<?xml version="1.0" encoding="iso-8859-1"?>
<!-- Uploaded to: SVG Repo, www.svgrepo.com, Generator: SVG Repo Mixer Tools -->
<!DOCTYPE svg PUBLIC "-//W3C//DTD SVG 1.1//EN" "http://www.w3.org/Graphics/SVG/1.1/DTD/svg11.dtd">
<svg fill="{{scope.VectorColor}}" version="1.1" id="Capa_1" xmlns="http://www.w3.org/2000/svg" xmlns:xlink="http://www.w3.org/1999/xlink"
	 viewBox="0 0 459.101 459.101" xml:space="preserve">
<g id="XMLID_1468_">
	<polygon id="XMLID_1469_" points="244.551,238.037 244.551,27.05 214.551,27.05 214.551,238.037 0,238.037 0,268.037
		459.101,268.037 459.101,238.037 	"/>
	<rect id="XMLID_1470_" x="49.551" y="320.043" width="360" height="30"/>
	<rect id="XMLID_1471_" x="94.551" y="402.05" width="270" height="30"/>
</g>
</svg>
