{
     "$schema": "https://raw.githubusercontent.com/cypress-io/cypress/develop/cli/schema/cypress.schema.json",
     "viewportWidth": 1000,
     "viewportHeight": 660,
     "defaultCommandTimeout": 500,
     "experimentalSourceRewriting": true,
     "watchForFileChanges": false,
     "testFiles": "**/*.feature"
 }