[
  {
    "id": "5db201685b9d7939c85a8e3d",
    "avatar": "https://via.placeholder.com/150",
    "name": "Lacy",
    "body": "Consectetur reprehenderit velit exercitation cupidatat dolor quis eu pariatur nulla minim magna laborum. Est consequat fugiat mollit minim non consectetur do minim anim et dolor esse. Exercitation ut mollit ut velit id enim velit. Ea ad minim commodo laborum adipisicing fugiat est veniam enim. Aliqua excepteur in do fugiat id. Nulla voluptate quis sit qui nisi elit laborum consectetur Lorem veniam qui magna nostrud. Cupidatat voluptate velit aliquip adipisicing occaecat sit duis reprehenderit.",
    "time": 1548990397
  },
  {
    "id": "5db201687c42705a96e2b040",
    "avatar": "https://via.placeholder.com/150",
    "name": "Sonya",
    "body": "Mollit officia nisi nostrud cillum commodo cupidatat mollit ullamco ea labore magna aliquip. Exercitation ad reprehenderit consectetur exercitation eu. Magna ad duis culpa mollit et velit incididunt id dolor cupidatat. Quis ex cupidatat ad culpa eiusmod fugiat consequat officia occaecat quis. Eu sint mollit sunt deserunt qui tempor officia anim in minim.",
    "time": 1565962214
  },
  {
    "id": "5db20168124e669e7ff0b854",
    "avatar": "https://via.placeholder.com/150",
    "name": "Jami",
    "body": "Pariatur ut laboris nostrud non esse laborum mollit in esse et cupidatat ullamco consequat qui. Commodo quis proident velit aliquip aute voluptate commodo aute. Duis deserunt officia commodo consequat et eiusmod cupidatat adipisicing qui quis nostrud aliquip laboris ut. Quis veniam laborum eu deserunt ullamco ea officia et laborum laboris eu. Sunt dolore culpa id duis occaecat non ullamco. Commodo dolor officia quis commodo est.",
    "time": 1556429359
  },
  {
    "id": "5db201681abbab91847cdd2c",
    "avatar": "https://via.placeholder.com/150",
    "name": "Meredith",
    "body": "In adipisicing adipisicing elit dolor sint cillum quis esse incididunt minim ut sunt in et. Enim occaecat velit nostrud veniam id non nulla veniam cillum. Minim quis consequat fugiat veniam nisi. Consectetur amet tempor cupidatat voluptate. Cillum commodo enim id incididunt eu ut aliquip anim non irure ullamco ipsum do. Est anim Lorem nisi cillum id ut sit officia culpa consequat. Eiusmod esse cillum aliquip aliqua non laborum velit.",
    "time": 1552203578
  },
  {
    "id": "5db201686382993c8f70af29",
    "avatar": "https://via.placeholder.com/150",
    "name": "Roxie",
    "body": "Sit Lorem culpa tempor irure anim. Exercitation excepteur et ea tempor id aute fugiat ad Lorem nulla exercitation irure duis. Est excepteur exercitation qui aute ipsum laboris enim aliqua eu magna. Magna veniam ullamco sunt irure ullamco. Do nulla consequat non elit minim nostrud. Eu do eu cupidatat elit ut. Esse nisi pariatur Lorem pariatur tempor voluptate do quis sit.",
    "time": 1546427877
  },
  {
    "id": "5db201682f2636a14234812c",
    "avatar": "https://via.placeholder.com/150",
    "name": "Eula",
    "body": "Qui enim pariatur consequat sint incididunt amet. Eiusmod mollit esse magna ad non dolore et nulla. Aute dolor commodo consectetur in amet culpa anim deserunt et exercitation id. Quis et eu aliqua est. Nisi veniam non consectetur fugiat consectetur reprehenderit consequat cupidatat qui cupidatat do nostrud mollit. Incididunt velit excepteur esse voluptate incididunt ullamco qui. Voluptate aliqua aliqua ut proident quis aliquip est nulla incididunt nulla.",
    "time": 1553278675
  },
  {
    "id": "5db201682171d4f3aca1d681",
    "avatar": "https://via.placeholder.com/150",
    "name": "Ophelia",
    "body": "Reprehenderit non proident minim aute cillum minim excepteur sit excepteur reprehenderit elit esse. Cillum minim ut veniam do et aute laborum ullamco officia aliquip dolore dolore officia laboris. Tempor duis labore irure consequat amet ipsum proident. Aliquip elit sunt et minim nulla aute.",
    "time": 1554967025
  },
  {
    "id": "5db20168ea9f3928e7794bc1",
    "avatar": "https://via.placeholder.com/150",
    "name": "Aguirre",
    "body": "Sit reprehenderit aliquip do non magna commodo consectetur aliquip nostrud pariatur eiusmod ullamco duis. Cillum in sit esse sit adipisicing elit laborum pariatur ut minim esse labore tempor mollit. Aliquip incididunt anim in enim amet adipisicing. Velit veniam elit eiusmod ad cupidatat consequat dolore cupidatat sit esse occaecat excepteur do. Esse id Lorem sit amet in.",
    "time": 1561663478
  },
  {
    "id": "5db201689ed96a772e6f7f65",
    "avatar": "https://via.placeholder.com/150",
    "name": "Carlene",
    "body": "Excepteur Lorem nostrud officia ipsum sunt deserunt ea in. Cupidatat nostrud irure dolor officia fugiat in labore exercitation occaecat enim. Dolore incididunt voluptate excepteur minim dolor veniam nulla tempor aute minim culpa. Culpa elit fugiat nostrud duis cillum laboris ullamco ea ipsum consectetur. Esse ut officia et pariatur eiusmod ex tempor cupidatat culpa occaecat reprehenderit laboris.",
    "time": 1554039674
  },
  {
    "id": "5db201680f3159a5311bd7d4",
    "avatar": "https://via.placeholder.com/150",
    "name": "Hyde",
    "body": "Duis laborum reprehenderit nulla ea amet mollit. Laborum esse dolore dolore mollit magna deserunt veniam. Ad velit labore quis consectetur cillum officia consectetur id ipsum officia mollit. Commodo veniam adipisicing nulla deserunt. Laboris eu ut eu et cillum nisi pariatur ad sunt quis.",
    "time": 1557635704
  },
  {
    "id": "5db201689ce734425ce4b823",
    "avatar": "https://via.placeholder.com/150",
    "name": "Cherie",
    "body": "Ex Lorem ut veniam qui aute. Tempor labore proident dolore non nisi ea elit reprehenderit nostrud laboris esse in laborum. Qui fugiat ullamco esse ex anim culpa incididunt excepteur officia aute exercitation. Deserunt ex ea nostrud elit do anim est voluptate exercitation nulla nisi cupidatat. Tempor ea nostrud ex proident proident adipisicing id magna duis mollit velit eiusmod quis anim. Eu ad aliqua ad aliqua voluptate. Do aliquip sint voluptate enim ex cillum tempor ullamco ullamco aliquip dolore tempor.",
    "time": 1553905514
  },
  {
    "id": "5db20168d0756d3e10887b5a",
    "avatar": "https://via.placeholder.com/150",
    "name": "Delacruz",
    "body": "Pariatur exercitation id eu sunt aliqua ullamco pariatur officia. Aliqua minim ipsum labore aliquip sit exercitation Lorem ea enim elit id incididunt. Occaecat officia aute veniam est proident dolore Lorem enim enim enim ea. Enim eiusmod dolor velit cillum ullamco ullamco aute et. Dolore ullamco ea velit occaecat et ullamco ad labore duis consequat ut magna consequat qui.",
    "time": 1554200150
  },
  {
    "id": "5db2016823564106f875822c",
    "avatar": "https://via.placeholder.com/150",
    "name": "Miller",
    "body": "Labore laborum elit sunt ipsum occaecat sint elit consequat Lorem occaecat commodo cupidatat. Nisi incididunt proident qui aute sint ullamco sint incididunt laborum excepteur. In nisi id in incididunt ut occaecat cillum deserunt dolore sunt fugiat. Sint nisi dolore irure cillum deserunt cupidatat ex ea culpa veniam Lorem deserunt ad. Eu laborum irure occaecat ea voluptate ullamco. Adipisicing id et exercitation ut Lorem ipsum ipsum sint.",
    "time": 1549795506
  },
  {
    "id": "5db201683003b4555632295a",
    "avatar": "https://via.placeholder.com/150",
    "name": "Buckley",
    "body": "Laborum eu incididunt aute exercitation fugiat nostrud. Id exercitation incididunt incididunt eiusmod est. In nisi nulla ipsum laborum. Commodo aute incididunt mollit laborum ea ut do anim aute commodo aliqua ullamco et.",
    "time": 1558389951
  },
  {
    "id": "5db20168edc3a8608152ef10",
    "avatar": "https://via.placeholder.com/150",
    "name": "Lawanda",
    "body": "Ullamco laboris ad eiusmod proident veniam. Nulla mollit esse est laborum veniam esse fugiat consequat nulla dolor velit elit culpa ullamco. Fugiat officia qui non minim nostrud et veniam culpa. Eiusmod tempor qui exercitation nostrud consequat amet ea id aute aliqua reprehenderit Lorem do Lorem. Est nulla consectetur officia ea aliquip adipisicing. Nostrud cillum pariatur adipisicing amet ad ut ipsum sunt. Tempor ea magna aliquip do in ut ea ad nostrud proident est ad.",
    "time": 1547146727
  }
]
