{
  "version": 29,
  "tenantid": "IND1540",
  "mobappid": 5866,
  "appName": "MyLOGOS",
  "appDisplayName": "MyLOGOS",
  "homeScreenTemplate": "<script>\r\n    MyCampusApp.rootScope.animatepage = function(currentstyle) {\r\n        $(\".app-body\").addClass(currentstyle);\r\n    }\r\n    var hideInterval = setInterval(function() {\r\n        var animatecss = $(\"#animatecss\");\r\n        if (!animatecss || animatecss.length <= 0) {\r\n            $.ajax({\r\n                url: \"https://raw.githubusercontent.com/daneden/animate.css/master/animate.css\",\r\n                dataType: \"text\",\r\n                success: function(data) {\r\n                    $(\"head\").append(\"<style id='animatecss'>\" + data + \"<\/style>\");\r\n                    clearInterval(hideInterval);\r\n                }\r\n            });\r\n        }\r\n    }, 2000);\r\n    if (!MyCampusApp.rootScope.cangelistadded) {\r\n        MyCampusApp.rootScope.$on(\"$routeChangeStart\", function(event, next, current) {\r\n            $(\".app-body\").attr(\"class\", \"app-body animated \");\r\n        });\r\n        MyCampusApp.rootScope.$on(\"$routeChangeSuccess\", function(event, next, current) {\r\n            currentstyle = \"bounceInRight\";\r\n            if (next.loadedTemplateUrl == \"partials/home.html\" && current.loadedTemplateUrl != \"partials/home.html\") {\r\n                currentstyle = \"bounceInLeft\";\r\n            } else if(current.loadedTemplateUrl != \"partials/home.html\") {\r\n                if (next.params.appid == current.params.appid && next.params.appid == next.params.pageid) {\r\n                    currentstyle = \"bounceInLeft\";\r\n                }\r\n              \tif (MyCampusApp.rootScope.ppage) {\r\n                \tif (MyCampusApp.rootScope.ppage.appid == next.params.appid && MyCampusApp.rootScope.ppage.pageid == next.params.pageid) {\r\n                    \tcurrentstyle = \"bounceInLeft\";\r\n                \t}\r\n                }\r\n            }\r\n            $(\".app-body\").addClass(currentstyle);\r\n            $(\".app-body\").addClass(\"animated\");\r\n            MyCampusApp.rootScope.cpage = next.params;\r\n            MyCampusApp.rootScope.ppage = current.params;\r\n        });\r\n        MyCampusApp.rootScope.cangelistadded = true;\r\n    }\r\n<\/script>\r\n<style>\r\n.navbar-app{background:none !important;border:0;}\r\n/*.sidebar, #mainSidebar{background:none !important;border:0;}*/\r\n.fa-user{display:none;}\r\n.navbar .navbar-brand{display:none;}\r\n.navbar-absolute-top .fa-bars, .navbar-absolute-top .fa-user{color:#fff;}\r\n#dock{background:#000 !important;bottom:0 !important;}\r\n.dockicon{margin-top:12px !important;margin-right:8% !important;}\r\n.sidebar-scrollable{min-height: 100% !important}\r\n.list-group{margin-bottom:0 !important;}\r\n#appContent{height:100% !important;background:#fff !important;}\r\n<\/style>",
  "middlewareServerUrl": "https://kryptosda.kryptosmobile.com/kryptosds",
  "feedbackEmail": "support@kryptosmobile.com",
  "backgroundurl": "IND1540/background.png",
  "brandingurl": "IND1540/branding.png",
  "customStyle": "#branding {\r\n  position: absolute !important;\r\n  top: 62px !important;\r\n  width: 70% !important;\r\n  margin: auto;\r\n  bottom: auto !important;\r\n}\r\n\r\nbody {\r\n  position: absolute;\r\n  width: 100%;\r\n  height: 100%;\r\n  background-size: 100% 100% !important;\r\n}\r\n\r\n.icon {\r\n  width: 56px !important;\r\n  height: 56px !important;\r\n}\r\n\r\n#homedata .campuseai-Info {\r\n  width: 56px !important;\r\n  height: 33px !important;\r\n}\r\n\r\n.dockicon:after {\r\n  bottom: 0px !important;\r\n}\r\n\r\n.dockicon {\r\n  margin-bottom: 25px !important;\r\n}\r\n\r\n.blockUI i {\r\n  color: white !important;\r\n}\r\n\r\n.promptumenu_nav a.active {\r\n  background: #fff;\r\n  border-radius: 50%;\r\n  width: 10px;\r\n  height: 10px;\r\n}\r\n\r\n.promptumenu_nav a {\r\n  background: #ad1a1a;\r\n  border-radius: 50%;\r\n  width: 10px;\r\n  height: 10px;\r\n}\r\n\r\n.promptumenu_window {\r\n  overflow: visible !important;\r\n  bottom: 30px;\r\n}\r\n\r\n.promptumenu_nav {\r\n  margin-bottom: -175px;\r\n}\r\n\r\n.app-body {\r\n  padding-bottom: 0px !important;\r\n}\r\n\r\n.app {\r\n  background-size: 100% 100% !important;\r\n}\r\n\r\n.navbar-app,\r\n.sidebar,\r\n#mainSidebar {\r\n  background: rgb(168, 12, 12) !important;\r\n  /* Old browsers */\r\n  background: -moz-linear-gradient(top, rgba(168, 12, 12, 1) 0%, rgba(0, 0, 0, 1) 100%) !important;\r\n  /* FF3.6+ */\r\n  background: -webkit-gradient(linear, left top, left bottom, color-stop(0%, rgba(168, 12, 12, 1)), color-stop(100%, rgba(0, 0, 0, 1))) !important;\r\n  /* Chrome,Safari4+ */\r\n  background: -webkit-linear-gradient(top, rgba(168, 12, 12, 1) 0%, rgba(0, 0, 0, 1) 100%) !important;\r\n  /* Chrome10+,Safari5.1+ */\r\n  background: -o-linear-gradient(top, rgba(168, 12, 12, 1) 0%, rgba(0, 0, 0, 1) 100%) !important;\r\n  /* Opera 11.10+ */\r\n  background: -ms-linear-gradient(top, rgba(168, 12, 12, 1) 0%, rgba(0, 0, 0, 1) 100%) !important;\r\n  /* IE10+ */\r\n  background: linear-gradient(to bottom, rgba(168, 12, 12, 1) 0%, rgba(0, 0, 0, 1) 100%) !important;\r\n  /* W3C */\r\n  filter: progid: DXImageTransform.Microsoft.gradient( startColorstr='#a80c0c', endColorstr='#000000', GradientType=0) !important;\r\n  /* IE6-9 */\r\n}\r\n\r\n.blockUI {\r\n  margin: auto !important;\r\n  left: 0px !important;\r\n  right: 0px !important;\r\n  width: auto !important;\r\n}\r\n\r\n#homedata .campuseai-Info {\r\n  width: 76px !important;\r\n  margin-left: -10px;\r\n}\r\n\r\n@media (min-width: 320px) and (max-width: 480px) {\r\n  .icon {\r\n    width: 56px !important;\r\n    height: 56px !important;\r\n  }\r\n  #homedata .campuseai-Info {\r\n    width: 76px !important;\r\n    margin-left: -10px;\r\n  }\r\n}\r\n\r\n@media (min-width: 320px) and (max-width: 568px) {\r\n  .icon {\r\n    width: 75px !important;\r\n    height: 75px !important;\r\n  }\r\n  #homedata .campuseai-Info {\r\n    width: 96px !important;\r\n    font-size: 12px;\r\n    margin-top: 2px;\r\n    margin-left: -10px;\r\n    margin-right: -10px;\r\n    line-height: 12px;\r\n    /*margin-left:-10px;*/\r\n  }\r\n}\r\n\r\n@media (min-width: 768px) {\r\n  #branding {\r\n    width: 50% !important;\r\n    margin: auto;\r\n  }\r\n  .icon {\r\n    width: 102px !important;\r\n    height: 102px !important;\r\n  }\r\n  #homedata .campuseai-Info {\r\n    width: 120px !important;\r\n    margin-left: -10px;\r\n    margin-right: -10px;\r\n    /*margin-left:-10px;*/\r\n  }\r\n}\r\n\r\n#loginbtn {}\r\n\r\n.btn-block {\r\n  background: #fed501;\r\n}\r\n\r\n@media all and (orientation:landscape) {\r\n  #branding {\r\n    width: 30% !important;\r\n  }\r\n}\r\n\r\na:active {\r\n  opacity: 1 !important;\r\n}\r\n\r\n#homedata {\r\n  top: 165px !important;\r\n}\r\n\r\n.scrollable-content > div#appContent {\r\n  background: #fff !important;\r\n  color: #333 !important;\r\n  min-height: 100%;\r\n  height: auto;\r\n  margin-top: 0px;\r\n  padding-bottom: 10px;\r\n}\r\n\r\n.scrollable-content > div#appContent h4,\r\n.scrollable-content > div#appContent p {\r\n  color: #333 !important;\r\n}\r\n\r\n.scrollable-content {\r\n  background-color: #fff;\r\n}\r\n\r\n.promptumenu_window ~ .scrollable {\r\n  display: none !important;\r\n}\r\n\r\ndiv.backButtonArrow div[aria-label=\"Login\"]:after {\r\n  content: \"Login\";\r\n  position: absolute !important;\r\n  top: 16px;\r\n  right: 6px;\r\n  font-size: 11px;\r\n \r\n}\r\n\r\ndiv.backButtonArrow div[aria-label=\"Logout\"]:after {\r\n  content: \"Logout\";\r\n  position: absolute !important;\r\n  top: 16px;\r\n  right: 0px;\r\n  font-size: 11px;\r\n  \r\n}\r\n\r\ndiv.backButtonArrow div[aria-label=\"Back\"]:after {\r\n  content: \"Back\";\r\n  position: absolute !important;\r\n  top: 16px;\r\n  right: 7px;\r\n  font-size: 11px;\r\n  \r\n}\r\n\r\ndiv.sideBarMenu div[aria-label=\"Sidebar Menu\"]:after {\r\n  content: \"Menu\";\r\n  position: absolute !important;\r\n  top: 16px;\r\n  right: 5px;\r\n  font-size: 11px;\r\n  \r\n}\r\n\r\n.btn-group.pull-left.sideBarMenu,\r\n.btn-group.pull-right.backButtonArrow {\r\n  bottom: 6px !important;\r\n}\r\n\r\n.app {\r\n  background-size: 100% 100% !important;\r\n}\r\n\r\n.userProfile {\r\n  display: none !important;\r\n}\r\n\r\na.list-group-item.active,\r\na.list-group-item.active:focus,\r\na.list-group-item.active:hover {\r\n  border-color: #ddd !important;\r\n}.navbar-app, .sidebar, #mainSidebar { background : #43035f !important; } .navbar-brand, .navbar-absolute-top .btn-navbar { color : #ffffff !important; } .navbar-absolute-bottom .navbar-inverse { background : #ffffff !important; } .navbar-absolute-bottom .navbar-inverse { color : #43035f !important; } .app { background :  !important; } .campuseai-Info { color : #ffffff !important; } #mainSidebar .list-group-item { background : #43035f !important; } #mainSidebar .list-group-item { color : #ffffff !important; } #mainSidebar .appgroup { background : #43035f !important; } #mainSidebar .appgroup { color : #ffffff !important; } .btn-primary { background : #43035f !important; } .btn-primary { color : #ffffff !important; } .btn-primary { border-color : #43035f !important; } ",
  "authFunction": "function authFunction(uname, password, $http, $rootScope, success, error) {\r\n  $rootScope.demoMode = false;\r\n  if ($rootScope.middlewareServerUrl == \"https://kryptosda.kryptosmobile.com/kryptosds\") {\r\n    $rootScope.demoMode = true;\r\n  }\r\n\r\n\r\n  var defaultSystem = \"banner\"; //banner,peoplesoft,colleague,    \r\n  var bannerLoginUrl = $rootScope.middlewareServerUrl + \"/services/authenticate/login\";\r\n  var bannerDataUrl = $rootScope.middlewareServerUrl + \"/services/student\";\r\n\r\n  var psTenantProduct = \"HOSTOS/PS\";\r\n  var psLoginUrl = $rootScope.middlewareServerUrl + \"/authenticate/\" + psTenantProduct;\r\n  var psDataUrl = $rootScope.middlewareServerUrl + \"/data/\" + psTenantProduct;\r\n\r\n  var colleagureTenantProduct = \"UAPB/COLLEAGUE\";\r\n  var colleagueLoginUrl = $rootScope.middlewareServerUrl + \"/authenticate/\" + colleagureTenantProduct;\r\n  var colleagueDataUrl = $rootScope.middlewareServerUrl; // + colleagureTenantProduct;\r\n  var defaultLoginUrl = bannerLoginUrl;\r\n  var defaultDataUrl = bannerDataUrl;\r\n\r\n\r\n  console.log(\"printing rootScope\");\r\n  console.log($rootScope);\r\n  try {\r\n    var authSuccess = success;\r\n    var authError = error;\r\n\r\n    //Banner Authentication with LDAP - middlware auth\r\n\r\n    var url = defaultLoginUrl;\r\n    var data = {};\r\n    if (window.device) {\r\n      data = \"username=\" + uname + \"&password=\" + encodeURIComponent(password);\r\n    } else {\r\n      url = \"/websimulator/json?url=\" + url;\r\n      data = {\r\n        method: \"POST\",\r\n        body: \"username=\" + uname + \"&password=\" + encodeURIComponent(password)\r\n      };\r\n    }\r\n    var authUrl = url;\r\n    var authData = data;\r\n    $rootScope.generateST = function(tgt, service, callback) {\r\n      //Bypassing the ST as there is no service ticket required here..\r\n      callback(tgt);\r\n    };\r\n\r\n\r\n    $rootScope.postAPI = function(endpoint, postdata, callback) {\r\n      console.log(endpoint);\r\n      $.blockUI({\r\n        message: '<div class=\"loader\" style=\"margin: 2px; vertical-align: middle; display: inline-block\"><!--<i class=\"icon-cog icon-spin icon-4x\"><\/i>--><h3>Loading...<\/h3><\/div>'\r\n      });\r\n      $rootScope.generateST($rootScope.ticket, endpoint, function(st) {\r\n        var serviceurl = defaultDataUrl + endpoint + \"?ticket=\" + st;\r\n        console.log(serviceurl);\r\n        var url = \"\";\r\n        var proxyMethod = \"POST\";\r\n        var proxyData = postdata;\r\n        if (window.device) {\r\n          url = serviceurl;\r\n        } else {\r\n          url = \"/websimulator/json?url=\" + serviceurl;\r\n          proxyMethod = \"POST\";\r\n          proxyData = {\r\n            method: \"POST\",\r\n            body: postdata\r\n          }\r\n        }\r\n        /**************************************************************\r\n          Demo API handler code: START\r\n          The below code in this section should be removed in the PROD environment\r\n        **************************************************************/\r\n        if ($rootScope.demoMode) {\r\n          proxyData = \"\";\r\n          url = serviceurl;\r\n        }\r\n        /**************************************************************\r\n          Demo API handler code: END\r\n        **************************************************************/\r\n        $http({\r\n          method: proxyMethod,\r\n          url: url,\r\n          data: proxyData\r\n        }).\r\n        success(function(data, status, headers, config) {\r\n          $.unblockUI();\r\n          callback(data, status, headers, config);\r\n        }).\r\n        error(function(data, status, headers, config) {\r\n          //$.unblockUI();\r\n          //alert(\"Error in service call : \" + data + \" Status : \" + status);\r\n          if (status == 403) { //Ticket expired.. need to relogin\r\n            $http.post(authUrl, authData).success(function(data, status, headers, config) {\r\n\r\n              if (!data.error) {\r\n                $rootScope.ticket = data.ticket;\r\n                if (defaultSystem == 'banner') {\r\n                  $rootScope.getAPI(defaultDataUrl + \"/banneruserroles\", function(roles) {\r\n                    if (roles && roles.getuserroles && roles.getuserroles[0]) {\r\n                      var uroles = [];\r\n                      if (roles.getuserroles[0].STUDENT == \"Y\") {\r\n                        uroles.push(\"STUDENT\");\r\n                      }\r\n                      if (roles.getuserroles[0].EMPLOYEE == \"Y\") {\r\n                        uroles.push(\"EMPLOYEE\");\r\n                      }\r\n                      if (roles.getuserroles[0].FACULTY == \"Y\") {\r\n                        uroles.push(\"FACULTY\");\r\n                      }\r\n                      if (roles.getuserroles[0].GOVROLE_ALUMNI_IND == \"Y\") {\r\n                        uroles.push(\"ALUMNI\");\r\n                      }\r\n                      if (roles.getuserroles[0].GOVROLE_FINANCE_IND == \"Y\") {\r\n                        uroles.push(\"FINANCE\");\r\n                      }\r\n                      if (roles.getuserroles[0].FINAID == \"Y\") {\r\n                        uroles.push(\"FINAID\");\r\n                      }\r\n                      data.roles = uroles;\r\n                    }\r\n                    console.log(data);\r\n                    authSuccess(data);\r\n                  });\r\n                } else {\r\n                  authSuccess(data);\r\n                }\r\n\r\n              } else {\r\n                authSuccess(data);\r\n              }\r\n              //authSuccess(data);\r\n              $rootScope.postAPI(endpoint, postdata, callback);\r\n            }).error(function(data, status, headers, config) {\r\n              authError(data);\r\n\r\n            });\r\n          }\r\n\r\n        });\r\n\r\n      });\r\n\r\n    };\r\n\r\n    $rootScope.getAPI = function(endpoint, callback) {\r\n      /**************************************************************\r\n        Demo API handler code: START\r\n        The below code in this section should be removed in the PROD environment\r\n      **************************************************************/\r\n      if ($rootScope.demoMode) {\r\n        console.log(\"endpoint:before:\" + endpoint);\r\n        var tempParamExists = endpoint.indexOf(\"=\");\r\n        var tempUrl = \"\";\r\n        if (tempParamExists > 0) {\r\n          endpoint = endpoint.substring(0, endpoint.lastIndexOf(\"/\"));\r\n        }\r\n        console.log(\"new end point\");\r\n        console.log(endpoint);\r\n      }\r\n      /*************************************************************\r\n        Demo API Handler Code: END\r\n      *************************************************************/\r\n      $.blockUI({\r\n        message: '<div class=\"loader\" style=\"margin: 2px; vertical-align: middle; display: inline-block\"><!--<i class=\"icon-cog icon-spin icon-4x\"><\/i>--><h3>Loading...<\/h3><\/div>'\r\n      });\r\n      $rootScope.generateST($rootScope.ticket, endpoint, function(st) {\r\n        var serviceurl = defaultDataUrl + endpoint + \"?ticket=\" + st;\r\n        var url = \"\";\r\n        var proxyMethod = \"GET\";\r\n        var proxyData = {};\r\n        if (window.device) {\r\n          url = serviceurl;\r\n        } else {\r\n          url = \"/websimulator/json?url=\" + encodeURIComponent(serviceurl);\r\n          proxyMethod = \"POST\";\r\n          proxyData = {\r\n            method: \"GET\"\r\n          }\r\n        }\r\n        $http({\r\n          method: proxyMethod,\r\n          url: url,\r\n          data: proxyData\r\n        }).\r\n        success(function(data, status, headers, config) {\r\n          $.unblockUI();\r\n          callback(data, status, headers, config);\r\n        }).\r\n        error(function(data, status, headers, config) {\r\n          //$.unblockUI();\r\n          //alert(\"Error in service call : \" + data + \" Status : \" + status);\r\n          if (status == 403) { //Ticket expired.. need to relogin\r\n            $http.post(authUrl, authData).success(function(data, status, headers, config) {\r\n\r\n              if (!data.error) {\r\n                $rootScope.ticket = data.ticket;\r\n                if (defaultSystem == 'banner') {\r\n                  $rootScope.getAPI(defaultDataUrl + \"/banneruserroles\", function(roles) {\r\n                    if (roles && roles.getuserroles && roles.getuserroles[0]) {\r\n                      var uroles = [];\r\n                      if (roles.getuserroles[0].GOVROLE_STUDENT_IND == \"Y\") {\r\n                        uroles.push(\"STUDENT\");\r\n                      }\r\n                      if (roles.getuserroles[0].GOVROLE_EMPLOYEE_IND == \"Y\") {\r\n                        uroles.push(\"EMPLOYEE\");\r\n                      }\r\n                      if (roles.getuserroles[0].GOVROLE_FACULTY_IND == \"Y\") {\r\n                        uroles.push(\"FACULTY\");\r\n                      }\r\n                      if (roles.getuserroles[0].GOVROLE_ALUMNI_IND == \"Y\") {\r\n                        uroles.push(\"ALUMNI\");\r\n                      }\r\n                      if (roles.getuserroles[0].GOVROLE_FINANCE_IND == \"Y\") {\r\n                        uroles.push(\"FINANCE\");\r\n                      }\r\n                      if (roles.getuserroles[0].GOVROLE_FINAID_IND == \"Y\") {\r\n                        uroles.push(\"FINAID\");\r\n                      }\r\n                      data.roles = uroles;\r\n                    }\r\n                    console.log(data);\r\n                    authSuccess(data);\r\n                  });\r\n                } else {\r\n                  authSuccess(data);\r\n                }\r\n\r\n              } else {\r\n                authSuccess(data);\r\n              }\r\n              //authSuccess(data);\r\n              $rootScope.getAPI(endpoint, callback);\r\n            }).error(function(data, status, headers, config) {\r\n              authError(data);\r\n\r\n            });\r\n          }\r\n          $.unblockUI();\r\n        });\r\n\r\n      });\r\n\r\n    };\r\n\r\n\r\n\r\n\r\n    $rootScope.pspostAPI = function(endpoint, postdata, callback) {\r\n      $rootScope.generateST($rootScope.ticket, endpoint, function(st) {\r\n        var psUrl = \"\";\r\n        if ($rootScope.demoMode) {\r\n          psUrl = $rootScope.middlewareServerUrl + \"/ps\"\r\n        } else {\r\n          psUrl = defaultDataUrl;\r\n        }\r\n        var serviceurl = psUrl + endpoint + \"?ticket=\" + st;\r\n        var url = \"\";\r\n        var proxyMethod = \"GET\";\r\n        var proxyData = {};\r\n        if (window.device) {\r\n          url = serviceurl;\r\n        } else {\r\n          url = \"/websimulator/json?url=\" + encodeURIComponent(serviceurl);\r\n          proxyMethod = \"POST\";\r\n          proxyData = {\r\n            method: \"GET\"\r\n          }\r\n        }\r\n        $http({\r\n          method: proxyMethod,\r\n          url: url,\r\n          data: proxyData\r\n        }).\r\n        success(function(data, status, headers, config) {\r\n          $.unblockUI();\r\n          callback(data, status, headers, config);\r\n        }).\r\n        error(function(data, status, headers, config) {\r\n          if (status == 403) {\r\n            $http.post(defaultLoginUrl, authData).success(function(data, status, headers, config) {\r\n              authSuccess(data);\r\n              $rootScope.getAPI(endpoint, callback);\r\n            }).error(function(data, status, headers, config) {\r\n              authError(data);\r\n            });\r\n          }\r\n          $.unblockUI();\r\n        });\r\n      });\r\n    }\r\n\r\n\r\n    $rootScope.wapostAPI = function(endpoint, postdata, callback) {\r\n      $rootScope.generateST($rootScope.ticket, endpoint, function(st) {\r\n        var colUrl = \"\";\r\n        if ($rootScope.demoMode) {\r\n          colUrl = $rootScope.middlewareServerUrl + \"/COLLEAGUE\"\r\n        } else {\r\n          colUrl = defaultDataUrl;\r\n        }\r\n        var serviceurl = colUrl + endpoint + \"?ticket=\" + st;\r\n        var url = \"\";\r\n        var proxyMethod = \"GET\";\r\n        var proxyData = {};\r\n        if (window.device) {\r\n          url = serviceurl;\r\n        } else {\r\n          url = \"/websimulator/json?url=\" + encodeURIComponent(serviceurl);\r\n          proxyMethod = \"POST\";\r\n          proxyData = {\r\n            method: \"GET\"\r\n          }\r\n        }\r\n        $http({\r\n          method: proxyMethod,\r\n          url: url,\r\n          data: proxyData\r\n        }).\r\n        success(function(data, status, headers, config) {\r\n          $.unblockUI();\r\n          callback(data, status, headers, config);\r\n        }).\r\n        error(function(data, status, headers, config) {\r\n          if (status == 403) {\r\n            $http.post(authUrl, authData).success(function(data, status, headers, config) {\r\n              authSuccess(data);\r\n              $rootScope.getAPI(endpoint, callback);\r\n            }).error(function(data, status, headers, config) {\r\n              authError(data);\r\n            });\r\n          }\r\n          $.unblockUI();\r\n        });\r\n      });\r\n    }\r\n\r\n    //Login to the subsystem.\r\n\r\n\r\n\r\n    // commented the actual auth URL\r\n    if ($rootScope.demoMode) {\r\n      var data = {\r\n        \"ticket\": \"b52d04c9-a0af-45e1-bdcf-fa737ba56762\",\r\n        \"roles\": [\"STUDENT\", \"FACULTY\", \"EMPLOYEE\", \"STAFF\"]\r\n      }\r\n      success(data);\r\n    } else {\r\n      $.blockUI({\r\n        message: '<div class=\"loader\" style=\"margin: 2px; vertical-align: middle; display: inline-block\"><!--<i class=\"icon-cog icon-spin icon-4x\"><\/i>--><h3>Authenticating<\/h3><\/div>'\r\n      });\r\n      $http.post(url, data).success(function(data, status, headers, config) {\r\n        if (!data.error) {\r\n          $rootScope.ticket = data.ticket;\r\n          $.blockUI();\r\n          if (defaultSystem == 'banner') {\r\n            $rootScope.getAPI(\"/banneruserroles\", function(roles) {\r\n              if (roles && roles.getuserroles && roles.getuserroles[0]) {\r\n                var uroles = [];\r\n                if (roles.getuserroles[0].GOVROLE_STUDENT_IND == \"Y\") {\r\n                  uroles.push(\"STUDENT\");\r\n                }\r\n                if (roles.getuserroles[0].GOVROLE_EMPLOYEE_IND == \"Y\") {\r\n                  uroles.push(\"EMPLOYEE\");\r\n                }\r\n                if (roles.getuserroles[0].GOVROLE_FACULTY_IND == \"Y\") {\r\n                  uroles.push(\"FACULTY\");\r\n                }\r\n                if (roles.getuserroles[0].ALUMNI == \"Y\") {\r\n                  uroles.push(\"ALUMNI\");\r\n                }\r\n                if (roles.getuserroles[0].GOVROLE_FINANCE_IND == \"Y\") {\r\n                  uroles.push(\"FINANCE\");\r\n                }\r\n                if (roles.getuserroles[0].GOVROLE_FINAID_IND == \"Y\") {\r\n                  uroles.push(\"FINAID\");\r\n                }\r\n                data.roles = uroles;\r\n              }\r\n              console.log(data);\r\n              success(data);\r\n              $.unblockUI();\r\n              //$rootScope.authD2L();\r\n            });\r\n          } else {\r\n            success(data);\r\n          }\r\n\r\n\r\n        } else {\r\n          success(data);\r\n          $.unblockUI();\r\n        }\r\n      }).error(function(data, status, headers, config) {\r\n        error(data);\r\n        $.unblockUI();\r\n      });\r\n    }\r\n  } catch (e) {\r\n    alert(\"Exception : \" + e);\r\n  }\r\n\r\n\r\n}",
  "forgotPasswordUrl": null,
  "reportissueEmail": "support@kryptosmobile.com",
  "iconWidth": 70,
  "apps": 
  [
    {
      "id": 70124,
      "name": "Videos",
      "displayname": "Videos",
      "logo": "IND1540/Videos.png",
      "logourl": "IND1540/Videos.png",
      "description": "Campus Videos",
      "appFeatureType": "Public",
      "roles": "public",
      "showInDock": false,
      "showInHome": true,
      "networkrequired": true,
      "analytics": true,
      "pages": 
      [
        {
          "pageid": "Videos",
          "pageTemplate": "<div><\/div>",
          "datatemplate": "<div class=\"media-list list-group\">\r\n    <a href=\"#app/Videos/VideosVideosDetails?index={{$index}}\" class=\"media list-group-item\" ng-repeat=\"video in videos\">\r\n        <div class=\"pull-left\"><img class=\"media-object\" src=\"{{video.snippet.thumbnails.default.url}}\"><\/img>\r\n        <\/div>\r\n        <div class=\"media-body\">\r\n            <h4 class=\"media-heading\">{{video.snippet.title}}<\/h4>\r\n            <p class=\"disabled\">Published On {{video.snippet.publishedAt | date:'medium'}}<\/p>\r\n        <\/div>\r\n    <\/a>\r\n<\/div>",
          "url": "https://www.googleapis.com/youtube/v3/search?videoEmbeddable=true&order=date&part=snippet&channelId=UC19k6YGnVbHvsfOxM2wGWzQ&type=video&maxResults=50&key=AIzaSyCsgCy_wu22gBBf-jewPk76QN9mUzevkGw",
          "pageprocessor": "function pageprocessorVideos(pagedef, $scope, $routeParams, $compile, $http, $rootScope, $sce, $window, $location) { \r\n\r\n $.blockUI();\r\n    $http.get(pagedef.url).success(function(data) {\r\n        console.log(JSON.stringify(data));\r\n        $scope.videos = data.items;\r\n        $rootScope.videos = data.items;\r\n        var data1 = $compile($(pagedef.datatemplate))($scope);\r\n        $(\"#appContent\").append(data1);\r\n        $.unblockUI();\r\n    }).error(function(data) {\r\n        $.unblockUI();\r\n    });\r\n}"
        },
        {
          "pageid": "VideosVideosDetails",
          "pageTemplate": "<div><\/div>",
          "pageprocessor": "function pageprocessorVideosVideosDetails(pagedef, $scope, $routeParams, $compile, $http, $rootScope, $sce, $window, $location) {\r\n\r\n  var video = $rootScope.videos[$routeParams.index];\r\n  var videoID = video.id.videoId\r\n\r\n  var url = \"https://www.googleapis.com/youtube/v3/videos?id=\" + videoID + \"&key=AIzaSyABYcg8dh0PuvHuGygJchQVSgca2UxMyws&part=snippet,contentDetails,statistics,status\";\r\n  $http.get(url).success(function(data) {\r\n\r\n    console.log(JSON.stringify(data));\r\n    $scope.title = data.items[0].snippet.localized.title;\r\n\r\n    $scope.trustSrc = function() {\r\n      return $sce.trustAsResourceUrl(\"https://www.youtube.com/embed/\" + videoID);\r\n    };\r\n    $scope.description = data.items[0].snippet.localized.description;\r\n\r\n    var data1 = $compile($(pagedef.datatemplate))($scope);\r\n    $(\"#appContent\").append(data1);\r\n\r\n  }).error(function(data) {\r\n    $.unblockUI();\r\n  });\r\n  \r\n   try {\r\n    var onPause = function() {\r\n      $('iframe').attr('src', $('iframe').attr('src'));\r\n    }\r\n\r\n    document.addEventListener(\"pause\", onPause, false);\r\n  } catch (e) {\r\n    // alert(e)\r\n  }\r\n\r\n}",
          "datatemplate": "<style>\r\n  #branding {\r\n    display: none;\r\n  }\r\n  \r\n  .scrollable-content {\r\n    background: #fff !important;\r\n  }\r\n  \r\n  iframe {\r\n    display: inline-block;\r\n    margin: auto;\r\n  }\r\n<\/style>\r\n<div class=\"jumbotron\" style=\"background:#fff;\">\r\n  <h4 style=\"color:#062d5d !important;padding:10px;text-align:center;\">{{title}}<\/h4>\r\n  <div style=\"text-align:center\">\r\n    <iframe ng-src=\"{{trustSrc()}}\" frameborder=\"0\" allowfullscreen target=\"self\"><\/iframe>\r\n  <\/div>\r\n  <h5 style=\"color:#062d5d;padding:10px;text-align:center;\">{{description}}<\/h5>\r\n<\/div>"
        }
      ]
    },
    {
      "id": 70126,
      "name": "Grades",
      "displayname": "Grades",
      "logo": "IND1540/Grades.png",
      "logourl": "IND1540/Grades.png",
      "description": "Grades",
      "appFeatureType": "Colleague",
      "roles": "STUDENT",
      "showInDock": false,
      "showInHome": true,
      "networkrequired": true,
      "analytics": true,
      "pages": 
      [
        {
          "pageid": "Grades",
          "pageTemplate": "<div><\/div>",
          "datatemplate": "<style>\r\n\r\n<\/style>\r\n<div class=\"page-container\">\r\n    <div class=\"list-group-item key-block\">\r\n        <span class=\"pull-left\">\r\n                <i class=\"fa fa-info-circle fa-2x\"><\/i>\r\n            <\/span>\r\n        <div>Select a term from the below term dropdown to show your final grade information.<\/div><br/>\r\n\r\n\r\n        <select ng-model=\"selterm\" class=\"form-control\" ng-change=\"termselect(this.value);\">\r\n                <option value=\"\">-- Select a Term --<\/option>\r\n                <option ng-selected=\"selterm == term.tid\" value=\"{{term.tid}}\" ng-repeat=\"term in gradeTerms\">{{term.Description}}<\/option>\r\n            <\/select><br/>\r\n    <\/div>\r\n    <div  ng-repeat=\"grade in Grades\">\r\n        <div class=\"list-group-item main-heading\">Advisor: <strong>{{grade.Advisor}}<\/strong><\/div>\r\n        <!--<div class=\"alert alert-warning\" ng-show=\"currentsummary.length == 0 && cumulativesummary.length == 0 && overallsummary.length == 0 && transfersummary.length==0\">No summary information found for the selected term.<\/div>\r\n            <div ng-show=\"currentsummary.length > 0\">-->\r\n        <div ng-repeat=\"gst in grade.GradeStatus\">\r\n            <div class=\"list-group-item group-heading\">{{gst.CourseSection}}<\/div>\r\n            <div class=\"data-block\">\r\n                <div class=\"list-group-item\">Title : <span class=\"pull-right\">{{gst.Title}}<\/span>\r\n                <\/div>\r\n                <div class=\"list-group-item\">Mid-term Grade : <span class=\"pull-right\">{{gst.Grd1}}<\/span>\r\n                <\/div>\r\n                <!--<div class=\"list-group-item\">Final Grade : <span class=\"pull-right\">{{gst.Grd2}}<\/span>\r\n                <\/div>\r\n                <div class=\"list-group-item\">Grade 3 : <span class=\"pull-right\">{{gst.Grd3}}<\/span>\r\n                <\/div>\r\n                <div class=\"list-group-item\">Grade 4 : <span class=\"pull-right\">{{gst.Grd4}}<\/span>\r\n                <\/div>\r\n                <div class=\"list-group-item\">Grade 5 : <span class=\"pull-right\">{{gst.Grd5}}<\/span>\r\n                <\/div>\r\n                <div class=\"list-group-item\">Grade 6 : <span class=\"pull-right\">{{gst.Grd6}}<\/span>\r\n                <\/div>-->\r\n                <div class=\"list-group-item\">Final Grade: <span class=\"pull-right\">{{gst.FinalGrd}}<\/span>\r\n                <\/div>\r\n                <div class=\"list-group-item\">Credits: <span class=\"pull-right\">{{gst.Credits}}<\/span>\r\n                <\/div>\r\n                <div class=\"list-group-item\">CEUs: <span class=\"pull-right\">{{gst.CEUs}}<\/span>\r\n                <\/div>\r\n            <\/div>\r\n        <\/div>\r\n\r\n    <\/div>\r\n\r\n<\/div>",
          "pageprocessor": "function pageprocessorGrades(pagedef, $scope, $routeParams, $compile, $http, $rootScope, $sce, $window, $location) {\r\n    var data1 = $compile($(pagedef.datatemplate))($scope);\r\n    $(\"#appContent\").append(data1);\r\n    var url = pagedef.endpoint;\r\n    $rootScope.wapostAPI(url, \"\", function(data) {\r\n        //alert(JSON.stringify(data));\r\n        var gradeTerms = []\r\n        $.each(data.GRADE_TERMS, function(i, val) {\r\n            val.tid = \"LIST.VAR1_\" + (i + 1);\r\n            gradeTerms.push(val);\r\n        });\r\n        $scope.gradeTerms = gradeTerms;\r\n        $.unblockUI();\r\n    });\r\n\r\n    $scope.termselect = function(termcode) {\r\n        $scope.Grades = null;\r\n        var url = \"/colleaguegradeinformation\";\r\n        var parameterData = \"termId=\" + $scope.selterm;\r\n        $rootScope.wapostAPI(url, parameterData, function(data) {\r\n            //alert(JSON.stringify(data));\r\n            $scope.Grades = data.Grades;\r\n            $.unblockUI();\r\n            if ($scope.Grades.length == 0) {\r\n                if (window.device) {\r\n                    var doNothing = function() {};\r\n                    navigator.notification.alert(\"You have no Grades record for this term\", doNothing, 'Alert', 'Ok');\r\n                } else {\r\n                    apprise(\"You have no Grades record for this term\", {\r\n                        'verify': false,\r\n                        'textYes': \"Ok\"\r\n                    }, function(r) {\r\n                        $rootScope.$apply(function() {\r\n                            //$location.path(\"/home\");\r\n                        });\r\n                    });\r\n                }\r\n            }\r\n        });\r\n    }\r\n}",
          "endpoint": "/colleaguegradeterms"
        }
      ]
    },
    {
      "id": 70128,
      "name": "Transcript",
      "displayname": "Transcript",
      "logo": "IND1540/Transcript.png",
      "logourl": "IND1540/Transcript.png",
      "description": "Transcript",
      "appFeatureType": "Colleague",
      "roles": "STUDENT",
      "showInDock": false,
      "showInHome": true,
      "networkrequired": true,
      "analytics": true,
      "pages": 
      [
        {
          "pageid": "Transcript",
          "pageTemplate": "<div><\/div>",
          "dropdownendpoint": "/colleaguetranscripttypes",
          "datatemplate": "<div class=\"page-container\">\r\n    <div class=\"list-group-item key-block\">\r\n        <span class=\"pull-left\">\r\n                <i class=\"fa fa-info-circle fa-2x\"><\/i>\r\n            <\/span>\r\n        <div>Select a Transcript Type from the below term dropdown to show your information.<\/div><br/>\r\n\r\n\r\n        <select ng-model=\"selectedvalue\" class=\"form-control\" ng-change=\"dropdownselect(this.value);\">\r\n                <option value=\"\">-- Select Transcript Type --<\/option>\r\n                <option ng-selected=\"selectedvalue == type.ID\" value=\"{{type.ID}}\" ng-repeat=\"type in dropdown.TRANSCRIPT_TYPES\">{{type.DESC}}<\/option>\r\n            <\/select><br/>\r\n    <\/div>\r\n\r\n    <div class=\"list-group-item main-heading\" ng-hide=\"selectedvalue=='' || selectedvalue==null\">\r\n        <strong>Total Earned Credits: <\/strong><span class=\"pull-right badge badge-info\">{{listdata.TRANSCRIPT_TOTALS[0].EARNED_CREDITS}}<\/span>\r\n        <br/>\r\n        <br/><strong>Total Grade Points:<\/strong> <span class=\"pull-right badge badge-info\">{{listdata.TRANSCRIPT_TOTALS[0].GRADE_POINTS}}<\/span>\r\n        <br/>\r\n        <br/><strong>Total Cumulative GPA:<\/strong> <span class=\"pull-right badge badge-info\">{{listdata.TRANSCRIPT_TOTALS[0].CUMULATIVE_GPA}}<\/span>\r\n    <\/div>\r\n    <div class=\"list-group\" ng-repeat=\"trans in listdata.TRANSCRIPT\">\r\n        <div class=\"list-group-item group-heading\">{{trans.COURSE}}<\/div>\r\n        <div class=\"data-block\">\r\n            <div class=\"list-group-item\">Term : <span class=\"pull-right\">{{trans.TERM}}<\/span>\r\n            <\/div>\r\n            <div class=\"list-group-item\">Grade : <span class=\"pull-right\">{{trans.GRADE}}<\/span>\r\n            <\/div>\r\n            <div class=\"list-group-item\">Credits : <span class=\"pull-right\">{{trans.CREDITS}}<\/span>\r\n            <\/div>\r\n            <div class=\"list-group-item\">CEUs : <span class=\"pull-right\">{{trans.CEU}}<\/span>\r\n            <\/div>\r\n            <div class=\"list-group-item\">Repeat : <span class=\"pull-right\">{{trans.REPEAT}}<\/span>\r\n            <\/div>\r\n        <\/div>\r\n    <\/div>\r\n\r\n\r\n\r\n\r\n\r\n<\/div>",
          "listendpoint": "/colleaguetranscript",
          "pageprocessor": "function pageprocessorTranscript(pagedef, $scope, $routeParams, $compile, $http, $rootScope, $sce, $window, $location) {\r\n    var data1 = $compile($(pagedef.datatemplate))($scope);\r\n    $(\"#appContent\").append(data1);\r\n    $.blockUI();\r\n    var url = pagedef.dropdownendpoint;\r\n    $rootScope.wapostAPI(url, \"\", function(data) {\r\n        $scope.dropdown = data;\r\n        $.unblockUI();\r\n    });\r\n\r\n    $scope.dropdownselect = function(selectedvalue) {\r\n        $.blockUI();\r\n        var url = pagedef.listendpoint;\r\n        $rootScope.wapostAPI(url, \"type=\" + $scope.selectedvalue, function(data) {\r\n          \r\nif(data.TRANSCRIPT.length==0){\r\n\r\nif(window.device){\r\nnavigator.notification.alert(\"Currently there is no data available.\");}\r\nelse{alert(\"Currently there is no data available.\");}\r\n}\r\n\r\n\r\n  $scope.listdata = data;\r\n\r\n\r\n\r\n            $.unblockUI();\r\n        });\r\n    }\r\n}"
        }
      ]
    },
    {
      "id": 70130,
      "name": "ClassSchedule",
      "displayname": "My Class Schedule",
      "logo": "IND1540/ClassSchedule.png",
      "logourl": "IND1540/ClassSchedule.png",
      "description": "Class Schedule",
      "appFeatureType": "Colleague",
      "roles": "STUDENT",
      "showInDock": false,
      "showInHome": true,
      "networkrequired": true,
      "analytics": true,
      "pages": 
      [
        {
          "pageid": "ClassSchedule",
          "pageTemplate": "<div><\/div>",
          "datatemplate": "<style>\r\n\r\n<\/style>\r\n<div class=\"page-container\">\r\n    <div class=\"list-group-item key-block\">\r\n        <span class=\"pull-left\">\r\n                <i class=\"fa fa-info-circle fa-2x\"><\/i>\r\n            <\/span>\r\n        <div>Select a term from the below term dropdown to show your class schedule information.<\/div><br/>\r\n        <select ng-model=\"selterm\" class=\"form-control\" ng-change=\"termselect(this.value);\">\r\n                <option value=\"\">-- Select a Term --<\/option>\r\n                <option ng-selected=\"selterm == term.ID\" value=\"{{term.ID}}\" ng-repeat=\"term in ClassScheduleTerm\">{{term.NAME}}<\/option>\r\n            <\/select>\r\n    <\/div>\r\n\r\n    <div class=\"list-group\" ng-repeat=\"sch in Schedule\">\r\n        <div class=\"list-group-item group-heading\">{{sch.Coursename}}<\/div>\r\n        <div class=\"data-block\">\r\n            <div class=\"list-group-item clearfix\">Meeting Info : <span class=\"pull-right\">{{sch.MeetingInformation}}<\/span>\r\n            <\/div>\r\n            <div class=\"list-group-item\">Status : <span class=\"pull-right\">{{sch.Status}}<\/span>\r\n            <\/div>\r\n            <div class=\"list-group-item\">TotalCredits : <span class=\"pull-right\">{{sch.TotalCredits}}<\/span>\r\n            <\/div>\r\n            <div class=\"list-group-item\">StartDate : <span class=\"pull-right\">{{sch.StartDate}}<\/span>\r\n            <\/div>\r\n        <\/div>\r\n    <\/div>\r\n<\/div>",
          "endpoint": "/colleaguedropdown",
          "pageprocessor": "function pageprocessorClassSchedule(pagedef, $scope, $routeParams, $compile, $http, $rootScope, $sce, $window, $location) {\r\n    var data1 = $compile($(pagedef.datatemplate))($scope);\r\n    $(\"#appContent\").append(data1);\r\n    var url = pagedef.endpoint;\r\n    $rootScope.wapostAPI(url, \"\", function(data) {\r\n        $scope.ClassScheduleTerm = data.TERM_DROPDOWN;\r\n        $.unblockUI();\r\n    });\r\n\r\n    $scope.termselect = function(termcode) {\r\n      \t$scope.Schedule = null;\r\n        var url = \"/colleagueschedule\";\r\n        var parameterData = \"termId=\" + $scope.selterm;\r\n        $rootScope.wapostAPI(url, parameterData, function(data) {\r\n         \r\n          $scope.Schedule = data.Schedule;\r\n            $.unblockUI();\r\n            if ($scope.Schedule.length == 0) {\r\n                if (window.device) {\r\n                    var doNothing = function() {};\r\n                    navigator.notification.alert(\"You have no Class Schedule record for this term\", doNothing, 'Alert', 'Ok');\r\n                } else {\r\n                    apprise(\"You have no Class Schedule record for this term\", {\r\n                        'verify': false,\r\n                        'textYes': \"Ok\"\r\n                    }, function(r) {\r\n                        $rootScope.$apply(function() {\r\n                            //$location.path(\"/home\");\r\n                        });\r\n                    });\r\n                }\r\n            }\r\n        });\r\n    }\r\n}"
        }
      ]
    },
    {
      "id": 70132,
      "name": "CourseSearch2",
      "displayname": "Course Search",
      "logo": "IND1540/CourseSearch2.png",
      "logourl": "IND1540/CourseSearch2.png",
      "description": "Course Search",
      "appFeatureType": "Colleague",
      "roles": "STUDENT",
      "showInDock": false,
      "showInHome": true,
      "networkrequired": true,
      "analytics": true,
      "pages": 
      [
        {
          "pageid": "CourseSearch2",
          "pageTemplate": "<div><\/div>",
          "datatemplate": "<div class=\"page-container\">\r\n    <div class=\"list-group-item key-block\">\r\n        <span class=\"pull-left\">\r\n            <i class=\"fa fa-info-circle fa-2x\"><\/i>\r\n        <\/span>\r\n        <div>Select a term and subject and press Search classes.<\/div><br/>\r\n\r\n        <select ng-model=\"selterm\" class=\"form-control\">\r\n          <option value=\"\">-- Select a term --<\/option>\r\n                <option ng-selected=\"selterm=={{term.ID}}\" value=\"{{term.ID}}\" ng-repeat=\"term in dropdowns.TERM_DROPDOWN\">{{term.NAME}}<\/option>\r\n            <\/select>\r\n        <br>\r\n\r\n        <select id=\"subject\" name='subject' ng-model=\"subject\" class=\"form-control\">\r\n          <option value=\"\">-- Select a subject --<\/option>\r\n                <option ng-selected=\"subject == {{subject.ID}}\" value=\"{{subject.ID}}\" ng-repeat=\"subject in dropdowns.SUBJECT_DROPDOWN\">{{subject.NAME}}<\/option>\r\n            <\/select>\r\n    <\/div>\r\n\r\n\r\n\r\n    <div class=\"list-group-item key-block\">\r\n        <button class=\"btn btn-primary btn-block\" ng-click=\"searchClasses();\">Search Classes<\/button>\r\n    <\/div>\r\n<\/div>\r\n<\/div>",
          "endpoint": "/colleaguecsdropdowns",
          "pageprocessor": "function pageprocessorCourseSearch2(pagedef, $scope, $routeParams, $compile, $http, $rootScope, $sce, $window, $location) {\r\n    var data1 = $compile($(pagedef.datatemplate))($scope);\r\n    $(\"#appContent\").append(data1);\r\n    $scope.selterm = \"\";\r\n    $scope.subject = \"\";\r\n    $scope.level = \"\";\r\n    $scope.loc = \"\";\r\n    $scope.acd = \"\";\r\n    var url = pagedef.endpoint;\r\n    $rootScope.wapostAPI(url, \"\", function(data) {\r\n        console.log(data);\r\n        $scope.dropdowns = data;\r\n        $.unblockUI();\r\n    });\r\n    $scope.searchClasses = function() {\r\n        if ($scope.selterm == \"\") {\r\n            if (window.device) {\r\n                navigator.notification.alert(\"Please select a term\");\r\n            } else {\r\n                apprise(\"Please select a term\", {\r\n                    'verify': false,\r\n                    'textYes': \"Ok\"\r\n                }, function(r) {\r\n\r\n                });\r\n            }\r\n            return;\r\n        }\r\n        var url = \"/colleaguecssearch\";\r\n        var params = \"term=\" + $scope.selterm;\r\n        params += \"&subject=\" + $scope.subject;\r\n        params += \"&level=\" + $scope.level;\r\n        params += \"&location=\" + $scope.loc;\r\n        params += \"&academiclevel=\" + $scope.acd;\r\n        $rootScope.wapostAPI(url, params, function(data) {\r\n            console.log(data);\r\n          \t$.unblockUI();\r\n            if (data.sections && data.sections.length > 0) {\r\n                $rootScope.sections = data.sections;\r\n                $rootScope.pageinfo = data.pageinfo[0].pageinfo;\r\n                $rootScope.searcparams = params;                \r\n                $location.path(\"/app/CourseSearch2/CourseSearch2Page2\");\r\n            }else {\r\n              if (window.device) {\r\n                    var errorCB = function() {};\r\n                    navigator.notification.alert(\"The search returns no results that match the criteria specified\", errorCB, 'Course Search', 'Ok');\r\n                } else {\r\n                    apprise(\"The search returns no results that match the criteria specified\", {\r\n                        'verify': false,\r\n                        'textYes': \"Ok\"\r\n                    }, function(r) {\r\n                    });\r\n                }\r\n            }\r\n        });\r\n    }\r\n}"
        },
        {
          "pageid": "CourseSearch2Page2",
          "pageTemplate": "<div><\/div>",
          "datatemplate": "<div class=\"page-container\">\r\n    <div ng-repeat=\"sec in sections\">\r\n        <div class=\"list-group-item main-heading\">{{sec.coursename}}\r\n        <\/div>\r\n        <div class=\"list-group\">\r\n            <div class=\"list-group-item\">{{sec.meetinginfo}}<\/div>\r\n            <div class=\"list-group-item key clearfix\">Faculty :\r\n                <span class=\"pull-right val bigVal\">{{sec.faculty}}<\/span>\r\n            <\/div>\r\n            <div class=\"list-group-item key clearfix\">Academic Level :\r\n                <span class=\"pull-right val bigVal\">{{sec.academiclevel}}<\/span>\r\n            <\/div>\r\n            <div class=\"list-group-item key clearfix\">Credits :\r\n                <span class=\"pull-right val bigVal\">{{sec.credits}}<\/span>\r\n            <\/div>\r\n            <div class=\"list-group-item key clearfix\">CEU :\r\n                <span class=\"pull-right val bigVal\">{{sec.ceu}}<\/span>\r\n            <\/div>\r\n            <div class=\"list-group-item key clearfix\">Location :\r\n                <span class=\"pull-right val bigVal\">{{sec.location}}<\/span>\r\n            <\/div>\r\n\r\n\r\n            <li class=\"list-group-item key\">\r\n                <div class=\"row\">\r\n                    <div class=\"col-xs-4 col-md-4 text-center\">\r\n                        Capacity\r\n                        <br/><span class=\"text-center badge badge-info circle\">{{sec.capacity.split('/')[1]}}<\/span>\r\n                    <\/div>\r\n\r\n                    <div class=\"col-xs-4 col-md-4 text-center\">\r\n                        Available\r\n                        <br/><span class=\"text-center badge badge-info circle\">{{sec.capacity.split('/')[0]}}<\/span>\r\n                    <\/div>\r\n\r\n                    <div class=\"col-xs-4 col-md-4 text-center\">\r\n                        Status\r\n                        <br/><span class=\"text-center badge badge-info circle\">{{sec.status}}<\/span>\r\n                    <\/div>\r\n                <\/div>\r\n            <\/li>\r\n\r\n\r\n        <\/div>\r\n    <\/div>\r\n<\/div>\r\n<div class=\"list-group-item\" ng-show=\"hasmore\">\r\n    <button class=\"btn btn-primary btn-block\" ng-click=\"nextPage()\">Load more<\/button>\r\n<\/div>\r\n<\/div>",
          "endpoint": "",
          "pageprocessor": "function pageprocessorCourseSearch2Page2(pagedef, $scope, $routeParams, $compile, $http, $rootScope, $sce, $window, $location) {\r\n    var data1 = $compile($(pagedef.datatemplate))($scope);\r\n    $(\"#appContent\").append(data1);\r\n  \t$scope.pageinfo = $rootScope.pageinfo;\r\n    $scope.hasmore = false;\r\n    $scope.checkmore = function() {\r\n        var split = $scope.pageinfo.split(\" \");\r\n        if (parseInt(split[1]) < parseInt(split[3])) {\r\n            $scope.hasmore = true;\r\n        } else {\r\n            $scope.hasmore = false;\r\n        }\r\n        $scope.nextpage = parseInt(split[1]) + 1;\r\n    }\r\n    $scope.checkmore();\r\n    $scope.nextPage = function() {\r\n        var url = $rootScope.middlewareServerUrl + \"/COLLEAGUE/colleaguecssearchpage\";\r\n        var params = $rootScope.searcparams  + \"&pagenum=\" + $scope.nextpage;\r\n        $rootScope.wapostAPI(url, params, function(data) {\r\n            console.log(data);\r\n          \t$.each(data.sections, function(i, val) {\r\n                $rootScope.sections.push(val);\r\n            });\r\n            $scope.pageinfo = data.pageinfo[0].pageinfo;\r\n            $scope.checkmore();\r\n            $.unblockUI();\r\n        });\r\n    }\r\n}"
        }
      ]
    },
    {
      "id": 70134,
      "name": "FinancialAid2",
      "displayname": "Financial Aid",
      "logo": "IND1540/FinancialAid2.png",
      "logourl": "IND1540/FinancialAid2.png",
      "description": "FinancialAid",
      "appFeatureType": "Colleague",
      "roles": "STUDENT",
      "showInDock": false,
      "showInHome": true,
      "networkrequired": true,
      "analytics": true,
      "pages": 
      [
        {
          "pageid": "FinancialAid2",
          "pageTemplate": "<div><\/div>",
          "datatemplate": "<div class=\"page-container\">\r\n  <div class=\"list-group-item key-block\">\r\n    <span class=\"pull-left\">\r\n                <i class=\"fa fa-info-circle fa-2x\"><\/i>\r\n            <\/span>\r\n    <div>Select 'By Term' or 'By Year' tabs to view the Financial Aid status by Term or by Year respectively .<\/div>\r\n    <br/>\r\n    <div class=\"btn-group justified nav-tabs\">\r\n      <a class=\"btn btn-default\" href=\"#Tab1\" toggle=\"on\" active-class=\"active\">By Term<\/a>\r\n      <a class=\"btn btn-default\" href=\"#Tab2\" toggle=\"on\" active-class=\"active\">By Year<\/a>\r\n    <\/div>\r\n  <\/div>\r\n\r\n  <div class=\"tab-content\">\r\n    <div class=\"tab-pane\" toggleable active-class=\"active\" default=\"active\" id=\"Tab1\" exclusion-group=\"myTabs\">\r\n      <div class=\"list-group-item main-heading\">Financial Aid status by term<\/div>\r\n      <div class=\"list-group-item\">\r\n        <select ng-model=\"selterm\" class=\"form-control\" ng-change=\"termselect(this.value);\">\r\n          <option value=\"\">-- Select a Term --<\/option>\r\n          <option ng-selected=\"selterm == term.ID\" value=\"{{term.ID}}\" ng-repeat=\"term in finaidterms\">{{term.DESC}}<\/option>\r\n        <\/select>\r\n      <\/div>\r\n\r\n      <div class=\"list-group\" ng-repeat=\"fs in finaidsummaryforterm\">\r\n\r\n        <div class=\"data-block\">\r\n          <div class=\"list-group-item clearfix\">Source : <span class=\"pull-right\">{{fs.SOURCE}}<\/span>\r\n          <\/div>\r\n          <div class=\"list-group-item clearfix\">Description : <span class=\"pull-right\">{{fs.DESC}}<\/span>\r\n          <\/div>\r\n          <div class=\"list-group-item clearfix\">Amount : <span class=\"pull-right\">{{fs.AMOUNT}}<\/span>\r\n          <\/div>\r\n\r\n\r\n        <\/div>\r\n      <\/div>\r\n      <div class=\"list-group-item footer\" ng-show=\"finaidtotalsforterm[0].AMOUNT\">\r\n        <strong>Total Estimated Funds: <\/strong><span class=\"pull-right badge badge-info\">{{finaidtotalsforterm[0].AMOUNT}}<\/span>\r\n      <\/div>\r\n    <\/div>\r\n    <div class=\"tab-pane\" toggleable active-class=\"active\" id=\"Tab2\" exclusion-group=\"myTabs\">\r\n      <div class=\"list-group-item main-heading\">Financial Aid status by year<\/div>\r\n      <div class=\"list-group-item\">\r\n        <select ng-model=\"selyear\" class=\"form-control\" ng-change=\"yearselect(this.value);\">\r\n          <option value=\"\">-- Select a Year --<\/option>\r\n          <option ng-selected=\"selyear == year.ID\" value=\"{{year.ID}}\" ng-repeat=\"year in finaidyears\">{{year.DESC}}<\/option>\r\n        <\/select>\r\n      <\/div>\r\n\r\n\r\n\r\n\r\n\r\n      <div class=\"list-group\" ng-repeat=\"fs in finaidsummaryforyer\">\r\n        <div class=\"data-block\">\r\n          <div class=\"list-group-item clearfix\">Source : <span class=\"pull-right\">{{fs.SOURCE}}<\/span>\r\n          <\/div>\r\n          <div class=\"list-group-item clearfix\">Description : <span class=\"pull-right\">{{fs.DESC}}<\/span>\r\n          <\/div>\r\n          <div class=\"list-group-item clearfix\">Amount : <span class=\"pull-right\">{{fs.AMOUNT}}<\/span>\r\n          <\/div>\r\n\r\n\r\n        <\/div>\r\n      <\/div>\r\n      <div class=\"list-group-item footer\" ng-show=\"finaidtotalsforyear[0].AMOUNT\">\r\n        <strong>Total Estimated Funds: <\/strong><span class=\"pull-right badge badge-info\">{{finaidtotalsforyear[0].AMOUNT}}<\/span>\r\n      <\/div>\r\n    <\/div>\r\n  <\/div>\r\n        <br><br>\r\n<\/div>",
          "pageprocessor": "function pageprocessorFinancialAid2(pagedef, $scope, $routeParams, $compile, $http, $rootScope, $sce, $window, $location) {\r\n  var data1 = $compile($(pagedef.datatemplate))($scope);\r\n  $(\"#appContent\")\r\n    .append(data1);\r\n  var url = \"/colleaguefinaidterms\";\r\n  $rootScope.wapostAPI(url, \"\", function(data) {\r\n    //console.log(data);\r\n    $scope.finaidterms = data.FINAID_TERMS;\r\n\r\n    if (data.FINAID_TERMS.length == 0) {\r\n\r\n      if (window.device) {\r\n        navigator.notification.alert(\"Currently there is no data available.\");\r\n      } else {\r\n        alert(\"Currently there is no data available.\");\r\n      }\r\n    }\r\n\r\n\r\n    $.unblockUI();\r\n    var url = \"/colleaguefinaidyears\";\r\n    $rootScope.wapostAPI(url, \"\", function(data) {\r\n      console.log(data);\r\n      $scope.finaidyears = data.FINAID_YEARS;\r\n      if (data.FINAID_YEARS.length == 0) {\r\n\r\n        if (window.device) {\r\n          navigator.notification.alert(\"Currently there is no data available.\");\r\n        } else {\r\n          alert(\"Currently there is no data available.\");\r\n        }\r\n      }\r\n\r\n      $.unblockUI();\r\n    });\r\n  });\r\n  $scope.termselect = function() {\r\n    var url = \"/colleaguefinaidforterm\";\r\n    $rootScope.wapostAPI(url, \"term=\" + $scope.selterm, function(data) {\r\n      \r\n      $scope.finaidtotalsforterm = data.TOT_EST_FUNDS;\r\n      $scope.finaidsummaryforterm = data.FINAID_SUMMARY;\r\n\r\n      if (data.TOT_EST_FUNDS.length == 0 || data.FINAID_SUMMARY == 0) {\r\n\r\n        if (window.device) {\r\n          navigator.notification.alert(\"Currently there is no data available.\");\r\n        } else {\r\n          alert(\"Currently there is no data available.\");\r\n        }\r\n      }\r\n\r\n      $.unblockUI();\r\n    });\r\n  }\r\n  $scope.yearselect = function() {\r\n    var url = \"/colleaguefinaidforyear\";\r\n    $rootScope.wapostAPI(url, \"year=\" + $scope.selyear, function(data) {\r\n      console.log(data);\r\n      \r\n      \r\n      $scope.finaidtotalsforyear = data.TOT_EST_FUNDS;\r\n      $scope.finaidsummaryforyer = data.FINAID_SUMMARY;\r\n\r\n      if (data.TOT_EST_FUNDS.length == 0 || data.FINAID_SUMMARY == 0) {\r\n\r\n        if (window.device) {\r\n          navigator.notification.alert(\"Currently there is no data available.\");\r\n        } else {\r\n          alert(\"Currently there is no data available.\");\r\n        }\r\n      }\r\n\r\n      $.unblockUI();\r\n    });\r\n  }\r\n}"
        }
      ]
    },
    {
      "id": 70136,
      "name": "AccountSummary",
      "displayname": "Account Summary",
      "logo": "IND1540/AccountSummary.png",
      "logourl": "IND1540/AccountSummary.png",
      "description": "Account Summary",
      "appFeatureType": "Colleague",
      "roles": "STUDENT",
      "showInDock": false,
      "showInHome": true,
      "networkrequired": true,
      "analytics": true,
      "pages": 
      [
        {
          "pageid": "AccountSummary",
          "pageTemplate": "<div><\/div>",
          "endpoint": "/colleagueaccountsummary",
          "pageprocessor": "function pageprocessorAccountSummary(pagedef, $scope, $routeParams, $compile, $http, $rootScope, $sce, $window, $location) {\r\n    var data1 = $compile($(pagedef.datatemplate))($scope);\r\n    $(\"#appContent\").append(data1);\r\n    var url = pagedef.endpoint;\r\n    $rootScope.wapostAPI(url, \"\", function(data) {\r\n        console.log(data);\r\n        $scope.acsummary = data.ACCOUNT_SUMMARY;\r\n        $.unblockUI();\r\n    });\r\n}",
          "datatemplate": "<style>\r\n\r\n<\/style>\r\n<div class=\"page-container\">\r\n    <div class=\"list-group\" ng-repeat=\"ac in acsummary\">\r\n        <div class=\"list-group-item group-heading\">{{ac.TermId.substring(6)}}<\/div>\r\n\r\n        <div class=\"data-block\">\r\n            <div ng-repeat=\"ar in ac.AccountReceivable\">\r\n\r\n                <div class=\"list-group-item\">{{ar.title.substring(6)}} <span class=\"pull-right\">{{ar.amount}}<\/span><\/div>\r\n\r\n            <\/div>\r\n        <\/div>\r\n    <\/div>\r\n<\/div>"
        }
      ]
    },
    {
      "id": 70138,
      "name": "Assignments",
      "displayname": "Assignments",
      "logo": "IND1540/Assignments.png",
      "logourl": "IND1540/Assignments.png",
      "description": "Assignments",
      "appFeatureType": "Moodle",
      "roles": null,
      "showInDock": false,
      "showInHome": true,
      "networkrequired": true,
      "analytics": true,
      "pages": 
      [
        {
          "pageid": "Assignments",
          "pageTemplate": "<div><\/div>",
          "pageprocessor": "function pageprocessorAssignments(pagedef, $scope, $routeParams, $compile, $http, $rootScope, $sce, $window, $location) {\r\n  $.blockUI();\r\n  $scope.showAssignment = false;\r\n  setTimeout(function() {\r\n    var data1 = $compile($(pagedef.datatemplate))($scope);\r\n    $(\"#appContent\").append(data1);\r\n    $.unblockUI();\r\n  }, 1200);\r\n\r\n  $scope.mycourses = [{\r\n    \"courseName\": \"084A FUND OF MATH LECTURE I (NDU)\",\r\n    \"courseId\": \"1\"\r\n  }, {\r\n    \"courseName\": \"084B FUND OF MATH LECTURE II (NDU)\",\r\n    \"courseId\": \"2\"\r\n  }, {\r\n    \"courseName\": \"085 FUND OF MATH I II (NDU)\",\r\n    \"courseId\": \"3\"\r\n  }, {\r\n    \"courseName\": \"085 FUND OF ENGLISH\",\r\n    \"courseId\": \"4\"\r\n  }, {\r\n    \"courseName\": \"085L FUNDAMENTALS OF ENGLISH LAB\",\r\n    \"courseId\": \"5\"\r\n  }, {\r\n    \"courseName\": \"100 PERSONAL ADJUSTMENT\",\r\n    \"courseId\": \"6\"\r\n  }];\r\n  $scope.assignments = [{\r\n    \"name\": \"Placement Test1 \",\r\n    \"duedate\": \"Monday, August 14,2017, 11:00AM\",\r\n    \"submissionstatus\": \"Submitted for Grading\",\r\n    \"grade\": \"95.00\"\r\n  }, {\r\n    \"name\": \"Placement Test2\",\r\n    \"duedate\": \"Monday, September 11,2017, 11:00AM\",\r\n    \"submissionstatus\": \"No Submission\",\r\n    \"grade\": \"-\"\r\n  }, {\r\n    \"name\": \"Placement Exam1\",\r\n    \"duedate\": \"Monday, August 14,2017, 11:00AM\",\r\n    \"submissionstatus\": \"Submitted for Grading\",\r\n    \"grade\": \"80.00\"\r\n  }, {\r\n    \"name\": \"Placement Exam2\",\r\n    \"duedate\": \"Monday, September 18,2017, 10:00AM\",\r\n    \"submissionstatus\": \"No Submission\",\r\n    \"grade\": \"-\"\r\n  }];\r\n  /*var url = $rootScope.middlewareServerUrl + \"/moodleenrolledcourselist\";\r\n  $rootScope.getAPI(url, function(data) {\r\n    \r\n    $.unblockUI();\r\n    if ($rootScope.selcourseid != null && $rootScope.selcourseid != \"\") {\r\n      $scope.courseassignments();\r\n    }\r\n  });*/\r\n\r\n  $scope.courseassignments = function(index) {\r\n      $.blockUI();\r\n      setTimeout(function() {\r\n        $scope.showAssignment = true;\r\n        $scope.$apply()\r\n        $.unblockUI();\r\n      }, 1200);\r\n    }\r\n    /*$scope.showassignment = function(index) {\r\n      $rootScope.selectedassignment = $scope.assignments[index];\r\n      $location.path(\"/app/Assignments/AssignmentsPage2\");\r\n\r\n    }*/\r\n  var dv = '<div class=\"list-group-item key-block ng-scope\">' +\r\n    '<select ng-model=\"selcourseid\" class=\"form-control\" ng-change=\"courseassignments(this.value);\">' +\r\n    '<option value=\"\">-- Select Course --<\/option>' +\r\n    '<option ng-selected=\"selcourseid == course.courseId\" value=\"{{course.courseId}}\" ng-repeat=\"course in mycourses\">{{course.courseName}}<\/option>' +\r\n    '<\/select>' +\r\n    '<\/div>';\r\n  $(\".app-content\").prepend($compile(dv)($scope));\r\n}",
          "endpoint": "notdefined",
          "datatemplate": "<div ng-repeat=\"assign in assignments\" ng-show=\"showAssignment\">\r\n  <div class=\"list-group-item main-heading\" style=\"border: medium none;box-shadow: 0 2px 5px #000;color: #fff;padding: 7px;\">\r\n    <h5>{{assign.name}}<\/h5>\r\n  <\/div>\r\n  <div class=\"list-group-item ng-scope\">\r\n    Due Date:<span class=\"badge pull-right\">{{assign.duedate}}<\/span>\r\n  <\/div>\r\n  <div class=\"list-group-item ng-scope\">\r\n    Submission Status:<span class=\"badge pull-right\">{{assign.submissionstatus}}<\/span>\r\n  <\/div>\r\n  <div class=\"list-group-item ng-scope\">\r\n    Grade:<span class=\"badge pull-right\">{{assign.grade}}<\/span>\r\n  <\/div>\r\n  <br>\r\n  <br>\r\n<\/div>"
        },
        {
          "pageid": "AssignmentsPage2",
          "pageTemplate": "<div><\/div>",
          "pageprocessor": "function pageprocessorAssignmentsPage2(pagedef, $scope, $routeParams, $compile, $http, $rootScope, $sce, $window, $location) {\r\n    var data1 = $compile($(pagedef.datatemplate))($scope);\r\n    $(\"#appContent\").append(data1);\r\n  \t$scope.trustHtml = function(content) {\r\n    \treturn $sce.trustAsHtml(content);\r\n  \t}\r\n    $scope.course = $rootScope.selectedcourse;\r\n\t$scope.selectedassignment = $rootScope.selectedassignment\r\n    var url = $rootScope.middlewareServerUrl + \"/moodleassignmentstatus\";\r\n    $rootScope.postAPI(url, \"id=\" + $scope.selectedassignment.id, function(data) {\r\n        $scope.pagehtml = data.rawhtml;\r\n      \t$scope.submissionstatus = data.submissionstatus\r\n      \tsetTimeout(function() {\r\n            var ht = $(data.rawhtml);\r\n            var images = $(ht)\r\n\t\t\tvar pageimages = $(\"#appContent img\");\r\n          \tconsole.log(\"page images : \" + pageimages);\r\n          \t$.each(data.pageimages, function(i, val) {\r\n                $(pageimages[i]).attr(\"src\", \"data:image/png;base64,\" + val.image);\r\n            });        \t\r\n          \t$(\"#appContent iframe\").attr(\"width\",\"230\");\r\n\t\t\t$(\"#appContent iframe\").attr(\"height\",\"300\");          \r\n      \t}, 1000);\r\n        $.unblockUI();\r\n    });  \r\n}",
          "datatemplate": "<div class=\"list-group-item\">\r\n    <h4>{{selectedassignment.name}}<\/h4>\r\n<\/div>\r\n<div class=\"list-group-item\">\r\n  <span ng-bind-html=\"trustHtml(pagehtml);\"><\/span>\r\n<\/div>          \r\n<a class=\"list-group-item active\">Submission status<\/a>  \r\n<div class=\"list-group-item clearfix\" ng-repeat=\"ss in submissionstatus\">\r\n  <strong>{{ss.label}}<\/strong><span class=\"pull-right\">{{ss.value}}<\/span>\r\n<\/div>  ",
          "endpoint": ""
        }
      ]
    },
    {
      "id": 70140,
      "name": "Profile2",
      "displayname": "My Profile",
      "logo": "IND1540/Profile2.png",
      "logourl": "IND1540/Profile2.png",
      "description": "Profile",
      "appFeatureType": "Moodle",
      "roles": null,
      "showInDock": false,
      "showInHome": true,
      "networkrequired": true,
      "analytics": true,
      "pages": 
      [
        {
          "pageid": "Profile2",
          "pageTemplate": "<div><\/div>",
          "endpoint": "/moodleuserprofile",
          "datatemplate": "<style>\r\n  #branding {\r\n    display: none;\r\n  }\r\n<\/style>\r\n<div class=\"well\" style=\"background:transparent;padding:10px;border:none;\">\r\n  <div class=\"list-group-item\" style=\" background: none repeat scroll 0 0 transparent;color: #fff;\">\r\n    <img src=\"https://sortitoutsi.net/uploads/face/67080310.png\" style=\"border-radius: 10px;width: 75px;\" />\r\n    <span><h4 style=\"margin-top:20px;\">Marcos Alonso<\/h4><\/span>\r\n  <\/div>\r\n  <div class=\"list-group \">\r\n    <div style=\"box-shadow:0 0 10px #000000;margin:10px 0 10px 0;\">\r\n      <a class=\"list-group-item panel-title active \" style=\"background: #003478;color:#fff;box-shadow:0 0 10px grey;border:none; \">\r\n              Profile Information<\/a>\r\n      <li class=\"list-group-item clearfix\">\r\n        Country:<span class=\"pull-right \">England<\/span>\r\n      <\/li>\r\n      <li class=\"list-group-item clearfix\">\r\n        City/Town:<span class=\"pull-right \">Ratatie 22, Vantaa<\/span>\r\n      <\/li>\r\n      <li class=\"list-group-item clearfix\">\r\n        Course Profile:<span class=\"pull-right \">CED777 Orientation<\/span>\r\n      <\/li>\r\n\r\n    <\/div>\r\n  <\/div>\r\n<\/div>",
          "pageprocessor": "function pageprocessorProfile2(pagedef, $scope, $routeParams, $compile, $http, $rootScope, $sce, $window, $location) {\r\n  $.blockUI();\r\n  setTimeout(function() {\r\n    var data1 = $compile($(pagedef.datatemplate))($scope);\r\n    $(\"#appContent\").append(data1);\r\n    $.unblockUI();\r\n  }, 1200);\r\n\r\n\r\n  /*var url = $rootScope.middlewareServerUrl + pagedef.endpoint;\r\n  $rootScope.getAPI(url, function(data) {\r\n    $scope.profiledata = data;\r\n    \r\n  });*/\r\n}"
        }
      ]
    },
    {
      "id": 70142,
      "name": "Emergency",
      "displayname": "Emergency",
      "logo": "IND1540/Emergency.png",
      "logourl": "IND1540/Emergency.png",
      "description": "Emergency Contact",
      "appFeatureType": "Public",
      "roles": "public",
      "showInDock": false,
      "showInHome": true,
      "networkrequired": true,
      "analytics": true,
      "pages": 
      [
        {
          "pageid": "Emergency",
          "pageTemplate": "<div class=\"well\"  style=\"background:transparent;padding:10px;border:none;\">     <div class=\"list-group\">         <a class=\"list-group-item active panel-title\" style=\"background:#f00f00 !important;color:#fff;font-weight:bold\">Phone Numbers<\/a>         <a href=\"tel:{{contact.number}}\" class=\"list-group-item\" ng-repeat=\"contact in contacts.Contacts \">             <b>{{contact.name}} <\/b>             <i class=\"fa fa-chevron-circle-right pull-right fa-2x\"><\/i>             <br/>             <i class=\"fa fa-phone\"><\/i>&nbsp;&nbsp;{{contact.number}}         <\/a>     <\/div> <\/div>",
          "pageprocessor": "function pageprocessorEmergency(pagedef, $scope, $routeParams, $compile, $http, $rootScope, $sce, $window, $location) {\r\n    $scope.contacts = $.parseJSON(pagedef.contactdetails);\r\n    var data1 = $compile($(pagedef.pageTemplate))($scope);\r\n    $(\"#appContent\").append(data1);\r\n    $scope.$apply();\r\n}",
          "contactdetails": "{\r\n  \"Contacts\": [{\r\n      \"name\": \"Universal Emergency\",\r\n      \"number\": \"112\"\r\n    }, {\r\n      \"name\": \"Lake Macquarie Campus\",\r\n      \"number\": \"61 2 4980 2222\"\r\n    },{\r\n    \"name\": \"Sydney Campus\",\r\n    \"number\": \"61 2 9480 3630\"\r\n  },\r\n  {\r\n    \"name\": \"Melbourne Campus\",\r\n    \"number\": \"61 2 4980 2377\"\r\n  }]\r\n\r\n}"
        }
      ]
    },
    {
      "id": 70144,
      "name": "News354",
      "displayname": "Library",
      "logo": "IND1540/News354.png",
      "logourl": "IND1540/News354.png",
      "description": "News",
      "appFeatureType": "Public",
      "roles": null,
      "showInDock": false,
      "showInHome": true,
      "networkrequired": true,
      "analytics": true,
      "pages": 
      [
        {
          "pageid": "News354",
          "pageTemplate": "<div><\/div>",
          "pageprocessor": "function pageprocessorNews354(pagedef, $scope, $routeParams, $compile, $http, $rootScope, $sce, $window, $location) {\r\n  if (window.device) {\r\n    $.blockUI();\r\n  }\r\n  var iabRef = window.open(pagedef.url, \"_blank\", \"location=no,hidden=yes,enableViewportScale=yes,clearcache=yes\");\r\n  var hideBlockUi = function() {\r\n    $.unblockUI();\r\n    iabRef.show();\r\n  };\r\n  var iabClose = function(data) {\r\n    $.unblockUI();\r\n    iabRef.removeEventListener(\"exit\", iabClose);\r\n    window.location.href = \"index.html#home\";\r\n  };\r\n  iabRef.addEventListener(\"exit\", iabClose);\r\n  var loadStop = function(data) {\r\n    hideBlockUi();\r\n    iabRef.removeEventListener(\"loadstop\", loadStop);\r\n  };\r\n  iabRef.addEventListener(\"loadstop\", loadStop);\r\n}",
          "url": "https://www.les.edu/academics-en/library-en/"
        }
      ]
    },
    {
      "id": 70146,
      "name": "Facebook321",
      "displayname": "Facebook",
      "logo": "IND1540/Facebook321.png",
      "logourl": "IND1540/Facebook321.png",
      "description": "Facebook",
      "appFeatureType": "Public",
      "roles": null,
      "showInDock": false,
      "showInHome": true,
      "networkrequired": true,
      "analytics": true,
      "pages": 
      [
        {
          "pageid": "Facebook321",
          "pageTemplate": "<div><\/div>",
          "pageprocessor": "function pageprocessorFacebook321(pagedef, $scope, $routeParams, $compile, $http, $rootScope, $sce, $window, $location) {\r\n  if (window.device) {\r\n    $.blockUI();\r\n  }\r\n  var iabRef = window.open(pagedef.url, \"_blank\", \"location=no,hidden=yes,enableViewportScale=yes,clearcache=yes\");\r\n  var hideBlockUi = function() {\r\n    $.unblockUI();\r\n    iabRef.show();\r\n  };\r\n  var iabClose = function(data) {\r\n    $.unblockUI();\r\n    iabRef.removeEventListener(\"exit\", iabClose);\r\n    window.location.href = \"index.html#home\";\r\n  };\r\n  iabRef.addEventListener(\"exit\", iabClose);\r\n  var loadStop = function(data) {\r\n    hideBlockUi();\r\n    iabRef.removeEventListener(\"loadstop\", loadStop);\r\n  };\r\n  iabRef.addEventListener(\"loadstop\", loadStop);\r\n}",
          "url": "https://www.facebook.com/LogosEvangelicalSeminary/"
        }
      ]
    }
  ],
  "pages": 
  [
  ]
}