{
  "version": 8,
  "tenantid": "LBAR",
  "mobappid": 6404,
  "appName": "LBAR",
  "appDisplayName": "LBAR",
  "homeScreenTemplate": "<script>\r\n    MyCampusApp.rootScope.animatepage = function(currentstyle) {\r\n        $(\".app-body\").addClass(currentstyle);\r\n    }\r\n    var hideInterval = setInterval(function() {\r\n        var animatecss = $(\"#animatecss\");\r\n        if (!animatecss || animatecss.length <= 0) {\r\n            $.ajax({\r\n                url: \"https://raw.githubusercontent.com/daneden/animate.css/master/animate.css\",\r\n                dataType: \"text\",\r\n                success: function(data) {\r\n                    $(\"head\").append(\"<style id='animatecss'>\" + data + \"<\/style>\");\r\n                    clearInterval(hideInterval);\r\n                }\r\n            });\r\n        }\r\n    }, 2000);\r\n    if (!MyCampusApp.rootScope.cangelistadded) {\r\n        MyCampusApp.rootScope.$on(\"$routeChangeStart\", function(event, next, current) {\r\n            $(\".app-body\").attr(\"class\", \"app-body animated \");\r\n        });\r\n        MyCampusApp.rootScope.$on(\"$routeChangeSuccess\", function(event, next, current) {\r\n            currentstyle = \"bounceInRight\";\r\n            if (next.loadedTemplateUrl == \"partials/home.html\" && current.loadedTemplateUrl != \"partials/home.html\") {\r\n                currentstyle = \"bounceInLeft\";\r\n            } else if(current.loadedTemplateUrl != \"partials/home.html\") {\r\n                if (next.params.appid == current.params.appid && next.params.appid == next.params.pageid) {\r\n                    currentstyle = \"bounceInLeft\";\r\n                }\r\n              \tif (MyCampusApp.rootScope.ppage) {\r\n                \tif (MyCampusApp.rootScope.ppage.appid == next.params.appid && MyCampusApp.rootScope.ppage.pageid == next.params.pageid) {\r\n                    \tcurrentstyle = \"bounceInLeft\";\r\n                \t}\r\n                }\r\n            }\r\n            $(\".app-body\").addClass(currentstyle);\r\n            $(\".app-body\").addClass(\"animated\");\r\n            MyCampusApp.rootScope.cpage = next.params;\r\n            MyCampusApp.rootScope.ppage = current.params;\r\n        });\r\n        MyCampusApp.rootScope.cangelistadded = true;\r\n    }\r\n<\/script>",
  "middlewareServerUrl": null,
  "feedbackEmail": null,
  "backgroundurl": "LBAR/background.png",
  "brandingurl": "LBAR/branding.png",
  "customStyle": "#branding {\r\n  position:absolute !important;\r\n  bottom:40px;\r\n  left:0px !important;\r\n  right:0px !important;\r\n  width:50% !important;\r\n  margin:auto !important;\r\n}\r\nbody {\r\n   position:absolute;\r\n   width:100%;\r\n   height:100%;\r\n   background-size:100% 100% !important;\r\n}\r\n.icon {\r\n   width:56px !important;\r\n   height:56px !important;\r\n}\r\n.campuseai-Info {\r\n  color:white;\r\n}\r\n.dockicon:after {\r\n   bottom:0px !important;\r\n}\r\n\r\n.dockicon {\r\n   margin-bottom:25px !important;\r\n}\r\n\r\n\r\n.blockUI i{\r\n   color:white !important;\r\n}\r\n\r\n@media (min-width: 768px) { \r\n   #branding {\r\n      width:50% !important;\r\n      margin:auto;    \r\n   }\r\n   .icon {\r\n      width:102px !important;\r\n      height:102px !important;\r\n    }\r\n}\r\n\r\n.promptumenu_nav a.active {\r\n   background:#fff;\r\n   border-radius:50%;\r\n   width:10px;\r\n   height:10px;\r\n}\r\n\r\n.promptumenu_nav a {\r\n  background:#00162f;\r\n   border-radius:50%;\r\n   width:10px;\r\n   height:10px;\r\n}\r\n.promptumenu_window {\r\n   overflow:visible !important; \r\n}\r\n\r\n.promptumenu_nav {\r\nmargin-bottom:-3px;\r\n}\r\n\r\n.app-body {\r\n   padding-bottom:19px !important;\r\n}\r\n\r\n.blockUI {\r\n  margin:auto !important;\r\n  left:0px  !important;\r\n  right:0px !important;\r\n  width:auto !important;\r\n}\r\n\r\n#homedata .campuseai-Info {\r\n  width:76px !important;\r\n  margin-left:-10px;\r\n}\r\n@media (min-width : 320px) and (max-width : 480px) { \r\n   .icon { width:56px !important;\r\n     height:56px !important;\r\n   }\r\n   #homedata .campuseai-Info {\r\n     width:76px !important;\r\n     margin-left:-10px;\r\n   }\r\n}\r\n\r\n@media (min-width : 320px) and (max-width : 568px) { \r\n   .icon { width:63px !important;\r\n\t   height:63px !important;\r\n   }\r\n   #homedata .campuseai-Info {\r\n     width:83px !important;\r\n     margin-left:-10px;\r\n   }\r\n}\r\n\r\n#mainSidebar .list-group-item {\r\n  border-bottom:1px solid #000 !important;\r\n}\r\n\r\n#homedata .campuseai-Info {\r\n  font-weight:bold;\r\n  text-shadow:2px 2px 2px #000;\r\n}.navbar-app, .sidebar, #mainSidebar { background : #000000 !important; } .navbar-brand, .navbar-absolute-top .btn-navbar { color : #ffffff !important; } .navbar-absolute-bottom .navbar-inverse { background :  !important; } .navbar-absolute-bottom .navbar-inverse { color :  !important; } .app { background :  !important; } .campuseai-Info { color :  !important; } #mainSidebar .list-group-item { background :  !important; } #mainSidebar .list-group-item { color :  !important; } #mainSidebar .appgroup { background :  !important; } #mainSidebar .appgroup { color :  !important; } .btn-primary { background :  !important; } .btn-primary { color :  !important; } .btn-primary { border-color :  !important; } ",
  "authFunction": "function authFunction(uname, password, $http, $rootScope, success, error) {\r\n  alert (\"Tenant from Mycampus : \" + MyCampusApp.config.tenant);\r\n  alert (\"Tenant from Jstorage : \" + $.jStorage.get('tenant'));\r\n  $.jStorage.deleteKey('tenant');\r\n    var authSuccess = success;\r\n    var authError = error;\r\n    //Peoplesoft authentication\r\n    /*\r\n    var url = $rootScope.middlewareServerUrl + \"/services/ps/psholds\";\r\n    var data = {};\r\n    if (window.device) {\r\n        data = \"userId=\" + uname + \"&password=\" + password;\r\n    } else {\r\n        url = \"/websimulator/json?url=\" + url;\r\n        data = {\r\n            method: \"POST\",\r\n            body: \"userId=\" + uname + \"&password=\" + password\r\n        };\r\n    }\r\n    $.blockUI({\r\n        message: '<div style=\"margin: 2px; vertical-align: middle; display: inline-block\"><i class=\"icon-cog icon-spin icon-4x\"><\/i><h3>Authenticating<\/h3><\/div>'\r\n    });\r\n    alert(\"URL : \" + url);\r\n    $http.post(url, data).success(function (data, status, headers, config) {\r\n        success(data);\r\n        $.unblockUI();\r\n    }).error(function (data, status, headers, config) {\r\n        error(data);\r\n        $.unblockUI();\r\n    });\r\n*/\r\n    //Banner Authentication with CAS\r\n\r\n    /*var url = \"https://my.curry.edu/cas/v1/tickets/\";\r\n    var data = {};\r\n    if (window.device) {\r\n        data = \"username=\" + uname + \"&password=\" + password;\r\n    } else {\r\n        url = \"/websimulator/text?url=\" + url;\r\n        data = {\r\n            method: \"POST\",\r\n            body: \"username=\" + uname + \"&password=\" + password\r\n        };\r\n    }\r\n\r\n    $rootScope.generateST = function (tgt, service, callback) {\r\n        var data = {};\r\n        if (window.device) {\r\n            data = \"service=\" + service;\r\n        } else {\r\n            url = \"/websimulator/text?url=\" + \"https://my.curry.edu/cas/v1/tickets/\";\r\n            data = {\r\n                method: \"POST\",\r\n                body: \"service=\" + service\r\n            };\r\n        }\r\n\r\n        $.ajax({\r\n            url: url + tgt,\r\n            type: \"POST\",\r\n            async: true,\r\n            data: data,\r\n            error: function (response) {\r\n                alert(\"Error : \" + response);\r\n\r\n            },\r\n            success: function (data) {\r\n                //alert(\"Success : \" + data);\r\n                callback(data);\r\n            }\r\n        });\r\n\r\n    };\r\n\r\n    $.blockUI({\r\n        message: '<div style=\"margin: 2px; vertical-align: middle; display: inline-block\"><i class=\"icon-cog icon-spin icon-4x\"><\/i><h3>Authenticating<\/h3><\/div>'\r\n    });\r\n    $.ajax({\r\n        url: url,\r\n        type: \"POST\",\r\n        async: true,\r\n        data: data,\r\n        error: function (response) {\r\n            $.unblockUI();\r\n        },\r\n        success: function (data) {\r\n            //alert(\"Success : \" + data);\r\n            $.unblockUI();\r\n\r\n        },\r\n        complete: function (response, textStatus) {\r\n            //alert(\"complete : \" + response + \"  text status : \" + textStatus);\r\n            $.unblockUI();\r\n            if (textStatus == \"success\" && response.status == 201) {\r\n                var str = response.getResponseHeader('Location');\r\n                var tgtTicket = str.substr(str.lastIndexOf('/') + 1);\r\n                //generateST(tgtTicket);\r\n                success({\r\n                    \"ticket\": tgtTicket\r\n                });\r\n                $rootScope.$apply(function () {\r\n\r\n                    $rootScope.setRoute(\"/home\");\r\n\r\n                });\r\n\r\n\r\n            } else {\r\n                success({\r\n                    \"error\": \"Oops! Cannot log you in. Please check your login details.\"\r\n                });\r\n            }\r\n        }\r\n\r\n    });*/\r\n\r\n\r\n    //Banner Authentication with LDAP - middlware auth\r\n\r\n    var url = $rootScope.middlewareServerUrl + \"/bannermobile2/services/authenticate/login\";\r\n    var data = {};\r\n    if (window.device) {\r\n        data = \"username=\" + uname + \"&password=\" + password;\r\n    } else {\r\n        url = \"/websimulator/json?url=\" + url;\r\n        data = {\r\n            method: \"POST\",\r\n            body: \"username=\" + uname + \"&password=\" + password\r\n        };\r\n    }\r\n    var authUrl = url;\r\n    var authData = data;\r\n    $rootScope.generateST = function(tgt, service, callback) {\r\n        //Bypassing the ST as there is no service ticket required here..\r\n        callback(tgt);\r\n    };\r\n\r\n    $rootScope.postAPI = function(endpoint, postdata, callback) {\r\n        $.blockUI();\r\n        $rootScope.generateST($rootScope.ticket, endpoint, function(st) {\r\n            var serviceurl = endpoint + \"?ticket=\" + st;\r\n            var url = \"\";\r\n            var proxyMethod = \"POST\";\r\n            var proxyData = postdata;\r\n            if (window.device) {\r\n                url = serviceurl;\r\n            } else {\r\n                url = \"/websimulator/json?url=\" + serviceurl;\r\n                proxyMethod = \"POST\";\r\n                proxyData = {\r\n                    method: \"POST\",\r\n                    body: postdata\r\n                }\r\n            }\r\n            $http({\r\n                method: proxyMethod,\r\n                url: url,\r\n                data: proxyData\r\n            }).\r\n            success(function(data, status, headers, config) {\r\n                $.unblockUI();\r\n                callback(data, status, headers, config);\r\n            }).\r\n            error(function(data, status, headers, config) {\r\n                $.unblockUI();\r\n                //alert(\"Error in service call : \" + data + \" Status : \" + status);\r\n                if (status == 403) { //Ticket expired.. need to relogin\r\n                    $http.post(authUrl, authData).success(function(data, status, headers, config) {\r\n                        authSuccess(data);\r\n                        $rootScope.getAPI(endpoint, callback);\r\n                    }).error(function(data, status, headers, config) {\r\n                        authError(data);\r\n\r\n                    });\r\n                }\r\n\r\n            });\r\n\r\n        });\r\n\r\n    };\r\n\r\n    $rootScope.getAPI = function(endpoint, callback) {\r\n        $.blockUI();\r\n        $rootScope.generateST($rootScope.ticket, endpoint, function(st) {\r\n            var serviceurl = endpoint + \"?ticket=\" + st;\r\n            var url = \"\";\r\n            var proxyMethod = \"GET\";\r\n            var proxyData = {};\r\n            if (window.device) {\r\n                url = serviceurl;\r\n            } else {\r\n                url = \"/websimulator/json?url=\" + encodeURIComponent(serviceurl);\r\n                proxyMethod = \"POST\";\r\n                proxyData = {\r\n                    method: \"GET\"\r\n                }\r\n            }\r\n            $http({\r\n                method: proxyMethod,\r\n                url: url,\r\n                data: proxyData\r\n            }).\r\n            success(function(data, status, headers, config) {\r\n                $.unblockUI();\r\n                callback(data, status, headers, config);\r\n            }).\r\n            error(function(data, status, headers, config) {\r\n                $.unblockUI();\r\n                //alert(\"Error in service call : \" + data + \" Status : \" + status);\r\n                if (status == 403) { //Ticket expired.. need to relogin\r\n                    $http.post(authUrl, authData).success(function(data, status, headers, config) {\r\n                        authSuccess(data);\r\n                        $rootScope.getAPI(endpoint, callback);\r\n                    }).error(function(data, status, headers, config) {\r\n                        authError(data);\r\n\r\n                    });\r\n                }\r\n\r\n            });\r\n\r\n        });\r\n\r\n    };\r\n\r\n\r\n\r\n\r\n    $.blockUI({\r\n        message: '<div style=\"margin: 2px; vertical-align: middle; display: inline-block\"><i class=\"icon-cog icon-spin icon-4x\"><\/i><h3>Authenticating<\/h3><\/div>'\r\n    });\r\n\r\n    $http.post(url, data).success(function(data, status, headers, config) {\r\n        success(data);\r\n        $.unblockUI();\r\n    }).error(function(data, status, headers, config) {\r\n        error(data);\r\n        $.unblockUI();\r\n    });\r\n\r\n}",
  "forgotPasswordUrl": null,
  "reportissueEmail": null,
  "iconWidth": 70,
  "apps": 
  [
    {
      "id": 84118,
      "name": "ARMaps",
      "displayname": "AR-Maps",
      "logo": "LBAR/ARMaps.png",
      "logourl": "LBAR/ARMaps.png",
      "description": "AR-Maps",
      "appFeatureType": "Public",
      "roles": null,
      "showInDock": false,
      "showInHome": true,
      "networkrequired": true,
      "analytics": false,
      "pages": 
      [
        {
          "pageid": "ARMaps",
          "pageTemplate": "<div><\/div>",
          "pageprocessor": "function pageprocessorARMaps(pagedef, $scope, $routeParams, $compile, $http, $rootScope, $sce, $window, $location) {\r\n\tvar data1 = $compile($(pagedef.datatemplate))($scope);$(\"#appContent\").append(data1);\r\n\r\ntry{\r\n\r\nvar kMarker_AnimationDuration_ChangeDrawable = 500;\r\nvar kMarker_AnimationDuration_Resize = 1000;\r\n\r\nfunction Marker(poiData) {\r\n\r\n    this.poiData = poiData;\r\n    this.isSelected = false;\r\n\r\n    /*\r\n        With AR.PropertyAnimations you are able to animate almost any property of ARchitect objects. This sample will animate the opacity of both background drawables so that one will fade out while the other one fades in. The scaling is animated too. The marker size changes over time so the labels need to be animated too in order to keep them relative to the background drawable. AR.AnimationGroups are used to synchronize all animations in parallel or sequentially.\r\n    */\r\n\r\n    this.animationGroup_idle = null;\r\n    this.animationGroup_selected = null;\r\n\r\n\r\n    // create the AR.GeoLocation from the poi data\r\n    var markerLocation = new AR.GeoLocation(poiData.latitude, poiData.longitude, poiData.altitude);\r\n\r\n    // create an AR.ImageDrawable for the marker in idle state\r\n    this.markerDrawable_idle = new AR.ImageDrawable(World.markerDrawable_idle, 2.5, {\r\n        zOrder: 0,\r\n        opacity: 1.0,\r\n        /*\r\n            To react on user interaction, an onClick property can be set for each AR.Drawable. The property is a function which will be called each time the user taps on the drawable. The function called on each tap is returned from the following helper function defined in marker.js. The function returns a function which checks the selected state with the help of the variable isSelected and executes the appropriate function. The clicked marker is passed as an argument.\r\n        */\r\n        onClick: Marker.prototype.getOnClickTrigger(this)\r\n    });\r\n\r\n    // create an AR.ImageDrawable for the marker in selected state\r\n    this.markerDrawable_selected = new AR.ImageDrawable(World.markerDrawable_selected, 2.5, {\r\n        zOrder: 0,\r\n        opacity: 0.0,\r\n        onClick: null\r\n    });\r\n\r\n    // create an AR.Label for the marker's title \r\n    this.titleLabel = new AR.Label(poiData.title.trunc(10), 1, {\r\n        zOrder: 1,\r\n        translate: {\r\n            y: 0.55\r\n        },\r\n        style: {\r\n            textColor: '#FFFFFF',\r\n            fontStyle: AR.CONST.FONT_STYLE.BOLD\r\n        }\r\n    });\r\n\r\n    // create an AR.Label for the marker's description\r\n    this.descriptionLabel = new AR.Label(poiData.description.trunc(15), 0.8, {\r\n        zOrder: 1,\r\n        translate: {\r\n            y: -0.55\r\n        },\r\n        style: {\r\n            textColor: '#FFFFFF'\r\n        }\r\n    });\r\n\r\n    /*\r\n        Create an AR.ImageDrawable using the AR.ImageResource for the direction indicator which was created in the World. Set options regarding the offset and anchor of the image so that it will be displayed correctly on the edge of the screen.\r\n    */\r\n    this.directionIndicatorDrawable = new AR.ImageDrawable(World.markerDrawable_directionIndicator, 0.1, {\r\n        enabled: false,\r\n        verticalAnchor: AR.CONST.VERTICAL_ANCHOR.TOP\r\n    });\r\n\r\n    /*\r\n        Create the AR.GeoObject with the drawable objects and define the AR.ImageDrawable as an indicator target on the marker AR.GeoObject. The direction indicator is displayed automatically when necessary. AR.Drawable subclasses (e.g. AR.Circle) can be used as direction indicators.\r\n    */\r\n    this.markerObject = new AR.GeoObject(markerLocation, {\r\n        drawables: {\r\n            cam: [this.markerDrawable_idle, this.markerDrawable_selected, this.titleLabel, this.descriptionLabel],\r\n            indicator: this.directionIndicatorDrawable\r\n        }\r\n    });\r\n\r\n    return this;\r\n}\r\n\r\nMarker.prototype.getOnClickTrigger = function(marker) {\r\n\r\n    /*\r\n        The setSelected and setDeselected functions are prototype Marker functions. \r\n        Both functions perform the same steps but inverted.\r\n    */\r\n\r\n    return function() {\r\n\r\n        if (!Marker.prototype.isAnyAnimationRunning(marker)) {\r\n            if (marker.isSelected) {\r\n\r\n                Marker.prototype.setDeselected(marker);\r\n\r\n            } else {\r\n                Marker.prototype.setSelected(marker);\r\n                try {\r\n                    World.onMarkerSelected(marker);\r\n                } catch (err) {\r\n                    alert(err);\r\n                }\r\n\r\n            }\r\n        } else {\r\n            AR.logger.debug('a animation is already running');\r\n        }\r\n\r\n\r\n        return true;\r\n    };\r\n};\r\n\r\n/*\r\n    Property Animations allow constant changes to a numeric value/property of an object, dependent on start-value, end-value and the duration of the animation. Animations can be seen as functions defining the progress of the change on the value. The Animation can be parametrized via easing curves.\r\n*/\r\n\r\nMarker.prototype.setSelected = function(marker) {\r\n\r\n    marker.isSelected = true;\r\n\r\n    // New: \r\n    if (marker.animationGroup_selected === null) {\r\n\r\n        // create AR.PropertyAnimation that animates the opacity to 0.0 in order to hide the idle-state-drawable\r\n        var hideIdleDrawableAnimation = new AR.PropertyAnimation(marker.markerDrawable_idle, \"opacity\", null, 0.0, kMarker_AnimationDuration_ChangeDrawable);\r\n        // create AR.PropertyAnimation that animates the opacity to 1.0 in order to show the selected-state-drawable\r\n        var showSelectedDrawableAnimation = new AR.PropertyAnimation(marker.markerDrawable_selected, \"opacity\", null, 1.0, kMarker_AnimationDuration_ChangeDrawable);\r\n\r\n        // create AR.PropertyAnimation that animates the scaling of the idle-state-drawable to 1.2\r\n        var idleDrawableResizeAnimationX = new AR.PropertyAnimation(marker.markerDrawable_idle, 'scale.x', null, 1.2, kMarker_AnimationDuration_Resize, new AR.EasingCurve(AR.CONST.EASING_CURVE_TYPE.EASE_OUT_ELASTIC, {\r\n            amplitude: 2.0\r\n        }));\r\n        // create AR.PropertyAnimation that animates the scaling of the selected-state-drawable to 1.2\r\n        var selectedDrawableResizeAnimationX = new AR.PropertyAnimation(marker.markerDrawable_selected, 'scale.x', null, 1.2, kMarker_AnimationDuration_Resize, new AR.EasingCurve(AR.CONST.EASING_CURVE_TYPE.EASE_OUT_ELASTIC, {\r\n            amplitude: 2.0\r\n        }));\r\n        // create AR.PropertyAnimation that animates the scaling of the title label to 1.2\r\n        var titleLabelResizeAnimationX = new AR.PropertyAnimation(marker.titleLabel, 'scale.x', null, 1.2, kMarker_AnimationDuration_Resize, new AR.EasingCurve(AR.CONST.EASING_CURVE_TYPE.EASE_OUT_ELASTIC, {\r\n            amplitude: 2.0\r\n        }));\r\n        // create AR.PropertyAnimation that animates the scaling of the description label to 1.2\r\n        var descriptionLabelResizeAnimationX = new AR.PropertyAnimation(marker.descriptionLabel, 'scale.x', null, 1.2, kMarker_AnimationDuration_Resize, new AR.EasingCurve(AR.CONST.EASING_CURVE_TYPE.EASE_OUT_ELASTIC, {\r\n            amplitude: 2.0\r\n        }));\r\n\r\n        // create AR.PropertyAnimation that animates the scaling of the idle-state-drawable to 1.2\r\n        var idleDrawableResizeAnimationY = new AR.PropertyAnimation(marker.markerDrawable_idle, 'scale.y', null, 1.2, kMarker_AnimationDuration_Resize, new AR.EasingCurve(AR.CONST.EASING_CURVE_TYPE.EASE_OUT_ELASTIC, {\r\n            amplitude: 2.0\r\n        }));\r\n        // create AR.PropertyAnimation that animates the scaling of the selected-state-drawable to 1.2\r\n        var selectedDrawableResizeAnimationY = new AR.PropertyAnimation(marker.markerDrawable_selected, 'scale.y', null, 1.2, kMarker_AnimationDuration_Resize, new AR.EasingCurve(AR.CONST.EASING_CURVE_TYPE.EASE_OUT_ELASTIC, {\r\n            amplitude: 2.0\r\n        }));\r\n        // create AR.PropertyAnimation that animates the scaling of the title label to 1.2\r\n        var titleLabelResizeAnimationY = new AR.PropertyAnimation(marker.titleLabel, 'scale.y', null, 1.2, kMarker_AnimationDuration_Resize, new AR.EasingCurve(AR.CONST.EASING_CURVE_TYPE.EASE_OUT_ELASTIC, {\r\n            amplitude: 2.0\r\n        }));\r\n        // create AR.PropertyAnimation that animates the scaling of the description label to 1.2\r\n        var descriptionLabelResizeAnimationY = new AR.PropertyAnimation(marker.descriptionLabel, 'scale.y', null, 1.2, kMarker_AnimationDuration_Resize, new AR.EasingCurve(AR.CONST.EASING_CURVE_TYPE.EASE_OUT_ELASTIC, {\r\n            amplitude: 2.0\r\n        }));\r\n\r\n        /*\r\n            There are two types of AR.AnimationGroups. Parallel animations are running at the same time, sequentials are played one after another. This example uses a parallel AR.AnimationGroup.\r\n        */\r\n        marker.animationGroup_selected = new AR.AnimationGroup(AR.CONST.ANIMATION_GROUP_TYPE.PARALLEL, [hideIdleDrawableAnimation, showSelectedDrawableAnimation, idleDrawableResizeAnimationX, selectedDrawableResizeAnimationX, titleLabelResizeAnimationX, descriptionLabelResizeAnimationX, idleDrawableResizeAnimationY, selectedDrawableResizeAnimationY, titleLabelResizeAnimationY, descriptionLabelResizeAnimationY]);\r\n    }\r\n\r\n    // removes function that is set on the onClick trigger of the idle-state marker\r\n    marker.markerDrawable_idle.onClick = null;\r\n    // sets the click trigger function for the selected state marker\r\n    marker.markerDrawable_selected.onClick = Marker.prototype.getOnClickTrigger(marker);\r\n\r\n    // enables the direction indicator drawable for the current marker\r\n    marker.directionIndicatorDrawable.enabled = true;\r\n    // starts the selected-state animation\r\n    marker.animationGroup_selected.start();\r\n};\r\n\r\nMarker.prototype.setDeselected = function(marker) {\r\n\r\n    marker.isSelected = false;\r\n\r\n    if (marker.animationGroup_idle === null) {\r\n\r\n        // create AR.PropertyAnimation that animates the opacity to 1.0 in order to show the idle-state-drawable\r\n        var showIdleDrawableAnimation = new AR.PropertyAnimation(marker.markerDrawable_idle, \"opacity\", null, 1.0, kMarker_AnimationDuration_ChangeDrawable);\r\n        // create AR.PropertyAnimation that animates the opacity to 0.0 in order to hide the selected-state-drawable\r\n        var hideSelectedDrawableAnimation = new AR.PropertyAnimation(marker.markerDrawable_selected, \"opacity\", null, 0, kMarker_AnimationDuration_ChangeDrawable);\r\n        // create AR.PropertyAnimation that animates the scaling of the idle-state-drawable to 1.0\r\n        var idleDrawableResizeAnimationX = new AR.PropertyAnimation(marker.markerDrawable_idle, 'scale.x', null, 1.0, kMarker_AnimationDuration_Resize, new AR.EasingCurve(AR.CONST.EASING_CURVE_TYPE.EASE_OUT_ELASTIC, {\r\n            amplitude: 2.0\r\n        }));\r\n        // create AR.PropertyAnimation that animates the scaling of the selected-state-drawable to 1.0\r\n        var selectedDrawableResizeAnimationX = new AR.PropertyAnimation(marker.markerDrawable_selected, 'scale.x', null, 1.0, kMarker_AnimationDuration_Resize, new AR.EasingCurve(AR.CONST.EASING_CURVE_TYPE.EASE_OUT_ELASTIC, {\r\n            amplitude: 2.0\r\n        }));\r\n        // create AR.PropertyAnimation that animates the scaling of the title label to 1.0\r\n        var titleLabelResizeAnimationX = new AR.PropertyAnimation(marker.titleLabel, 'scale.x', null, 1.0, kMarker_AnimationDuration_Resize, new AR.EasingCurve(AR.CONST.EASING_CURVE_TYPE.EASE_OUT_ELASTIC, {\r\n            amplitude: 2.0\r\n        }));\r\n        // create AR.PropertyAnimation that animates the scaling of the description label to 1.0\r\n        var descriptionLabelResizeAnimationX = new AR.PropertyAnimation(marker.descriptionLabel, 'scale.x', null, 1.0, kMarker_AnimationDuration_Resize, new AR.EasingCurve(AR.CONST.EASING_CURVE_TYPE.EASE_OUT_ELASTIC, {\r\n            amplitude: 2.0\r\n        }));\r\n        // create AR.PropertyAnimation that animates the scaling of the idle-state-drawable to 1.0\r\n        var idleDrawableResizeAnimationY = new AR.PropertyAnimation(marker.markerDrawable_idle, 'scale.y', null, 1.0, kMarker_AnimationDuration_Resize, new AR.EasingCurve(AR.CONST.EASING_CURVE_TYPE.EASE_OUT_ELASTIC, {\r\n            amplitude: 2.0\r\n        }));\r\n        // create AR.PropertyAnimation that animates the scaling of the selected-state-drawable to 1.0\r\n        var selectedDrawableResizeAnimationY = new AR.PropertyAnimation(marker.markerDrawable_selected, 'scale.y', null, 1.0, kMarker_AnimationDuration_Resize, new AR.EasingCurve(AR.CONST.EASING_CURVE_TYPE.EASE_OUT_ELASTIC, {\r\n            amplitude: 2.0\r\n        }));\r\n        // create AR.PropertyAnimation that animates the scaling of the title label to 1.0\r\n        var titleLabelResizeAnimationY = new AR.PropertyAnimation(marker.titleLabel, 'scale.y', null, 1.0, kMarker_AnimationDuration_Resize, new AR.EasingCurve(AR.CONST.EASING_CURVE_TYPE.EASE_OUT_ELASTIC, {\r\n            amplitude: 2.0\r\n        }));\r\n        // create AR.PropertyAnimation that animates the scaling of the description label to 1.0\r\n        var descriptionLabelResizeAnimationY = new AR.PropertyAnimation(marker.descriptionLabel, 'scale.y', null, 1.0, kMarker_AnimationDuration_Resize, new AR.EasingCurve(AR.CONST.EASING_CURVE_TYPE.EASE_OUT_ELASTIC, {\r\n            amplitude: 2.0\r\n        }));\r\n\r\n        /*\r\n            There are two types of AR.AnimationGroups. Parallel animations are running at the same time, sequentials are played one after another. This example uses a parallel AR.AnimationGroup.\r\n        */\r\n        marker.animationGroup_idle = new AR.AnimationGroup(AR.CONST.ANIMATION_GROUP_TYPE.PARALLEL, [showIdleDrawableAnimation, hideSelectedDrawableAnimation, idleDrawableResizeAnimationX, selectedDrawableResizeAnimationX, titleLabelResizeAnimationX, descriptionLabelResizeAnimationX, idleDrawableResizeAnimationY, selectedDrawableResizeAnimationY, titleLabelResizeAnimationY, descriptionLabelResizeAnimationY]);\r\n    }\r\n\r\n    // sets the click trigger function for the idle state marker\r\n    marker.markerDrawable_idle.onClick = Marker.prototype.getOnClickTrigger(marker);\r\n    // removes function that is set on the onClick trigger of the selected-state marker\r\n    marker.markerDrawable_selected.onClick = null;\r\n\r\n    // disables the direction indicator drawable for the current marker\r\n    marker.directionIndicatorDrawable.enabled = false;\r\n    // starts the idle-state animation\r\n    marker.animationGroup_idle.start();\r\n};\r\n\r\nMarker.prototype.isAnyAnimationRunning = function(marker) {\r\n\r\n    if (marker.animationGroup_idle === null || marker.animationGroup_selected === null) {\r\n        return false;\r\n    } else {\r\n        if ((marker.animationGroup_idle.isRunning() === true) || (marker.animationGroup_selected.isRunning() === true)) {\r\n            return true;\r\n        } else {\r\n            return false;\r\n        }\r\n    }\r\n};\r\n\r\n// will truncate all strings longer than given max-length \"n\". e.g. \"foobar\".trunc(3) -> \"foo...\"\r\nString.prototype.trunc = function(n) {\r\n    return this.substr(0, n - 1) + (this.length > n ? '...' : '');\r\n};\r\n\r\n\r\n\r\n// implementation of AR-Experience (aka \"World\")\r\nvar World = {\r\n\t// you may request new data from server periodically, however: in this sample data is only requested once\r\n\tisRequestingData: false,\r\n\r\n\t// true once data was fetched\r\n\tinitiallyLoadedData: false,\r\n\r\n\t// different POI-Marker assets\r\n\tmarkerDrawable_idle: null,\r\n\tmarkerDrawable_selected: null,\r\n\tmarkerDrawable_directionIndicator: null,\r\n\r\n\t// list of AR.GeoObjects that are currently shown in the scene / World\r\n\tmarkerList: [],\r\n\r\n\t// The last selected marker\r\n\tcurrentMarker: null,\r\n\r\n\t// called to inject new POI data\r\n\tloadPoisFromJsonData: function loadPoisFromJsonDataFn(poiData) {\r\n\t\t// empty list of visible markers\r\n\t\tWorld.markerList = [];\r\n\r\n\t\t// Start loading marker assets:\r\n\t\t// Create an AR.ImageResource for the marker idle-image\r\n\t\tWorld.markerDrawable_idle = new AR.ImageResource(\"assets/marker_idle.png\");\r\n\t\t// Create an AR.ImageResource for the marker selected-image\r\n\t\tWorld.markerDrawable_selected = new AR.ImageResource(\"assets/marker_selected.png\");\r\n\t\t// Create an AR.ImageResource referencing the image that should be displayed for a direction indicator. \r\n\t\tWorld.markerDrawable_directionIndicator = new AR.ImageResource(\"assets/indi.png\");\r\n\r\n\t\t// loop through POI-information and create an AR.GeoObject (=Marker) per POI\r\n\t\tfor (var currentPlaceNr = 0; currentPlaceNr < poiData.length; currentPlaceNr++) {\r\n\t\t\tvar singlePoi = {\r\n\t\t\t\t\"id\": poiData[currentPlaceNr].id,\r\n\t\t\t\t\"latitude\": parseFloat(poiData[currentPlaceNr].latitude),\r\n\t\t\t\t\"longitude\": parseFloat(poiData[currentPlaceNr].longitude),\r\n\t\t\t\t\"altitude\": parseFloat(poiData[currentPlaceNr].altitude),\r\n\t\t\t\t\"title\": poiData[currentPlaceNr].name,\r\n\t\t\t\t\"description\": poiData[currentPlaceNr].description\r\n\t\t\t};\r\n\r\n\t\t\t/*\r\n\t\t\t\tTo be able to deselect a marker while the user taps on the empty screen, \r\n\t\t\t\tthe World object holds an array that contains each marker.\r\n\t\t\t*/\r\n\t\t\tWorld.markerList.push(new Marker(singlePoi));\r\n\t\t}\r\n\r\n\t\tWorld.updateStatusMessage(currentPlaceNr + ' places loaded');\r\n\t},\r\n\r\n\t// updates status message shown in small \"i\"-button aligned bottom center\r\n\tupdateStatusMessage: function updateStatusMessageFn(message, isWarning) {\r\n\r\n\t\tvar themeToUse = isWarning ? \"e\" : \"c\";\r\n\t\tvar iconToUse = isWarning ? \"alert\" : \"info\";\r\n\r\n\t\t$(\"#status-message\").html(message);\r\n\t\t$(\"#popupInfoButton\").buttonMarkup({\r\n\t\t\ttheme: themeToUse\r\n\t\t});\r\n\t\t$(\"#popupInfoButton\").buttonMarkup({\r\n\t\t\ticon: iconToUse\r\n\t\t});\r\n\t},\r\n\r\n\t// location updates, fired every time you call architectView.setLocation() in native environment\r\n\tlocationChanged: function locationChangedFn(lat, lon, alt, acc) {\r\n\r\n\t\t/*\r\n\t\t\tThe custom function World.onLocationChanged checks with the flag World.initiallyLoadedData if the function was already called. With the first call of World.onLocationChanged an object that contains geo information will be created which will be later used to create a marker using the World.loadPoisFromJsonData function.\r\n\t\t*/\r\n\t\tif (!World.initiallyLoadedData) {\r\n\t\t\t/* \r\n\t\t\t\trequestDataFromLocal with the geo information as parameters (latitude, longitude) creates different poi data to a random location in the user's vicinity.\r\n\t\t\t*/\r\n\t\t\tWorld.requestDataFromLocal(lat, lon);\r\n\t\t\tWorld.initiallyLoadedData = true;\r\n\t\t}\r\n\t},\r\n\r\n\t// fired when user pressed maker in cam\r\n\tonMarkerSelected: function onMarkerSelectedFn(marker) {\r\n\r\n\t\t// deselect previous marker\r\n\t\tif (World.currentMarker) {\r\n\t\t\tif (World.currentMarker.poiData.id == marker.poiData.id) {\r\n\t\t\t\treturn;\r\n\t\t\t}\r\n\t\t\tWorld.currentMarker.setDeselected(World.currentMarker);\r\n\t\t}\r\n\r\n\t\t// highlight current one\r\n\t\tmarker.setSelected(marker);\r\n\t\tWorld.currentMarker = marker;\r\n\t},\r\n\r\n\t// screen was clicked but no geo-object was hit\r\n\tonScreenClick: function onScreenClickFn() {\r\n\t\tif (World.currentMarker) {\r\n\t\t\tWorld.currentMarker.setDeselected(World.currentMarker);\r\n\t\t}\r\n\t},\r\n\r\n\t// request POI data\r\n\trequestDataFromLocal: function requestDataFromLocalFn(centerPointLatitude, centerPointLongitude) {\r\n\t\tvar poisToCreate = 20;\r\n\t\tvar poiData = [];\r\n\r\n\t\tfor (var i = 0; i < poisToCreate; i++) {\r\n\t\t\tpoiData.push({\r\n\t\t\t\t\"id\": (i + 1),\r\n\t\t\t\t\"longitude\": (centerPointLongitude + (Math.random() / 5 - 0.1)),\r\n\t\t\t\t\"latitude\": (centerPointLatitude + (Math.random() / 5 - 0.1)),\r\n\t\t\t\t\"description\": (\"EVC-Office\" + (i + 1)),\r\n\t\t\t\t// use this value to ignore altitude information in general - marker will always be on user-level\r\n\t\t\t\t\"altitude\": AR.CONST.UNKNOWN_ALTITUDE,\r\n\t\t\t\t\"name\": (\"EVC - Augmented Maps#\" + (i + 1))\r\n\t\t\t});\r\n\t\t}\r\n\t\tWorld.loadPoisFromJsonData(poiData);\r\n\t}\r\n\r\n};\r\n\r\n/* \r\n\tSet a custom function where location changes are forwarded to. There is also a possibility to set AR.context.onLocationChanged to null. In this case the function will not be called anymore and no further location updates will be received. \r\n*/\r\nAR.context.onLocationChanged = World.locationChanged;\r\n\r\n/*\r\n\tTo detect clicks where no drawable was hit set a custom function on AR.context.onScreenClick where the currently selected marker is deselected.\r\n*/\r\nAR.context.onScreenClick = World.onScreenClick;\r\n\r\n\r\n/*****************************************/\r\nvar poiData = [];\r\n\r\nfunction prepareApplicationDataModel() {\r\n    if ( !poiData.length ) {\r\n        navigator.geolocation.getCurrentPosition(onLocationUpdated, onLocationError);\r\n    } else {\r\n        if ( app.isArchitectWorldLoaded == true ) {\r\n            injectGeneratedPoiJsonData();\r\n        }\r\n    }\r\n}\r\n\r\n/* this is a dummy implementation to create poi-data, which are passed over to JS / Wikitude SDK on first location update */\r\n/* in this function we generate poi data that will then be injected once the example is fully loaded. The injection is done in the 'injectGeneratedPoiJsonData' function defined in this file. */\r\nfunction onLocationUpdated(position) {\r\n\r\n    var latitude = position.coords.latitude;\r\n    var longitude = position.coords.longitude;\r\n    var altitude = position.coords.altitudeAccuracy !== null ? position.coords.altitude : -32768.0;\r\n    var placesAmount = 10;\r\n\r\n    poiData = [];\r\n\r\n    // creates dummy poi-data around given lat/lon\r\n    for (var i=0; i< placesAmount; i++) {\r\n        poiData.push({ 'id': (i+1), 'longitude': longitude + 0.001 * ( 5 - getRandomInt(1,10) ), 'latitude' : latitude + 0.001 * (5 - getRandomInt(1,10)), 'description': 'This is the description of POI#'+(i+1), 'altitude' : altitude, 'name': 'POI#'+(i+1)})\r\n    }\r\n\r\n    if ( app.isArchitectWorldLoaded == true ) {\r\n           injectGeneratedPoiJsonData();\r\n    }\r\n}\r\n\r\nfunction injectGeneratedPoiJsonData() {\r\n    // inject POI data in JSON-format to JS\r\n    if ( poiData.length > 0 && app.isArchitectWorldLoaded == true ) {\r\n        app.wikitudePlugin.callJavaScript(\"World.loadPoisFromJsonData(\" + JSON.stringify( poiData ) +\");\");\r\n    }\r\n}\r\n\r\nfunction onLocationError(error) {\r\n\talert(\"Not able to fetch location.\");\r\n}\r\n\r\nfunction getRandomInt(min, max) {\r\n\treturn Math.floor(Math.random() * (max - min + 1) + min);\r\n}\r\n\r\n\r\n\r\n\t/*\r\n * Licensed to the Apache Software Foundation (ASF) under one\r\n * or more contributor license agreements.  See the NOTICE file\r\n * distributed with this work for additional information\r\n * regarding copyright ownership.  The ASF licenses this file\r\n * to you under the Apache License, Version 2.0 (the\r\n * \"License\"); you may not use this file except in compliance\r\n * with the License.  You may obtain a copy of the License at\r\n *\r\n * http://www.apache.org/licenses/LICENSE-2.0\r\n *\r\n * Unless required by applicable law or agreed to in writing,\r\n * software distributed under the License is distributed on an\r\n * \"AS IS\" BASIS, WITHOUT WARRANTIES OR CONDITIONS OF ANY\r\n * KIND, either express or implied.  See the License for the\r\n * specific language governing permissions and limitations\r\n * under the License.\r\n */\r\nvar app = {\r\n\r\n    // represents the device capability of launching ARchitect Worlds with specific features\r\n    isDeviceSupported: false,\r\n    isArchitectWorldLoaded: false,\r\n\r\n    // Application Constructor\r\n    initialize: function() {\r\n        this.bindEvents();\r\n    },\r\n    // Bind Event Listeners\r\n    //\r\n    // Bind any events that are required on startup. Common events are:\r\n    // 'load', 'deviceready', 'offline', and 'online'.\r\n    bindEvents: function() {\r\n        document.addEventListener('deviceready', this.onDeviceReady, false);\r\n    },\r\n    // deviceready Event Handler\r\n    onDeviceReady: function() {\r\n        app.wikitudePlugin = cordova.require(\"com.wikitude.phonegap.WikitudePlugin.WikitudePlugin\");\r\n        // set a callback for android that is called once the back button was clicked.\r\n        if ( cordova.platformId == \"android\" ) {\r\n            app.wikitudePlugin.setBackButtonCallback(app.onBackButton);\r\n        }\r\n        app.wikitudePlugin.setJSONObjectReceivedCallback(app.onJSONObjectReceived);\r\n    },\r\n    // --- Wikitude Plugin ---\r\n    loadExampleARchitectWorld: function(example) {\r\n\r\n        app.isArchitectWorldLoaded = false;\r\n        // inject poi data using phonegap's GeoLocation API and inject data using World.loadPoisFromJsonData\r\n        if ( example.requiredExtension === \"ObtainPoiDataFromApplicationModel\" ) {\r\n            prepareApplicationDataModel();\r\n        }\r\n\r\n        /* cordova.file.applicationDirectory is used to demonstrate the use of the cordova file plugin in combination with the Wikitude plugin */\r\n        /* The length check here is only necessary because for each example the same 'example' object is given here and we only want to change the path once. */\r\n        if ( example.path.length > cordova.file.applicationDirectory ) {\r\n            if ( example.path.substring(0, cordova.file.applicationDirectory) != cordova.file.applicationDirectory ) {\r\n                example.path = cordova.file.applicationDirectory + example.path;\r\n            }\r\n        }\r\n\r\n        app.prepareArchitectWorld(example, function() {\r\n            app.loadARchitectWorld(example);\r\n        });\r\n    },\r\n    loadCustomARchitectWorldFromURL: function(url) {\r\n        var customArchitectWorld = {\r\n            \"path\": url,\r\n            \"requiredFeatures\": [\r\n                \"geo\"\r\n            ],\r\n            \"startupConfiguration\": {\r\n                \"camera_position\": \"back\"\r\n            }\r\n        };\r\n        app.isArchitectWorldLoaded = false;\r\n        app.prepareArchitectWorld(customArchitectWorld, function() {\r\n            app.loadARchitectWorld(customArchitectWorld);\r\n        });\r\n    },\r\n    prepareArchitectWorld: function(architectWorld, successCallback) {\r\n        app.wikitudePlugin.isDeviceSupported(function() {\r\n            app.wikitudePlugin.requestAccess(\r\n                function() {\r\n                    successCallback();\r\n                },\r\n                function(error) {\r\n                    /* The error object contains two error messages.\r\n                        * userDescription is a end user formatted message that can be displayed with e.g. a JS alert\r\n                        * developerDescription is a developer formatted message with more detailed information about the error\r\n                     */\r\n                    /* Here, the userDescription is used to show a confirmation box which, in case of a positive result, shows the applications settings so that user can grant access. */\r\n                    var openAppSettings = confirm(error.userDescription + '\\nOpen App Settings?');\r\n                    if ( openAppSettings == true ) {\r\n                        app.wikitudePlugin.openAppSettings();\r\n                    }\r\n                },\r\n                architectWorld.requiredFeatures);\r\n        }, function(errorMessage) {\r\n            alert(errorMessage);\r\n        },\r\n        architectWorld.requiredFeatures);\r\n    },\r\n    // Use this method to load a specific ARchitect World from either the local file system or a remote server\r\n    loadARchitectWorld: function(architectWorld) {\r\n        app.wikitudePlugin.loadARchitectWorld(function successFn(loadedURL) {\r\n                /* Respond to successful world loading if you need to */\r\n                app.isArchitectWorldLoaded = true;\r\n\r\n                /* in case the loaded Architect World belongs to the 'obtain poi data from application model' example, we can now safely inject poi data. */\r\n                if ( architectWorld.requiredExtension === \"ObtainPoiDataFromApplicationModel\" ) {\r\n                    injectGeneratedPoiJsonData();\r\n                }\r\n            }, function errorFn(error) {\r\n                app.isArchitectWorldLoaded = false;\r\n                alert('Loading AR web view failed: ' + error);\r\n            },\r\n            architectWorld.path, architectWorld.requiredFeatures, architectWorld.startupConfiguration\r\n        );\r\n    },\r\n    // This function gets called if you call \"AR.platform.sendJSONObject\" in your ARchitect World\r\n    onJSONObjectReceived: function (jsonObject) {\r\n        if (typeof jsonObject.action !== 'undefined') {\r\n            if ( jsonObject.action === \"capture_screen\" ) {\r\n                app.wikitudePlugin.captureScreen(\r\n                    function(absoluteFilePath) {\r\n                        alert(\"snapshot stored at:\\n\" + absoluteFilePath);\r\n                    },\r\n                    function (errorMessage) {\r\n                        alert(errorMessage);\r\n                    },\r\n                    true, null\r\n                );\r\n            } else if (jsonObject.action === \"present_poi_details\") {\r\n                var alertMessage = \"Poi '\" + jsonObject.id + \"' selected\\nTitle: \" + jsonObject.title + \"\\nDescription: \" + jsonObject.description;\r\n                alert(alertMessage);\r\n            }\r\n        }\r\n    },\r\n    onBackButton: function() {\r\n        /* Android back button was pressed and the Wikitude PhoneGap Plugin is now closed */\r\n    },\r\n    showBuildInformation: function() {\r\n        var sdkVersion = \"\"\r\n\r\n        app.wikitudePlugin.getSDKVersion(function(version){ sdkVersion = version });\r\n\r\n        app.wikitudePlugin.getSDKBuildInformation(function(buildInformationJSON) {\r\n            var buildInformation = JSON.parse(buildInformationJSON);\r\n            alert(\r\n                \"Build configuration: \" + buildInformation.buildConfiguration + \"\\n\" +\r\n                \"Build date: \" + buildInformation.buildDate + \"\\n\" +\r\n                \"Build number: \" + buildInformation.buildNumber + \"\\n\" +\r\n                \"Build version: \" + sdkVersion\r\n            );\r\n        });\r\n    }\r\n    // --- End Wikitude Plugin ---\r\n};\r\n\r\napp.onDeviceReady();\r\n\r\nsetTimeout(function(){var option={\r\n            \"path\": \"www/world/08_PointOfInterest_4_SelectingPois/index.html\",\r\n            \"requiredFeatures\": [\r\n                \"geo\"\r\n            ],\r\n            \"startupConfiguration\": {\r\n                \"camera_resolution\": \"auto\",\r\n                \"camera_position\": \"back\"\r\n            },\r\n            \"requiredExtension\":\"ObtainPoiDataFromApplicationModel\"\r\n        };\r\n        app.loadExampleARchitectWorld(option);\r\n    },2000);\r\n}catch(e){alert(e)}\r\n}",
          "datatemplate": "<div>Augmented reality<\/div>"
        }
      ]
    }
  ],
  "pages": 
  [
  ]
}