{
    "termdropdown": [{
      "TERM_CODE": "201640",
      "TERM_DESC": "Fall 2016"
    }, {
      "TERM_CODE": "201635",
      "TERM_DESC": "Summer 2016"
    }, {
      "TERM_CODE": "201610",
      "TERM_DESC": "Spring 2016"
    }]
  }