{
  "message": 
  [
    {
      "MESSAGE": "CIV 1000AD_M46 has been added to your Shopping Cart."
    }
  ],
  "enrollmentcart": 
  [
    {
      "CLASS_ID": "P_DELETE$0",
      "CLASS": "CIV 1000AD_M46-2\n (1234)",
      "DAY_TIME": "MoWe 4:45PM - 6:15PM",
      "ROOM": "AD-B-2F10",
      "INSTRUCTOR": "E. Paleologos",
      "UNITS": "3.00",
      "STATUS": "Closed"
    },
    {
      "CLASS_ID": "P_DELETE$1",
      "CLASS": "ISL-UR 1000AD_M01-2\n (1601)",
      "DAY_TIME": "MoWe 6:30PM - 8:00PM",
      "ROOM": "AD-B-1F17",
      "INSTRUCTOR": "L. Salem",
      "UNITS": "3.00",
      "STATUS": "Open"
    }
  ],
  "buttonid": 
  [
    {
      "CLASS_NUMBER_BUTTON_ID": "DERIVED_REGFRM1_SSR_PB_ADDTOLIST2$9$",
      "SUBMIT_CART_BUTTON_ID": "DERIVED_REGFRM1_LINK_ADD_ENRL$82$"
    }
  ]
}