{
  "CLASS_ROSTER": 
  [
    {
      "TITLE": "CPSC*2363*05 (0732) Intro To Busi Prog (Web)",
      "TERM": "FALL SEMESTER 2013",
      "ST_DATE": "08/22/13",
      "EN_DATE": "12/13/13",
      "MEETING_INFO": "08/22/2013-12/13/2013 WEB CT COURSE Days to be Announced, Times to be AnnouncedWeb, Room WEB",
      "LOCATION": "Main UAPB Campus",
      "REG_AVAIL_WAIT": "16 / 6 / 0",
      "REF": "312470759996014"
    },
    {
      "TITLE": "CPSC*2363*1N (0060) Intro To Business Prog (Web)",
      "TERM": "SUMMER SESSION II 2013",
      "ST_DATE": "07/08/13",
      "EN_DATE": "08/09/13",
      "MEETING_INFO": "07/08/2013-08/09/2013 WEB CT COURSE Days to be Announced, Times to be AnnouncedWeb, Room WEB",
      "LOCATION": "North Little Rock",
      "REG_AVAIL_WAIT": "13 / 17 / 0",
      "REF": "216571055891312"
    },
    {
      "TITLE": "CPSC*2363*1N (8078) Intro To Bus Programming (Web)",
      "TERM": "SPRING SEMESTER 2013",
      "ST_DATE": "01/07/13",
      "EN_DATE": "05/10/13",
      "MEETING_INFO": "01/07/2013-05/10/2013 WEB CT COURSE Days to be Announced, Times to be AnnouncedWeb, Room WEB",
      "LOCATION": "North Little Rock",
      "REG_AVAIL_WAIT": "17 / 13 / 0",
      "REF": "015174154798519"
    },
    {
      "TITLE": "CPSC*2363*05 (6292) Intro To Busi Prog (Web)",
      "TERM": "FALL SEMESTER 2012",
      "ST_DATE": "08/23/12",
      "EN_DATE": "12/14/12",
      "MEETING_INFO": "08/23/2012-12/14/2012 WEB CT COURSE Days to be Announced, Times to be AnnouncedARRANGED, Room ARR",
      "LOCATION": "Main UAPB Campus",
      "REG_AVAIL_WAIT": "21 / 1 / 0",
      "REF": "315474455793914"
    },
    {
      "TITLE": "CPSC*2363*1N (5638) Intro To Business Prog (Web)",
      "TERM": "SUMMER SESSION II 2012",
      "ST_DATE": "07/09/12",
      "EN_DATE": "08/10/12",
      "MEETING_INFO": "07/09/2012-08/10/2012 WEB CT COURSE Days to be Announced, Times to be AnnouncedARRANGED, Room ARR",
      "LOCATION": "North Little Rock",
      "REG_AVAIL_WAIT": "4 / 26 / 0",
      "REF": "214078054596510"
    },
    {
      "TITLE": "CPSC*2363*1N (5155) Intro To Busi Program (Web)",
      "TERM": "SUMMER SESSION I 2012",
      "ST_DATE": "05/29/12",
      "EN_DATE": "06/29/12",
      "MEETING_INFO": "05/29/2012-06/29/2012 WEB CT COURSE Days to be Announced, Times to be AnnouncedARRANGED, Room ARR",
      "LOCATION": "North Little Rock",
      "REG_AVAIL_WAIT": "17 / 13 / 0",
      "REF": "711877051297714"
    },
    {
      "TITLE": "CPSC*2363*1N (3593) Intro To Bus Programming (Web)",
      "TERM": "SPRING SEMESTER 2012",
      "ST_DATE": "01/09/12",
      "EN_DATE": "05/11/12",
      "MEETING_INFO": "01/09/2012-05/11/2012 WEB CT COURSE Days to be Announced, Times to be Announced, Room to be Announced",
      "LOCATION": "North Little Rock",
      "REG_AVAIL_WAIT": "25 / 5 / 0",
      "REF": "112577558190710"
    },
    {
      "TITLE": "CPSC*2363*05 (1788) Intro To Busi Prog (Web)",
      "TERM": "FALL SEMESTER 2011",
      "ST_DATE": "08/25/11",
      "EN_DATE": "12/15/11",
      "MEETING_INFO": "08/25/2011-12/09/2011 WEB CT COURSE Days to be Announced, Times to be AnnouncedCaine-Gilleland Hall, Room ARR",
      "LOCATION": "Main UAPB Campus",
      "REG_AVAIL_WAIT": "18 / 4 / 0",
      "REF": "911371557092119"
    },
    {
      "TITLE": "CPSC*2363*1N (1790) Intro/Busi/Prog (Web)",
      "TERM": "FALL SEMESTER 2011",
      "ST_DATE": "08/25/11",
      "EN_DATE": "12/15/11",
      "MEETING_INFO": "08/25/2011-12/09/2011 WEB CT COURSE Days to be Announced, Times to be AnnouncedNORTH LITTLE ROCK SITE, Room ARR",
      "LOCATION": "North Little Rock",
      "REG_AVAIL_WAIT": "15 / 2 / 0",
      "REF": "119976056292518"
    },
    {
      "TITLE": "CPSC*2363*1N (0636) Intro To Busi Program (Web)",
      "TERM": "SUMMER SESSION I 2011",
      "ST_DATE": "05/31/11",
      "EN_DATE": "06/30/11",
      "MEETING_INFO": "05/31/2011-06/30/2011 WEB CT COURSE Days to be Announced, Times to be AnnouncedNORTH LITTLE ROCK SITE, Room ARR",
      "LOCATION": "North Little Rock",
      "REG_AVAIL_WAIT": "23 / 7 / 0",
      "REF": "013073054992519"
    },
    {
      "TITLE": "CPSC*2363*1N (9084) Intro To Bus Programming (Web)",
      "TERM": "SPRING SEMESTER 2011",
      "ST_DATE": "01/12/11",
      "EN_DATE": "05/13/11",
      "MEETING_INFO": "01/10/2011-05/13/2011 WEB CT COURSE Days to be Announced, Times to be AnnouncedNORTH LITTLE ROCK SITE, Room ARR",
      "LOCATION": "North Little Rock",
      "REG_AVAIL_WAIT": "26 / 4 / 0",
      "REF": "814377055593610"
    },
    {
      "TITLE": "CPSC*2363*1N (7338) Intro/Busi/Prog (Web)",
      "TERM": "FALL SEMESTER 2010",
      "ST_DATE": "08/26/10",
      "EN_DATE": "12/10/10",
      "MEETING_INFO": "08/26/2010-12/10/2010 WEB CT COURSE Days to be Announced, Times to be AnnouncedNORTH LITTLE ROCK SITE, Room ARR",
      "LOCATION": "North Little Rock",
      "REG_AVAIL_WAIT": "15 / 15 / 0",
      "REF": "416372353193518"
    },
    {
      "TITLE": "CPSC*2363*03 (4740) Intro To Business Programming",
      "TERM": "SPRING SEMESTER 2010",
      "ST_DATE": "01/11/10",
      "EN_DATE": "05/07/10",
      "MEETING_INFO": "01/12/2010-05/06/2010 LECTURE/LAB FEE Tuesday, Thursday 06:00PM - 07:15PM, Caine-Gilleland Hall, Room 222",
      "LOCATION": "Main UAPB Campus",
      "REG_AVAIL_WAIT": "21 / 4 / 0",
      "REF": "016478759398415"
    },
    {
      "TITLE": "CPSC*2363*02 (8682) Intro To Business Programming",
      "TERM": "SUMMER SESSION II 2008",
      "ST_DATE": "07/09/08",
      "EN_DATE": "08/08/08",
      "MEETING_INFO": "07/08/2008-08/07/2008 LECTURE Tuesday, Thursday 06:00PM - 09:55PM, Caine-Gilleland Hall, Room 222",
      "LOCATION": "Main UAPB Campus",
      "REG_AVAIL_WAIT": "7 / 13 / 0",
      "REF": "717270457690011"
    }
  ]
}