{
  "primaryphones": 
  [
    {
      "ADDRESS_SEQ": 1,
      "ADDRESS_TYPE_CODE": "BI",
      "PHONE_SEQ": 1,
      "PHONE_CODE": "BI",
      "COUNTRY_CODE": "",
      "AREA_CODE": "603",
      "PHONE_NUMBER": "8783695",
      "EXTENSION": "",
      "INTERNATIONAL_ACCESS": "",
      "UNLISTED_IND": ""
    }
  ],
  "additionalphones": 
  [
  ],
  "addresses": 
  [
    {
      "ADDRESS_SEQ": 1,
      "ADDRESS_TYPE_CODE": "BI",
      "HOUSE_NUMBER": "",
      "STREET_LINE1": "107 Greenbriar Rd",
      "STREET_LINE2": "",
      "STREET_LINE3": "",
      "STREET_LINE4": "",
      "CITY": "New Ipswich",
      "STATE_CODE": "NH",
      "ZIP": "03071-3307",
      "COUNTY_CODE": "NH011",
      "NATION_CODE": "",
      "FROM_DATE": "26-JUL-2016",
      "TO_DATE": ""
    }
  ]
}