{
  "LEAVE_SUMMARY": 
  [
    {
      "PLAN": "VCLS",
      "DESC": "Classified Employees Vacation",
      "ALLOWED_DATE": "03/16/90",
      "ACCRUAL_RATE": "7.5000",
      "ACCRUAL_LIMIT": "",
      "MAX_CARRYOVER": "240.00",
      "CURRENT_BAL": "248.25"
    },
    {
      "PLAN": "SICS",
      "DESC": "Reg Apptd Employees Sick",
      "ALLOWED_DATE": "03/16/90",
      "ACCRUAL_RATE": "4.0000",
      "ACCRUAL_LIMIT": "",
      "MAX_CARRYOVER": "960.00",
      "CURRENT_BAL": "808.30"
    }
  ]
}