{
  "getcurrentearnings": 
  [
    {
      "AMOUNT": "                   $93.75",
      "HOURS": 12.5,
      "RATE": 7.5,
      "JOB": "XN2101",
      "PHREARN_SUFF": "00",
      "PHREARN_EARN_CODE": "REG",
      "JOB_DESC": "",
      "EARNINGS_DESC": "Regular Pay"
    }
  ],
  "getytdearnings": 
  [
    {
      "PTREARN_CASH_IND": "Y",
      "JOB_DESC": "",
      "PHREARN_POSN": "XN2101",
      "PHREARN_SUFF": "00",
      "PHREARN_EARN_CODE": "REG",
      "PTREARN_LONG_DESC": "Regular Pay",
      "PTRECLS_SALARY_IND": "H",
      "YTD_AMOUNT": "                $2,115.00",
      "DISPLAY_HOURS_IND": "Y"
    }
  ]
}