{
  "p_out": 
  [
    {
      "summary": 
      [
        {
          "roster": 
          [
            {
              "STUD_PIDM": "222802",
              "SPRIDEN_ID": "00153021",
              "NAME": "Rebecca, Forest",
              "ATTENDED": "N",
              "DATA_ORIGIN": "",
              "ORIG_HRS": "240"
            }
          ]
        }
      ]
    }
  ]
}