{
  "p_out": 
  [
    {
      "summary": 
      [
        {
          "course": {
            "coursetitle": "TEST",
            "crn": "67552",
            "subjectcode": "CSPD",
            "crsenumber": "100",
            "seqno": "0",
            "schedulecode": "U"
          },
          "headerinfo": {
            "status": "Active",
            "availableforreg": " - ",
            "college": "Non-credit",
            "department": "CS Workshop",
            "partofterm": "Q",
            "coursecredits": "0",
            "courselevels": "Non-Credit",
            "campus": "Gardner",
            "override": "No",
            "syllabus": "Add"
          },
          "enrollment": 
          [
            {
              "title": "Enrollment",
              "max": "0",
              "actual": "1",
              "rem": "-1"
            },
            {
              "title": "Cross List",
              "max": "0",
              "actual": "0",
              "rem": "0"
            }
          ],
          "meetingtimes": 
          [
            {
              "type": "Class",
              "time": "2:00 pm - 3:00 pm",
              "days": "F",
              "where": "Gardner Academic Building 003-006",
              "daterange": "10-JUN-2016 - 01-SEP-2016",
              "scheduletype": "Seminar",
              "instructors": "Susan   McHugh (P)"
            },
            {
              "type": "Class",
              "time": "11:15 am - 1:15 pm",
              "days": "MW",
              "where": "TBA",
              "daterange": "13-JUN-2016 - 01-SEP-2016",
              "scheduletype": "Seminar",
              "instructors": "Susan   McHugh (P)"
            }
          ]
        }
      ]
    }
  ]
}