{
	"ACCOUNT_SUMMARY": [{
		"TermId": "[ + ] FALL SEMESTER 2012 (12/FA)",
		"AccountReceivable": [{
			"title": "[ + ] ST Student Accounts Receivable",
			"amount": "$0.10",
			"details": [{
				"title": "Charges",
				"colheaders": [{
					"header": ""
				}, {
					"header": ""
				}, {
					"header": "Date"
				}, {
					"header": "Description"
				}, {
					"header": "Charge"
				}],
				"colvalues": [{
					"column": [{
						"value": " "
					}, {
						"value": " "
					}, {
						"value": "09-12-2012"
					}, {
						"value": "Bookstore Charges 12/FA"
					}, {
						"value": "$0.10"
					}]
				}, {
					"column": [{
						"value": " "
					}, {
						"value": " "
					}, {
						"value": " "
					}, {
						"value": ""
					}, {
						"value": "$0.10"
					}]
				}]
			}, {
				"title": "Total for 'ST Student Accounts Receivable' for 'FALL SEMESTER 2012 (12/FA)'",
				"colheaders": [{
					"header": ""
				}, {
					"header": ""
				}, {
					"header": ""
				}, {
					"header": ""
				}, {
					"header": ""
				}],
				"colvalues": []
			}]
		}]
	}, {
		"TermId": "[ + ] SPRING SEMESTER 2006 (06/SP)",
		"AccountReceivable": [{
			"title": "[ + ] FS Faculty/Staff Receivable",
			"amount": "$-99.11",
			"details": [{
				"title": "Payments",
				"colheaders": [{
					"header": ""
				}, {
					"header": ""
				}, {
					"header": "Date"
				}, {
					"header": "Reference No. - Description"
				}, {
					"header": "Payment"
				}],
				"colvalues": [{
					"column": [{
						"value": " "
					}, {
						"value": " "
					}, {
						"value": "02-09-2006"
					}, {
						"value": "000095567 - FACULTY/STAFF PAYMENT"
					}, {
						"value": "$-99.11"
					}]
				}, {
					"column": [{
						"value": " "
					}, {
						"value": " "
					}, {
						"value": " "
					}, {
						"value": ""
					}, {
						"value": "$-99.11"
					}]
				}]
			}, {
				"title": "Total for 'FS Faculty/Staff Receivable' for 'SPRING SEMESTER 2006 (06/SP)'",

				"colheaders": [{
					"header": ""
				}, {
					"header": ""
				}, {
					"header": ""
				}, {
					"header": ""
				}, {
					"header": ""
				}],
				"colvalues": []
			}]
		}]
	}, {
		"TermId": "[ + ] SPRING SEMESTER 2004 (04/SP)",
		"AccountReceivable": [{
			"title": "[ + ] FS Faculty/Staff Receivable",
			"amount": "$-100.00",
			"details": [{
				"title": "Payments",
				"colheaders": [{
					"header": ""
				}, {
					"header": ""
				}, {
					"header": "Date"
				}, {
					"header": "Reference No. - Description"
				}, {
					"header": "Payment"
				}],
				"colvalues": [{
					"column": [{
						"value": " "
					}, {
						"value": " "
					}, {
						"value": "04-13-2004"
					}, {
						"value": "000050741 - FACULTY/STAFF PAYMENT"
					}, {
						"value": "$-199.11"
					}]
				}, {
					"column": [{
						"value": " "
					}, {
						"value": " "
					}, {
						"value": "04-22-2004"
					}, {
						"value": "V0215619 - Voucher"
					}, {
						"value": "$99.11"
					}]
				}, {
					"column": [{
						"value": " "
					}, {
						"value": " "
					}, {
						"value": " "
					}, {
						"value": ""
					}, {
						"value": "$-100.00"
					}]
				}]
			}, {
				"title": "Total for 'FS Faculty/Staff Receivable' for 'SPRING SEMESTER 2004 (04/SP)'",

				"colheaders": [{
					"header": ""
				}, {
					"header": ""
				}, {
					"header": ""
				}, {
					"header": ""
				}, {
					"header": ""
				}],
				"colvalues": []
			}]
		}]
	}, {
		"TermId": "[ + ] FALL SEMESTER 2003 (03/FA)",
		"AccountReceivable": [{
			"title": "[ + ] FS Faculty/Staff Receivable",
			"amount": "$-395.67",
			"details": [{
				"title": "Payments",
				"colheaders": [{
					"header": ""
				}, {
					"header": ""
				}, {
					"header": "Date"
				}, {
					"header": "Reference No. - Description"
				}, {
					"header": "Payment"
				}],
				"colvalues": [{
					"column": [{
						"value": " "
					}, {
						"value": " "
					}, {
						"value": "09-24-2003"
					}, {
						"value": "000039564 - FACULTY/STAFF PAYMENT"
					}, {
						"value": "$-54.08"
					}]
				}, {
					"column": [{
						"value": " "
					}, {
						"value": " "
					}, {
						"value": "10-02-2003"
					}, {
						"value": "000040019 - FACULTY/STAFF PAYMENT"
					}, {
						"value": "$-54.08"
					}]
				}, {
					"column": [{
						"value": " "
					}, {
						"value": " "
					}, {
						"value": "10-06-2003"
					}, {
						"value": "000040186 - FACULTY/STAFF PAYMENT"
					}, {
						"value": "$-36.91"
					}]
				}, {
					"column": [{
						"value": " "
					}, {
						"value": " "
					}, {
						"value": "11-11-2003"
					}, {
						"value": "000041993 - FACULTY/STAFF PAYMENT"
					}, {
						"value": "$-81.21"
					}]
				}, {
					"column": [{
						"value": " "
					}, {
						"value": " "
					}, {
						"value": "12-17-2003"
					}, {
						"value": "000043976 - FACULTY/STAFF PAYMENT"
					}, {
						"value": "$-127.88"
					}]
				}, {
					"column": [{
						"value": " "
					}, {
						"value": " "
					}, {
						"value": "01-09-2004"
					}, {
						"value": "000044720 - FACULTY/STAFF PAYMENT"
					}, {
						"value": "$-41.51"
					}]
				}, {
					"column": [{
						"value": " "
					}, {
						"value": " "
					}, {
						"value": " "
					}, {
						"value": ""
					}, {
						"value": "$-395.67"
					}]
				}]
			}, {
				"title": "Total for 'FS Faculty/Staff Receivable' for 'FALL SEMESTER 2003 (03/FA)'",
				"colheaders": [{
					"header": ""
				}, {
					"header": ""
				}, {
					"header": ""
				}, {
					"header": ""
				}, {
					"header": ""
				}],
				"colvalues": []
			}]
		}]
	}, {
		"TermId": "[ + ] SUMMER SESSION I 2003 (03/S1)",
		"AccountReceivable": [{
			"title": "[ + ] ST Student Accounts Receivable",
			"amount": "$0.00",
			"details": [{
				"title": "Charges",
				"colheaders": [{
					"header": ""
				}, {
					"header": ""
				}, {
					"header": "Date"
				}, {
					"header": "Description"
				}, {
					"header": "Charge"
				}],
				"colvalues": [{
					"column": [{
						"value": " "
					}, {
						"value": " "
					}, {
						"value": "06-10-2003"
					}, {
						"value": "Overpayment of Payroll"
					}, {
						"value": "$648.86"
					}]
				}, {
					"column": [{
						"value": " "
					}, {
						"value": " "
					}, {
						"value": "06-10-2003"
					}, {
						"value": "Reverse Overpay/Incorrect Acct"
					}, {
						"value": "$-648.86"
					}]
				}, {
					"column": [{
						"value": " "
					}, {
						"value": " "
					}, {
						"value": " "
					}, {
						"value": ""
					}, {
						"value": "$0.00"
					}]
				}]
			}]
		}, {
			"title": "[ + ] FS Faculty/Staff Receivable",
			"amount": "$594.78",
			"details": [{
				"title": "Charges",
				"colheaders": [{
					"header": ""
				}, {
					"header": ""
				}, {
					"header": "Date"
				}, {
					"header": "Description"
				}, {
					"header": "Charge"
				}],
				"colvalues": [{
					"column": [{
						"value": " "
					}, {
						"value": " "
					}, {
						"value": "06-10-2003"
					}, {
						"value": "Overpayment of Payroll"
					}, {
						"value": "$648.86"
					}]
				}, {
					"column": [{
						"value": " "
					}, {
						"value": " "
					}, {
						"value": " "
					}, {
						"value": ""
					}, {
						"value": "$648.86"
					}]
				}]
			}, {
				"title": "Payments",
				"colheaders": [{
					"header": ""
				}, {
					"header": ""
				}, {
					"header": "Date"
				}, {
					"header": "Reference No. - Description"
				}, {
					"header": "Payment"
				}],
				"colvalues": [{
					"column": [{
						"value": " "
					}, {
						"value": " "
					}, {
						"value": "07-03-2003"
					}, {
						"value": "000033342 - FACULTY/STAFF PAYMENT"
					}, {
						"value": "$-54.08"
					}]
				}, {
					"column": [{
						"value": " "
					}, {
						"value": " "
					}, {
						"value": " "
					}, {
						"value": ""
					}, {
						"value": "$-54.08"
					}]
				}]
			}, {
				"title": "Total for 'FS Faculty/Staff Receivable' for 'SUMMER SESSION I 2003 (03/S1)'",
				"colheaders": [{
					"header": ""
				}, {
					"header": ""
				}, {
					"header": ""
				}, {
					"header": ""
				}, {
					"header": ""
				}],
				"colvalues": []
			}]
		}]
	}]
}