{
  "meetingCodesDropDown": 
  [
    {
      "MEETING_CODE": "A",
      "MEETING_DAYS": "MW",
      "START_TIME": "0800",
      "END_TIME": "0915",
      "ACTIVITY_DATE": 1219377600000
    },
    {
      "MEETING_CODE": "B",
      "MEETING_DAYS": "TR",
      "START_TIME": "0800",
      "END_TIME": "0915",
      "ACTIVITY_DATE": 1219636800000
    },
    {
      "MEETING_CODE": "C",
      "MEETING_DAYS": "MW",
      "START_TIME": "0930",
      "END_TIME": "1045",
      "ACTIVITY_DATE": 1219636800000
    },
    {
      "MEETING_CODE": "D",
      "MEETING_DAYS": "TR",
      "START_TIME": "0930",
      "END_TIME": "1045",
      "ACTIVITY_DATE": 1219636800000
    },
    {
      "MEETING_CODE": "E",
      "MEETING_DAYS": "MW",
      "START_TIME": "1100",
      "END_TIME": "1215",
      "ACTIVITY_DATE": 1219636800000
    },
    {
      "MEETING_CODE": "F",
      "MEETING_DAYS": "TR",
      "START_TIME": "1100",
      "END_TIME": "1215",
      "ACTIVITY_DATE": 1219636800000
    },
    {
      "MEETING_CODE": "G",
      "MEETING_DAYS": "MW",
      "START_TIME": "1345",
      "END_TIME": "1500",
      "ACTIVITY_DATE": 1219636800000
    },
    {
      "MEETING_CODE": "H",
      "MEETING_DAYS": "TR",
      "START_TIME": "1345",
      "END_TIME": "1500",
      "ACTIVITY_DATE": 1219636800000
    },
    {
      "MEETING_CODE": "I",
      "MEETING_DAYS": "MW",
      "START_TIME": "1515",
      "END_TIME": "1630",
      "ACTIVITY_DATE": 1219636800000
    },
    {
      "MEETING_CODE": "J",
      "MEETING_DAYS": "TR",
      "START_TIME": "1515",
      "END_TIME": "1630",
      "ACTIVITY_DATE": 1219636800000
    },
    {
      "MEETING_CODE": "K",
      "MEETING_DAYS": "MW",
      "START_TIME": "1645",
      "END_TIME": "1800",
      "ACTIVITY_DATE": 1219636800000
    },
    {
      "MEETING_CODE": "L",
      "MEETING_DAYS": "TR",
      "START_TIME": "1645",
      "END_TIME": "1800",
      "ACTIVITY_DATE": 1219636800000
    },
    {
      "MEETING_CODE": "LA",
      "MEETING_DAYS": "",
      "START_TIME": "1931",
      "END_TIME": "2130",
      "ACTIVITY_DATE": 1279857600000
    },
    {
      "MEETING_CODE": "LE",
      "MEETING_DAYS": "",
      "START_TIME": "1700",
      "END_TIME": "1930",
      "ACTIVITY_DATE": 1279857600000
    },
    {
      "MEETING_CODE": "M",
      "MEETING_DAYS": "",
      "START_TIME": "0800",
      "END_TIME": "1045",
      "ACTIVITY_DATE": 1219377600000
    },
    {
      "MEETING_CODE": "M1",
      "MEETING_DAYS": "MW",
      "START_TIME": "0900",
      "END_TIME": "1130",
      "ACTIVITY_DATE": 1279857600000
    },
    {
      "MEETING_CODE": "M2",
      "MEETING_DAYS": "MW",
      "START_TIME": "1300",
      "END_TIME": "1530",
      "ACTIVITY_DATE": 1279857600000
    },
    {
      "MEETING_CODE": "M3",
      "MEETING_DAYS": "MW",
      "START_TIME": "1630",
      "END_TIME": "1900",
      "ACTIVITY_DATE": 1279857600000
    },
    {
      "MEETING_CODE": "M4",
      "MEETING_DAYS": "MW",
      "START_TIME": "1901",
      "END_TIME": "2130",
      "ACTIVITY_DATE": 1279857600000
    },
    {
      "MEETING_CODE": "MG",
      "MEETING_DAYS": "M",
      "START_TIME": "1800",
      "END_TIME": "2030",
      "ACTIVITY_DATE": 1279857600000
    },
    {
      "MEETING_CODE": "N",
      "MEETING_DAYS": "",
      "START_TIME": "1100",
      "END_TIME": "1345",
      "ACTIVITY_DATE": 1219377600000
    },
    {
      "MEETING_CODE": "O",
      "MEETING_DAYS": "",
      "START_TIME": "1400",
      "END_TIME": "1545",
      "ACTIVITY_DATE": 1219377600000
    },
    {
      "MEETING_CODE": "P",
      "MEETING_DAYS": "",
      "START_TIME": "1600",
      "END_TIME": "1845",
      "ACTIVITY_DATE": 1219377600000
    },
    {
      "MEETING_CODE": "RG",
      "MEETING_DAYS": "R",
      "START_TIME": "1800",
      "END_TIME": "2030",
      "ACTIVITY_DATE": 1279857600000
    },
    {
      "MEETING_CODE": "T1",
      "MEETING_DAYS": "TR",
      "START_TIME": "0900",
      "END_TIME": "1130",
      "ACTIVITY_DATE": 1279857600000
    },
    {
      "MEETING_CODE": "T2",
      "MEETING_DAYS": "TR",
      "START_TIME": "1300",
      "END_TIME": "1530",
      "ACTIVITY_DATE": 1279857600000
    },
    {
      "MEETING_CODE": "T3",
      "MEETING_DAYS": "TR",
      "START_TIME": "1630",
      "END_TIME": "1900",
      "ACTIVITY_DATE": 1279857600000
    },
    {
      "MEETING_CODE": "T4",
      "MEETING_DAYS": "TR",
      "START_TIME": "1901",
      "END_TIME": "2130",
      "ACTIVITY_DATE": 1279857600000
    },
    {
      "MEETING_CODE": "TG",
      "MEETING_DAYS": "T",
      "START_TIME": "1800",
      "END_TIME": "2030",
      "ACTIVITY_DATE": 1279857600000
    },
    {
      "MEETING_CODE": "U",
      "MEETING_DAYS": "TR",
      "START_TIME": "1800",
      "END_TIME": "2000",
      "ACTIVITY_DATE": 1228885200000
    },
    {
      "MEETING_CODE": "WG",
      "MEETING_DAYS": "W",
      "START_TIME": "1800",
      "END_TIME": "2030",
      "ACTIVITY_DATE": 1279857600000
    },
    {
      "MEETING_CODE": "X",
      "MEETING_DAYS": "",
      "START_TIME": "1215",
      "END_TIME": "1330",
      "ACTIVITY_DATE": 1219377600000
    },
    {
      "MEETING_CODE": "Z",
      "MEETING_DAYS": "",
      "START_TIME": "0000",
      "END_TIME": "0001",
      "ACTIVITY_DATE": 861249600000
    }
  ],
  "buildingCodesDropDown": 
  [
    {
      "CAMPUS_CODE": "A",
      "BUILDING_CODE": "FTDV",
      "BUILDING_DESC": "Devens Campus",
      "SITE_CODE": "003",
      "CAPACITY": 50,
      "MAX_CAPACITY": 50
    },
    {
      "CAMPUS_CODE": "BUR",
      "BUILDING_CODE": "BURB",
      "BUILDING_DESC": "Burbank - Dental Hygiene",
      "SITE_CODE": "013",
      "CAPACITY": 12,
      "MAX_CAPACITY": 12
    },
    {
      "CAMPUS_CODE": "D",
      "BUILDING_CODE": "GREEN",
      "BUILDING_DESC": "Greenhouse-Gardner",
      "SITE_CODE": "001",
      "CAPACITY": 20,
      "MAX_CAPACITY": 20
    },
    {
      "CAMPUS_CODE": "D",
      "BUILDING_CODE": "PERC",
      "BUILDING_DESC": "Viet Nam Vet Phys Educ Bldg",
      "SITE_CODE": "001",
      "CAPACITY": 1000,
      "MAX_CAPACITY": 1000
    },
    {
      "CAMPUS_CODE": "DEV",
      "BUILDING_CODE": "SHRV",
      "BUILDING_DESC": "Shriver Job Corps Center",
      "SITE_CODE": "",
      "CAPACITY": 300,
      "MAX_CAPACITY": 300
    },
    {
      "CAMPUS_CODE": "FIT",
      "BUILDING_CODE": "MKAY",
      "BUILDING_DESC": "McKay Building",
      "SITE_CODE": "",
      "CAPACITY": 50,
      "MAX_CAPACITY": 50
    },
    {
      "CAMPUS_CODE": "GAR",
      "BUILDING_CODE": "CHLD",
      "BUILDING_DESC": "Garrison Cntr Early Childhood",
      "SITE_CODE": "001",
      "CAPACITY": 50,
      "MAX_CAPACITY": 50
    },
    {
      "CAMPUS_CODE": "GAR",
      "BUILDING_CODE": "MAIN",
      "BUILDING_DESC": "Gardner Academic Building",
      "SITE_CODE": "001",
      "CAPACITY": 2000,
      "MAX_CAPACITY": 2000
    },
    {
      "CAMPUS_CODE": "LEO",
      "BUILDING_CODE": "LABE",
      "BUILDING_DESC": "Leominster ABE Site",
      "SITE_CODE": "",
      "CAPACITY": 300,
      "MAX_CAPACITY": 300
    },
    {
      "CAMPUS_CODE": "O",
      "BUILDING_CODE": "WRHC",
      "BUILDING_DESC": "West River Health Center",
      "SITE_CODE": "012",
      "CAPACITY": 25,
      "MAX_CAPACITY": 25
    },
    {
      "CAMPUS_CODE": "OFF",
      "BUILDING_CODE": "OFFC",
      "BUILDING_DESC": "Off-campus Corporate Site",
      "SITE_CODE": "",
      "CAPACITY": 300,
      "MAX_CAPACITY": 300
    },
    {
      "CAMPUS_CODE": "OFF",
      "BUILDING_CODE": "OFFH",
      "BUILDING_DESC": "Off-campus High School Site",
      "SITE_CODE": "",
      "CAPACITY": 300,
      "MAX_CAPACITY": 300
    },
    {
      "CAMPUS_CODE": "Q",
      "BUILDING_CODE": "QINE",
      "BUILDING_DESC": "Quality Institute of New Eng",
      "SITE_CODE": "004",
      "CAPACITY": 100,
      "MAX_CAPACITY": 100
    },
    {
      "CAMPUS_CODE": "T",
      "BUILDING_CODE": "AYER",
      "BUILDING_DESC": "Ayer High School",
      "SITE_CODE": "005",
      "CAPACITY": 50,
      "MAX_CAPACITY": 50
    },
    {
      "CAMPUS_CODE": "T",
      "BUILDING_CODE": "FCHB",
      "BUILDING_DESC": "Fitchburg Campus",
      "SITE_CODE": "002",
      "CAPACITY": 1000,
      "MAX_CAPACITY": 1000
    },
    {
      "CAMPUS_CODE": "T",
      "BUILDING_CODE": "FSCD",
      "BUILDING_DESC": "Fitchburg State Developmental",
      "SITE_CODE": "002",
      "CAPACITY": 1000,
      "MAX_CAPACITY": 1000
    },
    {
      "CAMPUS_CODE": "T",
      "BUILDING_CODE": "LCTC",
      "BUILDING_DESC": "Leominster Corp Training Cent.",
      "SITE_CODE": "002",
      "CAPACITY": 150,
      "MAX_CAPACITY": 150
    },
    {
      "CAMPUS_CODE": "U",
      "BUILDING_CODE": "ATHOL",
      "BUILDING_DESC": "Athol Campus",
      "SITE_CODE": "010",
      "CAPACITY": 150,
      "MAX_CAPACITY": 150
    },
    {
      "CAMPUS_CODE": "U",
      "BUILDING_CODE": "FBUR",
      "BUILDING_DESC": "Burbank Site-Dental Hygiene",
      "SITE_CODE": "013",
      "CAPACITY": 12,
      "MAX_CAPACITY": 12
    }
  ],
  "campusCodesDropDown": 
  [
    {
      "CAMPUS_CODE": "A",
      "CAMPUS_DESC": "DNU-DEVENS - Devens Campus",
      "ACTIVITY_DATE": 1134536400000
    },
    {
      "CAMPUS_CODE": "BUR",
      "CAMPUS_DESC": "Fitchburg Dental Programs",
      "ACTIVITY_DATE": 1415768400000
    },
    {
      "CAMPUS_CODE": "C",
      "CAMPUS_DESC": "DNU-Converted Course",
      "ACTIVITY_DATE": 1156219200000
    },
    {
      "CAMPUS_CODE": "D",
      "CAMPUS_DESC": "DNU-GAR-D Gardner Day Campus",
      "ACTIVITY_DATE": 1134536400000
    },
    {
      "CAMPUS_CODE": "DEV",
      "CAMPUS_DESC": "Devens",
      "ACTIVITY_DATE": 1121313600000
    },
    {
      "CAMPUS_CODE": "E",
      "CAMPUS_DESC": "DNU-GAR-E Gardner Evening",
      "ACTIVITY_DATE": 1134536400000
    },
    {
      "CAMPUS_CODE": "F",
      "CAMPUS_DESC": "DNU-Devens Non-Credit",
      "ACTIVITY_DATE": 1156219200000
    },
    {
      "CAMPUS_CODE": "FIT",
      "CAMPUS_DESC": "Fitchburg",
      "ACTIVITY_DATE": 1121313600000
    },
    {
      "CAMPUS_CODE": "G",
      "CAMPUS_DESC": "DNU-Gardner Non-Credit",
      "ACTIVITY_DATE": 1134536400000
    },
    {
      "CAMPUS_CODE": "GAR",
      "CAMPUS_DESC": "Gardner",
      "ACTIVITY_DATE": 1121313600000
    },
    {
      "CAMPUS_CODE": "H",
      "CAMPUS_DESC": "DNU-Ayer Campus",
      "ACTIVITY_DATE": 1134536400000
    },
    {
      "CAMPUS_CODE": "J",
      "CAMPUS_DESC": "DNU-Gardner Summer II",
      "ACTIVITY_DATE": 1134536400000
    },
    {
      "CAMPUS_CODE": "K",
      "CAMPUS_DESC": "DNULEOM - Leominster Summer II",
      "ACTIVITY_DATE": 1134536400000
    },
    {
      "CAMPUS_CODE": "L",
      "CAMPUS_DESC": "DNU-Leominster Non-Credit",
      "ACTIVITY_DATE": 1134536400000
    },
    {
      "CAMPUS_CODE": "LEO",
      "CAMPUS_DESC": "Leominster",
      "ACTIVITY_DATE": 1121313600000
    },
    {
      "CAMPUS_CODE": "N",
      "CAMPUS_DESC": "DNU-GAR-E Evening/Sum Nursing",
      "ACTIVITY_DATE": 1134536400000
    },
    {
      "CAMPUS_CODE": "O",
      "CAMPUS_DESC": "DNU-PN Courses",
      "ACTIVITY_DATE": 1134536400000
    },
    {
      "CAMPUS_CODE": "OFF",
      "CAMPUS_DESC": "Off-campus",
      "ACTIVITY_DATE": 1121313600000
    },
    {
      "CAMPUS_CODE": "ORA",
      "CAMPUS_DESC": "Orange",
      "ACTIVITY_DATE": 1121313600000
    },
    {
      "CAMPUS_CODE": "P",
      "CAMPUS_DESC": "DNU-Non-Billable Course",
      "ACTIVITY_DATE": 1134536400000
    },
    {
      "CAMPUS_CODE": "Q",
      "CAMPUS_DESC": "DNU-Littleton",
      "ACTIVITY_DATE": 1134536400000
    },
    {
      "CAMPUS_CODE": "S",
      "CAMPUS_DESC": "DNU-GAR-S Gardner \"S\"  course",
      "ACTIVITY_DATE": 1134536400000
    },
    {
      "CAMPUS_CODE": "T",
      "CAMPUS_DESC": "DNU-LEOM - Leominster Campus",
      "ACTIVITY_DATE": 1134536400000
    },
    {
      "CAMPUS_CODE": "U",
      "CAMPUS_DESC": "DNU-Dental Hygiene Courses",
      "ACTIVITY_DATE": 1134536400000
    },
    {
      "CAMPUS_CODE": "V",
      "CAMPUS_DESC": "DNU-E-Learning Network",
      "ACTIVITY_DATE": 1134536400000
    },
    {
      "CAMPUS_CODE": "WEB",
      "CAMPUS_DESC": "Web Offerings",
      "ACTIVITY_DATE": 1262926800000
    },
    {
      "CAMPUS_CODE": "X",
      "CAMPUS_DESC": "DNU -Non-Billable Non-Credit",
      "ACTIVITY_DATE": 1156219200000
    }
  ],
  "siteCodesDropDown": 
  [
    {
      "SITE_CODE": "001",
      "SITE_DESC": "Gardner Campus",
      "STREET_1": "444 Green Street",
      "STREET_2": "",
      "STREET_3": "",
      "CITY": "Gardner",
      "STATE": "MA",
      "ZIP_CODE": "01440-1000",
      "NATION": "",
      "ACTIVITY_DATE": 815893200000
    },
    {
      "SITE_CODE": "002",
      "SITE_DESC": "Leominster Campus",
      "STREET_1": "100 Erdman Way",
      "STREET_2": "",
      "STREET_3": "",
      "CITY": "Leominster",
      "STATE": "MA",
      "ZIP_CODE": "01453",
      "NATION": "",
      "ACTIVITY_DATE": 860130000000
    },
    {
      "SITE_CODE": "003",
      "SITE_DESC": "Devens",
      "STREET_1": "100 Jackson Road",
      "STREET_2": "",
      "STREET_3": "",
      "CITY": "Ayer",
      "STATE": "MA",
      "ZIP_CODE": "01433",
      "NATION": "",
      "ACTIVITY_DATE": 1101186000000
    },
    {
      "SITE_CODE": "004",
      "SITE_DESC": "Quality Institute",
      "STREET_1": "119 Russell St",
      "STREET_2": "",
      "STREET_3": "",
      "CITY": "Littleton",
      "STATE": "MA",
      "ZIP_CODE": "01460",
      "NATION": "",
      "ACTIVITY_DATE": 860130000000
    },
    {
      "SITE_CODE": "005",
      "SITE_DESC": "Ayer High School",
      "STREET_1": "",
      "STREET_2": "",
      "STREET_3": "",
      "CITY": "Ayer",
      "STATE": "MA",
      "ZIP_CODE": "01433",
      "NATION": "",
      "ACTIVITY_DATE": 860130000000
    },
    {
      "SITE_CODE": "009",
      "SITE_DESC": "Prison Campuses",
      "STREET_1": "varied",
      "STREET_2": "",
      "STREET_3": "",
      "CITY": "xxx",
      "STATE": "MA",
      "ZIP_CODE": "00000",
      "NATION": "",
      "ACTIVITY_DATE": 815893200000
    },
    {
      "SITE_CODE": "010",
      "SITE_DESC": "Athol High School",
      "STREET_1": "2363 Main Street",
      "STREET_2": "",
      "STREET_3": "",
      "CITY": "Athol",
      "STATE": "MA",
      "ZIP_CODE": "01331",
      "NATION": "",
      "ACTIVITY_DATE": 937368000000
    },
    {
      "SITE_CODE": "011",
      "SITE_DESC": "Distance Learning",
      "STREET_1": "",
      "STREET_2": "",
      "STREET_3": "",
      "CITY": "Unknown",
      "STATE": "UK",
      "ZIP_CODE": "00000",
      "NATION": "",
      "ACTIVITY_DATE": 1003118400000
    },
    {
      "SITE_CODE": "012",
      "SITE_DESC": "West River Health Center",
      "STREET_1": "West River St",
      "STREET_2": "",
      "STREET_3": "",
      "CITY": "Orange",
      "STATE": "MA",
      "ZIP_CODE": "01364",
      "NATION": "",
      "ACTIVITY_DATE": 1034654400000
    },
    {
      "SITE_CODE": "013",
      "SITE_DESC": "Fitchburg Dental Programs",
      "STREET_1": "326 Nichols Rd",
      "STREET_2": "",
      "STREET_3": "",
      "CITY": "Fitchburg",
      "STATE": "MA",
      "ZIP_CODE": "01420",
      "NATION": "",
      "ACTIVITY_DATE": 1415768400000
    }
  ],
  "roomAttributesDropDown": 
  [
    {
      "ATTRIBUTE_CODE": "ADM",
      "ATTRIBUTE_DESC": "Administrative Office",
      "ACTIVITY_DATE": 813988800000
    },
    {
      "ATTRIBUTE_CODE": "AMPH",
      "ATTRIBUTE_DESC": "Amphitheatre",
      "ACTIVITY_DATE": 813988800000
    },
    {
      "ATTRIBUTE_CODE": "APPL",
      "ATTRIBUTE_DESC": "Apple Laboratory",
      "ACTIVITY_DATE": 813988800000
    },
    {
      "ATTRIBUTE_CODE": "AUD",
      "ATTRIBUTE_DESC": "Auditorium",
      "ACTIVITY_DATE": 641915405000
    },
    {
      "ATTRIBUTE_CODE": "BBC",
      "ATTRIBUTE_DESC": "Basketball Court",
      "ACTIVITY_DATE": 641915405000
    },
    {
      "ATTRIBUTE_CODE": "BBF",
      "ATTRIBUTE_DESC": "Baseball Field",
      "ACTIVITY_DATE": 641915405000
    },
    {
      "ATTRIBUTE_CODE": "BLB",
      "ATTRIBUTE_DESC": "Biology Lab",
      "ACTIVITY_DATE": 641915405000
    },
    {
      "ATTRIBUTE_CODE": "BLKB",
      "ATTRIBUTE_DESC": "Blackboard",
      "ACTIVITY_DATE": 813988800000
    },
    {
      "ATTRIBUTE_CODE": "CADD",
      "ATTRIBUTE_DESC": "CAD Stations",
      "ACTIVITY_DATE": 813988800000
    },
    {
      "ATTRIBUTE_CODE": "CLB",
      "ATTRIBUTE_DESC": "Chemistry Lab",
      "ACTIVITY_DATE": 641915405000
    },
    {
      "ATTRIBUTE_CODE": "CON",
      "ATTRIBUTE_DESC": "Conference Room",
      "ACTIVITY_DATE": 813988800000
    },
    {
      "ATTRIBUTE_CODE": "CPL",
      "ATTRIBUTE_DESC": "Computer Lab",
      "ACTIVITY_DATE": 641915405000
    },
    {
      "ATTRIBUTE_CODE": "CRIM",
      "ATTRIBUTE_DESC": "Criminology Lab",
      "ACTIVITY_DATE": 813988800000
    },
    {
      "ATTRIBUTE_CODE": "DIV",
      "ATTRIBUTE_DESC": "Division Office",
      "ACTIVITY_DATE": 813988800000
    },
    {
      "ATTRIBUTE_CODE": "ELB",
      "ATTRIBUTE_DESC": "Electronics Lab",
      "ACTIVITY_DATE": 641915405000
    },
    {
      "ATTRIBUTE_CODE": "FBF",
      "ATTRIBUTE_DESC": "Football Field",
      "ACTIVITY_DATE": 641915405000
    },
    {
      "ATTRIBUTE_CODE": "GCA",
      "ATTRIBUTE_DESC": "Gen Class w/Audiovisual Equip",
      "ACTIVITY_DATE": 641915405000
    },
    {
      "ATTRIBUTE_CODE": "GCL",
      "ATTRIBUTE_DESC": "General Classroom",
      "ACTIVITY_DATE": 641915405000
    },
    {
      "ATTRIBUTE_CODE": "GYM",
      "ATTRIBUTE_DESC": "Gymnasium",
      "ACTIVITY_DATE": 641915405000
    },
    {
      "ATTRIBUTE_CODE": "IBM",
      "ATTRIBUTE_DESC": "IBM Computers",
      "ACTIVITY_DATE": 813988800000
    },
    {
      "ATTRIBUTE_CODE": "IPL",
      "ATTRIBUTE_DESC": "Indoor Pool",
      "ACTIVITY_DATE": 641915405000
    },
    {
      "ATTRIBUTE_CODE": "LAB",
      "ATTRIBUTE_DESC": "Laboratory",
      "ACTIVITY_DATE": 641915405000
    },
    {
      "ATTRIBUTE_CODE": "LAN",
      "ATTRIBUTE_DESC": "Language Lab",
      "ACTIVITY_DATE": 641915405000
    },
    {
      "ATTRIBUTE_CODE": "LEC",
      "ATTRIBUTE_DESC": "Tiered Lecture Room",
      "ACTIVITY_DATE": 641915405000
    },
    {
      "ATTRIBUTE_CODE": "LIB",
      "ATTRIBUTE_DESC": "Library",
      "ACTIVITY_DATE": 641915405000
    },
    {
      "ATTRIBUTE_CODE": "MATH",
      "ATTRIBUTE_DESC": "Math Lab",
      "ACTIVITY_DATE": 813988800000
    },
    {
      "ATTRIBUTE_CODE": "MMR",
      "ATTRIBUTE_DESC": "Multi-Media Room",
      "ACTIVITY_DATE": 813988800000
    },
    {
      "ATTRIBUTE_CODE": "MPR",
      "ATTRIBUTE_DESC": "Music Practice Room",
      "ACTIVITY_DATE": 641915405000
    },
    {
      "ATTRIBUTE_CODE": "NURS",
      "ATTRIBUTE_DESC": "Nursing Bed Stations",
      "ACTIVITY_DATE": 813988800000
    },
    {
      "ATTRIBUTE_CODE": "PHOT",
      "ATTRIBUTE_DESC": "Photography Laboratory",
      "ACTIVITY_DATE": 813988800000
    },
    {
      "ATTRIBUTE_CODE": "PLB",
      "ATTRIBUTE_DESC": "Physics Lab",
      "ACTIVITY_DATE": 641915405000
    },
    {
      "ATTRIBUTE_CODE": "PODM",
      "ATTRIBUTE_DESC": "Podium",
      "ACTIVITY_DATE": 813988800000
    },
    {
      "ATTRIBUTE_CODE": "POTT",
      "ATTRIBUTE_DESC": "Potters Wheels",
      "ACTIVITY_DATE": 813988800000
    },
    {
      "ATTRIBUTE_CODE": "RBC",
      "ATTRIBUTE_DESC": "Racquetball Court",
      "ACTIVITY_DATE": 641915405000
    },
    {
      "ATTRIBUTE_CODE": "SCRN",
      "ATTRIBUTE_DESC": "Movie Screen",
      "ACTIVITY_DATE": 813988800000
    },
    {
      "ATTRIBUTE_CODE": "SHOP",
      "ATTRIBUTE_DESC": "Automotive and Welding Room",
      "ACTIVITY_DATE": 813988800000
    },
    {
      "ATTRIBUTE_CODE": "STU",
      "ATTRIBUTE_DESC": "Art Studio",
      "ACTIVITY_DATE": 641915405000
    },
    {
      "ATTRIBUTE_CODE": "TCT",
      "ATTRIBUTE_DESC": "Tennis Court",
      "ACTIVITY_DATE": 641915405000
    },
    {
      "ATTRIBUTE_CODE": "TRK",
      "ATTRIBUTE_DESC": "Track",
      "ACTIVITY_DATE": 641915405000
    },
    {
      "ATTRIBUTE_CODE": "TV",
      "ATTRIBUTE_DESC": "TV Monitor",
      "ACTIVITY_DATE": 813988800000
    },
    {
      "ATTRIBUTE_CODE": "WANG",
      "ATTRIBUTE_DESC": "WANG Computers",
      "ACTIVITY_DATE": 813988800000
    },
    {
      "ATTRIBUTE_CODE": "WITB",
      "ATTRIBUTE_DESC": "Whiteboard",
      "ACTIVITY_DATE": 813988800000
    },
    {
      "ATTRIBUTE_CODE": "WRIT",
      "ATTRIBUTE_DESC": "Writing Lab",
      "ACTIVITY_DATE": 813988800000
    },
    {
      "ATTRIBUTE_CODE": "WTR",
      "ATTRIBUTE_DESC": "Weight Training Room",
      "ACTIVITY_DATE": 641915405000
    }
  ]
}