{
  "subjectDropDown": 
  [
    {
      "SUBJECT_CODE": "ACC",
      "SUBJECT_DESC": "ACC Accounting"
    },
    {
      "SUBJECT_CODE": "ANT",
      "SUBJECT_DESC": "ANT Anthropology"
    },
    {
      "SUBJECT_CODE": "AQS",
      "SUBJECT_DESC": "AQS Analytical Lab Quality"
    },
    {
      "SUBJECT_CODE": "ART",
      "SUBJECT_DESC": "ART Art"
    },
    {
      "SUBJECT_CODE": "ASL",
      "SUBJECT_DESC": "ASL American Sign Language"
    },
    {
      "SUBJECT_CODE": "AUT",
      "SUBJECT_DESC": "AUT Automotive"
    },
    {
      "SUBJECT_CODE": "BIO",
      "SUBJECT_DESC": "BIO Biology"
    },
    {
      "SUBJECT_CODE": "BTC",
      "SUBJECT_DESC": "BTC Biotechnology/Biomanufact"
    },
    {
      "SUBJECT_CODE": "BUS",
      "SUBJECT_DESC": "BUS Business"
    },
    {
      "SUBJECT_CODE": "CAD",
      "SUBJECT_DESC": "CAD Computer Assisted Design"
    },
    {
      "SUBJECT_CODE": "CED",
      "SUBJECT_DESC": "CED Cooperative Education"
    },
    {
      "SUBJECT_CODE": "CHC",
      "SUBJECT_DESC": "CHC Complementary Health Care"
    },
    {
      "SUBJECT_CODE": "CHE",
      "SUBJECT_DESC": "CHE Chemistry"
    },
    {
      "SUBJECT_CODE": "CIS",
      "SUBJECT_DESC": "CIS Computer Information Sys"
    },
    {
      "SUBJECT_CODE": "CJU",
      "SUBJECT_DESC": "CJU Criminal Justice"
    },
    {
      "SUBJECT_CODE": "CPT",
      "SUBJECT_DESC": "CPT Career Plan & Placement"
    },
    {
      "SUBJECT_CODE": "DAC",
      "SUBJECT_DESC": "DAC Dental Assisting"
    },
    {
      "SUBJECT_CODE": "DAN",
      "SUBJECT_DESC": "DAN Dance"
    },
    {
      "SUBJECT_CODE": "DHY",
      "SUBJECT_DESC": "DHY Dental Hygiene"
    },
    {
      "SUBJECT_CODE": "EAS",
      "SUBJECT_DESC": "EAS Earth Science"
    },
    {
      "SUBJECT_CODE": "ECE",
      "SUBJECT_DESC": "ECE Early Childhood Education"
    },
    {
      "SUBJECT_CODE": "ECO",
      "SUBJECT_DESC": "ECO Economics"
    },
    {
      "SUBJECT_CODE": "EET",
      "SUBJECT_DESC": "EET Electronic Engineer Tech"
    },
    {
      "SUBJECT_CODE": "EGM",
      "SUBJECT_DESC": "EGM Energy Management"
    },
    {
      "SUBJECT_CODE": "EKG",
      "SUBJECT_DESC": "EKG Electrocardiogram"
    },
    {
      "SUBJECT_CODE": "ENG",
      "SUBJECT_DESC": "ENG English"
    },
    {
      "SUBJECT_CODE": "EOA",
      "SUBJECT_DESC": "EOA Executive Office Admin"
    },
    {
      "SUBJECT_CODE": "ELC",
      "SUBJECT_DESC": "ESL-Conversation"
    },
    {
      "SUBJECT_CODE": "ELG",
      "SUBJECT_DESC": "ESL-Grammar"
    },
    {
      "SUBJECT_CODE": "ELR",
      "SUBJECT_DESC": "ESL-Reading"
    },
    {
      "SUBJECT_CODE": "ELW",
      "SUBJECT_DESC": "ESL-Writing"
    },
    {
      "SUBJECT_CODE": "EXS",
      "SUBJECT_DESC": "EXS Exercise & Sports Science"
    },
    {
      "SUBJECT_CODE": "FIN",
      "SUBJECT_DESC": "FIN Finance"
    },
    {
      "SUBJECT_CODE": "FRE",
      "SUBJECT_DESC": "FRE French"
    },
    {
      "SUBJECT_CODE": "FST",
      "SUBJECT_DESC": "FST Fire Science Technology"
    },
    {
      "SUBJECT_CODE": "FYE",
      "SUBJECT_DESC": "FYE First Year Experience"
    },
    {
      "SUBJECT_CODE": "GEO",
      "SUBJECT_DESC": "GEO Geography"
    },
    {
      "SUBJECT_CODE": "GID",
      "SUBJECT_DESC": "GID Graphic&Interactive Design"
    },
    {
      "SUBJECT_CODE": "HCC",
      "SUBJECT_DESC": "HCC Health Care"
    },
    {
      "SUBJECT_CODE": "HEA",
      "SUBJECT_DESC": "HEA Health Sciences"
    },
    {
      "SUBJECT_CODE": "HIM",
      "SUBJECT_DESC": "HIM Health Information Mnt"
    },
    {
      "SUBJECT_CODE": "HIS",
      "SUBJECT_DESC": "HIS History"
    },
    {
      "SUBJECT_CODE": "HRM",
      "SUBJECT_DESC": "HRM Hotel & Restaurant Mgmt"
    },
    {
      "SUBJECT_CODE": "HST",
      "SUBJECT_DESC": "HST Human Services"
    },
    {
      "SUBJECT_CODE": "HUM",
      "SUBJECT_DESC": "HUM Humanities"
    },
    {
      "SUBJECT_CODE": "ISC",
      "SUBJECT_DESC": "ISC Interdisciplinary Studies"
    },
    {
      "SUBJECT_CODE": "LAW",
      "SUBJECT_DESC": "LAW Legal Studies"
    },
    {
      "SUBJECT_CODE": "MAS",
      "SUBJECT_DESC": "MAS Medical Assisting"
    },
    {
      "SUBJECT_CODE": "MAT",
      "SUBJECT_DESC": "MAT Mathematics"
    },
    {
      "SUBJECT_CODE": "MGT",
      "SUBJECT_DESC": "MGT Management"
    },
    {
      "SUBJECT_CODE": "MKT",
      "SUBJECT_DESC": "MKT Marketing"
    },
    {
      "SUBJECT_CODE": "MLT",
      "SUBJECT_DESC": "MLT Medical Laboratory Tech"
    },
    {
      "SUBJECT_CODE": "MRT",
      "SUBJECT_DESC": "MRT Media Arts & Technology"
    },
    {
      "SUBJECT_CODE": "MUS",
      "SUBJECT_DESC": "MUS Music"
    },
    {
      "SUBJECT_CODE": "NRD",
      "SUBJECT_DESC": "NRD Natural Resources"
    },
    {
      "SUBJECT_CODE": "NUR",
      "SUBJECT_DESC": "NUR Nursing"
    },
    {
      "SUBJECT_CODE": "PER",
      "SUBJECT_DESC": "PER Physical Education"
    },
    {
      "SUBJECT_CODE": "PHE",
      "SUBJECT_DESC": "PHE Public Health"
    },
    {
      "SUBJECT_CODE": "PHL",
      "SUBJECT_DESC": "PHL Philosophy"
    },
    {
      "SUBJECT_CODE": "PHO",
      "SUBJECT_DESC": "PHO Photography"
    },
    {
      "SUBJECT_CODE": "PHY",
      "SUBJECT_DESC": "PHY Physics"
    },
    {
      "SUBJECT_CODE": "PLB",
      "SUBJECT_DESC": "PLB Phlebotomy"
    },
    {
      "SUBJECT_CODE": "PLT",
      "SUBJECT_DESC": "PLT Plastics Technology"
    },
    {
      "SUBJECT_CODE": "POL",
      "SUBJECT_DESC": "POL Political Science"
    },
    {
      "SUBJECT_CODE": "PSY",
      "SUBJECT_DESC": "PSY Psychology"
    },
    {
      "SUBJECT_CODE": "PTA",
      "SUBJECT_DESC": "PTA Physical Therapist Assist"
    },
    {
      "SUBJECT_CODE": "RDG",
      "SUBJECT_DESC": "RDG Reading"
    },
    {
      "SUBJECT_CODE": "SOC",
      "SUBJECT_DESC": "SOC Sociology"
    },
    {
      "SUBJECT_CODE": "SPA",
      "SUBJECT_DESC": "SPA Spanish"
    },
    {
      "SUBJECT_CODE": "SPC",
      "SUBJECT_DESC": "SPC Speech"
    },
    {
      "SUBJECT_CODE": "SSC",
      "SUBJECT_DESC": "SSC Special Topics-Social Sci"
    },
    {
      "SUBJECT_CODE": "THE",
      "SUBJECT_DESC": "THE Theatre"
    }
  ]
}