{
  "todolist": 
  [
    {
      "ITEM_ID": "SRVC_LINK$0",
      "ITEM_DESC": "PG Medical Form",
      "DUE_DATE": "29/09/2014",
      "STATUS": "Initiated",
      "INSTITUTION": "Abu Dhabi University",
      "ADMINISTRATIVE_FUNCTION": "Admissions Application"
    }
  ]
}