{
  "gradesdropdown": 
  [
    {
      "TERM_ID": "0",
      "TERM": "2016 Spring",
      "CAREER": "Graduate",
      "INSTITUTION": "Claremont Graduate University"
    },
    {
      "TERM_ID": "1",
      "TERM": "2015 Fall",
      "CAREER": "Graduate",
      "INSTITUTION": "Claremont Graduate University"
    },
    {
      "TERM_ID": "2",
      "TERM": "2015 Summer",
      "CAREER": "Graduate",
      "INSTITUTION": "Claremont Graduate University"
    },
    {
      "TERM_ID": "3",
      "TERM": "2011 Fall",
      "CAREER": "Graduate",
      "INSTITUTION": "Claremont Graduate University"
    },
    {
      "TERM_ID": "4",
      "TERM": "2011 Spring",
      "CAREER": "Graduate",
      "INSTITUTION": "Claremont Graduate University"
    },
    {
      "TERM_ID": "5",
      "TERM": "2010 Fall",
      "CAREER": "Graduate",
      "INSTITUTION": "Claremont Graduate University"
    },
    {
      "TERM_ID": "6",
      "TERM": "2010 Spring",
      "CAREER": "Graduate",
      "INSTITUTION": "Claremont Graduate University"
    },
    {
      "TERM_ID": "7",
      "TERM": "2009 Spring",
      "CAREER": "Graduate",
      "INSTITUTION": "Claremont Graduate University"
    },
    {
      "TERM_ID": "8",
      "TERM": "2008 Fall",
      "CAREER": "Graduate",
      "INSTITUTION": "Claremont Graduate University"
    },
    {
      "TERM_ID": "9",
      "TERM": "2008 Summer",
      "CAREER": "Graduate",
      "INSTITUTION": "Claremont Graduate University"
    },
    {
      "TERM_ID": "10",
      "TERM": "2008 Spring",
      "CAREER": "Graduate",
      "INSTITUTION": "Claremont Graduate University"
    },
    {
      "TERM_ID": "11",
      "TERM": "2007 Fall",
      "CAREER": "Graduate",
      "INSTITUTION": "Claremont Graduate University"
    },
    {
      "TERM_ID": "12",
      "TERM": "2007 Spring",
      "CAREER": "Graduate",
      "INSTITUTION": "Claremont Graduate University"
    }
  ]
}