{
      "weekataglance": [{
        "CRN": "91845",
        "DESCRIPTION": "ACC  101-B",
        "TITLE": "Principles Of Accounting I",
        "CAMPUS": "Gardner",
        "PLACE": "Gardner Academic Building 306",
        "CLASS_TIME": "08:00 AM - 09:15 AM",
        "CLASS_TYPE": "Class",
        "TERM_CODE": "201609",
        "CREDITS": 3,
        "LEVEL_CODE": "01",
        "MON_DAY": "M",
        "TUE_DAY": "T",
        "WED_DAY": "W",
        "THU_DAY": "R",
        "FRI_DAY": "",
        "SAT_DAY": "",
        "SUN_DAY": "",
        "START_DATE": "06-AUG-2018",
        "END_DATE": "23-DEC-2019"
      }, {
        "CRN": "92282",
        "DESCRIPTION": "CIS  127-H",
        "TITLE": "Computer Technologies",
        "CAMPUS": "Gardner",
        "PLACE": "Gardner Academic Building 240",
        "CLASS_TIME": "01:45 PM - 03:00 PM",
        "CLASS_TYPE": "Class",
        "TERM_CODE": "201609",
        "CREDITS": 3,
        "LEVEL_CODE": "01",
        "MON_DAY": "",
        "TUE_DAY": "T",
        "WED_DAY": "",
        "THU_DAY": "R",
        "FRI_DAY": "F",
        "SAT_DAY": "",
        "SUN_DAY": "",
        "START_DATE": "06-AUG-2018",
        "END_DATE": "23-DEC-2019"
      }, {
        "CRN": "91872",
        "DESCRIPTION": "ENG  102-W1G",
        "TITLE": "College Writing II",
        "CAMPUS": "Gardner",
        "PLACE": "Gardner Academic Building 301",
        "CLASS_TIME": "06:00 PM - 08:40 PM",
        "CLASS_TYPE": "Class",
        "TERM_CODE": "201609",
        "CREDITS": 3,
        "LEVEL_CODE": "01",
        "MON_DAY": "",
        "TUE_DAY": "T",
        "WED_DAY": "W",
        "THU_DAY": "R",
        "FRI_DAY": "",
        "SAT_DAY": "S",
        "SUN_DAY": "U",
        "START_DATE": "06-AUG-2018",
        "END_DATE": "23-DEC-2019"
      }, {
        "CRN": "92088",
        "DESCRIPTION": "MAT  096-AC",
        "TITLE": "Intermediate Algebra",
        "CAMPUS": "Gardner",
        "PLACE": "Gardner Academic Building 349",
        "CLASS_TIME": "08:00 AM - 09:40 AM",
        "CLASS_TYPE": "Class",
        "TERM_CODE": "201609",
        "CREDITS": 4,
        "LEVEL_CODE": "01",
        "MON_DAY": "M",
        "TUE_DAY": "",
        "WED_DAY": "W",
        "THU_DAY": "",
        "FRI_DAY": "F",
        "SAT_DAY": "",
        "SUN_DAY": "",
        "START_DATE": "06-AUG-2018",
        "END_DATE": "23-DEC-2019"
      }, {
        "CRN": "92716",
        "DESCRIPTION": "MGT  210-E",
        "TITLE": "Principles Of Management",
        "CAMPUS": "Gardner",
        "PLACE": "Gardner Academic Building 206",
        "CLASS_TIME": "11:00 AM - 12:15 PM",
        "CLASS_TYPE": "Class",
        "TERM_CODE": "201609",
        "CREDITS": 3,
        "LEVEL_CODE": "01",
        "MON_DAY": "M",
        "TUE_DAY": "",
        "WED_DAY": "W",
        "THU_DAY": "",
        "FRI_DAY": "F",
        "SAT_DAY": "",
        "SUN_DAY": "",
        "START_DATE": "06-AUG-2018",
        "END_DATE": "23-DEC-2019"
      }]
    }