{
  "terms": 
  [
    {
      "TERM_ID": "0",
      "TERM": "2016 Summer",
      "CAREER": "Graduate",
      "INSTITUTION": "Claremont Graduate University"
    },
    {
      "TERM_ID": "1",
      "TERM": "2016 Fall",
      "CAREER": "Graduate",
      "INSTITUTION": "Claremont Graduate University"
    }
  ]
}