{
  "blockTranscriptsGrades": 
  [
  ],
  "transcriptleveldropdown": 
  [
    {
      "LEVEL_CODE": "01",
      "LEVEL_DESC": "Undergraduate"
    },
    {
      "LEVEL_CODE": "07",
      "LEVEL_DESC": "Non-Credit"
    }
  ],
  "transcripttypedropdown": 
  [
    {
      "TRANSCRIPT_CODE": "OFFC",
      "TRANSCRIPT_DESC": "Official"
    },
    {
      "TRANSCRIPT_CODE": "WEB",
      "TRANSCRIPT_DESC": "Unofficial Web Transcript"
    }
  ]
}