{
  "enrollmentcart": 
  [
    {
      "CLASS_ID": "P_DELETE$0",
      "CLASS": "ISL-UR 1000AD_M01-2\n (1601)",
      "DAY_TIME": "MoWe 6:30PM - 8:00PM",
      "ROOM": "AD-B-1F17",
      "INSTRUCTOR": "L. Salem",
      "UNITS": "3.00",
      "STATUS": "Open"
    }
  ],
  "buttonid": 
  [
    {
      "CLASS_NUMBER_BUTTON_ID": "DERIVED_REGFRM1_SSR_PB_ADDTOLIST2$9$",
      "SUBMIT_CART_BUTTON_ID": "DERIVED_REGFRM1_LINK_ADD_ENRL$82$"
    }
  ]
}