{
    "/js/app.js": "/js/app.js",
    "/plugins/global/plugins.bundle.css": "/plugins/global/plugins.bundle.css",
    "/css/style.bundle.css": "/css/style.bundle.css",
    "/plugins/custom/cropper/cropper.bundle.css": "/plugins/custom/cropper/cropper.bundle.css",
    "/plugins/custom/fullcalendar/fullcalendar.bundle.css": "/plugins/custom/fullcalendar/fullcalendar.bundle.css",
    "/plugins/custom/jqvmap/jqvmap.bundle.css": "/plugins/custom/jqvmap/jqvmap.bundle.css",
    "/plugins/custom/kanban/kanban.bundle.css": "/plugins/custom/kanban/kanban.bundle.css",
    "/plugins/custom/leaflet/leaflet.bundle.css": "/plugins/custom/leaflet/leaflet.bundle.css",
    "/plugins/custom/prismjs/prismjs.bundle.css": "/plugins/custom/prismjs/prismjs.bundle.css",
    "/plugins/custom/uppy/uppy.bundle.css": "/plugins/custom/uppy/uppy.bundle.css",
    "/css/pages/error/error-3.css": "/css/pages/error/error-3.css",
    "/css/pages/error/error-4.css": "/css/pages/error/error-4.css",
    "/css/pages/error/error-5.css": "/css/pages/error/error-5.css",
    "/css/pages/error/error-6.css": "/css/pages/error/error-6.css",
    "/css/pages/invoice/invoice-6.css": "/css/pages/invoice/invoice-6.css",
    "/css/pages/login/classic/login-1.css": "/css/pages/login/classic/login-1.css",
    "/css/pages/login/classic/login-2.css": "/css/pages/login/classic/login-2.css",
    "/css/pages/login/classic/login-3.css": "/css/pages/login/classic/login-3.css",
    "/css/pages/login/classic/login-4.css": "/css/pages/login/classic/login-4.css",
    "/css/pages/login/classic/login-5.css": "/css/pages/login/classic/login-5.css",
    "/css/pages/login/classic/login-6.css": "/css/pages/login/classic/login-6.css",
    "/css/pages/login/login-1.css": "/css/pages/login/login-1.css",
    "/css/pages/login/login-2.css": "/css/pages/login/login-2.css",
    "/css/pages/login/login-3.css": "/css/pages/login/login-3.css",
    "/css/pages/login/login-4.css": "/css/pages/login/login-4.css",
    "/css/pages/wizard/wizard-1.css": "/css/pages/wizard/wizard-1.css",
    "/css/pages/wizard/wizard-2.css": "/css/pages/wizard/wizard-2.css",
    "/css/pages/wizard/wizard-3.css": "/css/pages/wizard/wizard-3.css",
    "/css/pages/wizard/wizard-4.css": "/css/pages/wizard/wizard-4.css",
    "/css/pages/wizard/wizard-5.css": "/css/pages/wizard/wizard-5.css",
    "/css/pages/wizard/wizard-6.css": "/css/pages/wizard/wizard-6.css",
    "/css/themes/layout/aside/dark.css": "/css/themes/layout/aside/dark.css",
    "/css/themes/layout/aside/light.css": "/css/themes/layout/aside/light.css",
    "/css/themes/layout/brand/dark.css": "/css/themes/layout/brand/dark.css",
    "/css/themes/layout/brand/light.css": "/css/themes/layout/brand/light.css",
    "/css/themes/layout/header/base/dark.css": "/css/themes/layout/header/base/dark.css",
    "/css/themes/layout/header/base/light.css": "/css/themes/layout/header/base/light.css",
    "/css/themes/layout/header/menu/dark.css": "/css/themes/layout/header/menu/dark.css",
    "/css/themes/layout/header/menu/light.css": "/css/themes/layout/header/menu/light.css",
    "/css/app.css": "/css/app.css",
    "/js/pages/builder.js": "/js/pages/builder.js",
    "/js/pages/crud/datatables/advanced/column-rendering.js": "/js/pages/crud/datatables/advanced/column-rendering.js",
    "/js/pages/crud/datatables/advanced/column-visibility.js": "/js/pages/crud/datatables/advanced/column-visibility.js",
    "/js/pages/crud/datatables/advanced/footer-callback.js": "/js/pages/crud/datatables/advanced/footer-callback.js",
    "/js/pages/crud/datatables/advanced/multiple-controls.js": "/js/pages/crud/datatables/advanced/multiple-controls.js",
    "/js/pages/crud/datatables/advanced/row-callback.js": "/js/pages/crud/datatables/advanced/row-callback.js",
    "/js/pages/crud/datatables/advanced/row-grouping.js": "/js/pages/crud/datatables/advanced/row-grouping.js",
    "/js/pages/crud/datatables/basic/basic.js": "/js/pages/crud/datatables/basic/basic.js",
    "/js/pages/crud/datatables/basic/headers.js": "/js/pages/crud/datatables/basic/headers.js",
    "/js/pages/crud/datatables/basic/paginations.js": "/js/pages/crud/datatables/basic/paginations.js",
    "/js/pages/crud/datatables/basic/scrollable.js": "/js/pages/crud/datatables/basic/scrollable.js",
    "/js/pages/crud/datatables/data-sources/ajax-client-side.js": "/js/pages/crud/datatables/data-sources/ajax-client-side.js",
    "/js/pages/crud/datatables/data-sources/ajax-server-side.js": "/js/pages/crud/datatables/data-sources/ajax-server-side.js",
    "/js/pages/crud/datatables/data-sources/html.js": "/js/pages/crud/datatables/data-sources/html.js",
    "/js/pages/crud/datatables/data-sources/javascript.js": "/js/pages/crud/datatables/data-sources/javascript.js",
    "/js/pages/crud/datatables/extensions/buttons.js": "/js/pages/crud/datatables/extensions/buttons.js",
    "/js/pages/crud/datatables/extensions/colreorder.js": "/js/pages/crud/datatables/extensions/colreorder.js",
    "/js/pages/crud/datatables/extensions/fixedcolumns.js": "/js/pages/crud/datatables/extensions/fixedcolumns.js",
    "/js/pages/crud/datatables/extensions/fixedheader.js": "/js/pages/crud/datatables/extensions/fixedheader.js",
    "/js/pages/crud/datatables/extensions/keytable.js": "/js/pages/crud/datatables/extensions/keytable.js",
    "/js/pages/crud/datatables/extensions/responsive.js": "/js/pages/crud/datatables/extensions/responsive.js",
    "/js/pages/crud/datatables/extensions/rowgroup.js": "/js/pages/crud/datatables/extensions/rowgroup.js",
    "/js/pages/crud/datatables/extensions/rowreorder.js": "/js/pages/crud/datatables/extensions/rowreorder.js",
    "/js/pages/crud/datatables/extensions/scroller.js": "/js/pages/crud/datatables/extensions/scroller.js",
    "/js/pages/crud/datatables/extensions/select.js": "/js/pages/crud/datatables/extensions/select.js",
    "/js/pages/crud/datatables/search-options/advanced-search.js": "/js/pages/crud/datatables/search-options/advanced-search.js",
    "/js/pages/crud/datatables/search-options/column-search.js": "/js/pages/crud/datatables/search-options/column-search.js",
    "/js/pages/crud/file-upload/dropzonejs.js": "/js/pages/crud/file-upload/dropzonejs.js",
    "/js/pages/crud/file-upload/image-input.js": "/js/pages/crud/file-upload/image-input.js",
    "/js/pages/crud/file-upload/uppy.js": "/js/pages/crud/file-upload/uppy.js",
    "/js/pages/crud/forms/editors/bootstrap-markdown.js": "/js/pages/crud/forms/editors/bootstrap-markdown.js",
    "/js/pages/crud/forms/editors/ckeditor-balloon.js": "/js/pages/crud/forms/editors/ckeditor-balloon.js",
    "/js/pages/crud/forms/editors/ckeditor-balloon-block.js": "/js/pages/crud/forms/editors/ckeditor-balloon-block.js",
    "/js/pages/crud/forms/editors/ckeditor-classic.js": "/js/pages/crud/forms/editors/ckeditor-classic.js",
    "/js/pages/crud/forms/editors/ckeditor-document.js": "/js/pages/crud/forms/editors/ckeditor-document.js",
    "/js/pages/crud/forms/editors/ckeditor-inline.js": "/js/pages/crud/forms/editors/ckeditor-inline.js",
    "/js/pages/crud/forms/editors/quill.js": "/js/pages/crud/forms/editors/quill.js",
    "/js/pages/crud/forms/editors/summernote.js": "/js/pages/crud/forms/editors/summernote.js",
    "/js/pages/crud/forms/editors/tinymce.js": "/js/pages/crud/forms/editors/tinymce.js",
    "/js/pages/crud/forms/validation/form-controls.js": "/js/pages/crud/forms/validation/form-controls.js",
    "/js/pages/crud/forms/validation/form-widgets.js": "/js/pages/crud/forms/validation/form-widgets.js",
    "/js/pages/crud/forms/widgets/autosize.js": "/js/pages/crud/forms/widgets/autosize.js",
    "/js/pages/crud/forms/widgets/bootstrap-datepicker.js": "/js/pages/crud/forms/widgets/bootstrap-datepicker.js",
    "/js/pages/crud/forms/widgets/bootstrap-daterangepicker.js": "/js/pages/crud/forms/widgets/bootstrap-daterangepicker.js",
    "/js/pages/crud/forms/widgets/bootstrap-datetimepicker.js": "/js/pages/crud/forms/widgets/bootstrap-datetimepicker.js",
    "/js/pages/crud/forms/widgets/bootstrap-maxlength.js": "/js/pages/crud/forms/widgets/bootstrap-maxlength.js",
    "/js/pages/crud/forms/widgets/bootstrap-multipleselectsplitter.js": "/js/pages/crud/forms/widgets/bootstrap-multipleselectsplitter.js",
    "/js/pages/crud/forms/widgets/bootstrap-select.js": "/js/pages/crud/forms/widgets/bootstrap-select.js",
    "/js/pages/crud/forms/widgets/bootstrap-switch.js": "/js/pages/crud/forms/widgets/bootstrap-switch.js",
    "/js/pages/crud/forms/widgets/bootstrap-timepicker.js": "/js/pages/crud/forms/widgets/bootstrap-timepicker.js",
    "/js/pages/crud/forms/widgets/bootstrap-touchspin.js": "/js/pages/crud/forms/widgets/bootstrap-touchspin.js",
    "/js/pages/crud/forms/widgets/clipboard.js": "/js/pages/crud/forms/widgets/clipboard.js",
    "/js/pages/crud/forms/widgets/form-repeater.js": "/js/pages/crud/forms/widgets/form-repeater.js",
    "/js/pages/crud/forms/widgets/google-recaptcha.js": "/js/pages/crud/forms/widgets/google-recaptcha.js",
    "/js/pages/crud/forms/widgets/input-mask.js": "/js/pages/crud/forms/widgets/input-mask.js",
    "/js/pages/crud/forms/widgets/ion-range-slider.js": "/js/pages/crud/forms/widgets/ion-range-slider.js",
    "/js/pages/crud/forms/widgets/jquery-mask.js": "/js/pages/crud/forms/widgets/jquery-mask.js",
    "/js/pages/crud/forms/widgets/nouislider.js": "/js/pages/crud/forms/widgets/nouislider.js",
    "/js/pages/crud/forms/widgets/select2.js": "/js/pages/crud/forms/widgets/select2.js",
    "/js/pages/crud/forms/widgets/tagify.js": "/js/pages/crud/forms/widgets/tagify.js",
    "/js/pages/crud/forms/widgets/typeahead.js": "/js/pages/crud/forms/widgets/typeahead.js",
    "/js/pages/crud/ktdatatable/advanced/column-rendering.js": "/js/pages/crud/ktdatatable/advanced/column-rendering.js",
    "/js/pages/crud/ktdatatable/advanced/column-width.js": "/js/pages/crud/ktdatatable/advanced/column-width.js",
    "/js/pages/crud/ktdatatable/advanced/horizontal.js": "/js/pages/crud/ktdatatable/advanced/horizontal.js",
    "/js/pages/crud/ktdatatable/advanced/modal.js": "/js/pages/crud/ktdatatable/advanced/modal.js",
    "/js/pages/crud/ktdatatable/advanced/record-selection.js": "/js/pages/crud/ktdatatable/advanced/record-selection.js",
    "/js/pages/crud/ktdatatable/advanced/row-details.js": "/js/pages/crud/ktdatatable/advanced/row-details.js",
    "/js/pages/crud/ktdatatable/advanced/vertical.js": "/js/pages/crud/ktdatatable/advanced/vertical.js",
    "/js/pages/crud/ktdatatable/api/events.js": "/js/pages/crud/ktdatatable/api/events.js",
    "/js/pages/crud/ktdatatable/api/methods.js": "/js/pages/crud/ktdatatable/api/methods.js",
    "/js/pages/crud/ktdatatable/base/data-ajax.js": "/js/pages/crud/ktdatatable/base/data-ajax.js",
    "/js/pages/crud/ktdatatable/base/data-json.js": "/js/pages/crud/ktdatatable/base/data-json.js",
    "/js/pages/crud/ktdatatable/base/data-local.js": "/js/pages/crud/ktdatatable/base/data-local.js",
    "/js/pages/crud/ktdatatable/base/data-bahan-baku.js": "/js/pages/crud/ktdatatable/base/data-bahan-baku.js",
    "/js/pages/crud/ktdatatable/base/html-table.js": "/js/pages/crud/ktdatatable/base/html-table.js",
    "/js/pages/crud/ktdatatable/base/local-sort.js": "/js/pages/crud/ktdatatable/base/local-sort.js",
    "/js/pages/crud/ktdatatable/base/translation.js": "/js/pages/crud/ktdatatable/base/translation.js",
    "/js/pages/crud/ktdatatable/child/data-ajax.js": "/js/pages/crud/ktdatatable/child/data-ajax.js",
    "/js/pages/crud/ktdatatable/child/data-local.js": "/js/pages/crud/ktdatatable/child/data-local.js",
    "/js/pages/custom/chat/chat.js": "/js/pages/custom/chat/chat.js",
    "/js/pages/custom/contacts/add-contact.js": "/js/pages/custom/contacts/add-contact.js",
    "/js/pages/custom/contacts/edit-contact.js": "/js/pages/custom/contacts/edit-contact.js",
    "/js/pages/custom/contacts/list-columns.js": "/js/pages/custom/contacts/list-columns.js",
    "/js/pages/custom/contacts/list-datatable.js": "/js/pages/custom/contacts/list-datatable.js",
    "/js/pages/custom/ecommerce/checkout.js": "/js/pages/custom/ecommerce/checkout.js",
    "/js/pages/custom/ecommerce/my-orders.js": "/js/pages/custom/ecommerce/my-orders.js",
    "/js/pages/custom/education/school/calendar.js": "/js/pages/custom/education/school/calendar.js",
    "/js/pages/custom/education/school/library.js": "/js/pages/custom/education/school/library.js",
    "/js/pages/custom/education/school/students.js": "/js/pages/custom/education/school/students.js",
    "/js/pages/custom/education/school/teachers.js": "/js/pages/custom/education/school/teachers.js",
    "/js/pages/custom/education/student/calendar.js": "/js/pages/custom/education/student/calendar.js",
    "/js/pages/custom/education/student/profile.js": "/js/pages/custom/education/student/profile.js",
    "/js/pages/custom/inbox/inbox.js": "/js/pages/custom/inbox/inbox.js",
    "/js/pages/custom/login/login-3.js": "/js/pages/custom/login/login-3.js",
    "/js/pages/custom/login/login-4.js": "/js/pages/custom/login/login-4.js",
    "/js/pages/custom/login/login-general.js": "/js/pages/custom/login/login-general.js",
    "/js/pages/custom/profile/profile.js": "/js/pages/custom/profile/profile.js",
    "/js/pages/custom/projects/add-project.js": "/js/pages/custom/projects/add-project.js",
    "/js/pages/custom/projects/list-datatable.js": "/js/pages/custom/projects/list-datatable.js",
    "/js/pages/custom/todo/todo.js": "/js/pages/custom/todo/todo.js",
    "/js/pages/custom/user/add-user.js": "/js/pages/custom/user/add-user.js",
    "/js/pages/custom/user/edit-user.js": "/js/pages/custom/user/edit-user.js",
    "/js/pages/custom/user/list-datatable.js": "/js/pages/custom/user/list-datatable.js",
    "/js/pages/custom/wizard/wizard-1.js": "/js/pages/custom/wizard/wizard-1.js",
    "/js/pages/custom/wizard/wizard-2.js": "/js/pages/custom/wizard/wizard-2.js",
    "/js/pages/custom/wizard/wizard-3.js": "/js/pages/custom/wizard/wizard-3.js",
    "/js/pages/custom/wizard/wizard-4.js": "/js/pages/custom/wizard/wizard-4.js",
    "/js/pages/custom/wizard/wizard-5.js": "/js/pages/custom/wizard/wizard-5.js",
    "/js/pages/custom/wizard/wizard-6.js": "/js/pages/custom/wizard/wizard-6.js",
    "/js/pages/features/base/dropdown.js": "/js/pages/features/base/dropdown.js",
    "/js/pages/features/calendar/background-events.js": "/js/pages/features/calendar/background-events.js",
    "/js/pages/features/calendar/basic.js": "/js/pages/features/calendar/basic.js",
    "/js/pages/features/calendar/external-events.js": "/js/pages/features/calendar/external-events.js",
    "/js/pages/features/calendar/google.js": "/js/pages/features/calendar/google.js",
    "/js/pages/features/calendar/list-view.js": "/js/pages/features/calendar/list-view.js",
    "/js/pages/features/cards/draggable.js": "/js/pages/features/cards/draggable.js",
    "/js/pages/features/cards/tools.js": "/js/pages/features/cards/tools.js",
    "/js/pages/features/charts/amcharts/charts.js": "/js/pages/features/charts/amcharts/charts.js",
    "/js/pages/features/charts/amcharts/maps.js": "/js/pages/features/charts/amcharts/maps.js",
    "/js/pages/features/charts/amcharts/stock-charts.js": "/js/pages/features/charts/amcharts/stock-charts.js",
    "/js/pages/features/charts/apexcharts.js": "/js/pages/features/charts/apexcharts.js",
    "/js/pages/features/charts/flotcharts.js": "/js/pages/features/charts/flotcharts.js",
    "/js/pages/features/charts/google-charts.js": "/js/pages/features/charts/google-charts.js",
    "/js/pages/features/custom/spinners.js": "/js/pages/features/custom/spinners.js",
    "/js/pages/features/maps/google-maps.js": "/js/pages/features/maps/google-maps.js",
    "/js/pages/features/maps/jqvmap.js": "/js/pages/features/maps/jqvmap.js",
    "/js/pages/features/maps/jvectormap.js": "/js/pages/features/maps/jvectormap.js",
    "/js/pages/features/maps/leaflet.js": "/js/pages/features/maps/leaflet.js",
    "/js/pages/features/miscellaneous/blockui.js": "/js/pages/features/miscellaneous/blockui.js",
    "/js/pages/features/miscellaneous/bootstrap-notify.js": "/js/pages/features/miscellaneous/bootstrap-notify.js",
    "/js/pages/features/miscellaneous/cropper.js": "/js/pages/features/miscellaneous/cropper.js",
    "/js/pages/features/miscellaneous/dual-listbox.js": "/js/pages/features/miscellaneous/dual-listbox.js",
    "/js/pages/features/miscellaneous/idle-timer.js": "/js/pages/features/miscellaneous/idle-timer.js",
    "/js/pages/features/miscellaneous/kanban-board.js": "/js/pages/features/miscellaneous/kanban-board.js",
    "/js/pages/features/miscellaneous/perfect-scrollbar.js": "/js/pages/features/miscellaneous/perfect-scrollbar.js",
    "/js/pages/features/miscellaneous/session-timeout.js": "/js/pages/features/miscellaneous/session-timeout.js",
    "/js/pages/features/miscellaneous/sticky-panels.js": "/js/pages/features/miscellaneous/sticky-panels.js",
    "/js/pages/features/miscellaneous/sweetalert2.js": "/js/pages/features/miscellaneous/sweetalert2.js",
    "/js/pages/features/miscellaneous/toastr.js": "/js/pages/features/miscellaneous/toastr.js",
    "/js/pages/features/miscellaneous/treeview.js": "/js/pages/features/miscellaneous/treeview.js",
    "/js/pages/my-script.js": "/js/pages/my-script.js",
    "/js/pages/widgets.js": "/js/pages/widgets.js",
    "/js/scripts.bundle.js": "/js/scripts.bundle.js",
    "/plugins/custom/ckeditor/ckeditor-balloon-block.bundle.js": "/plugins/custom/ckeditor/ckeditor-balloon-block.bundle.js",
    "/plugins/custom/ckeditor/ckeditor-balloon.bundle.js": "/plugins/custom/ckeditor/ckeditor-balloon.bundle.js",
    "/plugins/custom/ckeditor/ckeditor-classic.bundle.js": "/plugins/custom/ckeditor/ckeditor-classic.bundle.js",
    "/plugins/custom/ckeditor/ckeditor-document.bundle.js": "/plugins/custom/ckeditor/ckeditor-document.bundle.js",
    "/plugins/custom/ckeditor/ckeditor-inline.bundle.js": "/plugins/custom/ckeditor/ckeditor-inline.bundle.js",
    "/plugins/custom/cropper/cropper.bundle.js": "/plugins/custom/cropper/cropper.bundle.js",
    "/plugins/custom/draggable/draggable.bundle.js": "/plugins/custom/draggable/draggable.bundle.js",
    "/plugins/custom/flot/flot.bundle.js": "/plugins/custom/flot/flot.bundle.js",
    "/plugins/custom/fullcalendar/fullcalendar.bundle.js": "/plugins/custom/fullcalendar/fullcalendar.bundle.js",
    "/plugins/custom/gmaps/gmaps.bundle.js": "/plugins/custom/gmaps/gmaps.bundle.js",
    "/plugins/custom/jqvmap/jqvmap.bundle.js": "/plugins/custom/jqvmap/jqvmap.bundle.js",
    "/plugins/custom/kanban/kanban.bundle.js": "/plugins/custom/kanban/kanban.bundle.js",
    "/plugins/custom/leaflet/leaflet.bundle.js": "/plugins/custom/leaflet/leaflet.bundle.js",
    "/plugins/custom/prismjs/prismjs.bundle.js": "/plugins/custom/prismjs/prismjs.bundle.js",
    "/plugins/custom/tinymce/tinymce.bundle.js": "/plugins/custom/tinymce/tinymce.bundle.js",
    "/plugins/custom/uppy/uppy.bundle.js": "/plugins/custom/uppy/uppy.bundle.js",
    "/plugins/global/plugins.bundle.js": "/plugins/global/plugins.bundle.js",
    "/plugins/global/fonts/flaticon/Flaticon.eot": "/plugins/global/fonts/flaticon/Flaticon.eot",
    "/plugins/global/fonts/flaticon/Flaticon.ttf": "/plugins/global/fonts/flaticon/Flaticon.ttf",
    "/plugins/global/fonts/flaticon/Flaticon.woff": "/plugins/global/fonts/flaticon/Flaticon.woff",
    "/plugins/global/fonts/flaticon2/Flaticon2.eot": "/plugins/global/fonts/flaticon2/Flaticon2.eot",
    "/plugins/global/fonts/flaticon2/Flaticon2.ttf": "/plugins/global/fonts/flaticon2/Flaticon2.ttf",
    "/plugins/global/fonts/flaticon2/Flaticon2.woff": "/plugins/global/fonts/flaticon2/Flaticon2.woff",
    "/plugins/global/fonts/flaticon2/Flaticon2.woff2": "/plugins/global/fonts/flaticon2/Flaticon2.woff2",
    "/plugins/global/fonts/keenthemes-icons/Ki.eot": "/plugins/global/fonts/keenthemes-icons/Ki.eot",
    "/plugins/global/fonts/keenthemes-icons/Ki.ttf": "/plugins/global/fonts/keenthemes-icons/Ki.ttf",
    "/plugins/global/fonts/keenthemes-icons/Ki.woff": "/plugins/global/fonts/keenthemes-icons/Ki.woff",
    "/plugins/global/fonts/keenthemes-icons/Ki.woff2": "/plugins/global/fonts/keenthemes-icons/Ki.woff2",
    "/plugins/global/fonts/@fortawesome/fa-brands-400.eot": "/plugins/global/fonts/@fortawesome/fa-brands-400.eot",
    "/plugins/global/fonts/@fortawesome/fa-brands-400.ttf": "/plugins/global/fonts/@fortawesome/fa-brands-400.ttf",
    "/plugins/global/fonts/@fortawesome/fa-brands-400.woff": "/plugins/global/fonts/@fortawesome/fa-brands-400.woff",
    "/plugins/global/fonts/@fortawesome/fa-brands-400.woff2": "/plugins/global/fonts/@fortawesome/fa-brands-400.woff2",
    "/plugins/global/fonts/@fortawesome/fa-regular-400.eot": "/plugins/global/fonts/@fortawesome/fa-regular-400.eot",
    "/plugins/global/fonts/@fortawesome/fa-regular-400.ttf": "/plugins/global/fonts/@fortawesome/fa-regular-400.ttf",
    "/plugins/global/fonts/@fortawesome/fa-regular-400.woff": "/plugins/global/fonts/@fortawesome/fa-regular-400.woff",
    "/plugins/global/fonts/@fortawesome/fa-regular-400.woff2": "/plugins/global/fonts/@fortawesome/fa-regular-400.woff2",
    "/plugins/global/fonts/@fortawesome/fa-solid-900.eot": "/plugins/global/fonts/@fortawesome/fa-solid-900.eot",
    "/plugins/global/fonts/@fortawesome/fa-solid-900.ttf": "/plugins/global/fonts/@fortawesome/fa-solid-900.ttf",
    "/plugins/global/fonts/@fortawesome/fa-solid-900.woff": "/plugins/global/fonts/@fortawesome/fa-solid-900.woff",
    "/plugins/global/fonts/@fortawesome/fa-solid-900.woff2": "/plugins/global/fonts/@fortawesome/fa-solid-900.woff2",
    "/plugins/global/fonts/line-awesome/fa-brands-400.eot": "/plugins/global/fonts/line-awesome/fa-brands-400.eot",
    "/plugins/global/fonts/line-awesome/fa-brands-400.ttf": "/plugins/global/fonts/line-awesome/fa-brands-400.ttf",
    "/plugins/global/fonts/line-awesome/fa-brands-400.woff": "/plugins/global/fonts/line-awesome/fa-brands-400.woff",
    "/plugins/global/fonts/line-awesome/fa-brands-400.woff2": "/plugins/global/fonts/line-awesome/fa-brands-400.woff2",
    "/plugins/global/fonts/line-awesome/fa-regular-400.eot": "/plugins/global/fonts/line-awesome/fa-regular-400.eot",
    "/plugins/global/fonts/line-awesome/fa-regular-400.ttf": "/plugins/global/fonts/line-awesome/fa-regular-400.ttf",
    "/plugins/global/fonts/line-awesome/fa-regular-400.woff": "/plugins/global/fonts/line-awesome/fa-regular-400.woff",
    "/plugins/global/fonts/line-awesome/fa-regular-400.woff2": "/plugins/global/fonts/line-awesome/fa-regular-400.woff2",
    "/plugins/global/fonts/line-awesome/fa-solid-900.eot": "/plugins/global/fonts/line-awesome/fa-solid-900.eot",
    "/plugins/global/fonts/line-awesome/fa-solid-900.ttf": "/plugins/global/fonts/line-awesome/fa-solid-900.ttf",
    "/plugins/global/fonts/line-awesome/fa-solid-900.woff": "/plugins/global/fonts/line-awesome/fa-solid-900.woff",
    "/plugins/global/fonts/line-awesome/fa-solid-900.woff2": "/plugins/global/fonts/line-awesome/fa-solid-900.woff2",
    "/plugins/global/fonts/line-awesome/la-brands-400.eot": "/plugins/global/fonts/line-awesome/la-brands-400.eot",
    "/plugins/global/fonts/line-awesome/la-brands-400.ttf": "/plugins/global/fonts/line-awesome/la-brands-400.ttf",
    "/plugins/global/fonts/line-awesome/la-brands-400.woff": "/plugins/global/fonts/line-awesome/la-brands-400.woff",
    "/plugins/global/fonts/line-awesome/la-brands-400.woff2": "/plugins/global/fonts/line-awesome/la-brands-400.woff2",
    "/plugins/global/fonts/line-awesome/la-regular-400.eot": "/plugins/global/fonts/line-awesome/la-regular-400.eot",
    "/plugins/global/fonts/line-awesome/la-regular-400.ttf": "/plugins/global/fonts/line-awesome/la-regular-400.ttf",
    "/plugins/global/fonts/line-awesome/la-regular-400.woff": "/plugins/global/fonts/line-awesome/la-regular-400.woff",
    "/plugins/global/fonts/line-awesome/la-regular-400.woff2": "/plugins/global/fonts/line-awesome/la-regular-400.woff2",
    "/plugins/global/fonts/line-awesome/la-solid-900.eot": "/plugins/global/fonts/line-awesome/la-solid-900.eot",
    "/plugins/global/fonts/line-awesome/la-solid-900.ttf": "/plugins/global/fonts/line-awesome/la-solid-900.ttf",
    "/plugins/global/fonts/line-awesome/la-solid-900.woff": "/plugins/global/fonts/line-awesome/la-solid-900.woff",
    "/plugins/global/fonts/line-awesome/la-solid-900.woff2": "/plugins/global/fonts/line-awesome/la-solid-900.woff2",
    "/plugins/global/fonts/socicon/socicon.eot": "/plugins/global/fonts/socicon/socicon.eot",
    "/plugins/global/fonts/socicon/socicon.ttf": "/plugins/global/fonts/socicon/socicon.ttf",
    "/plugins/global/fonts/socicon/socicon.woff": "/plugins/global/fonts/socicon/socicon.woff",
    "/plugins/custom/datatables/datatables.bundle.js": "/plugins/custom/datatables/datatables.bundle.js",
    "/plugins/custom/datatables/datatables.bundle.css": "/plugins/custom/datatables/datatables.bundle.css"
}