Place,Sex,Name,CyrillicName,BodyweightKg,Squat1Kg,Squat2Kg,Squat3Kg,Best3SquatKg,Squat4Kg,TotalKg,WeightClassKg,Event,Equipment,Tested,Deadlift1Kg,Deadlift2Kg,Deadlift3Kg,Best3DeadliftKg,Deadlift4Kg,Bench1Kg,Bench2Kg,Bench3Kg,Best3BenchKg,Bench4Kg,Division,Age,BirthDate
1,F,Valentina Rodichkina,Валентина Родичкина,60,,,,,,82.5,60,B,Unlimited,No,,,,,,82.5,-95,-95,82.5,,Amateur Open,30,1986-08-23
2,F,Ekaterina Ilyashenko,Екатерина Ильяшенко,59.5,,,,,,75,60,B,Unlimited,No,,,,,,-75,75,-82.5,75,,Amateur Open,28,1989-03-26
3,F,Kristina Aynetdinova,Кристина Айнетдинова,58.7,,,,,,65,60,B,Unlimited,No,,,,,,65,-80,-80,65,,Amateur Open,30,1986-10-11
1,M,Mkrtich Khatlamadzhiev,Мкртич Хатламаджиев,74.7,,,,,,162.5,75,B,Unlimited,No,,,,,,162.5,-170,-170,162.5,,Amateur Open,35,1982-02-12
1,M,Aleksandr Tkachenko,Александр Ткаченко,82,,,,,,202.5,82.5,B,Unlimited,No,,,,,,-185,185,202.5,202.5,,Amateur Open,27,1989-08-22
2,M,Dmitriy Moskalev,Дмитрий Москалев,82.1,,,,,,185,82.5,B,Unlimited,No,,,,,,185,-202.5,-202.5,185,,Amateur Open,39,1978-02-11
1,M,Anton Shchekolkin,Антон Щеколкин,94.5,,,,,,202.5,100,B,Unlimited,No,,,,,,-202.5,-202.5,202.5,202.5,,Amateur Juniors 20-23,22,1995-05-26
1,M,Aleksandr Boytsevskiy,Александр Бойцевский,96.2,,,,,,232.5,100,B,Unlimited,No,,,,,,-220,220,232.5,232.5,,Amateur Open,30,1987-05-30
2,M,Anton Shchekolkin,Антон Щеколкин,94.5,,,,,,202.5,100,B,Unlimited,No,,,,,,-202.5,-202.5,202.5,202.5,,Amateur Open,22,1995-05-26
DQ,M,Karlen Osipov,Карлен Осипов,107.2,,,,,,,110,B,Unlimited,No,,,,,,-270,-290,-290,,,Amateur Open,44,1972-08-26
1,M,Andrey Olifir,Андрей Олифир,108.7,,,,,,210,110,B,Unlimited,No,,,,,,190,200,210,210,,Amateur Masters 40-44,42,1975-06-15
DQ,M,Karlen Osipov,Карлен Осипов,107.2,,,,,,,110,B,Unlimited,No,,,,,,-270,-290,-290,,,Amateur Masters 40-44,44,1972-08-26
1,M,Artem Nechushkin,Артем Нечушкин,158,,,,,,282.5,140+,B,Unlimited,No,,,,,,270,282.5,,282.5,,Amateur Teen 18-19,18,1999-07-09
1,M,Artem Nechushkin,Артем Нечушкин,158,,,,,,282.5,140+,B,Unlimited,No,,,,,,270,282.5,,282.5,,Amateur Open,18,1999-07-09
1,F,Kristina Peshkova,Кристина Пешкова,54.3,-67.5,67.5,72.5,72.5,,72.5,56,S,Wraps,No,,,,,,,,,,,Amateur Juniors 20-23,22,1995-07-11
1,M,Aleksandr Ogly,Александр Оглы,71.9,,,,,,157.5,75,B,Single-ply,No,,,,,,157.5,-160,,157.5,,Amateur Open,31,1986-03-31
1,M,Aleksandr Polfuntikov,Александр Полфунтиков,89.3,280,300,310,310,,760,90,SBD,Single-ply,No,250,270,,270,,180,-190,,180,,Amateur Open,34,1982-12-06
1,F,Sofya Konovalova,Софья Коновалова,41.8,,,,,,70,44,D,Raw,No,50,60,70,70,,,,,,,Amateur Teen 14-15,14,2003-07-07
1,F,Anzhelika Prokhorova,Анжелика Прохорова,46.4,,,,,,77.5,48,D,Raw,No,67.5,-77.5,77.5,77.5,,,,,,,Amateur Teen 18-19,19,1997-12-08
1,F,Laura Shabukaeva,Лаура Шабукаева,47,,,,,,70,48,D,Raw,No,60,65,70,70,,,,,,,Amateur Juniors 20-23,21,1995-08-05
1,F,Yuliya Samokhvalova,Юлия Самохвалова,47.4,,,,,,97.5,48,D,Raw,No,85,97.5,-107.5,97.5,,,,,,,Amateur Open,29,1987-09-01
1,F,Anastasiya Oleynikova,Анастасия Олейникова,54.6,,,,,,80,56,D,Raw,No,60,70,80,80,,,,,,,Amateur Teen 14-15,14,2003-01-05
1,F,Polina Tverdokhlebova,Полина Твердохлебова,59,,,,,,82.5,60,D,Raw,No,65,75,82.5,82.5,,,,,,,Amateur Teen 16-17,17,1999-12-18
1,F,Kristina Sklyar,Кристина Скляр,56.8,,,,,,125,60,D,Raw,No,115,120,125,125,,,,,,,Amateur Open,29,1988-05-25
2,F,Anna Akimova,Анна Акимова,60,,,,,,125,60,D,Raw,No,105,115,125,125,,,,,,,Amateur Open,24,1992-09-07
3,F,Oksana Leganova,Оксана Леганова,57.7,,,,,,112.5,60,D,Raw,No,90,100,112.5,112.5,,,,,,,Amateur Open,24,1993-01-30
1,F,Valentina Torosyan,Валентина Торосян,66.3,,,,,,130,67.5,D,Raw,No,120,130,-137.5,130,,,,,,,Amateur Teen 18-19,19,1997-09-27
1,F,Lyudmila Smekhnova,Людмила Смехнова,67.5,,,,,,137.5,67.5,D,Raw,No,130,-137.5,137.5,137.5,,,,,,,Amateur Open,35,1981-07-30
2,F,Evgeniya Kartavskaya,Евгения Картавская,67.2,,,,,,120,67.5,D,Raw,No,-110,110,120,120,,,,,,,Amateur Open,34,1983-05-05
3,F,Elizaveta Kovtun,Елизавета Ковтун,64.7,,,,,,110,67.5,D,Raw,No,105,110,-120,110,,,,,,,Amateur Open,28,1989-01-23
4,F,Karina Sogbatyan,Карина Согбатян,66.8,,,,,,100,67.5,D,Raw,No,100,-110,-110,100,,,,,,,Amateur Open,25,1991-10-06
1,F,Anna Buzueva,Анна Бузуева,75,,,,,,150,75,D,Raw,No,130,145,150,150,,,,,,,Amateur Open,21,1995-10-03
1,F,Kristina Kochesokova,Кристина Кочесокова,100.5,,,,,,167.5,90+,D,Raw,No,157.5,167.5,-177.5,167.5,,,,,,,Amateur Open,24,1992-11-18
1,M,Murat Ismailov,Мурат Исмаилов,59.5,,,,,,175,60,D,Raw,No,175,-196,-196,175,,,,,,,Amateur Teen 16-17,17,2000-01-17
1,M,Amir Boriev,Амир Бориев,59.3,,,,,,195,60,D,Raw,No,175,195,-202.5,195,,,,,,,Amateur Open,25,1992-07-04
1,M,Tamerlan Skhvitaridze,Тамерлан Схвитаридзе,65.8,,,,,,192.5,67.5,D,Raw,No,175,192.5,,192.5,,,,,,,Amateur Teen 14-15,15,2001-10-07
1,M,Ruslan Achmizov,Руслан Ачмизов,65.8,,,,,,205,67.5,D,Raw,No,-185,192.5,205,205,,,,,,,Amateur Open,30,1986-11-11
1,M,Boris Shavrin,Борис Шаврин,67,,,,,,165,67.5,D,Raw,No,150,165,-170,165,,,,,,,Amateur Masters 65-69,66,1951-03-12
1,M,Aleksey Khekalo,Алексей Хекало,72.5,,,,,,190,75,D,Raw,No,180,-185,190,190,,,,,,,Amateur Teen 16-17,16,2000-08-28
1,M,Beslan Zakaunov,Беслан Закаунов,73.2,,,,,,235,75,D,Raw,No,210,235,,235,,,,,,,Amateur Teen 18-19,19,1997-10-28
1,M,Adam Shamurzaev,Адам Шамурзаев,74,,,,,,205,75,D,Raw,No,-205,-205,205,205,,,,,,,Amateur Juniors 20-23,22,1994-08-17
2,M,Anton Gapon,Антон Гапон,73.8,,,,,,182.5,75,D,Raw,No,175,182.5,-190,182.5,,,,,,,Amateur Juniors 20-23,21,1996-01-19
1,M,Konstantin Popov,Константин Попов,74.4,,,,,,192.5,75,D,Raw,No,170,182.5,192.5,192.5,,,,,,,Amateur Open,26,1991-01-11
1,M,Daniil Medyannikov,Даниил Медянников,78.4,,,,,,165,82.5,D,Raw,No,145,155,165,165,,,,,,,Amateur Teen 16-17,16,2001-02-02
1,M,Artur Akopyan,Артур Акопян,81.2,,,,,,200,82.5,D,Raw,No,187.5,200,-217.5,200,,,,,,,Amateur Juniors 20-23,23,1993-12-14
1,M,Aleksey Tsygankov,Алексей Цыганков,80.9,,,,,,225.5,82.5,D,Raw,No,-210,-210,225.5,225.5,,,,,,,Amateur Open,29,1987-11-19
2,M,Aleksandr Kozlov,Александр Козлов,80.3,,,,,,222.5,82.5,D,Raw,No,205,215,222.5,222.5,,,,,,,Amateur Open,34,1983-07-01
3,M,Artem Arkhipov,Артем Архипов,80.8,,,,,,210,82.5,D,Raw,No,190,210,-217.5,210,,,,,,,Amateur Open,33,1983-08-26
4,M,Sergey Chenakal,Сергей Ченакал,80.3,,,,,,200,82.5,D,Raw,No,200,-217.5,-217.5,200,,,,,,,Amateur Open,32,1984-08-02
1,M,Imran Tubaev,Имран Тубаев,89,,,,,,265,90,D,Raw,No,257.5,265,-270,265,,,,,,,Amateur Juniors 20-23,22,1994-12-03
2,M,Elsevar Mirzoev,Элсевар Мирзоев,89.5,,,,,,225,90,D,Raw,No,205,225,-230,225,,,,,,,Amateur Juniors 20-23,22,1994-11-27
1,M,Igor Kryat,Игорь Крят,84,,,,,,235,90,D,Raw,No,230,235,-240,235,,,,,,,Amateur Open,29,1988-05-31
2,M,Evgeniy Matsegorov,Евгений Мацегоров,89.8,,,,,,235,90,D,Raw,No,225,235,-245,235,,,,,,,Amateur Open,31,1986-05-06
3,M,Vladislav Bogatov,Владислав Богатов,87.1,,,,,,225,90,D,Raw,No,205,225,-235,225,,,,,,,Amateur Open,32,1985-05-03
1,M,Khusen Berbekov,Хусен Бербеков,99.1,,,,,,235,100,D,Raw,No,235,-270,-270,235,,,,,,,Amateur Juniors 20-23,22,1995-03-18
1,M,Artem Shekhovtsov,Артем Шеховцов,98.1,,,,,,270,100,D,Raw,No,245,260,270,270,,,,,,,Amateur Open,32,1985-01-25
2,M,Georgiy Pastukhov,Георгий Пастухов,93.4,,,,,,220,100,D,Raw,No,210,220,-225,220,,,,,,,Amateur Open,38,1979-01-05
1,M,Zamir Midov,Замир Мидов,108.7,,,,,,242.5,110,D,Raw,No,242.5,-250,-250,242.5,,,,,,,Amateur Open,29,1987-11-26
2,M,Ivan Krapivka,Иван Крапивка,108.3,,,,,,210,110,D,Raw,No,-180,-180,210,210,,,,,,,Amateur Open,39,1977-10-13
1,M,Oleg Novoseltsev,Олег Новосельцев,120,,,,,,295,125,D,Raw,No,270,280,295,295,,,,,,,Amateur Open,32,1985-05-10
2,M,Dmitriy Dukhno,Дмитрий Духно,114,,,,,,220,125,D,Raw,No,200,210,220,220,,,,,,,Amateur Open,37,1980-01-14
1,F,Irina Timoshchenko,Ирина Тимощенко,46.5,,,,,,45,48,B,Raw,No,,,,,,42.5,-45,45,45,,Amateur Open,25,1991-12-17
1,F,Irina Rybalchenko,Ирина Рыбальченко,51.1,,,,,,60,52,B,Raw,No,,,,,,50,55,60,60,,Amateur Open,38,1979-07-21
2,F,Tatyana Marenkova,Татьяна Маренкова,48.8,,,,,,52.5,52,B,Raw,No,,,,,,50,52.5,-57.5,52.5,,Amateur Open,38,1979-02-16
DQ,F,Natalya Sklyar,Наталья Скляр,53.2,,,,,,,56,B,Raw,No,,,,,,-37.5,-37.5,-37.5,,,Amateur Masters 50-54,50,1967-01-28
1,F,Nataliya Kraeva,Наталия Краева,57.5,,,,,,75,60,B,Raw,No,,,,,,75,-77.5,-77.5,75,,Amateur Open,40,1977-02-02
1,F,Kristina Kochesokova,Кристина Кочесокова,100.5,,,,,,85,90+,B,Raw,No,,,,,,80,85,-92.5,85,,Amateur Open,24,1992-11-18
1,M,Ivan Krapivka,Иван Крапивка,51.1,,,,,,42.5,52,B,Raw,No,,,,,,32.5,40,42.5,42.5,,Amateur Teen 13,13,2004-01-24
1,M,Bogdan Shitko,Богдан Шитько,66.8,,,,,,82.5,67.5,B,Raw,No,,,,,,82.5,-90,-95,82.5,,Amateur Teen 16-17,16,2000-12-17
1,M,Azamat Shogenov,Азамат Шогенов,67.5,,,,,,95,67.5,B,Raw,No,,,,,,95,-105,-105,95,,Amateur Juniors 20-23,20,1996-10-24
1,M,Vitaliy Gusakov,Виталий Гусаков,74.4,,,,,,130,75,B,Raw,No,,,,,,125,130,-135,130,,Amateur Teen 16-17,17,1999-11-14
1,M,Anton Gapon,Антон Гапон,73.8,,,,,,112.5,75,B,Raw,No,,,,,,105,112.5,-120,112.5,,Amateur Juniors 20-23,21,1996-01-19
1,M,Andrey Nagornyy,Андрей Нагорный,73.5,,,,,,132.5,75,B,Raw,No,,,,,,-122.5,127.5,132.5,132.5,,Amateur Open,27,1990-01-07
2,M,Konstantin Popov,Константин Попов,74.4,,,,,,115,75,B,Raw,No,,,,,,110,115,-120,115,,Amateur Open,26,1991-01-11
DQ,M,Denis Dushenko,Денис Душенко,72.6,,,,,,,75,B,Raw,No,,,,,,-115,-120,-120,,,Amateur Open,31,1986-04-24
DQ,M,Andrey Maksimov,Андрей Максимов,73.9,,,,,,,75,B,Raw,No,,,,,,-100,-105,,,,Amateur Open,24,1992-12-12
1,M,Vladimir Kosmynin,Владимир Космынин,71.3,,,,,,135,75,B,Raw,No,,,,,,130,135,,135,,Amateur Masters 55-59,57,1960-06-12
1,M,Leonid Dvorkin,Леонид Дворкин,72.8,,,,,,102.5,75,B,Raw,No,,,,,,97.5,102.5,-106,102.5,,Amateur Masters 75-79,76,1941-01-23
1,M,Daniil Medyannikov,Даниил Медянников,78.4,,,,,,107.5,82.5,B,Raw,No,,,,,,95,107.5,-115,107.5,,Amateur Teen 16-17,16,2001-02-02
1,M,Alan Byazrov,Алан Бязров,82.4,,,,,,170,82.5,B,Raw,No,,,,,,-160,160,170,170,,Amateur Open,31,1986-07-08
2,M,Nikolay Munaev,Николай Мунаев,81,,,,,,160,82.5,B,Raw,No,,,,,,147.5,157.5,160,160,,Amateur Open,30,1986-10-30
3,M,Aleksandr Tkachenko,Александр Ткаченко,82,,,,,,137.5,82.5,B,Raw,No,,,,,,-137.5,-137.5,137.5,137.5,,Amateur Open,27,1989-08-22
4,M,Aleksey Botarev,Алексей Ботарев,79.9,,,,,,135,82.5,B,Raw,No,,,,,,125,135,-147.5,135,,Amateur Open,25,1991-11-19
5,M,Ivan Orekhov,Иван Орехов,81.9,,,,,,127.5,82.5,B,Raw,No,,,,,,127.5,-132.5,-132.5,127.5,,Amateur Open,30,1987-07-11
1,M,Zaur Akhmadov,Заур Ахмадов,90,,,,,,130,90,B,Raw,No,,,,,,130,-150,-150,130,,Amateur Teen 18-19,19,1997-08-03
1,M,Arkadiy Litvin,Аркадий Литвин,88.1,,,,,,160,90,B,Raw,No,,,,,,155,-160,160,160,,Amateur Open,32,1985-06-08
2,M,Pavel Shukshin,Павел Шукшин,89.3,,,,,,157.5,90,B,Raw,No,,,,,,150,155,157.5,157.5,,Amateur Open,36,1980-08-03
3,M,Aleksandr Burgelov,Александр Бургелов,88.5,,,,,,140,90,B,Raw,No,,,,,,130,140,-150,140,,Amateur Open,42,1975-03-12
1,M,Aleksandr Burgelov,Александр Бургелов,88.5,,,,,,140,90,B,Raw,No,,,,,,130,140,-150,140,,Amateur Masters 40-44,42,1975-03-12
1,M,Denis Chabannyy,Денис Чабанный,100,,,,,,125,100,B,Raw,No,,,,,,112.5,117.5,125,125,,Amateur Teen 16-17,16,2000-08-16
1,M,Artem Nikolaev,Артем Николаев,100,,,,,,135,100,B,Raw,No,,,,,,135,-140,-142.5,135,,Amateur Teen 18-19,18,1999-01-07
1,M,Pavel Zhitnik,Павел Житник,98.7,,,,,,170,100,B,Raw,No,,,,,,160,170,-172.5,170,,Amateur Open,25,1992-05-17
2,M,Roman Gavrilenko,Роман Гавриленко,95.9,,,,,,167.5,100,B,Raw,No,,,,,,162.5,167.5,-172.5,167.5,,Amateur Open,24,1993-06-24
3,M,Mikhail Dukh,Михаил Дух,92.2,,,,,,155,100,B,Raw,No,,,,,,140,147.5,155,155,,Amateur Open,30,1987-01-15
4,M,Maksim Vlasov,Максим Власов,99.7,,,,,,140,100,B,Raw,No,,,,,,140,-162.5,-162.5,140,,Amateur Open,33,1983-10-13
1,M,Telman Aliev,Тельман Алиев,109.4,,,,,,190,110,B,Raw,No,,,,,,190,-200,-200,190,,Amateur Open,36,1981-07-04
2,M,Sergey Mikhienko,Сергей Михиенко,107,,,,,,167.5,110,B,Raw,No,,,,,,147.5,167.5,,167.5,,Amateur Open,34,1983-02-15
3,M,Ivan Krapivka,Иван Крапивка,108.3,,,,,,167.5,110,B,Raw,No,,,,,,162.5,167.5,-170,167.5,,Amateur Open,39,1977-10-13
1,M,Andrey Olifir,Андрей Олифир,108.7,,,,,,160,110,B,Raw,No,,,,,,155,160,-162.5,160,,Amateur Masters 40-44,42,1975-06-15
DQ,M,Ruslan Dzhasheev,Руслан Джашеев,125,,,,,,,125,B,Raw,No,,,,,,-175,-175,-175,,,Amateur Open,31,1986-04-17
1,M,Oleg Khokhlov,Олег Хохлов,123.5,,,,,,162.5,125,B,Raw,No,,,,,,155,160,162.5,162.5,,Amateur Masters 45-49,46,1971-03-24
1,M,Aleksandr Sokolov,Александр Соколов,135,,,,,,220,140,B,Raw,No,,,,,,210,215,220,220,,Amateur Open,37,1979-09-10
1,M,Denis Zverev,Денис Зверев,174,,,,,,182.5,140+,B,Raw,No,,,,,,-182.5,182.5,-225,182.5,,Amateur Open,29,1987-09-26
1,F,Laura Shabukaeva,Лаура Шабукаева,47,55,-65,70,70,,170,48,SBD,Wraps,No,60,65,70,70,,30,-35,-35,30,,Amateur Juniors 20-23,21,1995-08-05
1,F,Ekaterina Muratova,Екатерина Муратова,55.3,70,75,80,80,,215,56,SBD,Wraps,No,80,87.5,90,90,,-40,45,-47.5,45,,Amateur Teen 18-19,18,1999-01-10
1,F,Polina Tverdokhlebova,Полина Твердохлебова,59,55,60,62.5,62.5,,177.5,60,SBD,Wraps,No,65,75,82.5,82.5,,27.5,30,32.5,32.5,,Amateur Teen 16-17,17,1999-12-18
1,F,Anna Akimova,Анна Акимова,60,70,77.5,85,85,,260,60,SBD,Wraps,No,105,115,125,125,,45,50,-55,50,,Amateur Open,24,1992-09-07
2,F,Elena Tereshchenko,Елена Терещенко,60,95,100,-105,100,,255,60,SBD,Wraps,No,105,110,-120,110,,45,-50,-50,45,,Amateur Open,29,1988-05-09
1,F,Olga Ushakova,Ольга Ушакова,65.2,70,75,80,80,,210,67.5,SBD,Wraps,No,75,80,85,85,,40,-42.5,45,45,,Amateur Masters 40-44,43,1974-03-22
1,M,Artem Arkhipov,Артем Архипов,80.8,-170,-170,180,180,,515,82.5,SBD,Wraps,No,190,210,-217.5,210,,115,-125,125,125,,Amateur Open,33,1983-08-26
1,M,Dmitriy Boytsevskiy,Дмитрий Бойцевский,83.9,90,100,110,110,,330,90,SBD,Wraps,No,120,130,140,140,,70,75,80,80,,Amateur Teen 14-15,14,2003-06-16
1,M,Imran Tubaev,Имран Тубаев,89,-185,185,-205,185,,367.5,90,SBD,Wraps,No,50,,,50,,115,125,132.5,132.5,,Amateur Juniors 20-23,22,1994-12-03
1,M,Orkhan Zeynalov,Орхан Зейналов,96.7,210,220,230,230,,655,100,SBD,Wraps,No,235,255,,255,,170,-180,-180,170,,Amateur Open,29,1987-12-09
2,M,Valeriy Antonenko,Валерий Антоненко,99.4,225,-230,-230,225,,615,100,SBD,Wraps,No,230,-240,,230,,-160,160,-165,160,,Amateur Open,30,1987-01-06
3,M,Aleksandr Boytsevskiy,Александр Бойцевский,96.2,180,190,-210,190,,605,100,SBD,Wraps,No,240,250,-260,250,,160,-165,165,165,,Amateur Open,30,1987-05-30
1,M,Artem Fatykhov,Артем Фатыхов,120.3,110,-120,135,135,,375,125,SBD,Wraps,No,150,160,-170,160,,80,-85,-87.5,80,,Amateur Teen 16-17,16,2001-04-07
1,M,Pavel Mitrofanov,Павел Митрофанов,99.9,325,350,-380,350,,350,100,S,Multi-ply,No,,,,,,,,,,,Pro Open,33,1983-08-12
1,M,Evgeniy Kholyavka,Евгений Холявка,89.2,,,,,,240,90,B,Unlimited,No,,,,,,240,-260,-260,240,,Pro Open,29,1988-04-25
1,M,Artem Krylov,Артем Крылов,94,,,,,,270,100,B,Unlimited,No,,,,,,250,270,-300,270,,Pro Open,26,1990-09-03
1,M,Andrey Likhman,Андрей Лихман,108.8,,,,,,300,110,B,Unlimited,No,,,,,,280,300,-320,300,,Pro Open,40,1977-05-01
1,M,Mikhail Mikao,Михаил Микао,124.9,,,,,,290,125,B,Unlimited,No,,,,,,280,-290,290,290,,Pro Open,32,1985-07-29
1,M,Aleksandr Ballod,Александр Баллод,137.4,,,,,,320,140,B,Unlimited,No,,,,,,310,320,-330,320,,Pro Open,37,1979-08-17
1,M,Eduard Smetanin,Эдуард Сметанин,131,,,,,,205,140,B,Unlimited,No,,,,,,195,205,-215,205,,Pro Masters 45-49,47,1969-10-15
1,F,Tatyanaya Zlydennaya,Татьяная Злыденная,66.2,140,-155,-155,140,,367.5,67.5,SBD,Unlimited,No,140,145,-150,145,,65,75,82.5,82.5,,Pro Open,30,1987-01-28
1,M,Evgeniy Radionov,Евгений Радионов,89,250,260,275,275,,780,90,SBD,Unlimited,No,230,240,255,255,,230,240,250,250,,Pro Open,34,1983-05-10
1,M,Yaroslav Trubichkin,Ярослав Трубічкін,100,310,335,350,350,,825,100,SBD,Unlimited,No,-280,290,-305,290,,170,180,185,185,,Pro Open,30,1987-06-16
1,M,Stanislav Shvetsov,Станислав Швецов,128,380,-400,400,400,,1100,140,SBD,Unlimited,No,320,340,360,360,,320,340,-350,340,,Pro Open,29,1988-02-08
1,M,Vladimir Vinnikov,Владимир Винников,95.8,,,,,,270,100,D,Multi-ply,No,250,270,-290,270,,,,,,,Pro Open,30,1986-08-28
1,M,Andrey Sizov,Андрей Сизов,95,,,,,,315,100,D,Single-ply,No,300,315,-325,315,,,,,,,Pro Open,49,1968-01-29
1,M,Stepan Pogosyan,Степан Погосян,86.6,,,,,,240,90,B,Single-ply,No,,,,,,230,240,-245,240,,Pro Open,32,1985-04-18
2,M,Georgiy Elkanishvili,Георгий Элканишвили,89.7,,,,,,195,90,B,Single-ply,No,,,,,,180,190,195,195,,Pro Open,28,1988-11-01
1,M,Anatoliy Talovasov,Анатолий Таловасов,118.4,,,,,,145,125,B,Single-ply,No,,,,,,135,145,-155,145,,Pro Masters 55-59,56,1960-12-01
DQ,F,Kamilla Lysenko,Камилла Лысенко,60,,,,,,,60,D,Raw,No,-140,,,,,,,,,,Pro Juniors 20-23,22,1994-08-05
1,F,Zalina Musienko,Залина Мусиенко,72.9,,,,,,160,75,D,Raw,No,-150,150,160,160,,,,,,,Pro Open,32,1984-11-07
1,M,Viktor Ezhov,Виктор Ежов,65.7,,,,,,155,67.5,D,Raw,No,145,155,-162.5,155,,,,,,,Pro Teen 16-17,17,1999-12-01
1,M,Fuad Mamedov,Фуад Мамедов,86.8,,,,,,240,90,D,Raw,No,230,240,-250,240,,,,,,,Pro Open,30,1987-01-02
1,M,Anatoliy Talovasov,Анатолий Таловасов,118.4,,,,,,225,125,D,Raw,No,200,215,225,225,,,,,,,Pro Masters 55-59,56,1960-12-01
1,F,Anzhela Bogdan,Анжела Богдан,54.9,,,,,,55,56,B,Raw,No,,,,,,52.5,55,-57.5,55,,Pro Open,29,1987-08-06
1,M,Timur Kantserov,Тимур Канцеров,74.6,,,,,,170,75,B,Raw,No,,,,,,160,170,-182.5,170,,Pro Juniors 20-23,20,1997-01-13
1,M,Fuad Mamedov,Фуад Мамедов,86.8,,,,,,160,90,B,Raw,No,,,,,,155,160,-165,160,,Pro Open,30,1987-01-02
1,M,Aleksandr Fesun,Александр Фесун,87.9,,,,,,145,90,B,Raw,No,,,,,,135,145,-150,145,,Pro Masters 50-54,51,1966-03-09
1,M,Vladimir Zakharov,Владимир Захаров,103.8,,,,,,190,110,B,Raw,No,,,,,,180,185,190,190,,Pro Masters 60-64,62,1955-07-07
1,M,Aleksandr Mitrofanov,Александр Митрофанов,112.1,,,,,,200,125,B,Raw,No,,,,,,170,190,200,200,,Pro Open,31,1985-12-29
1,M,Kaplan Tlevtsezhev,Каплан Тлевцежев,82.1,170,180,187.5,187.5,,497.5,82.5,SBD,Wraps,No,190,215,,215,,-95,95,-97.5,95,,Pro Masters 60-64,61,1956-02-13
DQ,M,Marat Yakupov,Марат Якупов,108,-230,,,,,,110,SBD,Wraps,No,-250,,,,,-180,,,,,Pro Masters 40-44,40,1977-05-06
