Division,WeightClassKg,Place,Name,Team,BodyweightKg,Best3SquatKg,Best3BenchKg,Best3DeadliftKg,TotalKg,Equipment,Event,Sex
Boys,51.71,1,Reid Clanton,Midland Greenwood,51.35,124.74,70.31,158.76,353.8,Single-ply,SBD,M
Boys,51.71,2,Jose Garcia #1,Brownfield,51.71,115.67,79.38,140.61,335.66,Single-ply,SBD,M
Boys,51.71,3,Juan Duran #2,Lubbock Cooper,46.18,111.13,65.77,140.61,317.51,Single-ply,SBD,M
Boys,51.71,4,Salvador Antillon,Seminole,50.17,129.27,63.5,124.74,317.51,Single-ply,SBD,M
Boys,51.71,5,Jacob Jackson,Vernon,51.44,106.59,63.5,106.59,276.69,Single-ply,SBD,M
Boys,55.79,6,Eric Hernandez,Andrews,51.89,106.59,63.5,104.33,274.42,Single-ply,SBD,M
Boys,51.71,7,Justin Rodriguez,Levelland,51.44,95.25,56.7,108.86,260.82,Single-ply,SBD,M
Boys,51.71,8,Jimmie Vaughn,Seminole,51.44,86.18,47.63,113.4,247.21,Single-ply,SBD,M
Boys,51.71,9,Jonathan Hernandez,Lamesa,48.63,88.45,47.63,90.72,226.8,Single-ply,SBD,M
Boys,55.79,DQ,Brandon Rhea,Andrews,51.89,,,,,Single-ply,SBD,M
Boys,55.79,1,Brett Salas,Lubbock Cooper,55.52,163.29,77.11,174.63,415.04,Single-ply,SBD,M
Boys,59.87,2,Eric Rivas,Seminole,56.02,149.69,88.45,165.56,403.7,Single-ply,SBD,M
Boys,55.79,3,Darian Vidana,Monahans,54.7,163.29,77.11,149.69,390.09,Single-ply,SBD,M
Boys,59.87,4,Sawyer Jenkins,Seminole,55.88,145.15,86.18,151.95,383.29,Single-ply,SBD,M
Boys,55.79,5,Jay Lomas,Sweetwater,55.25,131.54,88.45,140.61,360.61,Single-ply,SBD,M
Boys,55.79,6,Daniel Valenzuela,Pecos,55.34,131.54,70.31,149.69,351.53,Single-ply,SBD,M
Boys,55.79,7,Wesley Payton,Lamesa,55.34,129.27,72.57,147.42,349.27,Single-ply,SBD,M
Boys,55.79,8,Cole Byerly,Midland Greenwood,55.52,127.01,79.38,140.61,347,Single-ply,SBD,M
Boys,55.79,9,Gian Cruz,Monahans,55.7,117.93,61.23,131.54,310.71,Single-ply,SBD,M
Boys,55.79,DQ,Tyler Nairn,Big Spring,53.8,140.61,,,,Single-ply,SBD,M
Boys,67.13,1,Andrew Alvidrez,Seminole,60.06,190.51,106.59,188.24,485.34,Single-ply,SBD,M
Boys,59.87,2,Pablo Hinojosa,Lamesa,59.06,181.44,99.79,176.9,458.13,Single-ply,SBD,M
Boys,67.13,3,Justin Workman,Pecos,59.96,158.76,95.25,181.44,435.45,Single-ply,SBD,M
Boys,67.13,4,Bray Amos,Sweetwater,60.1,170.1,86.18,163.29,419.57,Single-ply,SBD,M
Boys,67.13,5,Nicolas Ybara,Pecos,60.1,158.76,102.06,154.22,415.04,Single-ply,SBD,M
Boys,59.87,6,Ryan Vasquez,Monahans,59.69,147.42,86.18,165.56,399.16,Single-ply,SBD,M
Boys,59.87,7,Josh Martinez,Midland Greenwood,59.24,147.42,86.18,156.49,390.09,Single-ply,SBD,M
Boys,59.87,8,Rodrick Renteria,Pecos,59.87,136.08,97.52,147.42,381.02,Single-ply,SBD,M
Boys,59.87,9,Abraham Trevino,Lubbock Cooper,59.87,131.54,97.52,136.08,365.14,Single-ply,SBD,M
Boys,59.87,10,Johnathan Browning,Sweetwater,59.15,131.54,74.84,136.08,342.46,Single-ply,SBD,M
Boys,67.13,1,Matthew Gonzales,Fort Stockton,66.13,185.97,97.52,204.12,487.61,Single-ply,SBD,M
Boys,67.13,2,Elliot Hanna,Levelland,66.22,181.44,104.33,188.24,474,Single-ply,SBD,M
Boys,67.13,3,Hunter Tollison,Borger,66.04,170.1,104.33,190.51,464.93,Single-ply,SBD,M
Boys,67.13,4,Donald Baker,Sweetwater,65.05,176.9,104.33,176.9,458.13,Single-ply,SBD,M
Boys,67.13,5,Levi Mills,Levelland,67.13,158.76,113.4,163.29,435.45,Single-ply,SBD,M
Boys,67.13,6,Dominic Baca,Dalhart,64.95,154.22,97.52,181.44,433.18,Single-ply,SBD,M
Boys,74.84,7,Alex Valdez,Andrews,67.36,158.76,97.52,174.63,430.91,Single-ply,SBD,M
Boys,67.13,8,Austin Marlett,Sweetwater,66.41,172.37,90.72,158.76,421.84,Single-ply,SBD,M
Boys,67.13,9,Martin Zambrano,Big Spring,66.13,145.15,97.52,163.29,405.97,Single-ply,SBD,M
Boys,67.13,DQ,Frankie Medina,Dalhart,66.22,172.37,90.72,,,Single-ply,SBD,M
Boys,74.84,1,Ryan Linebaugh,Sweetwater,74.39,204.12,113.4,206.38,523.9,Single-ply,SBD,M
Boys,74.84,2,Trey Cave,Midland Greenwood,70.4,183.7,117.93,183.7,485.34,Single-ply,SBD,M
Boys,74.84,3,Willie Haymon,Vernon,70.94,170.1,97.52,190.51,458.13,Single-ply,SBD,M
Boys,74.84,4,Garrett Mindrup,Midland Classical Academy,74.21,185.97,88.45,183.7,458.13,Single-ply,SBD,M
Boys,74.84,5,Ramon Juarez,Seminole,73.21,167.83,88.45,179.17,435.45,Single-ply,SBD,M
Boys,74.84,6,Dustin Rea,Midland Greenwood,73.48,158.76,104.33,167.83,430.91,Single-ply,SBD,M
Boys,74.84,7,Joe Macias,Andrews,72.94,158.76,104.33,165.56,428.64,Single-ply,SBD,M
Boys,74.84,8,Leo Ureste,Fort Stockton,69.4,172.37,83.91,163.29,419.57,Single-ply,SBD,M
Boys,74.84,9,Guillermo Davila,Dalhart,71.76,167.83,79.38,154.22,401.43,Single-ply,SBD,M
Boys,74.84,DQ,Aaron Castillo,Pecos,74.03,170.1,106.59,,,Single-ply,SBD,M
Boys,82.1,1,Sam Nemir,Sweetwater,79.56,217.72,140.61,233.6,591.94,Single-ply,SBD,M
Boys,89.81,2,Justin Thornton,Pecos,82.19,206.38,117.93,231.33,555.65,Single-ply,SBD,M
Boys,82.1,3,George Klassen,Seminole,80.2,192.78,111.13,210.92,514.83,Single-ply,SBD,M
Boys,82.1,4,Hector Ontiveros,Fort Stockton,80.56,176.9,108.86,208.65,494.42,Single-ply,SBD,M
Boys,82.1,5,Orlando Haymon,Vernon,80.74,183.7,102.06,208.65,494.42,Single-ply,SBD,M
Boys,89.81,6,Caleb Morales,Lamesa,82.33,199.58,108.86,170.1,478.54,Single-ply,SBD,M
Boys,82.1,7,Derek Fitzpatrick,Midland Greenwood,80.83,167.83,99.79,199.58,467.2,Single-ply,SBD,M
Boys,82.1,8,AJ Sanchez,Monahans,79.74,181.44,102.06,181.44,464.93,Single-ply,SBD,M
Boys,82.1,9,Nathan Montes,Monahans,81.56,181.44,120.2,163.29,464.93,Single-ply,SBD,M
Boys,82.1,10,Rickey Harcrow,Midland Greenwood,81.1,170.1,111.13,170.1,451.32,Single-ply,SBD,M
Boys,89.81,1,Fili Jaquez,Lubbock Cooper,86.36,251.74,149.69,249.48,650.91,Single-ply,SBD,M
Boys,89.81,2,Shane Smith,Levelland,89.36,217.72,120.2,213.19,551.11,Single-ply,SBD,M
Boys,89.81,3,Christian Gonzales,Monahans,85.28,208.65,122.47,197.31,528.44,Single-ply,SBD,M
Boys,89.81,4,Azel Alvidrez,Andrews,88.54,183.7,122.47,219.99,526.17,Single-ply,SBD,M
Boys,89.81,5,Anthony Palacios,Sweetwater,87.18,190.51,115.67,215.46,521.63,Single-ply,SBD,M
Boys,89.81,6,Juan Chavira,Dalhart,88.45,192.78,117.93,206.38,517.1,Single-ply,SBD,M
Boys,89.81,7,Alex Garcia #1,Sweetwater,82.46,181.44,104.33,222.26,508.02,Single-ply,SBD,M
Boys,89.81,8,Nick Runkles,Levelland,86.18,204.12,117.93,170.1,492.15,Single-ply,SBD,M
Boys,89.81,9,Brady McClellan,Lubbock Cooper,86.73,179.17,97.52,192.78,469.47,Single-ply,SBD,M
Boys,99.79,10,Kyle Lambert,Sweetwater,89.9,165.56,115.67,172.37,453.59,Single-ply,SBD,M
Boys,99.79,1,Brett Cummings,Borger,99.79,260.82,129.27,235.87,625.96,Single-ply,SBD,M
Boys,99.79,2,Montana Vega,Lubbock Cooper,95.71,222.26,147.42,238.14,607.81,Single-ply,SBD,M
Boys,99.79,3,Shaquille Walters,Midland Greenwood,98.25,226.8,127.01,240.4,594.21,Single-ply,SBD,M
Boys,99.79,4,Anthony Montemayor,Lamesa,97.98,238.14,117.93,217.72,573.79,Single-ply,SBD,M
Boys,109.77,5,Sammy Sambrano,Brownfield,99.97,222.26,142.88,208.65,573.79,Single-ply,SBD,M
Boys,99.79,6,Marcus Trujillo,Dalhart,97.98,215.46,92.99,204.12,512.56,Single-ply,SBD,M
Boys,99.79,7,Eddie Campos,Levelland,99.16,213.19,136.08,158.76,508.02,Single-ply,SBD,M
Boys,99.79,8,Michael Powers,Fort Stockton,99.06,192.78,113.4,195.04,501.22,Single-ply,SBD,M
Boys,99.79,9,Kendall Rea,Sweetwater,95.53,183.7,127.01,181.44,492.15,Single-ply,SBD,M
Boys,99.79,10,Chance Arriaga,Fort Stockton,93.17,181.44,108.86,188.24,478.54,Single-ply,SBD,M
Boys,109.77,1,Trae Taylor,Levelland,102.87,278.96,158.76,272.16,709.87,Single-ply,SBD,M
Boys,109.77,2,Mateo Gonzales,Sweetwater,103.33,249.48,158.76,258.55,666.78,Single-ply,SBD,M
Boys,109.77,3,Stephen Lane,Vernon,106.5,278.96,136.08,226.8,641.83,Single-ply,SBD,M
Boys,109.77,4,Ibraham Carrasco,Andrews,109.04,256.28,151.95,210.92,619.15,Single-ply,SBD,M
Boys,109.77,5,Austin Betancourt,Seminole,102.15,213.19,127.01,213.19,553.38,Single-ply,SBD,M
Boys,109.77,6,Andrew Clayman,Brownfield,104.87,226.8,124.74,181.44,532.97,Single-ply,SBD,M
Boys,109.77,7,Garrett Ford,Monahans,101.33,199.58,127.01,204.12,530.7,Single-ply,SBD,M
Boys,109.77,8,Spencer Holsey,Borger,108.77,199.58,106.59,224.53,530.7,Single-ply,SBD,M
Boys,109.77,9,Victor Perez,Lamesa,108.23,185.97,108.86,185.97,480.81,Single-ply,SBD,M
Boys,109.77,10,James Iglesias,Lamesa,107.68,142.88,142.88,142.88,428.64,Single-ply,SBD,M
Boys,109.77,DQ,Eddie Aguirre,Brownfield,105.23,195.04,113.4,,,Single-ply,SBD,M
Boys,124.74,1,O'Scotty Castro,Dalhart,114.76,297.1,158.76,249.48,705.34,Single-ply,SBD,M
Boys,124.74,2,Emiliano Renteria,Lamesa,122.47,254.01,145.15,240.4,639.57,Single-ply,SBD,M
Boys,124.74,3,Sergio Vidales,Levelland,122.56,249.48,170.1,197.31,616.89,Single-ply,SBD,M
Boys,124.74,4,Dallam Read,Dalhart,119.75,233.6,124.74,254.01,612.35,Single-ply,SBD,M
Boys,124.74,5,Robert Montferrand,Fort Stockton,118.66,231.33,127.01,226.8,585.13,Single-ply,SBD,M
Boys,124.74,6,Jeremy Garza,Snyder,117.93,226.8,136.08,183.7,546.58,Single-ply,SBD,M
Boys,124.74,7,Aric Rutledge,Big Spring,113.4,204.12,115.67,217.72,537.51,Single-ply,SBD,M
Boys,124.74,8,Keith Kalka,Fort Stockton,115.67,226.8,120.2,190.51,537.51,Single-ply,SBD,M
Boys,124.74,9,Boston Alvarado,Fort Stockton,116.12,222.26,115.67,192.78,530.7,Single-ply,SBD,M
Boys,124.74,DQ,Chase Saunders,Sweetwater,118.93,195.04,145.15,,,Single-ply,SBD,M
Boys,124.74+,1,Byron Lara,Lubbock Cooper,140.34,317.51,204.12,256.28,777.91,Single-ply,SBD,M
Boys,124.74+,2,Sawyer Roberts,Big Spring,161.75,285.76,149.69,240.4,675.85,Single-ply,SBD,M
Boys,124.74+,3,Andrew Rawling,Monahans,128.37,263.08,124.74,254.01,641.83,Single-ply,SBD,M
Boys,124.74+,4,Dakota Gonzalez,Fort Stockton,144.15,231.33,149.69,206.38,587.4,Single-ply,SBD,M
Boys,124.74+,5,Nicolas Franco,Pecos,151.14,240.4,149.69,197.31,587.4,Single-ply,SBD,M
Boys,124.74+,6,Cole Coomer,Andrews,144.79,208.65,120.2,201.85,530.7,Single-ply,SBD,M
Boys,124.74+,7,Dimitri Pena,Monahans,136.62,210.92,104.33,181.44,496.68,Single-ply,SBD,M
Boys,124.74+,8,Dominick Puente,Levelland,127.73,208.65,92.99,174.63,476.27,Single-ply,SBD,M
Boys,124.74+,9,Jessie Enriquez,Perryton,141.61,181.44,120.2,174.63,476.27,Single-ply,SBD,M
Boys,124.74+,DQ,Tyler Ramos,Pecos,132.9,238.14,,,,Single-ply,SBD,M
