Place,Name,CyrillicName,Sex,Country,Tested,Division,BirthDate,BodyweightKg,Squat1Kg,Squat2Kg,Squat3Kg,Best3SquatKg,Bench1Kg,Bench2Kg,Bench3Kg,Best3BenchKg,Bench4Kg,Deadlift1Kg,Deadlift2Kg,Deadlift3Kg,Best3DeadliftKg,Deadlift4Kg,TotalKg,Event,Equipment
1,Valentin Gontar,Валентин Гонтар,M,Ukraine,Yes,Open,1987-09-26,75.6,230,240,247.5,247.5,145,150,-152.5,150,,260,267.5,272.5,272.5,,670,SBD,Wraps
2,Oleksandr Gavrilenko,Олександр Гавриленко,M,Ukraine,Yes,Open,1988-10-17,96.85,180,200,210,210,160,170,180,180,,220,240,260,260,,650,SBD,Wraps
3,Dmitro Smolinets,Дмитро Смолинець,M,Ukraine,Yes,Open,1982-07-08,80.55,205,220,-230,220,127.5,135,-140,135,,205,-215,220,220,,575,SBD,Wraps
4,Adelaida Poddueva,Аделаїда Поддуєва,F,Ukraine,Yes,Open,1989-10-12,62.9,125,135,-142.5,135,77.5,82.5,85,85,,127.5,135,140,140,,360,SBD,Wraps
1,Mikhaylo Zhelyazkov,Михайло Желязков,M,Ukraine,No,Open,1980-09-12,99,310,320,330,330,175,185,187.5,187.5,,310,320,-335,320,,837.5,SBD,Wraps
2,Arkadiy Shalokha,Аркадий Шалоха,M,Ukraine,No,Open,1983-02-28,77.6,280,300,-310,300,155,165,167.5,167.5,,260,-275,-275,260,,727.5,SBD,Wraps
3,Igor Makovetskiy,Ігор Маковецький,M,Ukraine,No,Open,1972-04-08,103.5,315,325,340,340,-180,185,192.5,192.5,,300,310,-315,310,,842.5,SBD,Wraps
4,Anna Kashperska,Анна Кашперська,F,Ukraine,No,Open,1994-10-01,75.85,195,210,215,215,120,-125,,120,,190,200,,200,,535,SBD,Wraps
5,Oleksiy Perebatinskiy,Олексій Перебатинський,M,Ukraine,No,Open,1989-05-22,88.15,290,-300,300,300,167.5,-175,175,175,,-300,300,-310,300,,775,SBD,Wraps
6,Oleksandr Hushtyk,Олександр Гуштик,M,Ukraine,No,Open,1998-12-30,72.95,260,280,-300,280,140,-150,-150,140,,205,220,230,230,,650,SBD,Wraps
7,Yuliya Malinovska,Юлія Маліновська,F,Ukraine,No,Open,1984-12-02,59.55,150,155,-160,155,82.5,-87.5,-87.5,82.5,,170,175,-180,175,,412.5,SBD,Wraps
8,Grigoriy Barannik,Григорій Бараннік,M,Ukraine,No,Open,1990-05-09,142.6,275,290,-302.5,290,190,202.5,210,210,,285,305,320,320,,820,SBD,Wraps
9,Mileana Regushevskaya,Милеана Регушевская,F,Ukraine,No,Open,1995-08-23,68.2,165,175,180,180,87.5,92.5,-95,92.5,,-175,175,,175,,447.5,SBD,Wraps
10,Valeriy Marushka,Валерій Марушка,M,Ukraine,No,Open,1986-02-21,83.4,250,-260,262.5,262.5,150,155,-160,155,,250,260,,260,,677.5,SBD,Wraps
1,Nadiya Tishchenko,Надія Тищенко,F,Ukraine,Yes,Open,1993-09-30,71.5,,,,,115,120,122.5,122.5,125,,,,,,122.5,B,Raw
2,Sergiy Kurazhenko,Сергій Кураженко,M,Ukraine,Yes,Open,1985-03-21,99.5,,,,,167.5,172.5,-180,172.5,-180,,,,,,172.5,B,Raw
3,Sergiy Ilnitskiy,Сергій Ільницький,M,Ukraine,Yes,Open,1970-05-20,87.9,,,,,100,-110,110,110,,,,,,,110,B,Raw
1,Denis Bunchuk,Денис Бунчук,M,Ukraine,No,Open,1989-07-09,99.2,,,,,245,256,261,261,,,,,,,261,B,Raw
2,Volodimir Oleynik,Володимир Олейник,M,Ukraine,No,Open,1990-06-27,105.95,,,,,220,230,240,240,-242.5,,,,,,240,B,Raw
3,Andriy Podoba,Андрій Подоба,M,Ukraine,No,Open,1988-12-12,116.3,,,,,230,237.5,-242.5,237.5,242.5,,,,,,237.5,B,Raw
4,Ruslan Revutskiy,Руслан Ревуцкий,M,Ukraine,No,Open,1991-11-21,121.15,,,,,240,-245,-245,240,,,,,,,240,B,Raw
5,Sergiy Gorbatovskiy,Сергій Горбатовський,M,Ukraine,No,Open,1991-09-01,122.7,,,,,220,240,-250,240,,,,,,,240,B,Raw
6,Evgeniy Boloban,Євгеній Болобан,M,Ukraine,No,Open,1996-08-28,74.95,,,,,182.5,190,-195,190,-195,,,,,,190,B,Raw
7,Oleksiy Bronishevskiy,Олексій Бронішевський,M,Ukraine,No,Open,1988-03-26,88.45,,,,,210,-215,-215,210,,,,,,,210,B,Raw
8,Yaroslav Dunay,Ярослав Дунай,M,Ukraine,No,Open,1978-02-19,108.25,,,,,200,210,-220,210,-225,,,,,,210,B,Raw
1,Oleg Zhuchkov,Олег Жучков,M,Ukraine,Yes,Open,1994-03-18,74.2,,,,,,,,,,250,260,270,270,-277.5,270,D,Raw
2,Mikhaylo Savenko,Михайло Савенко,M,Ukraine,Yes,Open,1996-04-25,103.9,,,,,,,,,,300,-310,-310,300,,300,D,Raw
3,Oleksandr Novak,Олександр Новак,M,Ukraine,Yes,Open,1983-07-27,81.5,,,,,,,,,,230,240,250,250,-255,250,D,Raw
4,Oleksandr Pisarenko,Олександр Писаренко,M,Ukraine,Yes,Open,1971-04-08,117.5,,,,,,,,,,165,180,-210,180,,180,D,Raw
DQ,Maryana Tsiganyuk,Марьяна Циганюк,F,Ukraine,Yes,Open,1989-08-15,56,,,,,,,,,,-130,-130,,,,,D,Raw
1,Vasil Matviїv,Василь Матвіїв,M,Ukraine,No,Open,1985-10-09,66.3,,,,,,,,,,-240,250,260,260,270,260,D,Raw
2,Maksim Potomkin,Максим Потьомкін,M,Ukraine,No,Open,1993-08-30,101.6,,,,,,,,,,330,-350,-350,330,-350,330,D,Raw
3,Vitaliy Kobets,Віталій Кобець,M,Ukraine,No,Open,1989-01-19,86.85,,,,,,,,,,285,300,-305,300,305,300,D,Raw
4,Maksim Skobelev,Максим Скобелєв,M,Ukraine,No,Open,1984-06-07,100.7,,,,,,,,,,300,325,-335,325,-335,325,D,Raw
5,Dmitro Kulikov #1,Дмитро Куліков,M,Ukraine,No,Open,1973-04-16,85.3,,,,,,,,,,280,300,-320,300,-320,300,D,Raw
6,Andriy Bodrov,Андрій Бодров,M,Ukraine,No,Open,1992-12-22,80.85,,,,,,,,,,275,-287.5,-287.5,275,290,275,D,Raw
7,Vitaliy Mikheev #2,Віталій Міхеєв,M,Ukraine,No,Open,1978-09-23,107.85,,,,,,,,,,310,325,,325,,325,D,Raw
8,Ivan Cherepanya,Іван Черепаня,M,Ukraine,No,Open,1985-04-14,115.25,,,,,,,,,,300,320,-330,320,-330,320,D,Raw
9,Mikhaylo Yurchenko,Михайло Юрченко,M,Ukraine,No,Open,1999-01-02,79.8,,,,,,,,,,265,270,-275,270,-275,270,D,Raw
