Place,Sex,Name,CyrillicName,BodyweightKg,Squat1Kg,Squat2Kg,Squat3Kg,Best3SquatKg,Squat4Kg,Bench1Kg,Bench2Kg,Bench3Kg,Best3BenchKg,Bench4Kg,Deadlift1Kg,Deadlift2Kg,Deadlift3Kg,Best3DeadliftKg,Deadlift4Kg,TotalKg,WeightClassKg,Event,Equipment,Tested,Division,Age,BirthDate
1,F,Anastasiya Leushina,Анастасия Леушина,50.8,-80,80,85,85,,35,-40,-42.5,35,,60,70,80,80,,200,52,SBD,Raw,No,Juniors 20-23,23,1992-10-21
1,M,Mikhail Sizykh,Михаил Сизых,89.1,-100,-100,100,100,,105,110,-115,110,,145,,,145,,355,90,SBD,Raw,No,Masters 50-54,53,1962-06-17
1,M,Vyacheslav Khorkov,Вячеслав Хорьков,89.4,210,220,-230,220,,145,-152.5,-152.5,145,,220,230,235,235,,600,90,SBD,Wraps,Yes,Open,36,1979-10-25
1,M,Evgeniy Pedurets,Евгений Пэдурец,78.4,155,160,165,165,,85,90,-95,90,,180,,,180,,435,82.5,SBD,Raw,Yes,Teen 16-17,17,1999-05-19
1,M,Roman Stepanov,Роман Степанов,89.6,250,270,280,280,,195,205,210,210,,255,265,275,275,,765,90,SBD,Single-ply,No,Juniors 20-23,22,1993-08-14
1,F,Yuliya Kukina,Юлія Кукіна,54.8,90,100,-110,100,,50,-55,-55,50,,100,-120,-120,100,,250,56,SBD,Single-ply,Yes,Open,36,1980-04-25
1,M,Artur Mamedov,Артур Мамедов,127.3,-300,300,320,320,,-190,190,-200,190,,230,250,260,260,,770,140,SBD,Single-ply,Yes,Open,28,1987-09-09
1,M,Mikhail Sizykh,Михаил Сизых,89.1,100,,,100,,,,,,,,,,,,100,90,S,Raw,No,Masters 50-54,53,1962-06-17
1,M,Dmitriy Kvasha,Дмитрий Кваша,88.4,170,-180,-180,170,,,,,,,,,,,,170,90,S,Raw,Yes,Open,30,1985-06-11
1,M,Kirill Bogdanov,Кирилл Богданов,74,,,,,,135,-145,-145,135,,,,,,,135,75,B,Raw,No,Open,31,1984-06-01
1,M,Egor Gorlov,Егор Горлов,81.5,,,,,,110,120,-125,120,,,,,,,120,82.5,B,Raw,No,Teen 16-17,16,1999-06-21
1,M,Aleksandr Leonov,Александр Леонов,80.6,,,,,,95,-100,100,100,,,,,,,100,82.5,B,Raw,No,Masters 55-59,56,1959-06-11
1,M,Mikhail Sizykh,Михаил Сизых,89.1,,,,,,110,,,110,,,,,,,110,90,B,Raw,No,Masters 50-54,53,1962-06-17
1,M,Ivan Karpinchik,Иван Карпинчик,97.3,,,,,,140,-150,-150,140,,,,,,,140,100,B,Raw,No,Open,35,1981-03-02
1,M,Aleksandr Kadochnikov,Александр Кадочников,103.5,,,,,,200,210,-222.5,210,,,,,,,210,110,B,Raw,No,Open,25,1990-07-26
1,M,Gleb Isaev,Глеб Исаев,64.8,,,,,,70,75,77.5,77.5,,,,,,,77.5,67.5,B,Raw,Yes,Teen 13-15,13,2003-01-05
1,M,Vladimir Blashchitsin,Владимир Блащицин,63.9,,,,,,100,107.5,-110,107.5,,,,,,,107.5,67.5,B,Raw,Yes,Open,30,1985-11-13
1,M,Evgeniy Sorokin,Евгений Сорокин,81.4,,,,,,140,145,150,150,,,,,,,150,82.5,B,Raw,Yes,Open,39,1977-02-11
1,M,Denis Zaytsev,Денис Зайцев,88.7,,,,,,145,152.5,-157.5,152.5,,,,,,,152.5,90,B,Raw,Yes,Open,33,1983-02-22
2,M,Dmitriy Kvasha,Дмитрий Кваша,88.4,,,,,,132.5,-140,,132.5,,,,,,,132.5,90,B,Raw,Yes,Open,30,1985-06-11
DQ,M,Maksim Levin,Максим Левин,89.8,,,,,,-147.5,-152.5,-152.5,,,,,,,,,90,B,Raw,Yes,Open,27,1988-10-04
1,M,Ruslan Andreev,Руслан Андреєв,109,,,,,,220,232.5,-240,232.5,,,,,,,232.5,110,B,Single-ply,No,Open,38,1977-06-21
1,M,Artem Kupryashov,Артем Купряшов,81.9,,,,,,115,125,132.5,132.5,,,,,,,132.5,82.5,B,Raw,No,Open,27,1989-04-05
2,M,Dmitriy Pavlov,Дмитрий Павлов,81.5,,,,,,102.5,107.5,-110,107.5,,,,,,,107.5,82.5,B,Raw,No,Open,30,1986-03-14
1,M,Andrey Shibanov,Андрей Шибанов,86.1,,,,,,155,162.5,170,170,,,,,,,170,90,B,Raw,No,Masters 40-44,40,1975-10-09
1,M,Aleksandr Vdovichenko,Александр Вдовиченко,92,,,,,,110,115,122.5,122.5,,,,,,,122.5,100,B,Raw,No,Open,30,1986-02-10
1,F,Elena Konyushenko,Елена Конюшенко,67.4,,,,,,,,,,,-135,135,140,140,,140,67.5,D,Raw,No,Open,31,1985-03-11
1,M,Mikhail Sizykh,Михаил Сизых,89.1,,,,,,,,,,,145,,,145,,145,90,D,Raw,No,Masters 50-54,53,1962-06-17
1,M,Evgeniy Pedurets,Евгений Пэдурец,78.4,,,,,,,,,,,180,-190,,180,,180,82.5,D,Raw,Yes,Teen 16-17,17,1999-05-19
1,M,Vyacheslav Khorkov,Вячеслав Хорьков,89.4,,,,,,,,,,,235,,,235,,235,90,D,Raw,Yes,Open,36,1979-10-25
