<svg xmlns="http://www.w3.org/2000/svg" xmlns:xlink="http://www.w3.org/1999/xlink" width="12" height="12" viewBox="0 0 12 12">
  <defs>
    <clipPath id="clip-path">
      <rect id="Rectangle_21" data-name="Rectangle 21" width="12" height="12" transform="translate(-0.029 -0.105)" fill="#ff0404" stroke="#707070" stroke-width="1"/>
    </clipPath>
  </defs>
  <g id="Mask_Group_21" data-name="Mask Group 21" transform="translate(0.029 0.105)" clip-path="url(#clip-path)">
    <path id="customer" d="M8.988,3.636A3.134,3.134,0,0,0,5.751,6.642a2.964,2.964,0,0,0,1.431,2.5,4.314,4.314,0,0,0-2.818,3.945h.925a3.568,3.568,0,0,1,3.7-3.435,3.568,3.568,0,0,1,3.7,3.435h.925a4.314,4.314,0,0,0-2.818-3.945,2.965,2.965,0,0,0,1.431-2.5A3.134,3.134,0,0,0,8.988,3.636Zm0,.859A2.227,2.227,0,0,1,11.3,6.642,2.227,2.227,0,0,1,8.988,8.789,2.227,2.227,0,0,1,6.676,6.642,2.227,2.227,0,0,1,8.988,4.5Z" transform="translate(-3.038 -2.187)" fill="#ff0404"/>
  </g>
</svg>
