{
  "environment": "development",
  "port": ":7777",
  "csrf": {
    "development": {
      "authenticationKey": "G3NeRAteR4nD0m32Ch4racTErAuThKEY"
    },
    "production": {
      "authenticationKey": "G3NeRAteR4nD0m32Ch4racTErAuThKEY"
    }
  },
  "session": {
    "development": {
      "domain": "localhost",
      "authenticationKey": "GenerateRandom64CharacterAuthKeyGenerateRandom64CharacterAuthKey",
      "encryptionKey": "GenerateRand32CharsEncryptionKey"
    },
    "production": {
      "domain": "youtube-dlmp3.com",
      "authenticationKey": "GenerateRandom64CharacterAuthKeyGenerateRandom64CharacterAuthKey",
      "encryptionKey": "GenerateRand32CharsEncryptionKey"
    }
  }
}
