%YAML 1.1
%TAG !u! tag:unity3d.com,2011:
--- !u!1 &4556080338232838132
GameObject:
  m_ObjectHideFlags: 0
  m_CorrespondingSourceObject: {fileID: 0}
  m_PrefabInstance: {fileID: 0}
  m_PrefabAsset: {fileID: 0}
  serializedVersion: 6
  m_Component:
  - component: {fileID: 4556080338232838131}
  m_Layer: 0
  m_Name: Room_W
  m_TagString: Untagged
  m_Icon: {fileID: 0}
  m_NavMeshLayer: 0
  m_StaticEditorFlags: 0
  m_IsActive: 1
--- !u!4 &4556080338232838131
Transform:
  m_ObjectHideFlags: 0
  m_CorrespondingSourceObject: {fileID: 0}
  m_PrefabInstance: {fileID: 0}
  m_PrefabAsset: {fileID: 0}
  m_GameObject: {fileID: 4556080338232838132}
  m_LocalRotation: {x: 0, y: 0, z: 0, w: 1}
  m_LocalPosition: {x: 0, y: 0, z: 0}
  m_LocalScale: {x: 2, y: 2, z: 2}
  m_Children:
  - {fileID: 4556080338787225328}
  - {fileID: 4556080338278431489}
  m_Father: {fileID: 0}
  m_RootOrder: 0
  m_LocalEulerAnglesHint: {x: 0, y: 0, z: 0}
--- !u!1 &4556080338278431490
GameObject:
  m_ObjectHideFlags: 0
  m_CorrespondingSourceObject: {fileID: 0}
  m_PrefabInstance: {fileID: 0}
  m_PrefabAsset: {fileID: 0}
  serializedVersion: 6
  m_Component:
  - component: {fileID: 4556080338278431489}
  m_Layer: 0
  m_Name: Walls
  m_TagString: Untagged
  m_Icon: {fileID: 0}
  m_NavMeshLayer: 0
  m_StaticEditorFlags: 0
  m_IsActive: 1
--- !u!4 &4556080338278431489
Transform:
  m_ObjectHideFlags: 0
  m_CorrespondingSourceObject: {fileID: 0}
  m_PrefabInstance: {fileID: 0}
  m_PrefabAsset: {fileID: 0}
  m_GameObject: {fileID: 4556080338278431490}
  m_LocalRotation: {x: -0, y: -0, z: -0, w: 1}
  m_LocalPosition: {x: 0, y: 0, z: 0}
  m_LocalScale: {x: 1, y: 1, z: 1}
  m_Children:
  - {fileID: 2714799286313456994}
  - {fileID: 808515941263576179}
  - {fileID: 2301722721458840977}
  - {fileID: 8584616642666935975}
  m_Father: {fileID: 4556080338232838131}
  m_RootOrder: 1
  m_LocalEulerAnglesHint: {x: 0, y: 0, z: 0}
--- !u!1 &4556080338787225329
GameObject:
  m_ObjectHideFlags: 0
  m_CorrespondingSourceObject: {fileID: 0}
  m_PrefabInstance: {fileID: 0}
  m_PrefabAsset: {fileID: 0}
  serializedVersion: 6
  m_Component:
  - component: {fileID: 4556080338787225328}
  - component: {fileID: 4556080338787225293}
  - component: {fileID: 4556080338787225294}
  - component: {fileID: 4556080338787225295}
  m_Layer: 0
  m_Name: Floor
  m_TagString: Floor
  m_Icon: {fileID: 0}
  m_NavMeshLayer: 0
  m_StaticEditorFlags: 0
  m_IsActive: 1
--- !u!4 &4556080338787225328
Transform:
  m_ObjectHideFlags: 0
  m_CorrespondingSourceObject: {fileID: 0}
  m_PrefabInstance: {fileID: 0}
  m_PrefabAsset: {fileID: 0}
  m_GameObject: {fileID: 4556080338787225329}
  m_LocalRotation: {x: -0, y: -0, z: -0, w: 1}
  m_LocalPosition: {x: 0, y: 0, z: 0}
  m_LocalScale: {x: 1, y: 1, z: 1}
  m_Children: []
  m_Father: {fileID: 4556080338232838131}
  m_RootOrder: 0
  m_LocalEulerAnglesHint: {x: 0, y: 0, z: 0}
--- !u!33 &4556080338787225293
MeshFilter:
  m_ObjectHideFlags: 0
  m_CorrespondingSourceObject: {fileID: 0}
  m_PrefabInstance: {fileID: 0}
  m_PrefabAsset: {fileID: 0}
  m_GameObject: {fileID: 4556080338787225329}
  m_Mesh: {fileID: 10209, guid: 0000000000000000e000000000000000, type: 0}
--- !u!23 &4556080338787225294
MeshRenderer:
  m_ObjectHideFlags: 0
  m_CorrespondingSourceObject: {fileID: 0}
  m_PrefabInstance: {fileID: 0}
  m_PrefabAsset: {fileID: 0}
  m_GameObject: {fileID: 4556080338787225329}
  m_Enabled: 1
  m_CastShadows: 1
  m_ReceiveShadows: 1
  m_DynamicOccludee: 1
  m_MotionVectors: 1
  m_LightProbeUsage: 1
  m_ReflectionProbeUsage: 1
  m_RenderingLayerMask: 1
  m_RendererPriority: 0
  m_Materials:
  - {fileID: 10303, guid: 0000000000000000f000000000000000, type: 0}
  m_StaticBatchInfo:
    firstSubMesh: 0
    subMeshCount: 0
  m_StaticBatchRoot: {fileID: 0}
  m_ProbeAnchor: {fileID: 0}
  m_LightProbeVolumeOverride: {fileID: 0}
  m_ScaleInLightmap: 1
  m_ReceiveGI: 1
  m_PreserveUVs: 0
  m_IgnoreNormalsForChartDetection: 0
  m_ImportantGI: 0
  m_StitchLightmapSeams: 1
  m_SelectedEditorRenderState: 3
  m_MinimumChartSize: 4
  m_AutoUVMaxDistance: 0.5
  m_AutoUVMaxAngle: 89
  m_LightmapParameters: {fileID: 0}
  m_SortingLayerID: 0
  m_SortingLayer: 0
  m_SortingOrder: 0
--- !u!64 &4556080338787225295
MeshCollider:
  m_ObjectHideFlags: 0
  m_CorrespondingSourceObject: {fileID: 0}
  m_PrefabInstance: {fileID: 0}
  m_PrefabAsset: {fileID: 0}
  m_GameObject: {fileID: 4556080338787225329}
  m_Material: {fileID: 0}
  m_IsTrigger: 0
  m_Enabled: 1
  serializedVersion: 3
  m_Convex: 0
  m_CookingOptions: 14
  m_Mesh: {fileID: 10209, guid: 0000000000000000e000000000000000, type: 0}
--- !u!1001 &3108295309493203381
PrefabInstance:
  m_ObjectHideFlags: 0
  serializedVersion: 2
  m_Modification:
    m_TransformParent: {fileID: 4556080338278431489}
    m_Modifications:
    - target: {fileID: 6629383623060178705, guid: 2740a453d720f4e1388853887636a13a,
        type: 3}
      propertyPath: m_Name
      value: Wall_Door
      objectReference: {fileID: 0}
    - target: {fileID: 6629383623060178706, guid: 2740a453d720f4e1388853887636a13a,
        type: 3}
      propertyPath: m_LocalPosition.x
      value: -3.999999
      objectReference: {fileID: 0}
    - target: {fileID: 6629383623060178706, guid: 2740a453d720f4e1388853887636a13a,
        type: 3}
      propertyPath: m_LocalPosition.y
      value: 0
      objectReference: {fileID: 0}
    - target: {fileID: 6629383623060178706, guid: 2740a453d720f4e1388853887636a13a,
        type: 3}
      propertyPath: m_LocalPosition.z
      value: -0.0000041656394
      objectReference: {fileID: 0}
    - target: {fileID: 6629383623060178706, guid: 2740a453d720f4e1388853887636a13a,
        type: 3}
      propertyPath: m_LocalRotation.x
      value: 0
      objectReference: {fileID: 0}
    - target: {fileID: 6629383623060178706, guid: 2740a453d720f4e1388853887636a13a,
        type: 3}
      propertyPath: m_LocalRotation.y
      value: 0.7071068
      objectReference: {fileID: 0}
    - target: {fileID: 6629383623060178706, guid: 2740a453d720f4e1388853887636a13a,
        type: 3}
      propertyPath: m_LocalRotation.z
      value: 0
      objectReference: {fileID: 0}
    - target: {fileID: 6629383623060178706, guid: 2740a453d720f4e1388853887636a13a,
        type: 3}
      propertyPath: m_LocalRotation.w
      value: 0.7071068
      objectReference: {fileID: 0}
    - target: {fileID: 6629383623060178706, guid: 2740a453d720f4e1388853887636a13a,
        type: 3}
      propertyPath: m_RootOrder
      value: 3
      objectReference: {fileID: 0}
    - target: {fileID: 6629383623060178706, guid: 2740a453d720f4e1388853887636a13a,
        type: 3}
      propertyPath: m_LocalEulerAnglesHint.x
      value: 0
      objectReference: {fileID: 0}
    - target: {fileID: 6629383623060178706, guid: 2740a453d720f4e1388853887636a13a,
        type: 3}
      propertyPath: m_LocalEulerAnglesHint.y
      value: 90
      objectReference: {fileID: 0}
    - target: {fileID: 6629383623060178706, guid: 2740a453d720f4e1388853887636a13a,
        type: 3}
      propertyPath: m_LocalEulerAnglesHint.z
      value: 0
      objectReference: {fileID: 0}
    - target: {fileID: 6629383623060178710, guid: 2740a453d720f4e1388853887636a13a,
        type: 3}
      propertyPath: m_Mesh
      value: 
      objectReference: {fileID: 0}
    - target: {fileID: 6629383623060178707, guid: 2740a453d720f4e1388853887636a13a,
        type: 3}
      propertyPath: m_Mesh
      value: 
      objectReference: {fileID: 0}
    m_RemovedComponents: []
  m_SourcePrefab: {fileID: 100100000, guid: 2740a453d720f4e1388853887636a13a, type: 3}
--- !u!4 &8584616642666935975 stripped
Transform:
  m_CorrespondingSourceObject: {fileID: 6629383623060178706, guid: 2740a453d720f4e1388853887636a13a,
    type: 3}
  m_PrefabInstance: {fileID: 3108295309493203381}
  m_PrefabAsset: {fileID: 0}
--- !u!1001 &4895713894769926787
PrefabInstance:
  m_ObjectHideFlags: 0
  serializedVersion: 2
  m_Modification:
    m_TransformParent: {fileID: 4556080338278431489}
    m_Modifications:
    - target: {fileID: 6629383623060178705, guid: 15a73317299fc4fd79d12a73bcb5993e,
        type: 3}
      propertyPath: m_Name
      value: Wall (2)
      objectReference: {fileID: 0}
    - target: {fileID: 6629383623060178706, guid: 15a73317299fc4fd79d12a73bcb5993e,
        type: 3}
      propertyPath: m_LocalPosition.x
      value: 4
      objectReference: {fileID: 0}
    - target: {fileID: 6629383623060178706, guid: 15a73317299fc4fd79d12a73bcb5993e,
        type: 3}
      propertyPath: m_LocalPosition.y
      value: 0
      objectReference: {fileID: 0}
    - target: {fileID: 6629383623060178706, guid: 15a73317299fc4fd79d12a73bcb5993e,
        type: 3}
      propertyPath: m_LocalPosition.z
      value: 0
      objectReference: {fileID: 0}
    - target: {fileID: 6629383623060178706, guid: 15a73317299fc4fd79d12a73bcb5993e,
        type: 3}
      propertyPath: m_LocalRotation.x
      value: -0
      objectReference: {fileID: 0}
    - target: {fileID: 6629383623060178706, guid: 15a73317299fc4fd79d12a73bcb5993e,
        type: 3}
      propertyPath: m_LocalRotation.y
      value: -0.70710677
      objectReference: {fileID: 0}
    - target: {fileID: 6629383623060178706, guid: 15a73317299fc4fd79d12a73bcb5993e,
        type: 3}
      propertyPath: m_LocalRotation.z
      value: -0
      objectReference: {fileID: 0}
    - target: {fileID: 6629383623060178706, guid: 15a73317299fc4fd79d12a73bcb5993e,
        type: 3}
      propertyPath: m_LocalRotation.w
      value: 0.7071068
      objectReference: {fileID: 0}
    - target: {fileID: 6629383623060178706, guid: 15a73317299fc4fd79d12a73bcb5993e,
        type: 3}
      propertyPath: m_RootOrder
      value: 2
      objectReference: {fileID: 0}
    - target: {fileID: 6629383623060178706, guid: 15a73317299fc4fd79d12a73bcb5993e,
        type: 3}
      propertyPath: m_LocalEulerAnglesHint.x
      value: 0
      objectReference: {fileID: 0}
    - target: {fileID: 6629383623060178706, guid: 15a73317299fc4fd79d12a73bcb5993e,
        type: 3}
      propertyPath: m_LocalEulerAnglesHint.y
      value: -90.00001
      objectReference: {fileID: 0}
    - target: {fileID: 6629383623060178706, guid: 15a73317299fc4fd79d12a73bcb5993e,
        type: 3}
      propertyPath: m_LocalEulerAnglesHint.z
      value: 0
      objectReference: {fileID: 0}
    - target: {fileID: 6629383623060178710, guid: 15a73317299fc4fd79d12a73bcb5993e,
        type: 3}
      propertyPath: m_Mesh
      value: 
      objectReference: {fileID: 0}
    - target: {fileID: 6629383623060178707, guid: 15a73317299fc4fd79d12a73bcb5993e,
        type: 3}
      propertyPath: m_Mesh
      value: 
      objectReference: {fileID: 0}
    m_RemovedComponents: []
  m_SourcePrefab: {fileID: 100100000, guid: 15a73317299fc4fd79d12a73bcb5993e, type: 3}
--- !u!4 &2301722721458840977 stripped
Transform:
  m_CorrespondingSourceObject: {fileID: 6629383623060178706, guid: 15a73317299fc4fd79d12a73bcb5993e,
    type: 3}
  m_PrefabInstance: {fileID: 4895713894769926787}
  m_PrefabAsset: {fileID: 0}
--- !u!1001 &6284810324055608161
PrefabInstance:
  m_ObjectHideFlags: 0
  serializedVersion: 2
  m_Modification:
    m_TransformParent: {fileID: 4556080338278431489}
    m_Modifications:
    - target: {fileID: 6629383623060178705, guid: 15a73317299fc4fd79d12a73bcb5993e,
        type: 3}
      propertyPath: m_Name
      value: Wall (1)
      objectReference: {fileID: 0}
    - target: {fileID: 6629383623060178706, guid: 15a73317299fc4fd79d12a73bcb5993e,
        type: 3}
      propertyPath: m_LocalPosition.x
      value: 0
      objectReference: {fileID: 0}
    - target: {fileID: 6629383623060178706, guid: 15a73317299fc4fd79d12a73bcb5993e,
        type: 3}
      propertyPath: m_LocalPosition.y
      value: 0
      objectReference: {fileID: 0}
    - target: {fileID: 6629383623060178706, guid: 15a73317299fc4fd79d12a73bcb5993e,
        type: 3}
      propertyPath: m_LocalPosition.z
      value: -4
      objectReference: {fileID: 0}
    - target: {fileID: 6629383623060178706, guid: 15a73317299fc4fd79d12a73bcb5993e,
        type: 3}
      propertyPath: m_LocalRotation.x
      value: -0
      objectReference: {fileID: 0}
    - target: {fileID: 6629383623060178706, guid: 15a73317299fc4fd79d12a73bcb5993e,
        type: 3}
      propertyPath: m_LocalRotation.y
      value: -0
      objectReference: {fileID: 0}
    - target: {fileID: 6629383623060178706, guid: 15a73317299fc4fd79d12a73bcb5993e,
        type: 3}
      propertyPath: m_LocalRotation.z
      value: -0
      objectReference: {fileID: 0}
    - target: {fileID: 6629383623060178706, guid: 15a73317299fc4fd79d12a73bcb5993e,
        type: 3}
      propertyPath: m_LocalRotation.w
      value: 1
      objectReference: {fileID: 0}
    - target: {fileID: 6629383623060178706, guid: 15a73317299fc4fd79d12a73bcb5993e,
        type: 3}
      propertyPath: m_RootOrder
      value: 1
      objectReference: {fileID: 0}
    - target: {fileID: 6629383623060178706, guid: 15a73317299fc4fd79d12a73bcb5993e,
        type: 3}
      propertyPath: m_LocalEulerAnglesHint.x
      value: 0
      objectReference: {fileID: 0}
    - target: {fileID: 6629383623060178706, guid: 15a73317299fc4fd79d12a73bcb5993e,
        type: 3}
      propertyPath: m_LocalEulerAnglesHint.y
      value: 0
      objectReference: {fileID: 0}
    - target: {fileID: 6629383623060178706, guid: 15a73317299fc4fd79d12a73bcb5993e,
        type: 3}
      propertyPath: m_LocalEulerAnglesHint.z
      value: 0
      objectReference: {fileID: 0}
    - target: {fileID: 6629383623060178710, guid: 15a73317299fc4fd79d12a73bcb5993e,
        type: 3}
      propertyPath: m_Mesh
      value: 
      objectReference: {fileID: 0}
    - target: {fileID: 6629383623060178707, guid: 15a73317299fc4fd79d12a73bcb5993e,
        type: 3}
      propertyPath: m_Mesh
      value: 
      objectReference: {fileID: 0}
    m_RemovedComponents: []
  m_SourcePrefab: {fileID: 100100000, guid: 15a73317299fc4fd79d12a73bcb5993e, type: 3}
--- !u!4 &808515941263576179 stripped
Transform:
  m_CorrespondingSourceObject: {fileID: 6629383623060178706, guid: 15a73317299fc4fd79d12a73bcb5993e,
    type: 3}
  m_PrefabInstance: {fileID: 6284810324055608161}
  m_PrefabAsset: {fileID: 0}
--- !u!1001 &8767570413996331632
PrefabInstance:
  m_ObjectHideFlags: 0
  serializedVersion: 2
  m_Modification:
    m_TransformParent: {fileID: 4556080338278431489}
    m_Modifications:
    - target: {fileID: 6629383623060178705, guid: 15a73317299fc4fd79d12a73bcb5993e,
        type: 3}
      propertyPath: m_Name
      value: Wall
      objectReference: {fileID: 0}
    - target: {fileID: 6629383623060178706, guid: 15a73317299fc4fd79d12a73bcb5993e,
        type: 3}
      propertyPath: m_LocalPosition.x
      value: -0.06533949
      objectReference: {fileID: 0}
    - target: {fileID: 6629383623060178706, guid: 15a73317299fc4fd79d12a73bcb5993e,
        type: 3}
      propertyPath: m_LocalPosition.y
      value: 0
      objectReference: {fileID: 0}
    - target: {fileID: 6629383623060178706, guid: 15a73317299fc4fd79d12a73bcb5993e,
        type: 3}
      propertyPath: m_LocalPosition.z
      value: 4
      objectReference: {fileID: 0}
    - target: {fileID: 6629383623060178706, guid: 15a73317299fc4fd79d12a73bcb5993e,
        type: 3}
      propertyPath: m_LocalRotation.x
      value: 0
      objectReference: {fileID: 0}
    - target: {fileID: 6629383623060178706, guid: 15a73317299fc4fd79d12a73bcb5993e,
        type: 3}
      propertyPath: m_LocalRotation.y
      value: -1
      objectReference: {fileID: 0}
    - target: {fileID: 6629383623060178706, guid: 15a73317299fc4fd79d12a73bcb5993e,
        type: 3}
      propertyPath: m_LocalRotation.z
      value: 0
      objectReference: {fileID: 0}
    - target: {fileID: 6629383623060178706, guid: 15a73317299fc4fd79d12a73bcb5993e,
        type: 3}
      propertyPath: m_LocalRotation.w
      value: 0
      objectReference: {fileID: 0}
    - target: {fileID: 6629383623060178706, guid: 15a73317299fc4fd79d12a73bcb5993e,
        type: 3}
      propertyPath: m_RootOrder
      value: 0
      objectReference: {fileID: 0}
    - target: {fileID: 6629383623060178706, guid: 15a73317299fc4fd79d12a73bcb5993e,
        type: 3}
      propertyPath: m_LocalEulerAnglesHint.x
      value: 0
      objectReference: {fileID: 0}
    - target: {fileID: 6629383623060178706, guid: 15a73317299fc4fd79d12a73bcb5993e,
        type: 3}
      propertyPath: m_LocalEulerAnglesHint.y
      value: -180
      objectReference: {fileID: 0}
    - target: {fileID: 6629383623060178706, guid: 15a73317299fc4fd79d12a73bcb5993e,
        type: 3}
      propertyPath: m_LocalEulerAnglesHint.z
      value: 0
      objectReference: {fileID: 0}
    - target: {fileID: 6629383623060178710, guid: 15a73317299fc4fd79d12a73bcb5993e,
        type: 3}
      propertyPath: m_Mesh
      value: 
      objectReference: {fileID: 0}
    - target: {fileID: 6629383623060178707, guid: 15a73317299fc4fd79d12a73bcb5993e,
        type: 3}
      propertyPath: m_Mesh
      value: 
      objectReference: {fileID: 0}
    m_RemovedComponents: []
  m_SourcePrefab: {fileID: 100100000, guid: 15a73317299fc4fd79d12a73bcb5993e, type: 3}
--- !u!4 &2714799286313456994 stripped
Transform:
  m_CorrespondingSourceObject: {fileID: 6629383623060178706, guid: 15a73317299fc4fd79d12a73bcb5993e,
    type: 3}
  m_PrefabInstance: {fileID: 8767570413996331632}
  m_PrefabAsset: {fileID: 0}
