%YAML 1.1
%TAG !u! tag:unity3d.com,2011:
--- !u!1 &8357346051350871229
GameObject:
  m_ObjectHideFlags: 0
  m_CorrespondingSourceObject: {fileID: 0}
  m_PrefabInstance: {fileID: 0}
  m_PrefabAsset: {fileID: 0}
  serializedVersion: 6
  m_Component:
  - component: {fileID: 1035549819051491166}
  m_Layer: 0
  m_Name: Wall_IndentBigRev
  m_TagString: Untagged
  m_Icon: {fileID: 0}
  m_NavMeshLayer: 0
  m_StaticEditorFlags: 0
  m_IsActive: 1
--- !u!4 &1035549819051491166
Transform:
  m_ObjectHideFlags: 0
  m_CorrespondingSourceObject: {fileID: 0}
  m_PrefabInstance: {fileID: 0}
  m_PrefabAsset: {fileID: 0}
  m_GameObject: {fileID: 8357346051350871229}
  m_LocalRotation: {x: 0, y: 0, z: 0, w: 1}
  m_LocalPosition: {x: 0, y: 0, z: 0}
  m_LocalScale: {x: 1, y: 1, z: 1}
  m_Children:
  - {fileID: 5175540466464841483}
  m_Father: {fileID: 0}
  m_RootOrder: 0
  m_LocalEulerAnglesHint: {x: 0, y: 0, z: 0}
--- !u!1001 &191827861954524177
PrefabInstance:
  m_ObjectHideFlags: 0
  serializedVersion: 2
  m_Modification:
    m_TransformParent: {fileID: 1035549819051491166}
    m_Modifications:
    - target: {fileID: -927199367670048503, guid: 34f76d3e4a0a0304095cba16317dcbdd,
        type: 3}
      propertyPath: m_Name
      value: Wall_IndentBigRev
      objectReference: {fileID: 0}
    - target: {fileID: -4216859302048453862, guid: 34f76d3e4a0a0304095cba16317dcbdd,
        type: 3}
      propertyPath: m_LocalPosition.x
      value: 0
      objectReference: {fileID: 0}
    - target: {fileID: -4216859302048453862, guid: 34f76d3e4a0a0304095cba16317dcbdd,
        type: 3}
      propertyPath: m_LocalPosition.y
      value: 0
      objectReference: {fileID: 0}
    - target: {fileID: -4216859302048453862, guid: 34f76d3e4a0a0304095cba16317dcbdd,
        type: 3}
      propertyPath: m_LocalPosition.z
      value: 0
      objectReference: {fileID: 0}
    - target: {fileID: -4216859302048453862, guid: 34f76d3e4a0a0304095cba16317dcbdd,
        type: 3}
      propertyPath: m_LocalRotation.x
      value: 0
      objectReference: {fileID: 0}
    - target: {fileID: -4216859302048453862, guid: 34f76d3e4a0a0304095cba16317dcbdd,
        type: 3}
      propertyPath: m_LocalRotation.y
      value: 0
      objectReference: {fileID: 0}
    - target: {fileID: -4216859302048453862, guid: 34f76d3e4a0a0304095cba16317dcbdd,
        type: 3}
      propertyPath: m_LocalRotation.z
      value: 0
      objectReference: {fileID: 0}
    - target: {fileID: -4216859302048453862, guid: 34f76d3e4a0a0304095cba16317dcbdd,
        type: 3}
      propertyPath: m_LocalRotation.w
      value: 1
      objectReference: {fileID: 0}
    - target: {fileID: -4216859302048453862, guid: 34f76d3e4a0a0304095cba16317dcbdd,
        type: 3}
      propertyPath: m_RootOrder
      value: 0
      objectReference: {fileID: 0}
    - target: {fileID: -4216859302048453862, guid: 34f76d3e4a0a0304095cba16317dcbdd,
        type: 3}
      propertyPath: m_LocalEulerAnglesHint.x
      value: 0
      objectReference: {fileID: 0}
    - target: {fileID: -4216859302048453862, guid: 34f76d3e4a0a0304095cba16317dcbdd,
        type: 3}
      propertyPath: m_LocalEulerAnglesHint.y
      value: 0
      objectReference: {fileID: 0}
    - target: {fileID: -4216859302048453862, guid: 34f76d3e4a0a0304095cba16317dcbdd,
        type: 3}
      propertyPath: m_LocalEulerAnglesHint.z
      value: 0
      objectReference: {fileID: 0}
    m_RemovedComponents: []
  m_SourcePrefab: {fileID: 100100000, guid: 34f76d3e4a0a0304095cba16317dcbdd, type: 3}
--- !u!4 &5175540466464841483 stripped
Transform:
  m_CorrespondingSourceObject: {fileID: -4216859302048453862, guid: 34f76d3e4a0a0304095cba16317dcbdd,
    type: 3}
  m_PrefabInstance: {fileID: 191827861954524177}
  m_PrefabAsset: {fileID: 0}
