[
	{
		"text": "How many Services exist on the system?",
		"subtext": "in the current(default) namespace",
		"hint": "Run the command 'kubectl get service' and count the number of services.",
		"type": "multiple_choice",
		"options": [
			"0",
			"1",
			"2",
			"3",
			"4"
		],
		"answer": "1"
	},
	{
		"text": "That is a default service created by Kubernetes at launch.",
		"type": "info",
		"options": [
			"Ok"
		],
		"answer": "Ok"
	},
	{
		"text": "What is the type of the default 'kubernetes' service?",
		"hint": "Run the command 'kubectl get service' and look at the Type column.",
		"type": "multiple_choice",
		"options": [
			"LoadBalancer",
			"NodePort",
			"ClusterIP",
			"External"
		],
		"answer": "ClusterIP"
	},
	{
		"text": "What is the 'targetPort' configured on the 'kubernetes' service?",
		"hint": "Run the command 'kubectl describe service' and look at TargetPort.",
		"type": "multiple_choice",
		"options": [
			"8080",
			"443",
			"10.96.0.1",
			"6443"
		],
		"answer": "6443"
	},
	{
		"text": "How many labels are configured on the 'kubernetes' service?",
		"hint": "Run the command 'kubectl describe service' and look at Labels.",
		"type": "multiple_choice",
		"options": [
			"0",
			"1",
			"2",
			"3"
		],
		"answer": "2"
	},
	{
		"text": "How many Endpoints are attached on the 'kubernetes' service?",
		"hint": "Run the command 'kubectl describe service' and look at Endpoints.",
		"type": "multiple_choice",
		"options": [
			"0",
			"1",
			"2",
			"3"
		],
		"answer": "1"
	},
	{
		"text": "How many Deployments exist on the system now?",
		"hint": "Run the command 'kubectl get deployment' and count the number of pods.",
		"subtext": "in the current(default) namespace",
		"type": "multiple_choice",
		"options": [
			"0",
			"1",
			"2",
			"3",
			"4"
		],
		"answer": "1",
		"before": {
			"type": "kubernetes",
			"action": "create",
			"config": {
				"apiVersion": "apps/v1",
				"kind": "Deployment",
				"metadata": {
					"name": "simple-webapp-deployment"
				},
				"spec": {
					"replicas": 4,
					"selector": {
						"matchLabels": {
							"name": "simple-webapp"
						}
					},
					"template": {
						"metadata": {
							"labels": {
								"name": "simple-webapp"
							}
						},
						"spec": {
							"containers": [
								{
									"name": "simple-webapp",
									"image": "kodekloud/simple-webapp:red",
									"ports": [
										{
											"containerPort": 8080
										}
									]
								}
							]
						}
					}
				}
			}
		}
	},
	{
		"text": "What is the image used to create the pods in the deployment?",
		"hint": "Run the command 'kubectl describe deployment' and look under the containers section.",
		"type": "multiple_choice",
		"options": [
			"NGINX",
			"BUSYBOX-CONTAINER",
			"kodekloud/simple-webapp:red",
			"BUSYBOX777",
			"BUSYBOX-POD"
		],
		"answer": "kodekloud/simple-webapp:red"
	},
	{
		"text": "Are you able to accesss the Web App UI?",
		"subtext": "Try to access the Web Application UI using the tab simple-webapp-ui above the terminal.",
		"type": "multiple_choice",
		"options": [
			"YES",
			"NO"
		],
		"answer": "NO"
	},
	{
		"text": "Create a new service to access the web application using the service-definition-1.yaml file",
		"subtext": "Name: webapp-service; Type: NodePort; targetPort: 8080; port: 8080; nodePort: 30080; selector: simple-webapp",
		"hint": "Update the given values in the service definition file and create the service",
		"type": "config_test",
		"tests": [
			{
				"type": "kubernetes",
				"object": "Service",
				"name": "webapp-service",
				"jmespath": "items[?metadata.name=='webapp-service'] | [].metadata.name",
				"state": "present"
			},
			{
				"type": "kubernetes",
				"object": "Service",
				"name": "NodePort",
				"err_message": "Service type is not NodePort",
				"jmespath": "items[?metadata.name=='webapp-service'] | [?spec.type=='NodePort'] | [].spec.type",
				"state": "present"
			},
			{
				"type": "kubernetes",
				"object": "Service",
				"name": 8080,
				"err_message": "Port not set to 8080",
				"jmespath": "items[?metadata.name=='webapp-service'] | [].spec.ports[] | [?port==`8080`] | [].port",
				"state": "present"
			},
			{
				"type": "kubernetes",
				"object": "Service",
				"name": 8080,
				"err_message": "TargetPort not set to 8080",
				"jmespath": "items[?metadata.name=='webapp-service'] | [].spec.ports[] | [?targetPort==`8080`] | [].targetPort",
				"state": "present"
			},
			{
				"type": "kubernetes",
				"object": "Service",
				"name": 30080,
				"err_message": "NodePort not set to 30080",
				"jmespath": "items[?metadata.name=='webapp-service'] | [].spec.ports[] | [?nodePort==`30080`] | [].nodePort",
				"state": "present"
			},
			{
				"type": "kubernetes",
				"object": "Service",
				"name": "simple-webapp",
				"err_message": "Selector not set to simple-webapp",
				"jmespath": "items[?metadata.name=='webapp-service'] | [].spec.selector.name",
				"state": "present"
			}
		]
	},
	{
		"text": "Access the web application using the tab 'simple-webapp-ui' above the terminal window.",
		"type": "info",
		"options": [
			"OK"
		],
		"answer": "OK"
	}
]
