<?xml version="1.0" encoding="UTF-8"?>
<session version="1.0">
<refactoring comment="Delete resource &apos;compiler&apos;" deleteContents="false" description="Delete resource &apos;compiler&apos;" element1="/compiler" flags="7" id="org.eclipse.ltk.core.refactoring.delete.resources" resources="1" stamp="1589539275406"/>
</session>