<svg width="225" height="122" viewBox="0 0 225 122" fill="none" xmlns="http://www.w3.org/2000/svg">
<path d="M186.597 0C167.673 0.000845594 149.073 4.94887 132.613 14.3607C116.152 23.7726 102.394 37.3266 92.6817 53.6996C86.0868 51.7578 79.2514 50.7726 72.381 50.7734C53.3111 50.7724 35.0112 58.3582 21.4581 71.8825C7.90497 85.4067 0.193741 103.776 0 123H398C396.567 113.97 391.988 105.751 385.086 99.8164C378.184 93.8823 369.411 90.622 360.339 90.6208C359.613 90.6258 358.887 90.6518 358.162 90.6987C352.424 77.5273 343.007 66.3249 331.059 58.4592C319.111 50.5936 305.15 46.4049 290.88 46.4047C286.135 46.4061 281.4 46.871 276.743 47.7928C266.685 33.0581 253.224 21.0097 237.52 12.686C221.816 4.36222 204.339 0.0127739 186.597 0.0122283V0Z" fill="white"/>
</svg>
