All defined variables:

File ../elf/dl-sysdep.c:
59:	int __GI___libc_enable_secure;
64:	void *__GI___libc_stack_end;
61:	int __libc_multiple_libcs;
66:	void *_dl_random;

File ../login/utmp_file.c:
39:	static int file_fd;
41:	static off64_t file_offset;
40:	static _Bool file_writable;
44:	static struct utmp last_entry;

File ../misc/syslog.c:
68:	static int LogFacility;
64:	static int LogFile;
69:	static int LogMask;
66:	static int LogStat;
67:	static const char *LogTag;
63:	static int LogType;
331:	static struct sockaddr_un SyslogAddr;
65:	static int connected;
73:	static __libc_lock_t syslog_lock;

File ../nss/getXXbyYY.c:
89:	static char *buffer;
86:	static __libc_lock_t lock;

File ../nss/getXXent.c:
65:	static char *buffer;
62:	static __libc_lock_t lock;

File ../nss/getXXent_r.c:
100:	static service_user *last_nip;
112:	static __libc_lock_t lock;
98:	static service_user *nip;
102:	static service_user *startp;
108:	static int stayopen_tmp;

File ../signal/allocrtsig.c:
33:	static int current_rtmax;
32:	static int current_rtmin;

File ../stdlib/strtol_l.c:
187:	const unsigned long __strtol_ul_max_tab[];
190:	const unsigned char __strtol_ul_rem_tab[];

File ../sysdeps/gnu/errlist.c:
19:	const char * const_sys_errlist_internal[135];
1486:	const int _sys_nerr_internal;

File ../sysdeps/gnu/siglist.c:
33:	const char * const__new_sys_sigabbrev[65];
25:	const char * const__new_sys_siglist[65];

File ../sysdeps/gnu/unwind-resume.c:
27:	void (*__libgcc_s_resume)(struct _Unwind_Exception *);
30:	static _Unwind_Reason_Code (*libgcc_s_personality)(int, _Unwind_Action, _Unwind_Exception_Class, struct _Unwind_Exception *, struct _Unwind_Context *);

File ../sysdeps/ieee754/dbl-64/wordsize-64/s_modf.c:
28:	static const double one;

File ../sysdeps/ieee754/dbl-64/wordsize-64/s_scalbn.c:
25:	static const double huge;
26:	static const double tiny;
23:	static const double two54;
24:	static const double twom54;

File ../sysdeps/ieee754/float128/../ldbl-128/s_frexpl.c:
35:	static const _Float128 two114;

File ../sysdeps/ieee754/float128/../ldbl-128/s_modfl.c:
34:	static const _Float128 one;

File ../sysdeps/ieee754/float128/../ldbl-128/s_scalbnl.c:
34:	static const _Float128 huge;
35:	static const _Float128 tiny;
32:	static const _Float128 two114;
33:	static const _Float128 twom114;

File ../sysdeps/ieee754/flt-32/s_frexpf.c:
25:	static const float two25;

File ../sysdeps/ieee754/flt-32/s_modff.c:
20:	static const float one;

File ../sysdeps/ieee754/flt-32/s_scalbnf.c:
22:	static const float huge;
23:	static const float tiny;
20:	static const float two25;
21:	static const float twom25;

File ../sysdeps/ieee754/ldbl-96/s_frexpl.c:
38:	static const long double two65;

File ../sysdeps/ieee754/ldbl-96/s_modfl.c:
31:	static const long double one;

File ../sysdeps/posix/gai_strerror.c:
48:	static const struct {
    int16_t code;
    uint16_t idx;
} msgidx[17];
36:	static const union msgstr_t msgstr;

File ../sysdeps/posix/getaddrinfo.c:
1692:	static const void *__elf_set___libc_subfreeres_element_fini__;
144:	static const struct addrinfo default_hints;
1234:	static const struct prefixentry default_labels[8];
1284:	static const struct prefixentry default_precedence[5];
1164:	static const struct scopeentry default_scopes[3];
1658:	static struct timespec gaiconf_mtime;
1650:	static int gaiconf_reload_flag;
1653:	static int gaiconf_reload_flag_ever_set;
125:	static const struct gaih_typeproto gaih_inet_typeproto[9];
1231:	static const struct prefixentry *labels;
109:	static const struct gaih_servtuple nullserv;
1281:	static const struct prefixentry *precedence;
1174:	static const struct scopeentry *scopes;

File ../sysdeps/posix/profil.c:
35:	static size_t nsamples;
36:	static size_t pc_offset;
37:	static u_int pc_scale;
34:	static u_short *samples;

File ../sysdeps/posix/signal.c:
24:	sigset_t _sigintr;

File ../sysdeps/posix/sprofil.c:
62:	static struct region default_overflow_region;
60:	static unsigned int overflow_counter;
72:	static struct prof_info prof_info;

File ../sysdeps/posix/system.c:
51:	static struct sigaction intr;
53:	static __libc_lock_t lock;
51:	static struct sigaction quit;
52:	static int sa_refcntr;

File ../sysdeps/posix/tempname.c:
167:	static const char letters[63];

File ../sysdeps/unix/bsd/getpt.c:
33:	const char __libc_ptyname1[17];
39:	const char __libc_ptyname2[17];

File ../sysdeps/unix/getlogin.c:
27:	static char name[33];

File ../sysdeps/unix/sysv/linux/check_pf.c:
365:	static const void *__elf_set___libc_subfreeres_element_freecache__;
65:	static struct cached_data *cache;
66:	static __libc_lock_t lock;
59:	static struct cached_data noai6ai_cached;

File ../sysdeps/unix/sysv/linux/internal-signals.h:
57:	static const sigset_t sigall_set;

File ../sysdeps/unix/sysv/linux/ptsname.c:
58:	static char buffer[30];

File ../sysdeps/unix/sysv/linux/sigstack.c:
63:	static const char __evoke_link_warning_sigstack[77];

File ../sysdeps/unix/sysv/linux/ttyname.c:
41:	static char *getttyname_name;
106:	static char *ttyname_buf;

File ../sysdeps/unix/sysv/linux/x86_64/brk.c:
24:	void *__curbrk;

File ../sysdeps/wordsize-64/../../io/ftw.c:
215:	static const int ftw_arr[7];
210:	static const int nftw_arr[7];

File ../sysdeps/x86/cacheinfo.c:
462:	long __x86_data_cache_size;
461:	long __x86_data_cache_size_half;
481:	int __x86_prefetchw;
466:	long __x86_raw_data_cache_size;
464:	long __x86_raw_data_cache_size_half;
474:	long __x86_raw_shared_cache_size;
472:	long __x86_raw_shared_cache_size_half;
470:	long __x86_shared_cache_size;
469:	long __x86_shared_cache_size_half;
477:	long __x86_shared_non_temporal_threshold;
35:	static const struct intel_02_cache_info intel_02_known[68];

File ../sysdeps/x86_64/multiarch/varshift.c:
21:	const int8_t ___m128i_shift_right[31];

File ./efgcvt-template.c:
40:	static char ecvt_buffer[20];
39:	static char fcvt_buffer[20];
41:	static char *fcvt_bufptr;
40:	static char qecvt_buffer[33];
39:	static char qfcvt_buffer[33];
41:	static char *qfcvt_bufptr;

File /build/glibc-SzIz7B/glibc-2.31/build-tree/amd64-libc/dl-tunable-list.h:
41:	static tunable_t tunable_list[26];

File /build/glibc-SzIz7B/glibc-2.31/build-tree/amd64-libc/intl/plural.c:
721:	static const yytype_int8 yycheck[55];
689:	static const yytype_int8 yydefact[27];
703:	static const yytype_int8 yydefgoto[3];
679:	static const yytype_int8 yypact[27];
697:	static const yytype_int8 yypgoto[3];
741:	static const yytype_int8 yyr1[14];
748:	static const yytype_int8 yyr2[14];
733:	static const yytype_int8 yystos[27];
711:	static const yytype_int8 yytable[55];
606:	static const yytype_int8 yytranslate[263];

File /build/glibc-SzIz7B/glibc-2.31/build-tree/amd64-libc/locale/C-translit.h:
3:	static const uint32_t translit_from_idx[1657];
145:	static const wchar_t translit_from_tbl[3314];
559:	static const uint32_t translit_to_idx[1657];
701:	static const wchar_t translit_to_tbl[5881];

File /build/glibc-SzIz7B/glibc-2.31/build-tree/amd64-libc/stdio-common/errlist-compat.c:
25:	const int __sys_nerr_GLIBC_2_1;
40:	const int __sys_nerr_GLIBC_2_3;
55:	const int __sys_nerr_GLIBC_2_4;
77:	static const char __evoke_link_warning_sys_errlist[68];
78:	static const char __evoke_link_warning_sys_nerr[65];

File C-address.c:
26:	const struct __locale_data _nl_C_LC_ADDRESS;

File C-collate.c:
101:	const struct __locale_data _nl_C_LC_COLLATE;
23:	static const char collseqmb[256];
59:	static const uint32_t collseqwc[263];

File C-ctype.c:
541:	const struct __locale_data _nl_C_LC_CTYPE;
33:	const char _nl_C_LC_CTYPE_class[768];
99:	const char _nl_C_LC_CTYPE_class32[1024];
443:	const struct {
    uint32_t isctype_data[8];
    uint32_t header[5];
    uint32_t level1[1];
    uint32_t level2[1];
    uint32_t level3[4];
} _nl_C_LC_CTYPE_class_alnum;
326:	const struct {
    uint32_t isctype_data[8];
    uint32_t header[5];
    uint32_t level1[1];
    uint32_t level2[2];
    uint32_t level3[2];
} _nl_C_LC_CTYPE_class_alpha;
404:	const struct {
    uint32_t isctype_data[8];
    uint32_t header[5];
    uint32_t level1[1];
    uint32_t level2[1];
    uint32_t level3[2];
} _nl_C_LC_CTYPE_class_blank;
417:	const struct {
    uint32_t isctype_data[8];
    uint32_t header[5];
    uint32_t level1[1];
    uint32_t level2[1];
    uint32_t level3[4];
} _nl_C_LC_CTYPE_class_cntrl;
339:	const struct {
    uint32_t isctype_data[8];
    uint32_t header[5];
    uint32_t level1[1];
    uint32_t level2[1];
    uint32_t level3[2];
} _nl_C_LC_CTYPE_class_digit;
391:	const struct {
    uint32_t isctype_data[8];
    uint32_t header[5];
    uint32_t level1[1];
    uint32_t level2[1];
    uint32_t level3[4];
} _nl_C_LC_CTYPE_class_graph;
313:	const struct {
    uint32_t isctype_data[8];
    uint32_t header[5];
    uint32_t level1[1];
    uint32_t level2[2];
    uint32_t level3[2];
} _nl_C_LC_CTYPE_class_lower;
378:	const struct {
    uint32_t isctype_data[8];
    uint32_t header[5];
    uint32_t level1[1];
    uint32_t level2[1];
    uint32_t level3[4];
} _nl_C_LC_CTYPE_class_print;
430:	const struct {
    uint32_t isctype_data[8];
    uint32_t header[5];
    uint32_t level1[1];
    uint32_t level2[1];
    uint32_t level3[4];
} _nl_C_LC_CTYPE_class_punct;
365:	const struct {
    uint32_t isctype_data[8];
    uint32_t header[5];
    uint32_t level1[1];
    uint32_t level2[1];
    uint32_t level3[2];
} _nl_C_LC_CTYPE_class_space;
300:	const struct {
    uint32_t isctype_data[8];
    uint32_t header[5];
    uint32_t level1[1];
    uint32_t level2[2];
    uint32_t level3[2];
} _nl_C_LC_CTYPE_class_upper;
352:	const struct {
    uint32_t isctype_data[8];
    uint32_t header[5];
    uint32_t level1[1];
    uint32_t level2[1];
    uint32_t level3[4];
} _nl_C_LC_CTYPE_class_xdigit;
483:	const struct {
    uint32_t header[5];
    uint32_t level1[1];
    uint32_t level2[4];
    int32_t level3[32];
} _nl_C_LC_CTYPE_map_tolower;
464:	const struct {
    uint32_t header[5];
    uint32_t level1[1];
    uint32_t level2[4];
    int32_t level3[32];
} _nl_C_LC_CTYPE_map_toupper;
238:	const uint32_t _nl_C_LC_CTYPE_tolower[384];
187:	const uint32_t _nl_C_LC_CTYPE_toupper[384];
510:	const struct {
    uint32_t header[5];
    uint32_t level1[1];
    uint32_t level2[8];
    int8_t level3[33];
} _nl_C_LC_CTYPE_width;

File C-identification.c:
26:	const struct __locale_data _nl_C_LC_IDENTIFICATION;

File C-measurement.c:
26:	const struct __locale_data _nl_C_LC_MEASUREMENT;

File C-messages.c:
26:	const struct __locale_data _nl_C_LC_MESSAGES;

File C-monetary.c:
27:	const struct __locale_data _nl_C_LC_MONETARY;
25:	static const uint32_t conversion_rate[2];
24:	static const char not_available[2];

File C-name.c:
26:	const struct __locale_data _nl_C_LC_NAME;

File C-numeric.c:
23:	const struct __locale_data _nl_C_LC_NUMERIC;

File C-paper.c:
26:	const struct __locale_data _nl_C_LC_PAPER;

File C-telephone.c:
26:	const struct __locale_data _nl_C_LC_TELEPHONE;

File C-time.c:
26:	const struct __locale_data _nl_C_LC_TIME;

File C_name.c:
11:	const char _nl_C_codeset[];
7:	const char _nl_C_name[];
8:	const char _nl_POSIX_name[];

File SYS_libc.c:
6:	const char __GI__libc_intl_domainname[];

File a64l.c:
27:	static const char a64l_table[77];

File abort.c:
35:	struct abort_msg_s *__GI___abort_msg;
43:	static __libc_lock_recursive_t lock;
40:	static int stage;

File arena.c:
100:	int __libc_malloc_initialized;
447:	static char *aligned_heap_area;
83:	static mstate free_list;
81:	static __libc_lock_t free_list_lock;
97:	static __libc_lock_t list_lock;
82:	static size_t narenas;
74:	static mstate thread_arena;

File argp-ba.c:
25:	const char *argp_program_bug_address;

File argp-eexst.c:
31:	error_t argp_err_exit_status;

File argp-help.c:
149:	static const struct uparam_name uparam_names[9];
134:	static struct uparams uparams;

File argp-parse.c:
93:	static volatile int _argp_hang;
161:	static const struct argp argp_default_argp;
99:	static const struct argp_option argp_default_options[5];
193:	static const struct argp argp_version_argp;
165:	static const struct argp_option argp_version_options[2];

File argp-pv.c:
24:	const char *argp_program_version;

File argp-pvh.c:
31:	void (*argp_program_version_hook)(FILE * restrict, struct argp_state * restrict);

File asctime.c:
29:	static const char format[32];
30:	static char result[114];

File auth_des.c:
68:	static const struct auth_ops authdes_ops;

File auth_none.c:
68:	static struct authnone_private_s authnone_private;
69:	static pthread_once_t authnone_private_guard;
52:	static const struct auth_ops ops;

File auth_unix.c:
67:	static const struct auth_ops auth_unix_ops;

File backtrace.c:
130:	static const void *__elf_set___libc_subfreeres_element_free_mem__;
40:	static void *libgcc_handle;
37:	static _Unwind_Reason_Code (*unwind_backtrace)(_Unwind_Trace_Fn, void *);
39:	static _Unwind_Word (*unwind_getcfa)(struct _Unwind_Context *);
38:	static _Unwind_Ptr (*unwind_getip)(struct _Unwind_Context *);

File bindrsvprt.c:
53:	static int blacklist_read;
54:	static int *list;
55:	static int list_size;
125:	static __libc_lock_t lock;

File c16rtomb.c:
24:	static mbstate_t state;

File c32rtomb.c:
24:	static mbstate_t state;

File categories.def:
292:	static const enum value_type _nl_value_type_LC_ADDRESS[13];
41:	static const enum value_type _nl_value_type_LC_COLLATE[19];
67:	static const enum value_type _nl_value_type_LC_CTYPE[86];
330:	static const enum value_type _nl_value_type_LC_IDENTIFICATION[16];
322:	static const enum value_type _nl_value_type_LC_MEASUREMENT[2];
259:	static const enum value_type _nl_value_type_LC_MESSAGES[5];
140:	static const enum value_type _nl_value_type_LC_MONETARY[46];
279:	static const enum value_type _nl_value_type_LC_NAME[7];
193:	static const enum value_type _nl_value_type_LC_NUMERIC[6];
270:	static const enum value_type _nl_value_type_LC_PAPER[3];
311:	static const enum value_type _nl_value_type_LC_TELEPHONE[5];
207:	static const enum value_type _nl_value_type_LC_TIME[159];

File cfsetspeed.c:
28:	static const struct speed_struct speeds[32];

File clnt_perr.c:
388:	static const void *__elf_set___libc_subfreeres_element_free_mem__;
360:	static const struct auth_errtab auth_errlist[8];
327:	static const char auth_errstr[198];
220:	static const struct rpc_errtab rpc_errlist[18];
147:	static const char rpc_errstr[451];

File clnt_raw.c:
72:	static const struct clnt_ops client_ops;

File clnt_tcp.c:
87:	static const struct clnt_ops tcp_ops;

File clnt_udp.c:
75:	static const struct clnt_ops udp_ops;

File clnt_unix.c:
88:	static const struct clnt_ops unix_ops;

File create_xid.c:
30:	static struct drand48_data __rpc_lrand48_data;
27:	static __libc_lock_t createxid_lock;
29:	static pid_t is_initialized;

File ctype-info.c:
64:	const __uint32_t *__ctype32_b;
67:	const __uint32_t *__ctype32_tolower;
68:	const __uint32_t *__ctype32_toupper;
63:	const unsigned short *__ctype_b;
65:	const __int32_t *__ctype_tolower;
66:	const __int32_t *__ctype_toupper;
22:	const uint16_t *__libc_tsd_CTYPE_B;
23:	const int32_t *__libc_tsd_CTYPE_TOLOWER;
24:	const int32_t *__libc_tsd_CTYPE_TOUPPER;

File cxa_at_quick_exit.c:
23:	struct exit_function_list *__quick_exit_funcs;
22:	static struct exit_function_list initial_quick;

File cxa_atexit.c:
76:	struct exit_function_list *__exit_funcs;
29:	__libc_lock_t __exit_funcs_lock;
77:	uint64_t __new_exitfn_called;
75:	static struct exit_function_list initial;

File cxa_thread_atexit_impl.c:
89:	static void *dso_symbol_cache;
90:	static struct link_map *lm_cache;
88:	static struct dtor_list *tls_dtor_list;

File databases.def:
23:	service_user *__nss_aliases_database;
24:	service_user *__nss_ethers_database;
25:	service_user *__nss_group_database;
26:	service_user *__nss_gshadow_database;
27:	service_user *__nss_hosts_database;
28:	service_user *__nss_initgroups_database;
29:	service_user *__nss_netgroup_database;
30:	service_user *__nss_networks_database;
31:	service_user *__nss_passwd_database;
32:	service_user *__nss_protocols_database;
33:	service_user *__nss_publickey_database;
34:	service_user *__nss_rpc_database;
35:	service_user *__nss_services_database;
36:	service_user *__nss_shadow_database;

File dcigettext.c:
335:	const char __GI__nl_default_dirname[];
323:	const char *_nl_current_default_domain;
319:	const char _nl_default_default_domain[];
344:	struct binding *_nl_domain_bindings;
435:	__libc_rwlock_t _nl_state_lock;
1674:	static const void *__elf_set___libc_subfreeres_element_free_mem__;
277:	static void *root;
418:	static struct transmem_list *transmem_list;
274:	static __libc_rwlock_t tree_lock;

File des_impl.c:
12:	static const uint32_t des_SPtrans[8][64];
158:	static const uint32_t des_skb[8][64];
370:	static const char shifts2[16];

File des_soft.c:
40:	static const char partab[128];

File dl-cache.c:
37:	static struct cache_file *cache;
38:	static struct cache_file_new *cache_new;
39:	static size_t cachesize;

File dl-debug.c:
37:	struct r_debug _r_debug;

File dl-error-skeleton.c:
57:	static struct catch *catch_hook;
68:	static receiver_fct receiver;

File dl-exception.c:
31:	static const char _dl_out_of_memory[14];

File dl-libc.c:
143:	struct dl_open_hook *__GI__dl_open_hook;
151:	struct dl_open_hook *__GI__dl_open_hook2;
325:	static const void *__elf_set___libc_subfreeres_element_free_mem__;

File dl-load.c:
89:	int __stack_prot;
103:	static const struct r_strlenpair *capstr;
100:	static struct r_search_path_struct env_path_list;
105:	static size_t max_capstrlen;
442:	static size_t max_dirnamelen;
104:	static size_t ncapstr;
440:	static struct r_search_path_struct rtld_search_dirs;
113:	static const char system_dirs[66];
114:	static const size_t system_dirs_len[4];

File dl-minimal.c:
252:	const char __GI__itoa_lower_digits[];
39:	static void *alloc_end;
39:	static void *alloc_last_block;
39:	static void *alloc_ptr;

File dl-profile.c:
149:	static struct here_cg_arc_record *data;
173:	static volatile uint32_t fromidx;
172:	static uint32_t fromlimit;
171:	static struct here_fromstruct *froms;
177:	static unsigned int log_hashfraction;
175:	static uintptr_t lowpc;
155:	static uint32_t narcs;
160:	static volatile uint32_t *narcsp;
152:	static int running;
176:	static size_t textsize;
169:	static volatile uint16_t *tos;

File drand48-iter.c:
26:	struct drand48_data __libc_drand48_data;

File dso_handle.c:
20:	const void * const __dso_handle;

File environ.c:
7:	char **__environ;

File errno.c:
31:	int errno;
27:	int rtld_errno;

File error.c:
62:	unsigned int error_message_count;
283:	int error_one_per_line;
59:	void (*error_print_progname)(void);

File exit.c:
31:	_Bool __exit_funcs_done;

File fgetgrent.c:
28:	static char *buffer;
26:	static __libc_lock_t lock;

File fgetpwent.c:
28:	static char *buffer;
26:	static __libc_lock_t lock;

File fgetsgent.c:
31:	static char *buffer;
29:	static __libc_lock_t lock;

File fgetspent.c:
31:	static char *buffer;
29:	static __libc_lock_t lock;

File fileops.c:
1482:	const struct _IO_jump_t _IO_file_jumps_maybe_mmap;
1458:	const struct _IO_jump_t _IO_file_jumps_mmap;
1433:	const struct _IO_jump_t __GI__IO_file_jumps;

File finddomain.c:
51:	static struct loaded_l10nfile *_nl_loaded_domains;

File findlocale.c:
59:	const char _nl_default_locale_path[];
57:	struct loaded_l10nfile *_nl_locale_file_list[];

File fmtmsg.c:
370:	static const void *__elf_set___libc_subfreeres_element_free_mem__;
76:	static const struct severity_info errorsev;
72:	static const struct severity_info haltsev;
84:	static const struct severity_info infosev;
48:	static const struct {
    uint32_t len;
    const char name[12];
} keywords[5];
30:	static __libc_lock_t lock;
68:	static const struct severity_info nosev;
93:	static int print;
90:	static struct severity_info *severity_list;
80:	static const struct severity_info warningsev;

File fnmatch.c:
162:	static int posixly_correct;

File forward.c:
30:	struct pthread_functions __libc_pthread_functions;
31:	int __libc_pthread_functions_init;

File fpioconst.c:
669:	const mp_limb_t __tens[];
1310:	const struct mp_power _fpioconst_pow10[15];

File fpu_control.c:
24:	fpu_control_t __fpu_control;

File fstab.c:
180:	static const void *__elf_set___libc_subfreeres_element_fstab_free__;
39:	static struct fstab_state fstab_state;

File gconv_builtin.c:
41:	static const struct builtin_map map[12];

File gconv_cache.c:
457:	static const void *__elf_set___libc_subfreeres_element_free_mem__;
37:	static int cache_malloced;
36:	static size_t cache_size;
35:	static void *gconv_cache;

File gconv_conf.c:
52:	size_t __gconv_max_path_elem_len;
50:	struct path_elem *__gconv_path_elem;
104:	const char *__gconv_path_envvar;
623:	static const void *__elf_set___libc_subfreeres_element_free_mem__;
87:	static const char builtin_aliases[999];
68:	static struct gconv_module builtin_modules[12];
39:	static const char default_gconv_path[32];
55:	static const struct path_elem empty_path_elem;
59:	static const char gconv_conf_filename[14];
65:	static const char gconv_module_ext[4];
608:	static pthread_once_t once;

File gconv_db.c:
36:	void *__gconv_alias_db;
42:	__libc_lock_t __gconv_lock;
39:	struct gconv_module *__gconv_modules_db;
831:	static const void *__elf_set___libc_subfreeres_element_free_mem__;
120:	static void *known_derivations;

File gconv_dl.c:
202:	static const void *__elf_set___libc_subfreeres_element_free_mem__;
50:	static void *loaded;

File genops.c:
1119:	static const void *__elf_set___libc_atexit_element__IO_cleanup__;
848:	static const void *__elf_set___libc_subfreeres_element_buffer_free__;
777:	static _Bool dealloc_buffers;
778:	static FILE *freeres_list;
36:	static _IO_lock_t list_all_lock;
39:	static FILE *run_fp;
503:	static int stdio_needs_locking;

File getdate.c:
51:	int getdate_err;

File getnameinfo.c:
80:	static char *domain;

File getnetgrent.c:
24:	static char *buffer;

File getnetgrent_r.c:
37:	static struct __netgrent dataset;
33:	static __libc_lock_t lock;

File getopt.c:
88:	char *optarg;
108:	int opterr;
103:	int optind;
114:	int optopt;
118:	static struct _getopt_data getopt_data;

File getpw.c:
62:	static const char __evoke_link_warning_getpw[58];

File gets_chk.c:
75:	static const char __evoke_link_warning___gets_chk[57];

File getttyent.c:
44:	static FILE *tf;
43:	static char zapchar;

File getusershell.c:
58:	static char **curshell;
56:	static const char *okshells[3];
58:	static char **shells;
58:	static char *strings;

File getutent.c:
24:	static struct utmp *buffer;

File getutent_r.c:
27:	__libc_lock_t __libc_utmp_lock;

File getutid.c:
24:	static struct utmp *buffer;

File getutline.c:
24:	static struct utmp *buffer;

File getwd_chk.c:
32:	static const char __evoke_link_warning_getwd[58];

File global-locale.c:
64:	locale_t __libc_tsd_LOCALE;
39:	struct __locale_struct _nl_global_locale;

File gmon.c:
71:	struct __bb *__bb_head;
73:	struct gmonparam _gmonparam;
78:	static int s_scale;

File herrno.c:
27:	int __h_errno;

File herror.c:
62:	const char * consth_errlist[5];
69:	const int h_nerr;

File hooks.c:
53:	static int using_malloc_checking;

File hsearch.c:
53:	static const void *__elf_set___libc_subfreeres_element___hdestroy__;
22:	static struct hsearch_data htab;

File in6_addr.c:
21:	const struct in6_addr __GI___in6addr_any;
26:	const struct in6_addr __GI___in6addr_loopback;

File inet6_option.c:
222:	static const char __evoke_link_warning_inet6_option_alloc[60];
162:	static const char __evoke_link_warning_inet6_option_append[61];
347:	static const char __evoke_link_warning_inet6_option_find[59];
130:	static const char __evoke_link_warning_inet6_option_init[59];
279:	static const char __evoke_link_warning_inet6_option_next[59];
97:	static const char __evoke_link_warning_inet6_option_space[60];

File inet_ntoa.c:
27:	static char buffer[18];

File init-first.c:
38:	int __libc_argc;
39:	char **__libc_argv;
34:	int __libc_multiple_libcs;

File init-misc.c:
23:	char *__progname;
22:	char *__progname_full;

File initgroups.c:
45:	static _Bool use_initgroups_entry;

File interp.c:
21:	const char __invoke_dynamic_linker__[28];

File iofopncook.c:
111:	static const struct _IO_jump_t _IO_cookie_jumps;

File iogets.c:
72:	static const char __evoke_link_warning_gets[57];

File iopadn.c:
30:	static const char blanks[16];
32:	static const char zeroes[16];

File iopopen.c:
49:	static const struct _IO_jump_t _IO_proc_jumps;
51:	static struct _IO_proc_file *proc_file_chain;
54:	static _IO_lock_t proc_file_chain_lock;

File iovsprintf.c:
38:	static const struct _IO_jump_t _IO_str_chk_jumps;

File iowpadn.c:
30:	static const wchar_t blanks[16];
35:	static const wchar_t zeroes[16];

File itoa-digits.c:
22:	const char __GI__itoa_lower_digits[];

File itoa-udigits.c:
22:	const char __GI__itoa_upper_digits[];

File itowa-digits.c:
22:	const wchar_t _itowa_lower_digits[36];
25:	const wchar_t _itowa_upper_digits[36];

File key_call.c:
294:	cryptkeyres *(*__key_decryptsession_pk_LOCAL)(uid_t, char *);
293:	cryptkeyres *(*__key_encryptsession_pk_LOCAL)(uid_t, char *);
295:	des_block *(*__key_gendes_LOCAL)(uid_t, char *);
382:	static __libc_lock_t keycall_lock;
67:	static const struct timeval tottimeout;
66:	static const struct timeval trytimeout;

File l64a.c:
22:	static const char conv_table[64];

File lckpwdf.c:
44:	static __libc_lock_t lock;
41:	static int lock_fd;

File libc_multiple_threads.c:
26:	int __libc_multiple_threads;

File libc_pthread_init.c:
31:	unsigned long *__fork_generation_pointer;

File loadarchive.c:
45:	static const char archfname[31];
81:	static struct stat64 archive_stat;
90:	static struct locale_in_archive *archloaded;
73:	static struct archmapped *archmapped;
80:	static struct archmapped headmap;

File loadlocale.c:
36:	static const size_t _nl_category_num_items[13];
58:	static const enum value_type * const_nl_value_types[13];

File loadmsgcat.c:
477:	int _nl_msg_cat_cntr;

File localealias.c:
119:	static __libc_lock_t lock;
136:	static struct alias_map *map;
138:	static size_t maxmap;
137:	static size_t nmap;
133:	static char *string_space;
134:	static size_t string_space_act;
135:	static size_t string_space_max;

File localtime.c:
22:	struct tm _tmbuf;

File malloc.c:
1855:	void (*__after_morecore_hook)(void);
1845:	void (*__free_hook)(void *, const void *);
1847:	void *(*__malloc_hook)(size_t, const void *);
1840:	void (*__malloc_initialize_hook)(void);
1852:	void *(*__memalign_hook)(size_t, size_t, const void *);
367:	void *(*__morecore)(ptrdiff_t);
1849:	void *(*__realloc_hook)(void *, size_t, const void *);
1755:	static mchunkptr dumped_main_arena_end;
1754:	static mchunkptr dumped_main_arena_start;
1611:	static size_t global_max_fast;
1742:	static struct malloc_state main_arena;
1764:	static struct malloc_par mp_;
1863:	static int perturb_byte;
2913:	static tcache_perthread_struct *tcache;
2912:	static _Bool tcache_shutting_down;

File mblen.c:
26:	static mbstate_t state;

File mbrlen.c:
23:	static mbstate_t internal;

File mbrtoc16.c:
34:	static mbstate_t state;

File mbrtoc32.c:
24:	static mbstate_t state;

File mbrtowc.c:
33:	static mbstate_t state;

File mbsnrtowcs.c:
35:	static mbstate_t state;

File mbsrtowcs.c:
24:	static mbstate_t state;

File mcheck.c:
39:	static void (*abortfunc)(enum mcheck_status);
62:	static int mcheck_used;
31:	static void (*old_free_hook)(void *, const void *);
32:	static void *(*old_malloc_hook)(size_t, const void *);
33:	static void *(*old_memalign_hook)(size_t, size_t, const void *);
35:	static void *(*old_realloc_hook)(void *, size_t, const void *);
65:	static int pedantic;
60:	static struct hdr *root;

File memstream.c:
36:	static const struct _IO_jump_t _IO_mem_jumps;

File mktime.c:
177:	const unsigned short __mon_yday[2][13];
153:	static const long_int mktime_max;
149:	static const long_int mktime_min;

File mntent.c:
31:	static void *mntent_buffer;

File mtrace.c:
54:	void *mallwatch;
51:	static __libc_lock_t lock;
48:	static const char mallenv[13];
49:	static char *malloc_trace_buffer;
47:	static FILE *mallstream;
57:	static void (*tr_old_free_hook)(void *, const void *);
58:	static void *(*tr_old_malloc_hook)(size_t, const void *);
61:	static void *(*tr_old_memalign_hook)(size_t, size_t, const void *);
59:	static void *(*tr_old_realloc_hook)(void *, size_t, const void *);

File netname.c:
29:	static const char OPSYS[5];

File nscd_getgr_r.c:
68:	struct locked_map_ptr __gr_map_handle;
39:	int __nss_not_use_nscd_group;
72:	static const void *__elf_set___libc_subfreeres_element_gr_map_free__;

File nscd_gethst_r.c:
81:	struct locked_map_ptr __hst_map_handle;
131:	int __nss_have_localdomain;
30:	int __nss_not_use_nscd_hosts;
85:	static const void *__elf_set___libc_subfreeres_element_hst_map_free__;

File nscd_getpw_r.c:
37:	int __nss_not_use_nscd_passwd;
71:	static const void *__elf_set___libc_subfreeres_element_pw_map_free__;
67:	static struct locked_map_ptr map_handle;

File nscd_getserv_r.c:
30:	int __nss_not_use_nscd_services;
62:	struct locked_map_ptr __serv_map_handle;
66:	static const void *__elf_set___libc_subfreeres_element_serv_map_free__;

File nscd_netgroup.c:
28:	int __nss_not_use_nscd_netgroup;
35:	static const void *__elf_set___libc_subfreeres_element_pw_map_free__;
31:	static struct locked_map_ptr map_handle;

File nsswitch.c:
86:	_Bool __nss_database_custom[14];
898:	static const void *__elf_set___libc_subfreeres_element_free_defconfig__;
912:	static const void *__elf_set___libc_subfreeres_element_free_mem__;
94:	static const char * const __nss_shlib_revision;
75:	static const struct {
    const char name[10];
    service_user **dbp;
} databases[14];
104:	static name_database_entry *defconfig_entries;
109:	static _Bool is_nscd;
90:	static __libc_lock_t lock;
111:	static void (*nscd_init_cb)(size_t, struct traced_file *);
98:	static name_database *service_table;

File obprintf.c:
94:	const struct _IO_jump_t _IO_obstack_jumps;

File obstack.c:
110:	struct obstack *_obstack_compat;
94:	void (*obstack_alloc_failed_handler)(void);
99:	int obstack_exit_failure;

File plural-exp.c:
48:	const struct expression __gettext_germanic_plural;
39:	static const struct expression plone;
34:	static const struct expression plvar;

File pmap_clnt.c:
98:	static const struct timeval timeout;
99:	static const struct timeval tottimeout;

File pmap_rmt.c:
58:	static const struct timeval timeout;

File psiginfo-define.h:
11:	static const uint8_t codes_11[2];
11:	static const uint8_t codes_17[6];
11:	static const uint8_t codes_29[6];
11:	static const uint8_t codes_4[8];
11:	static const uint8_t codes_5[2];
11:	static const uint8_t codes_7[3];
11:	static const uint8_t codes_8[8];
7:	static const union codestrs_t_11 codestrs_11;
7:	static const union codestrs_t_17 codestrs_17;
7:	static const union codestrs_t_29 codestrs_29;
7:	static const union codestrs_t_4 codestrs_4;
7:	static const union codestrs_t_5 codestrs_5;
7:	static const union codestrs_t_7 codestrs_7;
7:	static const union codestrs_t_8 codestrs_8;

File pthread_attr_init.c:
27:	struct pthread_attr *__attr_list;
28:	int __attr_list_lock;

File random.c:
197:	static __libc_lock_t lock;
146:	static int32_t randtbl[32];
160:	static struct random_data unsafe_state;

File random_r.c:
143:	static const struct random_poly_info random_poly_info;

File rcmd.c:
431:	int __check_rhosts_file;
432:	char *__rcmd_errstr;
100:	static char *ahostbuf;

File reg-modifier.c:
33:	struct printf_modifier_record **__printf_modifier_table;
186:	static const void *__elf_set___libc_subfreeres_element_free_mem__;
35:	static __libc_lock_t lock;
38:	static int next_bit;

File reg-printf.c:
27:	printf_arginfo_size_function **__printf_arginfo_table;
29:	printf_function **__printf_function_table;
31:	static __libc_lock_t lock;

File reg-type.c:
25:	printf_va_arg_function **__printf_va_arg_table;
28:	static __libc_lock_t lock;
31:	static int pa_next_type;

File regcomp.c:
243:	reg_syntax_t re_syntax_options;
713:	static const void *__elf_set___libc_subfreeres_element_free_mem__;
132:	static const char __re_error_msgid[382];
186:	static const size_t __re_error_msgid_idx[17];
659:	static struct re_pattern_buffer re_comp_buf;
558:	static const bitset_word_t utf8_sb_map[4];

File regex.c:
79:	int re_max_failures;
78:	static const char __evoke_link_warning_re_max_failures[61];

File regexp.c:
34:	char *loc1;
35:	char *loc2;
40:	char *locs;

File register-atfork.c:
143:	static const void *__elf_set___libc_subfreeres_element_free_mem__;
34:	static int atfork_lock;
32:	static _Bool fork_handler_init;
31:	static struct fork_handler_list fork_handlers;

File res-close.c:
144:	static const void *__elf_set___libc_subfreeres_element___res_thread_freeres__;

File res_hconf.c:
81:	struct hconf _res_hconf;
72:	static const struct cmd cmd[4];
334:	static struct netaddr *ifaddrs;

File res_libc.c:
94:	struct __res_state *__resp;
91:	struct __res_state _res;

File resolv_conf.c:
677:	static const void *__elf_set___libc_subfreeres_element_freeres__;
80:	static struct resolv_conf_global *global;
84:	static __libc_lock_t lock;

File resolv_context.c:
52:	static struct resolv_context *current;

File rexec.c:
44:	int rexecoptions;
45:	static char *ahostbuf;

File rpc_common.c:
45:	struct opaque_auth __GI__null_auth;
52:	struct rpc_createerr __GI_rpc_createerr;
50:	fd_set __GI_svc_fdset;
56:	int __GI_svc_max_pollfd;
54:	struct pollfd *__GI_svc_pollfd;

File rpc_prot.c:
123:	static const struct xdr_discrim reply_dscrm[3];

File rpc_thread.c:
40:	static const void *__elf_set___libc_subfreeres_element___rpc_thread_destroy__;
12:	static struct rpc_thread_variables __libc_tsd_RPC_VARS_mem;
13:	static struct rpc_thread_variables *thread_rpc_vars;

File rtld.c:
130:	char **__GI__dl_argv;
143:	uintptr_t __pointer_chk_guard_local;
129:	int _dl_argc;
131:	unsigned int _dl_skip_args;
278:	struct rtld_global _rtld_global;
306:	struct rtld_global_ro _rtld_global_ro;
181:	const char *audit_list_string;
347:	static struct libname_list _dl_rtld_libname;
348:	static struct libname_list _dl_rtld_libname2;
2391:	static int any_debug;
189:	static struct audit_list *audit_list;
841:	static const char *library_path;
352:	static hp_timing_t load_time;
847:	static const char *preloadarg;
843:	static const char *preloadlist;
351:	static hp_timing_t relocate_time;
353:	static hp_timing_t start_time;
695:	static _Bool tls_init_tp_called;
845:	static int version_info;

File ruserpass.c:
47:	static FILE *cfile;
59:	static const char tokstr[53];
80:	static const struct toktab toktab[7];
57:	static char tokval[100];

File samplestructs.c:
8:	struct dummy1 dummy1;
14:	struct dummy3 dummy3;
18:	struct dummysanity dummysanity;
24:	struct dummy3 *trial3;

File setenv.c:
324:	static const void *__elf_set___libc_subfreeres_element_free_mem__;
57:	static __libc_lock_t envlock;
85:	static void *known_values;
106:	static char **last_environ;

File setlocale.c:
122:	__libc_rwlock_t __libc_setlocale_lock;
76:	const uint8_t _nl_category_name_idxs[13];
85:	const uint8_t _nl_category_name_sizes[13];
68:	const struct catnamestr_t _nl_category_names;
112:	static void (* const_nl_category_postload[13])(void);

File sgetsgent.c:
28:	static __libc_lock_t lock;

File sgetspent.c:
28:	static __libc_lock_t lock;

File sofini.c:
17:	static const ui32 __FRAME_END__[1];

File stdfiles.c:
54:	struct _IO_FILE_plus _IO_2_1_stderr_;
52:	struct _IO_FILE_plus _IO_2_1_stdin_;
53:	struct _IO_FILE_plus _IO_2_1_stdout_;
56:	struct _IO_FILE_plus *__GI__IO_list_all;
52:	static _IO_lock_t _IO_stdfile_0_lock;
53:	static _IO_lock_t _IO_stdfile_1_lock;
54:	static _IO_lock_t _IO_stdfile_2_lock;
52:	static struct _IO_wide_data _IO_wide_data_0;
53:	static struct _IO_wide_data _IO_wide_data_1;
54:	static struct _IO_wide_data _IO_wide_data_2;

File stdio.c:
35:	FILE *stderr;
33:	FILE *stdin;
34:	FILE *stdout;

File strerror.c:
26:	static char *buf;

File strerror_l.c:
64:	static const void *__elf_set___libc_subfreeres_element___strerror_thread_freeres__;
26:	static char *last_value;

File strops.c:
353:	const struct _IO_jump_t _IO_str_jumps;

File strsignal.c:
25:	static __libc_key_t key;
30:	static char local_buf[100];
31:	static char *static_buf;

File svc_auth.c:
67:	static const struct {
    enum auth_stat (*authenticator)(struct svc_req *, struct rpc_msg *);
} svcauthsw[4];

File svc_raw.c:
60:	static const struct xp_ops server_ops;

File svc_tcp.c:
79:	static const struct xp_ops svctcp_op;
104:	static const struct xp_ops svctcp_rendezvous_op;

File svc_udp.c:
81:	static const struct xp_ops svcudp_op;

File svc_unix.c:
313:	static struct cmessage cm;
79:	static const struct xp_ops svcunix_op;
104:	static const struct xp_ops svcunix_rendezvous_op;

File svcauth_des.c:
97:	struct {
    u_long ncachehits;
    u_long ncachereplays;
    u_long ncachemisses;
} svcauthdes_stats;

File tempnam.c:
42:	static const char __evoke_link_warning_tempnam[56];

File tens_in_limb.c:
17:	const mp_limb_t _tens_in_limb[20];

File tmpnam.c:
50:	static const char __evoke_link_warning_tmpnam[55];
21:	static char tmpnam_buffer[20];

File tmpnam_r.c:
36:	static const char __evoke_link_warning_tmpnam_r[57];

File tzfile.c:
32:	int __use_tzfile;
61:	static struct leap *leaps;
60:	static size_t num_leaps;
52:	static size_t num_transitions;
55:	static size_t num_types;
59:	static long rule_dstoff;
58:	static long rule_stdoff;
53:	static time_t *transitions;
54:	static unsigned char *type_idxs;
56:	static struct ttinfo *types;
33:	static dev_t tzfile_dev;
34:	static ino64_t tzfile_ino;
35:	static time_t tzfile_mtime;
62:	static char *tzspec;
57:	static char *zone_names;

File tzset.c:
32:	int __daylight;
33:	long __timezone;
31:	char *__tzname[2];
613:	static const void *__elf_set___libc_subfreeres_element_free_mem__;
124:	static char *old_tz;
62:	static tz_rule tz_rules[2];
40:	static __libc_lock_t tzset_lock;
76:	static struct tzstring_l *tzstring_list;

File utmpname.c:
31:	const char *__libc_utmp_file_name;
28:	static const char default_file_name[14];

File valid_field.c:
21:	const char __nss_invalid_field_characters[];

File valid_list_field.c:
22:	static const char invalid_characters[4];

File version.c:
23:	static const char __libc_release[7];
24:	static const char __libc_version[5];
26:	static const char banner[443];

File vfprintf-internal.c:
2319:	static const struct _IO_jump_t _IO_helper_jumps;
263:	static const uint8_t jump_table[91];
256:	static const char null[7];

File vsnprintf.c:
67:	const struct _IO_jump_t _IO_strn_jumps;

File vswprintf.c:
66:	const struct _IO_jump_t _IO_wstrn_jumps;

File vtables.c:
26:	void (*IO_accept_foreign_vtables)(void);

File wcrtomb.c:
35:	static mbstate_t state;

File wcsmbsload.c:
72:	const struct gconv_fcts __wcsmbs_gconv_fcts_c;
51:	static const struct __gconv_step to_mb;
32:	static const struct __gconv_step to_wc;

File wcsnrtombs.c:
34:	static mbstate_t state;

File wcsrtombs.c:
35:	static mbstate_t state;

File wctomb.c:
26:	mbstate_t __wctomb_state;

File wfileops.c:
1073:	const struct _IO_jump_t _IO_wfile_jumps_maybe_mmap;
1049:	const struct _IO_jump_t _IO_wfile_jumps_mmap;
1023:	const struct _IO_jump_t __GI__IO_wfile_jumps;

File wmemstream.c:
37:	static const struct _IO_jump_t _IO_wmem_jumps;

File wstrops.c:
362:	const struct _IO_jump_t _IO_wstr_jumps;

File xcrypt.c:
52:	static const char hex[16];

File xdr.c:
60:	static const char xdr_zero[4];

File xdr_mem.c:
54:	static const struct xdr_ops xdrmem_ops;

File xdr_rec.c:
66:	static const struct xdr_ops xdrrec_ops;

File xdr_stdio.c:
64:	static const struct xdr_ops xdrstdio_ops;

File xlocale.c:
34:	const struct __locale_struct _nl_C_locobj;

Non-debugging symbols:
0x0000000008002000  _IO_stdin_used
0x0000000008002004  __GNU_EH_FRAME_HDR
0x000000000800214c  __FRAME_END__
0x0000000008003db8  __frame_dummy_init_array_entry
0x0000000008003db8  __init_array_start
0x0000000008003dc0  __do_global_dtors_aux_fini_array_entry
0x0000000008003dc0  __init_array_end
0x0000000008003dc8  _DYNAMIC
0x0000000008003fb8  _GLOBAL_OFFSET_TABLE_
0x0000000008004000  __data_start
0x0000000008004000  data_start
0x0000000008004008  __dso_handle
0x0000000008004010  __TMC_END__
0x0000000008004010  __bss_start
0x0000000008004010  _edata
0x0000000008004020  completed
0x00000000080041e8  _end
0x00007fffff7b0000  __ehdr_start
0x00007fffff7d4080  audit_iface_names
0x00007fffff7d4100  debopts
0x00007fffff7d4360  unsecure_envvars
0x00007fffff7d44c0  expected
0x00007fffff7d46a0  msg
0x00007fffff7d4700  primes
0x00007fffff7d49d0  expected_note
0x00007fffff7d4a00  auxvars
0x00007fffff7d6163  __PRETTY_FUNCTION__.10871
0x00007fffff7d7098  __PRETTY_FUNCTION__.10786
0x00007fffff7d70a8  __PRETTY_FUNCTION__.10841
0x00007fffff7d70b8  __PRETTY_FUNCTION__.10958
0x00007fffff7d7638  __PRETTY_FUNCTION__.10954
0x00007fffff7d7648  __PRETTY_FUNCTION__.10747
0x00007fffff7d78f8  __PRETTY_FUNCTION__.10452
0x00007fffff7d7908  __PRETTY_FUNCTION__.10202
0x00007fffff7d7918  __PRETTY_FUNCTION__.9703
0x00007fffff7d7d10  __PRETTY_FUNCTION__.10928
0x00007fffff7d7df8  __PRETTY_FUNCTION__.8718
0x00007fffff7d7f80  __PRETTY_FUNCTION__.8853
0x00007fffff7d8218  __PRETTY_FUNCTION__.9700
0x00007fffff7d8408  __PRETTY_FUNCTION__.11040
0x00007fffff7d8418  __PRETTY_FUNCTION__.11096
0x00007fffff7d8428  __PRETTY_FUNCTION__.11141
0x00007fffff7d8898  __PRETTY_FUNCTION__.10882
0x00007fffff7d88a8  __PRETTY_FUNCTION__.10814
0x00007fffff7d8930  __PRETTY_FUNCTION__.8199
0x00007fffff7d8970  __PRETTY_FUNCTION__.7385
0x00007fffff7d8980  __PRETTY_FUNCTION__.10870
0x00007fffff7d89a0  __PRETTY_FUNCTION__.10888
0x00007fffff7d89c0  __PRETTY_FUNCTION__.10248
0x00007fffff7d89c0  __PRETTY_FUNCTION__.10371
0x00007fffff7d89c0  __PRETTY_FUNCTION__.10681
0x00007fffff7d89e0  preload_file
0x00007fffff7d8a00  __PRETTY_FUNCTION__.10305
0x00007fffff7d8a00  __PRETTY_FUNCTION__.10618
0x00007fffff7d8a20  __PRETTY_FUNCTION__.10698
0x00007fffff7d8a40  __PRETTY_FUNCTION__.10798
0x00007fffff7d8a60  __PRETTY_FUNCTION__.10666
0x00007fffff7d8a80  __PRETTY_FUNCTION__.10653
0x00007fffff7d8aa0  __PRETTY_FUNCTION__.10252
0x00007fffff7d8ac0  __PRETTY_FUNCTION__.10427
0x00007fffff7d8ae0  __PRETTY_FUNCTION__.9900
0x00007fffff7d8b00  __PRETTY_FUNCTION__.10153
0x00007fffff7d8b20  __PRETTY_FUNCTION__.11008
0x00007fffff7d8b40  __PRETTY_FUNCTION__.10043
0x00007fffff7d8b60  __PRETTY_FUNCTION__.8875
0x00007fffff7d8b80  __PRETTY_FUNCTION__.10022
0x00007fffff7d8ba0  __PRETTY_FUNCTION__.9979
0x00007fffff7d8bc0  __PRETTY_FUNCTION__.9958
0x00007fffff7d8be0  __PRETTY_FUNCTION__.9898
0x00007fffff7d8c00  __PRETTY_FUNCTION__.9848
0x00007fffff7d8c20  __PRETTY_FUNCTION__.9824
0x00007fffff7d8c40  __PRETTY_FUNCTION__.10983
0x00007fffff7d8c60  __PRETTY_FUNCTION__.11065
0x00007fffff7d8c80  __PRETTY_FUNCTION__.10993
0x00007fffff7d8ca0  __PRETTY_FUNCTION__.10651
0x00007fffff7d8cb0  __PRETTY_FUNCTION__.10687
0x00007fffff7d8cd0  __PRETTY_FUNCTION__.10046
0x00007fffff7d8d10  __PRETTY_FUNCTION__.10203
0x00007fffff7d8d40  expected_note
0x00007fffff7d8d60  dummy_bucket
0x00007fffff7d8d80  errstring
0x00007fffff7d8dbb  _.stapsdt.base
0x00007fffff7d8dbc  __GNU_EH_FRAME_HDR
0x00007fffff7dd560  dyn_temp
0x00007fffff7de000  _GLOBAL_OFFSET_TABLE_
0x00007fffff7df000  newname
0x00007fffff7df0c0  dl_close_state
0x00007fffff74a500  codeset_idx
0x00007fffff7593e0  mask
0x00007fffff7595a0  nbits
0x00007fffff7595e0  nbits
0x00007fffff759620  nbits
0x00007fffff7597c0  nbits
0x00007fffff75d150  units
0x00007fffff75df40  step4_jumps
0x00007fffff75dfc0  step3b_jumps
0x00007fffff75e040  step4_jumps
0x00007fffff75e0c0  step3a_jumps
0x00007fffff75e140  step2_jumps
0x00007fffff75e1c0  step1_jumps
0x00007fffff75e240  step0_jumps
0x00007fffff75e340  step4_jumps
0x00007fffff75e3c0  step3b_jumps
0x00007fffff75e440  step4_jumps
0x00007fffff75e4c0  step3a_jumps
0x00007fffff75e540  step2_jumps
0x00007fffff75e5c0  step1_jumps
0x00007fffff75e640  step0_jumps
0x00007fffff75ee90  next_state
0x00007fffff75f9e0  nbits
0x00007fffff75fa20  nbits
0x00007fffff75fa60  nbits
0x00007fffff75faa0  nbits
0x00007fffff7625a0  afs
0x00007fffff762680  CSWTCH.1
0x00007fffff762800  options
0x00007fffff763ef3  __PRETTY_FUNCTION__.9088
0x00007fffff76415a  inmask
0x00007fffff76420a  slashdot
0x00007fffff7656d0  __PRETTY_FUNCTION__.13790
0x00007fffff765bb6  __PRETTY_FUNCTION__.9769
0x00007fffff765e39  dot
0x00007fffff76704e  longjmp_msg
0x00007fffff767d60  __PRETTY_FUNCTION__.12310
0x00007fffff767da0  __PRETTY_FUNCTION__.12395
0x00007fffff767de0  __PRETTY_FUNCTION__.12135
0x00007fffff767e20  __PRETTY_FUNCTION__.12220
0x00007fffff767e60  __PRETTY_FUNCTION__.12045
0x00007fffff767e80  __PRETTY_FUNCTION__.11870
0x00007fffff767ea0  __PRETTY_FUNCTION__.11694
0x00007fffff767ec0  __PRETTY_FUNCTION__.11486
0x00007fffff767ee0  __PRETTY_FUNCTION__.11297
0x00007fffff767f20  __PRETTY_FUNCTION__.11124
0x00007fffff767f60  __PRETTY_FUNCTION__.10981
0x00007fffff767fa0  __PRETTY_FUNCTION__.10859
0x00007fffff767fe0  __PRETTY_FUNCTION__.10744
0x00007fffff768000  __PRETTY_FUNCTION__.10623
0x00007fffff768140  result_type
0x00007fffff7681a0  bad_key_err
0x00007fffff7681e0  __PRETTY_FUNCTION__.13733
0x00007fffff768330  __PRETTY_FUNCTION__.9555
0x00007fffff7685f0  aliasfile
0x00007fffff768680  __PRETTY_FUNCTION__.8027
0x00007fffff768690  __PRETTY_FUNCTION__.8132
0x00007fffff7689e0  __PRETTY_FUNCTION__.12406
0x00007fffff7689e0  __PRETTY_FUNCTION__.12415
0x00007fffff7689e0  __PRETTY_FUNCTION__.12594
0x00007fffff7689e0  __PRETTY_FUNCTION__.12603
0x00007fffff7689e0  __PRETTY_FUNCTION__.13195
0x00007fffff7689e0  __PRETTY_FUNCTION__.13383
0x00007fffff768a18  __PRETTY_FUNCTION__.8802
0x00007fffff768a70  __PRETTY_FUNCTION__.15450
0x00007fffff768aa8  __PRETTY_FUNCTION__.10289
0x00007fffff769098  __PRETTY_FUNCTION__.13821
0x00007fffff7691a8  __PRETTY_FUNCTION__.11495
0x00007fffff769f80  __PRETTY_FUNCTION__.13461
0x00007fffff769f90  __PRETTY_FUNCTION__.13374
0x00007fffff769fa0  __PRETTY_FUNCTION__.13304
0x00007fffff769fb0  __PRETTY_FUNCTION__.12297
0x00007fffff769fc0  __PRETTY_FUNCTION__.12405
0x00007fffff769fd0  __PRETTY_FUNCTION__.13227
0x00007fffff769fe0  __PRETTY_FUNCTION__.13759
0x00007fffff769ff0  __PRETTY_FUNCTION__.13123
0x00007fffff76a000  __PRETTY_FUNCTION__.13111
0x00007fffff76a010  __PRETTY_FUNCTION__.12290
0x00007fffff76a020  __PRETTY_FUNCTION__.13690
0x00007fffff76a030  __PRETTY_FUNCTION__.13066
0x00007fffff76a040  __PRETTY_FUNCTION__.13576
0x00007fffff76a050  __PRETTY_FUNCTION__.13776
0x00007fffff76a218  __PRETTY_FUNCTION__.8415
0x00007fffff76a2b0  __PRETTY_FUNCTION__.8563
0x00007fffff76a370  __PRETTY_FUNCTION__.10418
0x00007fffff76a420  __PRETTY_FUNCTION__.10392
0x00007fffff76a430  __PRETTY_FUNCTION__.10388
0x00007fffff76a468  __PRETTY_FUNCTION__.10394
0x00007fffff76a478  __PRETTY_FUNCTION__.10395
0x00007fffff76a488  __PRETTY_FUNCTION__.10396
0x00007fffff76a508  __PRETTY_FUNCTION__.9229
0x00007fffff76a5a0  __PRETTY_FUNCTION__.9344
0x00007fffff76a620  __PRETTY_FUNCTION__.10394
0x00007fffff76a630  __PRETTY_FUNCTION__.10412
0x00007fffff76a680  __PRETTY_FUNCTION__.7564
0x00007fffff76a6e0  __PRETTY_FUNCTION__.9968
0x00007fffff76a6e0  __PRETTY_FUNCTION__.9973
0x00007fffff76a718  __PRETTY_FUNCTION__.9730
0x00007fffff76a728  __PRETTY_FUNCTION__.9993
0x00007fffff76a738  __PRETTY_FUNCTION__.10041
0x00007fffff76a798  cs_path
0x00007fffff76aa28  __PRETTY_FUNCTION__.15810
0x00007fffff76aa38  __PRETTY_FUNCTION__.16035
0x00007fffff76aa68  __PRETTY_FUNCTION__.11392
0x00007fffff76aa78  __PRETTY_FUNCTION__.11489
0x00007fffff76aa88  __PRETTY_FUNCTION__.11920
0x00007fffff76aa98  __PRETTY_FUNCTION__.11409
0x00007fffff76aaa8  __PRETTY_FUNCTION__.11401
0x00007fffff76abf8  __PRETTY_FUNCTION__.8781
0x00007fffff76ac30  __PRETTY_FUNCTION__.9808
0x00007fffff76ac68  __PRETTY_FUNCTION__.10287
0x00007fffff76acf0  __PRETTY_FUNCTION__.11445
0x00007fffff76b0f0  __PRETTY_FUNCTION__.9772
0x00007fffff76b168  __PRETTY_FUNCTION__.6120
0x00007fffff76b2a8  __PRETTY_FUNCTION__.13654
0x00007fffff76b2b8  __PRETTY_FUNCTION__.13476
0x00007fffff76b498  __PRETTY_FUNCTION__.12772
0x00007fffff76b540  __PRETTY_FUNCTION__.4078
0x00007fffff76b698  fmt
0x00007fffff76b7a0  __PRETTY_FUNCTION__.9420
0x00007fffff76b7b0  __PRETTY_FUNCTION__.9432
0x00007fffff76b8b8  __PRETTY_FUNCTION__.10045
0x00007fffff76ba00  __func__.12223
0x00007fffff76ba70  __func__.12179
0x00007fffff76bb10  __func__.15311
0x00007fffff76bb78  __func__.12230
0x00007fffff76bcd8  __func__.7924
0x00007fffff76bce8  __func__.8102
0x00007fffff76bcf8  __func__.8065
0x00007fffff76bd08  __func__.8075
0x00007fffff76bd50  __PRETTY_FUNCTION__.14436
0x00007fffff76bd60  __PRETTY_FUNCTION__.14295
0x00007fffff76bd70  __PRETTY_FUNCTION__.9649
0x00007fffff76bdf0  __PRETTY_FUNCTION__.9737
0x00007fffff76be10  __PRETTY_FUNCTION__.12757
0x00007fffff76be30  __PRETTY_FUNCTION__.9073
0x00007fffff76be50  __PRETTY_FUNCTION__.11960
0x00007fffff76be70  __PRETTY_FUNCTION__.11785
0x00007fffff76be90  __PRETTY_FUNCTION__.11597
0x00007fffff76beb0  __PRETTY_FUNCTION__.11394
0x00007fffff76bed0  __PRETTY_FUNCTION__.11213
0x00007fffff76bef0  __PRETTY_FUNCTION__.10895
0x00007fffff76bf10  __PRETTY_FUNCTION__.9770
0x00007fffff76bf30  __PRETTY_FUNCTION__.9762
0x00007fffff76bf50  __PRETTY_FUNCTION__.10338
0x00007fffff76bf70  __PRETTY_FUNCTION__.9847
0x00007fffff76bf90  __PRETTY_FUNCTION__.9963
0x00007fffff76bfb0  __PRETTY_FUNCTION__.9923
0x00007fffff76bff0  errstr
0x00007fffff76c050  __PRETTY_FUNCTION__.8029
0x00007fffff76c070  __PRETTY_FUNCTION__.12465
0x00007fffff76c090  __PRETTY_FUNCTION__.12456
0x00007fffff76c0b0  __PRETTY_FUNCTION__.12456
0x00007fffff76c0d0  __PRETTY_FUNCTION__.13245
0x00007fffff76c0f0  __PRETTY_FUNCTION__.14011
0x00007fffff76c110  __PRETTY_FUNCTION__.13653
0x00007fffff76c130  __PRETTY_FUNCTION__.13856
0x00007fffff76c130  __PRETTY_FUNCTION__.13882
0x00007fffff76c150  __PRETTY_FUNCTION__.13588
0x00007fffff76c170  __PRETTY_FUNCTION__.13614
0x00007fffff76c1d0  __PRETTY_FUNCTION__.11594
0x00007fffff76c1d0  __PRETTY_FUNCTION__.12383
0x00007fffff76c1e0  __PRETTY_FUNCTION__.12322
0x00007fffff76c200  __PRETTY_FUNCTION__.11649
0x00007fffff76c220  __PRETTY_FUNCTION__.11613
0x00007fffff76c240  __PRETTY_FUNCTION__.13503
0x00007fffff76c260  __PRETTY_FUNCTION__.12452
0x00007fffff76c280  __PRETTY_FUNCTION__.12629
0x00007fffff76c2a0  __PRETTY_FUNCTION__.8677
0x00007fffff76c2c0  __PRETTY_FUNCTION__.10348
0x00007fffff76c2e0  __PRETTY_FUNCTION__.12638
0x00007fffff76c300  __PRETTY_FUNCTION__.12638
0x00007fffff76c320  __PRETTY_FUNCTION__.12647
0x00007fffff76c340  __PRETTY_FUNCTION__.13427
0x00007fffff76c360  __PRETTY_FUNCTION__.7610
0x00007fffff76c380  default_tzdir
0x00007fffff76c3a0  __PRETTY_FUNCTION__.8742
0x00007fffff76c3c0  __PRETTY_FUNCTION__.14028
0x00007fffff76c3e0  __PRETTY_FUNCTION__.9776
0x00007fffff76c400  __PRETTY_FUNCTION__.10025
0x00007fffff76c420  __PRETTY_FUNCTION__.10239
0x00007fffff76c440  __PRETTY_FUNCTION__.12544
0x00007fffff76c460  __PRETTY_FUNCTION__.10290
0x00007fffff76c480  __PRETTY_FUNCTION__.4486
0x00007fffff76c4a0  __PRETTY_FUNCTION__.4476
0x00007fffff76c4c0  __PRETTY_FUNCTION__.4467
0x00007fffff76c4e0  __PRETTY_FUNCTION__.14969
0x00007fffff76c500  __PRETTY_FUNCTION__.9456
0x00007fffff76c520  __PRETTY_FUNCTION__.10194
0x00007fffff76c540  __PRETTY_FUNCTION__.10224
0x00007fffff76c560  __PRETTY_FUNCTION__.10159
0x00007fffff76c580  __PRETTY_FUNCTION__.10068
0x00007fffff76c5a0  __PRETTY_FUNCTION__.10060
0x00007fffff76c5c0  __func__.15414
0x00007fffff76c5d0  __func__.11245
0x00007fffff76c600  __PRETTY_FUNCTION__.14226
0x00007fffff76c6e0  signmask
0x00007fffff76c6f0  othermask
0x00007fffff76cb10  max
0x00007fffff76d3bc  _sys_nerr@@GLIBC_2.12
0x00007fffff76d3bc  sys_nerr@@GLIBC_2.12
0x00007fffff76d3c0  _sys_nerr@GLIBC_2.2.5
0x00007fffff76d3c0  sys_nerr@GLIBC_2.2.5
0x00007fffff76d3c4  _sys_nerr@GLIBC_2.3
0x00007fffff76d3c4  sys_nerr@GLIBC_2.3
0x00007fffff76d3c8  _sys_nerr@GLIBC_2.4
0x00007fffff76d3c8  sys_nerr@GLIBC_2.4
0x00007fffff76e698  _.stapsdt.base
0x00007fffff76e6bc  __GNU_EH_FRAME_HDR
0x00007fffff79a6a0  _sys_errlist@@GLIBC_2.12
0x00007fffff79a6a0  _sys_errlist@GLIBC_2.2.5
0x00007fffff79a6a0  _sys_errlist@GLIBC_2.3
0x00007fffff79a6a0  _sys_errlist@GLIBC_2.4
0x00007fffff79a6a0  sys_errlist@@GLIBC_2.12
0x00007fffff79a6a0  sys_errlist@GLIBC_2.2.5
0x00007fffff79a6a0  sys_errlist@GLIBC_2.3
0x00007fffff79a6a0  sys_errlist@GLIBC_2.4
0x00007fffff79aae0  __old2_sys_siglist
0x00007fffff79aae0  _old2_sys_siglist
0x00007fffff79aae0  _sys_siglist
0x00007fffff79aae0  _sys_siglist@@GLIBC_2.3.3
0x00007fffff79aae0  _sys_siglist@GLIBC_2.2.5
0x00007fffff79aae0  sys_siglist@@GLIBC_2.3.3
0x00007fffff79aae0  sys_siglist@GLIBC_2.2.5
0x00007fffff79ad00  __old2_sys_sigabbrev
0x00007fffff79ad00  sys_sigabbrev
0x00007fffff79ad00  sys_sigabbrev@@GLIBC_2.3.3
0x00007fffff79ad00  sys_sigabbrev@GLIBC_2.2.5
0x00007fffff79c000  _GLOBAL_OFFSET_TABLE_
0x00007fffff79c260  may_shrink_heap
0x00007fffff79c358  cached_result
0x00007fffff79c428  num_ifs
0x00007fffff79c42c  startport
0x00007fffff79c434  tty_gid
0x00007fffff79c6e0  __ctype32_toupper@GLIBC_2.2.5
0x00007fffff79c6e8  __ctype32_tolower@GLIBC_2.2.5
0x00007fffff79c6f0  __ctype_toupper@GLIBC_2.2.5
0x00007fffff79c6f8  __ctype_tolower@GLIBC_2.2.5
0x00007fffff79c700  __ctype32_b@GLIBC_2.2.5
0x00007fffff79c708  __ctype_b@GLIBC_2.2.5
0x00007fffff79d798  DW.ref.__gcc_personality_v0
0x00007fffff79d950  modcounter
0x00007fffff79daa0  result
0x00007fffff79db38  output_charset_cache
0x00007fffff79db40  output_charset_cached
0x00007fffff79db48  freemem_size
0x00007fffff79db50  freemem
0x00007fffff79db58  lock
0x00007fffff79dbc0  lock
0x00007fffff79dc00  lock
0x00007fffff79dc10  locale_alias_path
0x00007fffff79dc68  phys_pages
0x00007fffff79dc70  pagesize
0x00007fffff79e4d8  state
0x00007fffff79e658  sysconf_symloop_max
0x00007fffff79e660  result
0x00007fffff79e680  nore
0x00007fffff79e6c0  noexpr
0x00007fffff79e6e0  yesre
0x00007fffff79e720  yesexpr
0x00007fffff79e728  once
0x00007fffff79e738  name
0x00007fffff79ee50  __malloc_initialize_hook@GLIBC_2.2.5
0x00007fffff79ee58  next_to_use
0x00007fffff79ee60  narenas_limit
0x00007fffff79eee0  added_atexit_handler
0x00007fffff79ef18  _obstack@GLIBC_2.2.5
0x00007fffff79ef20  already_called
0x00007fffff79ef40  once
0x00007fffff79efc8  olds
0x00007fffff79efe0  state
0x00007fffff79f000  rdata
0x00007fffff79f030  init
0x00007fffff79f118  localtime_offset
0x00007fffff79f12c  is_initialized
0x00007fffff79f210  gmtime_offset
0x00007fffff79f220  tmbuf
0x00007fffff79f260  resbuf
0x00007fffff79f280  buffer_size
0x00007fffff79f2a0  buffer_size
0x00007fffff79f2c0  resbuf
0x00007fffff79f300  resbuf
0x00007fffff79f320  buffer_size
0x00007fffff79f340  resbuf
0x00007fffff79f360  buffer_size
0x00007fffff79f390  start_fct
0x00007fffff79f398  startp
0x00007fffff79f3a0  startp_initialized
0x00007fffff79f3a8  start_fct
0x00007fffff79f3b0  startp
0x00007fffff79f3b8  startp_initialized
0x00007fffff79f3c0  resbuf
0x00007fffff79f3f0  buffer_size
0x00007fffff79f400  buffer_size
0x00007fffff79f420  resbuf
0x00007fffff79f460  resbuf
0x00007fffff79f490  buffer_size
0x00007fffff79f4a0  resbuf
0x00007fffff79f4d0  buffer_size
0x00007fffff79f500  start_fct
0x00007fffff79f508  startp
0x00007fffff79f510  startp_initialized
0x00007fffff79f518  start_fct
0x00007fffff79f520  startp
0x00007fffff79f528  startp_initialized
0x00007fffff79f5c0  lock
0x00007fffff79f5c4  once
0x00007fffff79f608  namelen
0x00007fffff79f610  buflen
0x00007fffff79f618  tiocgsid_does_not_work
0x00007fffff79f6c0  tty
0x00007fffff79f700  line
0x00007fffff79f7b8  bufsize
0x00007fffff79f7c0  buf
0x00007fffff79f940  old_file_name
0x00007fffff79f948  old_line_number
0x00007fffff79f950  timestamp
0x00007fffff79f958  locs@GLIBC_2.2.5
0x00007fffff79f960  loc2@GLIBC_2.2.5
0x00007fffff79f968  loc1@GLIBC_2.2.5
0x00007fffff79f970  last_type
0x00007fffff79f974  last_family
0x00007fffff79f980  oact
0x00007fffff79fa20  otimer
0x00007fffff79fb40  buffer_size
0x00007fffff79fb60  resbuf
0x00007fffff79fbc0  resbuf
0x00007fffff79fc08  buffer_size
0x00007fffff79fc20  resbuf
0x00007fffff79fc68  buffer_size
0x00007fffff79fc70  buffer
0x00007fffff79fc80  resbuf
0x00007fffff79fcc8  buffer_size
0x00007fffff79fcf8  start_fct
0x00007fffff79fd00  startp
0x00007fffff79fd08  startp_initialized
0x00007fffff79fd20  buffer_size
0x00007fffff79fd40  resbuf
0x00007fffff79fd80  resbuf
0x00007fffff79fda0  buffer_size
0x00007fffff79fdc0  resbuf
0x00007fffff79fde0  buffer_size
0x00007fffff79fde8  buffer
0x00007fffff79fe00  resbuf
0x00007fffff79fe20  buffer_size
0x00007fffff79fe50  start_fct
0x00007fffff79fe58  startp
0x00007fffff79fe60  startp_initialized
0x00007fffff79fe68  once
0x00007fffff79fea0  resbuf
0x00007fffff79fec0  buffer_size
0x00007fffff79fed0  start_fct
0x00007fffff79fed8  startp
0x00007fffff79fee0  startp_initialized
0x00007fffff79ff00  resbuf
0x00007fffff79ff20  buffer_size
0x00007fffff79ff40  resbuf
0x00007fffff79ff60  buffer_size
0x00007fffff79ff70  start_fct
0x00007fffff79ff78  startp
0x00007fffff79ff80  startp_initialized
0x00007fffff79ff88  start_fct
0x00007fffff79ff90  startp
0x00007fffff79ff98  startp_initialized
0x00007fffff79ffa0  buffer_size
0x00007fffff79ffc0  resbuf
0x00007fffff7a0010  resbuf
0x00007fffff7a0028  buffer_size
0x00007fffff7a0038  start_fct
0x00007fffff7a0040  startp
0x00007fffff7a0048  startp_initialized
0x00007fffff7a0050  resbuf
0x00007fffff7a0068  buffer_size
0x00007fffff7a0080  buffer_size
0x00007fffff7a0090  resbuf
0x00007fffff7a00d0  start_fct
0x00007fffff7a00d8  startp
0x00007fffff7a00e0  startp_initialized
0x00007fffff7a00f0  resbuf
0x00007fffff7a0108  buffer_size
0x00007fffff7a0118  start_fct
0x00007fffff7a0120  startp
0x00007fffff7a0128  startp_initialized
0x00007fffff7a0130  buffer_size
0x00007fffff7a0140  resbuf
0x00007fffff7a0180  resbuf
0x00007fffff7a0198  buffer_size
0x00007fffff7a01a8  start_fct
0x00007fffff7a01b0  startp
0x00007fffff7a01b8  startp_initialized
0x00007fffff7a01c0  resbuf
0x00007fffff7a01e0  buffer_size
0x00007fffff7a01f0  start_fct
0x00007fffff7a01f8  startp
0x00007fffff7a0200  startp_initialized
0x00007fffff7a0220  resbuf
0x00007fffff7a0240  buffer_size
0x00007fffff7a0250  start_fct
0x00007fffff7a0258  startp
0x00007fffff7a0260  startp_initialized
0x00007fffff7a0280  buffer_size
0x00007fffff7a02a0  resbuf
0x00007fffff7a02e8  result
0x00007fffff7a02f0  start_fct
0x00007fffff7a02f8  startp
0x00007fffff7a0300  asc
0x00007fffff7a0318  start_fct
0x00007fffff7a0320  startp
0x00007fffff7a03c0  startp
0x00007fffff7a03c8  startp_initialized
0x00007fffff7a043c  once
0x00007fffff7a0460  buffer_size
0x00007fffff7a0480  resbuf
0x00007fffff7a04c0  resbuf
0x00007fffff7a04e0  buffer_size
0x00007fffff7a04f0  start_fct
0x00007fffff7a04f8  startp
0x00007fffff7a0500  startp_initialized
0x00007fffff7a0504  lock
0x00007fffff7a0508  not_first
0x00007fffff7a0510  functions
0x00007fffff7a0540  tmpbuf
0x00007fffff7a07c0  lock
0x00007fffff7a07c4  once
0x00007fffff7a07e0  _res@GLIBC_2.2.5
0x00007fffff7a0aa0  default_table
0x00007fffff7a0b60  port
0x00007fffff7a0b7c  size
0x00007fffff7a0c58  start_fct
0x00007fffff7a0c60  startp
0x00007fffff7a0c68  start_fct
0x00007fffff7a0c70  startp
0x00007fffff7a0c80  svcauthdes_stats@GLIBC_2.2.5
0x00007fffff7a0ca0  buffer_size
0x00007fffff7a0cb0  resbuf
0x00007fffff7a0cd0  resbuf
0x00007fffff7a0ce8  buffer_size
0x00007fffff7a0d00  resbuf
0x00007fffff7a0d18  buffer_size
0x00007fffff7a0d48  start_fct
0x00007fffff7a0d50  startp
0x00007fffff7a0d58  startp_initialized
0x00007fffff7a0d60  start_fct
0x00007fffff7a0d68  startp
0x00007fffff7a0d70  startp_initialized
0x00007fffff7a0d80  cm
0x00007fffff7a0df8  start_fct
0x00007fffff7a0e00  startp
0x00007fffff7a0e20  once
0x00007fffff7a0f48  crud
0x00007fffff7a114c  devpts_mounted
0x00007fffff7a1150  have_no_dev_ptmx
0x00007fffff79aae0  _sys_siglist
0x00007fffff79ad00  sys_sigabbrev
0x00007fffff79ef18  _obstack
Deleted breakpoint 1 
