{
    "name": "Film",
    "fields": [
        {
            "fieldName": "title",
            "fieldType": "String",
            "fieldValidateRules": [
                "required",
                "maxlength"
            ],
            "fieldValidateRulesMaxlength": 255
        },
        {
            "fieldName": "description",
            "fieldType": "String"
        },
        {
            "fieldName": "releaseYear",
            "fieldType": "Instant"
        },
        {
            "fieldName": "languageId",
            "fieldType": "Integer",
            "fieldValidateRules": [
                "required"
            ]
        },
        {
            "fieldName": "originalLanguageId",
            "fieldType": "Integer",
            "fieldValidateRules": [
                "required"
            ]
        },
        {
            "fieldName": "rentalDuration",
            "fieldType": "Integer",
            "fieldValidateRules": [
                "required"
            ]
        },
        {
            "fieldName": "rentalRate",
            "fieldType": "Double",
            "fieldValidateRules": [
                "required"
            ]
        },
        {
            "fieldName": "length",
            "fieldType": "Integer"
        },
        {
            "fieldName": "replacementCost",
            "fieldType": "Double",
            "fieldValidateRules": [
                "required"
            ]
        },
        {
            "fieldName": "rating",
            "fieldType": "String"
        },
        {
            "fieldName": "specialFeatures",
            "fieldType": "String"
        },
        {
            "fieldName": "lastUpdate",
            "fieldType": "Instant",
            "fieldValidateRules": [
                "required"
            ]
        }
    ],
    "relationships": [],
    "changelogDate": "20190930123653",
    "entityTableName": "film",
    "dto": "mapstruct",
    "pagination": "pagination",
    "service": "serviceImpl",
    "jpaMetamodelFiltering": false,
    "fluentMethods": true,
    "clientRootFolder": "",
    "applications": "*"
}