C:\Users\Mahmoud_Eltohamy\OneDrive - Dell Technologies\Desktop\logs\api-automation\src\test\java\runner\RunCucumber.java
C:\Users\Mahmoud_Eltohamy\OneDrive - Dell Technologies\Desktop\logs\api-automation\src\test\java\restassured\util\PropertyHelper.java
C:\Users\Mahmoud_Eltohamy\OneDrive - Dell Technologies\Desktop\logs\api-automation\src\test\java\restassured\steps\APISteps.java
C:\Users\Mahmoud_Eltohamy\OneDrive - Dell Technologies\Desktop\logs\api-automation\src\test\java\keywords\APIKeywords.java
