{
  "project_info": {
    "project_number": "1056377539623",
    "firebase_url": "https://educatory-popcoders.firebaseio.com",
    "project_id": "educatory-popcoders",
    "storage_bucket": "educatory-popcoders.appspot.com"
  },
  "client": [
    {
      "client_info": {
        "mobilesdk_app_id": "1:1056377539623:android:a2f3d7a834c744c6cc1202",
        "android_client_info": {
          "package_name": "com.propya.educatory"
        }
      },
      "oauth_client": [
        {
          "client_id": "1056377539623-7fhqnd26inv6cf222n3gp08k0f18r385.apps.googleusercontent.com",
          "client_type": 1,
          "android_info": {
            "package_name": "com.propya.educatory",
            "certificate_hash": "a03ff465bf0a35aab3c5cb7365e1c57140b1989e"
          }
        },
        {
          "client_id": "1056377539623-3631o8smraej3nppc9ich029fndn2au3.apps.googleusercontent.com",
          "client_type": 3
        }
      ],
      "api_key": [
        {
          "current_key": "AIzaSyBoATRIDJdCMdv-uOxCuo9nRTSWKwt3Sqg"
        }
      ],
      "services": {
        "appinvite_service": {
          "other_platform_oauth_client": [
            {
              "client_id": "1056377539623-3631o8smraej3nppc9ich029fndn2au3.apps.googleusercontent.com",
              "client_type": 3
            }
          ]
        }
      }
    }
  ],
  "configuration_version": "1"
}