storeid,orn,Duplicate_count,User_id,Date
0660204081,NO0000NX5GNK,8,JH4RYL7DB,2023-01-26
0660204081,NO0000NXKBJC,8,JH4RYL7DB,2023-01-26
0660204081,NO0000O0A3GL,8,JH4RYL7DB,2023-01-26
0660204081,NO0000NXH0R6,8,JH4RYL7DB,2023-01-26
0660204081,NO0000O5QM0Q,8,JH4RYL7DB,2023-01-26
0660204081,NO0000O0A3QX,8,JH4RYL7DB,2023-01-26
0660204081,NO0000ODE1F5,8,JH4RYL7DB,2023-01-26
0660204081,NO0000ODDZZJ,8,JH4RYL7DB,2023-01-26
0660204081,NO0000ODEHNM,4,MWOAWNJB4,2023-01-27
0660204081,NO0000O8JXGH,4,MWOAWNJB4,2023-01-27
0660204081,NO0000ODJIPZ,4,MWOAWNJB4,2023-01-27
0660204081,NO0000O0AAFO,4,MWOAWNJB4,2023-01-27
0661502936,NO0000O9KLSB,18,0AH1MBAYD,2023-01-28
0661502936,NO0000O9HPJ7,18,0AH1MBAYD,2023-01-28
0661876851,NO0000O8O6LR,18,0AH1MBAYD,2023-01-28
0661224611,NO0000O1W3X5,18,0AH1MBAYD,2023-01-28
0661502936,NO0000O9IB2M,18,0AH1MBAYD,2023-01-28
0661502936,NO0000O9KLRU,18,0AH1MBAYD,2023-01-28
0661502936,NO0000O9YUR6,18,0AH1MBAYD,2023-01-28
0661224611,NO0000O1WFWD,18,0AH1MBAYD,2023-01-28
0661224611,NO0000O89OQF,18,0AH1MBAYD,2023-01-28
0661224611,NO0000O89M6W,18,0AH1MBAYD,2023-01-28
0661224611,NO0000O1VA99,18,0AH1MBAYD,2023-01-28
0662621251,NO0000OE9FLC,18,0AH1MBAYD,2023-01-28
0661502936,NO0000O9HZW0,18,0AH1MBAYD,2023-01-28
0661876851,NO0000O8O01T,18,0AH1MBAYD,2023-01-28
0661502936,NO0000O9YV8Q,18,0AH1MBAYD,2023-01-28
0661224611,NO0000O8ALPK,18,0AH1MBAYD,2023-01-28
0661129806,NO0000OE6OMN,18,0AH1MBAYD,2023-01-28
0661502936,NO0000O9KLSU,18,0AH1MBAYD,2023-01-28
0661129806,NO0000NSJZZ0,20,15BR0G6VI,2023-01-28
0660948963,NO0000O6ZED1,20,15BR0G6VI,2023-01-28
0661876851,NO0000O8OW45,20,15BR0G6VI,2023-01-28
,NO0000O8IM1X,20,15BR0G6VI,2023-01-28
0661876851,NO0000O8IKXM,20,15BR0G6VI,2023-01-28
0660948963,NO0000O70IBN,20,15BR0G6VI,2023-01-28
IYA5,NO0000NS9DJL,20,15BR0G6VI,2023-01-28
0661129806,NO0000NT9FDK,20,15BR0G6VI,2023-01-28
0661876851,NO0000O8P2T3,20,15BR0G6VI,2023-01-28
0661129806,NO0000NTA0LL,20,15BR0G6VI,2023-01-28
0661224611,NO0000O1U88W,20,15BR0G6VI,2023-01-28
0661224611,NO0000O1UNF9,20,15BR0G6VI,2023-01-28
0662621251,NO0000OEAXS2,20,15BR0G6VI,2023-01-28
0661508275,NO0000O10OBB,20,15BR0G6VI,2023-01-28
0662621251,NO0000OEAWCL,20,15BR0G6VI,2023-01-28
IYA5,NO0000NS9KRW,20,15BR0G6VI,2023-01-28
0660948963,NO0000O70W95,20,15BR0G6VI,2023-01-28
0661224611,NO0000O1UYNE,20,15BR0G6VI,2023-01-28
0660948963,NO0000O70QCR,20,15BR0G6VI,2023-01-28
0660948963,NO0000O6SSWH,20,15BR0G6VI,2023-01-28
0661502936,NO0000OA0XFP,13,26XY7Y67X,2023-01-28
0662621251,NO0000OEB4E8,13,26XY7Y67X,2023-01-28
IYA5,NO0000O61WC6,13,26XY7Y67X,2023-01-28
0661224611,NO0000O1UIHA,13,26XY7Y67X,2023-01-28
0661224611,NO0000O1UHMR,13,26XY7Y67X,2023-01-28
0661224611,NO0000O1U9W9,13,26XY7Y67X,2023-01-28
0661508275,NO0000NRBEOT,13,26XY7Y67X,2023-01-28
IYA5,NO0000NS8MYK,13,26XY7Y67X,2023-01-28
0662621251,NO0000OEB8HV,13,26XY7Y67X,2023-01-28
0661876851,NO0000O8YRGI,13,26XY7Y67X,2023-01-28
0662621251,NO0000OEB8AZ,13,26XY7Y67X,2023-01-28
0661735239,NO0000OA22NV,13,26XY7Y67X,2023-01-28
0661735239,NO0000OA2A68,13,26XY7Y67X,2023-01-28
IYA5,NO0000NRS2A1,2,2ILNRRH63,2023-01-28
IYA5,NO0000NS8TYI,2,2ILNRRH63,2023-01-28
0660994099,NO0000NY4L4W,2,3EBM51QDT,2023-01-28
0660994099,NO0000NXMPDX,2,3EBM51QDT,2023-01-28
0661735239,NO0000O32QUW,10,4AA4CRUNY,2023-01-28
0661224611,NO0000O8862H,10,4AA4CRUNY,2023-01-28
0661224611,NO0000O883UL,10,4AA4CRUNY,2023-01-28
0662621251,NO0000OEB4HE,10,4AA4CRUNY,2023-01-28
0661876851,NO0000O8YL79,10,4AA4CRUNY,2023-01-28
0662621251,NO0000OEB8JU,10,4AA4CRUNY,2023-01-28
0661224611,NO0000O1XTA5,10,4AA4CRUNY,2023-01-28
0661876851,NO0000O8YEU1,10,4AA4CRUNY,2023-01-28
0661910311,NO0000O329WR,10,4AA4CRUNY,2023-01-28
0661224611,NO0000O1XE24,10,4AA4CRUNY,2023-01-28
0661876851,NO0000O8NTQ0,17,6A36LEHL3,2023-01-28
0661224611,NO0000O8AKD1,17,6A36LEHL3,2023-01-28
0661876851,NO0000O8NX6M,17,6A36LEHL3,2023-01-28
0661855639,NO0000O6G8HP,17,6A36LEHL3,2023-01-28
0661855639,NO0000O6G717,17,6A36LEHL3,2023-01-28
0661855639,NO0000O6G0BE,17,6A36LEHL3,2023-01-28
0661508275,NO0000O27DWA,17,6A36LEHL3,2023-01-28
0661469807,NO0000OAC5QS,17,6A36LEHL3,2023-01-28
0661224611,NO0000O8ASZA,17,6A36LEHL3,2023-01-28
0661508275,NO0000O26LI3,17,6A36LEHL3,2023-01-28
0661817574,NO0000OATJWV,17,6A36LEHL3,2023-01-28
0661817574,NO0000OATM1R,17,6A36LEHL3,2023-01-28
0661129806,NO0000OE6SOE,17,6A36LEHL3,2023-01-28
0661469807,NO0000OA5LOH,17,6A36LEHL3,2023-01-28
0662621251,NO0000OE8SQN,17,6A36LEHL3,2023-01-28
0662621251,NO0000OE8R1V,17,6A36LEHL3,2023-01-28
0661502936,NO0000OA06AZ,17,6A36LEHL3,2023-01-28
0661876851,NO0000O8PBOR,14,6VO1IPYAP,2023-01-28
0662621251,NO0000OE8PC0,14,6VO1IPYAP,2023-01-28
0661469807,NO0000OA6WI7,14,6VO1IPYAP,2023-01-28
0661224611,NO0000O1X0ZB,14,6VO1IPYAP,2023-01-28
IYA5,NO0000OBKCS3,14,6VO1IPYAP,2023-01-28
0661224611,NO0000O1WTJ1,14,6VO1IPYAP,2023-01-28
IYA5,NO0000OBMCAA,14,6VO1IPYAP,2023-01-28
0661129806,NO0000OE7R7C,14,6VO1IPYAP,2023-01-28
0661224611,NO0000O8638C,14,6VO1IPYAP,2023-01-28
0662621251,NO0000OE90CB,14,6VO1IPYAP,2023-01-28
0661876851,NO0000O8ZIBK,14,6VO1IPYAP,2023-01-28
0661876851,NO0000O8Y4QY,14,6VO1IPYAP,2023-01-28
0661469807,NO0000OA6F8P,14,6VO1IPYAP,2023-01-28
0661224611,NO0000O85IWM,14,6VO1IPYAP,2023-01-28
0661876851,NO0000O8ZCZO,5,7WNBHI6WT,2023-01-28
0661876851,NO0000O8ZD8N,5,7WNBHI6WT,2023-01-28
0662621251,NO0000OEB8KG,5,7WNBHI6WT,2023-01-28
0661876851,NO0000O90C9P,5,7WNBHI6WT,2023-01-28
0661508275,NO0000NRBQ12,5,7WNBHI6WT,2023-01-28
0660994099,NO0000NXMUD3,6,DL5WAOJMD,2023-01-28
0661129806,NO0000NT9TZC,6,DL5WAOJMD,2023-01-28
0661224611,NO0000O1UCZE,6,DL5WAOJMD,2023-01-28
0660948963,NO0000O7154S,6,DL5WAOJMD,2023-01-28
0660994099,NO0000NXMBUJ,6,DL5WAOJMD,2023-01-28
0660948963,NO0000O6T06T,6,DL5WAOJMD,2023-01-28
0661876851,NO0000O8YYFK,8,M2F88LYQE,2023-01-28
0661876851,NO0000O8YVXZ,8,M2F88LYQE,2023-01-28
0661855639,NO0000O6DA2H,8,M2F88LYQE,2023-01-28
0661876851,NO0000O9049B,8,M2F88LYQE,2023-01-28
0661876851,NO0000O8ZQU3,8,M2F88LYQE,2023-01-28
0661876851,NO0000O8ZJZ3,8,M2F88LYQE,2023-01-28
0662621251,NO0000OEAU44,8,M2F88LYQE,2023-01-28
0662621251,NO0000OEAQWO,8,M2F88LYQE,2023-01-28
IYA5,NO0000OBP3HI,20,M7SJSNDPG,2023-01-28
0660994099,NO0000NXNZ8Z,20,M7SJSNDPG,2023-01-28
0661508275,NO0000O6CJ88,20,M7SJSNDPG,2023-01-28
0661508275,NO0000O10RWH,20,M7SJSNDPG,2023-01-28
0661508275,NO0000O10OC2,20,M7SJSNDPG,2023-01-28
0661224611,NO0000O1U9TK,20,M7SJSNDPG,2023-01-28
0661508275,NO0000O10RUQ,20,M7SJSNDPG,2023-01-28
0661129806,NO0000NTA1VI,20,M7SJSNDPG,2023-01-28
0660994099,NO0000NW5A3E,20,M7SJSNDPG,2023-01-28
0661224611,NO0000O1UIVG,20,M7SJSNDPG,2023-01-28
IYA5,NO0000OBNA6Z,20,M7SJSNDPG,2023-01-28
0662513164,NO0000OB7S8S,20,M7SJSNDPG,2023-01-28
0662621251,NO0000OEB7TT,20,M7SJSNDPG,2023-01-28
0662513164,NO0000OB7QAF,20,M7SJSNDPG,2023-01-28
0662005840,NO0000O799FX,20,M7SJSNDPG,2023-01-28
0661224611,NO0000O1UI43,20,M7SJSNDPG,2023-01-28
IYA5,NO0000OBOPUO,20,M7SJSNDPG,2023-01-28
0661508275,NO0000O10OCI,20,M7SJSNDPG,2023-01-28
0662621251,NO0000OEB02Q,20,M7SJSNDPG,2023-01-28
0662513164,NO0000OB7Q3D,20,M7SJSNDPG,2023-01-28
0662621251,NO0000OEADX9,8,Q38Z2YTUD,2023-01-28
0661876851,NO0000O911ZX,8,Q38Z2YTUD,2023-01-28
0662621251,NO0000OEAOG4,8,Q38Z2YTUD,2023-01-28
0662621251,NO0000OEAM4I,8,Q38Z2YTUD,2023-01-28
0661876851,NO0000O912MK,8,Q38Z2YTUD,2023-01-28
0661876851,NO0000O8ZBMI,8,Q38Z2YTUD,2023-01-28
0661876851,NO0000O8ZBFP,8,Q38Z2YTUD,2023-01-28
0661224611,NO0000O20X4F,8,Q38Z2YTUD,2023-01-28
0661841328,NO0000ODX41Q,2,SGD7Z6YZU,2023-01-28
0661869936,NO0000ODXEJ2,2,SGD7Z6YZU,2023-01-28
0661508275,NO0000O6AHDC,20,WQXC34UP1,2023-01-28
0661224611,NO0000O8907A,20,WQXC34UP1,2023-01-28
0662621251,NO0000OEB4GZ,20,WQXC34UP1,2023-01-28
0661817574,NO0000OATIHQ,20,WQXC34UP1,2023-01-28
IYA5,NO0000NRRXPG,20,WQXC34UP1,2023-01-28
,NO0000O10O99,20,WQXC34UP1,2023-01-28
0661129806,NO0000NTANBR,20,WQXC34UP1,2023-01-28
0660994099,NO0000NY4DAG,20,WQXC34UP1,2023-01-28
0661876851,NO0000O8YOFV,20,WQXC34UP1,2023-01-28
IYA5,NO0000NRRVIC,20,WQXC34UP1,2023-01-28
0660994099,NO0000NXM7UX,20,WQXC34UP1,2023-01-28
0662005840,NO0000O799KE,20,WQXC34UP1,2023-01-28
0661508275,NO0000O6C418,20,WQXC34UP1,2023-01-28
0660948963,NO0000O6ZYW2,20,WQXC34UP1,2023-01-28
0660994099,NO0000NY4JHM,20,WQXC34UP1,2023-01-28
0661508275,NO0000O10OAK,20,WQXC34UP1,2023-01-28
0660948963,NO0000O6SG1H,20,WQXC34UP1,2023-01-28
0661224611,NO0000O891VI,20,WQXC34UP1,2023-01-28
0661817574,NO0000OATXY5,20,WQXC34UP1,2023-01-28
0660994099,NO0000NXLO94,20,WQXC34UP1,2023-01-28
0660204081,NO0000ODIUX5,7,ZF0R7REUC,2023-01-28
0660110059,NO0000O26RM1,7,ZF0R7REUC,2023-01-28
0705242973,NO0000O3AZ92,7,ZF0R7REUC,2023-01-28
0704049686,NO0000O3BGMH,7,ZF0R7REUC,2023-01-28
0660204081,NO0000ODHYH9,7,ZF0R7REUC,2023-01-28
0705242976,NO0000OE1F0S,7,ZF0R7REUC,2023-01-28
0660204081,NO0000ODI4BT,7,ZF0R7REUC,2023-01-28
0660994099,NO0000NY4DAG,10,1QN08XTO5,2023-01-29
0660994099,NO0000NY4JHM,10,1QN08XTO5,2023-01-29
0660994099,NO0000NXLO94,10,1QN08XTO5,2023-01-29
0661224611,NO0000O8907A,10,1QN08XTO5,2023-01-29
0661508275,NO0000O6C418,10,1QN08XTO5,2023-01-29
0660994099,NO0000NXM7UX,10,1QN08XTO5,2023-01-29
0661817574,NO0000OATIHQ,10,1QN08XTO5,2023-01-29
0661876851,NO0000O8YRGI,10,1QN08XTO5,2023-01-29
0661876851,NO0000O8YOFV,10,1QN08XTO5,2023-01-29
0661508275,NO0000O6ANF4,10,1QN08XTO5,2023-01-29
IYA5,NO0000NRRVIC,20,6HO7KOEFC,2023-01-29
0661557987,NO0000OEH9LT,20,6HO7KOEFC,2023-01-29
,NO0000O10O99,20,6HO7KOEFC,2023-01-29
0661224611,NO0000O1UIHA,20,6HO7KOEFC,2023-01-29
0662621251,NO0000OEB4E8,20,6HO7KOEFC,2023-01-29
0661224611,NO0000O1UHMR,20,6HO7KOEFC,2023-01-29
0661817574,NO0000OATXY5,20,6HO7KOEFC,2023-01-29
0661129806,NO0000NTANBR,20,6HO7KOEFC,2023-01-29
0660948963,NO0000O6ZYW2,20,6HO7KOEFC,2023-01-29
IYA5,NO0000O61WC6,20,6HO7KOEFC,2023-01-29
0661557987,NO0000OEH3A8,20,6HO7KOEFC,2023-01-29
0662621251,NO0000OEB8AZ,20,6HO7KOEFC,2023-01-29
IYA5,NO0000NRRXPG,20,6HO7KOEFC,2023-01-29
0661557987,NO0000OEHC9D,20,6HO7KOEFC,2023-01-29
0661224611,NO0000O891VI,20,6HO7KOEFC,2023-01-29
0662005840,NO0000O799KE,20,6HO7KOEFC,2023-01-29
0660948963,NO0000O6SG1H,20,6HO7KOEFC,2023-01-29
IYA5,NO0000NRS1M2,20,6HO7KOEFC,2023-01-29
0661129806,NO0000NTABKE,20,6HO7KOEFC,2023-01-29
IYA5,NO0000NS8MYK,20,6HO7KOEFC,2023-01-29
0661502936,NO0000O9IB2M,19,7DBYL338Y,2023-01-29
0661502936,NO0000O9KLSU,19,7DBYL338Y,2023-01-29
0661502936,NO0000O9YV8Q,19,7DBYL338Y,2023-01-29
0661129806,NO0000OE6OMN,19,7DBYL338Y,2023-01-29
0662621251,NO0000OE9FLC,19,7DBYL338Y,2023-01-29
0661557987,NO0000OEDVK3,19,7DBYL338Y,2023-01-29
0661502936,NO0000O9YUR6,19,7DBYL338Y,2023-01-29
0661224611,NO0000O1VA99,19,7DBYL338Y,2023-01-29
0661557987,NO0000OEDWIW,19,7DBYL338Y,2023-01-29
0661502936,NO0000O9KLSB,19,7DBYL338Y,2023-01-29
0661224611,NO0000O1WFWD,19,7DBYL338Y,2023-01-29
0661224611,NO0000O8ALPK,19,7DBYL338Y,2023-01-29
0661876851,NO0000O8O01T,19,7DBYL338Y,2023-01-29
0661876851,NO0000O8O6LR,19,7DBYL338Y,2023-01-29
0661502936,NO0000O9HZW0,19,7DBYL338Y,2023-01-29
0661224611,NO0000O1W3X5,19,7DBYL338Y,2023-01-29
0661502936,NO0000O9KLRU,19,7DBYL338Y,2023-01-29
0661224611,NO0000O89M6W,19,7DBYL338Y,2023-01-29
0661224611,NO0000O89OQF,19,7DBYL338Y,2023-01-29
0661876851,NO0000O911ZX,9,86WCVLLT8,2023-01-29
0662621251,NO0000OEADX9,9,86WCVLLT8,2023-01-29
0661224611,NO0000O2026N,9,86WCVLLT8,2023-01-29
0662621251,NO0000OEBXEC,9,86WCVLLT8,2023-01-29
0661876851,NO0000O912MK,9,86WCVLLT8,2023-01-29
0662621251,NO0000OEBKCJ,9,86WCVLLT8,2023-01-29
0661876851,NO0000O8ZBMI,9,86WCVLLT8,2023-01-29
0661876851,NO0000O8ZBFP,9,86WCVLLT8,2023-01-29
0661876851,NO0000O90Y1G,9,86WCVLLT8,2023-01-29
0661224611,NO0000O8ASZA,19,8WDGZDO8M,2023-01-29
0661817574,NO0000OATJWV,19,8WDGZDO8M,2023-01-29
0661508275,NO0000O27DWA,19,8WDGZDO8M,2023-01-29
0661817574,NO0000OATM1R,19,8WDGZDO8M,2023-01-29
0661502936,NO0000OA06AZ,19,8WDGZDO8M,2023-01-29
0662621251,NO0000OE8SQN,19,8WDGZDO8M,2023-01-29
0662621251,NO0000OEBD6G,19,8WDGZDO8M,2023-01-29
0661469807,NO0000OA5LOH,19,8WDGZDO8M,2023-01-29
0661508275,NO0000O26LI3,19,8WDGZDO8M,2023-01-29
0661876851,NO0000O8NTQ0,19,8WDGZDO8M,2023-01-29
0661876851,NO0000O8NX6M,19,8WDGZDO8M,2023-01-29
0661855639,NO0000O6G717,19,8WDGZDO8M,2023-01-29
0662621251,NO0000OE8R1V,19,8WDGZDO8M,2023-01-29
0661224611,NO0000O8AKD1,19,8WDGZDO8M,2023-01-29
0661469807,NO0000OAC5QS,19,8WDGZDO8M,2023-01-29
0661129806,NO0000OE6SOE,19,8WDGZDO8M,2023-01-29
0661855639,NO0000O6G0BE,19,8WDGZDO8M,2023-01-29
0662621251,NO0000OEBFO1,19,8WDGZDO8M,2023-01-29
0661855639,NO0000O6G8HP,19,8WDGZDO8M,2023-01-29
IYA5,NO0000OBOPUO,6,G88WQFEWW,2023-01-29
0661508275,NO0000O10OCI,6,G88WQFEWW,2023-01-29
0662513164,NO0000OB7QAF,6,G88WQFEWW,2023-01-29
0661129806,NO0000NTA1VI,6,G88WQFEWW,2023-01-29
0661508275,NO0000O10RUQ,6,G88WQFEWW,2023-01-29
0661224611,NO0000O1U9TK,6,G88WQFEWW,2023-01-29
0661876851,NO0000O90C9P,6,IJWYSM97Y,2023-01-29
0661876851,NO0000O8ZD8N,6,IJWYSM97Y,2023-01-29
0661876851,NO0000O8ZCZO,6,IJWYSM97Y,2023-01-29
0661557987,NO0000OED4EY,6,IJWYSM97Y,2023-01-29
0661557987,NO0000OED297,6,IJWYSM97Y,2023-01-29
0662621251,NO0000OEB8KG,6,IJWYSM97Y,2023-01-29
0661224611,NO0000O1XTA5,12,L0PNQIOKQ,2023-01-29
0661876851,NO0000O8YL79,12,L0PNQIOKQ,2023-01-29
0661224611,NO0000O883UL,12,L0PNQIOKQ,2023-01-29
0661876851,NO0000O8YEU1,12,L0PNQIOKQ,2023-01-29
0661224611,NO0000O8862H,12,L0PNQIOKQ,2023-01-29
0661735239,NO0000O32QUW,12,L0PNQIOKQ,2023-01-29
0662621251,NO0000OECFRC,12,L0PNQIOKQ,2023-01-29
0662621251,NO0000OEB8JU,12,L0PNQIOKQ,2023-01-29
0661910311,NO0000O329WR,12,L0PNQIOKQ,2023-01-29
0662621251,NO0000OECALW,12,L0PNQIOKQ,2023-01-29
0661224611,NO0000O1XE24,12,L0PNQIOKQ,2023-01-29
0662621251,NO0000OEB4HE,12,L0PNQIOKQ,2023-01-29
0661224611,NO0000O1UDRD,20,LFW6GRF97,2023-01-29
0661508275,NO0000O6CJ88,20,LFW6GRF97,2023-01-29
0662513164,NO0000OB7Q3D,20,LFW6GRF97,2023-01-29
0661508275,NO0000O10RWH,20,LFW6GRF97,2023-01-29
0662513164,NO0000OB7QKH,20,LFW6GRF97,2023-01-29
0662513164,NO0000OB7S8S,20,LFW6GRF97,2023-01-29
IYA5,NO0000OBNA6Z,20,LFW6GRF97,2023-01-29
IYA5,NO0000OBNFP9,20,LFW6GRF97,2023-01-29
IYA5,NO0000OBP3HI,20,LFW6GRF97,2023-01-29
0662005840,NO0000O799FX,20,LFW6GRF97,2023-01-29
0660994099,NO0000NXMPDX,20,LFW6GRF97,2023-01-29
0662621251,NO0000OEB7TT,20,LFW6GRF97,2023-01-29
0662621251,NO0000OEB02Q,20,LFW6GRF97,2023-01-29
0661557987,NO0000OEEUW1,20,LFW6GRF97,2023-01-29
0661224611,NO0000O1UIVG,20,LFW6GRF97,2023-01-29
0661224611,NO0000O8992B,20,LFW6GRF97,2023-01-29
0661557987,NO0000OEESKG,20,LFW6GRF97,2023-01-29
0661224611,NO0000O1UI43,20,LFW6GRF97,2023-01-29
0661508275,NO0000O10OC2,20,LFW6GRF97,2023-01-29
0660994099,NO0000NW5KHG,20,LFW6GRF97,2023-01-29
0662621251,NO0000OEAOG4,3,LSE4X4LNA,2023-01-29
0662621251,NO0000OEAM4I,3,LSE4X4LNA,2023-01-29
0661224611,NO0000O20X4F,3,LSE4X4LNA,2023-01-29
0662621251,NO0000OEBHUK,16,OCVFRC3RL,2023-01-29
0661224611,NO0000O1WTJ1,16,OCVFRC3RL,2023-01-29
0662621251,NO0000OEBGAI,16,OCVFRC3RL,2023-01-29
IYA5,NO0000OBMCAA,16,OCVFRC3RL,2023-01-29
0661224611,NO0000O8638C,16,OCVFRC3RL,2023-01-29
0662621251,NO0000OE8PC0,16,OCVFRC3RL,2023-01-29
0662621251,NO0000OE90CB,16,OCVFRC3RL,2023-01-29
0661224611,NO0000O85IWM,16,OCVFRC3RL,2023-01-29
0661224611,NO0000O1X0ZB,16,OCVFRC3RL,2023-01-29
0661876851,NO0000O8PBOR,16,OCVFRC3RL,2023-01-29
0661129806,NO0000OE7R7C,16,OCVFRC3RL,2023-01-29
IYA5,NO0000OBKCS3,16,OCVFRC3RL,2023-01-29
0661469807,NO0000OA6WI7,16,OCVFRC3RL,2023-01-29
0661469807,NO0000OA6F8P,16,OCVFRC3RL,2023-01-29
0661876851,NO0000O8ZIBK,16,OCVFRC3RL,2023-01-29
0661876851,NO0000O8Y4QY,16,OCVFRC3RL,2023-01-29
0661876851,NO0000O8OW45,20,PJXAOX483,2023-01-29
0662621251,NO0000OEAXS2,20,PJXAOX483,2023-01-29
0662621251,NO0000OEAWCL,20,PJXAOX483,2023-01-29
0661876851,NO0000O8P2T3,20,PJXAOX483,2023-01-29
0661224611,NO0000O1UYNE,20,PJXAOX483,2023-01-29
0661129806,NO0000NSJZZ0,20,PJXAOX483,2023-01-29
0660948963,NO0000O70QCR,20,PJXAOX483,2023-01-29
IYA5,NO0000NS9KRW,20,PJXAOX483,2023-01-29
0661129806,NO0000NT9TZC,20,PJXAOX483,2023-01-29
0661224611,NO0000O1U88W,20,PJXAOX483,2023-01-29
0661224611,NO0000O1UNF9,20,PJXAOX483,2023-01-29
0660948963,NO0000O6SSWH,20,PJXAOX483,2023-01-29
0660948963,NO0000O70IBN,20,PJXAOX483,2023-01-29
,NO0000O8IM1X,20,PJXAOX483,2023-01-29
0661876851,NO0000O8IKXM,20,PJXAOX483,2023-01-29
0661129806,NO0000NTA0LL,20,PJXAOX483,2023-01-29
0661557987,NO0000OEE54G,20,PJXAOX483,2023-01-29
0661557987,NO0000OEE23R,20,PJXAOX483,2023-01-29
0661129806,NO0000NT9FDK,20,PJXAOX483,2023-01-29
0660948963,NO0000O70W95,20,PJXAOX483,2023-01-29
0661557987,NO0000OEJ1TQ,5,Q6QIC2VLB,2023-01-29
0661876851,NO0000O8Z6EW,5,Q6QIC2VLB,2023-01-29
0661876851,NO0000O8Z8PV,5,Q6QIC2VLB,2023-01-29
0661557987,NO0000OEJ0MO,5,Q6QIC2VLB,2023-01-29
0661224611,NO0000O21SBX,5,Q6QIC2VLB,2023-01-29
0661224611,NO0000O1UCZE,7,R33OL26SE,2023-01-29
0661508275,NO0000O10OBB,7,R33OL26SE,2023-01-29
0660994099,NO0000NXMUD3,7,R33OL26SE,2023-01-29
0660948963,NO0000O7154S,7,R33OL26SE,2023-01-29
0660948963,NO0000O6T06T,7,R33OL26SE,2023-01-29
0660994099,NO0000NXMBUJ,7,R33OL26SE,2023-01-29
0660948963,NO0000O6ZED1,7,R33OL26SE,2023-01-29
0661508275,NO0000O6AHDC,3,WKHK38YM3,2023-01-29
0662005840,NO0000O799M5,3,WKHK38YM3,2023-01-29
0661224611,NO0000O1U9UQ,3,WKHK38YM3,2023-01-29
0661557987,NO0000OEKMI6,6,EUIMQ6C8O,2023-01-30
0661876851,NO0000O8Z6EW,6,EUIMQ6C8O,2023-01-30
0661557987,NO0000OEJ1TQ,6,EUIMQ6C8O,2023-01-30
0661557987,NO0000OEJ0MO,6,EUIMQ6C8O,2023-01-30
0661224611,NO0000O21SBX,6,EUIMQ6C8O,2023-01-30
0661876851,NO0000O8Z8PV,6,EUIMQ6C8O,2023-01-30
0661876851,NO0000O8Z8PV,7,6HL2WZP89,2023-01-31
0661557987,NO0000OFB3Y3,7,6HL2WZP89,2023-01-31
0661557987,NO0000OEJ1TQ,7,6HL2WZP89,2023-01-31
0661557987,NO0000OEJ0MO,7,6HL2WZP89,2023-01-31
0661876851,NO0000O8Z6EW,7,6HL2WZP89,2023-01-31
0661557987,NO0000OEKMI6,7,6HL2WZP89,2023-01-31
0661224611,NO0000O21SBX,7,6HL2WZP89,2023-01-31
IGZ91,testing1234,3,9JJS99AOP,2023-01-31
1132445,testingCUSTOMER_LIVENESS_SUCCESS,3,9JJS99AOP,2023-01-31
,bharath1,3,9JJS99AOP,2023-01-31
0661534663,NO0000OFDH4Q,4,LH06AQ0QE,2023-01-31
0660204081,NO0000ODJ38Y,4,LH06AQ0QE,2023-01-31
0704049686,NO0000OA5BNQ,4,LH06AQ0QE,2023-01-31
0661534663,NO0000OFDH09,4,LH06AQ0QE,2023-01-31
