{
  "accessToken":"2da28a15cde11ec89532a1102d5062aea715f8ba90c3ba126fe591b869bdbd613",
  "invalidAccessToken":"abcdfegd",
  "invalidUserId":"abcdefghi",
  "mediumuserName":"mahesh.patnam123",
  "mediumName":"Mahesh Patnam"
}