{
  "baseUrl": "https://www.otrium.com",
  "watchForFileChanges": false,
  "chromeWebSecurity": false,
  "defaultCommandTimeout": 8000,
  "video": false,
  "env": {
    "contactManagerUrl": "http://localhost:3000/",
    "mediumUrl": "https://api.medium.com"
  },
  "reporter": "mochawesome",
  "reporterOptions": {
    "reportDir": "cypress/reports",
    "reportFilename": "report",
    "overwrite": false,
    "html": true,
    "json": true,
    "charts": true
  },
  "projectId": "6g7d85"
}
