[
	{
		"inputs": [
			{
				"internalType": "address",
				"name": "factoryAddress",
				"type": "address"
			}
		],
		"name": "getLength",
		"outputs": [
			{
				"internalType": "uint256",
				"name": "",
				"type": "uint256"
			}
		],
		"stateMutability": "view",
		"type": "function"
	},
	{
		"inputs": [
			{
				"internalType": "address",
				"name": "factory1Address",
				"type": "address"
			},
			{
				"internalType": "address",
				"name": "factory2Address",
				"type": "address"
			},
			{
				"internalType": "uint256",
				"name": "from",
				"type": "uint256"
			},
			{
				"internalType": "uint256",
				"name": "count",
				"type": "uint256"
			}
		],
		"name": "getPools",
		"outputs": [
			{
				"components": [
					{
						"internalType": "address",
						"name": "pool1Address",
						"type": "address"
					},
					{
						"internalType": "address",
						"name": "token10",
						"type": "address"
					},
					{
						"internalType": "address",
						"name": "token11",
						"type": "address"
					},
					{
						"internalType": "uint256",
						"name": "reserve10",
						"type": "uint256"
					},
					{
						"internalType": "uint256",
						"name": "reserve11",
						"type": "uint256"
					},
					{
						"internalType": "address",
						"name": "pool2Address",
						"type": "address"
					},
					{
						"internalType": "address",
						"name": "token20",
						"type": "address"
					},
					{
						"internalType": "address",
						"name": "token21",
						"type": "address"
					},
					{
						"internalType": "uint256",
						"name": "reserve20",
						"type": "uint256"
					},
					{
						"internalType": "uint256",
						"name": "reserve21",
						"type": "uint256"
					}
				],
				"internalType": "struct PoolGather.ArbitragePool[]",
				"name": "",
				"type": "tuple[]"
			}
		],
		"stateMutability": "view",
		"type": "function"
	},
	{
		"inputs": [
			{
				"internalType": "address[]",
				"name": "poolAddresses",
				"type": "address[]"
			}
		],
		"name": "getPoolsByAddress",
		"outputs": [
			{
				"components": [
					{
						"internalType": "address",
						"name": "poolAddress",
						"type": "address"
					},
					{
						"internalType": "address",
						"name": "token0",
						"type": "address"
					},
					{
						"internalType": "address",
						"name": "token1",
						"type": "address"
					},
					{
						"internalType": "uint256",
						"name": "reserve0",
						"type": "uint256"
					},
					{
						"internalType": "uint256",
						"name": "reserve1",
						"type": "uint256"
					}
				],
				"internalType": "struct PoolGather.Pool[]",
				"name": "",
				"type": "tuple[]"
			}
		],
		"stateMutability": "view",
		"type": "function"
	}
]