<svg xmlns="http://www.w3.org/2000/svg" width="25" height="25" viewBox="0 0 25 25">
    <defs>
        <style>
            .cls-1,.cls-3{fill:#fff}.cls-1{stroke:#707070}.cls-2{clip-path:url(#clip-path)}
        </style>
        <clipPath id="clip-path">
            <path id="Rectangle_755" d="M0 0h25v25H0z" class="cls-1" data-name="Rectangle 755" transform="translate(1271 307)"/>
        </clipPath>
    </defs>
    <g id="Mask_Group_234" class="cls-2" data-name="Mask Group 234" transform="translate(-1271 -307)">
        <g id="wall-clock" transform="translate(1271 307)">
            <g id="Group_1717" data-name="Group 1717">
                <g id="Group_1716" data-name="Group 1716">
                    <path id="Path_3267" d="M12.451 0a12.5 12.5 0 0 0 0 25A12.616 12.616 0 0 0 25 12.451 12.528 12.528 0 0 0 12.451 0zm0 23.545a11.045 11.045 0 1 1 11.094-11.094 11.065 11.065 0 0 1-11.094 11.094z" class="cls-3" data-name="Path 3267"/>
                </g>
            </g>
            <g id="Group_1719" data-name="Group 1719">
                <g id="Group_1718" data-name="Group 1718">
                    <path id="Path_3268" d="M13.585 12.451L16 10.039A.732.732 0 0 0 14.961 9l-2.93 2.93a.732.732 0 0 0 0 1.036l2.93 2.93A.732.732 0 0 0 16 14.863z" class="cls-3" data-name="Path 3268"/>
                </g>
            </g>
            <g id="Group_1721" data-name="Group 1721">
                <g id="Group_1720" data-name="Group 1720">
                    <path id="Path_3269" d="M12.451 2.93a9.57 9.57 0 0 0 0 19.141 9.69 9.69 0 0 0 9.619-9.619 9.615 9.615 0 0 0-9.619-9.522zm6.23 14.716l-.435-.435a.732.732 0 0 0-1.036 1.036l.435.435a8.131 8.131 0 0 1-4.462 1.89v-.7a.732.732 0 0 0-1.465 0v.7a7.971 7.971 0 0 1-4.408-1.846l.479-.479a.732.732 0 1 0-1.035-1.037l-.476.476a8.171 8.171 0 0 1-1.851-4.5h.7a.732.732 0 0 0 0-1.465h-.7A8.021 8.021 0 0 1 6.263 7.3l.492.492A.732.732 0 0 0 7.79 6.754l-.49-.491a8.021 8.021 0 0 1 4.42-1.835v.7a.732.732 0 0 0 1.465 0v-.7a8.17 8.17 0 0 1 4.5 1.851l-.476.476a.732.732 0 1 0 1.037 1.035l.479-.479a7.97 7.97 0 0 1 1.846 4.408h-.7a.732.732 0 0 0 0 1.465h.7a8.131 8.131 0 0 1-1.89 4.461z" class="cls-3" data-name="Path 3269"/>
                </g>
            </g>
        </g>
    </g>
</svg>
