{
  "instructions": [
    {
      "instructionId": "1",
      "attemptNum": "0",
      "instructionType": "Cook",
      "inferParams": {
        "modelId": "",
        "modelFileName": ""
      },
      "captureParams": {
        "capturableTasks": [
          {
            "captureSensor": "VisualCamera",
            "sensorParameters": {
              "visualCaptureType": "SyncThermalVisual",
              "numOfSamples": "5",
              "timeBetweenCaptureMS": "30000"
            }
          }
        ],
        "sourceTasks": []
      },
      "actionParams": {
        "targetTemperature": "30",
        "timeToCook": "20",
        "visualScore": "5.2",
        "thermalScore": "8.2",
        "defaultWattage": "200"
      },
      "stirrerParams": {
        "cycleDurationSeconds": "20",
        "stirringPercent": "75",
        "stirringSpeed": "18"
      },
      "cookType": "frying"
    }
  ]
}