{
  "instructionId": 0,
  "attemptNum": 0,
  "instructionType": null,
  "cookType": "boiling",
  "inferParams": {
    "modelId": "consistency_kheer",
    "modelFileName": "consistency_kheer.model"
  },
  "captureParams": {
    "capturableTasks": [
      {
        "captureSensor": "VisualCamera",
        "sensorParameters": {
          "visualCaptureType": "VisionCamera",
          "thermalType": "Image",
          "numOfSamples": "10",
          "timeBetweenCaptureMS": "501",
          "triggerEvent": "StirrerStarts",
          "validationType": "ExposureValidation",
          "validationLowerScore": "0.8",
          "validationHigherScore": "1.0"
        }
      },
      {
        "captureSensor": "WeightSensor",
        "sensorParameters": {
          "numOfSamples": "10",
          "timeBetweenCaptureMS": "10"
        }
      }
    ],
    "sourceTasks": []
  },
  "actionParams": {
    "targetTemperature": 30,
    "timeToCook": 20,
    "visualScore": 5.2,
    "thermalScore": 8.2,
    "defaultWattage": 200
  },
  "stirrerParams": {
    "cycleDurationSeconds": 20,
    "stirringPercent": 75,
    "stirringSpeed": 18
  }
}