{
  "instructions": [
    {
      "instructionId": "1",
      "attemptNum": "0",
      "instructionType": "Dispense",
      "quantityInGrams": "38",
      "ingredients": [
        "Salt",
        "Pepper"
      ],
      "preDispense": {
        "capturableTasks": [
        ],
        "actionableTasks": [
        ],
        "sequenceList": [
          "preDispenseImage",
          "preDispenseWeight"
        ]
      },
      "postDispense": {
        "capturableTasks": [
        ],
        "actionableTasks": [
        ],
        "sequenceList": [
          "postDispenseImage",
          "postDispenseWeight"
        ]
      },
      "dispense": {
        "capturableTasks": [
        ],
        "actionableTasks": [
        ]
      },
      "inferInstructions": [
      ],
      "dispenseHwInformation": {
        "hardwareSubsystem": "Liquid",
        "dispenseMechanism": "LIQUID_OIL_DISPENSE",
        "hardwareFormQuantity": "10",
        "hardwareContainer": "LIQUID_OIL_CONTAINER"
      },
      "preDispenseHwTaskPosition": "0",
      "postDispenseHwTaskPosition": "0"
    },
    {
      "instructionId": "2",
      "attemptNum": "0",
      "instructionType": "Cook",
      "inferParams": {
        "modelId": "",
        "modelFileName": "best_model_deeplab_xception_voc.tflite"
      },
      "captureParams": {
        "capturableTasks": [
          {
            "captureSensor": "VisualCamera",
            "sensorParameters": {
              "visualCaptureType": "SyncThermalVisual",
              "numOfSamples": "1",
              "timeBetweenCaptureMS": "300"
            }
          }
        ],
        "sourceTasks": []
      },
      "actionParams": {
        "targetTemperature": "100",
        "timeToCook": "10",
        "visualScore": "5.2",
        "thermalScore": "8.2",
        "defaultWattage": "200"
      },
      "stirrerParams": {
        "cycleDurationSeconds": "20",
        "stirringPercent": "40",
        "stirringSpeed": "5"
      },
      "cookType": "temperature"
    },
    {
      "instructionId": "3",
      "attemptNum": "0",
      "instructionType": "Dispense",
      "quantityInGrams": "38",
      "ingredients": [
        "Salt",
        "Pepper"
      ],
      "preDispense": {
        "capturableTasks": [
        ],
        "actionableTasks": [
          {
            "taskName": "turnOffExhaustFan",
            "actuator": "ExhaustFan",
            "actionParameters": {
              "actuatorState": "false"
            }
          }
        ],
        "sequenceList": [
        ]
      },
      "postDispense": {
        "capturableTasks": [
        ],
        "actionableTasks": [
          {
            "taskName": "turnOnExhaustFan",
            "actuator": "ExhaustFan",
            "actionParameters": {
              "actuatorState": "true"
            }
          }
        ],
        "sequenceList": [
        ]
      },
      "dispense": {
        "capturableTasks": [
        ],
        "actionableTasks": [
        ]
      },
      "inferInstructions": [
      ],
      "dispenseHwInformation": {
        "hardwareSubsystem": "Micro",
        "dispenseMechanism": "MICRO_CLOCKWISE_DISPENSE",
        "hardwareFormQuantity": "2",
        "hardwareContainer": "MICRO_POD_3"
      },
      "preDispenseHwTaskPosition": "1",
      "postDispenseHwTaskPosition": "1"
    },
    {
      "instructionId": "4",
      "attemptNum": "0",
      "instructionType": "Cook",
      "inferParams": {
        "modelId": "",
        "modelFileName": ""
      },
      "captureParams": {
        "capturableTasks": [
        ],
        "sourceTasks": []
      },
      "actionParams": {
        "targetTemperature": "80",
        "timeToCook": "60",
        "visualScore": "5.2",
        "thermalScore": "8.2",
        "defaultWattage": "1000"
      },
      "stirrerParams": {
        "cycleDurationSeconds": "20",
        "stirringPercent": "40",
        "stirringSpeed": "5"
      },
      "cookType": "wattage"
    },
    {
      "instructionId": "5",
      "attemptNum": "0",
      "instructionType": "Dispense",
      "quantityInGrams": "38",
      "ingredients": [
        "Salt",
        "Pepper"
      ],
      "preDispense": {
        "capturableTasks": [
        ],
        "actionableTasks": [
        ],
        "sequenceList": [
          "preDispenseImage",
          "preDispenseWeight"
        ]
      },
      "postDispense": {
        "capturableTasks": [
        ],
        "actionableTasks": [
        ],
        "sequenceList": [
          "postDispenseImage",
          "postDispenseWeight"
        ]
      },
      "dispense": {
        "capturableTasks": [
        ],
        "actionableTasks": [
        ]
      },
      "inferInstructions": [
      ],
      "dispenseHwInformation": {
        "hardwareSubsystem": "Macro",
        "dispenseMechanism": "MACRO_NON_LIQUID_DISPENSE",
        "hardwareFormQuantity": "20",
        "hardwareContainer": "MACRO_CONTAINER_1"
      },
      "preDispenseHwTaskPosition": "0",
      "postDispenseHwTaskPosition": "0"
    },
    {
      "instructionId": "6",
      "attemptNum": "0",
      "instructionType": "Dispense",
      "quantityInGrams": "38",
      "ingredients": [
        "Salt",
        "Pepper"
      ],
      "preDispense": {
        "capturableTasks": [
        ],
        "actionableTasks": [
        ],
        "sequenceList": [
          "preDispenseImage",
          "preDispenseWeight"
        ]
      },
      "postDispense": {
        "capturableTasks": [
        ],
        "actionableTasks": [
        ],
        "sequenceList": [
          "postDispenseImage",
          "postDispenseWeight"
        ]
      },
      "dispense": {
        "capturableTasks": [
        ],
        "actionableTasks": [
        ]
      },
      "inferInstructions": [
      ],
      "dispenseHwInformation": {
        "hardwareSubsystem": "Liquid",
        "dispenseMechanism": "LIQUID_WATER_DISPENSE",
        "hardwareFormQuantity": "400",
        "hardwareContainer": "LIQUID_WATER_CONTAINER"
      },
      "preDispenseHwTaskPosition": "0",
      "postDispenseHwTaskPosition": "0"
    },
    {
      "instructionId": "7",
      "attemptNum": "0",
      "instructionType": "Cook",
      "inferParams": {
        "modelId": "",
        "modelFileName": ""
      },
      "captureParams": {
        "capturableTasks": [
        ],
        "sourceTasks": []
      },
      "actionParams": {
        "targetTemperature": "80",
        "timeToCook": "600",
        "visualScore": "5.2",
        "thermalScore": "8.2",
        "defaultWattage": "1200"
      },
      "stirrerParams": {
        "cycleDurationSeconds": "20",
        "stirringPercent": "40",
        "stirringSpeed": "5"
      },
      "cookType": "wattage"
    },
    {
      "instructionId": "8",
      "attemptNum": "0",
      "instructionType": "Cook",
      "inferParams": {
        "modelId": "",
        "modelFileName": "rice_dry_wet_diff_model.tflite"
      },
      "captureParams": {
        "capturableTasks": [
          {
            "captureSensor": "VisualCamera",
            "sensorParameters": {
              "visualCaptureType": "VisionCamera",
              "numOfSamples": "2",
              "timeBetweenCaptureMS": "5000"
            }
          }
        ],
        "sourceTasks": []
      },
      "actionParams": {
        "targetTemperature": "80",
        "timeToCook": "120",
        "visualScore": "100",
        "thermalScore": "8.2",
        "defaultWattage": "800"
      },
      "stirrerParams": {
        "cycleDurationSeconds": "30",
        "stirringPercent": "0",
        "stirringSpeed": "0"
      },
      "cookType": "dry_wet"
    },

    {
      "instructionId": "3",
      "attemptNum": "0",
      "instructionType": "Cook",
      "inferParams": {
        "modelId": "onion",
        "modelFileName": "torchscript_onion_frying_resnet34_pytorch_1.6.pt"
      },
      "captureParams": [
        {
          "captureSensor": "VisualCamera",
          "sensorParameters": {
            "visualCaptureType": "VisionCamera",
            "numOfSamples": "2",
            "triggerEvent": "StirrerStops",
            "timeBetweenCaptureMS" : "50"
          }
        }
      ],
      "actionParams": {
        "targetTemperature": "80",
        "timeToCook": "600",
        "visualScore": "55",
        "thermalScore": "0.5",
        "defaultWattage": "1200"
      },
      "stirrerParams": {
        "cycleDurationSeconds": "30",
        "stirringPercent": "50",
        "stirringSpeed": "7"
      },
      "cookType": "frying"
    }
  ]
}