{
	"info": {
		"_postman_id": "75ce0ac1-eac0-44b2-a975-7e6e94dbcd45",
		"name": "QA Go Rest",
		"schema": "https://schema.getpostman.com/json/collection/v2.0.0/collection.json",
		"_exporter_id": "23847892"
	},
	"item": [
		{
			"name": "New Request",
			"request": {
				"method": "GET",
				"header": [],
				"url": "https://gorest.co.in/public/v2/posts"
			},
			"response": []
		},
		{
			"name": "New Request",
			"event": [
				{
					"listen": "test",
					"script": {
						"exec": [
							"pm.test(\"fetching id value from response body\", function(){",
							"    const jsonData=pm.response.json();",
							"    const id = jsonData.id;",
							"    pm.collectionVariables.set(\"idValue\",id);",
							"})"
						],
						"type": "text/javascript"
					}
				}
			],
			"request": {
				"auth": {
					"type": "noauth"
				},
				"method": "POST",
				"header": [
					{
						"key": "Authorization",
						"value": "Bearer f6172f0de8ad1b800c2a8e0ae5ca16fd46d59ef1d65b655139819acb630e2b53",
						"type": "text"
					}
				],
				"body": {
					"mode": "raw",
					"raw": "{\n        \n        \"user_id\": 193126,\n        \"title\": \"Selenium Webdriver\",\n        \"body\": \"QA Refresher Session\"\n}",
					"options": {
						"raw": {
							"language": "json"
						}
					}
				},
				"url": "https://gorest.co.in/public/v2/posts"
			},
			"response": []
		},
		{
			"name": "PutMethod",
			"event": [
				{
					"listen": "test",
					"script": {
						"exec": [
							"pm.test(\"Validate status code\",function(){",
							"    pm.response.to.have.status(200)",
							"})",
							""
						],
						"type": "text/javascript"
					}
				}
			],
			"request": {
				"method": "PUT",
				"header": [
					{
						"key": "Authorization",
						"value": "Bearer f6172f0de8ad1b800c2a8e0ae5ca16fd46d59ef1d65b655139819acb630e2b53",
						"type": "text"
					}
				],
				"body": {
					"mode": "raw",
					"raw": "{\n    \"user_id\": 193126,\n    \"title\": \"Cucumber\",\n    \"body\": \"Automation Testing\"\n}",
					"options": {
						"raw": {
							"language": "json"
						}
					}
				},
				"url": "https://gorest.co.in/public/v2/posts/{{idValue}}"
			},
			"response": []
		},
		{
			"name": "New Request",
			"request": {
				"method": "DELETE",
				"header": [
					{
						"key": "Authorization",
						"value": "Bearer f6172f0de8ad1b800c2a8e0ae5ca16fd46d59ef1d65b655139819acb630e2b53",
						"type": "text"
					}
				],
				"url": "https://gorest.co.in/public/v2/posts/{{idValue}}"
			},
			"response": []
		}
	],
	"event": [
		{
			"listen": "prerequest",
			"script": {
				"type": "text/javascript",
				"exec": [
					""
				]
			}
		},
		{
			"listen": "test",
			"script": {
				"type": "text/javascript",
				"exec": [
					""
				]
			}
		}
	],
	"variable": [
		{
			"key": "idValue",
			"value": "8756",
			"type": "string"
		}
	]
}