{
  "sourceDefinitionId": "9c74c2d7-531a-4ebf-b6d8-6181f805ecdc",
  "documentationUrl": "https://docs.airbyte.com/integrations/sources/younium",
  "connectionSpecification": {
    "type": "object",
    "title": "Younium Spec",
    "$schema": "http://json-schema.org/draft-07/schema#",
    "required": [
      "username",
      "password",
      "legal_entity"
    ],
    "properties": {
      "password": {
        "type": "string",
        "title": "Password",
        "description": "Account password for younium account API key",
        "airbyte_secret": true
      },
      "username": {
        "type": "string",
        "title": "Username",
        "description": "Username for Younium account"
      },
      "playground": {
        "type": "boolean",
        "title": "Playground environment",
        "default": false,
        "description": "Property defining if connector is used against playground or production environment"
      },
      "legal_entity": {
        "type": "string",
        "title": "Legal Entity",
        "description": "Legal Entity that data should be pulled from"
      }
    },
    "additionalProperties": true
  },
  "jobInfo": {
    "id": "ba7b84cc-8f50-495a-919c-62a50645f755",
    "configType": "get_spec",
    "configId": "Optional.empty",
    "createdAt": 1705523876508,
    "endedAt": 1705523876508,
    "succeeded": true,
    "connectorConfigurationUpdated": false,
    "logs": {
      "logLines": []
    }
  }
}