{
  "sourceDefinitionId": "7cf88806-25f5-4e1a-b422-b2fa9e1b0090",
  "documentationUrl": "https://docs.airbyte.com/integrations/source/elasticsearch",
  "connectionSpecification": {
    "type": "object",
    "title": "Elasticsearch Connection Configuration",
    "$schema": "http://json-schema.org/draft-07/schema#",
    "required": [
      "endpoint"
    ],
    "properties": {
      "endpoint": {
        "type": "string",
        "title": "Server Endpoint",
        "description": "The full url of the Elasticsearch server"
      },
      "authenticationMethod": {
        "type": "object",
        "oneOf": [
          {
            "title": "None",
            "required": [
              "method"
            ],
            "properties": {
              "method": {
                "type": "string",
                "const": "none"
              }
            },
            "description": "No authentication will be used",
            "additionalProperties": true
          },
          {
            "title": "Api Key/Secret",
            "required": [
              "method",
              "apiKeyId",
              "apiKeySecret"
            ],
            "properties": {
              "method": {
                "type": "string",
                "const": "secret"
              },
              "apiKeyId": {
                "type": "string",
                "title": "API Key ID",
                "description": "The Key ID to used when accessing an enterprise Elasticsearch instance."
              },
              "apiKeySecret": {
                "type": "string",
                "title": "API Key Secret",
                "description": "The secret associated with the API Key ID.",
                "airbyte_secret": true
              }
            },
            "description": "Use a api key and secret combination to authenticate",
            "additionalProperties": true
          },
          {
            "title": "Username/Password",
            "required": [
              "method",
              "username",
              "password"
            ],
            "properties": {
              "method": {
                "type": "string",
                "const": "basic"
              },
              "password": {
                "type": "string",
                "title": "Password",
                "description": "Basic auth password to access a secure Elasticsearch server",
                "airbyte_secret": true
              },
              "username": {
                "type": "string",
                "title": "Username",
                "description": "Basic auth username to access a secure Elasticsearch server"
              }
            },
            "description": "Basic auth header with a username and password",
            "additionalProperties": true
          }
        ],
        "title": "Authentication Method",
        "description": "The type of authentication to be used"
      }
    },
    "additionalProperties": true
  },
  "jobInfo": {
    "id": "c63a7b4a-9df5-449e-93a3-e1347ecf925e",
    "configType": "get_spec",
    "configId": "Optional.empty",
    "createdAt": 1705523879150,
    "endedAt": 1705523879150,
    "succeeded": true,
    "connectorConfigurationUpdated": false,
    "logs": {
      "logLines": []
    }
  }
}