{
  "sourceDefinitionId": "95bcc041-1d1a-4c2e-8802-0ca5b1bfa36a",
  "documentationUrl": "https://docs.airbyte.com/integrations/sources/orbit",
  "connectionSpecification": {
    "type": "object",
    "title": "Orbit Source Spec",
    "$schema": "http://json-schema.org/draft-07/schema#",
    "required": [
      "api_token",
      "workspace"
    ],
    "properties": {
      "api_token": {
        "type": "string",
        "order": 0,
        "title": "API Token",
        "description": "Authorizes you to work with Orbit workspaces associated with the token.",
        "airbyte_secret": true
      },
      "workspace": {
        "type": "string",
        "order": 1,
        "title": "Workspace",
        "description": "The unique name of the workspace that your API token is associated with."
      },
      "start_date": {
        "type": "string",
        "order": 2,
        "title": "Start Date",
        "pattern": "^[0-9]{4}-[0-9]{2}-[0-9]{2}$",
        "description": "Date in the format 2022-06-26. Only load members whose last activities are after this date."
      }
    },
    "additionalProperties": true
  },
  "jobInfo": {
    "id": "d544fc96-a04a-47f3-9d4b-e2e00c5a9b7f",
    "configType": "get_spec",
    "configId": "Optional.empty",
    "createdAt": 1705523896966,
    "endedAt": 1705523896966,
    "succeeded": true,
    "connectorConfigurationUpdated": false,
    "logs": {
      "logLines": []
    }
  }
}