{
  "sourceDefinitionId": "919984ef-53a2-479b-8ffe-9c1ddb9fc3f3",
  "documentationUrl": "https://docs.airbyte.com/integrations/sources/coin-api",
  "connectionSpecification": {
    "type": "object",
    "title": "Coin API Spec",
    "$schema": "http://json-schema.org/draft-07/schema#",
    "required": [
      "api_key",
      "environment",
      "symbol_id",
      "period",
      "start_date"
    ],
    "properties": {
      "limit": {
        "type": "integer",
        "default": 100,
        "maximum": 100000,
        "minimum": 1,
        "description": "The maximum number of elements to return. If not supplied, the default\nis 100. For numbers larger than 100, each 100 items is counted as one\nrequest for pricing purposes. Maximum value is 100000.\n"
      },
      "period": {
        "type": "string",
        "examples": [
          "5SEC",
          "2MTH"
        ],
        "description": "The period to use. See the documentation for a list. https://docs.coinapi.io/#list-all-periods-get"
      },
      "api_key": {
        "type": "string",
        "order": 0,
        "description": "API Key",
        "airbyte_secret": true
      },
      "end_date": {
        "type": "string",
        "pattern": "^[0-9]{4}-[0-9]{2}-[0-9]{2}T[0-9]{2}:[0-9]{2}:[0-9]{2}$",
        "examples": [
          "2019-01-01T00:00:00"
        ],
        "description": "The end date in ISO 8601 format. If not supplied, data will be returned\nfrom the start date to the current time, or when the count of result\nelements reaches its limit.\n"
      },
      "symbol_id": {
        "type": "string",
        "order": 2,
        "description": "The symbol ID to use. See the documentation for a list.\nhttps://docs.coinapi.io/#list-all-symbols-get\n"
      },
      "start_date": {
        "type": "string",
        "pattern": "^[0-9]{4}-[0-9]{2}-[0-9]{2}T[0-9]{2}:[0-9]{2}:[0-9]{2}$",
        "examples": [
          "2019-01-01T00:00:00"
        ],
        "description": "The start date in ISO 8601 format."
      },
      "environment": {
        "enum": [
          "sandbox",
          "production"
        ],
        "type": "string",
        "order": 1,
        "default": "sandbox",
        "description": "The environment to use. Either sandbox or production.\n"
      }
    }
  },
  "jobInfo": {
    "id": "f4c6e738-78c4-49f7-829f-667d26ee7f99",
    "configType": "get_spec",
    "configId": "Optional.empty",
    "createdAt": 1705523878836,
    "endedAt": 1705523878836,
    "succeeded": true,
    "connectorConfigurationUpdated": false,
    "logs": {
      "logLines": []
    }
  }
}