{
  "sourceDefinitionId": "06bdb480-2598-40b8-8b0f-fc2e2d2abdda",
  "name": "Opsgenie",
  "dockerRepository": "airbyte/source-opsgenie",
  "dockerImageTag": "0.3.0",
  "documentationUrl": "https://docs.airbyte.com/integrations/sources/opsgenie",
  "protocolVersion": "0.2.0",
  "custom": false,
  "supportLevel": "community",
  "releaseStage": "alpha",
  "sourceType": "api"
}