{
  "sourceDefinitionId": "45e0b135-615c-40ac-b38e-e65b0944197f",
  "documentationUrl": "https://docs.airbyte.com/integrations/sources/lokalise",
  "connectionSpecification": {
    "type": "object",
    "title": "Lokalise Spec",
    "$schema": "http://json-schema.org/draft-07/schema#",
    "required": [
      "api_key",
      "project_id"
    ],
    "properties": {
      "api_key": {
        "type": "string",
        "title": "API Key",
        "description": "Lokalise API Key with read-access. Available at Profile settings > API tokens. See <a href=\"https://docs.lokalise.com/en/articles/1929556-api-tokens\">here</a>.",
        "airbyte_secret": true
      },
      "project_id": {
        "type": "string",
        "title": "Project Id",
        "description": "Lokalise project ID. Available at Project Settings > General."
      }
    },
    "additionalProperties": true
  },
  "jobInfo": {
    "id": "1d9833a4-a0a6-4c26-8cb3-4b526bb86430",
    "configType": "get_spec",
    "configId": "Optional.empty",
    "createdAt": 1705523876029,
    "endedAt": 1705523876029,
    "succeeded": true,
    "connectorConfigurationUpdated": false,
    "logs": {
      "logLines": []
    }
  }
}