{
  "sourceDefinitionId": "bff9a277-e01d-420d-81ee-80f28a307318",
  "name": "Gutendex",
  "dockerRepository": "airbyte/source-gutendex",
  "dockerImageTag": "0.1.0",
  "documentationUrl": "https://docs.airbyte.com/integrations/sources/gutendex",
  "protocolVersion": "0.2.0",
  "custom": false,
  "supportLevel": "community",
  "releaseStage": "alpha",
  "sourceType": "api"
}