{
  "sourceDefinitionId": "0fae6a9a-04eb-44d4-96e1-e02d3dbc1d83",
  "documentationUrl": "https://docs.airbyte.com/integrations/sources/nytimes",
  "connectionSpecification": {
    "type": "object",
    "title": "Nytimes Spec",
    "$schema": "http://json-schema.org/draft-07/schema#",
    "required": [
      "api_key",
      "start_date",
      "period"
    ],
    "properties": {
      "period": {
        "enum": [
          1,
          7,
          30
        ],
        "type": "integer",
        "order": 3,
        "title": "Period (used for Most Popular streams)",
        "description": "Period of time (in days)"
      },
      "api_key": {
        "type": "string",
        "order": 0,
        "title": "API Key",
        "description": "API Key",
        "airbyte_secret": true
      },
      "end_date": {
        "type": "string",
        "order": 2,
        "title": "End Date",
        "format": "date",
        "pattern": "^[0-9]{4}-[0-9]{2}$",
        "examples": [
          "2022-08",
          "1851-01"
        ],
        "description": "End date to stop the article retrieval (format YYYY-MM)"
      },
      "share_type": {
        "enum": [
          "facebook"
        ],
        "type": "string",
        "order": 4,
        "title": "Share Type (used for Most Popular Shared stream)",
        "description": "Share Type"
      },
      "start_date": {
        "type": "string",
        "order": 1,
        "title": "Start Date",
        "format": "date",
        "pattern": "^[0-9]{4}-[0-9]{2}$",
        "examples": [
          "2022-08",
          "1851-01"
        ],
        "description": "Start date to begin the article retrieval (format YYYY-MM)"
      }
    },
    "additionalProperties": true
  },
  "jobInfo": {
    "id": "c0642b4b-c41b-4fc1-a224-f44080fb3a33",
    "configType": "get_spec",
    "configId": "Optional.empty",
    "createdAt": 1705523878915,
    "endedAt": 1705523878915,
    "succeeded": true,
    "connectorConfigurationUpdated": false,
    "logs": {
      "logLines": []
    }
  }
}