{
  "sourceDefinitionId": "781f8b1d-4e20-4842-a2c3-cd9b119d65fa",
  "documentationUrl": "https://docs.airbyte.com/integrations/sources/smaily",
  "connectionSpecification": {
    "type": "object",
    "title": "Smaily Spec",
    "$schema": "http://json-schema.org/draft-07/schema#",
    "required": [
      "api_subdomain",
      "api_username",
      "api_password"
    ],
    "properties": {
      "api_password": {
        "type": "string",
        "title": "API User Password",
        "description": "API user password. See https://smaily.com/help/api/general/create-api-user/",
        "airbyte_secret": true
      },
      "api_username": {
        "type": "string",
        "title": "API User Username",
        "description": "API user username. See https://smaily.com/help/api/general/create-api-user/"
      },
      "api_subdomain": {
        "type": "string",
        "title": "API Subdomain",
        "description": "API Subdomain. See https://smaily.com/help/api/general/create-api-user/"
      }
    },
    "additionalProperties": true
  },
  "jobInfo": {
    "id": "6be7cb02-bc0f-4ef2-87a3-573e8076e88d",
    "configType": "get_spec",
    "configId": "Optional.empty",
    "createdAt": 1705523882041,
    "endedAt": 1705523882041,
    "succeeded": true,
    "connectorConfigurationUpdated": false,
    "logs": {
      "logLines": []
    }
  }
}