{
  "sourceDefinitionId": "7e20ce3e-d820-4327-ad7a-88f3927fd97a",
  "documentationUrl": "https://docs.faros.ai",
  "connectionSpecification": {
    "type": "object",
    "title": "VictorOps Spec",
    "$schema": "http://json-schema.org/draft-07/schema#",
    "required": [
      "apiId",
      "apiKey"
    ],
    "properties": {
      "apiId": {
        "type": "string",
        "title": "VictorOps API ID",
        "airbyte_secret": true
      },
      "apiKey": {
        "type": "string",
        "title": "VictorOps API key",
        "airbyte_secret": true
      },
      "pageLimit": {
        "type": "number",
        "title": "VictorOps Page Limit",
        "default": 100
      },
      "currentPhase": {
        "type": "string",
        "title": "VictorOps Current Phase",
        "default": "triggered,acknowledged,resolved"
      },
      "maxContentLength": {
        "type": "number",
        "title": "VictorOps Content Length",
        "default": 500000,
        "description": "VictorOps API response content length limit, try increasing if 'RequestError' is encountered."
      }
    },
    "additionalProperties": true
  },
  "jobInfo": {
    "id": "d81e69ae-690e-4da5-9082-d5d61abbd58e",
    "configType": "get_spec",
    "configId": "Optional.empty",
    "createdAt": 1705523894585,
    "endedAt": 1705523894585,
    "succeeded": true,
    "connectorConfigurationUpdated": false,
    "logs": {
      "logLines": []
    }
  }
}