{
  "sourceDefinitionId": "8baba53d-2fe3-4e33-bc85-210d0eb62884",
  "name": "Zenefits",
  "dockerRepository": "airbyte/source-zenefits",
  "dockerImageTag": "0.2.0",
  "documentationUrl": "https://docs.airbyte.com/integrations/sources/zenefits",
  "protocolVersion": "0.2.0",
  "custom": false,
  "supportLevel": "community",
  "releaseStage": "alpha",
  "releaseDate": "2022-08-24",
  "sourceType": "api"
}