{
  "sourceDefinitionId": "b9dc6155-672e-42ea-b10d-9f1f1fb95ab1",
  "documentationUrl": "https://docs.airbyte.com/integrations/sources/twilio",
  "connectionSpecification": {
    "type": "object",
    "title": "Twilio Spec",
    "$schema": "http://json-schema.org/draft-07/schema#",
    "required": [
      "account_sid",
      "auth_token",
      "start_date"
    ],
    "properties": {
      "auth_token": {
        "type": "string",
        "order": 2,
        "title": "Auth Token",
        "description": "Twilio Auth Token.",
        "airbyte_secret": true
      },
      "start_date": {
        "type": "string",
        "order": 3,
        "title": "Replication Start Date",
        "format": "date-time",
        "pattern": "^[0-9]{4}-[0-9]{2}-[0-9]{2}T[0-9]{2}:[0-9]{2}:[0-9]{2}Z$",
        "examples": [
          "2020-10-01T00:00:00Z"
        ],
        "description": "UTC date and time in the format 2020-10-01T00:00:00Z. Any data before this date will not be replicated."
      },
      "account_sid": {
        "type": "string",
        "order": 1,
        "title": "Account ID",
        "description": "Twilio account SID",
        "airbyte_secret": true
      },
      "lookback_window": {
        "type": "integer",
        "order": 4,
        "title": "Lookback window",
        "default": 0,
        "maximum": 576000,
        "minimum": 0,
        "examples": [
          60
        ],
        "description": "How far into the past to look for records. (in minutes)"
      }
    },
    "additionalProperties": true
  },
  "jobInfo": {
    "id": "f3791f38-4297-4e52-936b-3edb82c052b1",
    "configType": "get_spec",
    "configId": "Optional.empty",
    "createdAt": 1705523882840,
    "endedAt": 1705523882840,
    "succeeded": true,
    "connectorConfigurationUpdated": false,
    "logs": {
      "logLines": []
    }
  }
}