{
  "sourceDefinitionId": "d0243522-dccf-4978-8ba0-37ed47a0bdbf",
  "documentationUrl": "https://docsurl.com",
  "connectionSpecification": {
    "type": "object",
    "title": "Asana Spec",
    "$schema": "http://json-schema.org/draft-07/schema#",
    "properties": {
      "test_mode": {
        "type": "boolean",
        "title": "Test Mode",
        "description": "This flag is used for testing purposes for certain streams that return a lot of data. This flag is not meant to be enabled for prod.",
        "airbyte_hidden": true
      },
      "credentials": {
        "type": "object",
        "oneOf": [
          {
            "type": "object",
            "title": "Authenticate via Asana (Oauth)",
            "required": [
              "client_id",
              "client_secret",
              "refresh_token"
            ],
            "properties": {
              "client_id": {
                "type": "string",
                "title": "",
                "description": "",
                "airbyte_secret": true
              },
              "option_title": {
                "type": "string",
                "const": "OAuth Credentials",
                "title": "Credentials title",
                "description": "OAuth Credentials"
              },
              "client_secret": {
                "type": "string",
                "title": "",
                "description": "",
                "airbyte_secret": true
              },
              "refresh_token": {
                "type": "string",
                "title": "",
                "description": "",
                "airbyte_secret": true
              }
            }
          },
          {
            "type": "object",
            "title": "Authenticate with Personal Access Token",
            "required": [
              "personal_access_token"
            ],
            "properties": {
              "option_title": {
                "type": "string",
                "const": "PAT Credentials",
                "title": "Credentials title",
                "description": "PAT Credentials"
              },
              "personal_access_token": {
                "type": "string",
                "title": "Personal Access Token",
                "description": "Asana Personal Access Token (generate yours <a href=\"https://app.asana.com/0/developer-console\">here</a>).",
                "airbyte_secret": true
              }
            }
          }
        ],
        "title": "Authentication mechanism",
        "description": "Choose how to authenticate to Github"
      },
      "organization_export_ids": {
        "type": "array",
        "title": "Organization Export IDs",
        "description": "Globally unique identifiers for the organization exports"
      }
    },
    "additionalProperties": true
  },
  "advancedAuth": {
    "authFlowType": "oauth2.0",
    "predicateKey": [
      "credentials",
      "option_title"
    ],
    "predicateValue": "OAuth Credentials",
    "oauthConfigSpecification": {
      "completeOAuthOutputSpecification": {
        "type": "object",
        "properties": {
          "refresh_token": {
            "type": "string",
            "path_in_connector_config": [
              "credentials",
              "refresh_token"
            ]
          }
        }
      },
      "completeOAuthServerInputSpecification": {
        "type": "object",
        "properties": {
          "client_id": {
            "type": "string"
          },
          "client_secret": {
            "type": "string"
          }
        }
      },
      "completeOAuthServerOutputSpecification": {
        "type": "object",
        "properties": {
          "client_id": {
            "type": "string",
            "path_in_connector_config": [
              "credentials",
              "client_id"
            ]
          },
          "client_secret": {
            "type": "string",
            "path_in_connector_config": [
              "credentials",
              "client_secret"
            ]
          }
        }
      }
    }
  },
  "jobInfo": {
    "id": "b782f09f-f22c-42fe-beba-c794f0e577f7",
    "configType": "get_spec",
    "configId": "Optional.empty",
    "createdAt": 1705523885277,
    "endedAt": 1705523885277,
    "succeeded": true,
    "connectorConfigurationUpdated": false,
    "logs": {
      "logLines": []
    }
  }
}