{
  "sourceDefinitionId": "0541b2cd-2367-4986-b5f1-b79ff55439e4",
  "documentationUrl": "https://docs.airbyte.io/integrations/sources/courier",
  "connectionSpecification": {
    "type": "object",
    "title": "Courier Source Spec",
    "$schema": "http://json-schema.org/draft-07/schema#",
    "required": [
      "api_key"
    ],
    "properties": {
      "api_key": {
        "type": "string",
        "description": "Courier API Key to retrieve your data.",
        "airbyte_secret": true
      }
    },
    "additionalProperties": true
  },
  "jobInfo": {
    "id": "f2daad6a-5302-4fd5-8d30-1b88b2e12ed6",
    "configType": "get_spec",
    "configId": "Optional.empty",
    "createdAt": 1705523877912,
    "endedAt": 1705523877912,
    "succeeded": true,
    "connectorConfigurationUpdated": false,
    "logs": {
      "logLines": []
    }
  }
}