{
  "sourceDefinitionId": "e7f0c5e2-4815-48c4-90cf-f47124209835",
  "documentationUrl": "https://docs.airbyte.com/integrations/sources/omnisend",
  "connectionSpecification": {
    "type": "object",
    "title": "Omnisend Spec",
    "$schema": "http://json-schema.org/draft-07/schema#",
    "required": [
      "api_key"
    ],
    "properties": {
      "api_key": {
        "type": "string",
        "title": "API Key",
        "description": "API Key",
        "airbyte_secret": true
      }
    },
    "additionalProperties": true
  },
  "jobInfo": {
    "id": "c8be90c0-9ba6-4c40-8e90-6ae41fb9c1d8",
    "configType": "get_spec",
    "configId": "Optional.empty",
    "createdAt": 1705523875487,
    "endedAt": 1705523875487,
    "succeeded": true,
    "connectorConfigurationUpdated": false,
    "logs": {
      "logLines": []
    }
  }
}