{
  "sourceDefinitionId": "cf8ff320-6272-4faa-89e6-4402dc17e5d5",
  "connectionSpecification": {
    "type": "object",
    "title": "Glassfrog Spec",
    "$schema": "http://json-schema.org/draft-07/schema#",
    "required": [
      "api_key"
    ],
    "properties": {
      "api_key": {
        "type": "string",
        "description": "API key provided by Glassfrog",
        "airbyte_secret": true
      }
    },
    "additionalProperties": true
  },
  "jobInfo": {
    "id": "e2bbabd1-71f9-4c55-9ba2-9b38d678c57d",
    "configType": "get_spec",
    "configId": "Optional.empty",
    "createdAt": 1705523877132,
    "endedAt": 1705523877132,
    "succeeded": true,
    "connectorConfigurationUpdated": false,
    "logs": {
      "logLines": []
    }
  }
}