{
  "sourceDefinitionId": "fe2b4084-3386-4d3b-9ad6-308f61a6f1e6",
  "documentationUrl": "https://docs.airbyte.com/integrations/sources/harvest",
  "connectionSpecification": {
    "type": "object",
    "title": "Harvest Spec",
    "$schema": "http://json-schema.org/draft-07/schema#",
    "required": [
      "account_id",
      "replication_start_date"
    ],
    "properties": {
      "account_id": {
        "type": "string",
        "order": 0,
        "title": "Account ID",
        "description": "Harvest account ID. Required for all Harvest requests in pair with Personal Access Token",
        "airbyte_secret": true
      },
      "credentials": {
        "type": "object",
        "oneOf": [
          {
            "type": "object",
            "title": "Authenticate via Harvest (OAuth)",
            "required": [
              "client_id",
              "client_secret",
              "refresh_token"
            ],
            "properties": {
              "auth_type": {
                "type": "string",
                "const": "Client",
                "order": 0
              },
              "client_id": {
                "type": "string",
                "title": "Client ID",
                "description": "The Client ID of your Harvest developer application."
              },
              "client_secret": {
                "type": "string",
                "title": "Client Secret",
                "description": "The Client Secret of your Harvest developer application.",
                "airbyte_secret": true
              },
              "refresh_token": {
                "type": "string",
                "title": "Refresh Token",
                "description": "Refresh Token to renew the expired Access Token.",
                "airbyte_secret": true
              }
            },
            "additionalProperties": true
          },
          {
            "type": "object",
            "title": "Authenticate with Personal Access Token",
            "required": [
              "api_token"
            ],
            "properties": {
              "api_token": {
                "type": "string",
                "title": "Personal Access Token",
                "description": "Log into Harvest and then create new <a href=\"https://id.getharvest.com/developers\"> personal access token</a>.",
                "airbyte_secret": true
              },
              "auth_type": {
                "type": "string",
                "const": "Token",
                "order": 0
              }
            },
            "additionalProperties": true
          }
        ],
        "order": 3,
        "title": "Authentication mechanism",
        "description": "Choose how to authenticate to Harvest."
      },
      "replication_end_date": {
        "type": "string",
        "order": 2,
        "title": "End Date",
        "format": "date-time",
        "pattern": "^[0-9]{4}-[0-9]{2}-[0-9]{2}T[0-9]{2}:[0-9]{2}:[0-9]{2}Z$",
        "examples": [
          "2017-01-25T00:00:00Z"
        ],
        "description": "UTC date and time in the format 2017-01-25T00:00:00Z. Any data after this date will not be replicated.",
        "airbyte_hidden": true
      },
      "replication_start_date": {
        "type": "string",
        "order": 1,
        "title": "Start Date",
        "format": "date-time",
        "pattern": "^[0-9]{4}-[0-9]{2}-[0-9]{2}T[0-9]{2}:[0-9]{2}:[0-9]{2}Z$",
        "examples": [
          "2017-01-25T00:00:00Z"
        ],
        "description": "UTC date and time in the format 2017-01-25T00:00:00Z. Any data before this date will not be replicated."
      }
    },
    "additionalProperties": true
  },
  "advancedAuth": {
    "authFlowType": "oauth2.0",
    "predicateKey": [
      "credentials",
      "auth_type"
    ],
    "predicateValue": "Client",
    "oauthConfigSpecification": {
      "completeOAuthOutputSpecification": {
        "type": "object",
        "properties": {
          "refresh_token": {
            "type": "string",
            "path_in_connector_config": [
              "credentials",
              "refresh_token"
            ]
          }
        },
        "additionalProperties": true
      },
      "completeOAuthServerInputSpecification": {
        "type": "object",
        "properties": {
          "client_id": {
            "type": "string"
          },
          "client_secret": {
            "type": "string"
          }
        },
        "additionalProperties": true
      },
      "completeOAuthServerOutputSpecification": {
        "type": "object",
        "properties": {
          "client_id": {
            "type": "string",
            "path_in_connector_config": [
              "credentials",
              "client_id"
            ]
          },
          "client_secret": {
            "type": "string",
            "path_in_connector_config": [
              "credentials",
              "client_secret"
            ]
          }
        },
        "additionalProperties": true
      }
    }
  },
  "jobInfo": {
    "id": "a0b7afb8-a07d-4994-bf5e-c0c600341681",
    "configType": "get_spec",
    "configId": "Optional.empty",
    "createdAt": 1705523891080,
    "endedAt": 1705523891080,
    "succeeded": true,
    "connectorConfigurationUpdated": false,
    "logs": {
      "logLines": []
    }
  }
}