{
  "sourceDefinitionId": "69d9eb65-8026-47dc-baf1-e4bf67901fd6",
  "documentationUrl": "https://docs.airbyte.com/integrations/sources/pexels-api",
  "connectionSpecification": {
    "type": "object",
    "title": "Pexel API Spec",
    "$schema": "http://json-schema.org/draft-07/schema#",
    "required": [
      "api_key",
      "query"
    ],
    "properties": {
      "size": {
        "type": "string",
        "title": "Specific size for the search",
        "examples": [
          "large",
          "small"
        ],
        "description": "Optional, Minimum photo size. The current supported sizes are large(24MP), medium(12MP) or small(4MP)."
      },
      "color": {
        "type": "string",
        "title": "Specific color for the search",
        "examples": [
          "red",
          "orange"
        ],
        "description": "Optional, Desired photo color. Supported colors red, orange, yellow, green, turquoise, blue, violet, pink, brown, black, gray, white or any hexidecimal color code."
      },
      "query": {
        "type": "string",
        "title": "Specific query for the search",
        "examples": [
          "people",
          "oceans"
        ],
        "description": "Optional, the search query, Example Ocean, Tigers, Pears, etc."
      },
      "locale": {
        "type": "string",
        "title": "Specific locale for the search",
        "examples": [
          "en-US",
          "pt-BR"
        ],
        "description": "Optional, The locale of the search you are performing. The current supported locales are 'en-US' 'pt-BR' 'es-ES' 'ca-ES' 'de-DE' 'it-IT' 'fr-FR' 'sv-SE' 'id-ID' 'pl-PL' 'ja-JP' 'zh-TW' 'zh-CN' 'ko-KR' 'th-TH' 'nl-NL' 'hu-HU' 'vi-VN' 'cs-CZ' 'da-DK' 'fi-FI' 'uk-UA' 'el-GR' 'ro-RO' 'nb-NO' 'sk-SK' 'tr-TR' 'ru-RU'."
      },
      "api_key": {
        "type": "string",
        "title": "API Key from the pexels website",
        "description": "API key is required to access pexels api, For getting your's goto https://www.pexels.com/api/documentation and create account for free.",
        "airbyte_secret": true
      },
      "orientation": {
        "type": "string",
        "title": "Specific orientation for the search",
        "examples": [
          "square",
          "landscape"
        ],
        "description": "Optional, Desired photo orientation. The current supported orientations are landscape, portrait or square"
      }
    },
    "additionalProperties": true
  },
  "jobInfo": {
    "id": "7e6a320e-c96f-4418-b47a-27fa427a0c43",
    "configType": "get_spec",
    "configId": "Optional.empty",
    "createdAt": 1705523887417,
    "endedAt": 1705523887417,
    "succeeded": true,
    "connectorConfigurationUpdated": false,
    "logs": {
      "logLines": []
    }
  }
}