{
  "sourceDefinitionId": "16447954-e6a8-4593-b140-43dea13bc457",
  "documentationUrl": "https://docsurl.com",
  "connectionSpecification": {
    "type": "object",
    "title": "Appsflyer Spec",
    "$schema": "http://json-schema.org/draft-07/schema#",
    "required": [
      "app_id",
      "api_token",
      "start_date"
    ],
    "properties": {
      "app_id": {
        "type": "string",
        "description": "App identifier as found in AppsFlyer."
      },
      "timezone": {
        "type": "string",
        "default": "UTC",
        "examples": [
          "US/Pacific",
          "UTC"
        ],
        "description": "Time zone in which date times are stored. The project timezone may be found in the App settings in the AppsFlyer console."
      },
      "api_token": {
        "type": "string",
        "description": "Pull API token for authentication. If you change the account admin, the token changes, and you must update scripts with the new token. <a href=\"https://support.appsflyer.com/hc/en-us/articles/360004562377\">Get the API token in the Dashboard</a>.",
        "airbyte_secret": true
      },
      "start_date": {
        "type": "string",
        "pattern": "^[0-9]{4}-[0-9]{2}-[0-9]{2}( [0-9]{2}:[0-9]{2}:[0-9]{2})?$",
        "examples": [
          "2021-11-16",
          "2021-11-16 15:00:00"
        ],
        "description": "The default value to use if no bookmark exists for an endpoint. Raw Reports historical lookback is limited to 90 days."
      }
    },
    "additionalProperties": false
  },
  "jobInfo": {
    "id": "9e45f36d-c016-4cc2-b84e-c2177492c5c0",
    "configType": "get_spec",
    "configId": "Optional.empty",
    "createdAt": 1705523885516,
    "endedAt": 1705523885516,
    "succeeded": true,
    "connectorConfigurationUpdated": false,
    "logs": {
      "logLines": []
    }
  }
}