{
  "sourceDefinitionId": "5ea4459a-8f1a-452a-830f-a65c38cc438d",
  "documentationUrl": "https://docs.airbyte.io/integrations/sources/genesys",
  "connectionSpecification": {
    "type": "object",
    "title": "Genesys Connector Configuration",
    "$schema": "http://json-schema.org/draft-07/schema#",
    "required": [
      "start_date",
      "tenant_endpoint",
      "client_id",
      "client_secret"
    ],
    "properties": {
      "client_id": {
        "type": "string",
        "order": 0,
        "title": "Client ID",
        "description": "Your OAuth user Client ID",
        "airbyte_secret": true
      },
      "start_date": {
        "type": "string",
        "order": 3,
        "title": "Start Date",
        "pattern": "^[0-9]{4}-[0-9]{2}-[0-9]{2}$",
        "description": "Start Date in format: YYYY-MM-DD"
      },
      "client_secret": {
        "type": "string",
        "order": 1,
        "title": "Client Secret",
        "description": "Your OAuth user Client Secret",
        "airbyte_secret": true
      },
      "tenant_endpoint": {
        "enum": [
          "Americas (US East)",
          "Americas (US East 2)",
          "Americas (US West)",
          "Americas (Canada)",
          "Americas (S\u00e3o Paulo)",
          "EMEA (Frankfurt)",
          "EMEA (Dublin)",
          "EMEA (London)",
          "Asia Pacific (Mumbai)",
          "Asia Pacific (Seoul)",
          "Asia Pacific (Sydney)"
        ],
        "type": "string",
        "order": 2,
        "title": "Tenant Endpoint Location",
        "description": "Please choose the right endpoint where your Tenant is located. More info by this <a href=\"https://help.mypurecloud.com/articles/aws-regions-for-genesys-cloud-deployment/\">Link</a>"
      }
    }
  },
  "jobInfo": {
    "id": "301245fb-f421-461c-8815-694bfdbd3644",
    "configType": "get_spec",
    "configId": "Optional.empty",
    "createdAt": 1705523884182,
    "endedAt": 1705523884182,
    "succeeded": true,
    "connectorConfigurationUpdated": false,
    "logs": {
      "logLines": []
    }
  }
}