{
  "sourceDefinitionId": "cd06e646-31bf-4dc8-af48-cbc6530fcad3",
  "documentationUrl": "https://docs.airbyte.io/integrations/sources/kustomer",
  "connectionSpecification": {
    "type": "object",
    "title": "Source Kustomer Singer Spec",
    "$schema": "http://json-schema.org/draft-07/schema#",
    "required": [
      "api_token",
      "start_date"
    ],
    "properties": {
      "api_token": {
        "type": "string",
        "title": "API Token",
        "description": "Kustomer API Token. See the <a href=\"https://developer.kustomer.com/kustomer-api-docs/reference/authentication\">docs</a> on how to obtain this",
        "airbyte_secret": true
      },
      "start_date": {
        "type": "string",
        "title": "Start Date",
        "examples": [
          "2019-01-01T00:00:00Z"
        ],
        "description": "The date from which you'd like to replicate the data"
      }
    },
    "additionalProperties": true
  },
  "jobInfo": {
    "id": "1b60737c-6992-44a2-b427-d1971143f1a1",
    "configType": "get_spec",
    "configId": "Optional.empty",
    "createdAt": 1705523880938,
    "endedAt": 1705523880938,
    "succeeded": true,
    "connectorConfigurationUpdated": false,
    "logs": {
      "logLines": []
    }
  }
}