{
  "sourceDefinitionId": "fa290790-1dca-43e7-8ced-6a40b2a66099",
  "connectionSpecification": {
    "type": "object",
    "title": "Captain Data Spec",
    "required": [
      "api_key",
      "project_uid"
    ],
    "properties": {
      "api_key": {
        "type": "string",
        "title": "API Key",
        "description": "Your Captain Data project API key.",
        "airbyte_secret": true
      },
      "project_uid": {
        "type": "string",
        "title": "Project UID",
        "description": "Your Captain Data project uuid."
      }
    },
    "additionalProperties": true
  },
  "jobInfo": {
    "id": "e241fb78-6d80-4001-a0cf-3804042257ca",
    "configType": "get_spec",
    "configId": "Optional.empty",
    "createdAt": 1705523875797,
    "endedAt": 1705523875797,
    "succeeded": true,
    "connectorConfigurationUpdated": false,
    "logs": {
      "logLines": []
    }
  }
}