{
  "sourceDefinitionId": "722ba4bf-06ec-45a4-8dd5-72e4a5cf3903",
  "documentationUrl": "https://docs.airbyte.io/integrations/sources/my-hours",
  "connectionSpecification": {
    "type": "object",
    "title": "My Hours Spec",
    "$schema": "http://json-schema.org/draft-07/schema#",
    "required": [
      "email",
      "password",
      "start_date"
    ],
    "properties": {
      "email": {
        "type": "string",
        "title": "Email",
        "example": "john@doe.com",
        "description": "Your My Hours username"
      },
      "password": {
        "type": "string",
        "title": "Password",
        "description": "The password associated to the username",
        "airbyte_secret": true
      },
      "start_date": {
        "type": "string",
        "title": "Start Date",
        "pattern": "^[0-9]{4}-[0-9]{2}-[0-9]{2}$",
        "examples": [
          "%Y-%m-%d",
          "2016-01-01"
        ],
        "description": "Start date for collecting time logs"
      },
      "logs_batch_size": {
        "type": "integer",
        "title": "Time logs batch size",
        "default": 30,
        "maximum": 365,
        "minimum": 1,
        "examples": [
          30
        ],
        "description": "Pagination size used for retrieving logs in days"
      }
    },
    "additionalProperties": false
  },
  "jobInfo": {
    "id": "68b386b3-8de5-42d2-ac6e-1df0422f9e02",
    "configType": "get_spec",
    "configId": "Optional.empty",
    "createdAt": 1705523883636,
    "endedAt": 1705523883636,
    "succeeded": true,
    "connectorConfigurationUpdated": false,
    "logs": {
      "logLines": []
    }
  }
}