{
  "sourceDefinitionId": "88ecd3a8-5f5b-11ed-9b6a-0242ac120002",
  "name": "PyPI",
  "dockerRepository": "airbyte/source-pypi",
  "dockerImageTag": "0.1.0",
  "documentationUrl": "https://docs.airbyte.com/integrations/sources/pypi",
  "icon": "<svg xmlns=\"http://www.w3.org/2000/svg\" width=\"250\" height=\"250\" fill=\"none\"><g clip-path=\"url(#a)\"><path fill=\"#E8E8E8\" d=\"m224 60.879-99 48.13-98.538-48.947 99-33.062L224 60.879Z\"/><path fill=\"#F2F0F0\" d=\"m224 60.879-.462 114.007-99 48.114.462-113.991 99-48.13Z\"/><path fill=\"#DDD\" d=\"M125 109.009 124.538 223 26 174.07l.462-114.007L125 109.008Z\"/></g><defs><clipPath id=\"a\"><path fill=\"#fff\" d=\"M26 27h198v196H26z\"/></clipPath></defs></svg>",
  "protocolVersion": "0.2.0",
  "custom": false,
  "supportLevel": "community",
  "releaseStage": "alpha",
  "sourceType": "api"
}