{
  "sourceDefinitionId": "6babfc42-c734-4ef6-a817-6eca15f0f9b7",
  "documentationUrl": "https://docs.airbyte.io/integrations/sources/everhour",
  "connectionSpecification": {
    "type": "object",
    "title": "Everhour Spec",
    "required": [
      "api_key"
    ],
    "properties": {
      "api_key": {
        "type": "string",
        "title": "API Key",
        "description": "Everhour API Key. See the <a href=\"https://everhour.docs.apiary.io/#introduction/authentication\">docs</a> for information on how to generate this key.",
        "airbyte_secret": true
      }
    },
    "additionalProperties": true
  },
  "jobInfo": {
    "id": "c9bbb3ee-5925-4be4-bdff-5a9c0978309c",
    "configType": "get_spec",
    "configId": "Optional.empty",
    "createdAt": 1705523878062,
    "endedAt": 1705523878062,
    "succeeded": true,
    "connectorConfigurationUpdated": false,
    "logs": {
      "logLines": []
    }
  }
}