{
  "sourceDefinitionId": "b1ccb590-e84f-46c0-83a0-2048ccfffdae",
  "name": "Pendo",
  "dockerRepository": "airbyte/source-pendo",
  "dockerImageTag": "0.1.0",
  "documentationUrl": "https://docs.airbyte.com/integrations/sources/pendo",
  "icon": "<svg width=\"250\" height=\"250\" viewBox=\"0 0 250 250\" fill=\"none\" xmlns=\"http://www.w3.org/2000/svg\">\n<path fill-rule=\"evenodd\" clip-rule=\"evenodd\" d=\"M28 125.5H124.5V220L221 125.5V31H124.5L28 125.5Z\" fill=\"#FF4876\"/>\n</svg>\n",
  "protocolVersion": "0.2.0",
  "custom": false,
  "supportLevel": "community",
  "releaseStage": "alpha",
  "sourceType": "api"
}