{
  "sourceDefinitionId": "6fe89830-d04d-401b-aad6-6552ffa5c4af",
  "documentationUrl": "https://docs.faros.ai",
  "connectionSpecification": {
    "type": "object",
    "title": "Harness Spec",
    "$schema": "http://json-schema.org/draft-07/schema#",
    "required": [
      "api_key",
      "account_id"
    ],
    "properties": {
      "api_key": {
        "type": "string",
        "title": "Harness API key",
        "airbyte_secret": true
      },
      "api_url": {
        "type": "string",
        "title": "Harness API URL",
        "default": "https://app.harness.io",
        "examples": [
          "https://my-harness-server.example.com"
        ]
      },
      "page_size": {
        "type": "number",
        "title": "Harness Page Size",
        "default": 100,
        "description": "number of pipelines (builds) to fetch per call"
      },
      "account_id": {
        "type": "string",
        "title": "Harness account ID"
      },
      "cutoff_days": {
        "type": "number",
        "title": "Harness Cutoff Days",
        "default": 90,
        "description": "Only fetch deployments updated after cutoff"
      },
      "deployment_timeout": {
        "type": "number",
        "title": "Harness Deployment Timeout",
        "default": 24,
        "description": "Max number of hours to consider for a deployment to be running/queued before giving up on syncing it"
      }
    },
    "additionalProperties": false
  },
  "jobInfo": {
    "id": "b3c0524b-abd4-4be3-8f71-6bf99b39c384",
    "configType": "get_spec",
    "configId": "Optional.empty",
    "createdAt": 1705523880622,
    "endedAt": 1705523880622,
    "succeeded": true,
    "connectorConfigurationUpdated": false,
    "logs": {
      "logLines": []
    }
  }
}