{
  "sourceDefinitionId": "fa290790-1dca-43e7-8ced-6a40b2a66099",
  "name": "Captain Data",
  "dockerRepository": "airbyte/source-captain-data",
  "dockerImageTag": "0.1.0",
  "documentationUrl": "https://docs.airbyte.com/integrations/sources/captain-data",
  "protocolVersion": "0.2.0",
  "custom": false,
  "supportLevel": "community",
  "releaseStage": "alpha",
  "sourceType": "api"
}