{
  "sourceDefinitionId": "dfd88b22-b603-4c3d-aad7-3701784586b1",
  "documentationUrl": "https://docs.airbyte.com/integrations/sources/faker",
  "connectionSpecification": {
    "type": "object",
    "title": "Faker Source Spec",
    "$schema": "http://json-schema.org/draft-07/schema#",
    "required": [
      "count"
    ],
    "properties": {
      "seed": {
        "type": "integer",
        "order": 1,
        "title": "Seed",
        "default": -1,
        "description": "Manually control the faker random seed to return the same values on subsequent runs (leave -1 for random)"
      },
      "count": {
        "type": "integer",
        "order": 0,
        "title": "Count",
        "default": 1000,
        "minimum": 1,
        "description": "How many users should be generated in total.  This setting does not apply to the purchases or products stream."
      },
      "parallelism": {
        "type": "integer",
        "order": 4,
        "title": "Parallelism",
        "default": 4,
        "minimum": 1,
        "description": "How many parallel workers should we use to generate fake data?  Choose a value equal to the number of CPUs you will allocate to this source."
      },
      "always_updated": {
        "type": "boolean",
        "title": "Always Updated",
        "default": true,
        "description": "Should the updated_at values for every record be new each sync?  Setting this to false will case the source to stop emitting records after COUNT records have been emitted."
      },
      "records_per_slice": {
        "type": "integer",
        "order": 2,
        "title": "Records Per Stream Slice",
        "default": 1000,
        "minimum": 1,
        "description": "How many fake records will be in each page (stream slice), before a state message is emitted?"
      }
    },
    "additionalProperties": true
  },
  "jobInfo": {
    "id": "81fdd3b6-9a7f-4947-91b2-29f392d1d99e",
    "configType": "get_spec",
    "configId": "Optional.empty",
    "createdAt": 1705523884649,
    "endedAt": 1705523884649,
    "succeeded": true,
    "connectorConfigurationUpdated": false,
    "logs": {
      "logLines": []
    }
  }
}