<?xml version="1.0" encoding="UTF-8"?>
<svg width="138px" height="34px" viewBox="0 0 138 34" version="1.1" xmlns="http://www.w3.org/2000/svg" xmlns:xlink="http://www.w3.org/1999/xlink">
    <title>Logotypes/Title/PrimaryIkoner</title>
    <defs>
        <path d="M11.216719,0 C23.1840617,0 32.8857792,9.86989741 32.8857792,22.0454762 C32.8857792,26.3045675 31.6953718,30.2792529 29.639151,33.6501443 L25.2636643,30.713033 C26.7735081,28.1859139 27.6431038,25.2190676 27.6431038,22.0454762 C27.6431038,12.8157543 20.2888478,5.33374658 11.216719,5.33374658 Z M11.216719,10.6340151 C17.411514,10.6340151 22.433438,15.7431755 22.433438,22.0452313 C22.433438,28.3476369 17.411514,33.4567973 11.216719,33.4567973 C5.02192394,33.4567973 0,28.3476369 0,22.0452313 C0,15.7431755 5.02192394,10.6340151 11.216719,10.6340151 Z M11.216719,15.9492211 C7.90716624,15.9492211 5.22479522,18.6785377 5.22479522,22.0452313 C5.22479522,25.4122747 7.90716624,28.1415914 11.216719,28.1415914 C14.5262717,28.1415914 17.2086428,25.4122747 17.2086428,22.0452313 C17.2086428,18.6785377 14.5262717,15.9492211 11.216719,15.9492211 Z" id="path-1"></path>
    </defs>
    <g id="Landningssida" stroke="none" stroke-width="1" fill="none" fill-rule="evenodd">
        <g id="Knapp-Ladda-upp" transform="translate(-802.000000, -5472.000000)">
            <g id="Logotypes/Title/Primary" transform="translate(802.521541, 5472.000000)">
                <g id="✏️-TITLE" transform="translate(59.875000, 7.156250)" fill="#333333" fill-rule="nonzero">
                    <polygon id="Path" points="13.15625 22.84375 0 22.84375 0 0 13.15625 0 13.15625 3.96875 4.84375 3.96875 4.84375 8.984375 12.578125 8.984375 12.578125 12.953125 4.84375 12.953125 4.84375 18.84375 13.15625 18.84375"></polygon>
                    <path d="M29.734375,17.65625 C29.734375,19.4479167 29.1119792,20.8125 27.8671875,21.75 C26.6223958,22.6875 24.7604167,23.15625 22.28125,23.15625 C21.0104167,23.15625 19.9270833,23.0703125 19.03125,22.8984375 C18.1354167,22.7265625 17.296875,22.4739583 16.515625,22.140625 L16.515625,18.203125 C17.4010417,18.6197917 18.3984375,18.96875 19.5078125,19.25 C20.6171875,19.53125 21.59375,19.671875 22.4375,19.671875 C24.1666667,19.671875 25.03125,19.171875 25.03125,18.171875 C25.03125,17.796875 24.9166667,17.4921875 24.6875,17.2578125 C24.4583333,17.0234375 24.0625,16.7578125 23.5,16.4609375 C22.9375,16.1640625 22.1875,15.8177083 21.25,15.421875 C19.90625,14.859375 18.9192708,14.3385417 18.2890625,13.859375 C17.6588542,13.3802083 17.2005208,12.8307292 16.9140625,12.2109375 C16.6276042,11.5911458 16.484375,10.828125 16.484375,9.921875 C16.484375,8.36979167 17.0859375,7.16927083 18.2890625,6.3203125 C19.4921875,5.47135417 21.1979167,5.046875 23.40625,5.046875 C25.5104167,5.046875 27.5572917,5.50520833 29.546875,6.421875 L28.109375,9.859375 C27.234375,9.484375 26.4166667,9.17708333 25.65625,8.9375 C24.8958333,8.69791667 24.1197917,8.578125 23.328125,8.578125 C21.921875,8.578125 21.21875,8.95833333 21.21875,9.71875 C21.21875,10.1458333 21.4453125,10.515625 21.8984375,10.828125 C22.3515625,11.140625 23.34375,11.6041667 24.875,12.21875 C26.2395833,12.7708333 27.2395833,13.2864583 27.875,13.765625 C28.5104167,14.2447917 28.9791667,14.796875 29.28125,15.421875 C29.5833333,16.046875 29.734375,16.7916667 29.734375,17.65625 Z" id="Path"></path>
                    <path d="M40.8125,19.359375 C41.6458333,19.359375 42.6458333,19.1770833 43.8125,18.8125 L43.8125,22.359375 C42.625,22.890625 41.1666667,23.15625 39.4375,23.15625 C37.53125,23.15625 36.1432292,22.6744792 35.2734375,21.7109375 C34.4036458,20.7473958 33.96875,19.3020833 33.96875,17.375 L33.96875,8.953125 L31.6875,8.953125 L31.6875,6.9375 L34.3125,5.34375 L35.6875,1.65625 L38.734375,1.65625 L38.734375,5.375 L43.625,5.375 L43.625,8.953125 L38.734375,8.953125 L38.734375,17.375 C38.734375,18.0520833 38.9244792,18.5520833 39.3046875,18.875 C39.6848958,19.1979167 40.1875,19.359375 40.8125,19.359375 Z" id="Path"></path>
                    <path d="M54.578125,8.4375 C53.5677083,8.4375 52.7760417,8.7578125 52.203125,9.3984375 C51.6302083,10.0390625 51.3020833,10.9479167 51.21875,12.125 L57.90625,12.125 C57.8854167,10.9479167 57.578125,10.0390625 56.984375,9.3984375 C56.390625,8.7578125 55.5885417,8.4375 54.578125,8.4375 Z M55.25,23.15625 C52.4375,23.15625 50.2395833,22.3802083 48.65625,20.828125 C47.0729167,19.2760417 46.28125,17.078125 46.28125,14.234375 C46.28125,11.3072917 47.0130208,9.04427083 48.4765625,7.4453125 C49.9401042,5.84635417 51.9635417,5.046875 54.546875,5.046875 C57.015625,5.046875 58.9375,5.75 60.3125,7.15625 C61.6875,8.5625 62.375,10.5052083 62.375,12.984375 L62.375,15.296875 L51.109375,15.296875 C51.1614583,16.6510417 51.5625,17.7083333 52.3125,18.46875 C53.0625,19.2291667 54.1145833,19.609375 55.46875,19.609375 C56.5208333,19.609375 57.515625,19.5 58.453125,19.28125 C59.390625,19.0625 60.3697917,18.7135417 61.390625,18.234375 L61.390625,21.921875 C60.5572917,22.3385417 59.6666667,22.6484375 58.71875,22.8515625 C57.7708333,23.0546875 56.6145833,23.15625 55.25,23.15625 Z" id="Shape"></path>
                    <path d="M76,5.046875 C76.6458333,5.046875 77.1822917,5.09375 77.609375,5.1875 L77.25,9.65625 C76.8645833,9.55208333 76.3958333,9.5 75.84375,9.5 C74.3229167,9.5 73.1380208,9.890625 72.2890625,10.671875 C71.4401042,11.453125 71.015625,12.546875 71.015625,13.953125 L71.015625,22.84375 L66.25,22.84375 L66.25,5.375 L69.859375,5.375 L70.5625,8.3125 L70.796875,8.3125 C71.3385417,7.33333333 72.0703125,6.54427083 72.9921875,5.9453125 C73.9140625,5.34635417 74.9166667,5.046875 76,5.046875 Z" id="Path"></path>
                </g>
                <rect id="Divider" fill="#333333" x="44" y="0" width="1" height="34"></rect>
                <g id="Symbol" transform="translate(0.000000, 0.000000)">
                    <mask id="mask-2" fill="white">
                        <use xlink:href="#path-1"></use>
                    </mask>
                    <use id="Main-Symbol" fill="#95C23E" xlink:href="#path-1"></use>
                </g>
            </g>
        </g>
    </g>
</svg>