<?xml version="1.0" encoding="UTF-8"?>
<svg width="154px" height="34px" viewBox="0 0 154 34" version="1.1" xmlns="http://www.w3.org/2000/svg" xmlns:xlink="http://www.w3.org/1999/xlink">
    <title>Logotypes/Title/PrimaryIkoner</title>
    <defs>
        <path d="M11.216719,0 C23.1840617,0 32.8857792,9.86989741 32.8857792,22.0454762 C32.8857792,26.3045675 31.6953718,30.2792529 29.639151,33.6501443 L25.2636643,30.713033 C26.7735081,28.1859139 27.6431038,25.2190676 27.6431038,22.0454762 C27.6431038,12.8157543 20.2888478,5.33374658 11.216719,5.33374658 Z M11.216719,10.6340151 C17.411514,10.6340151 22.433438,15.7431755 22.433438,22.0452313 C22.433438,28.3476369 17.411514,33.4567973 11.216719,33.4567973 C5.02192394,33.4567973 0,28.3476369 0,22.0452313 C0,15.7431755 5.02192394,10.6340151 11.216719,10.6340151 Z M11.216719,15.9492211 C7.90716624,15.9492211 5.22479522,18.6785377 5.22479522,22.0452313 C5.22479522,25.4122747 7.90716624,28.1415914 11.216719,28.1415914 C14.5262717,28.1415914 17.2086428,25.4122747 17.2086428,22.0452313 C17.2086428,18.6785377 14.5262717,15.9492211 11.216719,15.9492211 Z" id="path-1"></path>
    </defs>
    <g id="Landningssida" stroke="none" stroke-width="1" fill="none" fill-rule="evenodd">
        <g id="Knapp-Ladda-upp" transform="translate(-802.000000, -5368.000000)">
            <g id="Logotypes/Title/Primary" transform="translate(802.521541, 5368.000000)">
                <g id="✏️-TITLE" transform="translate(57.000000, 0.656250)" fill="#333333" fill-rule="nonzero">
                    <path d="M16.859375,29.34375 L15.203125,23.90625 L6.875,23.90625 L5.21875,29.34375 L0,29.34375 L8.0625,6.40625 L13.984375,6.40625 L22.078125,29.34375 L16.859375,29.34375 Z M14.046875,19.84375 C12.515625,14.9166667 11.6536458,12.1302083 11.4609375,11.484375 C11.2682292,10.8385417 11.1302083,10.328125 11.046875,9.953125 C10.703125,11.2864583 9.71875,14.5833333 8.09375,19.84375 L14.046875,19.84375 Z M5.703125,2.109375 C5.703125,1.43229167 5.8984375,0.911458333 6.2890625,0.546875 C6.6796875,0.182291667 7.20833333,0 7.875,0 C8.5625,0 9.1015625,0.192708333 9.4921875,0.578125 C9.8828125,0.963541667 10.078125,1.47395833 10.078125,2.109375 C10.078125,2.734375 9.88020833,3.23697917 9.484375,3.6171875 C9.08854167,3.99739583 8.55208333,4.1875 7.875,4.1875 C7.20833333,4.1875 6.6796875,4.00520833 6.2890625,3.640625 C5.8984375,3.27604167 5.703125,2.765625 5.703125,2.109375 Z M12,2.109375 C12,1.38020833 12.2109375,0.846354167 12.6328125,0.5078125 C13.0546875,0.169270833 13.578125,0 14.203125,0 C14.8802083,0 15.4192708,0.1875 15.8203125,0.5625 C16.2213542,0.9375 16.421875,1.453125 16.421875,2.109375 C16.421875,2.74479167 16.21875,3.25 15.8125,3.625 C15.40625,4 14.8697917,4.1875 14.203125,4.1875 C13.578125,4.1875 13.0546875,4.01822917 12.6328125,3.6796875 C12.2109375,3.34114583 12,2.81770833 12,2.109375 Z" id="Shape"></path>
                    <path d="M29.796875,17.25 L31.390625,17.25 C32.8802083,17.25 33.9947917,16.9557292 34.734375,16.3671875 C35.4739583,15.7786458 35.84375,14.921875 35.84375,13.796875 C35.84375,12.6614583 35.5338542,11.8229167 34.9140625,11.28125 C34.2942708,10.7395833 33.3229167,10.46875 32,10.46875 L29.796875,10.46875 L29.796875,17.25 Z M40.734375,13.625 C40.734375,16.0833333 39.9661458,17.9635417 38.4296875,19.265625 C36.8932292,20.5677083 34.7083333,21.21875 31.875,21.21875 L29.796875,21.21875 L29.796875,29.34375 L24.953125,29.34375 L24.953125,6.5 L32.25,6.5 C35.0208333,6.5 37.1276042,7.09635417 38.5703125,8.2890625 C40.0130208,9.48177083 40.734375,11.2604167 40.734375,13.625 Z" id="Shape"></path>
                    <path d="M49.890625,17.25 L51.484375,17.25 C52.9739583,17.25 54.0885417,16.9557292 54.828125,16.3671875 C55.5677083,15.7786458 55.9375,14.921875 55.9375,13.796875 C55.9375,12.6614583 55.6276042,11.8229167 55.0078125,11.28125 C54.3880208,10.7395833 53.4166667,10.46875 52.09375,10.46875 L49.890625,10.46875 L49.890625,17.25 Z M60.828125,13.625 C60.828125,16.0833333 60.0598958,17.9635417 58.5234375,19.265625 C56.9869792,20.5677083 54.8020833,21.21875 51.96875,21.21875 L49.890625,21.21875 L49.890625,29.34375 L45.046875,29.34375 L45.046875,6.5 L52.34375,6.5 C55.1145833,6.5 57.2213542,7.09635417 58.6640625,8.2890625 C60.1067708,9.48177083 60.828125,11.2604167 60.828125,13.625 Z" id="Shape"></path>
                    <polygon id="Path" points="65.140625 29.34375 65.140625 6.5 69.984375 6.5 69.984375 25.34375 79.25 25.34375 79.25 29.34375"></polygon>
                    <polygon id="Path" points="96.375 29.34375 83.21875 29.34375 83.21875 6.5 96.375 6.5 96.375 10.46875 88.0625 10.46875 88.0625 15.484375 95.796875 15.484375 95.796875 19.453125 88.0625 19.453125 88.0625 25.34375 96.375 25.34375"></polygon>
                </g>
                <rect id="Divider" fill="#333333" x="44" y="0" width="1" height="34"></rect>
                <g id="Symbol" transform="translate(0.000000, 0.000000)">
                    <mask id="mask-2" fill="white">
                        <use xlink:href="#path-1"></use>
                    </mask>
                    <use id="Main-Symbol" fill="#95C23E" xlink:href="#path-1"></use>
                </g>
            </g>
        </g>
    </g>
</svg>