<?xml version="1.0" encoding="UTF-8"?>
<svg width="194px" height="194px" viewBox="0 0 194 194" version="1.1" xmlns="http://www.w3.org/2000/svg" xmlns:xlink="http://www.w3.org/1999/xlink">
    <title>horsel</title>
    <defs>
        <path d="M0,97.0004009 C0,150.57109 43.427929,194 96.9991982,194 L96.9991982,194 C150.570467,194 193.998396,150.57109 193.998396,97.0004009 L193.998396,97.0004009 C193.998396,43.4281085 150.570467,0 96.9991982,0 L96.9991982,0 C43.427929,0 0,43.4281085 0,97.0004009 L0,97.0004009 Z" id="path-1"></path>
    </defs>
    <g id="Forts-matris-grovskisser---david" stroke="none" stroke-width="1" fill="none" fill-rule="evenodd">
        <g id="Matris-annas-linjer" transform="translate(-345.000000, -1947.000000)">
            <g id="horsel" transform="translate(345.000000, 1947.000000)">
                <path d="M97,194 C150.571269,194 194,150.571891 194,96.9995991 C194,43.4281085 150.571269,0 97,0 C43.4287309,0 0,43.4281085 0,96.9995991 C0,150.571891 43.4287309,194 97,194" id="Fill-1" fill="#F3F3F3"></path>
                <g id="Group-5" transform="translate(0.000802, 0.000000)">
                    <mask id="mask-2" fill="white">
                        <use xlink:href="#path-1"></use>
                    </mask>
                    <g id="Clip-4"></g>
                    <polygon id="Fill-3" fill="#F3F3F3" mask="url(#mask-2)" points="-18.5571005 716.957498 614.050549 716.957498 614.050549 -602.245068 -18.5571005 -602.245068"></polygon>
                </g>
                <g id="Group-20" transform="translate(47.447578, 29.845198)">
                    <path d="M57.9993784,1.20269239 C35.922178,1.20269239 16.8935927,18.1224952 16.8935927,43.5531167 L16.8935927,49.802723 C25.6272892,57.5638135 30.6356135,68.709506 30.6356135,80.3836167 C30.6356135,91.8115598 26.3561664,101.489068 17.9151433,109.154739 C18.9960305,123.079638 30.6716965,133.916619 44.7047871,133.916619 C55.206552,133.916619 64.8102504,127.732764 69.1738913,118.161901 L95.9025948,57.5277303 C97.5471791,53.0630385 98.1830422,48.4059031 98.3730795,43.6533477 C99.2976069,20.4679017 80.0757768,1.20269239 57.9993784,1.20269239" id="Fill-6" fill="#FFFFFF"></path>
                    <path d="M67.4874507,68.7666778 C67.4874507,86.8884513 52.7968472,101.579917 34.6743467,101.579917 C16.5526482,101.579917 1.86124278,86.8884513 1.86124278,68.7666778 C1.86124278,50.6449043 16.5526482,35.9534382 34.6743467,35.9534382 C52.7968472,35.9534382 67.4874507,50.6449043 67.4874507,68.7666778" id="Fill-8" fill="#DDEBC1"></path>
                    <path d="M51.1310942,68.7666778 C51.1310942,77.8556293 43.7629399,85.2230122 34.6748279,85.2230122 C25.585914,85.2230122 18.2177596,77.8556293 18.2177596,68.7666778 C18.2177596,59.6777264 25.585914,52.3103434 34.6748279,52.3103434 C43.7629399,52.3103434 51.1310942,59.6777264 51.1310942,68.7666778" id="Fill-10" fill="#95C23E"></path>
                    <path d="M64.3656273,96.5432672 L62.5486464,95.6957134 L83.0285713,51.7937125 C84.2024725,48.7081999 84.7870175,45.5096267 84.7870175,42.2356798 C84.7870175,27.4640288 72.7689636,15.4459252 57.9981756,15.4459252 C44.7027825,15.4459252 33.2957345,25.3679972 31.4651222,38.5255273 C31.2943292,39.7475442 31.20773,40.996824 31.20773,42.2372835 C31.20773,42.4393493 31.29032,42.6358021 31.4346521,42.7777293 C31.5773805,42.9188546 31.766616,42.9966339 31.9670772,42.9966339 L32.304654,42.9942283 C46.056297,42.9942283 57.2388283,54.1768059 57.2388283,67.9220909 C57.2388283,81.6673759 46.056297,92.8499535 32.3110688,92.8499535 L32.3110688,90.8453325 C44.9513545,90.8453325 55.2342156,80.561627 55.2342156,67.9220909 C55.2342156,55.281753 44.9513545,44.9988493 32.3110688,44.9988493 L32.0007547,45.0012549 C31.2365964,45.0012549 30.5478115,44.7190042 30.027414,44.2058213 C29.5038092,43.6902327 29.2031173,42.9725784 29.2031173,42.2372835 C29.2031173,40.9046115 29.2969331,39.5623173 29.478952,38.2488896 C31.4474816,24.1066896 43.7076928,13.4413043 57.9981756,13.4413043 C73.874708,13.4413043 86.7916302,26.3582799 86.7916302,42.2356798 C86.7916302,45.7541905 86.1637855,49.1917145 84.9249349,52.4544356 C84.9032851,52.510565 84.8768242,52.5723073 84.8495615,52.6332478 L64.3656273,96.5432672 Z" id="Fill-12" fill="#333333"></path>
                    <path d="M1.31743145,94.0985116 L0,92.5878293 C3.99479214,89.103798 6.28566351,84.0673883 6.28566351,78.7719816 C6.28566351,73.4733675 3.99479214,68.4377596 0,64.9561339 L1.31743145,63.4446497 C5.74842731,67.3071534 8.29027618,72.8936311 8.29027618,78.7719816 C8.29027618,84.6463229 5.74842731,90.2328006 1.31743145,94.0985116" id="Fill-14" fill="#333333"></path>
                    <path d="M9.25048565,101.67654 L7.88815088,100.206752 C13.8370395,94.690837 17.2488902,86.8776264 17.2488902,78.771741 C17.2488902,70.664252 13.8370395,62.8518432 7.88815088,57.3375319 L9.25048565,55.8669419 C15.6075134,61.7589239 19.2535029,70.1077692 19.2535029,78.771741 C19.2535029,87.4341091 15.6075134,95.7821527 9.25048565,101.67654" id="Fill-16" fill="#333333"></path>
                    <path d="M44.3680122,134.309604 C29.1161171,134.309604 16.4549834,122.394939 15.5440874,107.183875 C15.525645,106.877569 15.6491291,106.579282 15.8792587,106.37481 C24.2336825,98.9504962 28.2942259,89.9216834 28.2942259,78.7719816 C28.2942259,67.6703907 23.5312662,57.0699551 15.2257549,49.6897425 L16.5568177,48.1910879 C25.2905143,55.9513766 30.2988386,67.097871 30.2988386,78.7719816 C30.2988386,90.1999248 26.0193914,99.8774329 17.5783684,107.543103 C18.6592555,121.467201 30.3349216,132.304983 44.3680122,132.304983 C54.8697771,132.304983 64.4734755,126.121129 68.8371163,116.550266 L95.5658199,55.9160952 C97.2104041,51.4514034 98.0363046,46.7974754 98.0363046,42.0417126 C98.0363046,19.9652229 80.0757768,2.00462096 57.9993784,2.00462096 C35.922178,2.00462096 17.9608485,19.9652229 17.9608485,42.0417126 L15.9562358,42.0417126 C15.9562358,18.8602759 34.8172355,0 57.9993784,0 C81.1807193,0 100.040917,18.8602759 100.040917,42.0417126 C100.040917,47.0348225 99.1741227,51.9204847 97.464589,56.5639887 C97.4453448,56.6177126 97.4220912,56.6746438 97.3980359,56.7299714 L70.6661249,117.370557 C65.9729257,127.664687 55.6523778,134.309604 44.3680122,134.309604" id="Fill-18" fill="#333333"></path>
                </g>
            </g>
        </g>
    </g>
</svg>