<?xml version="1.0" encoding="UTF-8"?>
<svg width="893px" height="168px" viewBox="0 0 893 168" version="1.1" xmlns="http://www.w3.org/2000/svg" xmlns:xlink="http://www.w3.org/1999/xlink">
    <title>Group 13Ikoner</title>
    <defs>
        <polygon id="path-1" points="0 0 168 0 168 165 0 165"></polygon>
        <path d="M27.9591064,25.0523148 L23.3708618,20.4730141 C23.1637695,20.2663255 22.8830444,20.1514985 22.5885132,20.1514985 L21.8383789,20.1514985 C23.1085449,18.5301413 23.8632812,16.4908138 23.8632812,14.2723562 C23.8632812,8.99490741 19.578772,4.71875 14.2910156,4.71875 C9.00325928,4.71875 4.71875,8.99490741 4.71875,14.2723562 C4.71875,19.5498051 9.00325928,23.8259625 14.2910156,23.8259625 C16.5138062,23.8259625 18.5571167,23.0726974 20.1816406,21.8050073 L20.1816406,22.5536793 C20.1816406,22.8476365 20.2966919,23.1278143 20.5037842,23.3345029 L25.0920288,27.9138036 C25.5246216,28.3455531 26.2241333,28.3455531 26.652124,27.9138036 L27.9545044,26.613962 C28.3870972,26.1822125 28.3870972,25.4840643 27.9591064,25.0523148 Z M14.2910156,20.1514985 C11.0373657,20.1514985 8.40039062,17.5242568 8.40039062,14.2723562 C8.40039062,11.0250487 11.0327637,8.39321394 14.2910156,8.39321394 C17.5446655,8.39321394 20.1816406,11.0204557 20.1816406,14.2723562 C20.1816406,17.5196637 17.5492676,20.1514985 14.2910156,20.1514985 Z" id="path-3"></path>
    </defs>
    <g id="Page-1" stroke="none" stroke-width="1" fill="none" fill-rule="evenodd">
        <g id="Färgpaletten---Översikt" transform="translate(-675.000000, -1589.000000)">
            <g id="Group-13" transform="translate(675.000000, 1589.000000)">
                <text id="Det-här-är-en-text-m" font-family="OpenSans, Open Sans" font-size="16" font-weight="normal" line-spacing="26">
                    <tspan x="513" y="44" fill="#333333">Det här är en text med en </tspan>
                    <tspan x="513" y="70" font-family="OpenSans-Semibold, Open Sans" font-weight="500" fill="#1616B2" text-decoration="underline">länk</tspan>
                    <tspan x="546.046875" y="70" fill="#333333">. När du har besökt </tspan>
                    <tspan x="513" y="96" fill="#333333">länken så får den </tspan>
                    <tspan x="645.25" y="96" font-family="OpenSans-Semibold, Open Sans" font-weight="500" fill="#822998" text-decoration="underline">denna</tspan>
                    <tspan x="694.03125" y="96" fill="#333333"> </tspan>
                    <tspan x="513" y="122" fill="#333333">färg. Bara så du vet!</tspan>
                </text>
                <g id="Group-18" transform="translate(725.000000, 0.000000)">
                    <g id="Group-3" transform="translate(0.000000, 3.000000)">
                        <mask id="mask-2" fill="white">
                            <use xlink:href="#path-1"></use>
                        </mask>
                        <g id="Clip-2"></g>
                        <path d="M104.299348,0 L83.9327248,81.2058041 L63.5741575,0.0315175241 C27.0536398,9.12643108 -2.01392511e-05,42.0475891 -2.01392511e-05,81.2686384 C-2.01392511e-05,127.512073 37.6080171,165.00006 83.9999899,165.00006 C130.391963,165.00006 168,127.512073 168,81.2686384 C168,42.0022199 140.883707,9.05014663 104.299348,0" id="Fill-1" fill="#00005A" mask="url(#mask-2)"></path>
                    </g>
                    <path d="M84,0 L84,84 L105,2.47253847 C98.2970859,0.857971654 91.2866339,0 84.069357,0 C84.0460995,0 84.0230498,0 84,0" id="Fill-4" fill="#9FD33C"></path>
                    <path d="M84,0 C76.7574316,0.0054417068 69.7234318,0.874300892 63,2.50378976 L84,84 L84,0 Z" id="Fill-6" fill="#B7EE4A"></path>
                    <path d="M30,84 C30,54.176591 54.4004483,30 84.5,30 C114.599552,30 139,54.176591 139,84" id="Fill-8" fill="#95C23E"></path>
                    <path d="M139,84 C139,113.823409 114.599552,138 84.5,138 C54.4004483,138 30,113.823409 30,84" id="Fill-10" fill="#FFFFFF"></path>
                    <path d="M113,84 C113,100.016236 100.01628,113 84.0000995,113 C67.9837197,113 55,100.016236 55,84" id="Fill-12" fill="#822998"></path>
                    <path d="M107,84 C107,96.150319 96.926508,106 84.5001014,106 C72.0736947,106 62,96.150319 62,84" id="Fill-14" fill="#424AE0"></path>
                    <path d="M100,84 C100,92.2843029 93.0604013,99 84.4998994,99 C75.9395987,99 69,92.2843029 69,84" id="Fill-16" fill="#1616B2"></path>
                </g>
                <rect id="Rectangle" fill="#00005A" x="0" y="7" width="484" height="149"></rect>
                <rect id="Rectangle" fill="#FFFFFF" x="36" y="57" width="411" height="50" rx="6"></rect>
                <path d="M322,57 L441,57 C444.313708,57 447,59.6862915 447,63 L447,101 C447,104.313708 444.313708,107 441,107 L322,107 L322,107 L322,57 Z" id="Rectangle" fill="#B7EE4A"></path>
                <g id="Group-6" transform="translate(347.000000, 65.000000)">
                    <g id="search">
                        <mask id="mask-4" fill="white">
                            <use xlink:href="#path-3"></use>
                        </mask>
                        <use id="Shape" fill="#1616B2" fill-rule="nonzero" xlink:href="#path-3"></use>
                        <g id="Group" mask="url(#mask-4)" fill="#00005A">
                            <g id="colors/6/blue">
                                <rect id="colors/primary" x="0" y="0" width="32" height="32"></rect>
                            </g>
                        </g>
                    </g>
                    <text id="Sök" font-family="OpenSans-Semibold, Open Sans" font-size="20" font-weight="500" line-spacing="24" fill="#00005A">
                        <tspan x="40" y="25">Sök</tspan>
                    </text>
                </g>
                <text id="Sök-på-webbplatsen" font-family="OpenSans-Semibold, Open Sans" font-size="16" font-weight="500" fill="#FFFFFF">
                    <tspan x="36" y="44">Sök på webbplatsen</tspan>
                </text>
            </g>
        </g>
    </g>
</svg>