{
	"name": "core-fonts",
	"$schema": "../../../node_modules/nx/schemas/project-schema.json",
	"sourceRoot": "libs/core/fonts/src",
	"projectType": "library",
	"targets": {
		"lint": {
			"executor": "@nrwl/linter:eslint",
			"outputs": ["{options.outputFile}"],
			"options": {
				"lintFilePatterns": ["libs/core/fonts/**/*.ts"]
			}
		},
		"test": {
			"executor": "@nrwl/jest:jest",
			"outputs": ["coverage/libs/core/fonts"],
			"options": {
				"jestConfig": "libs/core/fonts/jest.config.js",
				"passWithNoTests": true
			}
		}
	},
	"tags": []
}
