{
	"name": "shared-utils",
	"$schema": "../../../node_modules/nx/schemas/project-schema.json",
	"sourceRoot": "libs/shared/utils/src",
	"projectType": "library",
	"targets": {
		"lint": {
			"executor": "@nrwl/linter:eslint",
			"options": {
				"lintFilePatterns": ["libs/shared/utils/**/*.ts"]
			}
		},
		"test": {
			"executor": "@nrwl/jest:jest",
			"outputs": ["coverage/libs/shared/utils"],
			"options": {
				"jestConfig": "libs/shared/utils/jest.config.js",
				"passWithNoTests": true
			}
		}
	},
	"tags": []
}
