[
    {
        "title": "Start"
    },
    {
        "title": "Mina sidor"
    },
    {
        "title": "Sök jobb i Platsbanken"
    },
    {
        "divider": true
    },
    {
        "title": "Coronaviruset"
    },
    {
        "title": "Arbetslös - vad händer nu?",
        "children": [
            {
                "title": "När du blir arbetslös"
            },
            {
                "title": "Skriv in dig"
            },
            {
                "title": "Ersättning från a-kassa"
            },
            {
                "title": "Inför planeringssamtalet"
            },
            {
                "title": "Dina rättigheter och skyldigheter"
            },
            {
                "title": "Aktivitetsrapportera"
            },
            {
                "title": "Om du behöver redovisa sökta jobb"
            },
            {
                "title": "Varning eller förlorad a-kassa"
            },
            {
                "title": "Skriv ut dig"
            },
            {
                "title": "Vanliga frågor och svar"
            }
        ]
    },
    {
        "title": "Extra stöd",
        "highlight": true,
        "children": [
            {
                "title": "Stöd A-Ö"
            },
            {
                "title": "Ersättning och fråvaro",
                "highlight": true,
                "children": [
                    {
                        "title": "När du deltar i ett program"
                    },
                    {
                        "title": "Aktivitetsstöd och utvecklingsersättning"
                    },
                    {
                        "title": "Anmäla frånvaro för vård av barn (VAB)"
                    },
                    {
                        "title": "Etableringsersättning"
                    },
                    {
                        "title": "Varning eller avstängning från rätten till ersättning i program"
                    }
                ]
            },
            {
                "title": "Funktionsnedsättning"
            },
            {
                "title": "Ersättning för resekostnader"
            },
            {
                "title": "Stöd för återgång till arbete"
            },
            {
                "title": "Blanketter"
            },
            {
                "title": "När du får uppehållstillstånd"
            }
        ]
    },
    {
        "title": "Så hittar du jobbet",
        "children": [
            {
                "title": "Hitta jobbet du vill ha"
            },
            {
                "title": "Hitta rätt arbetsgivare"
            },
            {
                "title": "Skapa en profil"
            },
            {
                "title": "Starta eget"
            },
            {
                "title": "Hitta jobbet utomlands",
                "children": [
                    {
                        "title": "Jobba utomlands"
                    }
                ]
            },
            {
                "title": "Kultur och media",
                "children": [
                    {
                        "title": "Andra webbplatser inom kultur och media"
                    },
                    {
                        "title": "Kultur och media - kriterier för att bli inskriven"
                    }
                ]
            },
            {
                "title": "Tips, inspiration och nyheter"
            },
            {
                "title": "Aktiviteter"
            },
            {
                "title": "Webbinarier"
            },
            {
                "title": "Podcast"
            }
        ]
    },
    {
        "title": "CV, ansökan och intervju",
        "children": [
            {
                "title": "Så söker du jobbet"
            },
            {
                "title": "Skriva cv"
            },
            {
                "title": "Personligt brev",
                "children": [
                    {
                        "title": "Personliga egenskaper"
                    }
                ]
            },
            {
                "title": "Jobbintervjun",
                "children": [
                    {
                        "title": "Vanliga intervjufrågor"
                    }
                ]
            },
            {
                "title": "Referenser"
            },
            {
                "title": "Snabbintervju"
            }
        ]
    },
    {
        "title": "Yrken och framtid",
        "children": [
            {
                "title": "Karriärvägledning på egen hand",
                "children": [
                    {
                        "title": "Ta reda på vem du är"
                    },
                    {
                        "title": "Yrken och arbetsmarknad"
                    },
                    {
                        "title": "Vägar vidare"
                    },
                    {
                        "title": "Mallen Mitt jobb-jag"
                    }
                ]
            },
            {
                "title": "Intresseguiden"
            },
            {
                "title": "Hitta yrken"
            },
            {
                "title": "Hitta yrkesprognoser"
            },
            {
                "title": "När du behöver byta yrke"
            },
            {
                "title": "Quiz framtidens arbetsmarknad"
            }
        ]
    },
    {
        "title": "Utbildning och studier",
        "children": [
            {
                "title": "Att välja utbildning"
            },
            {
                "title": "Utbildningsvägar"
            },
            {
                "title": "Våga börja studera"
            }
        ]
    },
    {
        "title": "Arbeta i Sverige",
        "children": [
            {
                "title": "Tillstånd att arbeta"
            },
            {
                "title": "Jämställdhet och diskriminering"
            },
            {
                "title": "Rättigheter och skyldigheter"
            },
            {
                "title": "Lön och förmåner"
            },
            {
                "title": "Anställningsformer"
            },
            {
                "title": "Sveriges trygghetssystem"
            },
            {
                "title": "Varsel"
            },
            {
                "title": "Lär dig svenska"
            },
            {
                "title": "Jobba under asyltiden"
            }
        ]
    }
]