{
	"name": "shared-styles",
	"$schema": "../../../node_modules/nx/schemas/project-schema.json",
	"sourceRoot": "libs/shared/styles/src",
	"projectType": "library",
	"targets": {
		"lint": {
			"executor": "@nrwl/linter:eslint",
			"options": {
				"lintFilePatterns": ["libs/shared/styles/**/*.ts"]
			}
		},
		"test": {
			"executor": "@nrwl/jest:jest",
			"outputs": ["coverage/libs/shared/styles"],
			"options": {
				"jestConfig": "libs/shared/styles/jest.config.js",
				"passWithNoTests": true
			}
		},
		"publish": {
			"executor": "@nrwl/workspace:run-commands",
			"options": {
				"commands": ["npm publish"],
				"cwd": "libs/shared/styles",
				"parallel": false
			}
		}
	},
	"tags": [],
	"implicitDependencies": ["core"]
}
