{
	"global": {
		"border-radius": {
			"base": {
				"value": "6px",
				"name": "",
				"comment": ""
			},
			"small": {
				"value": "4px",
				"name": "",
				"comment": ""
			},
			"smaller": {
				"value": "3px",
				"name": "",
				"comment": ""
			},
			"smallest": {
				"value": "2px",
				"name": "",
				"comment": ""
			},
			"smallest-2": {
				"value": "1px",
				"name": "",
				"comment": ""
			},
			"smallest-3": {
				"value": "0px",
				"name": "",
				"comment": ""
			},
			"large": {
				"value": "8px",
				"name": "",
				"comment": ""
			},
			"larger": {
				"value": "16px",
				"name": "",
				"comment": ""
			},
			"largest": {
				"value": "32px",
				"name": "",
				"comment": ""
			},
			"largest-2": {
				"value": "64px",
				"name": "",
				"comment": ""
			}
		},
		"border-width": {
			"base": {
				"value": "2px",
				"name": "",
				"comment": ""
			},
			"small": {
				"value": "1px",
				"name": "",
				"comment": ""
			},
			"smaller": {
				"value": "0px",
				"name": "",
				"comment": ""
			},
			"large": {
				"value": "4px",
				"name": "",
				"comment": ""
			},
			"larger": {
				"value": "6px",
				"name": "",
				"comment": ""
			},
			"largest": {
				"value": "8px",
				"name": "",
				"comment": ""
			},
			"largest-2": {
				"value": "10px",
				"name": "",
				"comment": ""
			}
		},
		"border-style": {
			"solid": {
				"value": "solid",
				"name": "",
				"comment": ""
			},
			"none": {
				"value": "none",
				"name": "",
				"comment": ""
			},
			"dashed": {
				"value": "dashed",
				"name": "",
				"comment": ""
			}
		}
	}
}