<?xml version="1.0" encoding="UTF-8"?>
<svg width="119.999915px" height="191.937038px" viewBox="0 0 119.999915 191.937038" version="1.1" xmlns="http://www.w3.org/2000/svg" xmlns:xlink="http://www.w3.org/1999/xlink">
    <title>buller-horlur</title>
    <defs>
        <path d="M1.63667137,0 L0,4.49957687 L0,19.1475317 L1.05782793,19.1475317 C1.42764457,19.1475317 10.1136812,19.0823695 10.1136812,13.4327221 L10.1136812,13.4327221 L10.1136812,7.00535966 C10.1136812,3.14217207 6.97066291,0 3.10832158,0 L3.10832158,0 L1.63667137,0 Z M2.11565585,4.87277856 L3.11847673,2.11565585 C5.80959097,2.12157969 7.99802539,4.31255289 7.99802539,7.00535966 L7.99802539,7.00535966 L7.99802539,13.4327221 C7.99802539,16.0739069 4.05952045,16.7788434 2.11565585,16.9658674 L2.11565585,16.9658674 L2.11565585,4.87277856 Z" id="path-1"></path>
        <polygon id="path-3" points="0 0 119.999915 0 119.999915 187.066291 0 187.066291"></polygon>
        <polygon id="path-5" points="0 191.937377 120 191.937377 120 0 0 0"></polygon>
    </defs>
    <g id="Forts-matris-grovskisser---david" stroke="none" stroke-width="1" fill="none" fill-rule="evenodd">
        <g id="Matris-annas-linjer" transform="translate(-1204.000000, -1923.000339)">
            <g id="buller-horlur" transform="translate(1204.000000, 1923.000000)">
                <g id="Group-29" transform="translate(8.694499, 0.000339)">
                    <path d="M1.39040903,86.7062623 L-1.5032639e-15,85.1110578 C1.83469676,83.511622 2.88744711,81.1979408 2.88744711,78.7657828 C2.88744711,76.3319323 1.83469676,74.0190973 -1.5032639e-15,72.4196615 L1.39040903,70.824457 C3.68631876,72.8267137 5.00310296,75.7209309 5.00310296,78.7657828 C5.00310296,81.8097884 3.68631876,84.7040056 1.39040903,86.7062623" id="Fill-1" fill="#333333"></path>
                    <path d="M5.2919323,90.4095063 L3.85413258,88.8574612 C6.65441467,86.2611283 8.26146685,82.582426 8.26146685,78.7657828 C8.26146685,74.9474471 6.65441467,71.269591 3.85413258,68.6732581 L5.2919323,67.121213 C8.52296192,70.1169817 10.3771227,74.3609873 10.3771227,78.7657828 C10.3771227,83.1688858 8.52296192,87.4128914 5.2919323,90.4095063" id="Fill-3" fill="#333333"></path>
                    <path d="M8.86544429,94.1796897 L7.4606488,92.5980254 C11.4110014,89.0877292 13.6764457,84.0456982 13.6764457,78.7658674 C13.6764457,73.4860367 11.4110014,68.4440056 7.4606488,64.9328632 L8.86544429,63.3511989 C13.2668547,67.2634697 15.7921016,72.8818054 15.7921016,78.7658674 C15.7921016,84.6499295 13.2668547,90.2682652 8.86544429,94.1796897" id="Fill-5" fill="#333333"></path>
                    <path d="M101.210522,86.7062623 C98.9146121,84.7040056 97.5978279,81.8097884 97.5978279,78.7657828 C97.5978279,75.7209309 98.9146121,72.8267137 101.210522,70.824457 L102.600931,72.4196615 C100.766234,74.0190973 99.7134838,76.3319323 99.7134838,78.7657828 C99.7134838,81.1979408 100.766234,83.511622 102.600931,85.1110578 L101.210522,86.7062623 Z" id="Fill-7" fill="#333333"></path>
                    <path d="M97.3081523,90.4086601 C94.0771227,87.4128914 92.2238082,83.1688858 92.2238082,78.7657828 C92.2238082,74.3609873 94.0771227,70.1169817 97.3081523,67.121213 L98.745952,68.6732581 C95.9465162,71.269591 94.339464,74.9482934 94.339464,78.7657828 C94.339464,82.582426 95.9465162,86.2611283 98.745952,88.8583075 L97.3081523,90.4086601 Z" id="Fill-9" fill="#333333"></path>
                    <path d="M93.7354866,94.1796897 C89.3340762,90.2682652 86.8088293,84.6499295 86.8088293,78.7658674 C86.8088293,72.8809591 89.3340762,67.2626234 93.7354866,63.3511989 L95.1402821,64.9328632 C91.1899295,68.4431594 88.9244852,73.4851904 88.9244852,78.7658674 C88.9244852,84.0456982 91.1899295,89.0877292 95.1402821,92.5980254 L93.7354866,94.1796897 Z" id="Fill-11" fill="#333333"></path>
                    <path d="M89.5029055,43.6874471 L89.5291396,27.5204513 C89.5291396,12.3461213 77.1830183,0 62.007842,0 L40.610945,0 C25.4357687,0 13.0904937,12.3461213 13.0904937,27.5204513 L13.4628491,43.5672779 C11.3903526,44.6767278 9.97117066,46.8634697 9.97117066,49.3675599 L9.97117066,62.3974612 C9.97117066,66.0143865 12.9297038,68.9729196 16.5474753,68.9729196 L24.994866,68.9729196 C24.994866,68.05811 25.0253315,66.0050776 25.0177151,63.4332863 L25.7751199,63.4155148 L24.9381664,27.4569817 C24.9728632,18.8445698 31.9900705,11.8476728 40.610945,11.8476728 L62.007842,11.8476728 C70.6498731,11.8476728 77.6814669,18.8792666 77.6814669,27.5111425 L77.6222285,63.8598025 L77.7407052,63.8598025 C77.7373202,66.2293371 77.7644006,68.109732 77.7644006,68.9729196 L86.2117913,68.9729196 C89.8287165,68.9729196 92.7880959,66.0143865 92.7880959,62.3974612 L92.7880959,49.3675599 C92.7880959,46.9489422 91.4611566,44.8299013 89.5029055,43.6874471" id="Fill-13" fill="#DDEBC1"></path>
                    <path d="M23.9374612,50.3395769 L23.9374612,50.3734274 C23.5904937,49.5779408 23.2435261,48.6132017 22.9219464,47.5807616 L22.9388717,47.5807616 L23.9374612,50.3395769 Z" id="Fill-15" fill="#333333"></path>
                    <path d="M76.7186742,50.0940762 C76.7102116,50.1363893 76.7102116,50.187165 76.7102116,50.2379408 L76.7102116,50.1533145 C76.7102116,50.1279267 76.7186742,50.1110014 76.7186742,50.0940762" id="Fill-17" fill="#333333"></path>
                    <path d="M79.9006206,47.580677 C79.4351763,48.9600846 79.0035825,50.0179126 78.8258674,50.457969 L78.8258674,50.3394922 L79.824457,47.580677 L79.9006206,47.580677 Z" id="Fill-19" fill="#333333"></path>
                    <path d="M24.8512553,46.6412412 C24.9866573,47.1151481 25.1389845,47.5805924 25.2913117,48.0206488 C25.2997743,48.0037236 25.3166996,47.9867983 25.3251622,47.9698731 L24.8512553,46.6412412 Z" id="Fill-21" fill="#333333"></path>
                    <path d="M22.9345557,47.5799154 C20.2425952,47.5849929 18.0541608,49.7768124 18.0541608,52.4687729 L18.0541608,58.8969817 C18.0541608,61.5381664 21.993512,62.243103 23.9373766,62.4301269 L23.9373766,50.3370381 L22.9345557,47.5799154 Z M26.0530324,64.6117913 L24.9952045,64.6117913 C24.6253879,64.6117913 15.9385049,64.5466291 15.9385049,58.8969817 L15.9385049,52.4687729 C15.9385049,48.6064316 19.0815233,45.4642595 22.9447109,45.4642595 L24.4172073,45.4642595 L26.0530324,49.9646827 L26.0530324,64.6117913 Z" id="Fill-23" fill="#333333"></path>
                    <path d="M78.0895346,46.1589563 L77.3532863,48.1815233 C77.3786742,48.2069111 77.3955994,48.2238364 77.4125247,48.2492243 C77.6579408,47.6060649 77.9372073,46.8105783 78.2164739,45.9304654 C78.1572355,45.9981664 78.123385,46.07433 78.0895346,46.1589563 M76.7101269,50.1533145 L76.7101269,50.2379408 C76.7101269,50.187165 76.7101269,50.1363893 76.7185896,50.0940762 C76.7185896,50.1110014 76.7101269,50.1279267 76.7101269,50.1533145" id="Fill-25" fill="#333333"></path>
                    <path d="M78.8217207,50.3377151 L78.8217207,62.4299577 C80.7655853,62.2429337 84.7040903,61.5379972 84.7040903,58.8968124 L84.7040903,52.4694499 C84.7040903,49.7766432 82.5156559,47.58567 79.8245416,47.5797461 L78.8217207,50.3377151 Z M77.7638928,64.611622 L76.7060649,64.611622 L76.7060649,49.9645134 L78.3435825,45.4640903 L79.8143865,45.4640903 C83.6767278,45.4640903 86.8197461,48.6062623 86.8197461,52.4694499 L86.8197461,58.8968124 C86.8197461,64.5464598 78.1337094,64.611622 77.7638928,64.611622 L77.7638928,64.611622 Z" id="Fill-27" fill="#333333"></path>
                </g>
                <g id="Group-32" transform="translate(85.400564, 45.464598)">
                    <mask id="mask-2" fill="white">
                        <use xlink:href="#path-1"></use>
                    </mask>
                    <g id="Clip-31"></g>
                    <polygon id="Fill-30" fill="#333333" mask="url(#mask-2)" points="-8.42124118 13.7203667 -9.917433 12.2241749 6.56691114 -4.25932299 8.06310296 -2.76397743"></polygon>
                </g>
                <g id="Group-51">
                    <path d="M78.6710014,48.5496474 C76.8109168,45.4565585 70.7677574,46.638787 70.708519,46.6506347 L70.2853879,44.5781382 C70.5925811,44.5146685 77.853512,43.0844852 80.4845416,47.4605078 L78.6710014,48.5496474 Z" id="Fill-33" fill="#333333"></path>
                    <path d="M41.476756,48.5496474 L39.6632158,47.4605078 C42.2925529,43.0836389 49.5551763,44.512976 49.8623695,44.5781382 L49.4392384,46.6506347 C49.3791537,46.6396333 43.3368406,45.4565585 41.476756,48.5496474" id="Fill-35" fill="#333333"></path>
                    <path d="M61.3416643,68.2656982 L58.4093653,68.2656982 L58.4093653,66.1500423 L61.3416643,66.1500423 C63.8119041,66.1500423 65.8217772,64.1926375 65.8217772,61.7850212 C65.8217772,60.1500423 64.8629619,58.6326939 63.3701551,57.8913681 C63.3193794,57.8735966 63.2686037,57.8507475 63.221213,57.8253597 C60.8770663,56.5508886 59.4206488,54.1043441 59.4206488,51.4386178 L59.4206488,48.6577997 L61.5363047,48.6577997 L61.5363047,51.4386178 C61.5363047,53.2936248 62.5306629,54.9979972 64.1394076,55.9153456 C64.1521016,55.9204231 64.1647955,55.926347 64.1774894,55.9322708 C66.4615515,57.0027927 67.937433,59.2995487 67.937433,61.7850212 C67.937433,65.3579408 64.9788999,68.2656982 61.3416643,68.2656982" id="Fill-37" fill="#333333"></path>
                    <path d="M60.504457,79.3473343 C58.1061495,79.3473343 55.6232158,79.0638364 53.9924683,78.4968406 L54.6864034,76.4988152 C57.6195487,77.5177151 63.7295628,77.4060085 65.6581946,76.5597461 L66.507842,78.4968406 C65.2147532,79.0638364 62.9019182,79.3473343 60.504457,79.3473343" id="Fill-39" fill="#333333"></path>
                    <path d="M40.7272214,52.2099013 L41.4050776,54.2146968 C42.2166432,53.9405078 43.0510578,53.7458674 43.8947814,53.6180818 C43.8177715,53.8101834 43.7636107,54.0124401 43.7568406,54.228237 C43.7221439,55.2691396 44.5946403,56.131481 45.7049365,56.1526375 C46.816079,56.1746403 47.7444288,55.347842 47.7791255,54.3069394 C47.7875882,54.0319041 47.7300423,53.7712553 47.6251058,53.5334556 C48.6685472,53.6409309 49.7018336,53.8499577 50.6995769,54.1808463 L51.3655853,52.1726657 C47.9390691,51.0361354 44.1605078,51.0496756 40.7272214,52.2099013" id="Fill-41" fill="#333333"></path>
                    <path d="M79.420536,52.2099013 C75.9855571,51.0496756 72.2086883,51.0352891 68.7821721,52.1726657 L69.4481805,54.1808463 C70.4459238,53.8499577 71.4792102,53.6409309 72.5234979,53.5326093 C72.4177151,53.770409 72.3601693,54.0319041 72.3694781,54.3069394 C72.4041749,55.347842 73.3325247,56.1746403 74.4428209,56.1526375 C75.5539633,56.131481 76.4256135,55.2691396 76.3909168,54.228237 C76.3841467,54.0124401 76.3308322,53.8093371 76.252976,53.6172355 C77.0966996,53.7450212 77.9311142,53.9396615 78.7426798,54.2146968 L79.420536,52.2099013 Z" id="Fill-43" fill="#333333"></path>
                    <g id="Group-47" transform="translate(0.000000, 4.870155)">
                        <mask id="mask-4" fill="white">
                            <use xlink:href="#path-3"></use>
                        </mask>
                        <g id="Clip-46"></g>
                        <path d="M59.7544993,133.827927 L31.447024,97.2693935 C32.4625388,97.1509168 33.4865162,97.0832158 34.5104937,97.0747532 L58.9166996,128.38646 C59.1113399,128.640339 59.4159944,128.792666 59.7460367,128.792666 C60.0676164,128.792666 60.3722708,128.648801 60.5753738,128.394922 L85.4893371,97.0747532 C86.5133145,97.0832158 87.5203667,97.1509168 88.5189563,97.2524683 L59.7544993,133.827927 Z M46.3243159,97.0662906 C46.8743865,97.0662906 47.3313681,96.651622 47.3821439,96.1100141 L48.3722708,85.2016925 C51.9265726,86.8857546 55.895543,87.8251058 60.076079,87.8251058 C64.1127504,87.8251058 67.9547814,86.9449929 71.4075317,85.370945 L72.3722708,96.1100141 C72.4230465,96.651622 72.8800282,97.0662906 73.4216361,97.0662906 L82.7897602,97.0662906 L59.7544993,126.025388 L37.1846827,97.0662906 L46.3243159,97.0662906 Z M34.7474471,60.3892807 L34.7474471,45.6473907 C38.9449083,40.2736248 45.7488575,29.2637518 48.5161354,23.7884344 C55.3285472,32.3187588 65.356756,36.719323 78.8715656,37.1255289 L78.8800282,37.1255289 C80.2763611,39.9605078 84.3130324,44.5557123 85.4047109,45.7827927 L85.4047109,60.3892807 C85.4047109,74.3526093 74.0394076,85.7094499 60.076079,85.7094499 C46.1127504,85.7094499 34.7474471,74.3526093 34.7474471,60.3892807 L34.7474471,60.3892807 Z M33.985811,43.1509168 C33.8334838,42.7108604 33.6811566,42.2454161 33.5457546,41.7715092 L33.537292,41.7545839 C32.9195205,39.6473907 32.4456135,37.2693935 32.4456135,35.5007052 L32.4456135,26.3779972 C32.4456135,20.2933709 37.2269958,15.3004231 43.2269958,14.9534556 C44.3440621,17.48378 45.6303808,19.7940762 47.0944147,21.8843441 C44.9618336,26.4287729 38.4710014,37.1086037 34.0196615,43.100141 C34.0111989,43.1170663 33.9942736,43.1339915 33.985811,43.1509168 L33.985811,43.1509168 Z M32.6317913,57.5627645 C30.6853879,57.3765867 26.750268,56.6657264 26.750268,54.0253879 L26.750268,47.6022567 C26.750268,44.9111425 28.9251622,42.719323 31.6162764,42.7108604 L31.6332017,42.7108604 L32.6317913,45.4696756 L32.6317913,57.5627645 Z M29.9491396,22.6544429 C29.9491396,11.3229901 39.1649365,2.11565585 50.4879267,2.11565585 L69.7657828,2.11565585 C78.5584485,2.11565585 86.0817207,7.66713681 89.0013258,15.461213 C83.7968124,7.82792666 75.0379972,2.80959097 65.1198025,2.80959097 C56.2425106,2.80959097 48.7361636,6.27080395 43.3877856,12.8208745 C36.14378,13.100141 30.3299577,19.0747532 30.3299577,26.3779972 L30.3299577,35.5007052 C30.3299577,36.9901269 30.6176869,38.8265162 31.0492807,40.6205924 C30.6769252,40.6544429 30.3045698,40.7136812 29.9491396,40.7983075 L29.9491396,22.6544429 Z M93.40189,47.6022567 L93.40189,54.0253879 C93.40189,56.6657264 89.4583075,57.3765867 87.5203667,57.5627645 L87.5203667,45.4696756 L88.5189563,42.7108604 L88.5951199,42.7108604 C91.2523836,42.7616361 93.40189,44.9280677 93.40189,47.6022567 L93.40189,47.6022567 Z M90.3045698,37.0155148 L90.3045698,40.832158 C89.9660649,40.7390691 89.6190973,40.6713681 89.2552045,40.6375176 C89.5852468,39.4866008 89.8814386,38.2425952 90.0591537,37.0324401 C90.14378,37.0324401 90.2199436,37.0239774 90.3045698,37.0155148 L90.3045698,37.0155148 Z M45.131086,14.0310296 C50.0563329,8.07334274 56.9533709,4.92524683 65.1198025,4.92524683 C74.7756559,4.92524683 83.2636671,10.0705219 87.9773484,17.7545839 C86.8687447,17.8392102 85.7516784,17.8815233 84.6430748,17.8815233 C77.3059803,17.8815233 70.0450494,16.0535966 63.6303808,12.583921 L62.6233286,14.4456982 C69.3426516,18.0761636 76.9590127,19.9971791 84.6430748,19.9971791 C86.1324965,19.9971791 87.6219182,19.9294781 89.0944147,19.7856135 C89.5513963,20.6911142 89.9491396,21.6220028 90.3045698,22.5782793 L90.3045698,22.6544429 L90.3299577,22.6544429 C90.7446262,23.796897 91.0831312,24.9816643 91.3370099,26.2002821 C89.6275599,26.3526093 87.8927221,26.4287729 86.1832722,26.4287729 C76.6543583,26.4287729 67.1931453,24.1100141 58.8151481,19.7179126 L57.8334838,21.5881523 C66.5161354,26.1410437 76.3158533,28.5444288 86.1832722,28.5444288 C88.0111989,28.5444288 89.8645134,28.4682652 91.6924401,28.2990127 C91.827842,29.416079 91.9040056,30.5585331 91.9040056,31.7094499 C91.9040056,32.7334274 91.8447673,33.7574048 91.7262906,34.7729196 C88.8574612,35.077574 85.7686037,35.0691114 82.772835,35.0521862 L81.0379972,35.0521862 C62.8941326,35.0521862 51.469591,28.3667137 45.131086,14.0310296 L45.131086,14.0310296 Z M86.9110578,41.0521862 L86.9110578,41.0606488 C86.6317913,41.9407616 86.3525247,42.7362482 86.1071086,43.3794076 C86.0901834,43.3540197 86.0732581,43.3370945 86.0478702,43.3117066 C84.5584485,41.5853315 82.4851058,39.0465444 81.3172638,37.167842 L82.7643724,37.167842 C83.3821439,37.167842 83.9999154,37.1763047 84.6261495,37.1763047 C85.7178279,37.1763047 86.8095063,37.167842 87.9011848,37.1339915 C87.6726939,38.471086 87.2918759,39.8335684 86.9110578,41.0521862 L86.9110578,41.0521862 Z M85.4047109,45.3681241 L85.4047109,45.2834979 C85.4047109,45.25811 85.4131735,45.2411848 85.4131735,45.2242595 C85.4047109,45.2665726 85.4047109,45.3173484 85.4047109,45.3681241 L85.4047109,45.3681241 Z M84.9815797,94.9506347 L74.3948378,94.9506347 L73.4385614,84.3469676 C81.8334838,79.6502116 87.5203667,70.6713681 87.5203667,60.3892807 L87.5203667,59.6953456 C89.9152891,59.5007052 95.5175458,58.561354 95.5175458,54.0253879 L95.5175458,47.6022567 C95.5175458,45.1819464 94.2904654,43.0493653 92.4202257,41.796897 L92.4202257,36.8208745 C92.5556276,36.8124118 92.682567,36.7954866 92.8095063,36.7785614 C93.2749506,36.7108604 93.6473061,36.3469676 93.7150071,35.8815233 C93.91811,34.5021157 94.0196615,33.1057828 94.0196615,31.7094499 C94.0196615,28.3836389 93.4526657,25.1847673 92.411763,22.2059238 C92.1748096,9.90973202 82.1042877,0 69.7657828,0 L50.4879267,0 C37.9970945,0 27.8334838,10.1551481 27.8334838,22.6544429 L27.8334838,41.7291961 C25.9124683,42.9732017 24.6346121,45.1396333 24.6346121,47.6022567 L24.6346121,54.0253879 C24.6346121,58.5698166 30.2368688,59.5007052 32.6317913,59.6953456 L32.6317913,60.3892807 C32.6317913,70.5275035 38.1578843,79.3878702 46.3497038,84.1438646 L45.3595769,94.9506347 L35.0267137,94.9506347 C33.1056982,94.9506347 31.1846827,95.1114245 29.3144429,95.416079 C12.3299577,98.2087447 -8.46262341e-05,112.739069 -8.46262341e-05,129.977433 L-8.46262341e-05,187.066291 L2.11557123,187.066291 L2.11557123,129.977433 C2.11557123,113.991537 13.4047109,100.476728 29.0436389,97.6248237 L58.908237,136.188999 C59.1113399,136.45134 59.4159944,136.603667 59.7460367,136.603667 C60.076079,136.603667 60.3807334,136.45134 60.5838364,136.197461 L90.9308039,97.6078984 C106.248152,100.417489 117.88426,113.864598 117.88426,129.977433 L117.88426,187.066291 L119.999915,187.066291 L119.999915,129.977433 C119.999915,110.665726 104.293286,94.9506347 84.9815797,94.9506347 L84.9815797,94.9506347 Z" id="Fill-45" fill="#333333" mask="url(#mask-4)"></path>
                    </g>
                    <mask id="mask-6" fill="white">
                        <use xlink:href="#path-5"></use>
                    </mask>
                    <g id="Clip-49"></g>
                    <polygon id="Fill-48" fill="#333333" mask="url(#mask-6)" points="24.6245416 191.937377 26.7401975 191.937377 26.7401975 140.41354 24.6245416 140.41354"></polygon>
                    <polygon id="Fill-50" fill="#333333" mask="url(#mask-6)" points="92.4863188 191.937377 94.6019746 191.937377 94.6019746 140.41354 92.4863188 140.41354"></polygon>
                </g>
            </g>
        </g>
    </g>
</svg>