{
	"name": "shared-text",
	"$schema": "../../../node_modules/nx/schemas/project-schema.json",
	"sourceRoot": "libs/shared/text/src",
	"projectType": "library",
	"targets": {
		"build": {
			"executor": "@nrwl/js:tsc",
			"outputs": ["{options.outputPath}"],
			"options": {
				"outputPath": "dist/libs/shared/text",
				"main": "libs/shared/text/src/index.ts",
				"tsConfig": "libs/shared/text/tsconfig.lib.json",
				"assets": ["libs/shared/text/*.md"]
			}
		},
		"lint": {
			"executor": "@nrwl/linter:eslint",
			"outputs": ["{options.outputFile}"],
			"options": {
				"lintFilePatterns": ["libs/shared/text/**/*.ts"]
			}
		},
		"test": {
			"executor": "@nrwl/jest:jest",
			"outputs": ["coverage/libs/shared/text"],
			"options": {
				"jestConfig": "libs/shared/text/jest.config.ts",
				"passWithNoTests": true
			}
		}
	},
	"tags": []
}
