<?xml version="1.0" encoding="UTF-8"?>
<svg width="126.179445px" height="185.064351px" viewBox="0 0 126.179445 185.064351" version="1.1" xmlns="http://www.w3.org/2000/svg" xmlns:xlink="http://www.w3.org/1999/xlink">
    <title>starr</title>
    <defs>
        <polygon id="path-1" points="0 0 126.179445 0 126.179445 185.064266 0 185.064266"></polygon>
        <polygon id="path-3" points="0 185.064351 126.179785 185.064351 126.179785 0 0 0"></polygon>
    </defs>
    <g id="Forts-matris-grovskisser---david" stroke="none" stroke-width="1" fill="none" fill-rule="evenodd">
        <g id="Matris-annas-linjer" transform="translate(-923.820215, -1244.935649)">
            <g id="starr" transform="translate(923.820215, 1244.935649)">
                <path d="M36.0415459,46.2021653 C36.0415459,52.4695437 41.1304629,57.5493651 47.4071625,57.5493651 C53.6847129,57.5493651 58.772779,52.4695437 58.772779,46.2021653 C58.772779,39.934787 53.6847129,34.8549655 47.4071625,34.8549655 C41.1304629,34.8549655 36.0415459,39.934787 36.0415459,46.2021653" id="Fill-1" fill="#DDEBC1"></path>
                <path d="M90.8037717,46.2021653 C90.8037717,52.4695437 85.7148548,57.5493651 79.4381552,57.5493651 C73.1606048,57.5493651 68.0725387,52.4695437 68.0725387,46.2021653 C68.0725387,39.934787 73.1606048,34.8549655 79.4381552,34.8549655 C85.7148548,34.8549655 90.8037717,39.934787 90.8037717,46.2021653" id="Fill-3" fill="#DDEBC1"></path>
                <path d="M85.8373768,46.1477144 C85.8373768,49.6458256 82.9963981,52.4822008 79.4926094,52.4822008 C75.9879699,52.4822008 73.147842,49.6458256 73.147842,46.1477144 C73.147842,42.6496032 75.9879699,39.813228 79.4926094,39.813228 C82.9963981,39.813228 85.8373768,42.6496032 85.8373768,46.1477144" id="Fill-5" fill="#95C23E"></path>
                <path d="M41.5821777,46.2021653 C41.5821777,49.7002765 44.4231564,52.5366517 47.926945,52.5366517 C51.4315845,52.5366517 54.2717124,49.7002765 54.2717124,46.2021653 C54.2717124,42.7040542 51.4315845,39.8676789 47.926945,39.8676789 C44.4231564,39.8676789 41.5821777,42.7040542 41.5821777,46.2021653" id="Fill-7" fill="#95C23E"></path>
                <g id="Group-11">
                    <mask id="mask-2" fill="white">
                        <use xlink:href="#path-1"></use>
                    </mask>
                    <g id="Clip-10"></g>
                    <path d="M63.0814691,111.801858 C49.9120566,111.801858 39.5623516,104.720689 39.264555,95.6075913 C44.108428,94.470153 48.2554571,93.5297914 48.3456469,93.5094042 C48.8178671,93.4023712 49.1590568,92.9895295 49.1726704,92.5053325 L49.486633,82.0806554 C53.5936723,84.0998419 58.2103691,85.2389792 63.0899776,85.2389792 C67.9695861,85.2389792 72.5854321,84.0998419 76.6933222,82.0806554 L77.006434,92.5053325 C77.0208984,92.9895295 77.3612372,93.4023712 77.8343083,93.5094042 C77.9236472,93.5297914 82.0536594,94.4667552 86.8864714,95.601645 C86.1683563,104.621301 75.7676005,111.801858 63.0814691,111.801858 M34.3143262,54.3879833 L34.3143262,28.2838172 C41.8085881,32.6305474 50.2804734,35.2180283 58.9497553,35.793968 C59.1999043,35.8627749 59.4738771,35.8347424 59.7155177,35.7175158 C60.05926,35.5484716 60.287287,35.1942432 60.309409,34.8119824 C60.3366361,34.3498716 60.0635142,33.9395783 59.6585109,33.7705341 C58.5490062,32.9745821 57.6241354,31.9645641 56.9315458,30.8160827 C62.1489406,34.7788531 68.4869012,36.9246105 75.1541397,36.9246105 C76.6933222,36.9246105 78.2384607,36.8073838 79.7487144,36.5763284 C80.235399,36.5024247 80.6072192,36.1057229 80.6480599,35.6155796 C80.6889005,35.1262857 80.3894023,34.6726696 79.9222872,34.5189158 C77.7083829,33.7883729 76.0083902,32.142103 75.2111464,30.0456148 C77.3969728,30.5960704 79.6500161,30.874696 81.9302866,30.874696 C84.8852788,30.874696 88.759186,30.2027665 91.8639273,29.1876517 L91.8639273,54.3879833 C91.8639273,70.2288713 78.9557249,83.115308 63.0899776,83.115308 C47.2225287,83.115308 34.3143262,70.2288713 34.3143262,54.3879833 M32.7368555,25.4729261 C32.3973675,25.6598091 32.1872082,26.0157364 32.1872082,26.4022446 L32.1872082,52.2711079 C32.0119337,52.0001274 31.8672897,51.716405 31.754127,51.4564676 C30.6003783,48.8146207 30.6327105,44.3973846 31.4699441,42.635587 C31.6018254,42.3561119 31.6060796,42.0333139 31.4801542,41.7504409 C29.6508328,37.6296693 28.7608467,33.8282979 28.7608467,30.1297122 C28.7608467,22.8021972 31.8221948,15.8960185 37.1068066,10.9826929 C36.5792814,12.4106494 36.1002544,13.9779187 35.9819866,15.2164437 C35.9343392,15.7176301 36.2448984,16.1831389 36.7247762,16.3309464 C37.2055049,16.4804528 37.7245217,16.2723331 37.9704165,15.8331579 C42.6764522,7.37669924 51.6129001,2.12358623 61.2912867,2.12358623 C67.2999694,2.12358623 73.1240183,4.26679518 78.6000707,8.49459975 C82.8679202,11.787989 88.5677454,13.9813166 94.3611638,14.6337084 C93.0559642,15.1909597 91.5661308,15.641178 90.07885,15.9070616 C89.6559789,15.9826643 89.321596,16.3046129 89.2280028,16.7234008 C89.1361113,17.1413393 89.3037282,17.5745682 89.6551281,17.8209141 C95.155855,21.6825977 98.4401251,27.9899011 98.4401251,34.6939063 C98.4401251,37.5973895 97.8470847,40.4057323 96.6780206,43.039934 C96.5520953,43.3245059 96.5572003,43.6498524 96.692485,43.9310264 C97.3076475,45.2077775 97.6199085,46.5779702 97.6199085,48.0016793 C97.6199085,50.9586791 96.2457903,53.6574404 93.964669,55.4345284 C93.9765809,55.0862464 93.9910453,54.7388138 93.9910453,54.3879833 L93.9910453,27.6755978 C93.9910453,27.3230684 93.8157707,26.9934746 93.5239302,26.7963979 C93.2320896,26.5993212 92.8602694,26.5585468 92.5326932,26.6893649 C89.488362,27.9032553 85.1286211,28.7510249 81.9302866,28.7510249 C79.2399078,28.7510249 76.5920714,28.3313875 74.0616519,27.5040052 C73.7136554,27.3901764 73.3324759,27.4623812 73.0491438,27.6968345 C72.7683642,27.9312878 72.6271236,28.2931614 72.6764727,28.6558844 C73.0125573,31.1116978 74.2420315,33.2710466 76.0756072,34.7856489 C68.2733386,35.0387905 60.8394868,32.1047264 55.3259971,26.6001707 C55.0009735,26.2756738 54.5040788,26.1975227 54.0948213,26.403094 C53.6855638,26.6086654 53.4549842,27.0537869 53.5222011,27.5082525 C53.8472248,29.6871391 54.7763499,31.725014 56.1700375,33.4018647 C48.2460978,32.4411159 40.5765614,29.7381072 33.8157297,25.5026574 C33.4907061,25.2979355 33.0754927,25.2851935 32.7368555,25.4729261 M102.128548,97.2538612 C98.4826675,96.0578096 82.8900422,92.4832463 79.1080265,91.6210358 L78.7864063,80.9474645 C86.8583934,76.1743011 92.5735339,67.8427144 93.7562114,58.1298919 C97.4625017,56.0750277 99.7470264,52.2439249 99.7470264,48.0016793 C99.7470264,46.4208185 99.4330638,44.8951731 98.8127962,43.458722 C99.9767551,40.6809601 100.567243,37.7350034 100.567243,34.6939063 C100.567243,28.0587081 97.6513898,21.7760393 92.6688288,17.4785783 C94.7457467,16.8822514 97.0115527,15.922352 98.6171013,14.5920844 C98.9616945,14.3075125 99.0901724,13.8360575 98.9387216,13.4155706 C98.7864199,12.9942342 98.3856709,12.7139096 97.9381253,12.7139096 C91.5278427,12.7139096 84.6164111,10.4526246 79.9018669,6.81350165 C74.0429333,2.29263045 67.7815489,-8.4946847e-05 61.2912867,-8.4946847e-05 C53.1393199,-8.4946847e-05 45.4757394,3.45045598 40.0873243,9.30244426 C40.4234089,8.53962158 40.667602,8.03758571 40.6752597,8.02144581 C40.8862698,7.58991583 40.7807647,7.07004113 40.4166021,6.75488832 C40.0541412,6.43888605 39.5232126,6.40660625 39.1241653,6.67588776 C31.303178,11.951087 26.6337287,20.7193005 26.6337287,30.1297122 C26.6337287,34.0041379 27.5237149,37.9541663 29.3530363,42.1938634 C28.4656027,44.6207948 28.4494366,49.2028277 29.8039853,52.3050866 C30.3944733,53.6591393 31.2189442,54.6207376 32.2067777,55.1372145 C32.4705404,66.1174439 38.5030468,75.6909536 47.3935489,80.9474645 L47.0719287,91.6210358 C43.2890622,92.4832463 27.6972877,96.0569601 24.0667228,97.2487644 C9.67209033,101.718667 -0.00034033887,114.843805 -0.00034033887,129.908279 L-0.00034033887,185.064266 L2.1267776,185.064266 L2.1267776,129.908279 C2.1267776,115.77907 11.1976593,103.468573 24.7150684,99.2713488 C26.6047999,98.6512368 31.9966185,97.327765 37.1536032,96.1053798 C37.7849318,106.169033 48.9446433,113.925529 63.0814691,113.925529 C76.7307595,113.925529 87.9466269,106.053505 88.9718978,96.0934873 C94.1476011,97.3201197 99.5760061,98.6512368 101.480202,99.2764456 C114.981445,103.468573 124.052327,115.77907 124.052327,129.908279 L124.052327,185.064266 L126.179445,185.064266 L126.179445,129.908279 C126.179445,114.843805 116.507865,101.718667 102.128548,97.2538612" id="Fill-9" fill="#333333" mask="url(#mask-2)"></path>
                </g>
                <mask id="mask-4" fill="white">
                    <use xlink:href="#path-3"></use>
                </mask>
                <g id="Clip-13"></g>
                <polygon id="Fill-12" fill="#333333" mask="url(#mask-4)" points="26.628964 185.064351 28.7560819 185.064351 28.7560819 137.10591 26.628964 137.10591"></polygon>
                <polygon id="Fill-14" fill="#333333" mask="url(#mask-4)" points="98.4455706 185.064351 100.572688 185.064351 100.572688 137.10591 98.4455706 137.10591"></polygon>
                <polygon id="Fill-15" fill="#333333" mask="url(#mask-4)" points="62.0259081 185.064351 64.1530261 185.064351 64.1530261 116.124039 62.0259081 116.124039"></polygon>
                <path d="M47.9274555,48.2277229 C46.8085915,48.2277229 45.898185,47.3196411 45.898185,46.2017406 C45.898185,45.1840774 46.6571407,44.3473509 47.6390183,44.2063392 C47.8117403,44.1986939 47.9844623,44.2020918 48.1571843,44.2003929 C49.166289,44.3159206 49.9558752,45.1636901 49.9558752,46.2017406 C49.9558752,47.3196411 49.0454687,48.2277229 47.9274555,48.2277229 M48.1716487,42.0775712 C48.0891165,42.0733238 48.0108386,42.0529366 47.9274555,42.0529366 C47.8219505,42.0529366 47.7232522,42.0767217 47.6194489,42.0843669 C45.2770666,42.1718622 42.9525521,42.6654034 40.77098,43.5802809 L41.5954509,45.5383057 C42.3952472,45.2027657 43.2188673,44.9419789 44.0543992,44.7304612 C43.8782738,45.1891742 43.7710671,45.6818659 43.7710671,46.2017406 C43.7710671,48.4902087 45.6361241,50.3513941 47.9274555,50.3513941 C50.218787,50.3513941 52.0829931,48.4902087 52.0829931,46.2017406 C52.0829931,45.6003169 51.9477084,45.031173 51.7154272,44.5146962 C52.2574168,44.6208798 52.7960031,44.7466011 53.3286334,44.9046022 L53.9352874,42.8684263 C52.0549152,42.3103255 50.1107294,42.0597323 48.1716487,42.0775712" id="Fill-16" fill="#333333" mask="url(#mask-4)"></path>
                <path d="M81.5434064,46.2019954 C81.5434064,47.3190465 80.6338507,48.2279777 79.5149867,48.2279777 C78.3961227,48.2279777 77.4857162,47.3190465 77.4857162,46.2019954 C77.4857162,45.162246 78.2778549,44.3127776 79.290363,44.1997983 C79.4596816,44.2014972 79.6281494,44.1989488 79.797468,44.2057445 C80.7810473,44.3442079 81.5434064,45.1817838 81.5434064,46.2019954 M75.7270151,44.5141016 C75.4947338,45.0314279 75.3585983,45.5997223 75.3585983,46.2019954 C75.3585983,48.489614 77.2236553,50.3516489 79.5149867,50.3516489 C81.807169,50.3516489 83.6705243,48.489614 83.6705243,46.2019954 C83.6705243,45.6821207 83.5633176,45.189429 83.3871922,44.7298666 C84.2227241,44.9413842 85.047195,45.2030205 85.8469914,45.5385606 L86.6706114,43.5805357 C84.4915918,42.6665077 82.1704807,42.1729665 79.830651,42.0854712 C79.725146,42.0769765 79.6230443,42.0531914 79.5149867,42.0531914 C79.4290511,42.0531914 79.3482207,42.0735787 79.2639868,42.0786755 C77.3266078,42.0616861 75.3849745,42.3122793 73.5071548,42.8686812 L74.1138088,44.9048571 C74.6455883,44.7460065 75.1841746,44.6202851 75.7270151,44.5141016" id="Fill-17" fill="#333333" mask="url(#mask-4)"></path>
                <path d="M61.5535178,61.3065642 L64.6905913,61.3065642 L64.6905913,59.182893 L61.5535178,59.182893 C60.6269452,59.182893 59.8696912,58.4464038 59.8399116,57.5289779 L61.0208874,47.8297469 L58.9090848,47.5740569 L57.7196004,57.3446432 C57.7144953,57.3871167 57.7119428,57.4295901 57.7119428,57.4720635 C57.7119428,59.58724 59.4357592,61.3065642 61.5535178,61.3065642" id="Fill-18" fill="#333333" mask="url(#mask-4)"></path>
                <path d="M70.1018092,69.1102063 L69.2475586,67.165773 C67.0753458,68.1163282 60.4642632,68.2437484 57.1723355,67.1020628 L56.47379,69.1076579 C58.2529114,69.7252215 60.9594563,70.0335785 63.5724079,70.0335785 C66.1811054,70.0335785 68.6970605,69.7260709 70.1018092,69.1102063" id="Fill-19" fill="#333333" mask="url(#mask-4)"></path>
            </g>
        </g>
    </g>
</svg>