[
  {
    "id": 1,
    "topic": "Inget störigt ljud",
    "wcag": "1.4.2 Automatisk uppspelning av ljud",
    "statement": "Inget ljud spelas upp automatiskt på ett sätt att det stör användaren till exempel när sidan laddas.",
    "howToTest": "<a href='https://digi.arbetsformedlingen.se/tillganglighet/testmetoder/testa-storigt-och-skadligt.html' target='_blank'>Testa störigt och skadligt</a>",
    "category": "Störigt / Skadligt",
    "level": "A*",
    "why": "Automatiska ljud stör och kan försvåra för användaren att fokusera. Extra viktigt för personer med koncentrationssvårigheter.",
    "principle": "1. Möjligt att uppfatta",
    "guideline": "1.4 Urskiljningsbart",
    "criteria": "1.4.2 Automatisk uppspelning av ljud",
    "role": "UX"
  },
  {
    "id": 2,
    "topic": "Inget rör sig automatiskt",
    "wcag": "2.2.2 Paus, stopp, dölj",
    "statement": "Inget innehåll rör sig, blinkar eller scrollar automatiskt i mer än 5 sekunder. Gäller till exempel video och animationer. Undantag för visning av att en sida eller innehåll laddas.",
    "howToTest": "<a href='https://digi.arbetsformedlingen.se/tillganglighet/testmetoder/testa-storigt-och-skadligt.html' target='_blank'>Testa störigt och skadligt</a>",
    "category": "Störigt / Skadligt",
    "level": "A*",
    "why": "Automatisk uppspelning stör och kan försvåra för användaren att fokusera. Extra viktigt för personer med koncentrationssvårigheter.",
    "principle": "2. Möjligt att kontrollera",
    "guideline": "2.2 Tillräckligt med tid",
    "criteria": "2.2.2 Paus, stopp, dölj",
    "role": "AD"
  },
  {
    "id": 3,
    "topic": "Automatiskt uppdateringar",
    "wcag": "2.2.2 Paus, stopp, dölj",
    "statement": "Om det finns innehåll som uppdateras automatiskt så kan användaren pausa, stoppa, dölja eller kontrollera frekvensen av uppdateringen. Helst ska inget innehåll uppdateras automatiskt, för att undvika distraktioner.",
    "howToTest": "<a href='https://digi.arbetsformedlingen.se/tillganglighet/testmetoder/testa-storigt-och-skadligt.html' target='_blank'>Testa störigt och skadligt</a>",
    "category": "Störigt / Skadligt",
    "level": "A*",
    "why": "Automatiska uppdateringar stör och kan försvåra för användaren att fokusera. Extra viktigt för personer med koncentrationssvårigheter.",
    "principle": "2. Möjligt att kontrollera",
    "guideline": "2.2 Tillräckligt med tid",
    "criteria": "2.2.2 Paus, stopp, dölj",
    "role": "UX / Utvecklare"
  },
  {
    "id": 4,
    "topic": "Max tre blinkningar per sekund",
    "wcag": "2.3.1 / 2.3.2 Tre blinkningar",
    "statement": "Ingen del av innehållet blinkar på ett sånt sätt att det riskerar att trigga epileptiska anfall, dvs. mer än 3 gånger under en 1-sekundsperiod.",
    "howToTest": "<a href='https://digi.arbetsformedlingen.se/tillganglighet/testmetoder/testa-storigt-och-skadligt.html' target='_blank'>Testa störigt och skadligt</a>",
    "category": "Störigt / Skadligt",
    "level": "A*",
    "why": "Vi vill inte riskera att orsaka anfall eller fysiska reaktioner.",
    "principle": "2. Möjligt att kontrollera",
    "guideline": "2.3 Orsaka inte anfall & fysiska reaktioner",
    "criteria": "2.3.1 / 2.3.2 Tre blinkningar",
    "role": "AD"
  },
  {
    "id": 5,
    "topic": "Använd inte Captcha",
    "wcag": "1.1.1 Innehåll som inte är text",
    "statement": "Captcha används aldrig. Captcha är en metod för att hindra robotar ifrån att t.ex. fylla i formulär.",
    "howToTest": "Kontrollera att Captcha aldrig används.",
    "category": "Generellt",
    "level": "A",
    "why": "Captcha exkluderar ofta personer med funktionsnedsättningar, t.ex. nedsatt syn eller kognitiva nedsättningar.",
    "principle": "1. Möjligt att uppfatta",
    "guideline": "1.1 Textalternativ för allt som inte är text",
    "criteria": "1.1.1 Innehåll som inte är text",
    "role": "UX"
  },
  {
    "id": 6,
    "topic": "Inga bilder med bara text",
    "wcag": "1.4.5 Text i form av bild",
    "statement": "Det finns inga bilder på sidan som enbart innehåller text. Logotyper är undantag. Bilder med viss text kan vara okej om bilden för övrigt fyller ett visuellt syfte.",
    "howToTest": "Kontrollera att det inte finns några bilder som bara innehåller text.",
    "category": "Generellt",
    "level": "AA",
    "why": "Användare behöver kunna anpassa text utifrån sina behov. Text i bild är svårare att förstora eller anpassa.",
    "principle": "1. Möjligt att uppfatta",
    "guideline": "1.4 Urskiljningsbart",
    "criteria": "1.4.5 Text i form av bild",
    "role": "AD"
  },
  {
    "id": 7,
    "topic": "Flera olika sätt att navigera",
    "wcag": "2.4.5 Flera olika sätt att navigera",
    "statement": "Det finns flera olika sätt att hitta till tjänsten eller sidan. Till exempel genom menyer, länkar, global sökfunktion eller en sitemap. Undantag är sidor som är ett resultat av eller ett steg i en process.",
    "howToTest": "Går det att hitta till sidan med hjälp av menyn eller global sök?",
    "category": "Generellt",
    "level": "AA",
    "why": "Användare behöver kunna hitta innehåll på det sätt som passar dem bäst. En del föredrar innehållsförteckning eller att söka istället för att navigera via menyer.",
    "principle": "2. Möjligt att kontrollera",
    "guideline": "2.4 Hjälp användaren navigera, hitta innehåll och avgöra var de är",
    "criteria": "2.4.5 Flera olika sätt att navigera",
    "role": "UX"
  },
  {
    "id": 8,
    "topic": "Förebyggande av fel",
    "wcag": "3.3.4 / 3.3.6 Förebyggande av fel",
    "statement": "För sidor som innebär att användare skickar in information ska ett eller flera av följande alternativ gälla:\n• användaren kan ångra åtgärden\n• användaren kan kontrollera sin information och rätta fel\n• användaren kan förhandsgranska, ändra och bekräfta innan informationen sparas eller skickas in.",
    "howToTest": "Gå igenom tjänsten/flödet och se om funktionerna finns.",
    "category": "Generellt",
    "level": "AA",
    "why": "Att skydda användarna från allvarliga konsekvenser för att de råkat göra ett misstag är viktigt för alla, både användare och för verksamheten.",
    "principle": "3. Möjligt att förstå",
    "guideline": "3.3 Hjälp användare undvika och fixa till misstag",
    "criteria": "3.3.4 / 3.3.6 Förebyggande av fel",
    "role": "UX"
  },
  {
    "id": 9,
    "topic": "Justerbar tidsgräns",
    "wcag": "2.2.1 Justerbar tidsgräns",
    "statement": "Om tjänsten kräver inloggning så får användaren en varning innan den blir utloggad och har minst 20 sekunder på sig att förlänga inloggningstiden. Om tjänsten använder Arbetsförmedlingens globala inloggning, välj svaret: Stämmer helt och hållet.",
    "howToTest": "Säkerställ att ni inte gjort något för att påverka den globala inloggningen.",
    "category": "Tid",
    "level": "A",
    "why": "Olika personer behöver olika lång tid på sig för att utföra en uppgift. Tidsgränser kan skapa förvirring eller göra att användaren går miste om information eller förlorar data.",
    "principle": "2. Möjligt att kontrollera",
    "guideline": "2.2 Tillräckligt med tid",
    "criteria": "2.2.1 Justerbar tidsgräns",
    "role": "Utvecklare"
  },
  {
    "id": 10,
    "topic": "Justerbar tidsgräns",
    "wcag": "2.2.1 Justerbar tidsgräns",
    "statement": "Användaren kan vara kvar på sidan i över 20 timmar utan att bli förflyttad (redirectad) till en annan sida. Gäller tjänster som inte kräver inloggning.",
    "howToTest": "Kontrollera att användaren kan vara kvar på samma sida i över 20 timmar utan att förflyttas till annan sida.",
    "category": "Tid",
    "level": "A",
    "why": "Olika personer behöver olika lång tid på sig för att utföra en uppgift. Tidsgränser kan skapa förvirring eller göra att användaren går miste om information eller förlorar data.",
    "principle": "2. Möjligt att kontrollera",
    "guideline": "2.2 Tillräckligt med tid",
    "criteria": "2.2.1 Justerbar tidsgräns",
    "role": "Utvecklare"
  },
  {
    "id": 11,
    "topic": "Sidans titel",
    "wcag": "2.4.2 Sidans titel",
    "statement": "Alla sidor har en titel som beskriver sidans ämne eller syfte. Med titel avses <title> i <head>-elementet.",
    "howToTest": "<a href='https://digi.arbetsformedlingen.se/tillganglighet/testmetoder/testa-sidstruktur.html' target='_blank'>Testa sidstruktur</a>",
    "category": "Sida",
    "level": "A",
    "why": "Hjälper alla användare att snabbt och enkelt avgöra om sidan är relevant utifrån deras behov. Även viktigt för sökmotoroptimering.",
    "principle": "2. Möjligt att kontrollera",
    "guideline": "2.4 Hjälp användaren navigera, hitta innehåll och avgöra var de är",
    "criteria": "2.4.2 Sidans titel",
    "role": "UX / Redaktör"
  },
  {
    "id": 12,
    "topic": "Sidans språk",
    "wcag": "3.1.1 Sidans språk",
    "statement": "Det språk som sidans huvudinnehåll har är angivet i koden så att det blir åtkomligt för hjälpmedel. Görs i ett <lang>-attribut i <head>-elementet.",
    "howToTest": "<a href='https://digi.arbetsformedlingen.se/tillganglighet/testmetoder/testa-sidstruktur.html' target='_blank'>Testa sidstruktur</a>",
    "category": "Sida",
    "level": "A",
    "why": "Hjälper skärmläsare att läsa upp innehållet med rätt uttal. Underlättar även avstavning, automatisk översättning m.m.",
    "principle": "3. Möjligt att förstå",
    "guideline": "3.1 Gör texten läsbar (för människor och skärmläsare)",
    "criteria": "3.1.1 Sidans språk",
    "role": "Redaktör / Utvecklare"
  },
  {
    "id": 13,
    "topic": "Semantisk sidstruktur med HTML",
    "wcag": "1.3.1 Information och relationer",
    "statement": "Sidan är strukturerad med hjälp av HTML-element som <main>, <nav>, <section>, <form>, <aside> osv.",
    "howToTest": "<a href='https://digi.arbetsformedlingen.se/tillganglighet/testmetoder/testa-sidstruktur.html' target='_blank'>Testa sidstruktur</a>",
    "category": "Sida",
    "level": "A",
    "why": "Strukturerad semantisk HTML är grunden för bra tillgänglighet. Hjälpmedel scannar av sidan genom att läsa HTML-strukturen.",
    "principle": "1. Möjligt att uppfatta",
    "guideline": "1.3 Innehåll kan presenteras på olika sätt",
    "criteria": "1.3.1 Information och relationer",
    "role": "Utvecklare"
  },
  {
    "id": 14,
    "topic": "Semantisk sidstruktur med ARIA-landmarks",
    "wcag": "1.3.1 Information och relationer",
    "statement": "Sidan är strukturerad med hjälp av ARIA-landmarks, till exempel <nav role='navigation'></nav>, <search>.",
    "howToTest": "<a href='https://digi.arbetsformedlingen.se/tillganglighet/testmetoder/testa-sidstruktur.html' target='_blank'>Testa sidstruktur</a>",
    "category": "Sida",
    "level": "A",
    "why": "Landmarks hjälper användare med hjälpmedel att orientera sig. Användare med skärmläsare kan navigera via landmarks.",
    "principle": "1. Möjligt att uppfatta",
    "guideline": "1.3 Innehåll kan presenteras på olika sätt",
    "criteria": "1.3.1 Information och relationer",
    "role": "Utvecklare"
  },
  {
    "id": 15,
    "topic": "Semantiska rubriker",
    "wcag": "1.3.1 Information och relationer",
    "statement": "Alla rubriker på sidan är uppmärkta rätt semantiskt med H-element. Det finns inga tomma rubriker och H-element används inte för annat som inte är rubriker.",
    "howToTest": "<a href='https://digi.arbetsformedlingen.se/tillganglighet/testmetoder/testa-rubriker.html' target='_blank'>Testa rubriker</a>",
    "category": "Rubriker",
    "level": "A",
    "why": "Personer med skärmläsare kan navigera via rubriker eller få en automatisk innehållsförteckning. Hjälper även sökmotorer att förstå vad en sida handlar om.",
    "principle": "1. Möjligt att uppfatta",
    "guideline": "1.3 Innehåll kan presenteras på olika sätt",
    "criteria": "1.3.1 Information och relationer",
    "role": "Utvecklare"
  },
  {
    "id": 16,
    "topic": "Rätt rubrikhierarki",
    "wcag": "1.3.1 Information och relationer",
    "statement": "Alla rubriker kommer i en korrekt hierarkisk ordning.",
    "howToTest": "<a href='https://digi.arbetsformedlingen.se/tillganglighet/testmetoder/testa-rubriker.html' target='_blank'>Testa rubriker</a>",
    "category": "Rubriker",
    "level": "A",
    "why": "Personer med skärmläsare kan navigera via rubriker eller få en automatisk innehållsförteckning. Hjälper även sökmotorer att förstå vad en sida handlar om.",
    "principle": "1. Möjligt att uppfatta",
    "guideline": "1.3 Innehåll kan presenteras på olika sätt",
    "criteria": "1.3.1 Information och relationer",
    "role": "UX"
  },
  {
    "id": 17,
    "topic": "Beskrivande rubriker",
    "wcag": "2.4.6 Rubriker och etiketter",
    "statement": "Alla rubriker på sidan beskriver ämnet eller syftet med det avsnitt som följer.",
    "howToTest": "Läs igenom alla rubriker. Beskriver rubriken det innehåll som ligger nedanför rubriken? Testa med användare vid behov.",
    "category": "Rubriker",
    "level": "AA",
    "why": "Hjälper alla att förstå och förutse vad ett avsnitt på sidan innehåller. Extra viktgt för personer med lässvårigheter eller försämrat korttidsminne.",
    "principle": "2. Möjligt att kontrollera",
    "guideline": "2.4 Hjälp användaren navigera, hitta innehåll och avgöra var de är",
    "criteria": "2.4.6 Rubriker och etiketter",
    "role": "Copy / Redaktör"
  },
  {
    "id": 18,
    "topic": "Betoningar och speciell text",
    "wcag": "1.3.1 Information och relationer",
    "statement": "All text som förmedlar betoningar eller annan speciell text är uppmärkt i koden. Kursivering och liknande visuella markeringar är inte tillräckligt, eftersom det inte går att uppfatta för en skärmläsare. Använd t.ex. <strong> istället för <bold>.",
    "howToTest": "1. Finns speciell text? \n2. Titta i koden om det är uppmärkt på rätt sätt.",
    "category": "Innehåll",
    "level": "A",
    "why": "Användare med hjälpmedel kan ta till sig innebörden av informationen.",
    "principle": "1. Möjligt att uppfatta",
    "guideline": "1.3 Innehåll kan presenteras på olika sätt",
    "criteria": "1.3.1 Information och relationer",
    "role": "Redaktör / Utvecklare"
  },
  {
    "id": 19,
    "topic": "Inte bara sensoriska kännetecken",
    "wcag": "1.3.3 Sensoriska kännetecken",
    "statement": "Hänvisningar till komponenter och innehåll förlitar sig inte enbart på sensoriska kännetecken som form, storlek, placering. \nSkriv t.ex. \"Välj den gröna knappen med texten Skicka\". \nSkriv inte \"Välj den gröna knappen\".",
    "howToTest": "Läs igenom allt innehåll.",
    "category": "Innehåll",
    "level": "A",
    "why": "Personer som är blinda eller har nedsatt syn kan ha svårt att ta till sig information om den förmedlas enbart genom färg, form eller placering. Extra information i text underlättar för dem.",
    "principle": "1. Möjligt att uppfatta",
    "guideline": "1.3 Innehåll kan presenteras på olika sätt",
    "criteria": "1.3.3 Sensoriska kännetecken",
    "role": "Copy / Redaktör"
  },
  {
    "id": 20,
    "topic": "Språkförändringar",
    "wcag": "3.1.2 Språk för del av sida",
    "statement": "Ord, fras eller stycken som är på ett annat språk än huvudinnehållet på sidan är uppmärkta i koden och har ett lang-attribut. Ex. <p> Hej på engelska är <span lang=\"en\"> Hello </span>.</p>",
    "howToTest": "1. Finns text på annat språk? \n2. Titta i koden om det är uppmärkt på rätt sätt.",
    "category": "Innehåll",
    "level": "AA",
    "why": "Användare kan göra egna anpassningar, t.ex. välja språkanpassad font.",
    "principle": "3. Möjligt att förstå",
    "guideline": "3.1 Gör texten läsbar (för människor och skärmläsare)",
    "criteria": "3.1.2 Språk för del av sida",
    "role": "Redaktör / Utvecklare"
  },
  {
    "id": 21,
    "topic": "Navigera med tangentbord",
    "wcag": "2.1.1 Tangentbord räcker",
    "statement": "Det går att navigera på sidan och interagera med alla komponenter enbart genom att använda tangentbordet.",
    "howToTest": "<a href='https://digi.arbetsformedlingen.se/tillganglighet/testmetoder/testa-med-tangentbord.html' target='_blank'>Testa med tangentbord</a>",
    "category": "Använda tangentbord",
    "level": "A",
    "why": "Personer med exempelvis fysiska nedsättningar kan ha svårt att använda mus och föredrar därför tangentbord. Flera hjälpmedel, t.ex. skärmläsare, bygger på att användaren använder tangentbord.",
    "principle": "2. Möjligt att kontrollera",
    "guideline": "2.1 Åtkomst med tangentbord",
    "criteria": "2.1.1 Tangentbord räcker",
    "role": "UX"
  },
  {
    "id": 22,
    "topic": "Ingen tangentbordsfälla",
    "wcag": "2.1.2 Ingen tangentbordsfälla",
    "statement": "Om fokus kan flyttas till en komponent på sidan kan fokus också flyttas bort från samma komponent via tangentbord. Användaren fastnar aldrig med markören.",
    "howToTest": "<a href='https://digi.arbetsformedlingen.se/tillganglighet/testmetoder/testa-med-tangentbord.html' target='_blank'>Testa med tangentbord</a>",
    "category": "Använda tangentbord",
    "level": "A*",
    "why": "Personer som behöver använda tangentbord måste kunna komma åt allt innehåll och inte fastna någonstans.",
    "principle": "2. Möjligt att kontrollera",
    "guideline": "2.1 Åtkomst med tangentbord",
    "criteria": "2.1.2 Ingen tangentbordsfälla",
    "role": "Utvecklare"
  },
  {
    "id": 23,
    "topic": "Logisk tabbordning",
    "wcag": "2.4.3 Logisk tabbordning",
    "statement": "Allt som användaren kan navigera till kommer i en logisk navigeringsordning när användaren till exempel tabbar igenom sidan.",
    "howToTest": "<a href='https://digi.arbetsformedlingen.se/tillganglighet/testmetoder/testa-med-tangentbord.html' target='_blank'>Testa med tangentbord</a>",
    "category": "Använda tangentbord",
    "level": "A",
    "why": "Hjälper användare med tangentbord att navigera på sidan på ett förväntat sätt. Att fokusordningen är konsistent med läsordningen gör att tjänsten uppfattas som förutsägbar och intuitiv.",
    "principle": "2. Möjligt att kontrollera",
    "guideline": "2.4 Hjälp användaren navigera, hitta innehåll och avgöra var de är",
    "criteria": "2.4.3 Logisk tabbordning",
    "role": "Utvecklare"
  },
  {
    "id": 24,
    "topic": "Synligt fokus",
    "wcag": "2.4.7 Synligt fokus",
    "statement": "Det framgår tydligt vilket element på sidan som har fokus.",
    "howToTest": "<a href='https://digi.arbetsformedlingen.se/tillganglighet/testmetoder/testa-med-tangentbord.html' target='_blank'>Testa med tangentbord</a>",
    "category": "Använda tangentbord",
    "level": "AA",
    "why": "Hjälper alla som använder tangentbordet att visuellt avgöra var de är och vilken komponent de ska interagera med.",
    "principle": "2. Möjligt att kontrollera",
    "guideline": "2.4 Hjälp användaren navigera, hitta innehåll och avgöra var de är",
    "criteria": "2.4.7 Synligt fokus",
    "role": "AD"
  },
  {
    "id": 25,
    "topic": "Skip-länk",
    "wcag": "2.4.1 Hoppa över grupperat innehåll",
    "statement": "Användare kan hoppa över innehåll som upprepas på flera sidor (till exempel menyer) genom en skip-länk som leder till huvudinnehållet.",
    "howToTest": "<a href='https://digi.arbetsformedlingen.se/tillganglighet/testmetoder/testa-med-tangentbord.html' target='_blank'>Testa med tangentbord</a>",
    "category": "Använda tangentbord",
    "level": "A",
    "why": "Personer som använder tangentbord når huvudinnehållet snabbare och slipper tabba igen samma innehåll om och om igen.",
    "principle": "2. Möjligt att kontrollera",
    "guideline": "2.4 Hjälp användaren navigera, hitta innehåll och avgöra var de är",
    "criteria": "2.4.1 Hoppa över grupperat innehåll",
    "role": "UX"
  },
  {
    "id": 26,
    "topic": "Inga kortkommandon med en tangent",
    "wcag": "2.1.4 Entangentsgenvägar",
    "statement": "Det finns inga kortkommandon som utgörs av enbart en tangent. Om det finns kortkommandon ska de innehålla CTRL, ALT osv.",
    "howToTest": "Kontrollera att det inte finns några kortkommandon som bara utgörs av en tangent.",
    "category": "Använda tangentbord",
    "level": "A",
    "why": "Kortkommandon som bara består av ett tecken kan orsaka problem för personer som använder röststyrning eller råkar klicka på fel tangent, exempelvis på grund av skakningar i händerna.",
    "principle": "2. Möjligt att kontrollera",
    "guideline": "2.1 Åtkomst med tangentbord",
    "criteria": "2.1.4 Entangentsgenvägar",
    "role": "UX"
  },
  {
    "id": 27,
    "topic": "Förutsägbarhet vid fokus",
    "wcag": "3.2.1 Förutsägbart vid fokus",
    "statement": "Inga oväntade förändringar sker när en komponent får fokus. T.ex. så ska inte ett nytt fönster öppnas, fokus flyttas, användaren skickas till en ny sida eller att någon annan större förändring av innehållet på sidan sker.",
    "howToTest": "<a href='https://digi.arbetsformedlingen.se/tillganglighet/testmetoder/testa-forutsagbart.html' target='_blank'>Testa förutsägbart</a>",
    "category": "Förutsägbart",
    "level": "A",
    "why": "Hjälper användare med visuella, kognitiva eller motoriska nedsättningar genom att minska risken att kontexten ändras på ett oförutsägbart sätt.",
    "principle": "3. Möjligt att förstå",
    "guideline": "3.2 Gör innehåll förutsägbart",
    "criteria": "3.2.1 Förutsägbart vid fokus",
    "role": "UX"
  },
  {
    "id": 28,
    "topic": "Inget innehåll bara vid fokus/hover",
    "wcag": "1.4.13 Innehåll som visas vid hover/fokus",
    "statement": "Ingen ny information visas vid hover eller fokus.",
    "howToTest": "<a href='https://digi.arbetsformedlingen.se/tillganglighet/testmetoder/testa-forutsagbart.html' target='_blank'>Testa förutsägbart</a>",
    "category": "Förutsägbart",
    "level": "AA",
    "why": "Innehåll som bara visas vid hover kräver att användaren använder mus och fungerar sällan med hjälpmedel. Mobilanvändare eller personer som behöver förstora går miste om informationen. Det är svårt att få den här typen av innehåll tillgängligt så vi har därför valt att vara lite hårdare än kriteriet.",
    "principle": "1. Möjligt att uppfatta",
    "guideline": "1.4 Urskiljningsbart",
    "criteria": "1.4.13 Innehåll som visas vid hover/fokus",
    "role": "UX"
  },
  {
    "id": 29,
    "topic": "Interaktiva komponenter",
    "wcag": "3.3.1 Identifiering av fel",
    "statement": "Alla interaktiva komponenter presenteras för alla användare och går alltid att interagera med. Det finns inga komponenter som är avaktiverade (disabled). Gäller t.ex. knappar, kryssrutor, inmatningsfält m.fl.",
    "howToTest": "Kontrollera att det går att interagera med alla interaktiva komponenter.",
    "category": "Förutsägbart",
    "level": "A",
    "why": "Inaktiva komponenter, som t.ex. knappar, är i praktiken osynliga för många användare. Det är då svårt att förstå varför något som egentligen är valbart ibland inte är det. Det är bättre att lösa det eventuella behovet på andra sätt. t.ex. att ett felmeddelande visas.",
    "principle": "3. Möjligt att förstå",
    "guideline": "3.3 Hjälp användare undvika och fixa till misstag",
    "criteria": "3.3.1 Identifiering av fel",
    "role": "UX"
  },
  {
    "id": 30,
    "topic": "Förutsägbarhet vid inmatning",
    "wcag": "3.2.2 Förutsägbarhet vid inmatning",
    "statement": "Inga oväntade förändringar sker när användaren ändrar inställning för en komponent (matar in text/gör ett val). T.ex så ska inte ett nytt fönster öppnas, fokus flyttas eller formulär skickas in. Inmatningen förändrar inte kontexten, om inte användaren blivit förvarnad om förändringen.",
    "howToTest": "<a href='https://digi.arbetsformedlingen.se/tillganglighet/testmetoder/testa-forutsagbart.html' target='_blank'>Testa förutsägbart</a>",
    "category": "Förutsägbart",
    "level": "A",
    "why": "Hjälper användaren att veta var markören är i ett formulär så de inte råkar skriva i fel fält. Att funktioner är förutsägbara hjälper alla användare, men särskilt användare med visuella eller kognitiva nedsättningar.",
    "principle": "3. Möjligt att förstå",
    "guideline": "3.2 Gör innehåll förutsägbart",
    "criteria": "3.2.2 Förutsägbarhet vid inmatning",
    "role": "UX"
  },
  {
    "id": 31,
    "topic": "Porträtt & landskapsläge",
    "wcag": "1.3.4 Orientering",
    "statement": "Det går lika bra att använda tjänsten om enheten (till exempel mobilen) är i porträtt- eller landskapsläge. Skärmens riktning är inte låst.",
    "howToTest": "Testa genom att hålla mobilen i både porträtt- och landskapsläge. Går det att använda alla funktioner oavsett hur skärmen är vriden?",
    "category": "Responsiv design",
    "level": "AA",
    "why": "Personer med motorisk nedsatthet kan behöva montera fast enheten, till exempel på en rullstol. Att själv välja det håll som passar bäst hjälper även personer med nedsatt syn.",
    "principle": "1. Möjligt att uppfatta",
    "guideline": "1.3 Innehåll kan presenteras på olika sätt",
    "criteria": "1.3.4 Orientering",
    "role": "UX"
  },
  {
    "id": 32,
    "topic": "Flexibel layout",
    "wcag": "1.4.10 Justering av layout",
    "statement": "Layouten är flexibel och responsiv. Allt innehåll kan visas på en 320 px bred skärm utan att användaren behöver scrolla i sidled. Inget innehåll eller ingen funktionalitet försvinner.",
    "howToTest": "Testa med en 320 px bred skärm.",
    "category": "Responsiv design",
    "level": "AA",
    "why": "Hjälper de användare som behöver förstora texten (och alla med mobil).",
    "principle": "1. Möjligt att uppfatta",
    "guideline": "1.3 Innehåll kan presenteras på olika sätt",
    "criteria": "1.4.10 Justering av layout",
    "role": "UX / AD / Utvecklare"
  },
  {
    "id": 33,
    "topic": "Läsordning vid olika skärmstorlekar",
    "wcag": "1.3.2 Meningsfull ordning",
    "statement": "Läsordningen blir korrekt vid olika skärmstorlekar. När responsiv design gör att ordningen ändras, så är det viktigt att betydelsen ändå är den samma.",
    "howToTest": "<a href='https://digi.arbetsformedlingen.se/tillganglighet/testmetoder/testa-lasordning.html' target='_blank'>Testa läsordning</a>",
    "category": "Responsiv design",
    "level": "A",
    "why": "Hjälper alla användare som använder mobil eller är behov av andra skärmstorlekar överlag.",
    "principle": "1. Möjligt att uppfatta",
    "guideline": "1.3 Innehåll kan presenteras på olika sätt",
    "criteria": "1.3.2 Meningsfull ordning",
    "role": "UX / AD"
  },
  {
    "id": 34,
    "topic": "Läsordning för hjälpmedel",
    "wcag": "1.3.2 Meningsfull ordning",
    "statement": "Läsordningen blir korrekt för användare med hjälpmedel. Innehållet presenteras i den ordningen det har i koden. CSS används inte för att ändra ordningen.",
    "howToTest": "<a href='https://digi.arbetsformedlingen.se/tillganglighet/testmetoder/testa-lasordning.html' target='_blank'>Testa läsordning</a>",
    "category": "Responsiv design",
    "level": "A",
    "why": "Hjälper användare med skärmläsare eller andra hjälpmedel som läser upp innehållet.",
    "principle": "1. Möjligt att uppfatta",
    "guideline": "1.3 Innehåll kan presenteras på olika sätt",
    "criteria": "1.3.2 Meningsfull ordning",
    "role": "Utvecklare"
  },
  {
    "id": 35,
    "topic": "Inte bara färg",
    "wcag": "1.4.1 Användning av färger",
    "statement": "Förutom färg så används även andra sätt för att förmedla information.",
    "howToTest": "<a href='https://digi.arbetsformedlingen.se/tillganglighet/testmetoder/testa-inte-bara-farg.html' target='_blank'>Testa Inte bara färg</a>",
    "category": "Färg & form",
    "level": "A",
    "why": "Viktigt för att alla användare ska kunna ta till sig informationen, inkl personer med färgblindhet.",
    "principle": "1. Möjligt att uppfatta",
    "guideline": "1.4 Urskiljningsbart",
    "criteria": "1.4.1 Användning av färger",
    "role": "UX / AD"
  },
  {
    "id": 36,
    "topic": "Ändra textstorlek",
    "wcag": "1.4.4 Förändring av textstorlek",
    "statement": "Allt innehåll kan förstoras utan hjälpmedel upp till 200 procent utan att innehåll försvinner eller funktionalitet försämras. Detta gäller vid förstoring med CTRL+/CTRL-, inte pinch-to-zoom.",
    "howToTest": "<a href='https://digi.arbetsformedlingen.se/tillganglighet/testmetoder/testa-forstora-text.html' target='_blank'>Testa förstora text</a>",
    "category": "Ändra storlek",
    "level": "AA",
    "why": "Hjälper användare som behöver förstora innehållet.",
    "principle": "1. Möjligt att uppfatta",
    "guideline": "1.4 Urskiljningsbart",
    "criteria": "1.4.4 Förändring av textstorlek",
    "role": "Utvecklare"
  },
  {
    "id": 37,
    "topic": "Ändra textmellanrum",
    "wcag": "1.4.12 Textmellanrum",
    "statement": "Det går att öka avståndet mellan text, rader, stycken och ord utan att innehåll eller funktionalitet försvinner. \n• radavstånd till minst 1,5 ggr teckensnittets storlek\n• avståndet mellan stycken till minst 2 ggr teckensnittets storlek\n• teckenavståndet till minst 0,12 ggr teckensnittets storlek\n• avståndet mellan ord till minst 0,16 ggr teckensnittets storlek.",
    "howToTest": "<a href='https://digi.arbetsformedlingen.se/tillganglighet/testmetoder/testa-forstora-text.html' target='_blank'>Testa förstora text</a>",
    "category": "Ändra storlek",
    "level": "AA",
    "why": "Viktigt framför allt för personer med dyslexi och personer med nedsatt syn.",
    "principle": "1. Möjligt att uppfatta",
    "guideline": "1.4 Urskiljningsbart",
    "criteria": "1.4.12 Textmellanrum",
    "role": "Utvecklare"
  },
  {
    "id": 38,
    "topic": "Ångra klick/pekoperation",
    "wcag": "2.5.2 Ångra klick/pekoperation",
    "statement": "Användaren kan ångra ett påbörjat klick till exempel genom att flytta/dra fingret bort från knappen. Handlingen slutförs när fingret lyfts från skärmen, inte när fingret vidrör skärmen.",
    "howToTest": "Testa att dra fingret bort från en komponent. För standard-komponenter brukar det automatiskt bli rätt.",
    "category": "Använda mobil",
    "level": "A",
    "why": "Hjälper alla användare som har råkat välja fel.",
    "principle": "2. Möjligt att kontrollera",
    "guideline": "2.5 Input Modalitet",
    "criteria": "2.5.2 Ångra klick/pekoperation",
    "role": "Utvecklare"
  },
  {
    "id": 39,
    "topic": "Alternativ till komplexa rörelser",
    "wcag": "2.5.1 Gester",
    "statement": "Det finns alternativ till komplexa fingerrörelser. Funktioner som kräver flera fingrar eller sveprörelser är också möjliga att utföra på enklare sätt med endast ett finger. \nTill exempel en karta där användaren kan dra ihop/dra isär för att zooma så finns även +/-knappar som användaren kan klicka på.",
    "howToTest": "Testa med pekskärm: Går det att göra alla moment på sidan med bara ett finger?",
    "category": "Använda mobil",
    "level": "A",
    "why": "Alla har inte möjlighet att använda flera fingrar samtidigt till exempel på grund av motoriska nedsättningar. Komplexa rörelser är även svårt för ovana användare.",
    "principle": "2. Möjligt att kontrollera",
    "guideline": "2.5 Input Modalitet",
    "criteria": "2.5.1 Gester",
    "role": "UX"
  },
  {
    "id": 40,
    "topic": "Alternativ till rörelsestyrning",
    "wcag": "2.5.4 Rörelsestyrning",
    "statement": "Det finns alternativ till rörelsestyrning. Funktioner som aktiveras genom att användaren skakar, vrider, rör vid eller viftar framför enheten kan också aktiveras på något annat sätt, till exempel genom knappar i gränssnittet.",
    "howToTest": "1. Finns rörelsestyrning? \n2. Testa att funktionen går att använda på annat sätt.",
    "category": "Använda mobil",
    "level": "A",
    "why": "Hjälper personer som behöver ha mobilen fastmonterad eller som inte har fysiska förutsättningar för att göra vissa rörelser. Även personer som i situationen inte kan flytta sin mobil.",
    "principle": "2. Möjligt att kontrollera",
    "guideline": "2.5 Input Modalitet",
    "criteria": "2.5.4 Rörelsestyrning",
    "role": "UX"
  },
  {
    "id": 41,
    "topic": "Stänga av rörelsestyrning",
    "wcag": "2.5.4 Rörelsestyrning",
    "statement": "Rörelsestyrning går att stänga av. Alla funktioner som aktiveras genom att användaren skakar, vrider, rör vid eller viftar framför enheten kan stängas av, för att undvika att användaren råkar aktivera dem av misstag.",
    "howToTest": "1. Finns rörelsestyrning? \n2. Testa att rörelsestyrning går att stänga av.",
    "category": "Använda mobil",
    "level": "A",
    "why": "Hjälper personer som behöver ha mobilen fastmonterad eller som inte har fysiska förutsättningar för att göra vissa rörelser. Även personer som i situationen inte kan flytta sin mobil.",
    "principle": "2. Möjligt att kontrollera",
    "guideline": "2.5 Input Modalitet",
    "criteria": "2.5.4 Rörelsestyrning",
    "role": "UX"
  },
  {
    "id": 42,
    "topic": "Kontrast för text",
    "wcag": "1.4.3 Kontrast Minimum",
    "statement": "All text har ett kontrastvärde på minst 4,5:1. Gäller även text i bilder.",
    "howToTest": "<a href='https://digi.arbetsformedlingen.se/tillganglighet/testmetoder/testa-kontraster.html' target='_blank'>Testa kontrast</a>",
    "category": "Kontraster",
    "level": "AA",
    "why": "Viktigt för att alla användare ska kunna ta till sig informationen, inkl personer med nedsatt syn.",
    "principle": "1. Möjligt att uppfatta",
    "guideline": "1.4 Urskiljningsbart",
    "criteria": "1.4.3 Kontrast Minimum",
    "role": "AD"
  },
  {
    "id": 43,
    "topic": "Kontrast för komponenter, default",
    "wcag": "1.4.11 Kontrast för annat än text",
    "statement": "Alla interaktiva komponenter har ett kontrastvärde på minst 3:1 mot intilliggande bakgrunder. De bör ha tydliga visuella gränser. Gäller komponentens standardtillstånd (default state).",
    "howToTest": "<a href='https://digi.arbetsformedlingen.se/tillganglighet/testmetoder/testa-kontraster.html' target='_blank'>Testa kontrast</a>",
    "category": "Kontraster",
    "level": "AA",
    "why": "Viktigt för att alla användare ska kunna ta till sig informationen, inkl personer med nedsatt syn.",
    "principle": "1. Möjligt att uppfatta",
    "guideline": "1.4 Urskiljningsbart",
    "criteria": "1.4.11 Kontrast för annat än text",
    "role": "AD"
  },
  {
    "id": 44,
    "topic": "Kontrast för komponenter, tillstånd",
    "wcag": "1.4.11 Kontrast för annat än text",
    "statement": "När en komponent är i ett annat tillstånd (state) än standard (default) så har komponenten ett kontrastvärde på minst 3:1 mot intilliggande bakgrunder. Exempel: fokus, hover, select, press, check, besökt/obesökt och expanderad/ihopfälld.",
    "howToTest": "<a href='https://digi.arbetsformedlingen.se/tillganglighet/testmetoder/testa-kontraster.html' target='_blank'>Testa kontrast</a>",
    "category": "Kontraster",
    "level": "AA",
    "why": "Viktigt för att alla användare ska kunna ta till sig informationen, inkl personer med nedsatt syn.",
    "principle": "1. Möjligt att uppfatta",
    "guideline": "1.4 Urskiljningsbart",
    "criteria": "1.4.11 Kontrast för annat än text",
    "role": "AD"
  },
  {
    "id": 45,
    "topic": "Kontrast mellan tillstånd och default",
    "wcag": "1.4.11 Kontrast för annat än text",
    "statement": "Om en färgförändring är det enda sättet att visa vilket tillstånd en komponent är i, så har komponententen även ett kontrastvärde på minst 3:1 mot sitt standard-tillstånd (default state).",
    "howToTest": "<a href='https://digi.arbetsformedlingen.se/tillganglighet/testmetoder/testa-kontraster.html' target='_blank'>Testa kontrast</a>",
    "category": "Kontraster",
    "level": "AA",
    "why": "Viktigt för att alla användare ska kunna ta till sig informationen, inkl personer med nedsatt syn.",
    "principle": "1. Möjligt att uppfatta",
    "guideline": "1.4 Urskiljningsbart",
    "criteria": "1.4.11 Kontrast för annat än text",
    "role": "AD"
  },
  {
    "id": 46,
    "topic": "Kontrast för ikoner",
    "wcag": "1.4.11 Kontrast för annat än text",
    "statement": "Grafiska element som krävs för att förstå innehållet har ett kontrastvärdet på minst 3:1 mot intilliggande bakgrund eller närliggande grafiska element. Gäller ikoner, diagram, infografik och bilder.",
    "howToTest": "<a href='https://digi.arbetsformedlingen.se/tillganglighet/testmetoder/testa-kontraster.html' target='_blank'>Testa kontrast</a>",
    "category": "Kontraster",
    "level": "AA",
    "why": "Viktigt för att alla användare ska kunna ta till sig informationen, inkl personer med nedsatt syn.",
    "principle": "1. Möjligt att uppfatta",
    "guideline": "1.4 Urskiljningsbart",
    "criteria": "1.4.11 Kontrast för annat än text",
    "role": "AD"
  },
  {
    "id": 47,
    "topic": "Textalternativ för bilder",
    "wcag": "1.1.1 Innehåll som inte är text",
    "statement": "Alla innehållsbärande bilder och ikoner har ett textalternativ som beskriver motsvarande innehåll som bilden. Texten ska vara kortfattad och vara likvärdig som bilden.",
    "howToTest": "<a href='https://digi.arbetsformedlingen.se/tillganglighet/testmetoder/testa-textalternativ.html' target='_blank'>Testa textalternativ</a>",
    "category": "Ikoner & bilder",
    "level": "A",
    "why": "Personer med nedsatt syn kan ta till sig innehållet genom att en skärmläsare läser upp textalternativet. Dövblinda kan läsa texten med hjälp av punktskrift.",
    "principle": "1. Möjligt att uppfatta",
    "guideline": "1.1 Textalternativ för allt som inte är text",
    "criteria": "1.1.1 Innehåll som inte är text",
    "role": "UX / Redaktör"
  },
  {
    "id": 48,
    "topic": "Textalternativ för komplexa bilder",
    "wcag": "1.1.1 Innehåll som inte är text",
    "statement": "Komplexa bilder (exempelvis en karta eller en graf) har ett textalternativ som beskriver innehållet övergripande (t.ex Alt='Graf 4: Utveckling senaste året'). Motsvarande information finns även som vanlig text, antingen på samma sida som grafen eller via länk till annan sida.",
    "howToTest": "<a href='https://digi.arbetsformedlingen.se/tillganglighet/testmetoder/testa-textalternativ.html' target='_blank'>Testa textalternativ</a>",
    "category": "Ikoner & bilder",
    "level": "A",
    "why": "Det kan vara svårt att göra kartor och grafer tillgängliga. Det kan vara bättre är att flytta ut informationen och ha synlig text bredvid så att kartan eller grafen endast blir ett komplement (reduntant).",
    "principle": "1. Möjligt att uppfatta",
    "guideline": "1.1 Textalternativ för allt som inte är text",
    "criteria": "1.1.1 Innehåll som inte är text",
    "role": "UX / AD"
  },
  {
    "id": 49,
    "topic": "Dölj dekorativa bilder",
    "wcag": "1.1.1 Innehåll som inte är text",
    "statement": "Alla dekorativa eller redundanta bilder/ikoner är dolda för hjälpmedel (redundant innebär att bilden har text intill som säger samma sak).",
    "howToTest": "<a href='https://digi.arbetsformedlingen.se/tillganglighet/testmetoder/testa-textalternativ.html' target='_blank'>Testa textalternativ</a>",
    "category": "Ikoner & bilder",
    "level": "A",
    "why": "Att tvingas ta till sig onödig information är störande. Om alt-attributet uteslutas helt (och bilden inte är dold på annat sätt), kan en skärmläsare börja läsa upp filnamnet istället.",
    "principle": "1. Möjligt att uppfatta",
    "guideline": "1.1 Textalternativ för allt som inte är text",
    "criteria": "1.1.1 Innehåll som inte är text",
    "role": "UX / Utvecklare"
  },
  {
    "id": 50,
    "topic": "Text som identifierar ljud",
    "wcag": "1.1.1 Innehåll som inte är text",
    "statement": "För alla ljudklipp finns en text som identifierar innehållet.",
    "howToTest": "<a href='https://digi.arbetsformedlingen.se/tillganglighet/testmetoder/testa-textalternativ.html' target='_blank'>Testa textalternativ</a>",
    "category": "Ljud",
    "level": "A",
    "why": "Användare med hjälpmedel behöver kunna veta att det finns ett ljudklipp och övergripande förstå vad ljudklippet handlar om.",
    "principle": "1. Möjligt att uppfatta",
    "guideline": "1.1 Textalternativ för allt som inte är text",
    "criteria": "1.1.1 Innehåll som inte är text",
    "role": "UX / Copy / Redaktör"
  },
  {
    "id": 51,
    "topic": "Textalternativ till förinspelat ljud",
    "wcag": "1.2.1 Enbart ljud och video förinspelat",
    "statement": "För förinspelade ljudspår finns ett textalternativ som innehåller motsvarande information, t.ex. en text med transkribering. Denna text finns på samma sida eller så går texten att nå via länk till annan sida.",
    "howToTest": "Kan användaren ta till sig innehållet i ljudklippet genom att enkelt hitta och läsa texten?",
    "category": "Ljud",
    "level": "A",
    "why": "Personer med nedsatt hörsel eller som av andra anledningar har svårt att ta till sig information via ljud kan istället läsa texten.",
    "principle": "1. Möjligt att uppfatta",
    "guideline": "1.2 Texta och tolka ljud och video",
    "criteria": "1.2.1 Enbart ljud och video (förinspelat)",
    "role": "UX / Producent"
  },
  {
    "id": 52,
    "topic": "Text som identifierar video",
    "wcag": "1.1.1 Innehåll som inte är text",
    "statement": "För alla videos finns en text som identifierar innehållet i videon.",
    "howToTest": "<a href='https://digi.arbetsformedlingen.se/tillganglighet/testmetoder/testa-textalternativ.html' target='_blank'>Testa textalternativ</a>",
    "category": "Video",
    "level": "A",
    "why": "Användare med hjälpmedel behöver kunna veta att det finns en video och övergripande förstå vad videon handlar om.",
    "principle": "1. Möjligt att uppfatta",
    "guideline": "1.1 Textalternativ för allt som inte är text",
    "criteria": "1.1.1 Innehåll som inte är text",
    "role": "UX / Copy / Redaktör"
  },
  {
    "id": 53,
    "topic": "Textalternativ till video utan ljud",
    "wcag": "1.2.1 Enbart ljud och video förinspelat",
    "statement": "Alla förinspelade video utan ljud finns ett textalternativ med motsvarande information. Denna beskrivning finns på samma sida eller så går texten att nå via länk till annan sida.",
    "howToTest": "Kan användaren ta till sig innehållet i videon genom att enkelt hitta och läsa texten?",
    "category": "Video",
    "level": "A",
    "why": "Personer med nedsatt syn eller som av andra anledningar har svårt att ta till sig visuellt innehåll kan få informationen uppläst eller presenterat på andra sätt.",
    "principle": "1. Möjligt att uppfatta",
    "guideline": "1.2 Texta och tolka ljud och video",
    "criteria": "1.2.1 Enbart ljud och video (förinspelat)",
    "role": "UX / Producent"
  },
  {
    "id": 54,
    "topic": "Undertexter till video",
    "wcag": "1.2.2 Texta rörligt material",
    "statement": "Alla förinspelade video har undertexter (captions). Dessa beskriver både tal och annat ljud som behövs för att förstå innehållet (ljudeffekter, skratt, vem som pratar osv).\n(Lagen gäller videos publicerade efter 23/9 2020)",
    "howToTest": "1. Finns undertexter? \n2. Beskriver dessa allt ljud som behövs för att förstå innehållet?",
    "category": "Video",
    "level": "A",
    "why": "Personer med nedsatt hörsel kan uppfatta det som sägs genom att läsa undertexterna. Även bra för de som är i en miljö där de inte kan ha ljudet på (till exempel har glömt sina hörlurar).",
    "principle": "1. Möjligt att uppfatta",
    "guideline": "1.2 Texta och tolka ljud och video",
    "criteria": "1.2.2 Texta rörligt material",
    "role": "UX / Producent"
  },
  {
    "id": 55,
    "topic": "Syntolkning till video",
    "wcag": "1.2.5 Syntolkning",
    "statement": "Alla förinspelade video har ett extra ljudspår som förklarar det visuella innehållet i förinspelad video (s.k. syntolkning).\n(Lagen gäller videos publicerade efter 23/9 2020)",
    "howToTest": "1. Finns ljudspår?\n2. Beskriver ljudspåret det visuella innehållet i videon?",
    "category": "Video",
    "level": "AA",
    "why": "Hjälper personer som har svårt att ta till sig visuellt innehåll, till exempel på grund av nedsatt syn.",
    "principle": "1. Möjligt att uppfatta",
    "guideline": "1.2 Texta och tolka ljud och video",
    "criteria": "1.2.5 Syntolkning",
    "role": "UX / Producent"
  },
  {
    "id": 56,
    "topic": "Semantiska länkar",
    "wcag": "1.3.1 Information och relationer",
    "statement": "Alla länkar är semantiskt uppmärkta med <a> och har ett href-attribut. En länk ska alltid förflytta användaren till en ny plats på samma sida eller till en annan sida.",
    "howToTest": "Kontrollera att varje länk leder till en annan plats.",
    "category": "Komponenter - Länkar",
    "level": "A",
    "why": "Skärmläsare kan visa alla länkar i en länklista. Länkar behöver leda någonstans för att vara meningsfulla för användarna.",
    "principle": "1. Möjligt att uppfatta",
    "guideline": "1.3 Innehåll kan presenteras på olika sätt",
    "criteria": "1.3.1 Information och relationer",
    "role": "Utvecklare"
  },
  {
    "id": 57,
    "topic": "Synliga länktexter",
    "wcag": "2.4.4 / 2.4.9 Länksyfte",
    "statement": "Alla länkar har synliga länktexter. (undantag är länkar i form av logotyper som leder till t.ex. startsidan.)",
    "howToTest": "Gå igenom alla länkar och se om de har synlig länktext.",
    "category": "Komponenter - Länkar",
    "level": "A",
    "why": "Det behöver vara tydligt för användare var en länk leder. Länkar utan text försvårar för alla användare.",
    "principle": "2. Möjligt att kontrollera",
    "guideline": "2.4 Hjälp användaren navigera, hitta innehåll och avgöra var de är",
    "criteria": "2.4.4 / 2.4.9 Länksyfte",
    "role": "UX / Copy"
  },
  {
    "id": 58,
    "topic": "Skriv tydliga länktexter",
    "wcag": "2.4.4 / 2.4.9 Länksyfte",
    "statement": "Alla länktexter är begripliga och kan tolkas även om länken tas ur sitt sammanhang. Fel sätt är länktexter i stil med 'Läs mer', 'Klicka här' osv.",
    "howToTest": "<a href='https://digi.arbetsformedlingen.se/tillganglighet/testmetoder/testa-lanktexter.html' target='_blank'>Testa länktexter</a>",
    "category": "Komponenter - Länkar",
    "level": "A",
    "why": "Användare med skärmläsare kan navigera via skärmläsarens länklista. Länktexterna behöver då vara begripliga så att listan blir användbar.",
    "principle": "2. Möjligt att kontrollera",
    "guideline": "2.4 Hjälp användaren navigera, hitta innehåll och avgöra var de är",
    "criteria": "2.4.4 / 2.4.9 Länksyfte",
    "role": "UX / Copy"
  },
  {
    "id": 59,
    "topic": "Länktexter för externa webbplatser och dokument",
    "wcag": "2.4.4 / 2.4.9 Länksyfte",
    "statement": "Om länken leder till en extern sida (utanför arbetsförmedlingen) eller till ett dokument som laddas ner så framgår det tydligt i länktexten.",
    "howToTest": "<a href='https://digi.arbetsformedlingen.se/tillganglighet/testmetoder/testa-lanktexter.html' target='_blank'>Testa länktexter</a>",
    "category": "Komponenter - Länkar",
    "level": "A",
    "why": "Om något kommer att laddas ner eller öppnas på ett för användaren oväntat sätt så behöver det vara extra tydligt för användaren var länken leder.",
    "principle": "2. Möjligt att kontrollera",
    "guideline": "2.4 Hjälp användaren navigera, hitta innehåll och avgöra var de är",
    "criteria": "2.4.4 / 2.4.9 Länksyfte",
    "role": "UX / Copy"
  },
  {
    "id": 60,
    "topic": "Namn för länkar utan text",
    "wcag": "4.1.2 Namn, roll, värde",
    "statement": "Om länken endast utgörs av en bild (undantag) så ska bildens textalternativ beskriva såväl bilden som funktionen. Exempel: alt:\"Arbetsförmedlingens logotyp (Till startsidan)\".",
    "howToTest": "<a href='https://digi.arbetsformedlingen.se/tillganglighet/testmetoder/testa-textalternativ.html' target='_blank'>Testa textalternativ</a>",
    "category": "Komponenter - Länkar",
    "level": "A",
    "why": "Länkar utan text ska undvikas. Att klicka på logotypen för att komma till startsidan är dock ett välkänt designmönster.",
    "principle": "4. Robust",
    "guideline": "4.1 Kompatibel med webläsare & hjälpmedel",
    "criteria": "4.1.2 Namn, roll, värde",
    "role": "UX / Copy"
  },
  {
    "id": 61,
    "topic": "Semantiska knappar",
    "wcag": "1.3.1 Information och relationer",
    "statement": "Alla knappar är semantiskt uppmärkta med <buttons>.",
    "howToTest": "Kontrollera att alla knappar är kodade som <code>&lt;button&gt;</code>.",
    "category": "Komponenter - Knappar",
    "level": "A",
    "why": "Användare med skärmläsare behöver veta att en knapp är just en knapp. Att använda standardkomponenter gör dessutom att det finns inbyggd funktionalitet, så utvecklingstiden minskar för teamet.",
    "principle": "1. Möjligt att uppfatta",
    "guideline": "1.3 Innehåll kan presenteras på olika sätt",
    "criteria": "1.3.1 Information och relationer",
    "role": "Utvecklare"
  },
  {
    "id": 62,
    "topic": "Knappar med synlig text",
    "wcag": "4.1.2 Namn, roll, värde",
    "statement": "Alla knappar har en synlig text som förklarar knappens syfte (Undantag för knappar i mobil om det är platsbrist och det finns tydliga ikoner.)",
    "howToTest": "Gå igenom alla knappar och se om de har synlig text.",
    "category": "Komponenter - Knappar",
    "level": "A",
    "why": "Knappar utan text försvårar för alla användare.",
    "principle": "4. Robust",
    "guideline": "4.1 Kompatibel med webläsare & hjälpmedel",
    "criteria": "4.1.2 Namn, roll, värde",
    "role": "UX / Copy"
  },
  {
    "id": 63,
    "topic": "Namn för knappar utan text",
    "wcag": "4.1.2 Namn, roll, värde",
    "statement": "Om det finns knappar utan synlig text så har knappen ett namn som hjälpmedel kommer åt, i form av ett textalternativ som beskriver knappens funktion. Tex: aria-label=\"Sök på webbplatsen\".",
    "howToTest": "<a href='https://digi.arbetsformedlingen.se/tillganglighet/testmetoder/testa-komponenters-namn.html' target='_blank'>Testa komponenters namn</a>",
    "category": "Komponenter - Knappar",
    "level": "A",
    "why": "Användare med skärmläsare behöver kunna förstå vad knappen har för funktion.",
    "principle": "4. Robust",
    "guideline": "4.1 Kompatibel med webläsare & hjälpmedel",
    "criteria": "4.1.2 Namn, roll, värde",
    "role": "Copy / UX"
  },
  {
    "id": 64,
    "topic": "Semantiska listor",
    "wcag": "1.3.1 Information och relationer",
    "statement": "Listor är uppmärkta semantiskt med <ul>, <ol> och innehåller listelement (li). Ordnade listor <ol> används för att beskriva steg (1,2,3) och oordnade listor <ul> används för punktlistor.",
    "howToTest": "Kontrollera att listor är rätt uppmärkta i koden.",
    "category": "Komponenter - Listor",
    "level": "A",
    "why": "Listor behöver vara rätt uppmärkta så att hjälpmedel kan tolka dem. Om en lista endast är visuellt formaterad så kan användare ha svårt att navigera i dem och förstå relationerna.",
    "principle": "1. Möjligt att uppfatta",
    "guideline": "1.3 Innehåll kan presenteras på olika sätt",
    "criteria": "1.3.1 Information och relationer",
    "role": "Utvecklare"
  },
  {
    "id": 65,
    "topic": "Semantiska tabeller",
    "wcag": "1.3.1 Information och relationer",
    "statement": "Tabeller används endast för strukturerad data och är korrekt uppmärkta med <table>, <tr> för rad, <th> för tabellhuvud och <td> för varje cell.",
    "howToTest": "Kontrollera att tabeller är rätt uppmärkta i koden.",
    "category": "Komponenter - Tabeller",
    "level": "A",
    "why": "Tabeller behöver vara rätt uppmärkta så att användare med hjälpmedel kan navigera i dem och få dem upplästa på rätt sätt.",
    "principle": "1. Möjligt att uppfatta",
    "guideline": "1.3 Innehåll kan presenteras på olika sätt",
    "criteria": "1.3.1 Information och relationer",
    "role": "Utvecklare"
  },
  {
    "id": 66,
    "topic": "Tabeller har överskrifter",
    "wcag": "1.3.1 Information och relationer",
    "statement": "Tabeller har en överskrift i form av en <caption> som kort beskriver vilken information tabellen innehåller.",
    "howToTest": "Kontrollera att tabeller har en <caption> som kort och tydligt förklarar vad tabellen innehåller.",
    "category": "Komponenter - Tabeller",
    "level": "A",
    "why": "Rubriken identifierar tabellen och hjälper till exempel använda med skärmläsare att navigera direkt till tabellen.",
    "principle": "1. Möjligt att uppfatta",
    "guideline": "1.3 Innehåll kan presenteras på olika sätt",
    "criteria": "1.3.1 Information och relationer",
    "role": "UX"
  },
  {
    "id": 67,
    "topic": "Namn för iframes",
    "wcag": "4.1.2 Namn, roll, värde",
    "statement": "Om iframes används så har iframen ett namn i form av en <title>.",
    "howToTest": "Kontrollera att <code>&lt;iframe&gt;</code> har ett title-attribut som tydligt förklarar innehållet i iframen.",
    "category": "Komponenter - Iframes",
    "level": "A",
    "why": "Användare med skärmläsare använder titeln för att förstå vilket innehåll som iframen innehåller.",
    "principle": "4. Robust",
    "guideline": "4.1 Kompatibel med webläsare & hjälpmedel",
    "criteria": "4.1.2 Namn, roll, värde",
    "role": "Utvecklare"
  },
  {
    "id": 68,
    "topic": "Namn innehåller synlig text",
    "wcag": "2.5.3 Etikett i namn",
    "statement": "Den synliga texten på en komponent överrensstämmer med det namn som hjälpmedel kommer åt. Namnet innehåller den synliga texten. I de fall de inte kan vara samma så börjar namnet med den synliga texten.",
    "howToTest": "<a href='https://digi.arbetsformedlingen.se/tillganglighet/testmetoder/testa-komponenters-namn.html' target='_blank'>Testa komponenters namn</a>",
    "category": "Komponenter",
    "level": "A",
    "why": "Personer som använder röststyrning kan interagera med knappar och funktioner (t.ex. säga 'Klicka på Sök'). Upplevelsen blir bättre för personer som får texten uppläst eftersom det som hörs matchar med det som de ser.",
    "principle": "2. Möjligt att kontrollera",
    "guideline": "2.5 Input Modalitet",
    "criteria": "2.5.3 Etikett i namn",
    "role": "UX / Copy"
  },
  {
    "id": 69,
    "topic": "Grupper av radioknappar/kryssrutor",
    "wcag": "1.3.1 Information och relationer",
    "statement": "Grupper av radioknappar eller kryssrutor har en beskrivande överskrift i form av en <legend> och en <fieldset> runt om.",
    "howToTest": "Kontrollera att det finns en överskrift till radioknappar och kryssrutor. \nTitta i koden att det finns en <code>&lt;fieldset&gt;</code> runt om.",
    "category": "Formulär",
    "level": "A",
    "why": "Hjälper användare att förstå vad som efterfrågas och vilka olika alternativ användaren kan välja emellan. Det blir tydligt vilka fält som hör ihop.",
    "principle": "1. Möjligt att uppfatta",
    "guideline": "1.3 Innehåll kan presenteras på olika sätt",
    "criteria": "1.3.1 Information och relationer",
    "role": "UX / Utvecklare"
  },
  {
    "id": 70,
    "topic": "Autoifyllnad i inmatningsfält",
    "wcag": "1.3.5 Ange standardsyfte",
    "statement": "Inmatningsfält där användaren lämnar information om sig själv kan autoifyllas, så att användaren kan fylla i formuläret snabbare. Fältets betydelse är angivet i koden. Gäller t.ex. namn, telefonnummer, epost m.fl. \nGörs med autocomplete-attributet.",
    "howToTest": "När du börjar skriva i ett inmatningsfält, får du då upp förslag på personlig information du sparat i webbläsaren?",
    "category": "Formulär",
    "level": "AA",
    "why": "Underlättar för användare med kognitiva nedsättningar. Men bra för alla användare, till exempel de som har bråttom.",
    "principle": "1. Möjligt att uppfatta",
    "guideline": "1.3 Innehåll kan presenteras på olika sätt",
    "criteria": "1.3.5 Ange standardsyfte",
    "role": "UX / Utvecklare"
  },
  {
    "id": 71,
    "topic": "Synliga etiketter",
    "wcag": "3.3.2 Etiketter och instruktioner",
    "statement": "Det finns synliga etiketter i form av <labels> för alla formulärkomponenter. Placeholderstext som försvinner när användaren börjar skriva är inte tillräckligt för inmatningsfält.",
    "howToTest": "Finns det en synlig etikett för alla formulärelement?",
    "category": "Formulär",
    "level": "A",
    "why": "Att det finns synliga etiketter som inte försvinner när användaren börjar skriva, underlättar för alla användare. Det är särskilt viktigt för personer med kognitiva funktionsnedsättningar eller inlärningssvårigheter.",
    "principle": "3. Möjligt att förstå",
    "guideline": "3.3 Hjälp användare undvika och fixa till misstag",
    "criteria": "3.3.2 Etiketter och instruktioner",
    "role": "UX"
  },
  {
    "id": 72,
    "topic": "Placering av etikett",
    "wcag": "3.3.2 Etiketter och instruktioner",
    "statement": "Etiketten (labeln) är visuellt placerad så att det är tydligt vilket fält etiketten tillhör.",
    "howToTest": "Se riktlinjerna för respektive formulär-komponent på Digin.",
    "category": "Formulär",
    "level": "A",
    "why": "När etiketter är placerade där användaren förväntar att de ska vara, så blir det lättare att förstå formuläret och hitta fälten. Det gör det även lättare för användare som behöver förstora innehållet.",
    "principle": "3. Möjligt att förstå",
    "guideline": "3.3 Hjälp användare undvika och fixa till misstag",
    "criteria": "3.3.2 Etiketter och instruktioner",
    "role": "UX / AD"
  },
  {
    "id": 73,
    "topic": "Etikett är kopplat till fält",
    "wcag": "1.3.1 Information & Relationer",
    "statement": "Etiketten (labeln) är kopplad till det fält den tillhör. Att klicka på etiketten ger samma resultat som att klicka på fältet till exempel att klicka på etiketten till höger om en kryssruta.",
    "howToTest": "Klicka på etiketten och se om fältet får fokus.",
    "category": "Formulär",
    "level": "A",
    "why": "Användare med skärmläsare förstår vilken etikett som hör ihop med vilket fält. Klickytan blir större, vilket hjälper användare som har svårt att klicka exakt i en kryssruta eller ett fält.",
    "principle": "1. Möjligt att uppfatta",
    "guideline": "1.3 Innehåll kan presenteras på olika sätt",
    "criteria": "1.3.1 Information & Relationer",
    "role": "Utvecklare"
  },
  {
    "id": 74,
    "topic": "Obligatoriska fält",
    "wcag": "3.3.2 Etiketter och instruktioner",
    "statement": "Det framgår tydligt vilka fält som är obligatoriska, antingen genom att det står obligatorisk eller frivilligt i etiketten. Obligatoriska fält har även attributet \"required\".",
    "howToTest": "<a href='https://digi.arbetsformedlingen.se/designmonster/obligatoriska-falt.html' target='_blank'>Designmönster Obligatoriska fält</a>",
    "category": "Formulär",
    "level": "A",
    "why": "Hjälper användaren att veta vilka fält som behöver fyllas i för att komma vidare.",
    "principle": "3. Möjligt att förstå",
    "guideline": "3.3 Hjälp användare undvika och fixa till misstag",
    "criteria": "3.3.2 Etiketter och instruktioner",
    "role": "UX"
  },
  {
    "id": 75,
    "topic": "Information om obligatoriska fält",
    "wcag": "3.3.2 Etiketter och instruktioner",
    "statement": "Det finns en text inledningsvis i formuläret som informerar om vilket sätt som används för att markera obligatoriska eller frivilliga fält. Tex: \n\"Alla obligatoriska fält är uppmärkta med (obligatoriskt).",
    "howToTest": "<a href='https://digi.arbetsformedlingen.se/designmonster/obligatoriska-falt.html' target='_blank'>Designmönster Obligatoriska fält</a>",
    "category": "Formulär",
    "level": "A",
    "why": "Hjälper användaren att veta vilka fält som behöver fyllas i för att komma vidare.",
    "principle": "3. Möjligt att förstå",
    "guideline": "3.3 Hjälp användare undvika och fixa till misstag",
    "criteria": "3.3.2 Etiketter och instruktioner",
    "role": "UX"
  },
  {
    "id": 76,
    "topic": "Olika format",
    "wcag": "3.3.2 Etiketter och instruktioner",
    "statement": "Användaren kan mata in data i olika format (t.ex. datum kan skrivas som ååmmdd eller åå-mm-dd, telefonnummer som +4670... eller 070).",
    "howToTest": "Går det att skriva information i ett format som är intuitivt och naturligt? Testa med användare.",
    "category": "Formulär",
    "level": "A",
    "why": "Användaren ska kunna fylla i informationen på det sätt som är intuitivt och enkelt. Användaren ska inte behöva anpassa sig till verksamhetens system.",
    "principle": "3. Möjligt att förstå",
    "guideline": "3.3 Hjälp användare undvika och fixa till misstag",
    "criteria": "3.3.2 Etiketter och instruktioner",
    "role": "UX / Utvecklare"
  },
  {
    "id": 77,
    "topic": "Information om format",
    "wcag": "3.3.2 Etiketter och instruktioner",
    "statement": "Om ett särskilt format krävs för inmatade uppgifter framgår det tydligt för användaren.",
    "howToTest": "Testa med användare och se om de förstår hur informationen ska matas in.",
    "category": "Formulär",
    "level": "A",
    "why": "Hjälper användaren att förstå hur den ska fylla i och undvika att det blir fel.",
    "principle": "3. Möjligt att förstå",
    "guideline": "3.3 Hjälp användare undvika och fixa till misstag",
    "criteria": "3.3.2 Etiketter och instruktioner",
    "role": "UX"
  },
  {
    "id": 78,
    "topic": "Beskrivande etiketter",
    "wcag": "2.4.6 Rubriker och etiketter",
    "statement": "Alla etiketter (labels) är tydligt formulerade och beskriver vilken information som efterfrågas.",
    "howToTest": "Läs igenom alla etiketter. Testa med användare vid behov.",
    "category": "Formulär",
    "level": "AA",
    "why": "Tydliga etiketter hjälper alla användare att fylla i formulären rätt. Extra viktigt för personer med inlärningssvårigheter eller andra kognitiva eller språkliga nedsättningar.",
    "principle": "2. Möjligt att kontrollera",
    "guideline": "2.4 Hjälp användaren navigera, hitta innehåll och avgöra var de är",
    "criteria": "2.4.6 Rubriker och etiketter",
    "role": "UX / Copy"
  },
  {
    "id": 79,
    "topic": "Markering och felmeddelande, direktvalidering",
    "wcag": "3.3.1 Identifiering av fel",
    "statement": "Om ett inmatningsfel upptäcks automatiskt så markeras fältet och felet beskrivs för användaren med text. Fältet får attributet aria-invalid.",
    "howToTest": "<a href='https://digi.arbetsformedlingen.se/tillganglighet/testmetoder/testa-felhantering.html' target='_blank'>Testa felhantering</a>",
    "category": "Felhantering",
    "level": "A",
    "why": "Användaren får information om vad som blivit fel och kan åtgärda felet. Det blir även tydligt för alla användare vilket fält felet gäller.",
    "principle": "3. Möjligt att förstå",
    "guideline": "3.3 Hjälp användare undvika och fixa till misstag",
    "criteria": "3.3.1 Identifiering av fel",
    "role": "UX / Utvecklare"
  },
  {
    "id": 80,
    "topic": "Felmeddelande utan fokus, direktvalidering",
    "wcag": "4.1.3 Statusmeddelande",
    "statement": "Felmeddelandet kommuniceras till användare med skärmläsare utan att felmeddelandet får fokus.",
    "howToTest": "<a href='https://digi.arbetsformedlingen.se/tillganglighet/testmetoder/testa-felhantering.html' target='_blank'>Testa felhantering</a>",
    "category": "Felhantering",
    "level": "A",
    "why": "Seende användare kan observera ny information perifert, utan att det \"tar över\". Det är viktigt att ge samma möjlighet för användare med skärmläsare.",
    "principle": "4. Robust",
    "guideline": "4.1 Kompatibel med webläsare & hjälpmedel",
    "criteria": "4.1.3 Statusmeddelande",
    "role": "Utvecklare"
  },
  {
    "id": 81,
    "topic": "Felmeddelande med samtliga fel, vid inskick",
    "wcag": "3.3.1 Identifiering av fel",
    "statement": "Om en användare försöker skicka in ett formulär som innehåller fel visas ett meddelande med information om samtliga fel.",
    "howToTest": "<a href='https://digi.arbetsformedlingen.se/tillganglighet/testmetoder/testa-felhantering.html' target='_blank'>Testa felhantering</a>",
    "category": "Felhantering",
    "level": "A",
    "why": "Användaren får en överblick över samtliga fel och kan åtgärda dessa.",
    "principle": "4. Robust",
    "guideline": "4.1 Kompatibel med webläsare & hjälpmedel",
    "criteria": "3.3.1 Identifiering av fel",
    "role": "UX"
  },
  {
    "id": 82,
    "topic": "Felmeddelande med fokus, vid inskick",
    "wcag": "3.3.1 Identifiering av fel",
    "statement": "Meddelande som visas om en användare skickar in ett formulär som innehåller fel, kommuniceras till användare med skärmläsare och får fokus.",
    "howToTest": "<a href='https://digi.arbetsformedlingen.se/tillganglighet/testmetoder/testa-felhantering.html' target='_blank'>Testa felhantering</a>",
    "category": "Felhantering",
    "level": "A",
    "why": "I det här fallet är felmeddelandet så centralt så det behöver få fokus. Det kan annars vara svårt för en användare med skärmläsare att hitta till meddelandet.",
    "principle": "4. Robust",
    "guideline": "4.1 Kompatibel med webläsare & hjälpmedel",
    "criteria": "3.3.1 Identifiering av fel",
    "role": "Utvecklare"
  },
  {
    "id": 83,
    "topic": "Förslag vid fel",
    "wcag": "3.3.3 Förslag vid felhantering",
    "statement": "Om det finns kända korrigeringsförslag så ges förslagen till användaren, utom om det skulle påverka säkerheten.",
    "howToTest": "<a href='https://digi.arbetsformedlingen.se/tillganglighet/testmetoder/testa-felhantering.html' target='_blank'>Testa felhantering</a>",
    "category": "Felhantering",
    "level": "AA",
    "why": "Hjälper alla användare att förstå hur de ska rätta fel. Extra viktigt för användare med inlärningssvårigheter som kan behöva extra guidning.",
    "principle": "3. Möjligt att förstå",
    "guideline": "3.3 Hjälp användare undvika och fixa till misstag",
    "criteria": "3.3.3 Förslag vid felhantering",
    "role": "UX"
  },
  {
    "id": 84,
    "topic": "Meddelande om positivt resultat",
    "wcag": "4.1.3 Statusmeddelande",
    "statement": "Positivt (förväntat) resultat av en handling kommuniceras till användaren utan att meddelandet får fokus. Till exempel att ett jobb blivit sparat eller att ett formulär har skickats in. Gäller när kontexten inte ändras (t.ex. kommer till en tack-sida.)",
    "howToTest": "<a href='https://digi.arbetsformedlingen.se/tillganglighet/testmetoder/testa-dynamiskt-innehall.html' target='_blank'>Testa dynamiskt innehåll</a>",
    "category": "Dynamiskt innehåll",
    "level": "A",
    "why": "Detta gör att användarna kan bli medvetna om viktiga förändringar i innehåll på ett sätt som inte stör deras arbete i onödan.",
    "principle": "4. Robust",
    "guideline": "4.1 Kompatibel med webläsare & hjälpmedel",
    "criteria": "4.1.3 Statusmeddelande",
    "role": "Utvecklare"
  },
  {
    "id": 85,
    "topic": "Innehåll som förändras dynamiskt",
    "wcag": "4.1.3 Statusmeddelande",
    "statement": "Innehåll som förändras dynamiskt kommuniceras till användare utan att innehållet får fokus. Till exempel antal träffar i ett sökresultat, antalet sparade jobb efter att ett jobb blivit sparat osv.",
    "howToTest": "<a href='https://digi.arbetsformedlingen.se/tillganglighet/testmetoder/testa-dynamiskt-innehall.html' target='_blank'>Testa dynamiskt innehåll</a>",
    "category": "Dynamiskt innehåll",
    "level": "A",
    "why": "Detta gör att användarna kan bli medvetna om viktiga förändringar i innehåll på ett sätt som inte stör deras arbete i onödan.",
    "principle": "4. Robust",
    "guideline": "4.1 Kompatibel med webläsare & hjälpmedel",
    "criteria": "4.1.3 Statusmeddelande",
    "role": "Utvecklare"
  },
  {
    "id": 86,
    "topic": "Meddelande om upptaget system",
    "wcag": "4.1.3 Statusmeddelande",
    "statement": "Meddelande om att systemet är upptaget kommuniceras till användaren med skärmläsare utan att meddelandet får fokus. T.ex. information om att sökresultat laddas eller att något hämtas från en databas.",
    "howToTest": "<a href='https://digi.arbetsformedlingen.se/tillganglighet/testmetoder/testa-dynamiskt-innehall.html' target='_blank'>Testa dynamiskt innehåll</a>",
    "category": "Dynamiskt innehåll",
    "level": "A",
    "why": "Detta gör att användarna kan bli medvetna om viktiga förändringar i innehåll på ett sätt som inte stör deras arbete i onödan.",
    "principle": "4. Robust",
    "guideline": "4.1 Kompatibel med webläsare & hjälpmedel",
    "criteria": "4.1.3 Statusmeddelande",
    "role": "Utvecklare"
  },
  {
    "id": 87,
    "topic": "Roll för komponenter",
    "wcag": "4.1.2 Namn, roll, värde",
    "statement": "Alla egengjorda komponenter har en roll som hjälpmedel kan komma åt (vanliga html-komponenter uppfyller detta automatiskt om de används rätt).",
    "howToTest": "<a href='https://digi.arbetsformedlingen.se/tillganglighet/testmetoder/testa-med-skarmlasare.html' target='_blank'>Testa med skärmläsare</a>",
    "category": "Komponenter",
    "level": "A",
    "why": "Att en komponent har en roll gör att den blir kompatibel med olika hjälpmedel, till exempel skärmläsare. Hjälpmedel kan inte själva förstå vad en egengjord komponent är för något om den saknar roll.",
    "principle": "4. Robust",
    "guideline": "4.1 Kompatibel med webläsare & hjälpmedel",
    "criteria": "4.1.2 Namn, roll, värde",
    "role": "Utvecklare"
  },
  {
    "id": 88,
    "topic": "Värde för komponent",
    "wcag": "4.1.2 Namn, roll, värde",
    "statement": "Om en användare kan ändra en komponents tillstånd, egenskap eller värde så kan det även göras av en användare som använder hjälpmedel, t.ex. en skärmläsare.",
    "howToTest": "<a href='https://digi.arbetsformedlingen.se/tillganglighet/testmetoder/testa-med-skarmlasare.html' target='_blank'>Testa med skärmläsare</a>",
    "category": "Komponenter",
    "level": "A",
    "why": "Komponenters tillstånd, värde och egenskaper behöver vara kompatibla med hjälpmedel, så att alla användare får en lika bra upplevelse.",
    "principle": "4. Robust",
    "guideline": "4.1 Kompatibel med webläsare & hjälpmedel",
    "criteria": "4.1.2 Namn, roll, värde",
    "role": "Utvecklare"
  },
  {
    "id": 89,
    "topic": "Dölj innehåll som inte ska visas för skärmläsare",
    "wcag": "1.1.1 Innehåll som inte är text",
    "statement": "Allt som döljs för seende användare ska även döljas för skärmläsare. Till exempel innehåll som dolts i en expanderbar yta ska enbart vara synligt när användaren valt att visa innehållet. Använd attributet aria-hidden=\"true\" .",
    "howToTest": "<a href='https://digi.arbetsformedlingen.se/tillganglighet/testmetoder/testa-med-skarmlasare.html' target='_blank'>Testa med skärmläsare</a>",
    "category": "Komponenter",
    "level": "A",
    "why": "Användare med skärmläsare ska inte behöva ta del av innehåll som dolts. Det ska vara lika information till alla användare.",
    "principle": "1. Möjligt att uppfatta",
    "guideline": "1.1 Textalternativ för allt som inte är text",
    "criteria": "1.1.1 Innehåll som inte är text",
    "role": "Utvecklare"
  },
  {
    "id": 90,
    "topic": "Rätt HTML-markup",
    "wcag": "4.1.1 Se till att koden validerar",
    "statement": "Alla HTML-element har fullständiga start & slut-taggar och är nästlade enligt deras specifikationer.",
    "howToTest": "<a href='https://digi.arbetsformedlingen.se/tillganglighet/testmetoder/automatiska-tester.html' target='_blank'>Automatiska tester</a>",
    "category": "Kodkvalite",
    "level": "A",
    "why": "God kodkvalite och att följa standarder ökar chansen att alla användare kan använda tjänsten, oavsett vilka hjälpmedel de använder.",
    "principle": "4. Robust",
    "guideline": "4.1 Kompatibel med webläsare & hjälpmedel",
    "criteria": "4.1.1 Se till att koden validerar",
    "role": "Utvecklare"
  },
  {
    "id": 91,
    "topic": "Inga dubbla attribut",
    "wcag": "4.1.1 Se till att koden validerar",
    "statement": "Inga HTML-element innehåller dubbla attributangivelser.",
    "howToTest": "<a href='https://digi.arbetsformedlingen.se/tillganglighet/testmetoder/automatiska-tester.html' target='_blank'>Automatiska tester</a>",
    "category": "Kodkvalite",
    "level": "A",
    "why": "God kodkvalite och att följa standarder ökar chansen att alla användare kan använda tjänsten, oavsett vilka hjälpmedel de använder.",
    "principle": "4. Robust",
    "guideline": "4.1 Kompatibel med webläsare & hjälpmedel",
    "criteria": "4.1.1 Se till att koden validerar",
    "role": "Utvecklare"
  },
  {
    "id": 92,
    "topic": "Unika ID:n",
    "wcag": "4.1.1 Se till att koden validerar",
    "statement": "Alla HTML-element har unika id, dvs ett id förekommer endast en gång på sidan.",
    "howToTest": "<a href='https://digi.arbetsformedlingen.se/tillganglighet/testmetoder/automatiska-tester.html' target='_blank'>Automatiska tester</a>",
    "category": "Kodkvalite",
    "level": "A",
    "why": "God kodkvalite och att följa standarder ökar chansen att alla användare kan använda tjänsten, oavsett vilka hjälpmedel de använder.",
    "principle": "4. Robust",
    "guideline": "4.1 Kompatibel med webläsare & hjälpmedel",
    "criteria": "4.1.1 Se till att koden validerar",
    "role": "Utvecklare"
  },
  {
    "id": 93,
    "topic": "Konsekvent navigering i tjänsten",
    "wcag": "3.2.3 Konsekvent navigering",
    "statement": "Navigeringsfunktioner som upprepas på flera sidor i tjänsten presenteras på samma sätt och i samma inbördes ordning (t.ex. länkar mellan sidor, paginering i ett sökresultat osv). Gäller navigering inom tjänsten.",
    "howToTest": "<a href='https://digi.arbetsformedlingen.se/tillganglighet/testmetoder/testa-konsekvent-navigering.html' target='_blank'>Testa konsekvent navigering</a>",
    "category": "Konsekvent",
    "level": "AA",
    "why": "Att komponenter som upprepas finns på samma ställe på varje sida hjälper användarna att känna sig trygga i att hitta det som de behöver.",
    "principle": "3. Möjligt att förstå",
    "guideline": "3.2 Gör innehåll förutsägbart",
    "criteria": "3.2.3 Konsekvent navigering",
    "role": "UX"
  },
  {
    "id": 94,
    "topic": "Konsekvent navigering på AF",
    "wcag": "3.2.3 Konsekvent navigering",
    "statement": "Tjänsten följer Arbetsförmedlingens digitala riktlinjer kring navigering.\nVälj Stämmer till viss del om ni brukar använda er av Digin.\nVälj Stämmer inte om ni inte använder er av Digin.",
    "howToTest": "Navigering ska vara konsekvent mellan olika tjänster. För att uppnå det krävs generella designmönster.",
    "category": "Konsekvent",
    "level": "AA",
    "why": "Att komponenter som upprepas finns på samma ställe på varje sida hjälper användarna att känna sig trygga i att hitta det som de behöver.",
    "principle": "3. Möjligt att förstå",
    "guideline": "3.2 Gör innehåll förutsägbart",
    "criteria": "3.2.3 Konsekvent navigering",
    "role": "UX"
  },
  {
    "id": 95,
    "topic": "Konsekvent identifiering i tjänsten",
    "wcag": "3.2.4 Konsekvent identifiering",
    "statement": "Funktioner som finns på flera sidor i tjänsten identifieras på ett konsekvent sätt. Samma termer används t.ex för knappar som gör samma sak (både synlig text och textalternativ). Gäller funktioner i tjänsten.",
    "howToTest": "<a href='https://digi.arbetsformedlingen.se/tillganglighet/testmetoder/testa-konsekvent-identifiering.html' target='_blank'>Testa konsekvent identifiering</a>",
    "category": "Konsekvent",
    "level": "AA",
    "why": "Användare som lär sig en funktion kan lättare hitta och använda funktionen på andra sidor där funktionen finns. Användare som är beroende av textalternativ får en mer förutsägbar upplevelse.",
    "principle": "3. Möjligt att förstå",
    "guideline": "3.2 Gör innehåll förutsägbart",
    "criteria": "3.2.4 Konsekvent identifiering",
    "role": "UX / Copy"
  },
  {
    "id": 96,
    "topic": "Konsekvent identifiering på AF",
    "wcag": "3.2.4 Konsekvent identifiering",
    "statement": "Funktioner i tjänsten identifieras på samma sätt som på andra ställen där de förekommer på webbplatsen. Samma termer används t.ex för knappar som gör samma sak.\nVälj Stämmer till viss del om ni brukar använda er av Digin.\nVälj Stämmer inte om ni inte använder er av Digin.",
    "howToTest": "Funktioner ska vara konsekvent mellan olika tjänster. För att uppnå det krävs generella designmönster.",
    "category": "Konsekvent",
    "level": "AA",
    "why": "Användare som lär sig en funktion kan lättare hitta och använda funktionen på andra sidor där funktionen finns. Användare som är beroende av textalternativ får en mer förutsägbar upplevelse.",
    "principle": "3. Möjligt att förstå",
    "guideline": "3.2 Gör innehåll förutsägbart",
    "criteria": "3.2.4 Konsekvent identifiering",
    "role": "UX / Copy"
  }
]