<?xml version="1.0" encoding="UTF-8"?>
<svg width="891px" height="168px" viewBox="0 0 891 168" version="1.1" xmlns="http://www.w3.org/2000/svg" xmlns:xlink="http://www.w3.org/1999/xlink">
    <title>Group 16Ikoner</title>
    <defs>
        <polygon id="path-1" points="0 0 168 0 168 168 0 168"></polygon>
        <path d="M14.0918777,13.894147 L14.4121277,19.362897 C14.4302597,19.6726138 14.6856139,19.9144107 14.9944403,19.9144107 L17.0054824,19.9144107 C17.3143322,19.9144107 17.56965,19.6725897 17.587795,19.362897 L17.908045,13.894147 C17.9277325,13.5575747 17.6613436,13.2737857 17.3257324,13.2737857 L14.6741417,13.2737857 C14.3385791,13.2737857 14.0721902,13.5575747 14.0918777,13.894147 L14.0918777,13.894147 Z M18.041677,22.6487857 C18.041677,23.7814029 17.1275935,24.6995669 16.00001,24.6995669 C14.8724264,24.6995669 13.9583429,23.7814029 13.9583429,22.6487857 C13.9583429,21.5161685 14.8724264,20.5980044 16.00001,20.5980044 C17.1275935,20.5980044 18.041677,21.5161685 18.041677,22.6487857 Z M18.0211145,5.06992824 C17.1250657,3.50982082 14.876607,3.50698879 13.9789054,5.06992824 L2.31486171,25.3837954 C1.41934766,26.9430239 2.54046592,28.8987854 4.33596623,28.8987854 L27.663762,28.8987854 C29.4558109,28.8987854 30.5821306,26.9460025 29.6848665,25.3837954 L18.0211145,5.06992824 Z M4.58568155,26.1156802 L15.747378,6.68237942 C15.859621,6.48696926 16.1403989,6.48696926 16.2526419,6.68237942 L27.4143384,26.1156314 C27.5265328,26.3109439 27.3861925,26.5549868 27.1617064,26.5549868 L4.83831354,26.5549868 C4.613876,26.5549868 4.4735357,26.3109927 4.58568155,26.1156802 L4.58568155,26.1156802 Z" id="path-3"></path>
        <path d="M19.53125,9.765625 C19.53125,15.1590458 15.1590458,19.53125 9.765625,19.53125 C4.3722042,19.53125 0,15.1590458 0,9.765625 C0,4.3722042 4.3722042,0 9.765625,0 C15.1590458,0 19.53125,4.3722042 19.53125,9.765625 Z M8.63604146,14.9364447 L15.8815052,7.69098097 C16.1275359,7.44495023 16.1275359,7.04601657 15.8815052,6.79998582 L14.99051,5.90899068 C14.7444793,5.66292055 14.3455456,5.66292055 14.0994755,5.90899068 L8.19052419,11.8179026 L5.43177451,9.05915291 C5.18574376,8.81312216 4.78681011,8.81312216 4.54073998,9.05915291 L3.64974483,9.95014806 C3.40371409,10.1961788 3.40371409,10.5951125 3.64974483,10.8411432 L7.74500693,14.9364053 C7.99107705,15.1824754 8.38997133,15.1824754 8.63604146,14.9364447 L8.63604146,14.9364447 Z" id="path-5"></path>
    </defs>
    <g id="Page-1" stroke="none" stroke-width="1" fill="none" fill-rule="evenodd">
        <g id="Färgpaletten---Översikt" transform="translate(-677.000000, -2395.000000)">
            <g id="Group-16" transform="translate(677.000000, 2395.000000)">
                <g id="Group-20" transform="translate(723.000000, 0.000000)">
                    <g id="Group-3">
                        <mask id="mask-2" fill="white">
                            <use xlink:href="#path-1"></use>
                        </mask>
                        <g id="Clip-2"></g>
                        <path d="M83.9999899,0 C130.391963,0 168,37.6080417 168,84.0000201 C168,130.391999 130.391963,168.00004 83.9999899,168.00004 C37.6080171,168.00004 -2.01392509e-05,130.391999 -2.01392509e-05,84.0000201 C-2.01392509e-05,37.6080417 37.6080171,0 83.9999899,0" id="Fill-1" fill="#00005A" mask="url(#mask-2)"></path>
                    </g>
                    <path d="M84.1595701,83.9237074 L30,83.9237074 C30,83.9491717 30,83.974636 30,84.0001003 C30,113.823577 54.1766315,138 83.9998997,138 C113.823368,138 138,113.823577 138,84.0001003 C138,54.1768241 113.823368,30 83.9998997,30 C69.1441302,30 55.6906924,36.0001448 45.9275272,45.7076473 L84.1595701,83.9237074 Z" id="Fill-4" fill="#54EF00"></path>
                    <path d="M30,84 L84,84 L45.8798941,46 C36.0887128,55.7088427 30.0206004,69.1471474 30,84" id="Fill-6" fill="#DA0000"></path>
                    <path d="M46,45.752681 L84,84 L84,30 C70.2560603,29.963529 56.499581,35.2139585 46,45.752681" id="Fill-8" fill="#FFE200"></path>
                    <path d="M84,30 L84,84 L122,45.8798941 C112.291157,36.0887128 98.8528526,30.0206004 84,30" id="Fill-10" fill="#009322"></path>
                    <path d="M122.247319,46 L84,84 L138,84 C138.036471,70.2560603 132.786042,56.499581 122.247319,46" id="Fill-12" fill="#0000FF"></path>
                    <path d="M83.4255273,84.099217 L83.4253252,84.099217 L83.4253252,84.099217 L45,122.049427 C54.8211978,131.800443 68.4069051,137.850685 83.4253252,137.898197 L83.4253252,138 C97.3825514,138.036343 111.352714,132.804392 122.015388,122.30276 L83.525987,84.2894661 L83.525987,84.1986337 L121.95111,122.148644 C131.84649,112.427173 137.97918,98.9713888 138,84.099217 L83.525987,84.099217 L83.525987,84 L83.4255273,84.099217 Z" id="Fill-14" fill="#FFFFFF"></path>
                    <path d="M45.7526226,122 L84,84 L30,84 C29.9635291,97.7439397 35.2139391,111.500419 45.7526226,122" id="Fill-16" fill="#FFFFFF"></path>
                    <path d="M82.9998989,33.0767461 C69.3979648,33.0767461 56.609858,38.3735894 46.9917345,47.9918983 C37.373611,57.6098029 32.0767584,70.3978874 32.0767584,83.9997978 C32.0767584,97.6019104 37.373611,110.389995 46.9917345,120.008102 C56.609858,129.626411 69.3979648,134.923254 82.9998989,134.923254 C96.6020352,134.923254 109.390142,129.626411 119.008266,120.008102 C128.626389,110.389995 133.923242,97.6021126 133.923242,83.9997978 C133.923242,70.3978874 128.626389,57.6098029 119.008266,47.9918983 C109.390142,38.3735894 96.6020352,33.0767461 82.9998989,33.0767461 M82.9998989,142 C67.5076615,142 52.9424795,135.966973 41.9876575,125.01217 C31.0328355,114.057367 25,99.4924125 25,83.9997978 C25,68.5073853 31.0328355,53.9424308 41.9876575,42.9878301 C52.9424795,32.0330271 67.5076615,26 82.9998989,26 C98.4923385,26 113.057318,32.0330271 124.01214,42.9878301 C134.967165,53.9424308 141,68.5073853 141,83.9997978 C141,99.4924125 134.967165,114.057367 124.01214,125.01217 C113.057318,135.966973 98.4923385,142 82.9998989,142" id="Fill-18" fill="#95C23E"></path>
                </g>
                <g id="colors/meddelanderuta-small/blue" transform="translate(328.000000, 50.000000)">
                    <rect id="Rectangle" fill="#FFE200" x="0" y="0" width="47" height="69"></rect>
                    <rect id="Rectangle-2" stroke="#FDDC41" stroke-width="2" fill="#FFFFFF" x="46" y="1" width="320" height="67"></rect>
                </g>
                <text id="Text" font-family="OpenSans, Open Sans" font-size="15" font-weight="normal" fill="#333333">
                    <tspan x="389" y="78">Ett varningsmeddelande, som skall göra </tspan>
                    <tspan x="389" y="98">dig uppmärksam på att något är fel. </tspan>
                </text>
                <g id="i-af-exclamation-triangle" transform="translate(336.000000, 68.896552)">
                    <mask id="mask-4" fill="white">
                        <use xlink:href="#path-3"></use>
                    </mask>
                    <use id="Shape" fill="#1616B2" fill-rule="nonzero" xlink:href="#path-3"></use>
                    <g id="Group" mask="url(#mask-4)" fill="#333333">
                        <g id="colors/6/blue">
                            <rect id="colors/gray-90" x="0" y="0" width="32" height="32"></rect>
                        </g>
                    </g>
                </g>
                <g id="Group-4" transform="translate(0.000000, 33.000000)">
                    <g id="Group" transform="translate(1.125000, 82.000000)">
                        <text id="Det-blev-rätt!" font-family="OpenSans, Open Sans" font-size="15" font-weight="normal" fill="#333333">
                            <tspan x="29.875" y="16">Det blev rätt! </tspan>
                        </text>
                        <g id="check/circle" transform="translate(0.000000, 1.125000)">
                            <mask id="mask-6" fill="white">
                                <use xlink:href="#path-5"></use>
                            </mask>
                            <use id="Shape" fill="#1616B2" fill-rule="nonzero" xlink:href="#path-5"></use>
                            <g id="colors/6/blue" mask="url(#mask-6)" fill="#009322">
                                <g transform="translate(-3.125000, -3.125000)" id="colors/green">
                                    <rect x="0" y="0" width="25" height="25"></rect>
                                </g>
                            </g>
                        </g>
                    </g>
                    <path d="M300,31 L300,69 L2,69 L2,31 L300,31 Z" id="Rectangle-25-Copy-15" stroke="#009322" stroke-width="2" fill="#DDF1E1"></path>
                    <text id="Inmatningsfällt" font-family="OpenSans-Semibold, Open Sans" font-size="16" font-weight="500" fill="#333333">
                        <tspan x="0" y="17">Inmatningsfällt</tspan>
                    </text>
                </g>
            </g>
        </g>
    </g>
</svg>