<?xml version="1.0" encoding="UTF-8"?>
<svg width="895px" height="241px" viewBox="0 0 895 241" version="1.1" xmlns="http://www.w3.org/2000/svg" xmlns:xlink="http://www.w3.org/1999/xlink">
    <title>Group 15Ikoner</title>
    <defs>
        <polygon id="path-1" points="0 0 168 0 168 168 0 168"></polygon>
        <polygon id="path-3" points="0 0.0763522499 34.043351 0.0763522499 34.043351 57.5589168 0 57.5589168"></polygon>
        <polygon id="path-5" points="0.122857174 0.23334696 2.84523837 0.23334696 2.84523837 18.4460253 0.122857174 18.4460253"></polygon>
        <polygon id="path-7" points="0.0516743534 0.0176366366 10.5962102 0.0176366366 10.5962102 16.165349 0.0516743534 16.165349"></polygon>
    </defs>
    <g id="Page-1" stroke="none" stroke-width="1" fill="none" fill-rule="evenodd">
        <g id="Färgpaletten---Översikt" transform="translate(-673.000000, -1948.000000)">
            <g id="Group-15" transform="translate(673.000000, 1948.000000)">
                <g id="Group-38" transform="translate(727.000000, 17.000000)">
                    <g id="Group-3">
                        <mask id="mask-2" fill="white">
                            <use xlink:href="#path-1"></use>
                        </mask>
                        <g id="Clip-2"></g>
                        <path d="M29.6046953,84.0000201 C29.6046953,53.9582959 53.958283,29.6047024 84,29.6047024 C114.041717,29.6047024 138.395305,53.9582959 138.395305,84.0000201 C138.395305,114.041744 114.041717,138.395338 84,138.395338 C53.958283,138.395338 29.6046953,114.041744 29.6046953,84.0000201 M0,84.0000201 C0,130.391999 37.6080327,168.00004 84,168.00004 C130.391967,168.00004 168,130.391999 168,84.0000201 C168,37.6080417 130.391967,0 84,0 C37.6080327,0 0,37.6080417 0,84.0000201" id="Fill-1" fill="#00005A" mask="url(#mask-2)"></path>
                    </g>
                    <path d="M84.01475,138 C84.00495,138 83.99515,138 83.98525,138 L84.00005,84 L84.01475,138 Z" id="Fill-4" fill="#0BFF5F"></path>
                    <path d="M138,83.98525 C138,83.98765 138,83.99005 138,83.99245 C138,83.99985 138,84.00725 138,84.01475 L84,83.99995 L138,83.98525 Z" id="Fill-6" fill="#0BFF5F"></path>
                    <path d="M83.98525,30 C83.99015,30 83.99505,30 83.99995,30 C84.00495,30 84.00985,30 84.01475,30 L83.99995,84 L83.98525,30 Z" id="Fill-8" fill="#0BFF5F"></path>
                    <path d="M30,84.01475 C30,84.00985 30,84.00495 30,83.99995 C30,83.99505 30,83.99015 30,83.98525 L84,83.99995 L30,84.01475 Z" id="Fill-10" fill="#0BFF5F"></path>
                    <path d="M84.0295196,30 C93.8537258,30.0052224 103.064446,32.6340974 111,37.2235811 L84,84 L84.0295196,30 Z" id="Fill-12" fill="#F1F8FE"></path>
                    <path d="M57,37.2235543 C64.9353529,32.6340876 74.1460733,30.0052224 83.9704804,30 L84,84 L57,37.2235543 Z" id="Fill-14" fill="#FFFFFF"></path>
                    <path d="M30,83.9702871 C30.0052209,74.1455531 32.63493,64.9349528 37.2254751,57 L84,84 L30,83.9702871 Z" id="Fill-16" fill="#F1F1F1"></path>
                    <path d="M84,84 L37.2254751,111 C32.63493,103.065047 30.0054217,93.8542461 30,84.0297129 L84,84 Z" id="Fill-18" fill="#E9E9E9"></path>
                    <path d="M83.9704821,138 C83.9694781,138 83.9684741,138 83.9676709,138 C74.1454548,138 64.9360856,135.37662 57,130.792285 L84,84 L83.9704821,138 Z" id="Fill-20" fill="#CACACA"></path>
                    <path d="M111,130.764303 C103.064958,135.356308 93.8544575,137.988949 84.0297366,138 L84,84 L111,130.764303 Z" id="Fill-22" fill="#ACACAC"></path>
                    <path d="M138,84.0295319 C137.991963,93.8540146 135.361874,103.064555 130.771777,111 L84,84 L138,84.0295319 Z" id="Fill-24" fill="#333333"></path>
                    <path d="M130.785038,57 C135.371519,64.9363563 137.997589,74.1468357 138,83.9704767 L84,84 L130.785038,57 Z" id="Fill-26" fill="#000000"></path>
                    <path d="M37,56.7936143 C41.6200164,48.8244868 48.3352834,41.9238941 56.901143,37 L84,84 L37,56.7936143 Z" id="Fill-28" fill="#F8F8F8"></path>
                    <path d="M84,84 L56.794579,131 C48.8249191,126.381135 41.9236885,119.666128 37,111.09998 L84,84 Z" id="Fill-30" fill="#DDDDDD"></path>
                    <path d="M131,111.19928 C126.382109,119.169489 119.669239,126.072268 111.105977,131 L84,84 L131,111.19928 Z" id="Fill-32" fill="#757575"></path>
                    <path d="M111.211365,37 C119.179122,41.622815 126.078014,48.3395254 131,56.9060488 L84,84 L111.211365,37 Z" id="Fill-34" fill="#F1F7E5"></path>
                    <path d="M83.9998989,33.0767461 C70.3979648,33.0767461 57.6096558,38.3735894 47.9917345,47.9918983 C38.373611,57.6100051 33.0767584,70.3978874 33.0767584,83.9997978 C33.0767584,97.6021126 38.373611,110.389995 47.9917345,120.008102 C57.6096558,129.626411 70.3979648,134.923254 83.9998989,134.923254 C97.6020352,134.923254 110.390142,129.626411 120.008266,120.008102 C129.626389,110.389995 134.923242,97.6021126 134.923242,83.9997978 C134.923242,70.3978874 129.626389,57.6100051 120.008266,47.9918983 C110.390142,38.3735894 97.601833,33.0767461 83.9998989,33.0767461 M83.9998989,142 C68.5074594,142 53.9424795,135.966973 42.9876575,125.011968 C32.0328355,114.057367 26,99.4924125 26,83.9997978 C26,68.5075875 32.0328355,53.9424308 42.9876575,42.9878301 C53.9424795,32.0330271 68.5074594,26 83.9998989,26 C99.4923385,26 114.057318,32.0330271 125.01214,42.9878301 C135.967165,53.9424308 142,68.5075875 142,83.9997978 C142,99.4924125 135.967165,114.057367 125.01214,125.01217 C114.057318,135.966973 99.4923385,142 83.9998989,142" id="Fill-36" fill="#95C23E"></path>
                </g>
                <rect id="Rectangle-3-Copy" fill="#F1F7E5" x="0" y="46" width="371" height="195"></rect>
                <g id="Group-7" transform="translate(40.000000, 86.000000)" fill="#333333">
                    <text id="Regular-16px-#333333" font-family="OpenSans, Open Sans" font-size="16" font-weight="normal" line-spacing="24">
                        <tspan x="0" y="63">Visste du att denna faktaruta har en </tspan>
                        <tspan x="0" y="87">ljusgrön bakgrund. Det är för att det är </tspan>
                        <tspan x="0" y="111">ett alternativ till den grå bakgrunden.</tspan>
                    </text>
                    <text id="Tips-och-fakta-(prim" font-family="OpenSans-Semibold, Open Sans" font-size="22" font-weight="500">
                        <tspan x="0" y="24">Tips och fakta</tspan>
                    </text>
                </g>
                <g id="Group-57" transform="translate(398.000000, 48.000000)">
                    <g id="Group-43">
                        <rect id="Rectangle-3" fill="#F5F5F5" x="0" y="0" width="306" height="161"></rect>
                        <polygon id="Rectangle-9" fill="#00005A" points="0 0 306 0 306 10 0 10"></polygon>
                    </g>
                    <g id="Group-26" transform="translate(16.000000, 28.000000)" fill="#333333">
                        <text id="Brödtexten-är-mörkgr" font-family="OpenSans, Open Sans" font-size="16" font-weight="normal" line-spacing="24">
                            <tspan x="0" y="55">Brödtexten är mörkgrå och </tspan>
                            <tspan x="0" y="79">bakgrunden i informationsrutan är </tspan>
                            <tspan x="0" y="103">ljusgrå.</tspan>
                        </text>
                        <text id="Information" font-family="OpenSans-Semibold, Open Sans" font-size="18" font-weight="500">
                            <tspan x="0" y="19">Information</tspan>
                        </text>
                    </g>
                </g>
                <g id="Group-12" transform="translate(324.440303, 46.096905) rotate(24.000000) translate(-324.440303, -46.096905) translate(305.440303, 4.096905)">
                    <g id="Group-3" transform="translate(0.000000, 25.668166)">
                        <mask id="mask-4" fill="white">
                            <use xlink:href="#path-3"></use>
                        </mask>
                        <g id="Clip-2"></g>
                        <path d="M20.3557369,57.5589861 L13.6882364,57.5589861 C11.9749511,57.5589861 10.5814377,56.1612753 10.5814377,54.4428296 L10.5814377,54.3772957 C10.5814377,52.6591967 11.9749511,51.2611391 13.6882364,51.2611391 L23.4179404,51.2611391 C23.9873069,51.2611391 24.4505439,50.7965069 24.4505439,50.2257721 L24.4505439,50.1602382 C24.4505439,49.5891566 23.9873069,49.1245244 23.4179404,49.1245244 L9.38773834,49.1245244 C7.65647674,49.1245244 6.2480982,47.7122505 6.2480982,45.9757743 C6.2480982,44.239298 7.65647674,42.8270241 9.38773834,42.8270241 L24.4325675,42.8270241 C25.0423809,42.8270241 25.5384593,42.3294515 25.5384593,41.7178014 L25.5384593,41.6349304 C25.5384593,41.023627 25.0423809,40.5260544 24.4325675,40.5260544 L9.28644847,40.5260544 C7.61119015,40.5260544 6.2480982,39.1592035 6.2480982,37.4788992 L6.2480982,30.3679458 C2.27048321,27.1082387 -6.913984e-05,22.3200997 -6.913984e-05,17.1491591 C-6.913984e-05,7.73550233 7.63608049,0.0763522499 17.0218138,0.0763522499 C26.407547,0.0763522499 34.043351,7.73550233 34.043351,17.1491591 C34.043351,22.3696836 31.6227652,27.3467962 27.5421318,30.5714825 L27.5480087,33.2406905 C27.5480087,34.9237687 26.1852625,36.2906197 24.5096584,36.2906197 L11.9780624,36.3089969 L11.9766796,36.3089969 C11.5687546,36.3089969 11.1988564,36.0690525 11.0311923,35.6963065 C10.8635282,35.322867 10.9295568,34.8852806 11.2002392,34.5791087 L19.7106621,24.9442315 L12.2432137,24.9442315 C11.8345973,24.9442315 11.4640077,24.7039404 11.2966893,24.3298074 C11.1297166,23.9560212 11.1967822,23.5184347 11.4685018,23.2122629 L18.9898793,14.7424336 C19.3704941,14.3128222 20.0262855,14.2753742 20.4539154,14.6571354 C20.8815453,15.0392434 20.9195722,15.6970101 20.5386117,16.125928 L14.5555957,22.8637887 L22.015093,22.8637887 C22.4230181,22.8637887 22.7932619,23.1040799 22.960926,23.4775193 C23.1282444,23.8506121 23.0618702,24.2878518 22.7911877,24.5940236 L14.2842218,34.2250867 L24.5082756,34.2101769 C25.0413438,34.2101769 25.4738135,33.7764046 25.4738135,33.2431177 L25.4668995,30.0600403 C25.4662081,29.7289031 25.6224642,29.4175302 25.8879612,29.2205816 C29.6958378,26.4022751 31.9691558,21.889448 31.9691558,17.1491591 C31.9691558,8.88217304 25.2639741,2.15679503 17.0218138,2.15679503 C8.77965344,2.15679503 2.07412606,8.88217304 2.07412606,17.1491591 C2.07412606,21.8415978 4.20363313,26.1758536 7.91713394,29.0406233 C8.17225995,29.2375719 8.321602,29.54201 8.321602,29.8651721 L8.3222934,37.4785525 C8.3222934,38.0118393 8.7547631,38.4456116 9.28644847,38.4456116 L24.4325675,38.4456116 C26.1862996,38.4456116 27.6126545,39.8766095 27.6126545,41.6349304 L27.6126545,41.7178014 C27.6126545,43.476469 26.1862996,44.9074669 24.4325675,44.9074669 L9.38773834,44.9074669 C8.80039539,44.9074669 8.3222934,45.3866622 8.3222934,45.9757743 C8.3222934,46.5648863 8.80039539,47.0440816 9.38773834,47.0440816 L23.4179404,47.0440816 C25.1312256,47.0440816 26.5247391,48.4417924 26.5247391,50.1602382 L26.5247391,50.2257721 C26.5247391,51.9438711 25.1312256,53.3415819 23.4179404,53.3415819 L13.6882364,53.3415819 C13.1188698,53.3415819 12.6556329,53.8065609 12.6556329,54.3772957 L12.6556329,54.4428296 C12.6556329,55.0139112 13.1188698,55.4785434 13.6882364,55.4785434 L20.3557369,55.4785434 C20.9285604,55.4785434 21.3928345,55.9442158 21.3928345,56.5187648 C21.3928345,57.092967 20.9285604,57.5589861 20.3557369,57.5589861" id="Fill-1" fill="#343434" mask="url(#mask-4)"></path>
                    </g>
                    <g id="Group-6" transform="translate(17.889934, 0.000000)">
                        <mask id="mask-6" fill="white">
                            <use xlink:href="#path-5"></use>
                        </mask>
                        <g id="Clip-5"></g>
                        <path d="M1.48404777,18.4460253 C0.732281652,18.4460253 0.122857174,17.9043147 0.122857174,17.2360781 L0.122857174,1.44315588 C0.122857174,0.775265026 0.732281652,0.23320868 1.48404777,0.23320868 C2.2358139,0.23320868 2.84523837,0.775265026 2.84523837,1.44315588 L2.84523837,17.2360781 C2.84523837,17.9043147 2.2358139,18.4460253 1.48404777,18.4460253" id="Fill-4" fill="#95C23E" mask="url(#mask-6)"></path>
                    </g>
                    <path d="M9.65445099,21.7790496 C9.23805167,21.7790496 8.83154139,21.5773896 8.59879572,21.2123037 L0.181807979,8.02488879 C-0.174550725,7.46660182 0.00910291834,6.73778356 0.591496875,6.39638261 C1.17424401,6.05565838 1.93499391,6.23126501 2.29099943,6.78887527 L10.707634,19.9766286 C11.0639927,20.5345772 10.8806922,21.2637338 10.2979451,21.6047964 C10.0966325,21.7225442 9.874129,21.7790496 9.65445099,21.7790496" id="Fill-7" fill="#95C23E"></path>
                    <g id="Group-11" transform="translate(26.445989, 5.444762)">
                        <mask id="mask-8" fill="white">
                            <use xlink:href="#path-7"></use>
                        </mask>
                        <g id="Clip-10"></g>
                        <path d="M1.28039735,16.165349 C1.06963236,16.165349 0.856759709,16.1118281 0.661802088,15.9992258 C0.0751728486,15.6610713 -0.122594973,14.9159498 0.219195596,14.3355613 L8.30449212,0.621015698 C8.64663397,0.0406271952 9.39976755,-0.154689175 9.98604552,0.183465324 C10.5726748,0.521619823 10.7707939,1.26674135 10.428652,1.84712985 L2.34335548,15.5616754 C2.11502674,15.9491803 1.70333244,16.165349 1.28039735,16.165349" id="Fill-9" fill="#95C23E" mask="url(#mask-8)"></path>
                    </g>
                </g>
            </g>
        </g>
    </g>
</svg>