<?xml version="1.0" encoding="UTF-8"?>
<svg width="412px" height="334px" viewBox="0 0 412 334" version="1.1" xmlns="http://www.w3.org/2000/svg" xmlns:xlink="http://www.w3.org/1999/xlink">
    <!-- Generator: Sketch 63.1 (92452) - https://sketch.com -->
    <title>digi_bläckfisk</title>
    <desc>Created with Sketch.</desc>
    <g id="digi_bläckfisk" stroke="none" stroke-width="1" fill="none" fill-rule="evenodd">
        <g id="Group-73" transform="translate(2.000000, 4.000000)">
            <path d="M40.0813,65.8539 C47.2653,73.0379 47.2653,84.6849 40.0813,91.8679 C32.8973,99.0519 21.2503,99.0519 14.0663,91.8679 C6.8833,84.6849 6.8833,73.0379 14.0663,65.8539 C21.2503,58.6699 32.8973,58.6699 40.0813,65.8539" id="Fill-1" fill="#7EC13D"></path>
            <path d="M72.8616,133.1449 L72.8606,133.1449 C70.2296,135.7759 65.9646,135.7759 63.3336,133.1449 L42.9286,112.7409 C40.2986,110.1099 40.2986,105.8439 42.9286,103.2129 C45.5606,100.5819 49.8266,100.5819 52.4576,103.2129 L72.8616,123.6169 C75.4926,126.2479 75.4926,130.5139 72.8616,133.1449" id="Fill-3" fill="#FEFEFE"></path>
            <path d="M72.8616,133.1449 L72.8606,133.1449 C70.2296,135.7759 65.9646,135.7759 63.3336,133.1449 L42.9286,112.7409 C40.2986,110.1099 40.2986,105.8439 42.9286,103.2129 C45.5606,100.5819 49.8266,100.5819 52.4576,103.2129 L72.8616,123.6169 C75.4926,126.2479 75.4926,130.5139 72.8616,133.1449 Z" id="Stroke-5" stroke="#343434" stroke-width="3.96"></path>
            <line x1="42.929" y1="103.2127" x2="37.155" y2="97.4387" id="Stroke-7" stroke="#343434" stroke-width="3.96"></line>
            <path d="M36.5491,67.3666 C44.6861,75.5036 44.6861,88.6956 36.5491,96.8326 C28.4111,104.9696 15.2191,104.9696 7.0821,96.8326 C-1.0549,88.6956 -1.0549,75.5036 7.0821,67.3666 C15.2191,59.2296 28.4111,59.2296 36.5491,67.3666 Z" id="Stroke-9" stroke="#343434" stroke-width="3.96"></path>
            <path d="M275.178,127.5174 C275.178,136.7104 282.63,144.1624 291.824,144.1624 C301.016,144.1624 308.468,136.7104 308.468,127.5174 L308.468,51.1034 C308.468,45.2124 313.243,40.4374 319.134,40.4374 C325.026,40.4374 329.801,45.2124 329.801,51.1034 L329.801,63.2954" id="Stroke-11" stroke="#343434" stroke-width="3.96" stroke-linecap="round"></path>
            <polyline id="Stroke-13" stroke="#343434" stroke-width="3.96" stroke-linecap="round" points="203.3294 134.5384 203.3294 160.6554 203.3294 179.2544"></polyline>
            <path d="M331.6292,240.8748 L331.6292,224.2318 C331.6292,206.1748 316.8552,191.3998 298.7972,191.3998 L288.3222,191.3998 C261.1552,191.3998 239.1332,169.1368 239.1332,141.9708 L239.1332,129.2778" id="Stroke-15" stroke="#343434" stroke-width="3.96" stroke-linecap="round"></path>
            <path d="M373.3372,240.8748 C373.3372,252.3928 364.0002,261.7288 352.4832,261.7288 C340.9662,261.7288 331.6292,252.3928 331.6292,240.8748" id="Stroke-17" stroke="#343434" stroke-width="3.96" stroke-linecap="round"></path>
            <path d="M203.3294,179.0887 C203.3294,194.5667 190.6654,207.2307 175.1874,207.2307 L162.1164,207.2307 L143.7044,207.2307 C135.5904,207.2307 129.0134,213.8087 129.0134,221.9217 C129.0134,230.0357 135.5904,236.6137 143.7044,236.6137 C149.2214,236.6137 153.6934,241.0857 153.6934,246.6037 C153.6934,252.1197 149.2214,256.5927 143.7044,256.5927" id="Stroke-19" stroke="#343434" stroke-width="3.96" stroke-linecap="round"></path>
            <path d="M275.178,127.5174 L275.178,63.7564 C275.178,29.2294 246.929,0.9804 212.402,0.9804 C177.874,0.9804 149.625,29.2294 149.625,63.7564 L149.625,127.5174 C149.625,136.7104 142.173,144.1624 132.98,144.1624 C123.787,144.1624 116.335,136.7104 116.335,127.5174 L116.335,64.3044 C116.335,58.4134 111.56,53.6374 105.668,53.6374 C99.778,53.6374 95.002,58.4134 95.002,64.3044 L95.002,76.4964 C95.002,82.3874 90.227,87.1624 84.335,87.1624 C78.445,87.1624 73.669,82.3874 73.669,76.4964 L73.669,65.9214" id="Stroke-21" stroke="#343434" stroke-width="3.96" stroke-linecap="round"></path>
            <path d="M69.513,119.8294 C76.387,119.8294 81.959,125.4014 81.959,132.2754 C81.959,139.1494 76.387,144.7224 69.513,144.7224 L69.513,144.7024 L63.769,144.7024 C52.64,144.7024 43.617,135.6804 43.617,124.5514 C43.617,113.4224 52.64,104.4004 63.769,104.4004 L80.863,104.4004 C92.021,104.4004 101.067,113.4454 101.067,124.6044 L101.044,131.3104 C101.044,149.6694 115.927,164.5514 134.285,164.5514 C152.644,164.5514 167.527,149.6694 167.527,131.3104 L167.527,117.3784" id="Stroke-23" stroke="#343434" stroke-width="3.96" stroke-linecap="round"></path>
            <path d="M349.9212,83.4159 C338.8092,83.4159 329.8012,74.4079 329.8012,63.2959" id="Stroke-25" stroke="#343434" stroke-width="3.96" stroke-linecap="round"></path>
            <path d="M221.2307,134.5384 L221.2307,193.7474 C221.2307,209.9494 234.3657,223.0824 250.5667,223.0824 L281.5487,223.0824 C289.6637,223.0824 296.2407,229.6614 296.2407,237.7754 C296.2407,245.8894 289.6637,252.4664 281.5487,252.4664 C276.0327,252.4664 271.5597,256.9394 271.5597,262.4554 C271.5597,267.9724 276.0327,272.4454 281.5487,272.4454" id="Stroke-27" stroke="#343434" stroke-width="3.96" stroke-linecap="round"></path>
            <path d="M394.6018,184.4188 C400.1988,184.4188 404.7348,189.3958 404.7348,194.9908 C404.7348,203.2638 398.0288,209.9698 389.7558,209.9698 C381.4838,209.9698 374.7778,203.2638 374.7778,194.9908 C374.0168,175.8678 361.8738,166.1698 345.9558,166.1698 L291.7998,166.1698 C272.6358,166.1698 257.1008,150.6348 257.1008,131.4708 L257.1008,117.3778" id="Stroke-29" stroke="#343434" stroke-width="3.96" stroke-linecap="round"></path>
            <path d="M378.3938,134.4862 C382.6258,133.1612 384.7528,127.9252 383.1458,122.7922 C382.4808,120.6692 381.2818,118.8952 379.8028,117.6392 C377.8408,115.7022 376.0938,113.1442 375.2708,110.5152 C374.8758,109.2552 374.6608,107.9842 374.5758,106.7222 C366.9748,109.8442 362.8918,118.3102 365.3928,126.2982 C366.1358,128.6712 367.3798,130.7482 368.9728,132.4492 C371.2888,134.6162 374.9258,135.5722 378.1678,134.5572" id="Fill-31" fill="#7EC13D"></path>
            <line x1="372.7327" y1="147.1449" x2="368.7207" y2="135.8259" id="Stroke-33" stroke="#343434" stroke-width="3.96" stroke-linecap="round" stroke-linejoin="round"></line>
            <line x1="377.2239" y1="133.4642" x2="380.2979" y2="144.7762" id="Stroke-35" stroke="#343434" stroke-width="3.96" stroke-linecap="round" stroke-linejoin="round"></line>
            <path d="M377.3421,133.1258 C376.2771,134.2808 374.9041,135.1798 373.2971,135.6838" id="Stroke-37" stroke="#343434" stroke-width="3.96" stroke-linecap="round" stroke-linejoin="round"></path>
            <path d="M373.8782,135.5013 C378.1102,134.1763 380.2382,128.9403 378.6312,123.8073 C377.9662,121.6843 376.7662,119.9103 375.2872,118.6543 C373.3252,116.7183 371.5782,114.1593 370.7552,111.5303 C370.3602,110.2703 370.1452,109.0003 370.0602,107.7373 C362.4602,110.8603 358.3772,119.3263 360.8782,127.3133 C361.6202,129.6863 362.8652,131.7633 364.4582,133.4643 C366.7732,135.6313 370.4102,136.5873 373.6522,135.5723" id="Stroke-39" stroke="#343434" stroke-width="3.96" stroke-linecap="round" stroke-linejoin="round"></path>
            <line x1="372.7327" y1="147.1449" x2="380.2977" y2="144.7759" id="Stroke-41" stroke="#343434" stroke-width="3.96" stroke-linecap="round" stroke-linejoin="round"></line>
            <path d="M380.2766,144.8114 C381.7876,145.7174 382.9856,147.1564 383.5496,148.9594 L406.2356,227.4924 C406.8576,229.4794 406.2586,232.2094 404.2716,232.8324 C402.2846,233.4544 400.0506,231.6114 399.4286,229.6244 L372.4476,152.4364 C371.8876,150.6484 372.0436,148.8004 372.7516,147.2044" id="Stroke-43" stroke="#343434" stroke-width="3.96" stroke-linecap="round" stroke-linejoin="round"></path>
            <path d="M85.9475,215.8436 L70.1625,221.9446 C69.2555,222.2956 68.8035,223.3156 69.1545,224.2226 L70.2545,227.0666 C70.6045,227.9736 71.6245,228.4246 72.5315,228.0736 L74.0575,227.4846 L90.9415,271.1626 C92.2615,274.5776 96.1355,276.2916 99.5515,274.9726 L99.8655,274.8506 C103.2805,273.5306 104.9945,269.6566 103.6755,266.2406 L86.7915,222.5626 L88.3165,221.9726 C89.2235,221.6216 89.6755,220.6016 89.3245,219.6946 L88.2255,216.8516 C87.8745,215.9436 86.8545,215.4916 85.9475,215.8436" id="Fill-45" fill="#7EC13D"></path>
            <line x1="81.6751" y1="232.3504" x2="94.4411" y2="265.3744" id="Stroke-47" stroke="#343434" stroke-width="3.96" stroke-linecap="round" stroke-linejoin="round"></line>
            <path d="M83.6223,223.787 L100.5063,267.466 C101.8263,270.881 100.1123,274.756 96.6963,276.075 L96.3823,276.197 C92.9673,277.517 89.0933,275.803 87.7723,272.388 L70.8893,228.709" id="Stroke-49" stroke="#343434" stroke-width="3.96" stroke-linecap="round" stroke-linejoin="round"></path>
            <path d="M83.7268,223.7469 L70.7848,228.7489 C69.0918,229.4029 67.1898,228.5609 66.5358,226.8689 C65.8808,225.1769 66.7228,223.2739 68.4148,222.6199 L81.3578,217.6169 C83.0498,216.9639 84.9528,217.8049 85.6068,219.4979 C86.2608,221.1899 85.4188,223.0929 83.7268,223.7469 Z" id="Stroke-51" stroke="#343434" stroke-width="3.96" stroke-linecap="round" stroke-linejoin="round"></path>
            <path d="M61.1927,174.0145 C61.9477,172.6935 62.1147,170.8155 61.6087,169.5075 C61.4207,169.0185 53.7567,154.9175 53.7567,154.9175 L46.9587,157.5455 C46.9587,157.5455 50.7717,173.1345 50.9617,173.6225 C51.4657,174.9315 52.8527,176.2075 54.2997,176.6785 L71.4397,221.4515 L78.3337,218.7865 L61.1927,174.0145 Z" id="Stroke-53" stroke="#343434" stroke-width="3.96" stroke-linecap="round" stroke-linejoin="round"></path>
            <line x1="358.1917" y1="243.5135" x2="330.3807" y2="298.3365" id="Stroke-55" stroke="#343434" stroke-width="3.96" stroke-linecap="round" stroke-linejoin="round"></line>
            <path d="M333.9876,303.536 C333.5316,304.433 333.5786,305.474 333.9896,306.314 L333.9686,306.287 C336.3616,309.553 336.8836,314.024 334.9366,317.864 L333.8156,320.073 C331.4246,324.786 326.0676,327.053 321.1436,325.773 L326.6326,314.954 C327.2836,313.671 326.7656,312.088 325.4826,311.437 L322.7036,310.027 C321.4196,309.376 319.8376,309.893 319.1856,311.177 L313.6976,321.996 C309.7576,318.778 308.4226,313.116 310.8116,308.404 L311.9326,306.195 C313.8816,302.355 317.7986,300.136 321.8456,300.137 L321.8126,300.137 C322.7316,299.973 323.5996,299.395 324.0546,298.498 L354.5856,238.314 C355.0416,237.417 354.9946,236.375 354.5836,235.536 L354.6036,235.563 C352.2116,232.298 351.6886,227.826 353.6356,223.986 L354.7576,221.777 C357.1476,217.064 362.5056,214.798 367.4286,216.077 L361.9406,226.896 C361.2896,228.18 361.8066,229.763 363.0906,230.413 L365.8696,231.823 C367.1526,232.474 368.7356,231.957 369.3866,230.674 L374.8756,219.854 C378.8156,223.072 380.1506,228.734 377.7596,233.446 L376.6396,235.655 C374.6916,239.495 370.7746,241.715 366.7256,241.714 L366.7596,241.713 C365.8416,241.878 364.9726,242.455 364.5166,243.352 L333.9876,303.536 Z" id="Stroke-57" stroke="#343434" stroke-width="3.96" stroke-linecap="round" stroke-linejoin="round"></path>
            <path d="M185.428,129.2777 L185.428,152.5767 C185.428,170.6347 170.654,185.4087 152.596,185.4087 L142.121,185.4087 C114.954,185.4087 92.932,207.6727 92.932,234.8387 C92.932,241.9157 87.195,247.6527 80.118,247.6527 C73.042,247.6527 67.305993,241.9157 67.305993,234.8387 C67.299,229.6097 72.532,228.0737 76.072,226.7057" id="Stroke-59" stroke="#343434" stroke-width="3.96" stroke-linecap="round"></path>
            <path d="M173.9778,70.7738 C173.9778,79.1698 167.1718,85.9758 158.7758,85.9758 C150.3798,85.9758 143.5738,79.1698 143.5738,70.7738 C143.5738,62.3778 150.3798,55.5718 158.7758,55.5718 C167.1718,55.5718 173.9778,62.3778 173.9778,70.7738" id="Fill-61" fill="#FEFEFE"></path>
            <path d="M173.9778,70.7738 C173.9778,79.1698 167.1718,85.9758 158.7758,85.9758 C150.3798,85.9758 143.5738,79.1698 143.5738,70.7738 C143.5738,62.3778 150.3798,55.5718 158.7758,55.5718 C167.1718,55.5718 173.9778,62.3778 173.9778,70.7738 Z" id="Stroke-63" stroke="#343434" stroke-width="3.96" stroke-linecap="round"></path>
            <path d="M166.5022,70.7738 C166.5022,75.0408 163.0432,78.4998 158.7752,78.4998 C154.5092,78.4998 151.0502,75.0408 151.0502,70.7738 C151.0502,66.5068 154.5092,63.0478 158.7752,63.0478 C163.0432,63.0478 166.5022,66.5068 166.5022,70.7738" id="Fill-65" fill="#343434"></path>
            <path d="M280.5423,70.7738 C280.5423,80.1058 272.9773,87.6698 263.6453,87.6698 C254.3133,87.6698 246.7483,80.1058 246.7483,70.7738 C246.7483,61.4418 254.3133,53.8778 263.6453,53.8778 C272.9773,53.8778 280.5423,61.4418 280.5423,70.7738" id="Fill-67" fill="#FEFEFE"></path>
            <path d="M280.5423,70.7738 C280.5423,80.1058 272.9773,87.6698 263.6453,87.6698 C254.3133,87.6698 246.7483,80.1058 246.7483,70.7738 C246.7483,61.4418 254.3133,53.8778 263.6453,53.8778 C272.9773,53.8778 280.5423,61.4418 280.5423,70.7738 Z" id="Stroke-69" stroke="#343434" stroke-width="3.96" stroke-linecap="round"></path>
            <path d="M273.6829,70.7738 C273.6829,76.3168 269.1889,80.8108 263.6449,80.8108 C258.1019,80.8108 253.6079,76.3168 253.6079,70.7738 C253.6079,65.2308 258.1019,60.7368 263.6449,60.7368 C269.1889,60.7368 273.6829,65.2308 273.6829,70.7738" id="Fill-71" fill="#343434"></path>
        </g>
    </g>
</svg>