<?xml version="1.0" encoding="UTF-8"?>
<svg width="126.990631px" height="185.01271px" viewBox="0 0 126.990631 185.01271" version="1.1" xmlns="http://www.w3.org/2000/svg" xmlns:xlink="http://www.w3.org/1999/xlink">
    <title>dov</title>
    <defs>
        <polygon id="path-1" points="0 0 126.990631 0 126.990631 185.01271 0 185.01271"></polygon>
        <polygon id="path-3" points="0 185.01271 126.991056 185.01271 126.991056 0 0 0"></polygon>
    </defs>
    <g id="Forts-matris-grovskisser---david" stroke="none" stroke-width="1" fill="none" fill-rule="evenodd">
        <g id="Matris-annas-linjer" transform="translate(-656.000000, -1930.641715)">
            <g id="dov" transform="translate(656.000000, 1930.641715)">
                <polygon id="Fill-1" fill="#DDEBC1" points="96.9600071 66.2264974 111.821783 66.2264974 111.821783 34.8657487 96.9600071 34.8657487"></polygon>
                <polygon id="Fill-2" fill="#DDEBC1" points="16.8936329 66.2264974 31.7554089 66.2264974 31.7554089 34.8657487 16.8936329 34.8657487"></polygon>
                <polygon id="Fill-3" fill="#333333" points="101.158782 62.2901652 103.282378 62.2901652 103.282378 38.19414 101.158782 38.19414"></polygon>
                <polygon id="Fill-4" fill="#333333" points="105.394931 62.2901652 107.518528 62.2901652 107.518528 38.19414 105.394931 38.19414"></polygon>
                <polygon id="Fill-5" fill="#333333" points="25.4321887 62.2901652 27.555785 62.2901652 27.555785 38.19414 25.4321887 38.19414"></polygon>
                <polygon id="Fill-6" fill="#333333" points="21.1960389 62.2901652 23.3196352 62.2901652 23.3196352 38.19414 21.1960389 38.19414"></polygon>
                <g id="Group-16">
                    <g id="Group-9">
                        <mask id="mask-2" fill="white">
                            <use xlink:href="#path-1"></use>
                        </mask>
                        <g id="Clip-8"></g>
                        <path d="M50.5233279,98.5299791 L50.5233279,82.2896368 C54.4358416,84.2306324 58.8393308,85.327643 63.4951032,85.327643 C68.6520443,85.327643 73.498091,83.9835503 77.7104565,81.6349966 L78.2574949,98.6004527 C74.9438353,101.163823 69.8242695,103.582002 64.139827,103.582002 C58.456234,103.582002 53.580457,101.131558 50.5233279,98.5299791 M36.3368555,56.0581769 L36.3368555,37.1406872 C36.3368555,26.3828508 42.8053296,16.5972104 52.5738724,12.295774 L52.5738724,12.7738057 C52.5738724,28.9131075 65.7104388,42.0441209 81.8565658,42.0441209 C83.885025,42.0441209 87.1604598,42.0424227 90.6542004,41.4276892 L90.6542004,56.0581769 C90.6542004,71.0274473 78.470704,83.2049445 63.4951032,83.2049445 C48.5203519,83.2049445 36.3368555,71.0274473 36.3368555,56.0581769 M64.3411439,2.12210422 C82.3246064,2.12210422 96.9544857,16.7466483 96.9544857,34.7216599 L96.9544857,37.1457817 C91.8204794,39.9129315 85.1294524,39.9214223 81.8565658,39.9214223 C66.8809651,39.9214223 54.6974686,27.743076 54.6974686,12.7738057 L54.6974686,3.57827544 C57.7461034,2.63240096 60.9850124,2.12210422 64.3411439,2.12210422 M83.187636,92.5898194 C82.6151144,92.5898194 82.1547187,93.0457751 82.1334828,93.6138092 L82.1266873,93.6129601 L82.1249884,93.6554141 C82.1232895,94.4187365 81.4624264,95.5369741 80.3216305,96.7469123 L79.9461786,85.091599 C85.1795692,86.5749407 88.4261232,87.5955342 92.7625067,88.9591558 C94.2422286,89.4244513 95.8476674,89.9279554 97.7011422,90.5044803 C97.8039242,90.5367453 97.9109535,90.5528779 98.0162839,90.5528779 C98.2405356,90.5528779 98.4613896,90.4824043 98.6457178,90.3465515 C98.9183875,90.1461688 99.078082,89.8286131 99.078082,89.4915286 L99.078082,61.07284 L96.9544857,61.07284 L96.9544857,88.0489426 C95.6675864,87.646479 94.498759,87.2788276 93.3995856,86.9341013 C92.7472168,86.7286241 92.1203312,86.5316377 91.5070366,86.3397457 L91.5070366,77.0796854 L89.3834404,77.0796854 L89.3834404,85.6766147 C86.5488641,84.7978175 83.7542114,83.958927 79.8739764,82.8644636 L79.7932797,80.3622265 C87.6183072,75.1021795 92.7777966,66.171562 92.7777966,56.0581769 L92.7777966,40.9785262 C94.1912623,40.6244601 95.6030291,40.1472774 96.9544857,39.5189587 L96.9544857,41.8165676 L99.078082,41.8165676 L99.078082,34.7216599 C99.078082,15.5757678 83.4951327,-0.000594355602 64.3411439,-0.000594355602 C45.1871552,-0.000594355602 29.6042059,15.5757678 29.6042059,34.7216599 L29.6042059,41.8165676 L31.7278022,41.8165676 L31.7278022,34.7216599 C31.7278022,20.8927032 40.3912254,9.05568685 52.5738724,4.3271635 L52.5738724,9.99731594 C41.5668483,14.4295106 34.2132592,25.2314991 34.2132592,37.1406872 L34.2132592,56.0581769 C34.2132592,62.9866651 36.6392556,69.357308 40.6808839,74.3762165 C37.633948,74.0646044 34.6345807,73.8582781 31.7278022,73.7640303 L31.7278022,61.07284 L29.6042059,61.07284 L29.6042059,74.7965109 C29.6042059,75.3730358 30.0646016,75.8434258 30.6413703,75.8578601 C34.5504863,75.9487116 38.6405327,76.2509839 42.8036308,76.7485445 C44.4795729,78.4237782 46.3593803,79.8960819 48.3997316,81.1280962 L48.3997316,96.3639775 C47.5885178,95.3213079 47.1408637,94.3635463 47.1391649,93.6571123 L47.1383154,93.6248472 C47.1230255,93.0491714 46.6524366,92.5898194 46.0765173,92.5898194 C21.0996276,92.5898194 -0.00042471925,112.639981 -0.00042471925,136.374298 L-0.00042471925,184.974756 L2.12317153,184.974756 L2.12317153,136.374298 C2.12317153,125.390607 6.8528451,114.936741 15.4406683,106.94096 C23.5281723,99.4104745 34.2625266,94.9918651 45.0410518,94.7252542 L47.2878166,185.001077 L49.4114129,184.948434 L47.2546885,98.3134638 C48.187372,99.3867002 49.3731881,100.450597 50.7586223,101.417698 C53.0538051,103.018213 57.8429394,105.7047 64.139827,105.7047 C71.4764273,105.7047 78.4851444,101.940731 81.9644445,98.133459 L78.8554996,184.936547 L80.9782464,185.012965 L84.2112093,94.7286505 C106.723028,95.2729104 124.867035,113.742935 124.867035,136.374298 L124.867035,184.974756 L126.990631,184.974756 L126.990631,136.374298 C126.990631,112.231574 107.34142,92.5898194 83.187636,92.5898194" id="Fill-7" fill="#333333" mask="url(#mask-2)"></path>
                    </g>
                    <mask id="mask-4" fill="white">
                        <use xlink:href="#path-3"></use>
                    </mask>
                    <g id="Clip-11"></g>
                    <polygon id="Fill-10" fill="#333333" mask="url(#mask-4)" points="43.0656825 39.4770991 53.6360952 39.4770991 53.6360952 37.3544005 43.0656825 37.3544005"></polygon>
                    <path d="M64.3408042,60.7535862 L64.3408042,58.6308876 C61.2174188,58.6308876 60.9566412,57.609445 60.9566412,56.5633792 C60.9566412,55.4417452 61.4408211,55.0706975 62.0541157,54.6003075 C62.5637788,54.2080328 63.2620173,53.6722637 63.2620173,52.6941242 L63.2620173,46.68434 L61.138421,46.68434 L61.138421,52.6049709 C61.0594232,52.6864825 60.890385,52.8163916 60.7604209,52.916583 C60.040097,53.4701828 58.8330449,54.3965285 58.8330449,56.5633792 C58.8330449,59.3441143 60.6856703,60.7535862 64.3408042,60.7535862" id="Fill-12" fill="#333333" mask="url(#mask-4)"></path>
                    <path d="M42.7249728,45.0953727 L43.405373,47.1068419 C44.2794452,46.8113623 45.1790006,46.6033378 46.0878998,46.4674851 C45.9902144,46.6882457 45.9273559,46.925988 45.9188615,47.1781646 C45.8814862,48.2819678 46.8065247,49.1947282 47.9846959,49.2185025 C49.1628671,49.2414276 50.1473664,48.3651776 50.1838922,47.2613744 C50.1940855,46.9438187 50.1184855,46.6466409 49.9868225,46.3774827 C51.1114791,46.4904102 52.2250929,46.7145672 53.3004821,47.0711806 L53.9689902,45.0563151 C50.3478339,43.8557168 46.3529246,43.8701511 42.7249728,45.0953727" id="Fill-13" fill="#333333" mask="url(#mask-4)"></path>
                    <path d="M77.0039785,46.3773978 C76.8723155,46.6465559 76.7958661,46.9437337 76.8069088,47.2612895 C76.8434346,48.3650927 77.8279338,49.2413427 79.006105,49.2184175 C80.1834268,49.1946433 81.1093148,48.2818829 81.0719395,47.1780797 C81.0634451,46.9259031 81.0005866,46.6881608 80.9020518,46.4674002 C81.810951,46.6032529 82.7105063,46.8112774 83.585428,47.106757 L84.2649788,45.0952878 C80.637027,43.8709153 76.6429671,43.8564809 73.0209614,45.0562302 L73.6894695,47.0710957 C74.765708,46.7153314 75.8793219,46.4903253 77.0039785,46.3773978" id="Fill-14" fill="#333333" mask="url(#mask-4)"></path>
                    <path d="M68.2255413,68.1680874 C65.1259402,68.7267816 61.8581503,68.7463105 58.7517537,68.2275229 L58.401785,70.3222019 C60.0140193,70.5913601 61.667876,70.7272128 63.3174856,70.7272128 C65.0928121,70.7272128 66.8706869,70.5684349 68.6018425,70.2576719 L68.2255413,68.1680874 Z" id="Fill-15" fill="#333333" mask="url(#mask-4)"></path>
                </g>
            </g>
        </g>
    </g>
</svg>