{
	"name": "skolverket-design-tokens",
	"$schema": "../../../node_modules/nx/schemas/project-schema.json",
	"sourceRoot": "libs/skolverket/design-tokens/src",
	"projectType": "library",
	"targets": {
    "prepare": {
      "executor": "@nrwl/workspace:run-commands",
      "options": {
        "commands": [
					"node component-tokens-validator -- package-name=skolverket",
          "node component-tokens-generator -- package-name=skolverket"
        ],
        "cwd": "libs/shared/build",
        "parallel": false
      },
      "configurations": {
        "production": {}
      },
      "defaultConfiguration": "production"
    },
		"build": {
			"executor": "@nrwl/workspace:run-commands",
			"options": {
				"commands": ["npm run build"],
				"cwd": "libs/skolverket/design-tokens",
        "nxBail": true
			},
			"outputs": ["libs/skolverket/package/src/design-tokens"],
      "dependsOn": [
        {
          "target": "prepare",
          "projects": "self"
        }
      ]
		},
		"lint": {
			"executor": "@nrwl/linter:eslint",
			"outputs": ["{options.outputFile}"],
			"options": {
				"lintFilePatterns": ["libs/skolverket/design-tokens/**/*.ts"]
			}
		},
		"test": {
			"executor": "@nrwl/jest:jest",
			"outputs": ["coverage/libs/skolverket/design-tokens"],
			"options": {
				"jestConfig": "libs/skolverket/design-tokens/jest.config.js",
				"passWithNoTests": true
			}
		}
	},
	"tags": []
}
