<?xml version="1.0" encoding="UTF-8"?>
<svg width="194px" height="194px" viewBox="0 0 194 194" version="1.1" xmlns="http://www.w3.org/2000/svg" xmlns:xlink="http://www.w3.org/1999/xlink">
    <title>kognitiv</title>
    <defs>
        <path d="M0,97.0004009 C0,150.571891 43.428288,194 97,194 L97,194 C150.571712,194 194,150.571891 194,97.0004009 L194,97.0004009 C194,43.4281085 150.571712,0 97,0 L97,0 C43.428288,0 0,43.4281085 0,97.0004009 L0,97.0004009 Z" id="path-1"></path>
    </defs>
    <g id="Forts-matris-grovskisser---david" stroke="none" stroke-width="1" fill="none" fill-rule="evenodd">
        <g id="Matris-annas-linjer" transform="translate(-349.000000, -2631.000000)">
            <g id="kognitiv" transform="translate(349.000000, 2631.000000)">
                <g id="Group-3">
                    <mask id="mask-2" fill="white">
                        <use xlink:href="#path-1"></use>
                    </mask>
                    <g id="Clip-2"></g>
                    <polygon id="Fill-1" fill="#F3F3F3" mask="url(#mask-2)" points="-1.68789783 195.687089 195.687096 195.687089 195.687096 -1.687089 -1.68789783 -1.687089"></polygon>
                </g>
                <g id="Group-10" transform="translate(30.807062, 36.853704)">
                    <path d="M66.3042349,17.0615394 L66.0781128,17.058332 L66.3042349,17.0198433 L66.531159,17.058332 L66.3042349,17.0615394 Z M66.3042349,106.325707 C67.3217847,109.442492 69.0922733,112.284242 71.5331099,114.631253 C75.3499239,118.300511 80.313386,120.294708 85.5871646,120.294708 C85.8630016,120.294708 86.1388386,120.289095 86.4154774,120.277869 C97.0007217,119.860908 105.550866,111.238632 105.880427,100.647819 C105.89005,100.333494 105.888446,100.019971 105.883635,99.7080524 C116.614014,99.1868509 125.182601,90.2951542 125.182601,79.4389289 C125.182601,78.2489859 125.072748,77.0614485 124.868276,75.8971646 C129.449254,72.1733807 132.38323,66.497096 132.38323,60.1472586 C132.38323,53.7966194 129.449254,48.1203347 124.868276,44.3965508 C125.072748,43.232267 125.182601,42.0447295 125.182601,40.8547865 C125.182601,29.9985612 116.614014,21.1068645 105.883635,20.5864649 C105.888446,20.273744 105.89005,19.9602213 105.880427,19.6458967 C105.550866,9.05588512 97.0007217,0.432807588 86.4154774,0.0166482769 C77.2278606,-0.344985345 69.0601992,5.53416701 66.3042349,14.0465895 L66.3042349,106.325707 Z M66.3042349,14.0465895 C63.5490725,5.53416701 55.3814111,-0.344985345 46.1937943,0.0166482769 C35.6085501,0.432807588 27.0584054,9.05588512 26.7288443,19.6458967 C26.7192221,19.9602213 26.7208258,20.273744 26.7256369,20.5864649 C15.9952575,21.1068645 7.42667025,29.9985612 7.42667025,40.8547865 C7.42667025,42.0447295 7.53652393,43.232267 7.74099611,44.3965508 C3.16001736,48.1203347 0.226041994,53.7966194 0.226041994,60.1472586 C0.226041994,66.497096 3.16001736,72.1733807 7.74099611,75.8971646 C7.53652393,77.0614485 7.42667025,78.2489859 7.42667025,79.4389289 C7.42667025,90.2951542 15.9952575,99.1868509 26.7256369,99.7080524 C26.7208258,100.019971 26.7192221,100.333494 26.7288443,100.647819 C27.0584054,111.238632 35.6085501,119.860908 46.1937943,120.277869 C46.4704332,120.289095 46.7462701,120.294708 47.0221071,120.294708 C52.2958858,120.294708 57.2593478,118.300511 61.0761619,114.631253 C63.5169984,112.284242 65.287487,109.442492 66.3042349,106.325707 L66.3042349,14.0465895 Z" id="Fill-4" fill="#FFFFFF"></path>
                    <path d="M124.223988,75.5843635 C128.599692,71.8645889 131.383722,66.3262221 131.383722,60.1463766 C131.383722,53.9665311 128.599692,48.4281643 124.22479,44.7083897 L125.222293,44.9112573 C125.492517,43.5833964 125.628832,42.2186504 125.628832,40.8547063 C125.628832,30.0048958 117.057037,21.1212176 106.329865,20.6152512 C106.335478,20.2929082 106.337082,19.9705651 106.326658,19.6466184 C105.997097,9.0718419 97.4597818,0.462395794 86.8905745,0.0454346339 C76.7214913,-0.351480316 67.7784393,6.89321984 66.0913433,16.9026932 L67.0511598,17.0646666 L66.0785137,17.0502333 L65.8090915,35.4630778 L66.7809358,35.4767092 L65.8090915,35.4767092 L65.8090915,63.1925986 L65.8090915,94.5424649 L65.8090915,99.9990432 C65.8090915,105.563069 68.0189948,110.75183 72.0314607,114.608721 C75.8426618,118.273168 80.7973035,120.262554 86.0630636,120.262554 C86.3380987,120.262554 86.6147375,120.257743 86.8905745,120.246517 C97.4597818,119.830357 105.997097,111.220911 106.326658,100.646135 C106.337082,100.322188 106.335478,99.9990432 106.329865,99.677502 C117.057037,99.1715356 125.628832,90.2878574 125.628832,79.4380469 C125.628832,78.0741028 125.492517,76.708555 125.222293,75.3814959 L124.223988,75.5843635 Z" id="Fill-6" fill="#DDEBC1"></path>
                    <path d="M112.091651,78.435977 L112.091651,80.4405979 C116.032752,80.4405979 119.712449,79.3075862 122.830049,77.3550853 C122.907828,78.0454768 122.95193,78.7414812 122.95193,79.4382874 C122.95193,89.2328655 115.212458,97.2521511 105.527693,97.7059973 C104.95918,92.6671821 102.539993,88.0180652 98.6413904,84.6462927 L97.3303629,86.1617861 C101.519236,89.7861408 103.822956,95.0430588 103.65136,100.584633 C103.353873,110.128233 95.648078,117.898945 86.1108539,118.27421 C81.0704142,118.468258 76.3162354,116.664901 72.695875,113.18568 C69.0755146,109.704055 67.0805076,105.02126 67.0805076,99.9992837 L67.0805076,94.5427055 L67.0805076,78.1914132 L81.23319,78.1914132 C85.4797966,78.1914132 89.619757,79.7053029 92.8881045,82.4540392 L94.1782839,80.9201033 C90.5491031,77.8682683 85.9504836,76.1867922 81.23319,76.1867922 L67.0805076,76.1867922 L67.0805076,63.1928392 L67.0805076,43.5772221 C71.3840456,43.588448 76.880739,43.7953249 79.1331404,47.5840585 C81.0271142,50.7690003 85.4605522,58.227794 96.8933537,58.227794 L101.283492,58.227794 C102.093362,61.3485879 104.178978,64.0411948 107.128189,65.6031954 L108.065553,63.8319123 C104.887013,62.1480307 102.912053,58.8837059 102.912053,55.3130751 C102.912053,51.3238794 105.433074,47.697921 109.186542,46.2898752 L108.481714,44.4127482 C103.951252,46.1126667 100.907423,50.4931645 100.907423,55.3130751 C100.907423,55.6185793 100.922659,55.921678 100.945912,56.223173 L96.8933537,56.223173 C86.6015872,56.223173 82.7214268,49.6961272 80.8563197,46.5600981 C78.0362073,41.8171649 71.8683641,41.5846289 67.0805076,41.573403 L67.0805076,35.491383 L67.3475242,17.1731567 C68.8967017,8.17000302 76.9553112,1.66380523 86.1108539,2.01902406 C95.648078,2.39428911 103.353873,10.1642 103.65136,19.7086013 C103.822956,25.2501755 101.519236,30.5070935 97.3303629,34.1314482 L98.6413904,35.6469416 C102.540795,32.2743673 104.959982,27.6260522 105.527693,22.587237 C115.212458,23.0410832 122.95193,31.0603689 122.95193,40.8549469 C122.95193,41.5517531 122.907828,42.2477575 122.830049,42.938149 C119.712449,40.9856482 116.032752,39.8526364 112.091651,39.8526364 L112.091651,41.8572574 C122.17654,41.8572574 130.381086,50.06177 130.381086,60.1466172 C130.381086,70.2314643 122.17654,78.435977 112.091651,78.435977 L112.091651,78.435977 Z M59.4605109,113.18568 C55.8417542,116.664901 51.0867736,118.474672 46.0463338,118.27421 C36.5083078,117.898945 28.8033149,110.128233 28.5058279,100.584633 C28.3334298,95.0430588 30.6371497,89.7861408 34.826023,86.1617861 L33.5149955,84.6462927 C29.6163925,88.018867 27.1964041,92.6671821 26.6286931,97.7059973 C16.9447301,97.2521511 9.20445565,89.2328655 9.20445565,79.4382874 C9.20445565,78.694974 9.25497231,77.9540661 9.34397785,77.219573 C12.5056791,79.2546642 16.2631562,80.4405979 20.2948665,80.4405979 L20.2948665,78.435977 C10.2091758,78.435977 2.00462925,70.2314643 2.00462925,60.1466172 C2.00462925,50.06177 10.2091758,41.8572574 20.2948665,41.8572574 L20.2948665,39.8526364 C16.2631562,39.8526364 12.5056791,41.0385702 9.34397785,43.0736614 C9.25497231,42.3391682 9.20445565,41.5974585 9.20445565,40.8549469 C9.20445565,31.0603689 16.9447301,23.0410832 26.6286931,22.587237 C27.1964041,27.6260522 29.6163925,32.2743673 33.5149955,35.6469416 L34.826023,34.1314482 C30.6371497,30.5070935 28.3334298,25.2501755 28.5058279,19.7086013 C28.8033149,10.1642 36.5083078,2.39428911 46.0463338,2.01902406 C55.209895,1.67342741 63.2604861,8.16920117 64.8080598,17.1723548 L65.0758783,35.491383 L65.0758783,41.5766104 C60.3353311,41.6086844 54.0159378,41.9927697 51.300868,46.5600981 C49.4349591,49.6961272 45.5547987,56.223173 35.263834,56.223173 L31.2104737,56.223173 C31.2345292,55.921678 31.2497644,55.6185793 31.2497644,55.3130751 C31.2497644,50.4931645 28.2059354,46.1126667 23.6746714,44.4127482 L22.9698438,46.2898752 C26.7233116,47.697921 29.2451352,51.3238794 29.2451352,55.3130751 C29.2451352,58.8837059 27.2701744,62.1480307 24.0908324,63.8319123 L25.0289989,65.6031954 C27.9782095,64.0411948 30.0630239,61.3485879 30.8728941,58.227794 L35.263834,58.227794 C46.6958337,58.227794 51.1300736,50.7690003 53.0232454,47.5840585 C55.1850376,43.9484779 60.7988014,43.6125035 65.0758783,43.5812314 L65.0758783,63.1928392 L65.0758783,76.1867922 L50.9239977,76.1867922 C46.2059023,76.1867922 41.6088865,77.8682683 37.9773002,80.9201033 L39.2682814,82.4548411 C42.5374308,79.7053029 46.6773911,78.1914132 50.9239977,78.1914132 L65.0758783,78.1914132 L65.0758783,94.5427055 L65.0758783,99.9992837 C65.0758783,105.02126 63.0816731,109.704055 59.4605109,113.18568 L59.4605109,113.18568 Z M66.0781929,17.0608979 L65.8512689,17.0576905 L66.0781929,17.0192018 L66.3043151,17.0576905 L66.0781929,17.0608979 Z M132.385715,60.1466172 C132.385715,53.7045672 129.36514,47.9585217 124.669497,44.2379452 C124.856328,43.1249796 124.956559,41.991166 124.956559,40.8549469 C124.956559,29.9987216 116.38717,21.106223 105.657593,20.5858234 C105.661602,20.2731025 105.664008,19.9603817 105.654385,19.6460571 C105.324824,9.05524364 96.7738778,0.43216611 86.1886335,0.0160067982 C77.0146483,-0.340815733 68.8365628,5.53512923 66.0781929,14.045948 C63.3222287,5.53272368 55.1513598,-0.348032368 45.9677523,0.0160067982 C35.3825081,0.43216611 26.8323634,9.05524364 26.5028023,19.6460571 C26.4931801,19.9603817 26.4947838,20.2731025 26.4995949,20.5858234 C15.7692155,21.106223 7.1998264,29.9987216 7.1998264,40.8549469 C7.1998264,42.0448899 7.31048194,43.2324273 7.51495412,44.3959093 C2.93397537,48.1204951 0,53.7959779 0,60.1466172 C0,66.4972564 2.93397537,72.1727392 7.51495412,75.8965231 C7.31048194,77.060807 7.1998264,78.2483444 7.1998264,79.4382874 C7.1998264,90.2945127 15.7692155,99.1862095 26.4995949,99.7074109 C26.4947838,100.020132 26.4931801,100.332853 26.5028023,100.647177 C26.8323634,111.237991 35.3825081,119.861068 45.9677523,120.277228 C46.2443912,120.288453 46.5202282,120.294066 46.7952633,120.294066 C52.0698438,120.294066 57.0333058,118.299869 60.8501199,114.630611 C63.2909564,112.283601 65.061445,109.44185 66.0781929,106.325066 C67.0957427,109.44185 68.8654294,112.283601 71.3070679,114.630611 C75.123882,118.299869 80.087344,120.294066 85.3611226,120.294066 C85.6369596,120.294066 85.9127966,120.288453 86.1886335,120.277228 C96.7738778,119.861068 105.324824,111.237991 105.654385,100.647177 C105.664008,100.332853 105.661602,100.020132 105.657593,99.7074109 C116.38717,99.1862095 124.956559,90.2945127 124.956559,79.4382874 C124.956559,78.3020683 124.856328,77.1682547 124.669497,76.0544873 C129.36514,72.3347126 132.385715,66.5886671 132.385715,60.1466172 L132.385715,60.1466172 Z" id="Fill-8" fill="#3B3735"></path>
                </g>
            </g>
        </g>
    </g>
</svg>