{
	"fileServerFolder": ".",
	"fixturesFolder": "./src/fixtures",
	"integrationFolder": "./src/integration",
	"modifyObstructiveCode": false,
	"supportFile": "./src/support/index.ts",
	"pluginsFile": false,
	"video": true,
	"videosFolder": "../../../../dist/cypress/apps/arbetsformedlingen/playground/wheel-of-fortune-e2e/videos",
	"screenshotsFolder": "../../../../dist/cypress/apps/arbetsformedlingen/playground/wheel-of-fortune-e2e/screenshots",
	"chromeWebSecurity": false
}
