<?xml version="1.0" encoding="UTF-8"?>
<svg width="455px" height="275px" viewBox="0 0 455 275" version="1.1" xmlns="http://www.w3.org/2000/svg" xmlns:xlink="http://www.w3.org/1999/xlink">
    <title>Group 2</title>
    <g id="Main-senaste-designfiler" stroke="none" stroke-width="1" fill="none" fill-rule="evenodd">
        <g id="Placeholder-för-designmönsterpuffar" transform="translate(-371.000000, -874.000000)">
            <g id="Group-2" transform="translate(371.000000, 874.000000)">
                <rect id="Rectangle-Copy-123" fill="#FFFFFF" x="0" y="0" width="455" height="275" rx="5"></rect>
                <g id="Group" transform="translate(66.000000, 139.000000)">
                    <rect id="Rectangle-Copy-25" stroke="#979797" fill="#05005A" x="0.5" y="0.5" width="312" height="66" rx="6"></rect>
                    <g id="Primär" transform="translate(122.355957, 23.564453)" fill="#FFFFFF" fill-rule="nonzero">
                        <path d="M10.3984375,5.47851562 C10.3984375,7.11848958 9.86132812,8.37532552 8.78710938,9.24902344 C7.71289062,10.1227214 6.18391927,10.5595703 4.20019531,10.5595703 L2.56738281,10.5595703 L2.56738281,16.4355469 L0,16.4355469 L0,0.73046875 L4.52246094,0.73046875 C6.48470052,0.73046875 7.95458984,1.13151042 8.93212891,1.93359375 C9.90966797,2.73567708 10.3984375,3.91731771 10.3984375,5.47851562 Z M2.56738281,8.40039062 L3.93164062,8.40039062 C5.24934896,8.40039062 6.21614583,8.17122396 6.83203125,7.71289062 C7.44791667,7.25455729 7.75585938,6.53841146 7.75585938,5.56445312 C7.75585938,4.66210938 7.48014323,3.98893229 6.92871094,3.54492188 C6.37727865,3.10091146 5.51790365,2.87890625 4.35058594,2.87890625 L2.56738281,2.87890625 L2.56738281,8.40039062 Z" id="Shape"></path>
                        <path d="M19.2929688,4.33984375 C19.8014323,4.33984375 20.2203776,4.37565104 20.5498047,4.44726562 L20.3027344,6.79980469 C19.9446615,6.71386719 19.5722656,6.67089844 19.1855469,6.67089844 C18.1757812,6.67089844 17.3575846,7.00032552 16.730957,7.65917969 C16.1043294,8.31803385 15.7910156,9.17382812 15.7910156,10.2265625 L15.7910156,16.4355469 L13.2666016,16.4355469 L13.2666016,4.5546875 L15.2431641,4.5546875 L15.5761719,6.64941406 L15.7050781,6.64941406 C16.0989583,5.94042969 16.612793,5.37825521 17.246582,4.96289062 C17.8803711,4.54752604 18.5625,4.33984375 19.2929688,4.33984375 Z" id="Path"></path>
                        <path d="M25.2763672,16.4355469 L22.7519531,16.4355469 L22.7519531,4.5546875 L25.2763672,4.5546875 L25.2763672,16.4355469 Z M22.6015625,1.40722656 C22.6015625,0.956054688 22.7250977,0.608723958 22.972168,0.365234375 C23.2192383,0.121744792 23.5719401,0 24.0302734,0 C24.4742839,0 24.8198242,0.121744792 25.0668945,0.365234375 C25.3139648,0.608723958 25.4375,0.956054688 25.4375,1.40722656 C25.4375,1.83691406 25.3139648,2.17529297 25.0668945,2.42236328 C24.8198242,2.66943359 24.4742839,2.79296875 24.0302734,2.79296875 C23.5719401,2.79296875 23.2192383,2.66943359 22.972168,2.42236328 C22.7250977,2.17529297 22.6015625,1.83691406 22.6015625,1.40722656 Z" id="Shape"></path>
                        <path d="M38.8974609,16.4355469 L36.3623047,16.4355469 L36.3623047,9.109375 C36.3623047,8.19986979 36.1904297,7.52132161 35.8466797,7.07373047 C35.5029297,6.62613932 34.9658203,6.40234375 34.2353516,6.40234375 C33.2613932,6.40234375 32.5470378,6.71923828 32.0922852,7.35302734 C31.6375326,7.98681641 31.4101562,9.04134115 31.4101562,10.5166016 L31.4101562,16.4355469 L28.8857422,16.4355469 L28.8857422,4.5546875 L30.8623047,4.5546875 L31.2167969,6.11230469 L31.3457031,6.11230469 C31.6751302,5.54654948 32.1531576,5.10970052 32.7797852,4.80175781 C33.4064128,4.4938151 34.0957031,4.33984375 34.8476562,4.33984375 C36.6738281,4.33984375 37.8841146,4.96289062 38.4785156,6.20898438 L38.6503906,6.20898438 C39.0013021,5.62174479 39.4954427,5.16341146 40.1328125,4.83398438 C40.7701823,4.50455729 41.500651,4.33984375 42.3242188,4.33984375 C43.7421875,4.33984375 44.7752279,4.69791667 45.4233398,5.4140625 C46.0714518,6.13020833 46.3955078,7.22233073 46.3955078,8.69042969 L46.3955078,16.4355469 L43.8710938,16.4355469 L43.8710938,9.109375 C43.8710938,8.19986979 43.6974284,7.52132161 43.3500977,7.07373047 C43.0027669,6.62613932 42.4638672,6.40234375 41.7333984,6.40234375 C40.7522786,6.40234375 40.0343424,6.70849609 39.5795898,7.32080078 C39.1248372,7.93310547 38.8974609,8.87304688 38.8974609,10.140625 L38.8974609,16.4355469 Z" id="Path"></path>
                        <path d="M57.3525391,16.4355469 L56.8476562,14.78125 L56.7617188,14.78125 C56.1888021,15.5045573 55.6123047,15.9969076 55.0322266,16.2583008 C54.4521484,16.519694 53.7073568,16.6503906 52.7978516,16.6503906 C51.6305339,16.6503906 50.7192383,16.3352865 50.0639648,15.7050781 C49.4086914,15.0748698 49.0810547,14.1832682 49.0810547,13.0302734 C49.0810547,11.8056641 49.5358073,10.8818359 50.4453125,10.2587891 C51.3548177,9.63574219 52.7405599,9.29557292 54.6025391,9.23828125 L56.6542969,9.17382812 L56.6542969,8.54003906 C56.6542969,7.78092448 56.4770508,7.21337891 56.1225586,6.83740234 C55.7680664,6.46142578 55.2184245,6.2734375 54.4736328,6.2734375 C53.8649089,6.2734375 53.28125,6.36295573 52.7226562,6.54199219 C52.1640625,6.72102865 51.6269531,6.93229167 51.1113281,7.17578125 L50.2949219,5.37109375 C50.9394531,5.03450521 51.6448568,4.77848307 52.4111328,4.60302734 C53.1774089,4.42757161 53.9007161,4.33984375 54.5810547,4.33984375 C56.0921224,4.33984375 57.2325846,4.66927083 58.0024414,5.328125 C58.7722982,5.98697917 59.1572266,7.0218099 59.1572266,8.43261719 L59.1572266,16.4355469 L57.3525391,16.4355469 Z M53.5927734,14.7167969 C54.5094401,14.7167969 55.2452799,14.4607747 55.800293,13.9487305 C56.355306,13.4366862 56.6328125,12.71875 56.6328125,11.7949219 L56.6328125,10.7636719 L55.1074219,10.828125 C53.9186198,10.8710938 53.0538737,11.0698242 52.5131836,11.4243164 C51.9724935,11.7788086 51.7021484,12.3212891 51.7021484,13.0517578 C51.7021484,13.5817057 51.8597005,13.9916992 52.1748047,14.2817383 C52.4899089,14.5717773 52.9625651,14.7167969 53.5927734,14.7167969 Z M51.1435547,1.40722656 C51.1435547,0.963216146 51.2635091,0.642740885 51.503418,0.445800781 C51.7433268,0.248860677 52.0351562,0.150390625 52.3789062,0.150390625 C52.7584635,0.150390625 53.0610352,0.261393229 53.2866211,0.483398438 C53.512207,0.705403646 53.625,1.01334635 53.625,1.40722656 C53.625,1.78678385 53.5104167,2.09114583 53.28125,2.3203125 C53.0520833,2.54947917 52.7513021,2.6640625 52.3789062,2.6640625 C52.0351562,2.6640625 51.7433268,2.56022135 51.503418,2.35253906 C51.2635091,2.14485677 51.1435547,1.8297526 51.1435547,1.40722656 Z M55.3652344,1.40722656 C55.3652344,0.963216146 55.4851888,0.642740885 55.7250977,0.445800781 C55.9650065,0.248860677 56.2568359,0.150390625 56.6005859,0.150390625 C56.9801432,0.150390625 57.2845052,0.261393229 57.5136719,0.483398438 C57.7428385,0.705403646 57.8574219,1.01334635 57.8574219,1.40722656 C57.8574219,1.79394531 57.7392578,2.10009766 57.5029297,2.32568359 C57.2666016,2.55126953 56.9658203,2.6640625 56.6005859,2.6640625 C56.2568359,2.6640625 55.9650065,2.56022135 55.7250977,2.35253906 C55.4851888,2.14485677 55.3652344,1.8297526 55.3652344,1.40722656 Z" id="Shape"></path>
                        <path d="M68.7070312,4.33984375 C69.2154948,4.33984375 69.6344401,4.37565104 69.9638672,4.44726562 L69.7167969,6.79980469 C69.358724,6.71386719 68.9863281,6.67089844 68.5996094,6.67089844 C67.5898438,6.67089844 66.7716471,7.00032552 66.1450195,7.65917969 C65.5183919,8.31803385 65.2050781,9.17382812 65.2050781,10.2265625 L65.2050781,16.4355469 L62.6806641,16.4355469 L62.6806641,4.5546875 L64.6572266,4.5546875 L64.9902344,6.64941406 L65.1191406,6.64941406 C65.5130208,5.94042969 66.0268555,5.37825521 66.6606445,4.96289062 C67.2944336,4.54752604 67.9765625,4.33984375 68.7070312,4.33984375 Z" id="Path"></path>
                    </g>
                </g>
            </g>
        </g>
    </g>
</svg>