        {
            "property_group": "Acquisition Sensors-Video",
            "synonyms": [
                ["Camera", "RGB"],
                ["Thermal", "Thermographic"],
                ["Infra-red", "IR", "PIR"],
                ["Multispectral", "Multi-spectral"]
            ]
        },
        {
            "property_group": "Acquisition Sensors-Audio",
            "synonyms": [
                ["Microphone"],
                ["Audio sensor"],
                ["Microphone array", "Arrays of microphones"]
            ]
        },
        {
            "property_group": "Acquisition Sensors-Other",
            "synonyms": [
                ["Radar"],
                ["Electrodermal"],
                ["Electric"],
                ["Chemical"],
                ["Piezo", "Piezo-electric"],
                ["Multimodal", "Multi-modal"]
            ]
        },
        {
            "property_group": "Acquisition Platform",
            "synonyms": [
                ["Wearables", "Wearable device", "Smart watch", "Smart bracelet", "Smart necklace", "Smart belt", "Life belt", "Smart clothes", "Smart clothing", "Smart ring", "Bionic bra", "Smart bra"],
                ["Ambiental", "Environment"],
                ["Social robots", "Robotic device"],
                ["Diagnostic devices"]
            ]
        },
        {
            "property_group": "Acquisition Platform-Wearables",
            "synonyms": [
                ["Smart belt", "Life belt"],
                ["Smart bra", "Bionic bra"],
                ["Smart bracelet"],
                ["Smart clothes", "Smart clothing"],
                ["Smart necklace"],
                ["Smart ring"],
                ["Smart watch"],
                ["Wearables", "Wearable device"],
                ["Smart phone", "Mobile phone", "Mobile device"],
                ["Tablet"]
            ]
        },
