[
    {
        "property_group": "Deep Learning Algorithms",
        "synonyms": [
            ["DL", "Deep Learning"],
            ["CNNs", "Convolutional networks", "Convolutional nets", "Convolutional neural", "CNN"],
            ["RNNs", "Recurrent neural network", "Recurrent nets", "Recurrent neural", "RNN"],
            ["LSTM", "LSTMs", "Long short-term memory"],
            ["Auto-encoders"],
            ["Stacked Auto-Encoders"],
            ["Deep Boltzmann Machine", "DBM"],
            ["Deep Belief Networks", "DBN"],
            ["Mask R‐CNN", "Mask RCNN", "Mask Region‐based CNN",  "Mask Region CNN"]
        ]
    },
    {
        "property_group": "Ensemble Algorithms",
        "synonyms": [
            ["Ensemble classifiers", "Ensemble Algorithms", "Ensemble methods"],
            ["Boosting", "Boosted"],
            ["Bootstrapped Aggregation", "Bagging"],
            ["AdaBoost"],
            ["Weighted Average", "Blending"],
            ["Stacked Generalization", "Stacking"],
            ["Gradient Boosting Machines", "GBM"],
            ["Gradient Boosted Regression Trees", "GBRT"],
            ["Random Forest"],
            ["Extra Trees", "extratrees", "extremely randomized trees"],
            ["XGBoost"],
            ["GBT", "GBTs", "Gradient Boosted", "Gradient Tree"],
            ["Histogram-Based Gradient Boosting", "Histogram-Based Boosting", "Histogram-Based Gradient"],
            ["Decision Stump"],
            ["Stacked generalization"],
            ["Voting Classifier"],
            ["Voting Regressor"],
            ["AdaBoost"],
            ["LightGBM"],
            ["CatBoost"]
        ]
    },
    {
        "property_group": "Instance-based methods (XAI)",
        "synonyms": [
            ["Apriori algorithm"],
            ["k-Nearest Neighbor", "kNN"],
            ["Nearest Neighbors"],
            ["Nearest Centroid"],
            ["K-means"],
            ["K-medians"],
            ["SOM", "Self-organizing maps"],
            ["Growing neural gas", "Neural gas", "GNG"],
            ["Learning Vector Quantization", "LVQ"],
            ["Locally Weighted Learning", "LWL"],
            ["SVM", "Support Vector Machines"]
        ]
    },
    {
        "property_group": "Association Rule Learning Algorithms (XAI)",
        "synonyms": [
            ["Apriori algorithm"],
            ["Eclat algorithm"],
            ["Rough sets"],
            ["Fuzzy rules", "Fuzzy logic"],
            ["Rule-based machine learning", "RBML"],
            ["learning classifier systems"],
            ["association rule learning"],
            ["artificial immune systems"],
            ["RuleML"]
        ]
    },
    {
        "property_group": "Artificial Neural Network Algorithms",
        "synonyms": [
            ["Perceptron"],
            ["MLP", "Multilayer Perceptrons"],
            ["Back Propagation Neural Network", "Back-Propagation"],
            ["SGD", "Stochastic Gradient Descent"],
            ["Hopfield Network"],
            ["RBFN", "Radial Basis Function Network"],
            ["Restricted Boltzmann machines", "Unsupervised Restricted Boltzmann machines"]
        ]
    },
    {
        "property_group": "Clustering Algorithms",
        "synonyms": [
            ["K-means"],
            ["K-medians"],
            ["Hierarchical Clustering"],
            ["Expectation Maximisation"],
            ["SOM", "Self-organizing maps"],
            ["Growing neural gas", "Neural gas", "GNG"],
            ["Affinity Propagation"],
            ["Mean Shift"],
            ["Spectral clustering"],
            ["DBSCAN"],
            ["OPTICS"],
            ["BIRCH"],
            ["Biclustering"],
            ["Spectral Co-Clustering", "Spectral Coclustering"],
            ["Spectral Biclustering"],
            ["Biclustering evaluation"]
        ]
    },
    {
        "property_group": "Regularization Algorithms",
        "synonyms": [
            ["Ridge Regression"],
            ["Least Absolute Shrinkage and Selection Operator", "LASSO"],
            ["Elastic Net"],
            ["Least-Angle Regression", "LARS"]
        ]
    },
    {
        "property_group": "Bayesian Algorithms (XAI)",
        "synonyms": [
            ["Naive Bayes"],
            ["Gaussian Naive Bayes"],
            ["Multinomial Naive Bayes"],
            ["Complement Naive Bayes"],
            ["Bernoulli Naive Bayes"],
            ["Categorical Naive Bayes"],
            ["AODE", "Averaged One-Dependence Estimators"],
            ["BBN", "Bayesian Belief Network"],
            ["Bayesian Network", "Bayes Net", "BayesNet"]
        ]
    },
    {
        "property_group": "Decision Trees (XAI)",
        "synonyms": [
            ["Classification and Regression Tree", "CART"],
            ["Decision Trees"],
            ["ID3", "Iterative Dichotomiser 3"],
            ["C4.5", "C5.0"],
            ["CHAID", "Chi-squared Automatic Interaction Detection"],
            ["Decision Stump"],
            ["SLIQ"],
            ["M5"],
            ["Conditional Decision Trees"]
        ]
    },
    {
        "property_group": "Regression algorithms (XAI)",
        "synonyms": [
            ["Ordinary Least Squares Regression", "Ordinary Least Squares", "OLSR"],
            ["Linear Regression"],
            ["Logistic Regression"],
            ["Stepwise Regression"],
            ["Multivariate Adaptive Regression Splines", "MARS"],
            ["Locally Estimated Scatterplot Smoothing", "LOESS"]
        ]
    },
    {
        "property_group": "Evolutionary algorithms",
        "synonyms": [
            ["Genetic algorithms", "Genetic programming"],
            ["Evolutionary computation"],
            ["Bio-inspired algorithms"],
            ["Ant colony optimization", "ACO"],
            ["Swarm intelligence", "particle swarm optimization"],
            ["Mayfly optimization algorithm", "MA"],
            ["Memetic algorithm", "MA"],
            ["Bacteriologic algorithms", "BA", "bacterial foraging optimization"],
            ["Cultural algorithm", "CA"],
            ["Differential evolution", "DS"],
            ["Gaussian adaptation"],
            ["Simulated annealing", "SA"],
            ["Tabu search", "TS"],
            ["Extremal optimization", "EO"],
            ["Cross-entropy", "CE"],
            ["Reactive search optimization", "RSO"]
        ]
    },
    {
        "property_group": "Other ML algorithms",
        "synonyms": [
            ["Hidden Markov Models", "HMM"],
            ["Quadratic classifiers"],
            ["ANOVA"],
            ["Wilcoxon"]
        ]
    },
    {
        "property_group": "Dimensionality Reduction Algorithms",
        "synonyms": [
            ["Principal Component Analysis", "PCA"],
            ["Principal Component Regression", "PCR"],
            ["Partial Least Squares Regression", "PLSR"],
            ["Sammon Mapping"],
            ["Multidimensional Scaling", "MDS"],
            ["Projection Pursuit"],
            ["Linear Discriminant Analysis", "LDA"],
            ["Mixture Discriminant Analysis", "MDA"],
            ["Quadratic Discriminant Analysis", "QDA"],
            ["Flexible Discriminant Analysis", "FDA"]
        ]
    },
    {
        "property_group": "Decomposing signals / matrix factorization (Unsupervised)",
        "synonyms": [
            ["Principal component analysis", "PCA"],
            ["Kernel Principal Component Analysis", "kPCA"],
            ["Truncated singular value decomposition", "latent semantic analysis"],
            ["Dictionary Learning"],
            ["Factor Analysis"],
            ["Independent component analysis", "ICA"],
            ["Non-negative matrix factorization", "NMF", "NNMF"],
            ["Latent Dirichlet Allocation", "LDA"]
        ]
    },
    {
        "property_group": "Covariance estimation (Unsupervised)",
        "synonyms": [
            ["Empirical covariance"],
            ["Shrunk Covariance"],
            ["Sparse inverse covariance"],
            ["Robust Covariance Estimation"],
            ["Shrinkage"],
            ["Correlation"]
        ]
    },
    {
        "property_group": "Novelty and Outlier Detection (Unsupervised)",
        "synonyms": [
            ["Novelty Detection"],
            ["Outlier Detection"],
            ["Local Outlier Factor"]
        ]
    },
    {
        "property_group": "Density Estimation (Unsupervised)",
        "synonyms": [
            ["Density Estimation"],
            ["Histograms"],
            ["Kernel Density Estimation"]
        ]
    },
    {
        "property_group": "Gaussian mixture models (Unsupervised)",
        "synonyms": [
            ["Gaussian Mixture"],
            ["Gaussian mixture models", "GMM"],
            ["Variational Bayesian Gaussian Mixture"],
            ["Gaussian Process Classification", "GPC"],
            ["Gaussian Process Regression", "GPR"]
        ]
    },
    {
        "property_group": "Manifold learning (Unsupervised)",
        "synonyms": [
            ["Isomap"],
            ["Locally Linear Embedding"],
            ["Modified Locally Linear Embedding"],
            ["Hessian Eigenmapping"],
            ["Spectral Embedding"],
            ["Local Tangent Space Alignment"],
            ["Multi-dimensional Scaling", "MDS"],
            ["t-distributed Stochastic Neighbor Embedding", "t-SNE"]
        ]
    },
    {
        "property_group": "Supervised Linear Models - Regression",
        "synonyms": [
            ["Ridge regression"],
            ["Kernel ridge regression"],
            ["Least Angle Regression"],
            ["Bayesian Regression"],
            ["Logistic regression"],
            ["Generalized Linear Regression"],
            ["Robustness regression"],
            ["Quantile Regression"],
            ["Polynomial regression"]
        ]
    },
    {
        "property_group": "Supervised Linear Models - Classification",
        "synonyms": [
            ["Ordinary Least Squares"],
            ["Ridge classification"],
            ["Lasso"],
            ["Multi-task Lasso"],
            ["Elastic-Net"],
            ["Multi-task Elastic-Net"],
            ["LARS Lasso"],
            ["Orthogonal Matching Pursuit", "OMP)"],
            ["Stochastic Gradient Descent", "SGD"],
            ["Perceptron"],
            ["Passive Aggressive Algorithms"]
        ]
    },
    {
        "property_group": "Cross decomposition - Classification",
        "synonyms": [
            ["Ordinary Least Squares"],
            ["Ridge classification"],
            ["Lasso"],
            ["Multi-task Lasso"],
            ["Elastic-Net"],
            ["Multi-task Elastic-Net"],
            ["LARS Lasso"],
            ["Orthogonal Matching Pursuit", "OMP)"],
            ["Stochastic Gradient Descent", "SGD"],
            ["Perceptron"],
            ["Passive Aggressive Algorithms"],
            ["Cross decomposition"],
            ["PLSCanonical"],
            ["PLSSVD"],
            ["PLSRegression"],
            ["Canonical Correlation Analysis"]
        ]
    },
    {
        "property_group": "Time series",
        "synonyms": [
            ["ARIMA"],
            ["SARIMA"],
            ["Prophet"],
            ["LSTM"]
        ]
    },
    {
        "property_group": "ML Libraries",
        "synonyms": [
            ["Apache Singa"],
            ["Apache MXNet"],
            ["MLLib"],
            ["Mahout"],
            ["Caffe"],
            ["PyTorch"],
            ["mlpack"],
            ["TensorFlow"],
            ["Torch"],
            ["DistBelief"],
            ["CNTK"],
            ["Accord.Net"],
            ["Deeplearning4j"],
            ["Theano"],
            ["Scikit"],
            ["Keras"]
        ]
    }
]