
{
    "property_group": "Concerns",
    "synonyms": [
        ["Transparency"],
        ["Accessibility"],
        ["Availability"],
        ["Reliability"],
        ["Privacy"],
        ["Acceptance", "Adoption"],
        ["Ethical"],
        ["Legal"],
        ["Social"]
    ]
},