,Karpos_value_pm10__+3
2019-12-31 12:00:00,0.041739366948604584
2019-12-31 13:00:00,0.046957992017269135
2019-12-31 14:00:00,0.06202676147222519
2019-12-31 15:00:00,0.04174079746007919
2019-12-31 16:00:00,0.04461350291967392
2019-12-31 17:00:00,0.07623233646154404
2019-12-31 18:00:00,0.10896804183721542
2019-12-31 19:00:00,0.1025330051779747
2019-12-31 20:00:00,0.05966963618993759
2019-12-31 21:00:00,0.10369815677404404
2019-12-31 22:00:00,0.10923828929662704
2019-12-31 23:00:00,0.10023083537817001
2020-01-01 00:00:00,0.1239553913474083
2020-01-01 01:00:00,0.12769034504890442
2020-01-01 02:00:00,0.1312827169895172
2020-01-01 03:00:00,0.1464022696018219
2020-01-01 04:00:00,0.2174915373325348
2020-01-01 05:00:00,0.4155745804309845
2020-01-01 06:00:00,-0.029902078211307526
2020-01-01 07:00:00,0.34274429082870483
2020-01-01 08:00:00,-0.07960758358240128
2020-01-01 09:00:00,-0.07960758358240128
2020-01-01 10:00:00,-0.07960758358240128
2020-01-01 11:00:00,-0.07960758358240128
2020-01-01 12:00:00,-0.07960758358240128
2020-01-01 13:00:00,-0.07960758358240128
2020-01-01 14:00:00,-0.07960758358240128
2020-01-01 15:00:00,-0.07960758358240128
2020-01-01 16:00:00,-0.07960758358240128
2020-01-01 17:00:00,-0.07960758358240128
2020-01-01 18:00:00,0.11624529212713242
2020-01-01 19:00:00,0.10598506778478622
2020-01-01 20:00:00,0.08158399909734726
2020-01-01 21:00:00,0.106492780148983
2020-01-01 22:00:00,0.10473527759313583
2020-01-01 23:00:00,0.10182561725378036
2020-01-02 00:00:00,0.09335174411535263
2020-01-02 01:00:00,0.10768809169530869
2020-01-02 02:00:00,0.11817445605993271
2020-01-02 03:00:00,0.10915567725896835
2020-01-02 04:00:00,0.122719906270504
2020-01-02 05:00:00,0.12843993306159973
2020-01-02 06:00:00,0.1298169195652008
2020-01-02 07:00:00,0.13203886151313782
2020-01-02 08:00:00,0.1310988962650299
2020-01-02 09:00:00,0.1397031843662262
2020-01-02 10:00:00,0.13646629452705383
2020-01-02 11:00:00,0.13546517491340637
2020-01-02 12:00:00,0.13347211480140686
2020-01-02 13:00:00,0.13292840123176575
2020-01-02 14:00:00,0.12701228260993958
2020-01-02 15:00:00,0.13026204705238342
2020-01-02 16:00:00,0.12835338711738586
2020-01-02 17:00:00,0.12615302205085754
2020-01-02 18:00:00,0.1282590925693512
2020-01-02 19:00:00,0.1283142864704132
2020-01-02 20:00:00,0.12120714038610458
2020-01-02 21:00:00,0.12607493996620178
2020-01-02 22:00:00,0.12431170791387558
2020-01-02 23:00:00,0.09668471664190292
2020-01-03 00:00:00,0.09282615035772324
2020-01-03 01:00:00,0.10584618896245956
2020-01-03 02:00:00,0.11798276752233505
2020-01-03 03:00:00,0.11397840827703476
2020-01-03 04:00:00,0.125115305185318
2020-01-03 05:00:00,0.129479318857193
2020-01-03 06:00:00,0.12697795033454895
2020-01-03 07:00:00,0.12858858704566956
2020-01-03 08:00:00,0.12963023781776428
2020-01-03 09:00:00,0.12730374932289124
2020-01-03 10:00:00,0.12742844223976135
2020-01-03 11:00:00,0.12768259644508362
2020-01-03 12:00:00,0.1263517439365387
2020-01-03 13:00:00,0.12011518329381943
2020-01-03 14:00:00,0.12454893440008163
2020-01-03 15:00:00,0.12255921214818954
2020-01-03 16:00:00,0.11990322917699814
2020-01-03 17:00:00,0.12739494442939758
2020-01-03 18:00:00,0.13333645462989807
2020-01-03 19:00:00,0.1301434338092804
2020-01-03 20:00:00,0.13170161843299866
2020-01-03 21:00:00,0.1412656605243683
2020-01-03 22:00:00,0.13520780205726624
2020-01-03 23:00:00,0.13347211480140686
2020-01-04 00:00:00,0.14366665482521057
2020-01-04 01:00:00,0.3453194200992584
2020-01-04 02:00:00,0.13815322518348694
2020-01-04 03:00:00,0.39750543236732483
2020-01-04 04:00:00,-0.03139076381921768
2020-01-04 05:00:00,-0.07960758358240128
2020-01-04 06:00:00,-0.07960758358240128
2020-01-04 07:00:00,-0.07960758358240128
2020-01-04 08:00:00,-0.07960758358240128
2020-01-04 09:00:00,0.1380247175693512
2020-01-04 10:00:00,-0.07960758358240128
2020-01-04 11:00:00,-0.07960758358240128
2020-01-04 12:00:00,-0.07960758358240128
2020-01-04 13:00:00,-0.07960758358240128
2020-01-04 14:00:00,-0.07960758358240128
2020-01-04 15:00:00,-0.07960758358240128
2020-01-04 16:00:00,0.3217797577381134
2020-01-04 17:00:00,0.14263835549354553
2020-01-04 18:00:00,0.38601770997047424
2020-01-04 19:00:00,0.2625183165073395
2020-01-04 20:00:00,0.3392237722873688
2020-01-04 21:00:00,-0.07960758358240128
2020-01-04 22:00:00,-0.07960758358240128
2020-01-04 23:00:00,-0.034391142427921295
2020-01-05 00:00:00,-0.07960758358240128
2020-01-05 01:00:00,-0.07960758358240128
2020-01-05 02:00:00,-0.07960758358240128
2020-01-05 03:00:00,-0.07960758358240128
2020-01-05 04:00:00,-0.07960758358240128
2020-01-05 05:00:00,-0.07960758358240128
2020-01-05 06:00:00,-0.07960758358240128
2020-01-05 07:00:00,-0.07960758358240128
2020-01-05 08:00:00,-0.07960758358240128
2020-01-05 09:00:00,-0.07960758358240128
2020-01-05 10:00:00,0.3442991375923157
2020-01-05 11:00:00,-0.07960758358240128
2020-01-05 12:00:00,-0.07960758358240128
2020-01-05 13:00:00,-0.07960758358240128
2020-01-05 14:00:00,-0.07960758358240128
2020-01-05 15:00:00,-0.07960758358240128
2020-01-05 16:00:00,0.10618307441473007
2020-01-05 17:00:00,0.07881631702184677
2020-01-05 18:00:00,0.09712257236242294
2020-01-05 19:00:00,0.09455408900976181
2020-01-05 20:00:00,0.06987764686346054
2020-01-05 21:00:00,0.08541574329137802
2020-01-05 22:00:00,0.07824959605932236
2020-01-05 23:00:00,0.07919266074895859
2020-01-06 00:00:00,0.05685415118932724
2020-01-06 01:00:00,0.05299999564886093
2020-01-06 02:00:00,0.07071604579687119
2020-01-06 03:00:00,0.05897464603185654
2020-01-06 04:00:00,0.06041695922613144
2020-01-06 05:00:00,0.06697454303503036
2020-01-06 06:00:00,0.056667111814022064
2020-01-06 07:00:00,0.04887964576482773
2020-01-06 08:00:00,0.05915083736181259
2020-01-06 09:00:00,0.05700638145208359
2020-01-06 10:00:00,0.0584430918097496
2020-01-06 11:00:00,0.05697038024663925
2020-01-06 12:00:00,0.04325570911169052
2020-01-06 13:00:00,0.043520472943782806
2020-01-06 14:00:00,0.05106832832098007
2020-01-06 15:00:00,0.030837081372737885
2020-01-06 16:00:00,0.028329871594905853
2020-01-06 17:00:00,0.04730667918920517
2020-01-06 18:00:00,0.07780911773443222
2020-01-06 19:00:00,0.077645443379879
2020-01-06 20:00:00,0.05973818153142929
2020-01-06 21:00:00,0.06872083991765976
2020-01-06 22:00:00,0.0755249485373497
2020-01-06 23:00:00,0.06737842410802841
2020-01-07 00:00:00,0.059390805661678314
2020-01-07 01:00:00,0.0627540573477745
2020-01-07 02:00:00,0.06840803474187851
2020-01-07 03:00:00,0.06626071780920029
2020-01-07 04:00:00,0.07037713378667831
2020-01-07 05:00:00,0.07695426791906357
2020-01-07 06:00:00,0.05191376060247421
2020-01-07 07:00:00,0.054407261312007904
2020-01-07 08:00:00,0.07551159709692001
2020-01-07 09:00:00,0.07268299907445908
2020-01-07 10:00:00,0.07113947719335556
2020-01-07 11:00:00,0.06700649112462997
2020-01-07 12:00:00,0.02534773200750351
2020-01-07 13:00:00,0.026712678372859955
2020-01-07 14:00:00,0.061331771314144135
2020-01-07 15:00:00,0.0703515037894249
2020-01-07 16:00:00,0.0650109276175499
2020-01-07 17:00:00,0.06452431529760361
2020-01-07 18:00:00,0.09524967521429062
2020-01-07 19:00:00,0.0874808058142662
2020-01-07 20:00:00,0.047154806554317474
2020-01-07 21:00:00,0.080225370824337
2020-01-07 22:00:00,0.08700229972600937
2020-01-07 23:00:00,0.041779182851314545
2020-01-08 00:00:00,0.04526104778051376
2020-01-08 01:00:00,0.07280340045690536
2020-01-08 02:00:00,0.09176649898290634
2020-01-08 03:00:00,0.06945361942052841
2020-01-08 04:00:00,0.08780565112829208
2020-01-08 05:00:00,0.12604108452796936
2020-01-08 06:00:00,0.12670102715492249
2020-01-08 07:00:00,0.12860777974128723
2020-01-08 08:00:00,0.20342960953712463
2020-01-08 09:00:00,0.14129260182380676
2020-01-08 10:00:00,0.21740606427192688
2020-01-08 11:00:00,-0.07960758358240128
2020-01-08 12:00:00,0.1337001621723175
2020-01-08 13:00:00,0.1261862814426422
2020-01-08 14:00:00,0.12408306449651718
2020-01-08 15:00:00,0.12075831741094589
2020-01-08 16:00:00,0.1108412966132164
2020-01-08 17:00:00,0.1162051185965538
2020-01-08 18:00:00,0.12835565209388733
2020-01-08 19:00:00,0.12727215886116028
2020-01-08 20:00:00,0.11691584438085556
2020-01-08 21:00:00,0.12841466069221497
2020-01-08 22:00:00,0.12753596901893616
2020-01-08 23:00:00,0.10987069457769394
2020-01-09 00:00:00,0.114410899579525
2020-01-09 01:00:00,0.11866261810064316
2020-01-09 02:00:00,0.12450303882360458
2020-01-09 03:00:00,0.12110497802495956
2020-01-09 04:00:00,0.1273520290851593
2020-01-09 05:00:00,0.14916041493415833
2020-01-09 06:00:00,0.1366688311100006
2020-01-09 07:00:00,0.18007507920265198
2020-01-09 08:00:00,0.18416598439216614
2020-01-09 09:00:00,0.36326876282691956
2020-01-09 10:00:00,-0.07960758358240128
2020-01-09 11:00:00,-0.07960758358240128
2020-01-09 12:00:00,0.13351503014564514
2020-01-09 13:00:00,0.1281968653202057
2020-01-09 14:00:00,0.13232234120368958
2020-01-09 15:00:00,0.12256135791540146
2020-01-09 16:00:00,0.12377753108739853
2020-01-09 17:00:00,0.1283034384250641
2020-01-09 18:00:00,0.13038364052772522
2020-01-09 19:00:00,0.12650564312934875
2020-01-09 20:00:00,0.1248415932059288
2020-01-09 21:00:00,0.14484968781471252
2020-01-09 22:00:00,0.13456836342811584
2020-01-09 23:00:00,0.12886586785316467
2020-01-10 00:00:00,0.18354585766792297
2020-01-10 01:00:00,0.15377071499824524
2020-01-10 02:00:00,0.16706600785255432
2020-01-10 03:00:00,0.36667969822883606
2020-01-10 04:00:00,-0.04537687450647354
2020-01-10 05:00:00,-0.07960758358240128
2020-01-10 06:00:00,-0.07960758358240128
2020-01-10 07:00:00,-0.07960758358240128
2020-01-10 08:00:00,-0.07960758358240128
2020-01-10 09:00:00,-0.07960758358240128
2020-01-10 10:00:00,-0.07960758358240128
2020-01-10 11:00:00,-0.07960758358240128
2020-01-10 12:00:00,-0.07960758358240128
2020-01-10 13:00:00,-0.07960758358240128
2020-01-10 14:00:00,0.4913780987262726
2020-01-10 15:00:00,-0.07960758358240128
2020-01-10 16:00:00,-0.07960758358240128
2020-01-10 17:00:00,-0.07960758358240128
2020-01-10 18:00:00,-0.07960758358240128
2020-01-10 19:00:00,-0.07960758358240128
2020-01-10 20:00:00,-0.07960758358240128
2020-01-10 21:00:00,-0.07960758358240128
2020-01-10 22:00:00,-0.07960758358240128
2020-01-10 23:00:00,-0.07960758358240128
2020-01-11 00:00:00,-0.07960758358240128
2020-01-11 01:00:00,-0.07960758358240128
2020-01-11 02:00:00,-0.07960758358240128
2020-01-11 03:00:00,-0.07960758358240128
2020-01-11 04:00:00,-0.07960758358240128
2020-01-11 05:00:00,-0.07960758358240128
2020-01-11 06:00:00,-0.07960758358240128
2020-01-11 07:00:00,-0.07960758358240128
2020-01-11 08:00:00,-0.07960758358240128
2020-01-11 09:00:00,-0.07960758358240128
2020-01-11 10:00:00,-0.07960758358240128
2020-01-11 11:00:00,0.13782373070716858
2020-01-11 12:00:00,-0.07960758358240128
2020-01-11 13:00:00,-0.07960758358240128
2020-01-11 14:00:00,-0.07960758358240128
2020-01-11 15:00:00,-0.07960758358240128
2020-01-11 16:00:00,-0.07960758358240128
2020-01-11 17:00:00,-0.07960758358240128
2020-01-11 18:00:00,-0.07960758358240128
2020-01-11 19:00:00,-0.07960758358240128
2020-01-11 20:00:00,-0.07960758358240128
2020-01-11 21:00:00,-0.07960758358240128
2020-01-11 22:00:00,-0.07960758358240128
2020-01-11 23:00:00,-0.07960758358240128
2020-01-12 00:00:00,-0.07960758358240128
2020-01-12 01:00:00,-0.07960758358240128
2020-01-12 02:00:00,-0.06861565262079239
2020-01-12 03:00:00,-0.03644905239343643
2020-01-12 04:00:00,-0.06275484710931778
2020-01-12 05:00:00,-0.07960758358240128
2020-01-12 06:00:00,-0.07960758358240128
2020-01-12 07:00:00,-0.07960758358240128
2020-01-12 08:00:00,-0.07960758358240128
2020-01-12 09:00:00,0.13380923867225647
2020-01-12 10:00:00,0.1359429657459259
2020-01-12 11:00:00,0.131235271692276
2020-01-12 12:00:00,0.14282086491584778
2020-01-12 13:00:00,0.13282540440559387
2020-01-12 14:00:00,0.13907471299171448
2020-01-12 15:00:00,0.13387718796730042
2020-01-12 16:00:00,0.12834671139717102
2020-01-12 17:00:00,0.12718096375465393
2020-01-12 18:00:00,0.1246742233633995
2020-01-12 19:00:00,0.12347330898046494
2020-01-12 20:00:00,0.12255074828863144
2020-01-12 21:00:00,0.11796297878026962
2020-01-12 22:00:00,0.1198061928153038
2020-01-12 23:00:00,0.12086846679449081
2020-01-13 00:00:00,0.12259962409734726
2020-01-13 01:00:00,0.12420322746038437
2020-01-13 02:00:00,0.12692371010780334
2020-01-13 03:00:00,0.12937763333320618
2020-01-13 04:00:00,0.13392022252082825
2020-01-13 05:00:00,0.14055636525154114
2020-01-13 06:00:00,0.13879910111427307
2020-01-13 07:00:00,0.13435545563697815
2020-01-13 08:00:00,0.13772788643836975
2020-01-13 09:00:00,0.154076486825943
2020-01-13 10:00:00,0.15933433175086975
2020-01-13 11:00:00,0.15205052495002747
2020-01-13 12:00:00,0.13656309247016907
2020-01-13 13:00:00,0.1551453173160553
2020-01-13 14:00:00,0.15214493870735168
2020-01-13 15:00:00,0.12738600373268127
2020-01-13 16:00:00,0.13053157925605774
2020-01-13 17:00:00,0.13326779007911682
2020-01-13 18:00:00,0.13109233975410461
2020-01-13 19:00:00,0.1304965317249298
2020-01-13 20:00:00,0.13115635514259338
2020-01-13 21:00:00,0.13157573342323303
2020-01-13 22:00:00,0.1330048143863678
2020-01-13 23:00:00,0.13427606225013733
2020-01-14 00:00:00,0.13802745938301086
2020-01-14 01:00:00,0.13556137681007385
2020-01-14 02:00:00,0.1292039453983307
2020-01-14 03:00:00,0.12888887524604797
2020-01-14 04:00:00,0.12813213467597961
2020-01-14 05:00:00,0.12774410843849182
2020-01-14 06:00:00,0.12560716271400452
2020-01-14 07:00:00,0.12814024090766907
2020-01-14 08:00:00,0.12580254673957825
2020-01-14 09:00:00,0.12242772430181503
2020-01-14 10:00:00,0.12156476825475693
2020-01-14 11:00:00,0.12250974029302597
2020-01-14 12:00:00,0.12020959705114365
2020-01-14 13:00:00,0.1207977756857872
2020-01-14 14:00:00,0.12159266322851181
2020-01-14 15:00:00,0.12067367881536484
2020-01-14 16:00:00,0.11898329108953476
2020-01-14 17:00:00,0.11747290939092636
2020-01-14 18:00:00,0.11779787391424179
2020-01-14 19:00:00,0.11486949771642685
2020-01-14 20:00:00,0.1150217279791832
2020-01-14 21:00:00,0.11798848956823349
2020-01-14 22:00:00,0.11888696998357773
2020-01-14 23:00:00,0.12184884399175644
2020-01-15 00:00:00,0.1237431988120079
2020-01-15 01:00:00,0.12462272495031357
2020-01-15 02:00:00,0.12622562050819397
2020-01-15 03:00:00,0.1260475218296051
2020-01-15 04:00:00,0.12514939904212952
2020-01-15 05:00:00,0.12611594796180725
2020-01-15 06:00:00,0.12515106797218323
2020-01-15 07:00:00,0.1239485964179039
2020-01-15 08:00:00,0.12417354434728622
2020-01-15 09:00:00,0.12434353679418564
2020-01-15 10:00:00,0.12439753860235214
2020-01-15 11:00:00,0.12489321082830429
2020-01-15 12:00:00,0.12360646575689316
2020-01-15 13:00:00,0.12359001487493515
2020-01-15 14:00:00,0.12260367721319199
2020-01-15 15:00:00,0.12003185600042343
2020-01-15 16:00:00,0.11950340121984482
2020-01-15 17:00:00,0.11816778033971786
2020-01-15 18:00:00,0.11637570708990097
2020-01-15 19:00:00,0.10514762252569199
2020-01-15 20:00:00,0.10066475719213486
2020-01-15 21:00:00,0.10574045032262802
2020-01-15 22:00:00,0.097917340695858
2020-01-15 23:00:00,0.10284843295812607
2020-01-16 00:00:00,0.10758008807897568
2020-01-16 01:00:00,0.11580457538366318
2020-01-16 02:00:00,0.1138235554099083
2020-01-16 03:00:00,0.11443641036748886
2020-01-16 04:00:00,0.11630334705114365
2020-01-16 05:00:00,0.11470689624547958
2020-01-16 06:00:00,0.10640492290258408
2020-01-16 07:00:00,0.10534324496984482
2020-01-16 08:00:00,0.10547199100255966
2020-01-16 09:00:00,0.10258450359106064
2020-01-16 10:00:00,0.09827377647161484
2020-01-16 11:00:00,0.09599532932043076
2020-01-16 12:00:00,0.08828666061162949
2020-01-16 13:00:00,0.08207442611455917
2020-01-16 14:00:00,0.08275165408849716
2020-01-16 15:00:00,0.07315780967473984
2020-01-16 16:00:00,0.06992246955633163
2020-01-16 17:00:00,0.06905045360326767
2020-01-16 18:00:00,0.06442036479711533
2020-01-16 19:00:00,0.04444410651922226
2020-01-16 20:00:00,0.04269244521856308
2020-01-16 21:00:00,0.06092073768377304
2020-01-16 22:00:00,0.06417622417211533
2020-01-16 23:00:00,0.06432118266820908
2020-01-17 00:00:00,0.0927371010184288
2020-01-17 01:00:00,0.1170584186911583
2020-01-17 02:00:00,0.12580135464668274
2020-01-17 03:00:00,0.1287645399570465
2020-01-17 04:00:00,0.13482728600502014
2020-01-17 05:00:00,0.14838328957557678
2020-01-17 06:00:00,0.1479795277118683
2020-01-17 07:00:00,0.1538490355014801
2020-01-17 08:00:00,0.17144611477851868
2020-01-17 09:00:00,0.3928586542606354
2020-01-17 10:00:00,0.13706830143928528
2020-01-17 11:00:00,0.04069044440984726
2020-01-17 12:00:00,-0.07960758358240128
2020-01-17 13:00:00,-0.07960758358240128
2020-01-17 14:00:00,-0.07960758358240128
2020-01-17 15:00:00,-0.07960758358240128
2020-01-17 16:00:00,0.14855650067329407
2020-01-17 17:00:00,0.1464567482471466
2020-01-17 18:00:00,0.17439189553260803
2020-01-17 19:00:00,0.16035571694374084
2020-01-17 20:00:00,0.19141355156898499
2020-01-17 21:00:00,0.16494491696357727
2020-01-17 22:00:00,0.17656543850898743
2020-01-17 23:00:00,0.1309608519077301
2020-01-18 00:00:00,0.17683830857276917
2020-01-18 01:00:00,-0.12181005626916885
2020-01-18 02:00:00,0.1434711515903473
2020-01-18 03:00:00,0.13243547081947327
2020-01-18 04:00:00,0.15275827050209045
2020-01-18 05:00:00,0.3107210695743561
2020-01-18 06:00:00,0.39904800057411194
2020-01-18 07:00:00,-0.07960758358240128
2020-01-18 08:00:00,-0.07960758358240128
2020-01-18 09:00:00,-0.03153262287378311
2020-01-18 10:00:00,-0.07960758358240128
2020-01-18 11:00:00,0.1320343315601349
2020-01-18 12:00:00,0.14808788895606995
2020-01-18 13:00:00,0.1265646517276764
2020-01-18 14:00:00,0.12833943963050842
2020-01-18 15:00:00,0.126177579164505
2020-01-18 16:00:00,0.12443091720342636
2020-01-18 17:00:00,0.12370016425848007
2020-01-18 18:00:00,0.12563911080360413
2020-01-18 19:00:00,0.1259162724018097
2020-01-18 20:00:00,0.12142529338598251
2020-01-18 21:00:00,0.126499205827713
2020-01-18 22:00:00,0.12605872750282288
2020-01-18 23:00:00,0.12382795661687851
2020-01-19 00:00:00,0.1267358362674713
2020-01-19 01:00:00,0.12721958756446838
2020-01-19 02:00:00,0.1282881796360016
2020-01-19 03:00:00,0.12862923741340637
2020-01-19 04:00:00,0.12828150391578674
2020-01-19 05:00:00,0.12903252243995667
2020-01-19 06:00:00,0.1274367868900299
2020-01-19 07:00:00,0.12707415223121643
2020-01-19 08:00:00,0.12765124440193176
2020-01-19 09:00:00,0.126496821641922
2020-01-19 10:00:00,0.12807312607765198
2020-01-19 11:00:00,0.1267348825931549
2020-01-19 12:00:00,0.12539151310920715
2020-01-19 13:00:00,0.12729457020759583
2020-01-19 14:00:00,0.12766757607460022
2020-01-19 15:00:00,0.12765374779701233
2020-01-19 16:00:00,0.12791898846626282
2020-01-19 17:00:00,0.1282290518283844
2020-01-19 18:00:00,0.12911179661750793
2020-01-19 19:00:00,0.13035288453102112
2020-01-19 20:00:00,0.129129558801651
2020-01-19 21:00:00,0.13167443871498108
2020-01-19 22:00:00,0.1300235092639923
2020-01-19 23:00:00,0.12915638089179993
2020-01-20 00:00:00,0.1297188103199005
2020-01-20 01:00:00,0.13143625855445862
2020-01-20 02:00:00,0.13308921456336975
2020-01-20 03:00:00,0.13211432099342346
2020-01-20 04:00:00,0.12652340531349182
2020-01-20 05:00:00,0.12707629799842834
2020-01-20 06:00:00,0.1259852945804596
2020-01-20 07:00:00,0.12334921211004257
2020-01-20 08:00:00,0.11151006072759628
2020-01-20 09:00:00,0.09862663596868515
2020-01-20 10:00:00,0.09685399383306503
2020-01-20 11:00:00,0.08579304069280624
2020-01-20 12:00:00,0.07659687846899033
2020-01-20 13:00:00,0.07841088622808456
2020-01-20 14:00:00,0.07002010196447372
2020-01-20 15:00:00,0.06672825664281845
2020-01-20 16:00:00,0.06985463947057724
2020-01-20 17:00:00,0.07924964278936386
2020-01-20 18:00:00,0.08173897117376328
2020-01-20 19:00:00,0.08230700343847275
2020-01-20 20:00:00,0.09018554538488388
2020-01-20 21:00:00,0.0977194532752037
2020-01-20 22:00:00,0.10530402511358261
2020-01-20 23:00:00,0.10470666736364365
2020-01-21 00:00:00,0.10435798019170761
2020-01-21 01:00:00,0.11111464351415634
2020-01-21 02:00:00,0.11663021892309189
2020-01-21 03:00:00,0.1124817356467247
2020-01-21 04:00:00,0.1155874952673912
2020-01-21 05:00:00,0.12060179561376572
2020-01-21 06:00:00,0.11287548393011093
2020-01-21 07:00:00,0.11595966666936874
2020-01-21 08:00:00,0.12488832324743271
2020-01-21 09:00:00,0.11492445319890976
2020-01-21 10:00:00,0.11967923492193222
2020-01-21 11:00:00,0.12780585885047913
2020-01-21 12:00:00,0.11637105792760849
2020-01-21 13:00:00,0.11516287177801132
2020-01-21 14:00:00,0.10426857322454453
2020-01-21 15:00:00,0.08467664569616318
2020-01-21 16:00:00,0.08984031528234482
2020-01-21 17:00:00,0.10681917518377304
2020-01-21 18:00:00,0.12105288356542587
2020-01-21 19:00:00,0.10653295367956161
2020-01-21 20:00:00,0.04884912818670273
2020-01-21 21:00:00,0.11029627174139023
2020-01-21 22:00:00,0.1062779650092125
2020-01-21 23:00:00,0.07095196098089218
2020-01-22 00:00:00,0.11143245548009872
2020-01-22 01:00:00,0.11580540984869003
2020-01-22 02:00:00,0.1248345598578453
2020-01-22 03:00:00,0.07107534259557724
2020-01-22 04:00:00,0.12458672374486923
2020-01-22 05:00:00,0.16016140580177307
2020-01-22 06:00:00,0.16466417908668518
2020-01-22 07:00:00,0.1374315321445465
2020-01-22 08:00:00,0.1266266405582428
2020-01-22 09:00:00,0.37656763195991516
2020-01-22 10:00:00,0.15027180314064026
2020-01-22 11:00:00,0.15507736802101135
2020-01-22 12:00:00,0.25132909417152405
2020-01-22 13:00:00,0.16291633248329163
2020-01-22 14:00:00,0.13322368264198303
2020-01-22 15:00:00,0.15976205468177795
2020-01-22 16:00:00,0.1704593002796173
2020-01-22 17:00:00,0.1480506956577301
2020-01-22 18:00:00,0.2658825218677521
2020-01-22 19:00:00,0.36921003460884094
2020-01-22 20:00:00,0.1305023729801178
2020-01-22 21:00:00,0.2524994909763336
2020-01-22 22:00:00,0.1734553873538971
2020-01-22 23:00:00,0.12511184811592102
2020-01-23 00:00:00,-0.07960758358240128
2020-01-23 01:00:00,-0.07960758358240128
2020-01-23 02:00:00,-0.07960758358240128
2020-01-23 03:00:00,-0.07960758358240128
2020-01-23 04:00:00,-0.07960758358240128
2020-01-23 05:00:00,-0.07960758358240128
2020-01-23 06:00:00,-0.07960758358240128
2020-01-23 07:00:00,-0.07960758358240128
2020-01-23 08:00:00,-0.07960758358240128
2020-01-23 09:00:00,-0.07960758358240128
2020-01-23 10:00:00,-0.07960758358240128
2020-01-23 11:00:00,0.10656393319368362
2020-01-23 12:00:00,0.135746031999588
2020-01-23 13:00:00,-0.07960758358240128
2020-01-23 14:00:00,-0.07960758358240128
2020-01-23 15:00:00,-0.07960758358240128
2020-01-23 16:00:00,-0.07960758358240128
2020-01-23 17:00:00,-0.07960758358240128
2020-01-23 18:00:00,-0.07960758358240128
2020-01-23 19:00:00,-0.07960758358240128
2020-01-23 20:00:00,-0.09981880336999893
2020-01-23 21:00:00,-0.10755131393671036
2020-01-23 22:00:00,0.13022378087043762
2020-01-23 23:00:00,0.12911191582679749
2020-01-24 00:00:00,0.12740901112556458
2020-01-24 01:00:00,0.12707021832466125
2020-01-24 02:00:00,0.12983790040016174
2020-01-24 03:00:00,0.1268174946308136
2020-01-24 04:00:00,0.1299779713153839
2020-01-24 05:00:00,0.1374436914920807
2020-01-24 06:00:00,0.12844708561897278
2020-01-24 07:00:00,0.13374903798103333
2020-01-24 08:00:00,0.13482525944709778
2020-01-24 09:00:00,0.13961246609687805
2020-01-24 10:00:00,0.1376759111881256
2020-01-24 11:00:00,0.1315470039844513
2020-01-24 12:00:00,0.13052549958229065
2020-01-24 13:00:00,0.12869420647621155
2020-01-24 14:00:00,0.12939849495887756
2020-01-24 15:00:00,0.1269259750843048
2020-01-24 16:00:00,0.1271832287311554
2020-01-24 17:00:00,0.12912681698799133
2020-01-24 18:00:00,0.1390182077884674
2020-01-24 19:00:00,0.13159671425819397
2020-01-24 20:00:00,0.13077321648597717
2020-01-24 21:00:00,0.1349257528781891
2020-01-24 22:00:00,0.14412179589271545
2020-01-24 23:00:00,0.12726226449012756
2020-01-25 00:00:00,0.15433934330940247
2020-01-25 01:00:00,0.1339963972568512
2020-01-25 02:00:00,0.13876941800117493
2020-01-25 03:00:00,0.1669541895389557
2020-01-25 04:00:00,0.12741604447364807
2020-01-25 05:00:00,-0.07960758358240128
2020-01-25 06:00:00,-0.05633900314569473
2020-01-25 07:00:00,-0.07960758358240128
2020-01-25 08:00:00,-0.07960758358240128
2020-01-25 09:00:00,-0.07960758358240128
2020-01-25 10:00:00,-0.07960758358240128
2020-01-25 11:00:00,-0.07960758358240128
2020-01-25 12:00:00,-0.07960758358240128
2020-01-25 13:00:00,0.12209834903478622
2020-01-25 14:00:00,0.1679859459400177
2020-01-25 15:00:00,0.15771475434303284
2020-01-25 16:00:00,0.20983710885047913
2020-01-25 17:00:00,0.17347469925880432
2020-01-25 18:00:00,0.2920350134372711
2020-01-25 19:00:00,0.26358023285865784
2020-01-25 20:00:00,0.1219339594244957
2020-01-25 21:00:00,-0.07960758358240128
2020-01-25 22:00:00,-0.07960758358240128
2020-01-25 23:00:00,-0.07960758358240128
2020-01-26 00:00:00,-0.07960758358240128
2020-01-26 01:00:00,-0.07960758358240128
2020-01-26 02:00:00,0.3732052147388458
2020-01-26 03:00:00,0.13691309094429016
2020-01-26 04:00:00,-0.07960758358240128
2020-01-26 05:00:00,-0.07960758358240128
2020-01-26 06:00:00,-0.07960758358240128
2020-01-26 07:00:00,-0.07960758358240128
2020-01-26 08:00:00,-0.07960758358240128
2020-01-26 09:00:00,-0.07960758358240128
2020-01-26 10:00:00,0.7176221013069153
2020-01-26 11:00:00,0.6524278521537781
2020-01-26 12:00:00,0.659155547618866
2020-01-26 13:00:00,-0.07960758358240128
2020-01-26 14:00:00,-0.07960758358240128
2020-01-26 15:00:00,0.10979900509119034
2020-01-26 16:00:00,0.38690221309661865
2020-01-26 17:00:00,-0.07960758358240128
2020-01-26 18:00:00,-0.07960758358240128
2020-01-26 19:00:00,-0.07960758358240128
2020-01-26 20:00:00,-0.07960758358240128
2020-01-26 21:00:00,-0.07960758358240128
2020-01-26 22:00:00,-0.07960758358240128
2020-01-26 23:00:00,-0.07960758358240128
2020-01-27 00:00:00,0.596264660358429
2020-01-27 01:00:00,-0.07960758358240128
2020-01-27 02:00:00,-0.07960758358240128
2020-01-27 03:00:00,-0.07960758358240128
2020-01-27 04:00:00,-0.07960758358240128
2020-01-27 05:00:00,-0.07960758358240128
2020-01-27 06:00:00,-0.07960758358240128
2020-01-27 07:00:00,-0.07960758358240128
2020-01-27 08:00:00,0.10994180291891098
2020-01-27 09:00:00,0.606398344039917
2020-01-27 10:00:00,0.5121277570724487
2020-01-27 11:00:00,0.6005216836929321
2020-01-27 12:00:00,0.530904233455658
2020-01-27 13:00:00,0.6827853918075562
2020-01-27 14:00:00,-0.07960758358240128
2020-01-27 15:00:00,-0.07960758358240128
2020-01-27 16:00:00,-0.07960758358240128
2020-01-27 17:00:00,-0.07960758358240128
2020-01-27 18:00:00,-0.07960758358240128
2020-01-27 19:00:00,-0.07960758358240128
2020-01-27 20:00:00,0.3606003224849701
2020-01-27 21:00:00,0.5973536968231201
2020-01-27 22:00:00,-0.07960758358240128
2020-01-27 23:00:00,-0.07960758358240128
2020-01-28 00:00:00,-0.07960758358240128
2020-01-28 01:00:00,-0.07960758358240128
2020-01-28 02:00:00,-0.07960758358240128
2020-01-28 03:00:00,-0.07960758358240128
2020-01-28 04:00:00,-0.07960758358240128
2020-01-28 05:00:00,-0.07960758358240128
2020-01-28 06:00:00,-0.07960758358240128
2020-01-28 07:00:00,-0.07960758358240128
2020-01-28 08:00:00,-0.07960758358240128
2020-01-28 09:00:00,-0.07960758358240128
2020-01-28 10:00:00,-0.07960758358240128
2020-01-28 11:00:00,-0.07960758358240128
2020-01-28 12:00:00,-0.07960758358240128
2020-01-28 13:00:00,-0.030490495264530182
2020-01-28 14:00:00,-0.07960758358240128
2020-01-28 15:00:00,0.13634911179542542
2020-01-28 16:00:00,0.12839117646217346
2020-01-28 17:00:00,0.12555661797523499
2020-01-28 18:00:00,0.13050785660743713
2020-01-28 19:00:00,0.131687194108963
2020-01-28 20:00:00,0.13333740830421448
2020-01-28 21:00:00,0.13190332055091858
2020-01-28 22:00:00,0.12930002808570862
2020-01-28 23:00:00,0.12784340977668762
2020-01-29 00:00:00,0.12659361958503723
2020-01-29 01:00:00,0.1274259388446808
2020-01-29 02:00:00,0.1312185823917389
2020-01-29 03:00:00,0.13282564282417297
2020-01-29 04:00:00,0.22199395298957825
2020-01-29 05:00:00,-0.06245378404855728
2020-01-29 06:00:00,-0.05011186748743057
2020-01-29 07:00:00,-0.07960758358240128
2020-01-29 08:00:00,-0.07960758358240128
2020-01-29 09:00:00,-0.07960758358240128
2020-01-29 10:00:00,-0.07960758358240128
2020-01-29 11:00:00,-0.07960758358240128
2020-01-29 12:00:00,-0.07960758358240128
2020-01-29 13:00:00,-0.07960758358240128
2020-01-29 14:00:00,-0.07960758358240128
2020-01-29 15:00:00,-0.07960758358240128
2020-01-29 16:00:00,-0.07960758358240128
2020-01-29 17:00:00,-0.07960758358240128
2020-01-29 18:00:00,-0.07960758358240128
2020-01-29 19:00:00,-0.07960757613182068
2020-01-29 20:00:00,0.13114133477210999
2020-01-29 21:00:00,0.12351598590612411
2020-01-29 22:00:00,0.08525683730840683
2020-01-29 23:00:00,0.10489179939031601
2020-01-30 00:00:00,0.08491339534521103
2020-01-30 01:00:00,0.09707095474004745
2020-01-30 02:00:00,0.11927797645330429
2020-01-30 03:00:00,0.12389316409826279
2020-01-30 04:00:00,0.12664440274238586
2020-01-30 05:00:00,0.1287405788898468
2020-01-30 06:00:00,0.12670019268989563
2020-01-30 07:00:00,0.12853339314460754
2020-01-30 08:00:00,0.13310924172401428
2020-01-30 09:00:00,0.12793949246406555
2020-01-30 10:00:00,0.12130071967840195
2020-01-30 11:00:00,0.1224450096487999
2020-01-30 12:00:00,0.1053319200873375
2020-01-30 13:00:00,0.07763757556676865
2020-01-30 14:00:00,0.08448042720556259
2020-01-30 15:00:00,0.03245427459478378
2020-01-30 16:00:00,0.037891410291194916
2020-01-30 17:00:00,0.08450498431921005
2020-01-30 18:00:00,0.10821106284856796
2020-01-30 19:00:00,0.1077137216925621
2020-01-30 20:00:00,0.074188731610775
2020-01-30 21:00:00,0.11490275710821152
2020-01-30 22:00:00,0.11360564082860947
2020-01-30 23:00:00,0.07348217815160751
2020-01-31 00:00:00,0.10254719108343124
2020-01-31 01:00:00,0.10871293395757675
2020-01-31 02:00:00,0.11593081802129745
2020-01-31 03:00:00,0.11039843410253525
2020-01-31 04:00:00,0.11891331523656845
2020-01-31 05:00:00,0.1304638683795929
2020-01-31 06:00:00,0.12796750664710999
2020-01-31 07:00:00,0.13573017716407776
2020-01-31 08:00:00,0.13794603943824768
2020-01-31 09:00:00,0.13160982728004456
2020-01-31 10:00:00,0.12766602635383606
2020-01-31 11:00:00,0.12614884972572327
2020-01-31 12:00:00,0.12775805592536926
2020-01-31 13:00:00,0.12591496109962463
