,Karpos_value_pm10__+12
2020-01-01 00:00:00,0.030642199772770204
2020-01-01 01:00:00,0.03230098796260074
2020-01-01 02:00:00,0.0284219195940475
2020-01-01 03:00:00,0.025475745654618208
2020-01-01 04:00:00,0.03422414618913803
2020-01-01 05:00:00,0.05622165982640415
2020-01-01 06:00:00,0.07561507508590688
2020-01-01 07:00:00,0.12586529008724745
2020-01-01 08:00:00,0.1868870321145375
2020-01-01 09:00:00,0.24894720252082714
2020-01-01 10:00:00,0.16999924542155515
2020-01-01 11:00:00,0.21658060369486556
2020-01-01 12:00:00,0.20355797115797822
2020-01-01 13:00:00,0.14261414872045436
2020-01-01 14:00:00,0.19648826684034457
2020-01-01 15:00:00,0.26226845546354927
2020-01-01 16:00:00,0.1514023653090855
2020-01-01 17:00:00,0.1080705108067942
2020-01-01 18:00:00,0.12179206493869986
2020-01-01 19:00:00,0.140108520153934
2020-01-01 20:00:00,0.15925297804283758
2020-01-01 21:00:00,0.19572212889591256
2020-01-01 22:00:00,0.1137353077957586
2020-01-01 23:00:00,0.06112224545420004
2020-01-02 00:00:00,0.03294232612452257
2020-01-02 01:00:00,0.02808048622680273
2020-01-02 02:00:00,0.02780648327377872
2020-01-02 03:00:00,0.03535826153688899
2020-01-02 04:00:00,0.04528894200074602
2020-01-02 05:00:00,0.08838725179854574
2020-01-02 06:00:00,0.12698870219464592
2020-01-02 07:00:00,0.2972873172488605
2020-01-02 08:00:00,0.3060703962821224
2020-01-02 09:00:00,0.3060703962821224
2020-01-02 10:00:00,0.3060703962821224
2020-01-02 11:00:00,0.3060703962821224
2020-01-02 12:00:00,0.18830927869257777
2020-01-02 13:00:00,0.1275386346839574
2020-01-02 14:00:00,0.13491145476837385
2020-01-02 15:00:00,0.16753364697395312
2020-01-02 16:00:00,0.12285104353917625
2020-01-02 17:00:00,0.11826577537216504
2020-01-02 18:00:00,0.13817487275185122
2020-01-02 19:00:00,0.14330129675108488
2020-01-02 20:00:00,0.2053835158325007
2020-01-02 21:00:00,0.18988693632053635
2020-01-02 22:00:00,0.17377941584925127
2020-01-02 23:00:00,0.09814389757427111
2020-01-03 00:00:00,0.07585953709555798
2020-01-03 01:00:00,0.09111058427383596
2020-01-03 02:00:00,0.1881009936353181
2020-01-03 03:00:00,0.2054914044952539
2020-01-03 04:00:00,0.2100237986549238
2020-01-03 05:00:00,0.22253160533085586
2020-01-03 06:00:00,0.37102194003723654
2020-01-03 07:00:00,0.3639449575161633
2020-01-03 08:00:00,0.2787471643102591
2020-01-03 09:00:00,0.1461622728973083
2020-01-03 10:00:00,0.24029898431600671
2020-01-03 11:00:00,0.19770287055554633
2020-01-03 12:00:00,0.19197749322618676
2020-01-03 13:00:00,0.2234627872415234
2020-01-03 14:00:00,0.28771219842951357
2020-01-03 15:00:00,0.2693540005769046
2020-01-03 16:00:00,0.29094885831210965
2020-01-03 17:00:00,0.2334275040097014
2020-01-03 18:00:00,0.25253064739084435
2020-01-03 19:00:00,0.2648821867576299
2020-01-03 20:00:00,0.22580251558258005
2020-01-03 21:00:00,0.2897800644656166
2020-01-03 22:00:00,0.29159747467747127
2020-01-03 23:00:00,0.2398387449808492
2020-01-04 00:00:00,0.2213285611152348
2020-01-04 01:00:00,0.2022682306955019
2020-01-04 02:00:00,0.2733741376533038
2020-01-04 03:00:00,0.32388486952482426
2020-01-04 04:00:00,0.3624935981243641
2020-01-04 05:00:00,0.44594248185666974
2020-01-04 06:00:00,0.668734711090109
2020-01-04 07:00:00,0.7295569447172284
2020-01-04 08:00:00,0.5185211546869757
2020-01-04 09:00:00,0.7307856767096955
2020-01-04 10:00:00,0.7762701669116817
2020-01-04 11:00:00,0.5637637516569954
2020-01-04 12:00:00,0.46715202293918473
2020-01-04 13:00:00,0.40102098209722503
2020-01-04 14:00:00,0.5006702904270753
2020-01-04 15:00:00,0.4381548041761903
2020-01-04 16:00:00,0.16960343959331967
2020-01-04 17:00:00,0.02533253629870175
2020-01-04 18:00:00,0.01694826000097399
2020-01-04 19:00:00,0.017593879459036826
2020-01-04 20:00:00,0.015473032383188846
2020-01-04 21:00:00,0.013205764979318664
2020-01-04 22:00:00,0.01512346455327618
2020-01-04 23:00:00,0.012317588688387464
2020-01-05 00:00:00,0.016777864414562187
2020-01-05 01:00:00,0.013097812097123343
2020-01-05 02:00:00,0.01334364412153958
2020-01-05 03:00:00,0.011826481208053333
2020-01-05 04:00:00,0.014217264005591371
2020-01-05 05:00:00,0.010839599634591376
2020-01-05 06:00:00,0.01259405338669255
2020-01-05 07:00:00,0.017422841678203866
2020-01-05 08:00:00,0.024721167209766918
2020-01-05 09:00:00,0.01999354594606744
2020-01-05 10:00:00,0.021091270276619896
2020-01-05 11:00:00,0.02741881190821115
2020-01-05 12:00:00,0.025002234301423586
2020-01-05 13:00:00,0.021061301203632893
2020-01-05 14:00:00,0.018860929051965836
2020-01-05 15:00:00,0.016242702396937158
2020-01-05 16:00:00,0.015158999311246483
2020-01-05 17:00:00,0.01582998544894474
2020-01-05 18:00:00,0.016926853520268993
2020-01-05 19:00:00,0.01951211419501197
2020-01-05 20:00:00,0.02300650810529634
2020-01-05 21:00:00,0.020512010908742568
2020-01-05 22:00:00,0.017046729812217
2020-01-05 23:00:00,0.013921276596883322
2020-01-06 00:00:00,0.015159320408457057
2020-01-06 01:00:00,0.020265194186213902
2020-01-06 02:00:00,0.018488456287698816
2020-01-06 03:00:00,0.02227932995574745
2020-01-06 04:00:00,0.022536849918628615
2020-01-06 05:00:00,0.026904200112062925
2020-01-06 06:00:00,0.037284202605917936
2020-01-06 07:00:00,0.048503553208216026
2020-01-06 08:00:00,0.04969889109078328
2020-01-06 09:00:00,0.05045111482275702
2020-01-06 10:00:00,0.04907853127995235
2020-01-06 11:00:00,0.04872532434831983
2020-01-06 12:00:00,0.04365327281007689
2020-01-06 13:00:00,0.044601151775694334
2020-01-06 14:00:00,0.04154815949754708
2020-01-06 15:00:00,0.03896974889662971
2020-01-06 16:00:00,0.04127865190547112
2020-01-06 17:00:00,0.042266989119621026
2020-01-06 18:00:00,0.03896610979490986
2020-01-06 19:00:00,0.03631277651152499
2020-01-06 20:00:00,0.03493120224682422
2020-01-06 21:00:00,0.03176689626901096
2020-01-06 22:00:00,0.023621302231143965
2020-01-06 23:00:00,0.020126480191245497
2020-01-07 00:00:00,0.017201070538100053
2020-01-07 01:00:00,0.01684764954166049
2020-01-07 02:00:00,0.020584792943139568
2020-01-07 03:00:00,0.028302685496520645
2020-01-07 04:00:00,0.044618919154679484
2020-01-07 05:00:00,0.07150353233689732
2020-01-07 06:00:00,0.09266512290263315
2020-01-07 07:00:00,0.08968619704772521
2020-01-07 08:00:00,0.21671974581944808
2020-01-07 09:00:00,0.3453063347663188
2020-01-07 10:00:00,0.3657452425434538
2020-01-07 11:00:00,0.37285005348944367
2020-01-07 12:00:00,0.3726980674764381
2020-01-07 13:00:00,0.3430607949403642
2020-01-07 14:00:00,0.34182564100368573
2020-01-07 15:00:00,0.24954658398056717
2020-01-07 16:00:00,0.1856238356881354
2020-01-07 17:00:00,0.16246159543571018
2020-01-07 18:00:00,0.1638450962836744
2020-01-07 19:00:00,0.17109632755768645
2020-01-07 20:00:00,0.18008897603705037
2020-01-07 21:00:00,0.20787116295522887
2020-01-07 22:00:00,0.20787116295522887
2020-01-07 23:00:00,0.08713561487172433
2020-01-08 00:00:00,0.047743837207995535
2020-01-08 01:00:00,0.03169133139212231
2020-01-08 02:00:00,0.023772431984921273
2020-01-08 03:00:00,0.031231948316192984
2020-01-08 04:00:00,0.051140189436651
2020-01-08 05:00:00,0.0813346726654761
2020-01-08 06:00:00,0.0728722627131751
2020-01-08 07:00:00,0.08812973183566458
2020-01-08 08:00:00,0.22851043539176266
2020-01-08 09:00:00,0.2419815336994198
2020-01-08 10:00:00,0.27826979979053756
2020-01-08 11:00:00,0.298432563966578
2020-01-08 12:00:00,0.38151753752689854
2020-01-08 13:00:00,0.38862877041709987
2020-01-08 14:00:00,0.2170194365493181
2020-01-08 15:00:00,0.15774360708832796
2020-01-08 16:00:00,0.1287290490759625
2020-01-08 17:00:00,0.1512184836398295
2020-01-08 18:00:00,0.15751819684650428
2020-01-08 19:00:00,0.17149042086746552
2020-01-08 20:00:00,0.16535082813646415
2020-01-08 21:00:00,0.17926867969643467
2020-01-08 22:00:00,0.12038373257311784
2020-01-08 23:00:00,0.10767470497855873
2020-01-09 00:00:00,0.21247055939950538
2020-01-09 01:00:00,0.18847432265881334
2020-01-09 02:00:00,0.16357601682121253
2020-01-09 03:00:00,0.16943775343266296
2020-01-09 04:00:00,0.1903437506187811
2020-01-09 05:00:00,0.2625189112877978
2020-01-09 06:00:00,0.38257287702565507
2020-01-09 07:00:00,0.5504917336198949
2020-01-09 08:00:00,0.4034292111765376
2020-01-09 09:00:00,0.3348085966285863
2020-01-09 10:00:00,0.37811176644673294
2020-01-09 11:00:00,0.4653881289290926
2020-01-09 12:00:00,0.5797030171899392
2020-01-09 13:00:00,0.6742725676484927
2020-01-09 14:00:00,0.6180505867248781
2020-01-09 15:00:00,0.37481730906623323
2020-01-09 16:00:00,0.2782120022926341
2020-01-09 17:00:00,0.2679989703482781
2020-01-09 18:00:00,0.3130403463996707
2020-01-09 19:00:00,0.3799591457315745
2020-01-09 20:00:00,0.38039583793795656
2020-01-09 21:00:00,0.34605342094292324
2020-01-09 22:00:00,0.34012168513956753
2020-01-09 23:00:00,0.22520313412284002
2020-01-10 00:00:00,0.22020900217436323
2020-01-10 01:00:00,0.3005988998139242
2020-01-10 02:00:00,0.23821185244726914
2020-01-10 03:00:00,0.18015405173839352
2020-01-10 04:00:00,0.19475369970881834
2020-01-10 05:00:00,0.2375846425626126
2020-01-10 06:00:00,0.3618578256474257
2020-01-10 07:00:00,0.43329339240808457
2020-01-10 08:00:00,0.359740724705701
2020-01-10 09:00:00,0.3916941784540561
2020-01-10 10:00:00,0.4805353546759514
2020-01-10 11:00:00,0.5708514374184213
2020-01-10 12:00:00,0.6645754318891274
2020-01-10 13:00:00,0.6234899734720188
2020-01-10 14:00:00,0.5069038576083716
2020-01-10 15:00:00,0.5401053091818282
2020-01-10 16:00:00,0.48312339819318595
2020-01-10 17:00:00,0.3036386200740344
2020-01-10 18:00:00,0.3141577646924718
2020-01-10 19:00:00,0.31063853926456964
2020-01-10 20:00:00,0.3228273893779973
2020-01-10 21:00:00,0.33343430056732526
2020-01-10 22:00:00,0.2868259701283265
2020-01-10 23:00:00,0.4176773647337863
2020-01-11 00:00:00,0.371182488642524
2020-01-11 01:00:00,0.0645618387738796
2020-01-11 02:00:00,0.033510025992819194
2020-01-11 03:00:00,0.05193586832445589
2020-01-11 04:00:00,0.10674031209578543
2020-01-11 05:00:00,0.4312469328526865
2020-01-11 06:00:00,0.4749118721947476
2020-01-11 07:00:00,0.40948510456798237
2020-01-11 08:00:00,0.10028518783919238
2020-01-11 09:00:00,0.10264675079056808
2020-01-11 10:00:00,0.08518634073872694
2020-01-11 11:00:00,0.16529110405529723
2020-01-11 12:00:00,0.11838458134007779
2020-01-11 13:00:00,0.19431957628012092
2020-01-11 14:00:00,0.20837314492776116
2020-01-11 15:00:00,0.20508296884340246
2020-01-11 16:00:00,0.17349385339664655
2020-01-11 17:00:00,0.09113884082836658
2020-01-11 18:00:00,0.06654151010947809
2020-01-11 19:00:00,0.07205239450217354
2020-01-11 20:00:00,0.049809776660835185
2020-01-11 21:00:00,0.05386887353211748
2020-01-11 22:00:00,0.08083204849852267
2020-01-11 23:00:00,0.05591255024502393
2020-01-12 00:00:00,0.05892722492270923
2020-01-12 01:00:00,0.05765610809844627
2020-01-12 02:00:00,0.08000468801927439
2020-01-12 03:00:00,0.08932806662553054
2020-01-12 04:00:00,0.09059340370000314
2020-01-12 05:00:00,0.1533661958489623
2020-01-12 06:00:00,0.1550840659255386
2020-01-12 07:00:00,0.20824042474739016
2020-01-12 08:00:00,0.20974123310961773
2020-01-12 09:00:00,0.25230159804730085
2020-01-12 10:00:00,0.2648329518520084
2020-01-12 11:00:00,0.2561740304068355
2020-01-12 12:00:00,0.2394191779590312
2020-01-12 13:00:00,0.255683821998691
2020-01-12 14:00:00,0.2638910667009884
2020-01-12 15:00:00,0.21655705656609012
2020-01-12 16:00:00,0.18837949194929018
2020-01-12 17:00:00,0.17806435109197133
2020-01-12 18:00:00,0.1484086689824911
2020-01-12 19:00:00,0.13872138020424993
2020-01-12 20:00:00,0.17132666129007224
2020-01-12 21:00:00,0.12104990225265749
2020-01-12 22:00:00,0.0708292281946898
2020-01-12 23:00:00,0.06711969915332018
2020-01-13 00:00:00,0.13430822014210692
2020-01-13 01:00:00,0.1337375233665116
2020-01-13 02:00:00,0.16469578982689112
2020-01-13 03:00:00,0.1651468243753455
2020-01-13 04:00:00,0.19545711666478469
2020-01-13 05:00:00,0.1534242074116728
2020-01-13 06:00:00,0.17206625519843002
2020-01-13 07:00:00,0.13756114895003888
2020-01-13 08:00:00,0.09130666763709377
2020-01-13 09:00:00,0.0760671799583965
2020-01-13 10:00:00,0.07366986818424343
2020-01-13 11:00:00,0.079198305891117
2020-01-13 12:00:00,0.0769112374925947
2020-01-13 13:00:00,0.077991194444162
2020-01-13 14:00:00,0.0701414379696381
2020-01-13 15:00:00,0.06996183759652315
2020-01-13 16:00:00,0.07178245878048349
2020-01-13 17:00:00,0.07656081340345383
2020-01-13 18:00:00,0.0687271117894587
2020-01-13 19:00:00,0.04805979686320135
2020-01-13 20:00:00,0.042946430817197755
2020-01-13 21:00:00,0.05144587398111841
2020-01-13 22:00:00,0.049567027169640475
2020-01-13 23:00:00,0.05488825014328963
2020-01-14 00:00:00,0.0613964624720311
2020-01-14 01:00:00,0.06234348517842034
2020-01-14 02:00:00,0.06785693834880041
2020-01-14 03:00:00,0.07233239126979496
2020-01-14 04:00:00,0.08601391528278227
2020-01-14 05:00:00,0.11082595300314192
2020-01-14 06:00:00,0.08198393122525878
2020-01-14 07:00:00,0.07590684541791605
2020-01-14 08:00:00,0.10036032458646693
2020-01-14 09:00:00,0.09723219556104512
2020-01-14 10:00:00,0.08447842842181255
2020-01-14 11:00:00,0.09398076520676252
2020-01-14 12:00:00,0.08813272874296328
2020-01-14 13:00:00,0.09021643557478809
2020-01-14 14:00:00,0.09185724232082641
2020-01-14 15:00:00,0.07884702554274793
2020-01-14 16:00:00,0.07306684762278355
2020-01-14 17:00:00,0.06443083111196499
2020-01-14 18:00:00,0.062232813673175486
2020-01-14 19:00:00,0.06567690235380311
2020-01-14 20:00:00,0.06720853604824592
2020-01-14 21:00:00,0.06544935146390894
2020-01-14 22:00:00,0.06557072620950631
2020-01-14 23:00:00,0.07140570472007547
2020-01-15 00:00:00,0.07389570655568119
2020-01-15 01:00:00,0.08358684850044926
2020-01-15 02:00:00,0.08067042956919991
2020-01-15 03:00:00,0.07961423381121516
2020-01-15 04:00:00,0.08057003317469347
2020-01-15 05:00:00,0.08771466017479461
2020-01-15 06:00:00,0.10497556182646514
2020-01-15 07:00:00,0.12891378700444664
2020-01-15 08:00:00,0.10041747988994927
2020-01-15 09:00:00,0.06803525433307307
2020-01-15 10:00:00,0.06704541866527382
2020-01-15 11:00:00,0.07417420486965325
2020-01-15 12:00:00,0.0835138524012452
2020-01-15 13:00:00,0.08840951453847894
2020-01-15 14:00:00,0.07604341876481395
2020-01-15 15:00:00,0.06605708145112392
2020-01-15 16:00:00,0.06089555082353407
2020-01-15 17:00:00,0.06399007167424901
2020-01-15 18:00:00,0.06395624943473512
2020-01-15 19:00:00,0.05553130082366786
2020-01-15 20:00:00,0.05193736677810524
2020-01-15 21:00:00,0.04640100867337082
2020-01-15 22:00:00,0.04679274727027234
2020-01-15 23:00:00,0.052718275194223674
2020-01-16 00:00:00,0.052718275194223674
2020-01-16 01:00:00,0.05779567835264287
2020-01-16 02:00:00,0.08304868957552554
2020-01-16 03:00:00,0.11128854705117701
2020-01-16 04:00:00,0.1463575000013379
2020-01-16 05:00:00,0.18139391510082717
2020-01-16 06:00:00,0.22575756197309954
2020-01-16 07:00:00,0.16153726359886822
2020-01-16 08:00:00,0.18223668824618308
2020-01-16 09:00:00,0.16773401163335194
2020-01-16 10:00:00,0.16360427337574313
2020-01-16 11:00:00,0.14727819273645998
2020-01-16 12:00:00,0.15703719322506293
2020-01-16 13:00:00,0.15266213669857479
2020-01-16 14:00:00,0.14883401575409944
2020-01-16 15:00:00,0.15960361619678548
2020-01-16 16:00:00,0.14421321282911795
2020-01-16 17:00:00,0.20192979423555582
2020-01-16 18:00:00,0.18353392097690616
2020-01-16 19:00:00,0.11054681249474871
2020-01-16 20:00:00,0.21915580332367723
2020-01-16 21:00:00,0.27079037543221024
2020-01-16 22:00:00,0.24459526499350043
2020-01-16 23:00:00,0.23472259609235394
2020-01-17 00:00:00,0.18135131620422423
2020-01-17 01:00:00,0.2085253450055737
2020-01-17 02:00:00,0.14909453262427932
2020-01-17 03:00:00,0.115393453791168
2020-01-17 04:00:00,0.14078218210172036
2020-01-17 05:00:00,0.14314781228443002
2020-01-17 06:00:00,0.204306127658618
2020-01-17 07:00:00,0.21846437399690566
2020-01-17 08:00:00,0.22440039109640247
2020-01-17 09:00:00,0.19213954028512362
2020-01-17 10:00:00,0.2645139952895039
2020-01-17 11:00:00,0.297298020489213
2020-01-17 12:00:00,0.30579211203295736
2020-01-17 13:00:00,0.21289654836553493
2020-01-17 14:00:00,0.2204851457754578
2020-01-17 15:00:00,0.17435225327291712
2020-01-17 16:00:00,0.15836353876954476
2020-01-17 17:00:00,0.17356834794949996
2020-01-17 18:00:00,0.1574676775520405
2020-01-17 19:00:00,0.12985588622027375
2020-01-17 20:00:00,0.10100037835954646
2020-01-17 21:00:00,0.12251496179210775
2020-01-17 22:00:00,0.12760221193165125
2020-01-17 23:00:00,0.1352653038944275
2020-01-18 00:00:00,0.12804018852687557
2020-01-18 01:00:00,0.13160137065695954
2020-01-18 02:00:00,0.12310042903938952
2020-01-18 03:00:00,0.1263828987906944
2020-01-18 04:00:00,0.1183028085837847
2020-01-18 05:00:00,0.101054108626116
2020-01-18 06:00:00,0.10659196518449977
2020-01-18 07:00:00,0.09587245590666345
2020-01-18 08:00:00,0.10900683027283094
2020-01-18 09:00:00,0.0982243859417219
2020-01-18 10:00:00,0.1070873111480135
2020-01-18 11:00:00,0.1029734136861264
2020-01-18 12:00:00,0.09146593185353899
2020-01-18 13:00:00,0.10374982674129679
2020-01-18 14:00:00,0.1293875124224483
2020-01-18 15:00:00,0.13829260839572877
2020-01-18 16:00:00,0.13221445226435077
2020-01-18 17:00:00,0.14507974716805638
2020-01-18 18:00:00,0.1353646299648987
2020-01-18 19:00:00,0.12940763451431103
2020-01-18 20:00:00,0.1289015853104448
2020-01-18 21:00:00,0.12855030496207573
2020-01-18 22:00:00,0.13157760946337696
2020-01-18 23:00:00,0.12244774544269403
2020-01-19 00:00:00,0.07744340260292101
2020-01-19 01:00:00,0.08934240896760288
2020-01-19 02:00:00,0.0855037988475821
2020-01-19 03:00:00,0.08278003824267777
2020-01-19 04:00:00,0.10452024598186978
2020-01-19 05:00:00,0.13711032846639154
2020-01-19 06:00:00,0.14212351218269573
2020-01-19 07:00:00,0.1305969785822809
2020-01-19 08:00:00,0.10259751588494657
2020-01-19 09:00:00,0.06960541969278489
2020-01-19 10:00:00,0.06627821039680658
2020-01-19 11:00:00,0.04875743406937734
2020-01-19 12:00:00,0.04477368801017664
2020-01-19 13:00:00,0.03970163647193369
2020-01-19 14:00:00,0.04188745221672135
2020-01-19 15:00:00,0.036375283435183585
2020-01-19 16:00:00,0.029682975372379107
2020-01-19 17:00:00,0.03198417204816672
2020-01-19 18:00:00,0.027722997999029213
2020-01-19 19:00:00,0.028291768191361092
2020-01-19 20:00:00,0.030697428492989107
2020-01-19 21:00:00,0.032667466912270356
2020-01-19 22:00:00,0.03945503381421209
2020-01-19 23:00:00,0.04893682037768525
2020-01-20 00:00:00,0.059702567653844366
2020-01-20 01:00:00,0.06382502770801347
2020-01-20 02:00:00,0.06426407462727303
2020-01-20 03:00:00,0.06616090288254317
2020-01-20 04:00:00,0.06527809961826893
2020-01-20 05:00:00,0.06898934117809495
2020-01-20 06:00:00,0.08499967622697933
2020-01-20 07:00:00,0.08618195615631653
2020-01-20 08:00:00,0.07872779144522107
2020-01-20 09:00:00,0.06536179895782548
2020-01-20 10:00:00,0.08641635712003629
2020-01-20 11:00:00,0.11129132989366866
2020-01-20 12:00:00,0.09106113530340741
2020-01-20 13:00:00,0.08628406506927938
2020-01-20 14:00:00,0.11214330782572769
2020-01-20 15:00:00,0.11581109422972256
2020-01-20 16:00:00,0.10049411509087318
2020-01-20 17:00:00,0.10883985972333193
2020-01-20 18:00:00,0.1028625281160745
2020-01-20 19:00:00,0.09038383425390119
2020-01-20 20:00:00,0.09819291841508557
2020-01-20 21:00:00,0.09819291841508557
2020-01-20 22:00:00,0.07344017664627876
2020-01-20 23:00:00,0.05184424858703849
2020-01-21 00:00:00,0.049402411333019015
2020-01-21 01:00:00,0.050644201278716126
2020-01-21 02:00:00,0.053175089492468394
2020-01-21 03:00:00,0.0624010686115168
2020-01-21 04:00:00,0.07893307959518203
2020-01-21 05:00:00,0.11099955956165951
2020-01-21 06:00:00,0.12829513971207213
2020-01-21 07:00:00,0.14284319806399787
2020-01-21 08:00:00,0.19915187523446787
2020-01-21 09:00:00,0.27383223634039083
2020-01-21 10:00:00,0.2635271565290033
2020-01-21 11:00:00,0.21767019356275016
2020-01-21 12:00:00,0.3012239690505102
2020-01-21 13:00:00,0.2868131262399035
2020-01-21 14:00:00,0.3436088008464122
2020-01-21 15:00:00,0.34001679338411306
2020-01-21 16:00:00,0.25063403320038125
2020-01-21 17:00:00,0.21514851013570102
2020-01-21 18:00:00,0.22604440881454654
2020-01-21 19:00:00,0.24654753603379653
2020-01-21 20:00:00,0.2953478900969874
2020-01-21 21:00:00,0.23452137517372695
2020-01-21 22:00:00,0.1839661178223401
2020-01-21 23:00:00,0.19164141147911826
2020-01-22 00:00:00,0.24756862516342507
2020-01-22 01:00:00,0.23650789658315105
2020-01-22 02:00:00,0.24634845576324002
2020-01-22 03:00:00,0.24235614711175732
2020-01-22 04:00:00,0.24658820834713605
2020-01-22 05:00:00,0.32375000869638276
2020-01-22 06:00:00,0.422337555583265
2020-01-22 07:00:00,0.5241275119836154
2020-01-22 08:00:00,0.47309446198289296
2020-01-22 09:00:00,0.5217471113292192
2020-01-22 10:00:00,0.5399361979842587
2020-01-22 11:00:00,0.4635557341807445
2020-01-22 12:00:00,0.4840931117691225
2020-01-22 13:00:00,0.5090573495672948
2020-01-22 14:00:00,0.5084793745882596
2020-01-22 15:00:00,0.5110267457921548
2020-01-22 16:00:00,0.42184306587897946
2020-01-22 17:00:00,0.3427889326354107
2020-01-22 18:00:00,0.3200209997575716
2020-01-22 19:00:00,0.3558939801230123
2020-01-22 20:00:00,0.3175250041073684
2020-01-22 21:00:00,0.19828897999724923
2020-01-22 22:00:00,0.14325505875276212
2020-01-22 23:00:00,0.08745499956384295
2020-01-23 00:00:00,0.05898459429099863
2020-01-23 01:00:00,0.04930843688272406
2020-01-23 02:00:00,0.07594644740722029
2020-01-23 03:00:00,0.09818542614683881
2020-01-23 04:00:00,0.12100601896721222
2020-01-23 05:00:00,0.1441581981737061
2020-01-23 06:00:00,0.15622331882865878
2020-01-23 07:00:00,0.21802982243859415
2020-01-23 08:00:00,0.2599779620281142
2020-01-23 09:00:00,0.33551072919571034
2020-01-23 10:00:00,0.34198190831283215
2020-01-23 11:00:00,0.34198190831283215
2020-01-23 12:00:00,0.3262973799002779
2020-01-23 13:00:00,0.2810034073765662
2020-01-23 14:00:00,0.2529566363568739
2020-01-23 15:00:00,0.23027647004992527
2020-01-23 16:00:00,0.2019985090386189
2020-01-23 17:00:00,0.1866716829186452
2020-01-23 18:00:00,0.17764842317187318
2020-01-23 19:00:00,0.20723860145039608
2020-01-23 20:00:00,0.22700984109434208
2020-01-23 21:00:00,0.22994895089513873
2020-01-23 22:00:00,0.2019150237638694
2020-01-23 23:00:00,0.16873647712476714
2020-01-24 00:00:00,0.18728283794277298
2020-01-24 01:00:00,0.21412313970993146
2020-01-24 02:00:00,0.1755533709052747
2020-01-24 03:00:00,0.18095872134809451
2020-01-24 04:00:00,0.2055898743064969
2020-01-24 05:00:00,0.29340632229704383
2020-01-24 06:00:00,0.3141684679328243
2020-01-24 07:00:00,0.3635253904943452
2020-01-24 08:00:00,0.3564441266771308
2020-01-24 09:00:00,0.28956385901049614
2020-01-24 10:00:00,0.3445999209030538
2020-01-24 11:00:00,0.3700672109977935
2020-01-24 12:00:00,0.4234078796185151
2020-01-24 13:00:00,0.3707907500456225
2020-01-24 14:00:00,0.3609823005865911
2020-01-24 15:00:00,0.40307172294876414
2020-01-24 16:00:00,0.37363567133131714
2020-01-24 17:00:00,0.3004362105605662
2020-01-24 18:00:00,0.26289994664434685
2020-01-24 19:00:00,0.256154764574201
2020-01-24 20:00:00,0.27021882239738665
2020-01-24 21:00:00,0.26340942088512587
2020-01-24 22:00:00,0.32325123769595626
2020-01-24 23:00:00,0.29870870756767254
2020-01-25 00:00:00,0.26176968446312276
2020-01-25 01:00:00,0.22556918494289555
2020-01-25 02:00:00,0.1960843265494412
2020-01-25 03:00:00,0.1992304370186552
2020-01-25 04:00:00,0.23671125814984856
2020-01-25 05:00:00,0.3154871071442525
2020-01-25 06:00:00,0.45495889152961605
2020-01-25 07:00:00,0.4862658695606801
2020-01-25 08:00:00,0.5934994940043123
2020-01-25 09:00:00,0.6993823695154591
2020-01-25 10:00:00,1.0
2020-01-25 11:00:00,0.9337918958275022
2020-01-25 12:00:00,0.7081033697546761
2020-01-25 13:00:00,0.4998761099929198
2020-01-25 14:00:00,0.4072245802055343
2020-01-25 15:00:00,0.4219886299477736
2020-01-25 16:00:00,0.3860214610672308
2020-01-25 17:00:00,0.39733264547175334
2020-01-25 18:00:00,0.3680335953308184
2020-01-25 19:00:00,0.3505851729081721
2020-01-25 20:00:00,0.3643944936109683
2020-01-25 21:00:00,0.32536833863768083
2020-01-25 22:00:00,0.42329656591884907
2020-01-25 23:00:00,0.3697075821219495
2020-01-26 00:00:00,0.29959707651693
2020-01-26 01:00:00,0.198728883175737
2020-01-26 02:00:00,0.1632609134252349
2020-01-26 03:00:00,0.1541588778294685
2020-01-26 04:00:00,0.20091683956859518
2020-01-26 05:00:00,0.3334920980652287
2020-01-26 06:00:00,0.3301591090194601
2020-01-26 07:00:00,0.44281927632181
2020-01-26 08:00:00,0.5800968964349112
2020-01-26 09:00:00,0.4956162203326246
2020-01-26 10:00:00,0.525970609972316
2020-01-26 11:00:00,0.5128569998924324
2020-01-26 12:00:00,0.4132890361892611
2020-01-26 13:00:00,0.39825098349399785
2020-01-26 14:00:00,0.3577734691289113
2020-01-26 15:00:00,0.16552593314863107
2020-01-26 16:00:00,0.15174208615787385
2020-01-26 17:00:00,0.1583789514356524
2020-01-26 18:00:00,0.18458219633703005
2020-01-26 19:00:00,0.32262188716322926
2020-01-26 20:00:00,0.3146458324525458
2020-01-26 21:00:00,0.3395308662721095
2020-01-26 22:00:00,0.3574823409913234
2020-01-26 23:00:00,0.3777692627554529
2020-01-27 00:00:00,0.3828725677555251
2020-01-27 01:00:00,0.3771934284244883
2020-01-27 02:00:00,0.24549005588696945
2020-01-27 03:00:00,0.17843810824508066
2020-01-27 04:00:00,0.2990811803319396
2020-01-27 05:00:00,0.39236206065205215
2020-01-27 06:00:00,0.3822796082399966
2020-01-27 07:00:00,0.3849233086070643
2020-01-27 08:00:00,0.4864349807582496
2020-01-27 09:00:00,0.3934580724641481
2020-01-27 10:00:00,0.3295147739502396
2020-01-27 11:00:00,0.10990547433282688
2020-01-27 12:00:00,0.2623262529614528
2020-01-27 13:00:00,0.34207395617986364
2020-01-27 14:00:00,0.3571227121154794
2020-01-27 15:00:00,0.287778558519699
2020-01-27 16:00:00,0.10870928019103143
2020-01-27 17:00:00,0.11277800997863098
2020-01-27 18:00:00,0.15088325815198922
2020-01-27 19:00:00,0.1457407792922268
2020-01-27 20:00:00,0.156155888414438
2020-01-27 21:00:00,0.15415224182044993
2020-01-27 22:00:00,0.14425902269782664
2020-01-27 23:00:00,0.21234212051527537
2020-01-28 00:00:00,0.19201923586356148
2020-01-28 01:00:00,0.1758815322544824
2020-01-28 02:00:00,0.19061325821085703
2020-01-28 03:00:00,0.18428250560716003
2020-01-28 04:00:00,0.1939736475519281
2020-01-28 05:00:00,0.2749196855602049
2020-01-28 06:00:00,0.3155063729768869
2020-01-28 07:00:00,0.35711843081933836
2020-01-28 08:00:00,0.43078883416559943
2020-01-28 09:00:00,0.5402401700102698
2020-01-28 10:00:00,0.5096588716751053
2020-01-28 11:00:00,0.5044763626964245
2020-01-28 12:00:00,0.4859276471655411
2020-01-28 13:00:00,0.41378994783775813
2020-01-28 14:00:00,0.4198544038214849
2020-01-28 15:00:00,0.3616801518575741
2020-01-28 16:00:00,0.31288836038666523
2020-01-28 17:00:00,0.2873525695536695
2020-01-28 18:00:00,0.29032164842745317
2020-01-28 19:00:00,0.2828250988845618
2020-01-28 20:00:00,0.18812817986581346
2020-01-28 21:00:00,0.10065423556654658
2020-01-28 22:00:00,0.039044885643904265
2020-01-28 23:00:00,0.05820989375428464
2020-01-29 00:00:00,0.006984506524427737
2020-01-29 01:00:00,0.0
2020-01-29 02:00:00,0.002500961953726681
2020-01-29 03:00:00,0.001005376772791079
2020-01-29 04:00:00,0.004181520534434198
2020-01-29 05:00:00,0.008110936945605596
2020-01-29 06:00:00,0.017342567375560114
2020-01-29 07:00:00,0.02326595465144095
2020-01-29 08:00:00,0.032578201887730494
2020-01-29 09:00:00,0.07083500794448014
2020-01-29 10:00:00,0.06689493110591765
2020-01-29 11:00:00,0.08179790890793232
2020-01-29 12:00:00,0.01993681877219919
2020-01-29 13:00:00,0.004341384132339145
2020-01-29 14:00:00,0.002628801456496948
2020-01-29 15:00:00,0.002813924701633796
2020-01-29 16:00:00,0.005149864095605624
2020-01-29 17:00:00,0.009656484852506673
2020-01-29 18:00:00,0.008954074001133475
2020-01-29 19:00:00,0.015203674636477817
2020-01-29 20:00:00,0.019177959031206903
2020-01-29 21:00:00,0.030121594162024583
2020-01-29 22:00:00,0.029975816028423523
2020-01-29 23:00:00,0.01525457924759431
2020-01-30 00:00:00,0.0068936788267964155
2020-01-30 01:00:00,0.007868679803467102
2020-01-30 02:00:00,0.009821978354837033
2020-01-30 03:00:00,0.011122978626164178
2020-01-30 04:00:00,0.013882894776979255
2020-01-30 05:00:00,0.035085328907900226
2020-01-30 06:00:00,0.10224302456447176
2020-01-30 07:00:00,0.1496641590758394
2020-01-30 08:00:00,0.1906226770623672
2020-01-30 09:00:00,0.3017120368105842
2020-01-30 10:00:00,0.34075745761650605
2020-01-30 11:00:00,0.26082993996017323
2020-01-30 12:00:00,0.23102569687460028
2020-01-30 13:00:00,0.15245128286363052
2020-01-30 14:00:00,0.11467954765965623
2020-01-30 15:00:00,0.12449334873886395
2020-01-30 16:00:00,0.12381797427262116
2020-01-30 17:00:00,0.16409919120964275
2020-01-30 18:00:00,0.10819702310776075
2020-01-30 19:00:00,0.13223650093947692
2020-01-30 20:00:00,0.15393239726360958
2020-01-30 21:00:00,0.10466345533778623
2020-01-30 22:00:00,0.13455739157751312
2020-01-30 23:00:00,0.12267722291585166
2020-01-31 00:00:00,0.12527489934940353
2020-01-31 01:00:00,0.12303428301401109
2020-01-31 02:00:00,0.061762085162472516
2020-01-31 03:00:00,0.05600245746398494
2020-01-31 04:00:00,0.07827054901736226
2020-01-31 05:00:00,0.10479981461987709
2020-01-31 06:00:00,0.19357805578849968
2020-01-31 07:00:00,0.3413782455569512
2020-01-31 08:00:00,0.33762568948936444
2020-01-31 09:00:00,0.3219026294115412
2020-01-31 10:00:00,0.30390620108284694
2020-01-31 11:00:00,0.3850881385084927
2020-01-31 12:00:00,0.49493763489427606
2020-01-31 13:00:00,0.42436260865795816
2020-01-31 14:00:00,0.28772932361407755
2020-01-31 15:00:00,0.24451392036682146
2020-01-31 16:00:00,0.28061809072387617
2020-01-31 17:00:00,0.24763284460554008
2020-01-31 18:00:00,0.1728019959402609
2020-01-31 19:00:00,0.15561323412856626
2020-01-31 20:00:00,0.21359654028458844
2020-01-31 21:00:00,0.23015445310990676
2020-01-31 22:00:00,0.2168546066478896
2020-01-31 23:00:00,0.14975192564672993
2020-02-01 00:00:00,0.1089552406543319
