Model: "sequential"
_________________________________________________________________
Layer (type)                 Output Shape              Param #
=================================================================
conv2d (Conv2D)              (None, 6, 12, 6)          102
_________________________________________________________________
max_pooling2d (MaxPooling2D) (None, 5, 11, 6)          0
_________________________________________________________________
conv2d_1 (Conv2D)            (None, 3, 9, 6)           330
_________________________________________________________________
max_pooling2d_1 (MaxPooling2 (None, 3, 9, 6)           0
_________________________________________________________________
flatten (Flatten)            (None, 162)               0
_________________________________________________________________
dense (Dense)                (None, 1)                 163
=================================================================
Total params: 595
Trainable params: 595
Non-trainable params: 0
_________________________________________________________________
2020-11-27 02:57:48.573721: W tensorflow/python/util/util.cc:299] Sets are not currently considered sequences, but this may change in the future, so consider avoiding using them.
WARNING:tensorflow:From /Users/mirchearsov/anaconda3/envs/air-pollution-skopje/lib/python3.7/site-packages/tensorflow_core/python/ops/resource_variable_ops.py:1781: calling BaseResourceVariable.__init__ (from tensorflow.python.ops.resource_variable_ops) with constraint is deprecated and will be removed in a future version.
Instructions for updating:
If using Keras pass *_constraint arguments to layers.
257.794230131
/Users/mirchearsov/PycharmProjects/air-pollution-sensors-v2/evaluation/ARIMA/24/yhat__Karpos_value_pm10__2020-01-01_2020-02-01__6.csv
/Users/mirchearsov/PycharmProjects/air-pollution-sensors-v2/evaluation/ARIMA/24/y__Karpos_value_pm10__2020-01-01_2020-02-01.csv
Index=2020-01-02 00:00:00 predicted=0.045398, expected=0.061122
Index=2020-01-02 01:00:00 predicted=0.037923, expected=0.032942
Index=2020-01-02 02:00:00 predicted=0.038440, expected=0.028080
Index=2020-01-02 03:00:00 predicted=0.033482, expected=0.027806
Index=2020-01-02 04:00:00 predicted=0.039888, expected=0.035358
Index=2020-01-02 05:00:00 predicted=0.052659, expected=0.045289
Index=2020-01-02 06:00:00 predicted=0.070442, expected=0.088387
Index=2020-01-02 07:00:00 predicted=0.082904, expected=0.126989
Index=2020-01-02 08:00:00 predicted=0.116651, expected=0.297287
Index=2020-01-02 09:00:00 predicted=0.158198, expected=0.306070
Index=2020-01-02 10:00:00 predicted=0.191151, expected=0.306070
Index=2020-01-02 11:00:00 predicted=0.166344, expected=0.306070
Index=2020-01-02 12:00:00 predicted=0.198193, expected=0.306070
Index=2020-01-02 13:00:00 predicted=0.195920, expected=0.188309
Index=2020-01-02 14:00:00 predicted=0.163610, expected=0.127539
Index=2020-01-02 15:00:00 predicted=0.190799, expected=0.134911
Index=2020-01-02 16:00:00 predicted=0.206522, expected=0.167534
Index=2020-01-02 17:00:00 predicted=0.176727, expected=0.122851
Index=2020-01-02 18:00:00 predicted=0.164747, expected=0.118266
Index=2020-01-02 19:00:00 predicted=0.159728, expected=0.138175
Index=2020-01-02 20:00:00 predicted=0.167300, expected=0.143301
Index=2020-01-02 21:00:00 predicted=0.171331, expected=0.205384
Index=2020-01-02 22:00:00 predicted=0.180708, expected=0.189887
Index=2020-01-02 23:00:00 predicted=0.153387, expected=0.173779
Index=2020-01-03 00:00:00 predicted=0.106667, expected=0.098144
Index=2020-01-03 01:00:00 predicted=0.030678, expected=0.075860
Index=2020-01-03 02:00:00 predicted=0.030678, expected=0.091111
Index=2020-01-03 03:00:00 predicted=0.030678, expected=0.188101
Index=2020-01-03 04:00:00 predicted=0.031328, expected=0.205491
Index=2020-01-03 05:00:00 predicted=0.055458, expected=0.210024
Index=2020-01-03 06:00:00 predicted=0.084549, expected=0.222532
Index=2020-01-03 07:00:00 predicted=0.116617, expected=0.371022
Index=2020-01-03 08:00:00 predicted=0.153544, expected=0.363945
Index=2020-01-03 09:00:00 predicted=0.164276, expected=0.278747
Index=2020-01-03 10:00:00 predicted=0.176146, expected=0.146162
Index=2020-01-03 11:00:00 predicted=0.180490, expected=0.240299
Index=2020-01-03 12:00:00 predicted=0.184817, expected=0.197703
Index=2020-01-03 13:00:00 predicted=0.209264, expected=0.191977
Index=2020-01-03 14:00:00 predicted=0.188742, expected=0.223463
Index=2020-01-03 15:00:00 predicted=0.187290, expected=0.287712
Index=2020-01-03 16:00:00 predicted=0.189641, expected=0.269354
Index=2020-01-03 17:00:00 predicted=0.181312, expected=0.290949
Index=2020-01-03 18:00:00 predicted=0.181181, expected=0.233428
Index=2020-01-03 19:00:00 predicted=0.184428, expected=0.252531
Index=2020-01-03 20:00:00 predicted=0.180012, expected=0.264882
Index=2020-01-03 21:00:00 predicted=0.211703, expected=0.225803
Index=2020-01-03 22:00:00 predicted=0.210089, expected=0.289780
Index=2020-01-03 23:00:00 predicted=0.191668, expected=0.291597
Index=2020-01-04 00:00:00 predicted=0.151890, expected=0.239839
Index=2020-01-04 01:00:00 predicted=0.120729, expected=0.221329
Index=2020-01-04 02:00:00 predicted=0.098637, expected=0.202268
Index=2020-01-04 03:00:00 predicted=0.128085, expected=0.273374
Index=2020-01-04 04:00:00 predicted=0.134507, expected=0.323885
Index=2020-01-04 05:00:00 predicted=0.147715, expected=0.362494
Index=2020-01-04 06:00:00 predicted=0.165703, expected=0.445942
Index=2020-01-04 07:00:00 predicted=0.213423, expected=0.668735
Index=2020-01-04 08:00:00 predicted=0.222130, expected=0.729557
Index=2020-01-04 09:00:00 predicted=0.191203, expected=0.518521
Index=2020-01-04 10:00:00 predicted=0.123486, expected=0.730786
Index=2020-01-04 11:00:00 predicted=0.189045, expected=0.776270
Index=2020-01-04 12:00:00 predicted=0.171520, expected=0.563764
Index=2020-01-04 13:00:00 predicted=0.143843, expected=0.467152
Index=2020-01-04 14:00:00 predicted=0.135660, expected=0.401021
Index=2020-01-04 15:00:00 predicted=0.170317, expected=0.500670
Index=2020-01-04 16:00:00 predicted=0.159148, expected=0.438155
Index=2020-01-04 17:00:00 predicted=0.120584, expected=0.169603
Index=2020-01-04 18:00:00 predicted=0.119780, expected=0.025333
Index=2020-01-04 19:00:00 predicted=0.198912, expected=0.016948
Index=2020-01-04 20:00:00 predicted=0.208991, expected=0.017594
Index=2020-01-04 21:00:00 predicted=0.212046, expected=0.015473
Index=2020-01-04 22:00:00 predicted=0.250210, expected=0.013206
Index=2020-01-04 23:00:00 predicted=0.227918, expected=0.015123
Index=2020-01-05 00:00:00 predicted=0.200537, expected=0.012318
Index=2020-01-05 01:00:00 predicted=0.188583, expected=0.016778
Index=2020-01-05 02:00:00 predicted=0.183154, expected=0.013098
Index=2020-01-05 03:00:00 predicted=0.194618, expected=0.013344
Index=2020-01-05 04:00:00 predicted=0.219974, expected=0.011826
Index=2020-01-05 05:00:00 predicted=0.234334, expected=0.014217
Index=2020-01-05 06:00:00 predicted=0.263353, expected=0.010840
Index=2020-01-05 07:00:00 predicted=0.315959, expected=0.012594
Index=2020-01-05 08:00:00 predicted=0.356063, expected=0.017423
Index=2020-01-05 09:00:00 predicted=0.310360, expected=0.024721
Index=2020-01-05 10:00:00 predicted=0.368351, expected=0.019994
Index=2020-01-05 11:00:00 predicted=0.359519, expected=0.021091
Index=2020-01-05 12:00:00 predicted=0.305823, expected=0.027419
Index=2020-01-05 13:00:00 predicted=0.258578, expected=0.025002
Index=2020-01-05 14:00:00 predicted=0.222159, expected=0.021061
Index=2020-01-05 15:00:00 predicted=0.270050, expected=0.018861
Index=2020-01-05 16:00:00 predicted=0.253364, expected=0.016243
Index=2020-01-05 17:00:00 predicted=0.132527, expected=0.015159
Index=2020-01-05 18:00:00 predicted=0.030678, expected=0.015830
Index=2020-01-05 19:00:00 predicted=0.030678, expected=0.016927
Index=2020-01-05 20:00:00 predicted=0.030678, expected=0.019512
Index=2020-01-05 21:00:00 predicted=0.042046, expected=0.023007
Index=2020-01-05 22:00:00 predicted=0.030678, expected=0.020512
Index=2020-01-05 23:00:00 predicted=0.030678, expected=0.017047
Index=2020-01-06 00:00:00 predicted=0.030678, expected=0.013921
Index=2020-01-06 01:00:00 predicted=0.030678, expected=0.015159
Index=2020-01-06 02:00:00 predicted=0.030678, expected=0.020265
Index=2020-01-06 03:00:00 predicted=0.030678, expected=0.018488
Index=2020-01-06 04:00:00 predicted=0.030678, expected=0.022279
Index=2020-01-06 05:00:00 predicted=0.030678, expected=0.022537
Index=2020-01-06 06:00:00 predicted=0.030678, expected=0.026904
Index=2020-01-06 07:00:00 predicted=0.030678, expected=0.037284
Index=2020-01-06 08:00:00 predicted=0.030678, expected=0.048504
Index=2020-01-06 09:00:00 predicted=0.030678, expected=0.049699
Index=2020-01-06 10:00:00 predicted=0.036381, expected=0.050451
Index=2020-01-06 11:00:00 predicted=0.040986, expected=0.049079
Index=2020-01-06 12:00:00 predicted=0.044768, expected=0.048725
Index=2020-01-06 13:00:00 predicted=0.042988, expected=0.043653
Index=2020-01-06 14:00:00 predicted=0.039104, expected=0.044601
Index=2020-01-06 15:00:00 predicted=0.036602, expected=0.041548
Index=2020-01-06 16:00:00 predicted=0.033272, expected=0.038970
Index=2020-01-06 17:00:00 predicted=0.035580, expected=0.041279
Index=2020-01-06 18:00:00 predicted=0.036749, expected=0.042267
Index=2020-01-06 19:00:00 predicted=0.047424, expected=0.038966
Index=2020-01-06 20:00:00 predicted=0.054554, expected=0.036313
Index=2020-01-06 21:00:00 predicted=0.056627, expected=0.034931
Index=2020-01-06 22:00:00 predicted=0.047082, expected=0.031767
Index=2020-01-06 23:00:00 predicted=0.037127, expected=0.023621
Index=2020-01-07 00:00:00 predicted=0.032300, expected=0.020126
Index=2020-01-07 01:00:00 predicted=0.033358, expected=0.017201
Index=2020-01-07 02:00:00 predicted=0.036484, expected=0.016848
Index=2020-01-07 03:00:00 predicted=0.030678, expected=0.020585
Index=2020-01-07 04:00:00 predicted=0.035991, expected=0.028303
Index=2020-01-07 05:00:00 predicted=0.039976, expected=0.044619
Index=2020-01-07 06:00:00 predicted=0.047973, expected=0.071504
Index=2020-01-07 07:00:00 predicted=0.053688, expected=0.092665
Index=2020-01-07 08:00:00 predicted=0.059745, expected=0.089686
Index=2020-01-07 09:00:00 predicted=0.073725, expected=0.216720
Index=2020-01-07 10:00:00 predicted=0.080339, expected=0.345306
Index=2020-01-07 11:00:00 predicted=0.083900, expected=0.365745
Index=2020-01-07 12:00:00 predicted=0.088051, expected=0.372850
Index=2020-01-07 13:00:00 predicted=0.085753, expected=0.372698
Index=2020-01-07 14:00:00 predicted=0.082827, expected=0.343061
Index=2020-01-07 15:00:00 predicted=0.073742, expected=0.341826
Index=2020-01-07 16:00:00 predicted=0.080717, expected=0.249547
Index=2020-01-07 17:00:00 predicted=0.090221, expected=0.185624
Index=2020-01-07 18:00:00 predicted=0.096101, expected=0.162462
Index=2020-01-07 19:00:00 predicted=0.091761, expected=0.163845
Index=2020-01-07 20:00:00 predicted=0.082218, expected=0.171096
Index=2020-01-07 21:00:00 predicted=0.082235, expected=0.180089
Index=2020-01-07 22:00:00 predicted=0.071331, expected=0.207871
Index=2020-01-07 23:00:00 predicted=0.058986, expected=0.207871
Index=2020-01-08 00:00:00 predicted=0.046185, expected=0.087136
Index=2020-01-08 01:00:00 predicted=0.035868, expected=0.047744
Index=2020-01-08 02:00:00 predicted=0.030678, expected=0.031691
Index=2020-01-08 03:00:00 predicted=0.030678, expected=0.023772
Index=2020-01-08 04:00:00 predicted=0.034845, expected=0.031232
Index=2020-01-08 05:00:00 predicted=0.045701, expected=0.051140
Index=2020-01-08 06:00:00 predicted=0.065080, expected=0.081335
Index=2020-01-08 07:00:00 predicted=0.099133, expected=0.072872
Index=2020-01-08 08:00:00 predicted=0.118640, expected=0.088130
Index=2020-01-08 09:00:00 predicted=0.195637, expected=0.228510
Index=2020-01-08 10:00:00 predicted=0.230014, expected=0.241982
Index=2020-01-08 11:00:00 predicted=0.259801, expected=0.278270
Index=2020-01-08 12:00:00 predicted=0.281346, expected=0.298433
Index=2020-01-08 13:00:00 predicted=0.279003, expected=0.381518
Index=2020-01-08 14:00:00 predicted=0.264487, expected=0.388629
Index=2020-01-08 15:00:00 predicted=0.265205, expected=0.217019
Index=2020-01-08 16:00:00 predicted=0.179226, expected=0.157744
Index=2020-01-08 17:00:00 predicted=0.156178, expected=0.128729
Index=2020-01-08 18:00:00 predicted=0.175750, expected=0.151218
Index=2020-01-08 19:00:00 predicted=0.196671, expected=0.157518
Index=2020-01-08 20:00:00 predicted=0.199665, expected=0.171490
Index=2020-01-08 21:00:00 predicted=0.213965, expected=0.165351
Index=2020-01-08 22:00:00 predicted=0.222316, expected=0.179269
Index=2020-01-08 23:00:00 predicted=0.199238, expected=0.120384
Index=2020-01-09 00:00:00 predicted=0.125228, expected=0.107675
Index=2020-01-09 01:00:00 predicted=0.086089, expected=0.212471
Index=2020-01-09 02:00:00 predicted=0.053783, expected=0.188474
Index=2020-01-09 03:00:00 predicted=0.032351, expected=0.163576
Index=2020-01-09 04:00:00 predicted=0.035641, expected=0.169438
Index=2020-01-09 05:00:00 predicted=0.057704, expected=0.190344
Index=2020-01-09 06:00:00 predicted=0.097921, expected=0.262519
Index=2020-01-09 07:00:00 predicted=0.102320, expected=0.382573
Index=2020-01-09 08:00:00 predicted=0.120009, expected=0.550492
Index=2020-01-09 09:00:00 predicted=0.197595, expected=0.403429
Index=2020-01-09 10:00:00 predicted=0.208217, expected=0.334809
Index=2020-01-09 11:00:00 predicted=0.233525, expected=0.378112
Index=2020-01-09 12:00:00 predicted=0.236791, expected=0.465388
Index=2020-01-09 13:00:00 predicted=0.243739, expected=0.579703
Index=2020-01-09 14:00:00 predicted=0.246133, expected=0.674273
Index=2020-01-09 15:00:00 predicted=0.225460, expected=0.618051
Index=2020-01-09 16:00:00 predicted=0.181331, expected=0.374817
Index=2020-01-09 17:00:00 predicted=0.162068, expected=0.278212
Index=2020-01-09 18:00:00 predicted=0.186311, expected=0.267999
Index=2020-01-09 19:00:00 predicted=0.155053, expected=0.313040
Index=2020-01-09 20:00:00 predicted=0.163977, expected=0.379959
Index=2020-01-09 21:00:00 predicted=0.201775, expected=0.380396
Index=2020-01-09 22:00:00 predicted=0.207937, expected=0.346053
Index=2020-01-09 23:00:00 predicted=0.165874, expected=0.340122
Index=2020-01-10 00:00:00 predicted=0.146703, expected=0.225203
Index=2020-01-10 01:00:00 predicted=0.187901, expected=0.220209
Index=2020-01-10 02:00:00 predicted=0.169231, expected=0.300599
Index=2020-01-10 03:00:00 predicted=0.147361, expected=0.238212
Index=2020-01-10 04:00:00 predicted=0.151599, expected=0.180154
Index=2020-01-10 05:00:00 predicted=0.168147, expected=0.194754
Index=2020-01-10 06:00:00 predicted=0.167255, expected=0.237585
Index=2020-01-10 07:00:00 predicted=0.210135, expected=0.361858
Index=2020-01-10 08:00:00 predicted=0.268062, expected=0.433293
Index=2020-01-10 09:00:00 predicted=0.258519, expected=0.359741
Index=2020-01-10 10:00:00 predicted=0.253989, expected=0.391694
Index=2020-01-10 11:00:00 predicted=0.277570, expected=0.480535
Index=2020-01-10 12:00:00 predicted=0.291207, expected=0.570851
Index=2020-01-10 13:00:00 predicted=0.313876, expected=0.664575
Index=2020-01-10 14:00:00 predicted=0.341945, expected=0.623490
Index=2020-01-10 15:00:00 predicted=0.329587, expected=0.506904
Index=2020-01-10 16:00:00 predicted=0.267683, expected=0.540105
Index=2020-01-10 17:00:00 predicted=0.248589, expected=0.483123
Index=2020-01-10 18:00:00 predicted=0.240591, expected=0.303639
Index=2020-01-10 19:00:00 predicted=0.241755, expected=0.314158
Index=2020-01-10 20:00:00 predicted=0.270966, expected=0.310639
Index=2020-01-10 21:00:00 predicted=0.258604, expected=0.322827
Index=2020-01-10 22:00:00 predicted=0.264137, expected=0.333434
Index=2020-01-10 23:00:00 predicted=0.263433, expected=0.286826
Index=2020-01-11 00:00:00 predicted=0.220573, expected=0.417677
Index=2020-01-11 01:00:00 predicted=0.193703, expected=0.371182
Index=2020-01-11 02:00:00 predicted=0.205457, expected=0.064562
Index=2020-01-11 03:00:00 predicted=0.171746, expected=0.033510
Index=2020-01-11 04:00:00 predicted=0.146098, expected=0.051936
Index=2020-01-11 05:00:00 predicted=0.145145, expected=0.106740
Index=2020-01-11 06:00:00 predicted=0.115399, expected=0.431247
Index=2020-01-11 07:00:00 predicted=0.146780, expected=0.474912
Index=2020-01-11 08:00:00 predicted=0.209998, expected=0.409485
Index=2020-01-11 09:00:00 predicted=0.227152, expected=0.100285
Index=2020-01-11 10:00:00 predicted=0.238600, expected=0.102647
Index=2020-01-11 11:00:00 predicted=0.258192, expected=0.085186
Index=2020-01-11 12:00:00 predicted=0.282127, expected=0.165291
Index=2020-01-11 13:00:00 predicted=0.298908, expected=0.118385
Index=2020-01-11 14:00:00 predicted=0.293287, expected=0.194320
Index=2020-01-11 15:00:00 predicted=0.289006, expected=0.208373
Index=2020-01-11 16:00:00 predicted=0.292533, expected=0.205083
Index=2020-01-11 17:00:00 predicted=0.264663, expected=0.173494
Index=2020-01-11 18:00:00 predicted=0.239459, expected=0.091139
Index=2020-01-11 19:00:00 predicted=0.241105, expected=0.066542
Index=2020-01-11 20:00:00 predicted=0.223523, expected=0.072052
Index=2020-01-11 21:00:00 predicted=0.217347, expected=0.049810
Index=2020-01-11 22:00:00 predicted=0.235046, expected=0.053869
Index=2020-01-11 23:00:00 predicted=0.236983, expected=0.080832
Index=2020-01-12 00:00:00 predicted=0.265893, expected=0.055913
Index=2020-01-12 01:00:00 predicted=0.227916, expected=0.058927
Index=2020-01-12 02:00:00 predicted=0.075130, expected=0.057656
Index=2020-01-12 03:00:00 predicted=0.074082, expected=0.080005
Index=2020-01-12 04:00:00 predicted=0.067346, expected=0.089328
Index=2020-01-12 05:00:00 predicted=0.092941, expected=0.090593
Index=2020-01-12 06:00:00 predicted=0.194931, expected=0.153366
Index=2020-01-12 07:00:00 predicted=0.244962, expected=0.155084
Index=2020-01-12 08:00:00 predicted=0.248693, expected=0.208240
Index=2020-01-12 09:00:00 predicted=0.131129, expected=0.209741
Index=2020-01-12 10:00:00 predicted=0.073924, expected=0.252302
Index=2020-01-12 11:00:00 predicted=0.064215, expected=0.264833
Index=2020-01-12 12:00:00 predicted=0.114319, expected=0.256174
Index=2020-01-12 13:00:00 predicted=0.101673, expected=0.239419
Index=2020-01-12 14:00:00 predicted=0.140244, expected=0.255684
Index=2020-01-12 15:00:00 predicted=0.162178, expected=0.263891
Index=2020-01-12 16:00:00 predicted=0.170661, expected=0.216557
Index=2020-01-12 17:00:00 predicted=0.156186, expected=0.188379
Index=2020-01-12 18:00:00 predicted=0.111801, expected=0.178064
Index=2020-01-12 19:00:00 predicted=0.088942, expected=0.148409
Index=2020-01-12 20:00:00 predicted=0.084959, expected=0.138721
Index=2020-01-12 21:00:00 predicted=0.080474, expected=0.171327
Index=2020-01-12 22:00:00 predicted=0.083075, expected=0.121050
Index=2020-01-12 23:00:00 predicted=0.096101, expected=0.070829
Index=2020-01-13 00:00:00 predicted=0.088917, expected=0.067120
Index=2020-01-13 01:00:00 predicted=0.094160, expected=0.134308
Index=2020-01-13 02:00:00 predicted=0.095015, expected=0.133738
Index=2020-01-13 03:00:00 predicted=0.109349, expected=0.164696
Index=2020-01-13 04:00:00 predicted=0.117636, expected=0.165147
Index=2020-01-13 05:00:00 predicted=0.121191, expected=0.195457
Index=2020-01-13 06:00:00 predicted=0.143723, expected=0.153424
Index=2020-01-13 07:00:00 predicted=0.148948, expected=0.172066
Index=2020-01-13 08:00:00 predicted=0.176194, expected=0.137561
Index=2020-01-13 09:00:00 predicted=0.183301, expected=0.091307
Index=2020-01-13 10:00:00 predicted=0.202425, expected=0.076067
Index=2020-01-13 11:00:00 predicted=0.200643, expected=0.073670
Index=2020-01-13 12:00:00 predicted=0.192968, expected=0.079198
Index=2020-01-13 13:00:00 predicted=0.185618, expected=0.076911
Index=2020-01-13 14:00:00 predicted=0.203566, expected=0.077991
Index=2020-01-13 15:00:00 predicted=0.211255, expected=0.070141
Index=2020-01-13 16:00:00 predicted=0.184720, expected=0.069962
Index=2020-01-13 17:00:00 predicted=0.170720, expected=0.071782
Index=2020-01-13 18:00:00 predicted=0.167807, expected=0.076561
Index=2020-01-13 19:00:00 predicted=0.158856, expected=0.068727
Index=2020-01-13 20:00:00 predicted=0.154650, expected=0.048060
Index=2020-01-13 21:00:00 predicted=0.164356, expected=0.042946
Index=2020-01-13 22:00:00 predicted=0.143344, expected=0.051446
Index=2020-01-13 23:00:00 predicted=0.127536, expected=0.049567
Index=2020-01-14 00:00:00 predicted=0.112348, expected=0.054888
Index=2020-01-14 01:00:00 predicted=0.129643, expected=0.061396
Index=2020-01-14 02:00:00 predicted=0.136034, expected=0.062343
Index=2020-01-14 03:00:00 predicted=0.155621, expected=0.067857
Index=2020-01-14 04:00:00 predicted=0.153441, expected=0.072332
Index=2020-01-14 05:00:00 predicted=0.166515, expected=0.086014
Index=2020-01-14 06:00:00 predicted=0.152129, expected=0.110826
Index=2020-01-14 07:00:00 predicted=0.159618, expected=0.081984
Index=2020-01-14 08:00:00 predicted=0.141152, expected=0.075907
Index=2020-01-14 09:00:00 predicted=0.117124, expected=0.100360
Index=2020-01-14 10:00:00 predicted=0.103608, expected=0.097232
Index=2020-01-14 11:00:00 predicted=0.098436, expected=0.084478
Index=2020-01-14 12:00:00 predicted=0.102261, expected=0.093981
Index=2020-01-14 13:00:00 predicted=0.101959, expected=0.088133
Index=2020-01-14 14:00:00 predicted=0.104520, expected=0.090216
Index=2020-01-14 15:00:00 predicted=0.103588, expected=0.091857
Index=2020-01-14 16:00:00 predicted=0.102169, expected=0.078847
Index=2020-01-14 17:00:00 predicted=0.102651, expected=0.073067
Index=2020-01-14 18:00:00 predicted=0.105521, expected=0.064431
Index=2020-01-14 19:00:00 predicted=0.103404, expected=0.062233
Index=2020-01-14 20:00:00 predicted=0.092159, expected=0.065677
Index=2020-01-14 21:00:00 predicted=0.087131, expected=0.067209
Index=2020-01-14 22:00:00 predicted=0.089940, expected=0.065449
Index=2020-01-14 23:00:00 predicted=0.089110, expected=0.065571
Index=2020-01-15 00:00:00 predicted=0.093778, expected=0.071406
Index=2020-01-15 01:00:00 predicted=0.096607, expected=0.073896
Index=2020-01-15 02:00:00 predicted=0.098280, expected=0.083587
Index=2020-01-15 03:00:00 predicted=0.103119, expected=0.080670
Index=2020-01-15 04:00:00 predicted=0.103658, expected=0.079614
Index=2020-01-15 05:00:00 predicted=0.107927, expected=0.080570
Index=2020-01-15 06:00:00 predicted=0.121094, expected=0.087715
Index=2020-01-15 07:00:00 predicted=0.110493, expected=0.104976
Index=2020-01-15 08:00:00 predicted=0.106998, expected=0.128914
Index=2020-01-15 09:00:00 predicted=0.115776, expected=0.100417
Index=2020-01-15 10:00:00 predicted=0.119085, expected=0.068035
Index=2020-01-15 11:00:00 predicted=0.116008, expected=0.067045
Index=2020-01-15 12:00:00 predicted=0.116460, expected=0.074174
Index=2020-01-15 13:00:00 predicted=0.115080, expected=0.083514
Index=2020-01-15 14:00:00 predicted=0.119463, expected=0.088410
Index=2020-01-15 15:00:00 predicted=0.119741, expected=0.076043
Index=2020-01-15 16:00:00 predicted=0.114256, expected=0.066057
Index=2020-01-15 17:00:00 predicted=0.110858, expected=0.060896
Index=2020-01-15 18:00:00 predicted=0.104567, expected=0.063990
Index=2020-01-15 19:00:00 predicted=0.104682, expected=0.063956
Index=2020-01-15 20:00:00 predicted=0.107806, expected=0.055531
Index=2020-01-15 21:00:00 predicted=0.107602, expected=0.051937
Index=2020-01-15 22:00:00 predicted=0.107510, expected=0.046401
Index=2020-01-15 23:00:00 predicted=0.096125, expected=0.046793
Index=2020-01-16 00:00:00 predicted=0.090621, expected=0.052718
Index=2020-01-16 01:00:00 predicted=0.098118, expected=0.052718
Index=2020-01-16 02:00:00 predicted=0.112324, expected=0.057796
Index=2020-01-16 03:00:00 predicted=0.112785, expected=0.083049
Index=2020-01-16 04:00:00 predicted=0.114759, expected=0.111289
Index=2020-01-16 05:00:00 predicted=0.116421, expected=0.146358
Index=2020-01-16 06:00:00 predicted=0.115032, expected=0.181394
Index=2020-01-16 07:00:00 predicted=0.118028, expected=0.225758
Index=2020-01-16 08:00:00 predicted=0.130834, expected=0.161537
Index=2020-01-16 09:00:00 predicted=0.126564, expected=0.182237
Index=2020-01-16 10:00:00 predicted=0.113689, expected=0.167734
Index=2020-01-16 11:00:00 predicted=0.108534, expected=0.163604
Index=2020-01-16 12:00:00 predicted=0.109608, expected=0.147278
Index=2020-01-16 13:00:00 predicted=0.118867, expected=0.157037
Index=2020-01-16 14:00:00 predicted=0.117374, expected=0.152662
Index=2020-01-16 15:00:00 predicted=0.111774, expected=0.148834
Index=2020-01-16 16:00:00 predicted=0.098237, expected=0.159604
Index=2020-01-16 17:00:00 predicted=0.093898, expected=0.144213
Index=2020-01-16 18:00:00 predicted=0.096324, expected=0.201930
Index=2020-01-16 19:00:00 predicted=0.100650, expected=0.183534
Index=2020-01-16 20:00:00 predicted=0.090514, expected=0.110547
Index=2020-01-16 21:00:00 predicted=0.090702, expected=0.219156
Index=2020-01-16 22:00:00 predicted=0.087612, expected=0.270790
Index=2020-01-16 23:00:00 predicted=0.083669, expected=0.244595
Index=2020-01-17 00:00:00 predicted=0.084461, expected=0.234723
Index=2020-01-17 01:00:00 predicted=0.083371, expected=0.181351
Index=2020-01-17 02:00:00 predicted=0.092692, expected=0.208525
Index=2020-01-17 03:00:00 predicted=0.108490, expected=0.149095
Index=2020-01-17 04:00:00 predicted=0.123572, expected=0.115393
Index=2020-01-17 05:00:00 predicted=0.156352, expected=0.140782
Index=2020-01-17 06:00:00 predicted=0.182054, expected=0.143148
Index=2020-01-17 07:00:00 predicted=0.205027, expected=0.204306
Index=2020-01-17 08:00:00 predicted=0.184803, expected=0.218464
Index=2020-01-17 09:00:00 predicted=0.196183, expected=0.224400
Index=2020-01-17 10:00:00 predicted=0.163293, expected=0.192140
Index=2020-01-17 11:00:00 predicted=0.151146, expected=0.264514
Index=2020-01-17 12:00:00 predicted=0.176366, expected=0.297298
Index=2020-01-17 13:00:00 predicted=0.183526, expected=0.305792
Index=2020-01-17 14:00:00 predicted=0.156607, expected=0.212897
Index=2020-01-17 15:00:00 predicted=0.147654, expected=0.220485
Index=2020-01-17 16:00:00 predicted=0.146018, expected=0.174352
Index=2020-01-17 17:00:00 predicted=0.140321, expected=0.158364
Index=2020-01-17 18:00:00 predicted=0.176880, expected=0.173568
Index=2020-01-17 19:00:00 predicted=0.189823, expected=0.157468
Index=2020-01-17 20:00:00 predicted=0.176733, expected=0.129856
Index=2020-01-17 21:00:00 predicted=0.214718, expected=0.101000
Index=2020-01-17 22:00:00 predicted=0.233688, expected=0.122515
Index=2020-01-17 23:00:00 predicted=0.225854, expected=0.127602
Index=2020-01-18 00:00:00 predicted=0.226456, expected=0.135265
Index=2020-01-18 01:00:00 predicted=0.208442, expected=0.128040
Index=2020-01-18 02:00:00 predicted=0.189615, expected=0.131601
Index=2020-01-18 03:00:00 predicted=0.145200, expected=0.123100
Index=2020-01-18 04:00:00 predicted=0.110181, expected=0.126383
Index=2020-01-18 05:00:00 predicted=0.115462, expected=0.118303
Index=2020-01-18 06:00:00 predicted=0.118093, expected=0.101054
Index=2020-01-18 07:00:00 predicted=0.173620, expected=0.106592
Index=2020-01-18 08:00:00 predicted=0.191781, expected=0.095872
Index=2020-01-18 09:00:00 predicted=0.201024, expected=0.109007
Index=2020-01-18 10:00:00 predicted=0.188094, expected=0.098224
Index=2020-01-18 11:00:00 predicted=0.186386, expected=0.107087
Index=2020-01-18 12:00:00 predicted=0.210188, expected=0.102973
Index=2020-01-18 13:00:00 predicted=0.228859, expected=0.091466
Index=2020-01-18 14:00:00 predicted=0.210741, expected=0.103750
Index=2020-01-18 15:00:00 predicted=0.197011, expected=0.129388
Index=2020-01-18 16:00:00 predicted=0.172532, expected=0.138293
Index=2020-01-18 17:00:00 predicted=0.169286, expected=0.132214
Index=2020-01-18 18:00:00 predicted=0.173188, expected=0.145080
Index=2020-01-18 19:00:00 predicted=0.166688, expected=0.135365
Index=2020-01-18 20:00:00 predicted=0.156573, expected=0.129408
Index=2020-01-18 21:00:00 predicted=0.139712, expected=0.128902
Index=2020-01-18 22:00:00 predicted=0.152494, expected=0.128550
Index=2020-01-18 23:00:00 predicted=0.148374, expected=0.131578
Index=2020-01-19 00:00:00 predicted=0.139362, expected=0.122448
Index=2020-01-19 01:00:00 predicted=0.138533, expected=0.077443
Index=2020-01-19 02:00:00 predicted=0.140465, expected=0.089342
Index=2020-01-19 03:00:00 predicted=0.140828, expected=0.085504
Index=2020-01-19 04:00:00 predicted=0.138496, expected=0.082780
Index=2020-01-19 05:00:00 predicted=0.134078, expected=0.104520
Index=2020-01-19 06:00:00 predicted=0.121906, expected=0.137110
Index=2020-01-19 07:00:00 predicted=0.120604, expected=0.142124
Index=2020-01-19 08:00:00 predicted=0.111837, expected=0.130597
Index=2020-01-19 09:00:00 predicted=0.124127, expected=0.102598
Index=2020-01-19 10:00:00 predicted=0.120060, expected=0.069605
Index=2020-01-19 11:00:00 predicted=0.120092, expected=0.066278
Index=2020-01-19 12:00:00 predicted=0.118879, expected=0.048757
Index=2020-01-19 13:00:00 predicted=0.110464, expected=0.044774
Index=2020-01-19 14:00:00 predicted=0.123964, expected=0.039702
Index=2020-01-19 15:00:00 predicted=0.133964, expected=0.041887
Index=2020-01-19 16:00:00 predicted=0.140158, expected=0.036375
Index=2020-01-19 17:00:00 predicted=0.141611, expected=0.029683
Index=2020-01-19 18:00:00 predicted=0.147849, expected=0.031984
Index=2020-01-19 19:00:00 predicted=0.143208, expected=0.027723
Index=2020-01-19 20:00:00 predicted=0.147398, expected=0.028292
Index=2020-01-19 21:00:00 predicted=0.142126, expected=0.030697
Index=2020-01-19 22:00:00 predicted=0.142273, expected=0.032667
Index=2020-01-19 23:00:00 predicted=0.138987, expected=0.039455
Index=2020-01-20 00:00:00 predicted=0.130573, expected=0.048937
Index=2020-01-20 01:00:00 predicted=0.105975, expected=0.059703
Index=2020-01-20 02:00:00 predicted=0.104736, expected=0.063825
Index=2020-01-20 03:00:00 predicted=0.098643, expected=0.064264
Index=2020-01-20 04:00:00 predicted=0.099723, expected=0.066161
Index=2020-01-20 05:00:00 predicted=0.100887, expected=0.065278
Index=2020-01-20 06:00:00 predicted=0.122126, expected=0.068989
Index=2020-01-20 07:00:00 predicted=0.122417, expected=0.085000
Index=2020-01-20 08:00:00 predicted=0.122859, expected=0.086182
Index=2020-01-20 09:00:00 predicted=0.102823, expected=0.078728
Index=2020-01-20 10:00:00 predicted=0.087856, expected=0.065362
Index=2020-01-20 11:00:00 predicted=0.082836, expected=0.086416
Index=2020-01-20 12:00:00 predicted=0.075880, expected=0.111291
Index=2020-01-20 13:00:00 predicted=0.064293, expected=0.091061
Index=2020-01-20 14:00:00 predicted=0.062244, expected=0.086284
Index=2020-01-20 15:00:00 predicted=0.059407, expected=0.112143
Index=2020-01-20 16:00:00 predicted=0.059378, expected=0.115811
Index=2020-01-20 17:00:00 predicted=0.055655, expected=0.100494
Index=2020-01-20 18:00:00 predicted=0.053241, expected=0.108840
Index=2020-01-20 19:00:00 predicted=0.049513, expected=0.102863
Index=2020-01-20 20:00:00 predicted=0.053816, expected=0.090384
Index=2020-01-20 21:00:00 predicted=0.056292, expected=0.098193
Index=2020-01-20 22:00:00 predicted=0.057013, expected=0.098193
Index=2020-01-20 23:00:00 predicted=0.067612, expected=0.073440
Index=2020-01-21 00:00:00 predicted=0.071377, expected=0.051844
Index=2020-01-21 01:00:00 predicted=0.075637, expected=0.049402
Index=2020-01-21 02:00:00 predicted=0.090571, expected=0.050644
Index=2020-01-21 03:00:00 predicted=0.091032, expected=0.053175
Index=2020-01-21 04:00:00 predicted=0.091258, expected=0.062401
Index=2020-01-21 05:00:00 predicted=0.093558, expected=0.078933
Index=2020-01-21 06:00:00 predicted=0.100523, expected=0.111000
Index=2020-01-21 07:00:00 predicted=0.114042, expected=0.128295
Index=2020-01-21 08:00:00 predicted=0.119512, expected=0.142843
Index=2020-01-21 09:00:00 predicted=0.121127, expected=0.199152
Index=2020-01-21 10:00:00 predicted=0.110047, expected=0.273832
Index=2020-01-21 11:00:00 predicted=0.123664, expected=0.263527
Index=2020-01-21 12:00:00 predicted=0.151845, expected=0.217670
Index=2020-01-21 13:00:00 predicted=0.148432, expected=0.301224
Index=2020-01-21 14:00:00 predicted=0.151957, expected=0.286813
Index=2020-01-21 15:00:00 predicted=0.156178, expected=0.343609
Index=2020-01-21 16:00:00 predicted=0.166014, expected=0.340017
Index=2020-01-21 17:00:00 predicted=0.165662, expected=0.250634
Index=2020-01-21 18:00:00 predicted=0.165907, expected=0.215149
Index=2020-01-21 19:00:00 predicted=0.165876, expected=0.226044
Index=2020-01-21 20:00:00 predicted=0.172366, expected=0.246548
Index=2020-01-21 21:00:00 predicted=0.178845, expected=0.295348
Index=2020-01-21 22:00:00 predicted=0.163256, expected=0.234521
Index=2020-01-21 23:00:00 predicted=0.133774, expected=0.183966
Index=2020-01-22 00:00:00 predicted=0.091331, expected=0.191641
Index=2020-01-22 01:00:00 predicted=0.103691, expected=0.247569
Index=2020-01-22 02:00:00 predicted=0.101584, expected=0.236508
Index=2020-01-22 03:00:00 predicted=0.073549, expected=0.246348
Index=2020-01-22 04:00:00 predicted=0.080328, expected=0.242356
Index=2020-01-22 05:00:00 predicted=0.098166, expected=0.246588
Index=2020-01-22 06:00:00 predicted=0.125168, expected=0.323750
Index=2020-01-22 07:00:00 predicted=-0.000000, expected=0.422338
Index=2020-01-22 08:00:00 predicted=0.078977, expected=0.524128
Index=2020-01-22 09:00:00 predicted=-0.000000, expected=0.473094
Index=2020-01-22 10:00:00 predicted=0.066161, expected=0.521747
Index=2020-01-22 11:00:00 predicted=0.094810, expected=0.539936
Index=2020-01-22 12:00:00 predicted=0.226058, expected=0.463556
Index=2020-01-22 13:00:00 predicted=0.097916, expected=0.484093
Index=2020-01-22 14:00:00 predicted=0.220309, expected=0.509057
Index=2020-01-22 15:00:00 predicted=0.252304, expected=0.508479
Index=2020-01-22 16:00:00 predicted=0.247153, expected=0.511027
Index=2020-01-22 17:00:00 predicted=0.233140, expected=0.421843
Index=2020-01-22 18:00:00 predicted=0.237215, expected=0.342789
Index=2020-01-22 19:00:00 predicted=0.215129, expected=0.320021
Index=2020-01-22 20:00:00 predicted=0.224334, expected=0.355894
Index=2020-01-22 21:00:00 predicted=0.201070, expected=0.317525
Index=2020-01-22 22:00:00 predicted=0.203976, expected=0.198289
Index=2020-01-22 23:00:00 predicted=0.216967, expected=0.143255
Index=2020-01-23 00:00:00 predicted=0.203332, expected=0.087455
Index=2020-01-23 01:00:00 predicted=0.216261, expected=0.058985
Index=2020-01-23 02:00:00 predicted=0.199512, expected=0.049308
Index=2020-01-23 03:00:00 predicted=0.194571, expected=0.075946
Index=2020-01-23 04:00:00 predicted=0.191549, expected=0.098185
Index=2020-01-23 05:00:00 predicted=0.192510, expected=0.121006
Index=2020-01-23 06:00:00 predicted=0.186385, expected=0.144158
Index=2020-01-23 07:00:00 predicted=0.222630, expected=0.156223
Index=2020-01-23 08:00:00 predicted=0.240238, expected=0.218030
Index=2020-01-23 09:00:00 predicted=0.239316, expected=0.259978
Index=2020-01-23 10:00:00 predicted=0.252898, expected=0.335511
Index=2020-01-23 11:00:00 predicted=0.268907, expected=0.341982
Index=2020-01-23 12:00:00 predicted=0.252173, expected=0.341982
Index=2020-01-23 13:00:00 predicted=0.268241, expected=0.326297
Index=2020-01-23 14:00:00 predicted=0.284386, expected=0.281003
Index=2020-01-23 15:00:00 predicted=0.258813, expected=0.252957
Index=2020-01-23 16:00:00 predicted=0.251486, expected=0.230276
Index=2020-01-23 17:00:00 predicted=0.260096, expected=0.201999
Index=2020-01-23 18:00:00 predicted=0.278384, expected=0.186672
Index=2020-01-23 19:00:00 predicted=0.266483, expected=0.177648
Index=2020-01-23 20:00:00 predicted=0.231400, expected=0.207239
Index=2020-01-23 21:00:00 predicted=0.224637, expected=0.227010
Index=2020-01-23 22:00:00 predicted=0.221206, expected=0.229949
Index=2020-01-23 23:00:00 predicted=0.159010, expected=0.201915
Index=2020-01-24 00:00:00 predicted=0.099015, expected=0.168736
Index=2020-01-24 01:00:00 predicted=0.082531, expected=0.187283
Index=2020-01-24 02:00:00 predicted=0.080286, expected=0.214123
Index=2020-01-24 03:00:00 predicted=0.075240, expected=0.175553
Index=2020-01-24 04:00:00 predicted=0.084705, expected=0.180959
Index=2020-01-24 05:00:00 predicted=0.112117, expected=0.205590
Index=2020-01-24 06:00:00 predicted=0.134060, expected=0.293406
Index=2020-01-24 07:00:00 predicted=0.144585, expected=0.314168
Index=2020-01-24 08:00:00 predicted=0.180112, expected=0.363525
Index=2020-01-24 09:00:00 predicted=0.209132, expected=0.356444
Index=2020-01-24 10:00:00 predicted=0.229042, expected=0.289564
Index=2020-01-24 11:00:00 predicted=0.264342, expected=0.344600
Index=2020-01-24 12:00:00 predicted=0.276245, expected=0.370067
Index=2020-01-24 13:00:00 predicted=0.263515, expected=0.423408
Index=2020-01-24 14:00:00 predicted=0.256909, expected=0.370791
Index=2020-01-24 15:00:00 predicted=0.234992, expected=0.360982
Index=2020-01-24 16:00:00 predicted=0.227175, expected=0.403072
Index=2020-01-24 17:00:00 predicted=0.222009, expected=0.373636
Index=2020-01-24 18:00:00 predicted=0.217470, expected=0.300436
Index=2020-01-24 19:00:00 predicted=0.210392, expected=0.262900
Index=2020-01-24 20:00:00 predicted=0.217787, expected=0.256155
Index=2020-01-24 21:00:00 predicted=0.224717, expected=0.270219
Index=2020-01-24 22:00:00 predicted=0.235792, expected=0.263409
Index=2020-01-24 23:00:00 predicted=0.213715, expected=0.323251
Index=2020-01-25 00:00:00 predicted=0.193272, expected=0.298709
Index=2020-01-25 01:00:00 predicted=0.191386, expected=0.261770
Index=2020-01-25 02:00:00 predicted=0.172852, expected=0.225569
Index=2020-01-25 03:00:00 predicted=0.148189, expected=0.196084
Index=2020-01-25 04:00:00 predicted=0.146311, expected=0.199230
Index=2020-01-25 05:00:00 predicted=0.157302, expected=0.236711
Index=2020-01-25 06:00:00 predicted=0.173032, expected=0.315487
Index=2020-01-25 07:00:00 predicted=0.189417, expected=0.454959
Index=2020-01-25 08:00:00 predicted=0.229732, expected=0.486266
Index=2020-01-25 09:00:00 predicted=0.245964, expected=0.593499
Index=2020-01-25 10:00:00 predicted=0.234692, expected=0.699382
Index=2020-01-25 11:00:00 predicted=0.255435, expected=1.000000
Index=2020-01-25 12:00:00 predicted=0.259660, expected=0.933792
Index=2020-01-25 13:00:00 predicted=0.272880, expected=0.708103
Index=2020-01-25 14:00:00 predicted=0.268904, expected=0.499876
Index=2020-01-25 15:00:00 predicted=0.267400, expected=0.407225
Index=2020-01-25 16:00:00 predicted=0.236687, expected=0.421989
Index=2020-01-25 17:00:00 predicted=0.237150, expected=0.386021
Index=2020-01-25 18:00:00 predicted=0.245546, expected=0.397333
Index=2020-01-25 19:00:00 predicted=0.238578, expected=0.368034
Index=2020-01-25 20:00:00 predicted=0.230370, expected=0.350585
Index=2020-01-25 21:00:00 predicted=0.241336, expected=0.364394
Index=2020-01-25 22:00:00 predicted=0.247363, expected=0.325368
Index=2020-01-25 23:00:00 predicted=0.252933, expected=0.423297
Index=2020-01-26 00:00:00 predicted=0.226462, expected=0.369708
Index=2020-01-26 01:00:00 predicted=0.211847, expected=0.299597
Index=2020-01-26 02:00:00 predicted=0.178380, expected=0.198729
Index=2020-01-26 03:00:00 predicted=0.139956, expected=0.163261
Index=2020-01-26 04:00:00 predicted=0.139124, expected=0.154159
Index=2020-01-26 05:00:00 predicted=0.151270, expected=0.200917
Index=2020-01-26 06:00:00 predicted=0.170026, expected=0.333492
Index=2020-01-26 07:00:00 predicted=0.216726, expected=0.330159
Index=2020-01-26 08:00:00 predicted=0.225683, expected=0.442819
Index=2020-01-26 09:00:00 predicted=0.268028, expected=0.580097
Index=2020-01-26 10:00:00 predicted=0.301635, expected=0.495616
Index=2020-01-26 11:00:00 predicted=0.396535, expected=0.525971
Index=2020-01-26 12:00:00 predicted=0.387182, expected=0.512857
Index=2020-01-26 13:00:00 predicted=0.362386, expected=0.413289
Index=2020-01-26 14:00:00 predicted=0.283810, expected=0.398251
Index=2020-01-26 15:00:00 predicted=0.249124, expected=0.357773
Index=2020-01-26 16:00:00 predicted=0.227743, expected=0.165526
Index=2020-01-26 17:00:00 predicted=0.181443, expected=0.151742
Index=2020-01-26 18:00:00 predicted=0.187461, expected=0.158379
Index=2020-01-26 19:00:00 predicted=0.201338, expected=0.184582
Index=2020-01-26 20:00:00 predicted=0.216858, expected=0.322622
Index=2020-01-26 21:00:00 predicted=0.222592, expected=0.314646
Index=2020-01-26 22:00:00 predicted=0.192934, expected=0.339531
Index=2020-01-26 23:00:00 predicted=0.220773, expected=0.357482
Index=2020-01-27 00:00:00 predicted=0.199484, expected=0.377769
Index=2020-01-27 01:00:00 predicted=0.186397, expected=0.382873
Index=2020-01-27 02:00:00 predicted=0.129989, expected=0.377193
Index=2020-01-27 03:00:00 predicted=0.127182, expected=0.245490
Index=2020-01-27 04:00:00 predicted=0.141369, expected=0.178438
Index=2020-01-27 05:00:00 predicted=0.170928, expected=0.299081
Index=2020-01-27 06:00:00 predicted=0.185113, expected=0.392362
Index=2020-01-27 07:00:00 predicted=0.189131, expected=0.382280
Index=2020-01-27 08:00:00 predicted=0.207793, expected=0.384923
Index=2020-01-27 09:00:00 predicted=0.225468, expected=0.486435
Index=2020-01-27 10:00:00 predicted=0.237241, expected=0.393458
Index=2020-01-27 11:00:00 predicted=0.255120, expected=0.329515
Index=2020-01-27 12:00:00 predicted=0.254541, expected=0.109905
Index=2020-01-27 13:00:00 predicted=0.222005, expected=0.262326
Index=2020-01-27 14:00:00 predicted=0.218163, expected=0.342074
Index=2020-01-27 15:00:00 predicted=0.199953, expected=0.357123
Index=2020-01-27 16:00:00 predicted=0.152180, expected=0.287779
Index=2020-01-27 17:00:00 predicted=0.125582, expected=0.108709
Index=2020-01-27 18:00:00 predicted=0.100246, expected=0.112778
Index=2020-01-27 19:00:00 predicted=0.099071, expected=0.150883
Index=2020-01-27 20:00:00 predicted=0.158904, expected=0.145741
Index=2020-01-27 21:00:00 predicted=0.176384, expected=0.156156
Index=2020-01-27 22:00:00 predicted=0.179476, expected=0.154152
Index=2020-01-27 23:00:00 predicted=0.202750, expected=0.144259
Index=2020-01-28 00:00:00 predicted=0.239439, expected=0.212342
Index=2020-01-28 01:00:00 predicted=0.246898, expected=0.192019
Index=2020-01-28 02:00:00 predicted=0.249507, expected=0.175882
Index=2020-01-28 03:00:00 predicted=0.197598, expected=0.190613
Index=2020-01-28 04:00:00 predicted=0.148155, expected=0.184283
Index=2020-01-28 05:00:00 predicted=0.193929, expected=0.193974
Index=2020-01-28 06:00:00 predicted=0.220791, expected=0.274920
Index=2020-01-28 07:00:00 predicted=0.189727, expected=0.315506
Index=2020-01-28 08:00:00 predicted=0.184887, expected=0.357118
Index=2020-01-28 09:00:00 predicted=0.223736, expected=0.430789
Index=2020-01-28 10:00:00 predicted=0.225019, expected=0.540240
Index=2020-01-28 11:00:00 predicted=0.223426, expected=0.509659
Index=2020-01-28 12:00:00 predicted=0.125458, expected=0.504476
Index=2020-01-28 13:00:00 predicted=0.180457, expected=0.485928
Index=2020-01-28 14:00:00 predicted=0.197599, expected=0.413790
Index=2020-01-28 15:00:00 predicted=0.229076, expected=0.419854
Index=2020-01-28 16:00:00 predicted=0.223295, expected=0.361680
Index=2020-01-28 17:00:00 predicted=0.148476, expected=0.312888
Index=2020-01-28 18:00:00 predicted=0.123197, expected=0.287353
Index=2020-01-28 19:00:00 predicted=0.127907, expected=0.290322
Index=2020-01-28 20:00:00 predicted=0.132974, expected=0.282825
Index=2020-01-28 21:00:00 predicted=0.148821, expected=0.188128
Index=2020-01-28 22:00:00 predicted=0.157267, expected=0.100654
Index=2020-01-28 23:00:00 predicted=0.143699, expected=0.039045
Index=2020-01-29 00:00:00 predicted=0.151380, expected=0.058210
Index=2020-01-29 01:00:00 predicted=0.137150, expected=0.006985
Index=2020-01-29 02:00:00 predicted=0.137357, expected=0.000000
Index=2020-01-29 03:00:00 predicted=0.138324, expected=0.002501
Index=2020-01-29 04:00:00 predicted=0.133873, expected=0.001005
Index=2020-01-29 05:00:00 predicted=0.139104, expected=0.004182
Index=2020-01-29 06:00:00 predicted=0.171966, expected=0.008111
Index=2020-01-29 07:00:00 predicted=0.192731, expected=0.017343
Index=2020-01-29 08:00:00 predicted=0.232900, expected=0.023266
Index=2020-01-29 09:00:00 predicted=0.264555, expected=0.032578
Index=2020-01-29 10:00:00 predicted=0.294549, expected=0.070835
Index=2020-01-29 11:00:00 predicted=0.306572, expected=0.066895
Index=2020-01-29 12:00:00 predicted=0.322477, expected=0.081798
Index=2020-01-29 13:00:00 predicted=0.316923, expected=0.019937
Index=2020-01-29 14:00:00 predicted=0.304399, expected=0.004341
Index=2020-01-29 15:00:00 predicted=0.295387, expected=0.002629
Index=2020-01-29 16:00:00 predicted=0.270568, expected=0.002814
Index=2020-01-29 17:00:00 predicted=0.246477, expected=0.005150
Index=2020-01-29 18:00:00 predicted=0.234309, expected=0.009656
Index=2020-01-29 19:00:00 predicted=0.230940, expected=0.008954
Index=2020-01-29 20:00:00 predicted=0.219981, expected=0.015204
Index=2020-01-29 21:00:00 predicted=0.174643, expected=0.019178
Index=2020-01-29 22:00:00 predicted=0.106760, expected=0.030122
Index=2020-01-29 23:00:00 predicted=0.030678, expected=0.029976
Index=2020-01-30 00:00:00 predicted=0.061615, expected=0.015255
Index=2020-01-30 01:00:00 predicted=0.042256, expected=0.006894
Index=2020-01-30 02:00:00 predicted=0.030678, expected=0.007869
Index=2020-01-30 03:00:00 predicted=0.030678, expected=0.009822
Index=2020-01-30 04:00:00 predicted=0.030678, expected=0.011123
Index=2020-01-30 05:00:00 predicted=0.030678, expected=0.013883
Index=2020-01-30 06:00:00 predicted=0.030678, expected=0.035085
Index=2020-01-30 07:00:00 predicted=0.034264, expected=0.102243
Index=2020-01-30 08:00:00 predicted=0.053255, expected=0.149664
Index=2020-01-30 09:00:00 predicted=0.038585, expected=0.190623
Index=2020-01-30 10:00:00 predicted=0.076495, expected=0.301712
Index=2020-01-30 11:00:00 predicted=0.076572, expected=0.340757
Index=2020-01-30 12:00:00 predicted=0.082852, expected=0.260830
Index=2020-01-30 13:00:00 predicted=0.030678, expected=0.231026
Index=2020-01-30 14:00:00 predicted=0.030678, expected=0.152451
Index=2020-01-30 15:00:00 predicted=0.030678, expected=0.114680
Index=2020-01-30 16:00:00 predicted=0.030678, expected=0.124493
Index=2020-01-30 17:00:00 predicted=0.030678, expected=0.123818
Index=2020-01-30 18:00:00 predicted=0.030678, expected=0.164099
Index=2020-01-30 19:00:00 predicted=0.035049, expected=0.108197
Index=2020-01-30 20:00:00 predicted=0.052325, expected=0.132237
Index=2020-01-30 21:00:00 predicted=0.048370, expected=0.153932
Index=2020-01-30 22:00:00 predicted=0.041957, expected=0.104663
Index=2020-01-30 23:00:00 predicted=0.040094, expected=0.134557
Index=2020-01-31 00:00:00 predicted=0.030678, expected=0.122677
Index=2020-01-31 01:00:00 predicted=0.030678, expected=0.125275
Index=2020-01-31 02:00:00 predicted=0.030678, expected=0.123034
Index=2020-01-31 03:00:00 predicted=0.030678, expected=0.061762
Index=2020-01-31 04:00:00 predicted=0.030678, expected=0.056002
Index=2020-01-31 05:00:00 predicted=0.030678, expected=0.078271
Index=2020-01-31 06:00:00 predicted=0.030678, expected=0.104800
Index=2020-01-31 07:00:00 predicted=0.049429, expected=0.193578
Index=2020-01-31 08:00:00 predicted=0.107250, expected=0.341378
Index=2020-01-31 09:00:00 predicted=0.157097, expected=0.337626
Index=2020-01-31 10:00:00 predicted=0.189758, expected=0.321903
Index=2020-01-31 11:00:00 predicted=0.200199, expected=0.303906
Index=2020-01-31 12:00:00 predicted=0.219480, expected=0.385088
Index=2020-01-31 13:00:00 predicted=0.214423, expected=0.494938
/Users/mirchearsov/PycharmProjects/air-pollution-sensors-v2/evaluation/ARIMA/24/yhat__Karpos_value_pm10__2020-01-01_2020-02-01__6.csv
/Users/mirchearsov/PycharmProjects/air-pollution-sensors-v2/evaluation/ARIMA/24/y__Karpos_value_pm10__2020-01-01_2020-02-01.csv
/Users/mirchearsov/PycharmProjects/air-pollution-sensors-v2/evaluation/ARIMA/24/yhat__Karpos_value_pm10__2020-01-01_2020-02-01__6.csv
/Users/mirchearsov/PycharmProjects/air-pollution-sensors-v2/evaluation/ARIMA/24/y__Karpos_value_pm10__2020-01-01_2020-02-01.csv
{'mse': 0.028670637736410157, 'rmse': 0.16932406130379155}