,Karpos_value_pm10__+12
2020-01-01 12:00:00,0.06676013022661209
2020-01-01 13:00:00,0.06769067049026489
2020-01-01 14:00:00,0.07099785655736923
2020-01-01 15:00:00,0.0627063736319542
2020-01-01 16:00:00,0.0565771721303463
2020-01-01 17:00:00,0.06243044510483742
2020-01-01 18:00:00,0.0722336545586586
2020-01-01 19:00:00,0.06310003995895386
2020-01-01 20:00:00,0.06770075112581253
2020-01-01 21:00:00,0.07301080226898193
2020-01-01 22:00:00,0.07204778492450714
2020-01-01 23:00:00,0.04760090261697769
2020-01-02 00:00:00,0.07648998498916626
2020-01-02 01:00:00,0.06202846020460129
2020-01-02 02:00:00,0.03985494747757912
2020-01-02 03:00:00,0.06900900602340698
2020-01-02 04:00:00,0.07636904716491699
2020-01-02 05:00:00,0.06322816759347916
2020-01-02 06:00:00,0.09868796914815903
2020-01-02 07:00:00,0.1431996077299118
2020-01-02 08:00:00,0.18141372501850128
2020-01-02 09:00:00,0.18899689614772797
2020-01-02 10:00:00,0.22345072031021118
2020-01-02 11:00:00,0.19321060180664062
2020-01-02 12:00:00,0.1404801458120346
2020-01-02 13:00:00,0.14280855655670166
2020-01-02 14:00:00,0.11891840398311615
2020-01-02 15:00:00,0.11974538862705231
2020-01-02 16:00:00,0.10751615464687347
2020-01-02 17:00:00,0.10985943675041199
2020-01-02 18:00:00,0.11636382341384888
2020-01-02 19:00:00,0.10168029367923737
2020-01-02 20:00:00,0.10154436528682709
2020-01-02 21:00:00,0.08252871036529541
2020-01-02 22:00:00,0.08569763600826263
2020-01-02 23:00:00,0.08904432505369186
2020-01-03 00:00:00,0.0854342058300972
2020-01-03 01:00:00,0.09783182293176651
2020-01-03 02:00:00,0.09321650862693787
2020-01-03 03:00:00,0.10756668448448181
2020-01-03 04:00:00,0.12443116307258606
2020-01-03 05:00:00,0.1543961763381958
2020-01-03 06:00:00,0.21109187602996826
2020-01-03 07:00:00,0.26569318771362305
2020-01-03 08:00:00,0.2716074585914612
2020-01-03 09:00:00,0.3218984007835388
2020-01-03 10:00:00,0.3397678732872009
2020-01-03 11:00:00,0.3158887028694153
2020-01-03 12:00:00,0.2941577732563019
2020-01-03 13:00:00,0.2985535264015198
2020-01-03 14:00:00,0.2636909484863281
2020-01-03 15:00:00,0.3014211654663086
2020-01-03 16:00:00,0.24137835204601288
2020-01-03 17:00:00,0.2089938223361969
2020-01-03 18:00:00,0.19101080298423767
2020-01-03 19:00:00,0.15348562598228455
2020-01-03 20:00:00,0.11660898476839066
2020-01-03 21:00:00,0.08501020818948746
2020-01-03 22:00:00,0.06316211819648743
2020-01-03 23:00:00,0.10659128427505493
2020-01-04 00:00:00,0.05695322901010513
2020-01-04 01:00:00,0.07651866227388382
2020-01-04 02:00:00,0.15323835611343384
2020-01-04 03:00:00,0.20052023231983185
2020-01-04 04:00:00,0.21315433084964752
2020-01-04 05:00:00,0.20109830796718597
2020-01-04 06:00:00,0.15219323337078094
2020-01-04 07:00:00,0.19396670162677765
2020-01-04 08:00:00,0.2594999372959137
2020-01-04 09:00:00,0.2041861116886139
2020-01-04 10:00:00,0.4198521375656128
2020-01-04 11:00:00,0.4063084125518799
2020-01-04 12:00:00,0.3916538953781128
2020-01-04 13:00:00,0.42075711488723755
2020-01-04 14:00:00,0.4317612051963806
2020-01-04 15:00:00,0.39568138122558594
2020-01-04 16:00:00,0.4078899621963501
2020-01-04 17:00:00,0.36067086458206177
2020-01-04 18:00:00,0.328735888004303
2020-01-04 19:00:00,0.3240938186645508
2020-01-04 20:00:00,0.29102200269699097
2020-01-04 21:00:00,0.1971905380487442
2020-01-04 22:00:00,0.22391189634799957
2020-01-04 23:00:00,0.20324121415615082
2020-01-05 00:00:00,0.17605869472026825
2020-01-05 01:00:00,0.14973613619804382
2020-01-05 02:00:00,0.17749309539794922
2020-01-05 03:00:00,0.21092084050178528
2020-01-05 04:00:00,0.2159643918275833
2020-01-05 05:00:00,0.13407278060913086
2020-01-05 06:00:00,0.004561394453048706
2020-01-05 07:00:00,0.008835498243570328
2020-01-05 08:00:00,0.014575101435184479
2020-01-05 09:00:00,0.024240419268608093
2020-01-05 10:00:00,0.0433688648045063
2020-01-05 11:00:00,0.03577590733766556
2020-01-05 12:00:00,0.03927338868379593
2020-01-05 13:00:00,0.03581015020608902
2020-01-05 14:00:00,0.03655967861413956
2020-01-05 15:00:00,0.03149190545082092
2020-01-05 16:00:00,0.01937224343419075
2020-01-05 17:00:00,0.023350931704044342
2020-01-05 18:00:00,0.0193730928003788
2020-01-05 19:00:00,0.020045097917318344
2020-01-05 20:00:00,0.01965498924255371
2020-01-05 21:00:00,0.022639159113168716
2020-01-05 22:00:00,0.019901122897863388
2020-01-05 23:00:00,0.020358141511678696
2020-01-06 00:00:00,0.02591894194483757
2020-01-06 01:00:00,0.022876277565956116
2020-01-06 02:00:00,0.025104880332946777
2020-01-06 03:00:00,0.023866336792707443
2020-01-06 04:00:00,0.022708818316459656
2020-01-06 05:00:00,0.023778770118951797
2020-01-06 06:00:00,0.0253911130130291
2020-01-06 07:00:00,0.021176662296056747
2020-01-06 08:00:00,0.028636619448661804
2020-01-06 09:00:00,0.030864747241139412
2020-01-06 10:00:00,0.04249913990497589
2020-01-06 11:00:00,0.03745874762535095
2020-01-06 12:00:00,0.03834151849150658
2020-01-06 13:00:00,0.04155806824564934
2020-01-06 14:00:00,0.04257304593920708
2020-01-06 15:00:00,0.04141797125339508
2020-01-06 16:00:00,0.03891836851835251
2020-01-06 17:00:00,0.03972814604640007
2020-01-06 18:00:00,0.04184819757938385
2020-01-06 19:00:00,0.044627513736486435
2020-01-06 20:00:00,0.05120523273944855
2020-01-06 21:00:00,0.04489653557538986
2020-01-06 22:00:00,0.03984836861491203
2020-01-06 23:00:00,0.04471757262945175
2020-01-07 00:00:00,0.05064195394515991
2020-01-07 01:00:00,0.05045296251773834
2020-01-07 02:00:00,0.05138731747865677
2020-01-07 03:00:00,0.051922328770160675
2020-01-07 04:00:00,0.04456225782632828
2020-01-07 05:00:00,0.058193009346723557
2020-01-07 06:00:00,0.06350952386856079
2020-01-07 07:00:00,0.06540551781654358
2020-01-07 08:00:00,0.06807824969291687
2020-01-07 09:00:00,0.07006169855594635
2020-01-07 10:00:00,0.09770762920379639
2020-01-07 11:00:00,0.07221671938896179
2020-01-07 12:00:00,0.07571326196193695
2020-01-07 13:00:00,0.1076851412653923
2020-01-07 14:00:00,0.092750683426857
2020-01-07 15:00:00,0.09775529056787491
2020-01-07 16:00:00,0.0957789197564125
2020-01-07 17:00:00,0.10076707601547241
2020-01-07 18:00:00,0.09919702261686325
2020-01-07 19:00:00,0.07764071971178055
2020-01-07 20:00:00,0.07332006841897964
2020-01-07 21:00:00,0.09613259881734848
2020-01-07 22:00:00,0.07164151966571808
2020-01-07 23:00:00,0.06659407168626785
2020-01-08 00:00:00,0.07846993952989578
2020-01-08 01:00:00,0.058514729142189026
2020-01-08 02:00:00,0.06856696307659149
2020-01-08 03:00:00,0.08363161981105804
2020-01-08 04:00:00,0.06828760355710983
2020-01-08 05:00:00,0.1042741984128952
2020-01-08 06:00:00,0.1688985824584961
2020-01-08 07:00:00,0.20447112619876862
2020-01-08 08:00:00,0.33443695306777954
2020-01-08 09:00:00,0.3547091484069824
2020-01-08 10:00:00,0.5421205759048462
2020-01-08 11:00:00,0.48425614833831787
2020-01-08 12:00:00,0.24411781132221222
2020-01-08 13:00:00,0.2566324472427368
2020-01-08 14:00:00,0.15425696969032288
2020-01-08 15:00:00,0.22954924404621124
2020-01-08 16:00:00,0.2342836558818817
2020-01-08 17:00:00,0.22838732600212097
2020-01-08 18:00:00,0.23392228782176971
2020-01-08 19:00:00,0.15606750547885895
2020-01-08 20:00:00,0.13820916414260864
2020-01-08 21:00:00,0.09274057298898697
2020-01-08 22:00:00,0.06862415373325348
2020-01-08 23:00:00,0.08048463612794876
2020-01-09 00:00:00,0.05854993313550949
2020-01-09 01:00:00,0.02740025520324707
2020-01-09 02:00:00,0.020891733467578888
2020-01-09 03:00:00,0.02382873371243477
2020-01-09 04:00:00,0.04268255829811096
2020-01-09 05:00:00,0.11255457997322083
2020-01-09 06:00:00,0.15015241503715515
2020-01-09 07:00:00,0.16378137469291687
2020-01-09 08:00:00,0.22438174486160278
2020-01-09 09:00:00,0.26745226979255676
2020-01-09 10:00:00,0.3474041819572449
2020-01-09 11:00:00,0.27263393998146057
2020-01-09 12:00:00,0.3066405653953552
2020-01-09 13:00:00,0.45821452140808105
2020-01-09 14:00:00,0.36391061544418335
2020-01-09 15:00:00,0.3364049196243286
2020-01-09 16:00:00,0.3565402030944824
2020-01-09 17:00:00,0.36591649055480957
2020-01-09 18:00:00,0.33528584241867065
2020-01-09 19:00:00,0.23169027268886566
2020-01-09 20:00:00,0.19750957190990448
2020-01-09 21:00:00,0.14161615073680878
2020-01-09 22:00:00,0.15554606914520264
2020-01-09 23:00:00,0.15616880357265472
2020-01-10 00:00:00,0.22199970483779907
2020-01-10 01:00:00,0.21781401336193085
2020-01-10 02:00:00,0.20847083628177643
2020-01-10 03:00:00,0.2088044136762619
2020-01-10 04:00:00,0.19339321553707123
2020-01-10 05:00:00,0.25453656911849976
2020-01-10 06:00:00,0.33368098735809326
2020-01-10 07:00:00,0.29097211360931396
2020-01-10 08:00:00,0.3176806569099426
2020-01-10 09:00:00,0.28320884704589844
2020-01-10 10:00:00,0.3507556915283203
2020-01-10 11:00:00,0.33268123865127563
2020-01-10 12:00:00,0.29472407698631287
2020-01-10 13:00:00,0.3345627784729004
2020-01-10 14:00:00,0.308279812335968
2020-01-10 15:00:00,0.26961302757263184
2020-01-10 16:00:00,0.2519339323043823
2020-01-10 17:00:00,0.23250193893909454
2020-01-10 18:00:00,0.20489785075187683
2020-01-10 19:00:00,0.20014066994190216
2020-01-10 20:00:00,0.20864476263523102
2020-01-10 21:00:00,0.1493629515171051
2020-01-10 22:00:00,0.15727558732032776
2020-01-10 23:00:00,0.17055688798427582
2020-01-11 00:00:00,0.17537006735801697
2020-01-11 01:00:00,0.17762671411037445
2020-01-11 02:00:00,0.18403153121471405
2020-01-11 03:00:00,0.16512498259544373
2020-01-11 04:00:00,0.1893618106842041
2020-01-11 05:00:00,0.22417806088924408
2020-01-11 06:00:00,0.3135488033294678
2020-01-11 07:00:00,0.35967373847961426
2020-01-11 08:00:00,0.3342869281768799
2020-01-11 09:00:00,0.33052700757980347
2020-01-11 10:00:00,0.36231058835983276
2020-01-11 11:00:00,0.3824908137321472
2020-01-11 12:00:00,0.3603350520133972
2020-01-11 13:00:00,0.34749269485473633
2020-01-11 14:00:00,0.06807408481836319
2020-01-11 15:00:00,0.04379776865243912
2020-01-11 16:00:00,0.030160367488861084
2020-01-11 17:00:00,0.015169195830821991
2020-01-11 18:00:00,0.04042932391166687
2020-01-11 19:00:00,0.006475403904914856
2020-01-11 20:00:00,-0.0007558315992355347
2020-01-11 21:00:00,-0.013594508171081543
2020-01-11 22:00:00,0.0313916951417923
2020-01-11 23:00:00,0.0364740788936615
2020-01-12 00:00:00,0.04225052893161774
2020-01-12 01:00:00,0.04501873254776001
2020-01-12 02:00:00,0.07826554030179977
2020-01-12 03:00:00,0.1080075353384018
2020-01-12 04:00:00,0.1064051166176796
2020-01-12 05:00:00,0.10650188475847244
2020-01-12 06:00:00,0.08592528104782104
2020-01-12 07:00:00,0.07298564910888672
2020-01-12 08:00:00,0.06610534340143204
2020-01-12 09:00:00,0.05901896953582764
2020-01-12 10:00:00,0.0586409829556942
2020-01-12 11:00:00,0.07159885764122009
2020-01-12 12:00:00,0.061929717659950256
2020-01-12 13:00:00,0.06580190360546112
2020-01-12 14:00:00,0.06402488052845001
2020-01-12 15:00:00,0.07549425214529037
2020-01-12 16:00:00,0.08253800868988037
2020-01-12 17:00:00,0.08582237362861633
2020-01-12 18:00:00,0.0951068252325058
2020-01-12 19:00:00,0.08493752777576447
2020-01-12 20:00:00,0.08658307045698166
2020-01-12 21:00:00,0.09255523979663849
2020-01-12 22:00:00,0.10160618275403976
2020-01-12 23:00:00,0.08517004549503326
2020-01-13 00:00:00,0.08530092239379883
2020-01-13 01:00:00,0.09107547253370285
2020-01-13 02:00:00,0.1161772757768631
2020-01-13 03:00:00,0.12012004107236862
2020-01-13 04:00:00,0.11328431218862534
2020-01-13 05:00:00,0.13819372653961182
2020-01-13 06:00:00,0.14256548881530762
2020-01-13 07:00:00,0.15490007400512695
2020-01-13 08:00:00,0.15814167261123657
2020-01-13 09:00:00,0.17890729010105133
2020-01-13 10:00:00,0.16728569567203522
2020-01-13 11:00:00,0.13491618633270264
2020-01-13 12:00:00,0.11175835877656937
2020-01-13 13:00:00,0.12681755423545837
2020-01-13 14:00:00,0.12254723906517029
2020-01-13 15:00:00,0.12731575965881348
2020-01-13 16:00:00,0.12209917604923248
2020-01-13 17:00:00,0.12452222406864166
2020-01-13 18:00:00,0.11650800704956055
2020-01-13 19:00:00,0.12014983594417572
2020-01-13 20:00:00,0.1097446084022522
2020-01-13 21:00:00,0.09433618187904358
2020-01-13 22:00:00,0.08500991761684418
2020-01-13 23:00:00,0.08542424440383911
2020-01-14 00:00:00,0.09612768888473511
2020-01-14 01:00:00,0.09104984253644943
2020-01-14 02:00:00,0.09316860884428024
2020-01-14 03:00:00,0.08988045156002045
2020-01-14 04:00:00,0.08967651426792145
2020-01-14 05:00:00,0.08920495212078094
2020-01-14 06:00:00,0.09162075817584991
2020-01-14 07:00:00,0.08861066401004791
2020-01-14 08:00:00,0.07555573433637619
2020-01-14 09:00:00,0.07064313441514969
2020-01-14 10:00:00,0.07526201754808426
2020-01-14 11:00:00,0.07462577521800995
2020-01-14 12:00:00,0.0790083110332489
2020-01-14 13:00:00,0.08055124431848526
2020-01-14 14:00:00,0.0809175968170166
2020-01-14 15:00:00,0.08459276705980301
2020-01-14 16:00:00,0.08566813170909882
2020-01-14 17:00:00,0.08643735200166702
2020-01-14 18:00:00,0.08741320669651031
2020-01-14 19:00:00,0.0722324326634407
2020-01-14 20:00:00,0.07102562487125397
2020-01-14 21:00:00,0.07865320891141891
2020-01-14 22:00:00,0.07928939163684845
2020-01-14 23:00:00,0.07960624992847443
2020-01-15 00:00:00,0.08370226621627808
2020-01-15 01:00:00,0.08547535538673401
2020-01-15 02:00:00,0.09156079590320587
2020-01-15 03:00:00,0.0959918200969696
2020-01-15 04:00:00,0.09801379591226578
2020-01-15 05:00:00,0.09554371982812881
2020-01-15 06:00:00,0.08675707876682281
2020-01-15 07:00:00,0.08784183114767075
2020-01-15 08:00:00,0.09540203958749771
2020-01-15 09:00:00,0.09367566555738449
2020-01-15 10:00:00,0.09286476671695709
2020-01-15 11:00:00,0.07743123918771744
2020-01-15 12:00:00,0.09042110294103622
2020-01-15 13:00:00,0.0937720537185669
2020-01-15 14:00:00,0.09691430628299713
2020-01-15 15:00:00,0.08976605534553528
2020-01-15 16:00:00,0.09316692501306534
2020-01-15 17:00:00,0.08770163357257843
2020-01-15 18:00:00,0.08877810835838318
2020-01-15 19:00:00,0.09482542425394058
2020-01-15 20:00:00,0.09961970895528793
2020-01-15 21:00:00,0.1053592637181282
2020-01-15 22:00:00,0.09503674507141113
2020-01-15 23:00:00,0.10076245665550232
2020-01-16 00:00:00,0.10656506568193436
2020-01-16 01:00:00,0.11718389391899109
2020-01-16 02:00:00,0.1073484867811203
2020-01-16 03:00:00,0.10261062532663345
2020-01-16 04:00:00,0.09865547716617584
2020-01-16 05:00:00,0.10448725521564484
2020-01-16 06:00:00,0.10536345839500427
2020-01-16 07:00:00,0.10085098445415497
2020-01-16 08:00:00,0.09502170234918594
2020-01-16 09:00:00,0.08986444771289825
2020-01-16 10:00:00,0.08694641292095184
2020-01-16 11:00:00,0.08600732684135437
2020-01-16 12:00:00,0.09874463826417923
2020-01-16 13:00:00,0.10629304498434067
2020-01-16 14:00:00,0.10824093222618103
2020-01-16 15:00:00,0.10760689526796341
2020-01-16 16:00:00,0.12317632138729095
2020-01-16 17:00:00,0.14043377339839935
2020-01-16 18:00:00,0.1354716271162033
2020-01-16 19:00:00,0.10609143227338791
2020-01-16 20:00:00,0.09639550745487213
2020-01-16 21:00:00,0.10998205840587616
2020-01-16 22:00:00,0.08994199335575104
2020-01-16 23:00:00,0.09763266146183014
2020-01-17 00:00:00,0.12263264507055283
2020-01-17 01:00:00,0.16223396360874176
2020-01-17 02:00:00,0.1200127974152565
2020-01-17 03:00:00,0.11239670217037201
2020-01-17 04:00:00,0.08071543276309967
2020-01-17 05:00:00,0.07493694126605988
2020-01-17 06:00:00,0.11243029683828354
2020-01-17 07:00:00,0.09774081408977509
2020-01-17 08:00:00,0.10229289531707764
2020-01-17 09:00:00,0.14050538837909698
2020-01-17 10:00:00,0.14752787351608276
2020-01-17 11:00:00,0.1430007815361023
2020-01-17 12:00:00,0.16964532434940338
2020-01-17 13:00:00,0.27508872747421265
2020-01-17 14:00:00,0.2570452094078064
2020-01-17 15:00:00,0.22045885026454926
2020-01-17 16:00:00,0.24401284754276276
2020-01-17 17:00:00,0.2304019331932068
2020-01-17 18:00:00,0.24841417372226715
2020-01-17 19:00:00,0.1707211583852768
2020-01-17 20:00:00,0.2274097055196762
2020-01-17 21:00:00,0.2321237474679947
2020-01-17 22:00:00,0.21064972877502441
2020-01-17 23:00:00,0.19781042635440826
2020-01-18 00:00:00,0.16322475671768188
2020-01-18 01:00:00,0.16204822063446045
2020-01-18 02:00:00,0.1264786720275879
2020-01-18 03:00:00,0.1189521923661232
2020-01-18 04:00:00,0.13535264134407043
2020-01-18 05:00:00,0.14568458497524261
2020-01-18 06:00:00,0.16996410489082336
2020-01-18 07:00:00,0.1625053584575653
2020-01-18 08:00:00,0.17013517022132874
2020-01-18 09:00:00,0.14917440712451935
2020-01-18 10:00:00,0.1960342973470688
2020-01-18 11:00:00,0.19809140264987946
2020-01-18 12:00:00,0.194567009806633
2020-01-18 13:00:00,0.19114680588245392
2020-01-18 14:00:00,0.1865498423576355
2020-01-18 15:00:00,0.17808754742145538
2020-01-18 16:00:00,0.17692597210407257
2020-01-18 17:00:00,0.16820189356803894
2020-01-18 18:00:00,0.1510317176580429
2020-01-18 19:00:00,0.13801750540733337
2020-01-18 20:00:00,0.12245217710733414
2020-01-18 21:00:00,0.13145588338375092
2020-01-18 22:00:00,0.1239628940820694
2020-01-18 23:00:00,0.12895327806472778
2020-01-19 00:00:00,0.1185615062713623
2020-01-19 01:00:00,0.11295624822378159
2020-01-19 02:00:00,0.11833107471466064
2020-01-19 03:00:00,0.11699098348617554
2020-01-19 04:00:00,0.11149799823760986
2020-01-19 05:00:00,0.11186353862285614
2020-01-19 06:00:00,0.11982275545597076
2020-01-19 07:00:00,0.11189863830804825
2020-01-19 08:00:00,0.11493886262178421
2020-01-19 09:00:00,0.10647226870059967
2020-01-19 10:00:00,0.12206316739320755
2020-01-19 11:00:00,0.12347379326820374
2020-01-19 12:00:00,0.11568371951580048
2020-01-19 13:00:00,0.10935284942388535
2020-01-19 14:00:00,0.1216571182012558
2020-01-19 15:00:00,0.12031456083059311
2020-01-19 16:00:00,0.11643457412719727
2020-01-19 17:00:00,0.12170597910881042
2020-01-19 18:00:00,0.12561452388763428
2020-01-19 19:00:00,0.1085902601480484
2020-01-19 20:00:00,0.1024584174156189
2020-01-19 21:00:00,0.0817776545882225
2020-01-19 22:00:00,0.07211426645517349
2020-01-19 23:00:00,0.07009212672710419
2020-01-20 00:00:00,0.05443999916315079
2020-01-20 01:00:00,0.05369926244020462
2020-01-20 02:00:00,0.05137132108211517
2020-01-20 03:00:00,0.046173740178346634
2020-01-20 04:00:00,0.054080091416835785
2020-01-20 05:00:00,0.05615440383553505
2020-01-20 06:00:00,0.05829152092337608
2020-01-20 07:00:00,0.05527104437351227
2020-01-20 08:00:00,0.056575220078229904
2020-01-20 09:00:00,0.05979952588677406
2020-01-20 10:00:00,0.058292727917432785
2020-01-20 11:00:00,0.06113698333501816
2020-01-20 12:00:00,0.06326957792043686
2020-01-20 13:00:00,0.07219763845205307
2020-01-20 14:00:00,0.07154251635074615
2020-01-20 15:00:00,0.06941287219524384
2020-01-20 16:00:00,0.06704292446374893
2020-01-20 17:00:00,0.06798828393220901
2020-01-20 18:00:00,0.06899099051952362
2020-01-20 19:00:00,0.06558987498283386
2020-01-20 20:00:00,0.07028671354055405
2020-01-20 21:00:00,0.07034740597009659
2020-01-20 22:00:00,0.06523677706718445
2020-01-20 23:00:00,0.08524907380342484
2020-01-21 00:00:00,0.10799874365329742
2020-01-21 01:00:00,0.07678169757127762
2020-01-21 02:00:00,0.09060518443584442
2020-01-21 03:00:00,0.0988754853606224
2020-01-21 04:00:00,0.09752524644136429
2020-01-21 05:00:00,0.1101190522313118
2020-01-21 06:00:00,0.1302753984928131
2020-01-21 07:00:00,0.12710250914096832
2020-01-21 08:00:00,0.1451183408498764
2020-01-21 09:00:00,0.15050829946994781
2020-01-21 10:00:00,0.217202827334404
2020-01-21 11:00:00,0.19487088918685913
2020-01-21 12:00:00,0.16252461075782776
2020-01-21 13:00:00,0.24170510470867157
2020-01-21 14:00:00,0.2045699954032898
2020-01-21 15:00:00,0.2097485065460205
2020-01-21 16:00:00,0.22492830455303192
2020-01-21 17:00:00,0.22200895845890045
2020-01-21 18:00:00,0.21664410829544067
2020-01-21 19:00:00,0.07573601603507996
2020-01-21 20:00:00,0.070160411298275
2020-01-21 21:00:00,0.08273061364889145
2020-01-21 22:00:00,0.06617477536201477
2020-01-21 23:00:00,0.05841878056526184
2020-01-22 00:00:00,0.05567681044340134
2020-01-22 01:00:00,0.06520754098892212
2020-01-22 02:00:00,0.04796893894672394
2020-01-22 03:00:00,0.06808549165725708
2020-01-22 04:00:00,0.07656583189964294
2020-01-22 05:00:00,0.09507422149181366
2020-01-22 06:00:00,0.16474583745002747
2020-01-22 07:00:00,0.17783541977405548
2020-01-22 08:00:00,0.2557741403579712
2020-01-22 09:00:00,0.41432350873947144
2020-01-22 10:00:00,0.5031335353851318
2020-01-22 11:00:00,0.43392300605773926
2020-01-22 12:00:00,0.4726260304450989
2020-01-22 13:00:00,0.4453369975090027
2020-01-22 14:00:00,0.4541262984275818
2020-01-22 15:00:00,0.470933735370636
2020-01-22 16:00:00,0.42389559745788574
2020-01-22 17:00:00,0.3889678120613098
2020-01-22 18:00:00,0.28243350982666016
2020-01-22 19:00:00,0.2143905609846115
2020-01-22 20:00:00,0.2105073630809784
2020-01-22 21:00:00,0.1752701997756958
2020-01-22 22:00:00,0.18561112880706787
2020-01-22 23:00:00,0.17784419655799866
2020-01-23 00:00:00,0.21984899044036865
2020-01-23 01:00:00,0.22634172439575195
2020-01-23 02:00:00,0.24789978563785553
2020-01-23 03:00:00,0.22006775438785553
2020-01-23 04:00:00,0.22651337087154388
2020-01-23 05:00:00,0.3197382688522339
2020-01-23 06:00:00,0.40423595905303955
2020-01-23 07:00:00,0.44137805700302124
2020-01-23 08:00:00,0.40273433923721313
2020-01-23 09:00:00,0.4136279821395874
2020-01-23 10:00:00,0.4066428542137146
2020-01-23 11:00:00,0.3081367611885071
2020-01-23 12:00:00,0.18496140837669373
2020-01-23 13:00:00,0.16555754840373993
2020-01-23 14:00:00,0.1943187564611435
2020-01-23 15:00:00,0.19350598752498627
2020-01-23 16:00:00,0.1731327623128891
2020-01-23 17:00:00,0.14773903787136078
2020-01-23 18:00:00,0.11059190332889557
2020-01-23 19:00:00,0.09288813173770905
2020-01-23 20:00:00,0.1021239310503006
2020-01-23 21:00:00,0.0775737464427948
2020-01-23 22:00:00,0.07180870324373245
2020-01-23 23:00:00,0.09122854471206665
2020-01-24 00:00:00,0.09377285838127136
2020-01-24 01:00:00,0.12341909110546112
2020-01-24 02:00:00,0.13988140225410461
2020-01-24 03:00:00,0.16898997128009796
2020-01-24 04:00:00,0.19244761765003204
2020-01-24 05:00:00,0.22925154864788055
2020-01-24 06:00:00,0.2444244921207428
2020-01-24 07:00:00,0.30793124437332153
2020-01-24 08:00:00,0.358188271522522
2020-01-24 09:00:00,0.4612802267074585
2020-01-24 10:00:00,0.5392886996269226
2020-01-24 11:00:00,0.48702293634414673
2020-01-24 12:00:00,0.4454438090324402
2020-01-24 13:00:00,0.5312420129776001
2020-01-24 14:00:00,0.48575007915496826
2020-01-24 15:00:00,0.43566495180130005
2020-01-24 16:00:00,0.42509931325912476
2020-01-24 17:00:00,0.4024229645729065
2020-01-24 18:00:00,0.3688122630119324
2020-01-24 19:00:00,0.26942741870880127
2020-01-24 20:00:00,0.2740088701248169
2020-01-24 21:00:00,0.21570579707622528
2020-01-24 22:00:00,0.1925140619277954
2020-01-24 23:00:00,0.1779516190290451
2020-01-25 00:00:00,0.1860230565071106
2020-01-25 01:00:00,0.20805656909942627
2020-01-25 02:00:00,0.18275782465934753
2020-01-25 03:00:00,0.20678576827049255
2020-01-25 04:00:00,0.24036085605621338
2020-01-25 05:00:00,0.33306586742401123
2020-01-25 06:00:00,0.3455057144165039
2020-01-25 07:00:00,0.37176960706710815
2020-01-25 08:00:00,0.3931758999824524
2020-01-25 09:00:00,0.4131966829299927
2020-01-25 10:00:00,0.5357922911643982
2020-01-25 11:00:00,0.510941743850708
2020-01-25 12:00:00,0.5030586123466492
2020-01-25 13:00:00,0.5400996804237366
2020-01-25 14:00:00,0.5057460069656372
2020-01-25 15:00:00,0.45327073335647583
2020-01-25 16:00:00,0.4397351145744324
2020-01-25 17:00:00,0.4048735499382019
2020-01-25 18:00:00,0.37076741456985474
2020-01-25 19:00:00,0.30175846815109253
2020-01-25 20:00:00,0.25378310680389404
2020-01-25 21:00:00,0.20543155074119568
2020-01-25 22:00:00,0.21924123167991638
2020-01-25 23:00:00,0.20884840190410614
2020-01-26 00:00:00,0.20466318726539612
2020-01-26 01:00:00,0.21536073088645935
2020-01-26 02:00:00,0.17908073961734772
2020-01-26 03:00:00,0.18645811080932617
2020-01-26 04:00:00,0.2390996217727661
2020-01-26 05:00:00,0.2478107362985611
2020-01-26 06:00:00,0.29444563388824463
2020-01-26 07:00:00,0.28519517183303833
2020-01-26 08:00:00,0.30526620149612427
2020-01-26 09:00:00,0.3367169499397278
2020-01-26 10:00:00,0.3736487627029419
2020-01-26 11:00:00,0.35800158977508545
2020-01-26 12:00:00,0.34226179122924805
2020-01-26 13:00:00,0.33759981393814087
2020-01-26 14:00:00,0.2935542166233063
2020-01-26 15:00:00,0.2613688111305237
2020-01-26 16:00:00,0.22759287059307098
2020-01-26 17:00:00,0.22591550648212433
2020-01-26 18:00:00,0.21711620688438416
2020-01-26 19:00:00,0.20036259293556213
2020-01-26 20:00:00,0.20210160315036774
2020-01-26 21:00:00,0.1700790524482727
2020-01-26 22:00:00,0.19571749866008759
2020-01-26 23:00:00,0.18955838680267334
2020-01-27 00:00:00,0.18229161202907562
2020-01-27 01:00:00,0.1700720638036728
2020-01-27 02:00:00,0.17596520483493805
2020-01-27 03:00:00,0.17508894205093384
2020-01-27 04:00:00,0.15502962470054626
2020-01-27 05:00:00,0.14596492052078247
2020-01-27 06:00:00,0.13685397803783417
2020-01-27 07:00:00,0.14278572797775269
2020-01-27 08:00:00,0.15922865271568298
2020-01-27 09:00:00,0.14894479513168335
2020-01-27 10:00:00,0.15585222840309143
2020-01-27 11:00:00,0.14714552462100983
2020-01-27 12:00:00,0.16080151498317719
2020-01-27 13:00:00,0.15728697180747986
2020-01-27 14:00:00,0.16828982532024384
2020-01-27 15:00:00,0.13450142741203308
2020-01-27 16:00:00,0.12857547402381897
2020-01-27 17:00:00,0.1781499683856964
2020-01-27 18:00:00,0.16928206384181976
2020-01-27 19:00:00,0.14072120189666748
2020-01-27 20:00:00,0.14342322945594788
2020-01-27 21:00:00,0.15870296955108643
2020-01-27 22:00:00,0.1629587709903717
2020-01-27 23:00:00,0.17575375735759735
2020-01-28 00:00:00,0.09995561093091965
2020-01-28 01:00:00,0.14636139571666718
2020-01-28 02:00:00,0.14433728158473969
2020-01-28 03:00:00,0.11749353259801865
2020-01-28 04:00:00,0.1577124148607254
2020-01-28 05:00:00,0.10681283473968506
2020-01-28 06:00:00,0.09952455013990402
2020-01-28 07:00:00,0.11718574911355972
2020-01-28 08:00:00,0.1163700595498085
2020-01-28 09:00:00,0.13395339250564575
2020-01-28 10:00:00,0.14798858761787415
2020-01-28 11:00:00,0.13651703298091888
2020-01-28 12:00:00,0.1478026807308197
2020-01-28 13:00:00,0.14105606079101562
2020-01-28 14:00:00,0.14430277049541473
2020-01-28 15:00:00,0.13734877109527588
2020-01-28 16:00:00,0.12391407787799835
2020-01-28 17:00:00,0.12708058953285217
2020-01-28 18:00:00,0.1507149040699005
2020-01-28 19:00:00,0.14664357900619507
2020-01-28 20:00:00,0.16420075297355652
2020-01-28 21:00:00,0.15479214489459991
2020-01-28 22:00:00,0.16769425570964813
2020-01-28 23:00:00,0.18810723721981049
2020-01-29 00:00:00,0.19888292253017426
2020-01-29 01:00:00,0.1839262843132019
2020-01-29 02:00:00,0.19509904086589813
2020-01-29 03:00:00,0.20150287449359894
2020-01-29 04:00:00,0.1996023803949356
2020-01-29 05:00:00,0.21903148293495178
2020-01-29 06:00:00,0.24424581229686737
2020-01-29 07:00:00,0.23741726577281952
2020-01-29 08:00:00,0.2453518658876419
2020-01-29 09:00:00,0.17611593008041382
2020-01-29 10:00:00,0.11367751657962799
2020-01-29 11:00:00,0.07563579082489014
2020-01-29 12:00:00,0.10180788487195969
2020-01-29 13:00:00,0.05659985542297363
2020-01-29 14:00:00,0.06157708913087845
2020-01-29 15:00:00,0.0459403470158577
2020-01-29 16:00:00,0.04056524485349655
2020-01-29 17:00:00,0.04085322469472885
2020-01-29 18:00:00,0.04681483656167984
2020-01-29 19:00:00,0.046075489372015
2020-01-29 20:00:00,0.044146157801151276
2020-01-29 21:00:00,0.02861499786376953
2020-01-29 22:00:00,0.037966109812259674
2020-01-29 23:00:00,0.030945591628551483
2020-01-30 00:00:00,0.031904153525829315
2020-01-30 01:00:00,0.019809123128652573
2020-01-30 02:00:00,0.014299549162387848
2020-01-30 03:00:00,0.011153653264045715
2020-01-30 04:00:00,0.006935492157936096
2020-01-30 05:00:00,0.008359789848327637
2020-01-30 06:00:00,0.018053829669952393
2020-01-30 07:00:00,0.0018342435359954834
2020-01-30 08:00:00,0.022321991622447968
2020-01-30 09:00:00,0.02797544002532959
2020-01-30 10:00:00,0.05445835366845131
2020-01-30 11:00:00,0.049051254987716675
2020-01-30 12:00:00,0.03545558452606201
2020-01-30 13:00:00,0.04655580222606659
2020-01-30 14:00:00,0.04042106866836548
2020-01-30 15:00:00,0.042464517056941986
2020-01-30 16:00:00,0.04292602464556694
2020-01-30 17:00:00,0.04663573578000069
2020-01-30 18:00:00,0.060491424053907394
2020-01-30 19:00:00,0.054688796401023865
2020-01-30 20:00:00,0.057100679725408554
2020-01-30 21:00:00,0.06460359692573547
2020-01-30 22:00:00,0.057805292308330536
2020-01-30 23:00:00,0.04712259769439697
2020-01-31 00:00:00,0.06743870675563812
2020-01-31 01:00:00,0.05784454569220543
2020-01-31 02:00:00,0.058320630341768265
2020-01-31 03:00:00,0.06338626146316528
2020-01-31 04:00:00,0.07015620172023773
2020-01-31 05:00:00,0.0892002210021019
2020-01-31 06:00:00,0.16264928877353668
2020-01-31 07:00:00,0.18454211950302124
2020-01-31 08:00:00,0.229241281747818
2020-01-31 09:00:00,0.22317533195018768
2020-01-31 10:00:00,0.27554941177368164
2020-01-31 11:00:00,0.2724112272262573
2020-01-31 12:00:00,0.2398047000169754
2020-01-31 13:00:00,0.2990514039993286
