,Karpos_value_pm10__+24
2020-01-01 00:00:00,0.13548380607691168
2020-01-01 01:00:00,0.23660889391976908
2020-01-01 02:00:00,0.21827043219105824
2020-01-01 03:00:00,0.29194333718808924
2020-01-01 04:00:00,0.3954024166411762
2020-01-01 05:00:00,0.4506441812228612
2020-01-01 06:00:00,0.3516434193273912
2020-01-01 07:00:00,0.16383332215290558
2020-01-01 08:00:00,0.1792741051572065
2020-01-01 09:00:00,0.163607641607444
2020-01-01 10:00:00,0.1335918080228908
2020-01-01 11:00:00,0.14385160495364066
2020-01-01 12:00:00,0.1379128469407104
2020-01-01 13:00:00,0.12047297114367488
2020-01-01 14:00:00,0.09754643259216418
2020-01-01 15:00:00,0.07758465559538519
2020-01-01 16:00:00,0.06142061121187981
2020-01-01 17:00:00,0.05617507477618256
2020-01-01 18:00:00,0.06156493832448638
2020-01-01 19:00:00,0.07960900313467069
2020-01-01 20:00:00,0.11012642688385536
2020-01-01 21:00:00,0.1329084391868852
2020-01-01 22:00:00,0.1406481295050302
2020-01-01 23:00:00,0.09987948597532445
2020-01-02 00:00:00,0.12884373405606805
2020-01-02 01:00:00,0.14445358588363583
2020-01-02 02:00:00,0.09456678680280033
2020-01-02 03:00:00,0.14629857600191043
2020-01-02 04:00:00,0.19819792332515687
2020-01-02 05:00:00,0.10820799781805232
2020-01-02 06:00:00,0.11749478893680858
2020-01-02 07:00:00,0.12795574729160233
2020-01-02 08:00:00,0.13528321045227107
2020-01-02 09:00:00,0.13325731646824457
2020-01-02 10:00:00,0.15636748909185952
2020-01-02 11:00:00,0.11608567734075562
2020-01-02 12:00:00,0.10046882022676865
2020-01-02 13:00:00,0.08407456428102279
2020-01-02 14:00:00,0.0855391965215149
2020-01-02 15:00:00,0.0730240115524909
2020-01-02 16:00:00,0.06856160116331608
2020-01-02 17:00:00,0.07135903644035367
2020-01-02 18:00:00,0.09352377249444006
2020-01-02 19:00:00,0.09288170503177134
2020-01-02 20:00:00,0.19097251123575285
2020-01-02 21:00:00,0.16518825678179438
2020-01-02 22:00:00,0.17211676601871026
2020-01-02 23:00:00,0.1902769308645296
2020-01-03 00:00:00,0.20262715148423927
2020-01-03 01:00:00,0.14649547095218707
2020-01-03 02:00:00,0.13928450366433756
2020-01-03 03:00:00,0.14799084670594806
2020-01-03 04:00:00,0.17047152029496135
2020-01-03 05:00:00,0.13729604331936734
2020-01-03 06:00:00,0.14176501367419564
2020-01-03 07:00:00,0.15153191907207902
2020-01-03 08:00:00,0.1467952383589828
2020-01-03 09:00:00,0.16330333152969884
2020-01-03 10:00:00,0.16288050231236642
2020-01-03 11:00:00,0.15342964135316495
2020-01-03 12:00:00,0.1254635236094134
2020-01-03 13:00:00,0.11636238718823179
2020-01-03 14:00:00,0.13134596873280416
2020-01-03 15:00:00,0.17125370403048001
2020-01-03 16:00:00,0.1730769823238948
2020-01-03 17:00:00,0.16204504546449622
2020-01-03 18:00:00,0.18405545262132703
2020-01-03 19:00:00,0.2540292732097581
2020-01-03 20:00:00,0.2431515356748977
2020-01-03 21:00:00,0.19215156825269364
2020-01-03 22:00:00,0.14831739293474394
2020-01-03 23:00:00,0.2174451522642702
2020-01-04 00:00:00,0.1919438438072309
2020-01-04 01:00:00,0.18896414998105643
2020-01-04 02:00:00,0.22494335496640322
2020-01-04 03:00:00,0.24977147902747426
2020-01-04 04:00:00,0.22949397727910803
2020-01-04 05:00:00,0.2462112578202622
2020-01-04 06:00:00,0.21328401575243613
2020-01-04 07:00:00,0.23721888394210996
2020-01-04 08:00:00,0.23465172546719848
2020-01-04 09:00:00,0.2231108082415267
2020-01-04 10:00:00,0.2681544237143823
2020-01-04 11:00:00,0.27536268283294824
2020-01-04 12:00:00,0.2325190629183873
2020-01-04 13:00:00,0.24528960690734292
2020-01-04 14:00:00,0.2165870021284449
2020-01-04 15:00:00,0.261632958783328
2020-01-04 16:00:00,0.2748399122157463
2020-01-04 17:00:00,0.30123075283298406
2020-01-04 18:00:00,0.3446175272890113
2020-01-04 19:00:00,0.5527234944811903
2020-01-04 20:00:00,0.5740533230806225
2020-01-04 21:00:00,0.45541595160337367
2020-01-04 22:00:00,0.5592583394946454
2020-01-04 23:00:00,0.599955220380977
2020-01-05 00:00:00,0.4631018921717497
2020-01-05 01:00:00,0.471051534882489
2020-01-05 02:00:00,0.4368065445413697
2020-01-05 03:00:00,0.5288193805463397
2020-01-05 04:00:00,0.4707144679605214
2020-01-05 05:00:00,0.3203949378460663
2020-01-05 06:00:00,0.28168185756300246
2020-01-05 07:00:00,0.257306169270964
2020-01-05 08:00:00,0.2342086903144315
2020-01-05 09:00:00,0.23956890718594018
2020-01-05 10:00:00,0.21005662513802884
2020-01-05 11:00:00,0.18741816320923033
2020-01-05 12:00:00,0.1821044688345139
2020-01-05 13:00:00,0.15174449067597529
2020-01-05 14:00:00,0.13643034484652908
2020-01-05 15:00:00,0.12414607326961809
2020-01-05 16:00:00,0.0819210517397519
2020-01-05 17:00:00,0.09579759820230017
2020-01-05 18:00:00,0.07948874040417636
2020-01-05 19:00:00,0.03047679849767048
2020-01-05 20:00:00,0.0652407525784641
2020-01-05 21:00:00,0.02990762163764681
2020-01-05 22:00:00,-0.002191546307410781
2020-01-05 23:00:00,0.009844721407627328
2020-01-06 00:00:00,0.0007065956712240485
2020-01-06 01:00:00,0.010784309778827578
2020-01-06 02:00:00,-0.001432453083866531
2020-01-06 03:00:00,-0.011271762074449902
2020-01-06 04:00:00,-0.003971032725445873
2020-01-06 05:00:00,7.100915581593689e-05
2020-01-06 06:00:00,-0.0011310908161716485
2020-01-06 07:00:00,0.0003421958969898366
2020-01-06 08:00:00,0.0010970539203118035
2020-01-06 09:00:00,0.0031213222253549675
2020-01-06 10:00:00,0.000866966285542437
2020-01-06 11:00:00,0.0005745118878008155
2020-01-06 12:00:00,-0.002305895624886663
2020-01-06 13:00:00,-0.00026597426049264393
2020-01-06 14:00:00,0.0021470158836970213
2020-01-06 15:00:00,0.0010556805950127195
2020-01-06 16:00:00,0.003342691493635227
2020-01-06 17:00:00,0.0037215430975149066
2020-01-06 18:00:00,0.005561016797375944
2020-01-06 19:00:00,0.01220427792464607
2020-01-06 20:00:00,0.017096626982569592
2020-01-06 21:00:00,0.018145428442588287
2020-01-06 22:00:00,0.020286827275694058
2020-01-06 23:00:00,0.02047869002257079
2020-01-07 00:00:00,0.02184747779931459
2020-01-07 01:00:00,0.020399407806964632
2020-01-07 02:00:00,0.022317597302850906
2020-01-07 03:00:00,0.021973602227090522
2020-01-07 04:00:00,0.021369948207676785
2020-01-07 05:00:00,0.023585811300659367
2020-01-07 06:00:00,0.024739873440549644
2020-01-07 07:00:00,0.02275016306097006
2020-01-07 08:00:00,0.02137660036830967
2020-01-07 09:00:00,0.02129011764032304
2020-01-07 10:00:00,0.019785564989230592
2020-01-07 11:00:00,0.015318420790386672
2020-01-07 12:00:00,0.014576594457177598
2020-01-07 13:00:00,0.012023626249644172
2020-01-07 14:00:00,0.011672393129810929
2020-01-07 15:00:00,0.012270812692627283
2020-01-07 16:00:00,0.01613132300133616
2020-01-07 17:00:00,0.023862381256724307
2020-01-07 18:00:00,0.03790777496204534
2020-01-07 19:00:00,0.04770053781974122
2020-01-07 20:00:00,0.04599173177427361
2020-01-07 21:00:00,0.1242604518641644
2020-01-07 22:00:00,0.19375075523275964
2020-01-07 23:00:00,0.19978022295089845
2020-01-08 00:00:00,0.22028258042542415
2020-01-08 01:00:00,0.2342537752194712
2020-01-08 02:00:00,0.22804310340356343
2020-01-08 03:00:00,0.2439689228370443
2020-01-08 04:00:00,0.20118884173043383
2020-01-08 05:00:00,0.18583870404401526
2020-01-08 06:00:00,0.18505015698814564
2020-01-08 07:00:00,0.18675224565569953
2020-01-08 08:00:00,0.19748793531770584
2020-01-08 09:00:00,0.1988492968106376
2020-01-08 10:00:00,0.2092152132299272
2020-01-08 11:00:00,0.2090223205547272
2020-01-08 12:00:00,0.13369826839730753
2020-01-08 13:00:00,0.12492766433724013
2020-01-08 14:00:00,0.12008680190822023
2020-01-08 15:00:00,0.10505184764621472
2020-01-08 16:00:00,0.1069693996095233
2020-01-08 17:00:00,0.11546714912717061
2020-01-08 18:00:00,0.11488190626462906
2020-01-08 19:00:00,0.10405608262740157
2020-01-08 20:00:00,0.10094083150750534
2020-01-08 21:00:00,0.17345797653363984
2020-01-08 22:00:00,0.1627330579502075
2020-01-08 23:00:00,0.1832508102609105
2020-01-09 00:00:00,0.20205805501046906
2020-01-09 01:00:00,0.2589268056221443
2020-01-09 02:00:00,0.2538839901998785
2020-01-09 03:00:00,0.16697044737286548
2020-01-09 04:00:00,0.1597838889591093
2020-01-09 05:00:00,0.15278482044373326
2020-01-09 06:00:00,0.16155405139439763
2020-01-09 07:00:00,0.16692536968536575
2020-01-09 08:00:00,0.17959653988446242
2020-01-09 09:00:00,0.1722964185221214
2020-01-09 10:00:00,0.16785553373117715
2020-01-09 11:00:00,0.14175672575698314
2020-01-09 12:00:00,0.13649082492190592
2020-01-09 13:00:00,0.20358561636485054
2020-01-09 14:00:00,0.1703897568320921
2020-01-09 15:00:00,0.16866332642433712
2020-01-09 16:00:00,0.1826240075772275
2020-01-09 17:00:00,0.18633508108415414
2020-01-09 18:00:00,0.22481997037132329
2020-01-09 19:00:00,0.2955666309359515
2020-01-09 20:00:00,0.3820522755431055
2020-01-09 21:00:00,0.28365172208078676
2020-01-09 22:00:00,0.2614031712036111
2020-01-09 23:00:00,0.3157546742899262
2020-01-10 00:00:00,0.36511451538115125
2020-01-10 01:00:00,0.415983481194924
2020-01-10 02:00:00,0.4954140600400056
2020-01-10 03:00:00,0.47189139002446123
2020-01-10 04:00:00,0.35024501932860574
2020-01-10 05:00:00,0.3231033349301244
2020-01-10 06:00:00,0.3305435715657738
2020-01-10 07:00:00,0.34710157435339417
2020-01-10 08:00:00,0.3842691497641026
2020-01-10 09:00:00,0.3851098094459648
2020-01-10 10:00:00,0.37922777408354924
2020-01-10 11:00:00,0.3811231256209228
2020-01-10 12:00:00,0.3024150560919728
2020-01-10 13:00:00,0.3050869380640575
2020-01-10 14:00:00,0.33901041362548606
2020-01-10 15:00:00,0.29046679907282724
2020-01-10 16:00:00,0.27936296292426055
2020-01-10 17:00:00,0.28660585838133307
2020-01-10 18:00:00,0.30358908853767363
2020-01-10 19:00:00,0.3382964822078625
2020-01-10 20:00:00,0.36610506611023796
2020-01-10 21:00:00,0.32111487774066366
2020-01-10 22:00:00,0.35779859034725536
2020-01-10 23:00:00,0.40006947425099176
2020-01-11 00:00:00,0.44815480012287584
2020-01-11 01:00:00,0.5064861704562201
2020-01-11 02:00:00,0.46550998206121935
2020-01-11 03:00:00,0.43453386065822236
2020-01-11 04:00:00,0.4791900942725629
2020-01-11 05:00:00,0.4423200195631482
2020-01-11 06:00:00,0.3572062005354971
2020-01-11 07:00:00,0.38173905878355846
2020-01-11 08:00:00,0.359808853988801
2020-01-11 09:00:00,0.37775327842423645
2020-01-11 10:00:00,0.37309937466633025
2020-01-11 11:00:00,0.3469197764491073
2020-01-11 12:00:00,0.43930514977356777
2020-01-11 13:00:00,0.3711420259743435
2020-01-11 14:00:00,0.2109297314434022
2020-01-11 15:00:00,0.24305942201970146
2020-01-11 16:00:00,0.21963292512831575
2020-01-11 17:00:00,0.23648381760072593
2020-01-11 18:00:00,0.4086006991720538
2020-01-11 19:00:00,0.37406834334298733
2020-01-11 20:00:00,0.3664640921321849
2020-01-11 21:00:00,0.18635954900475105
2020-01-11 22:00:00,0.2071617195103817
2020-01-11 23:00:00,0.19817581153259928
2020-01-12 00:00:00,0.21075948110510467
2020-01-12 01:00:00,0.16432316108648162
2020-01-12 02:00:00,0.22452789230011808
2020-01-12 03:00:00,0.19802602048609
2020-01-12 04:00:00,0.1847615227556633
2020-01-12 05:00:00,0.1993339977535329
2020-01-12 06:00:00,0.12969246430765985
2020-01-12 07:00:00,0.12137306988511837
2020-01-12 08:00:00,0.12543268386045278
2020-01-12 09:00:00,0.09522575486337116
2020-01-12 10:00:00,0.11621811379660298
2020-01-12 11:00:00,0.10295741004689277
2020-01-12 12:00:00,0.07302170359142013
2020-01-12 13:00:00,0.0853714923733475
2020-01-12 14:00:00,0.08667118726548448
2020-01-12 15:00:00,0.09081061848205298
2020-01-12 16:00:00,0.11094785265388124
2020-01-12 17:00:00,0.0710720585162202
2020-01-12 18:00:00,0.11952943192590383
2020-01-12 19:00:00,0.09293990078122845
2020-01-12 20:00:00,0.15035040884483217
2020-01-12 21:00:00,0.14312705060842554
2020-01-12 22:00:00,0.17866072667276017
2020-01-12 23:00:00,0.17716900522829396
2020-01-13 00:00:00,0.18726698255527843
2020-01-13 01:00:00,0.17955396358717376
2020-01-13 02:00:00,0.19517783169556374
2020-01-13 03:00:00,0.20227764096041584
2020-01-13 04:00:00,0.17770817253588347
2020-01-13 05:00:00,0.1758371274250888
2020-01-13 06:00:00,0.17646945520011012
2020-01-13 07:00:00,0.15920218484221557
2020-01-13 08:00:00,0.15906368029985604
2020-01-13 09:00:00,0.17830766125182415
2020-01-13 10:00:00,0.14527313706343759
2020-01-13 11:00:00,0.12022970642251428
2020-01-13 12:00:00,0.12248596462216975
2020-01-13 13:00:00,0.1576625586729961
2020-01-13 14:00:00,0.14491990806407767
2020-01-13 15:00:00,0.15986052667648215
2020-01-13 16:00:00,0.16386739342079237
2020-01-13 17:00:00,0.1729748382064081
2020-01-13 18:00:00,0.15007920134676128
2020-01-13 19:00:00,0.1626127814333584
2020-01-13 20:00:00,0.1446842466897529
2020-01-13 21:00:00,0.11200275134792262
2020-01-13 22:00:00,0.10730213143031937
2020-01-13 23:00:00,0.10238193695013068
2020-01-14 00:00:00,0.10103843660676208
2020-01-14 01:00:00,0.0936592179450699
2020-01-14 02:00:00,0.08769443496142584
2020-01-14 03:00:00,0.08322929835167067
2020-01-14 04:00:00,0.07868691377356718
2020-01-14 05:00:00,0.08085214756470524
2020-01-14 06:00:00,0.08122936739360122
2020-01-14 07:00:00,0.07653404610330662
2020-01-14 08:00:00,0.05797343684417194
2020-01-14 09:00:00,0.060373183595311686
2020-01-14 10:00:00,0.06160158206031858
2020-01-14 11:00:00,0.06137533877105354
2020-01-14 12:00:00,0.056315432212135856
2020-01-14 13:00:00,0.05941764196346478
2020-01-14 14:00:00,0.05414638997497762
2020-01-14 15:00:00,0.05848202012631369
2020-01-14 16:00:00,0.054517062051641516
2020-01-14 17:00:00,0.06645149627845978
2020-01-14 18:00:00,0.07440491323811325
2020-01-14 19:00:00,0.057692262067982905
2020-01-14 20:00:00,0.06130403756489226
2020-01-14 21:00:00,0.07660216334269965
2020-01-14 22:00:00,0.0724314651714653
2020-01-14 23:00:00,0.0668715409901642
2020-01-15 00:00:00,0.0744017725846569
2020-01-15 01:00:00,0.0706893850301052
2020-01-15 02:00:00,0.07343474167301194
2020-01-15 03:00:00,0.074125767572145
2020-01-15 04:00:00,0.06942770703277035
2020-01-15 05:00:00,0.06660169212983419
2020-01-15 06:00:00,0.06031662313890092
2020-01-15 07:00:00,0.06288716374063376
2020-01-15 08:00:00,0.06489873656192911
2020-01-15 09:00:00,0.06226844631099041
2020-01-15 10:00:00,0.0635831391475196
2020-01-15 11:00:00,0.06180954686335044
2020-01-15 12:00:00,0.06381520864390063
2020-01-15 13:00:00,0.06605750832670611
2020-01-15 14:00:00,0.07028033667521665
2020-01-15 15:00:00,0.06735562454006955
2020-01-15 16:00:00,0.06855341356415777
2020-01-15 17:00:00,0.06597143657579434
2020-01-15 18:00:00,0.07199925639877519
2020-01-15 19:00:00,0.08263122571213291
2020-01-15 20:00:00,0.09264323555102885
2020-01-15 21:00:00,0.07616117374743628
2020-01-15 22:00:00,0.06391581541106066
2020-01-15 23:00:00,0.06578550796590954
2020-01-16 00:00:00,0.06945447808024724
2020-01-16 01:00:00,0.07277581460081592
2020-01-16 02:00:00,0.07360893386628567
2020-01-16 03:00:00,0.0677882816583536
2020-01-16 04:00:00,0.06312861259957736
2020-01-16 05:00:00,0.060624666813139445
2020-01-16 06:00:00,0.06403105072640695
2020-01-16 07:00:00,0.06214862657486804
2020-01-16 08:00:00,0.055387952988565824
2020-01-16 09:00:00,0.054658959731086046
2020-01-16 10:00:00,0.05132471495299971
2020-01-16 11:00:00,0.049763703568964514
2020-01-16 12:00:00,0.053202622891536294
2020-01-16 13:00:00,0.049353698610278746
2020-01-16 14:00:00,0.051015215532571594
2020-01-16 15:00:00,0.06452071052117597
2020-01-16 16:00:00,0.07843624944931979
2020-01-16 17:00:00,0.09680557083011142
2020-01-16 18:00:00,0.1162412551057344
2020-01-16 19:00:00,0.13963173003037252
2020-01-16 20:00:00,0.1062464909784952
2020-01-16 21:00:00,0.1320106300584576
2020-01-16 22:00:00,0.12724866007153798
2020-01-16 23:00:00,0.1282029543721329
2020-01-17 00:00:00,0.12317668953557928
2020-01-17 01:00:00,0.13063073354663285
2020-01-17 02:00:00,0.131827359010721
2020-01-17 03:00:00,0.12906049087561527
2020-01-17 04:00:00,0.13952240459415596
2020-01-17 05:00:00,0.1331968157711071
2020-01-17 06:00:00,0.16610378047281718
2020-01-17 07:00:00,0.15416366369882742
2020-01-17 08:00:00,0.11932165798334567
2020-01-17 09:00:00,0.1918817634690847
2020-01-17 10:00:00,0.20882234941607414
2020-01-17 11:00:00,0.19642894809321695
2020-01-17 12:00:00,0.1976988962901241
2020-01-17 13:00:00,0.17531849344929326
2020-01-17 14:00:00,0.1985962206218113
2020-01-17 15:00:00,0.1584629898747578
2020-01-17 16:00:00,0.147120541191404
2020-01-17 17:00:00,0.1669961526072127
2020-01-17 18:00:00,0.14644236542636227
2020-01-17 19:00:00,0.18946801808263886
2020-01-17 20:00:00,0.19086825063049667
2020-01-17 21:00:00,0.19258252505876172
2020-01-17 22:00:00,0.17799385548136945
2020-01-17 23:00:00,0.22492731811076855
2020-01-18 00:00:00,0.23666508625602073
2020-01-18 01:00:00,0.24611697827676368
2020-01-18 02:00:00,0.20040707097911775
2020-01-18 03:00:00,0.21440809253229368
2020-01-18 04:00:00,0.19362466556216298
2020-01-18 05:00:00,0.17780946052121407
2020-01-18 06:00:00,0.19061222287861734
2020-01-18 07:00:00,0.18347503536409118
2020-01-18 08:00:00,0.15868822487832074
2020-01-18 09:00:00,0.14148765151417564
2020-01-18 10:00:00,0.15462601953409477
2020-01-18 11:00:00,0.1499707956388812
2020-01-18 12:00:00,0.15156030343072951
2020-01-18 13:00:00,0.1437280665926293
2020-01-18 14:00:00,0.1454510307391541
2020-01-18 15:00:00,0.1422207702067558
2020-01-18 16:00:00,0.1402991885255031
2020-01-18 17:00:00,0.13910321522206384
2020-01-18 18:00:00,0.11821724140045842
2020-01-18 19:00:00,0.12330285653699166
2020-01-18 20:00:00,0.11022357010801145
2020-01-18 21:00:00,0.12048157681828164
2020-01-18 22:00:00,0.10616726263772117
2020-01-18 23:00:00,0.10851762855410338
2020-01-19 00:00:00,0.09834520309123165
2020-01-19 01:00:00,0.09579079642161481
2020-01-19 02:00:00,0.09996847210837233
2020-01-19 03:00:00,0.11396667364977704
2020-01-19 04:00:00,0.11648636225296478
2020-01-19 05:00:00,0.11141994272510966
2020-01-19 06:00:00,0.12101462175097966
2020-01-19 07:00:00,0.11547487902027183
2020-01-19 08:00:00,0.11626972496617421
2020-01-19 09:00:00,0.11631470101196004
2020-01-19 10:00:00,0.11663508199667905
2020-01-19 11:00:00,0.11788107903626666
2020-01-19 12:00:00,0.11245204925029433
2020-01-19 13:00:00,0.08962933060005565
2020-01-19 14:00:00,0.09973547663157503
2020-01-19 15:00:00,0.09303189571797311
2020-01-19 16:00:00,0.09051586349471502
2020-01-19 17:00:00,0.10304066352792163
2020-01-19 18:00:00,0.11637199671131213
2020-01-19 19:00:00,0.11944185641633706
2020-01-19 20:00:00,0.1116380575117141
2020-01-19 21:00:00,0.1006171166133823
2020-01-19 22:00:00,0.08551533013370431
2020-01-19 23:00:00,0.08312448271060863
2020-01-20 00:00:00,0.07282450912465685
2020-01-20 01:00:00,0.07041995876705973
2020-01-20 02:00:00,0.06233289086672692
2020-01-20 03:00:00,0.0592639881859076
2020-01-20 04:00:00,0.05553108049427425
2020-01-20 05:00:00,0.045110912620565186
2020-01-20 06:00:00,0.046489220153205744
2020-01-20 07:00:00,0.04081581945701823
2020-01-20 08:00:00,0.037953953544235
2020-01-20 09:00:00,0.0379399173131142
2020-01-20 10:00:00,0.036656861285664394
2020-01-20 11:00:00,0.036242018933263474
2020-01-20 12:00:00,0.0425095313765375
2020-01-20 13:00:00,0.0452129684346253
2020-01-20 14:00:00,0.045790084334519664
2020-01-20 15:00:00,0.04695206687241185
2020-01-20 16:00:00,0.04792825320333944
2020-01-20 17:00:00,0.04561499047242174
2020-01-20 18:00:00,0.04733396197526468
2020-01-20 19:00:00,0.056149936971598605
2020-01-20 20:00:00,0.056253203784924974
2020-01-20 21:00:00,0.055069921403885266
2020-01-20 22:00:00,0.04936397433204955
2020-01-20 23:00:00,0.06442979563369704
2020-01-21 00:00:00,0.07675238343997193
2020-01-21 01:00:00,0.06535530160806574
2020-01-21 02:00:00,0.06742998083721026
2020-01-21 03:00:00,0.08417434866859831
2020-01-21 04:00:00,0.08518183387851239
2020-01-21 05:00:00,0.07886240495596411
2020-01-21 06:00:00,0.08827932094018795
2020-01-21 07:00:00,0.08586523426101163
2020-01-21 08:00:00,0.07965954633220787
2020-01-21 09:00:00,0.08694041459976368
2020-01-21 10:00:00,0.08811678231860987
2020-01-21 11:00:00,0.07421246391901522
2020-01-21 12:00:00,0.06290048435635223
2020-01-21 13:00:00,0.06415007205969658
2020-01-21 14:00:00,0.06269552338961201
2020-01-21 15:00:00,0.0606165615832266
2020-01-21 16:00:00,0.06608071388979642
2020-01-21 17:00:00,0.07318719804363617
2020-01-21 18:00:00,0.08649429944668123
2020-01-21 19:00:00,0.0950455055097556
2020-01-21 20:00:00,0.10432749713317016
2020-01-21 21:00:00,0.13763989929601336
2020-01-21 22:00:00,0.1778650935338224
2020-01-21 23:00:00,0.17018836687445973
2020-01-22 00:00:00,0.15574657131801825
2020-01-22 01:00:00,0.21632275461798306
2020-01-22 02:00:00,0.20388613691428306
2020-01-22 03:00:00,0.24363939619447977
2020-01-22 04:00:00,0.24824350407579862
2020-01-22 05:00:00,0.2060939363195499
2020-01-22 06:00:00,0.2025265292252025
2020-01-22 07:00:00,0.21306577782068092
2020-01-22 08:00:00,0.22899928843895628
2020-01-22 09:00:00,0.25437337618814376
2020-01-22 10:00:00,0.21773968481108807
2020-01-22 11:00:00,0.2060017515988469
2020-01-22 12:00:00,0.21389682897972573
2020-01-22 13:00:00,0.24335087350421902
2020-01-22 14:00:00,0.23695637009916107
2020-01-22 15:00:00,0.24276106129380584
2020-01-22 16:00:00,0.23967163785271506
2020-01-22 17:00:00,0.2476931258084596
2020-01-22 18:00:00,0.28837217463191855
2020-01-22 19:00:00,0.34361380363256205
2020-01-22 20:00:00,0.3999607363268067
2020-01-22 21:00:00,0.3595162265806966
2020-01-22 22:00:00,0.407287354098194
2020-01-22 23:00:00,0.4357947450304117
2020-01-23 00:00:00,0.38648654087426493
2020-01-23 01:00:00,0.4253424788335986
2020-01-23 02:00:00,0.43750225453875885
2020-01-23 03:00:00,0.4386447787956862
2020-01-23 04:00:00,0.4509326791797679
2020-01-23 05:00:00,0.4120385283204618
2020-01-23 06:00:00,0.38198996092655607
2020-01-23 07:00:00,0.37262037720396407
2020-01-23 08:00:00,0.38909282178186766
2020-01-23 09:00:00,0.3676257934544201
2020-01-23 10:00:00,0.3001173785553617
2020-01-23 11:00:00,0.2797015697460151
2020-01-23 12:00:00,0.2434360706006617
2020-01-23 13:00:00,0.21517102813483233
2020-01-23 14:00:00,0.2003090349125757
2020-01-23 15:00:00,0.204996576378303
2020-01-23 16:00:00,0.20085431399163867
2020-01-23 17:00:00,0.19859763831185545
2020-01-23 18:00:00,0.20330858392254855
2020-01-23 19:00:00,0.19046714314255953
2020-01-23 20:00:00,0.22237691770666865
2020-01-23 21:00:00,0.230799372944539
2020-01-23 22:00:00,0.26598897024861073
2020-01-23 23:00:00,0.2683267033994656
2020-01-24 00:00:00,0.2707698984817592
2020-01-24 01:00:00,0.26520954339446556
2020-01-24 02:00:00,0.23890889079617475
2020-01-24 03:00:00,0.2260385683509799
2020-01-24 04:00:00,0.21717581454234494
2020-01-24 05:00:00,0.2048502520642957
2020-01-24 06:00:00,0.19929808825594386
2020-01-24 07:00:00,0.18992073891011685
2020-01-24 08:00:00,0.2055643619399158
2020-01-24 09:00:00,0.21742292958721343
2020-01-24 10:00:00,0.21887460153078234
2020-01-24 11:00:00,0.20812547238632842
2020-01-24 12:00:00,0.19566836428189072
2020-01-24 13:00:00,0.21065308892075824
2020-01-24 14:00:00,0.22409799974061065
2020-01-24 15:00:00,0.19706835107721518
2020-01-24 16:00:00,0.20377317537503575
2020-01-24 17:00:00,0.21413742018134563
2020-01-24 18:00:00,0.2617153659582145
2020-01-24 19:00:00,0.26250009972535315
2020-01-24 20:00:00,0.2943913579041739
2020-01-24 21:00:00,0.2866919261542187
2020-01-24 22:00:00,0.25214625924195927
2020-01-24 23:00:00,0.2952251330774511
2020-01-25 00:00:00,0.3078768960807716
2020-01-25 01:00:00,0.3407434399945881
2020-01-25 02:00:00,0.31222196678010405
2020-01-25 03:00:00,0.31904144268724954
2020-01-25 04:00:00,0.3527403545897733
2020-01-25 05:00:00,0.33216581191942157
2020-01-25 06:00:00,0.3037409723631096
2020-01-25 07:00:00,0.2907461203658588
2020-01-25 08:00:00,0.2878193914243685
2020-01-25 09:00:00,0.2925560749974025
2020-01-25 10:00:00,0.2893094042020391
2020-01-25 11:00:00,0.3264939350907507
2020-01-25 12:00:00,0.3056825966956408
2020-01-25 13:00:00,0.2838673107052021
2020-01-25 14:00:00,0.27114266862705283
2020-01-25 15:00:00,0.25764998004171674
2020-01-25 16:00:00,0.25685818496041607
2020-01-25 17:00:00,0.2695211628728038
2020-01-25 18:00:00,0.3073383145920211
2020-01-25 19:00:00,0.3741343877063604
2020-01-25 20:00:00,0.380127169765114
2020-01-25 21:00:00,0.4556018339913821
2020-01-25 22:00:00,0.5138063334822072
2020-01-25 23:00:00,0.70498582445204
2020-01-26 00:00:00,0.6487301261376903
2020-01-26 01:00:00,0.5524481848042309
2020-01-26 02:00:00,0.4807058889939068
2020-01-26 03:00:00,0.44937990517194637
2020-01-26 04:00:00,0.46320313565738946
2020-01-26 05:00:00,0.4385083800676793
2020-01-26 06:00:00,0.45189325212692105
2020-01-26 07:00:00,0.4295774310175638
2020-01-26 08:00:00,0.41339834645349893
2020-01-26 09:00:00,0.4314325938564262
2020-01-26 10:00:00,0.39776423036963077
2020-01-26 11:00:00,0.45868697511826195
2020-01-26 12:00:00,0.4155133331121265
2020-01-26 13:00:00,0.38702773149819597
2020-01-26 14:00:00,0.33473137248231494
2020-01-26 15:00:00,0.3239279017560057
2020-01-26 16:00:00,0.3065862654241909
2020-01-26 17:00:00,0.31697987545118445
2020-01-26 18:00:00,0.3674485119033011
2020-01-26 19:00:00,0.3462503697086356
2020-01-26 20:00:00,0.4034519054199053
2020-01-26 21:00:00,0.47722311956913593
2020-01-26 22:00:00,0.3921173106365686
2020-01-26 23:00:00,0.4204951238245074
2020-01-27 00:00:00,0.42340534151452125
2020-01-27 01:00:00,0.37335762260770533
2020-01-27 02:00:00,0.38270967453686566
2020-01-27 03:00:00,0.36145296497028734
2020-01-27 04:00:00,0.234680738920839
2020-01-27 05:00:00,0.23282962279372973
2020-01-27 06:00:00,0.21930355708254762
2020-01-27 07:00:00,0.23543226672513548
2020-01-27 08:00:00,0.3283533330105688
2020-01-27 09:00:00,0.30774794793506627
2020-01-27 10:00:00,0.3293203769753867
2020-01-27 11:00:00,0.3294184218885644
2020-01-27 12:00:00,0.3439703215045728
2020-01-27 13:00:00,0.3639141300242771
2020-01-27 14:00:00,0.3548479669478017
2020-01-27 15:00:00,0.2893574370829495
2020-01-27 16:00:00,0.27041917267316845
2020-01-27 17:00:00,0.32658427985597005
2020-01-27 18:00:00,0.374677083128842
2020-01-27 19:00:00,0.3565962240240817
2020-01-27 20:00:00,0.3430607891628363
2020-01-27 21:00:00,0.42111149859563873
2020-01-27 22:00:00,0.34519259303656
2020-01-27 23:00:00,0.3118394401096952
2020-01-28 00:00:00,0.17828817242776562
2020-01-28 01:00:00,0.29498597576708363
2020-01-28 02:00:00,0.3148324362115357
2020-01-28 03:00:00,0.3314808021291564
2020-01-28 04:00:00,0.30839289681394877
2020-01-28 05:00:00,0.1933833604975717
2020-01-28 06:00:00,0.20895521157992908
2020-01-28 07:00:00,0.21047370002710222
2020-01-28 08:00:00,0.18792181590319407
2020-01-28 09:00:00,0.195404633970408
2020-01-28 10:00:00,0.18564051043311677
2020-01-28 11:00:00,0.17332515154759592
2020-01-28 12:00:00,0.2118602244706757
2020-01-28 13:00:00,0.1851206144688552
2020-01-28 14:00:00,0.18027676751688146
2020-01-28 15:00:00,0.19981553493645196
2020-01-28 16:00:00,0.18089237355304064
2020-01-28 17:00:00,0.19114102979113282
2020-01-28 18:00:00,0.23722778388831883
2020-01-28 19:00:00,0.25890104202824815
2020-01-28 20:00:00,0.2782416970719302
2020-01-28 21:00:00,0.32377679807868226
2020-01-28 22:00:00,0.4013513072500393
2020-01-28 23:00:00,0.40362470034341785
2020-01-29 00:00:00,0.4152390874709824
2020-01-29 01:00:00,0.41618977073198027
2020-01-29 02:00:00,0.374630192468578
2020-01-29 03:00:00,0.3844321166087042
2020-01-29 04:00:00,0.36352090035842616
2020-01-29 05:00:00,0.3437789186630269
2020-01-29 06:00:00,0.3265510709170179
2020-01-29 07:00:00,0.32893764777523515
2020-01-29 08:00:00,0.3245066701886138
2020-01-29 09:00:00,0.2562177200042857
2020-01-29 10:00:00,0.2089785078359908
2020-01-29 11:00:00,0.16671727909531078
2020-01-29 12:00:00,0.16611890432981474
2020-01-29 13:00:00,0.11949302389276255
2020-01-29 14:00:00,0.11352165307898429
2020-01-29 15:00:00,0.1019507578376188
2020-01-29 16:00:00,0.09021209945982284
2020-01-29 17:00:00,0.07979657251204139
2020-01-29 18:00:00,0.06881850349603151
2020-01-29 19:00:00,0.06467818849072998
2020-01-29 20:00:00,0.05420793360848818
2020-01-29 21:00:00,0.04249561222917815
2020-01-29 22:00:00,0.059174633586726574
2020-01-29 23:00:00,0.04402179990428293
2020-01-30 00:00:00,0.04746733632853764
2020-01-30 01:00:00,0.004608911043569758
2020-01-30 02:00:00,-0.007396629199465733
2020-01-30 03:00:00,-0.014194946030426762
2020-01-30 04:00:00,-0.0158402973600377
2020-01-30 05:00:00,-0.017605802956264044
2020-01-30 06:00:00,-0.017280539602359642
2020-01-30 07:00:00,-0.02222765785999104
2020-01-30 08:00:00,-0.01582958077355838
2020-01-30 09:00:00,-0.010673454162509699
2020-01-30 10:00:00,0.004577086129191637
2020-01-30 11:00:00,0.004591747932855995
2020-01-30 12:00:00,0.0004591596627273988
2020-01-30 13:00:00,0.0015232700652532973
2020-01-30 14:00:00,0.00487686133568674
2020-01-30 15:00:00,0.004961051240769978
2020-01-30 16:00:00,0.007727692839623805
2020-01-30 17:00:00,0.007859710962008128
2020-01-30 18:00:00,0.021658597959929398
2020-01-30 19:00:00,0.06345683737631067
2020-01-30 20:00:00,0.09182721463703365
2020-01-30 21:00:00,0.11866536012176963
2020-01-30 22:00:00,0.19723386233953724
2020-01-30 23:00:00,0.22124232786300788
2020-01-31 00:00:00,0.18348134374960778
2020-01-31 01:00:00,0.1872554822701838
2020-01-31 02:00:00,0.14613298212551215
2020-01-31 03:00:00,0.12923828867739898
2020-01-31 04:00:00,0.13581166952416712
2020-01-31 05:00:00,0.13403752528222163
2020-01-31 06:00:00,0.16123008897576513
2020-01-31 07:00:00,0.11743599548220926
2020-01-31 08:00:00,0.1422824983635253
2020-01-31 09:00:00,0.15438331607433864
2020-01-31 10:00:00,0.11454112840128063
2020-01-31 11:00:00,0.14498033138532154
2020-01-31 12:00:00,0.1380187885770423
2020-01-31 13:00:00,0.13994027413890417
2020-01-31 14:00:00,0.14192850139530713
2020-01-31 15:00:00,0.10408094944655354
2020-01-31 16:00:00,0.1033860126661104
2020-01-31 17:00:00,0.11183200773487648
2020-01-31 18:00:00,0.1188408604023783
2020-01-31 19:00:00,0.17238458370492166
2020-01-31 20:00:00,0.2609654895560469
2020-01-31 21:00:00,0.24659262341538618
2020-01-31 22:00:00,0.2453125860168695
2020-01-31 23:00:00,0.24246239194942293
2020-02-01 00:00:00,0.3047640171047717
