,Karpos_value_pm10__+12
2020-01-01 12:00:00,0.05250680819153786
2020-01-01 13:00:00,0.05411139130592346
2020-01-01 14:00:00,0.05754847079515457
2020-01-01 15:00:00,0.05360583961009979
2020-01-01 16:00:00,0.05016770213842392
2020-01-01 17:00:00,0.05582336708903313
2020-01-01 18:00:00,0.060475707054138184
2020-01-01 19:00:00,0.057298850268125534
2020-01-01 20:00:00,0.0591602697968483
2020-01-01 21:00:00,0.0666070431470871
2020-01-01 22:00:00,0.07866305857896805
2020-01-01 23:00:00,0.04884637892246246
2020-01-02 00:00:00,0.06866119801998138
2020-01-02 01:00:00,0.07543890178203583
2020-01-02 02:00:00,0.043926164507865906
2020-01-02 03:00:00,0.06616442650556564
2020-01-02 04:00:00,0.08704111725091934
2020-01-02 05:00:00,0.05396978184580803
2020-01-02 06:00:00,0.06440357863903046
2020-01-02 07:00:00,0.10142998397350311
2020-01-02 08:00:00,0.12858116626739502
2020-01-02 09:00:00,0.14261919260025024
2020-01-02 10:00:00,0.16095048189163208
2020-01-02 11:00:00,0.14321358501911163
2020-01-02 12:00:00,0.1008467972278595
2020-01-02 13:00:00,0.08918052911758423
2020-01-02 14:00:00,0.07878948748111725
2020-01-02 15:00:00,0.08659287542104721
2020-01-02 16:00:00,0.07773107290267944
2020-01-02 17:00:00,0.07507655769586563
2020-01-02 18:00:00,0.0788559690117836
2020-01-02 19:00:00,0.07396218925714493
2020-01-02 20:00:00,0.08272822201251984
2020-01-02 21:00:00,0.07278501242399216
2020-01-02 22:00:00,0.07403266429901123
2020-01-02 23:00:00,0.07619555294513702
2020-01-03 00:00:00,0.07387717813253403
2020-01-03 01:00:00,0.08173904567956924
2020-01-03 02:00:00,0.07402103394269943
2020-01-03 03:00:00,0.08108349144458771
2020-01-03 04:00:00,0.08635325729846954
2020-01-03 05:00:00,0.11053043603897095
2020-01-03 06:00:00,0.16092722117900848
2020-01-03 07:00:00,0.19118660688400269
2020-01-03 08:00:00,0.19973990321159363
2020-01-03 09:00:00,0.2546585202217102
2020-01-03 10:00:00,0.2698889970779419
2020-01-03 11:00:00,0.2498505413532257
2020-01-03 12:00:00,0.21773576736450195
2020-01-03 13:00:00,0.20673581957817078
2020-01-03 14:00:00,0.2012927532196045
2020-01-03 15:00:00,0.21779084205627441
2020-01-03 16:00:00,0.16545405983924866
2020-01-03 17:00:00,0.1577131152153015
2020-01-03 18:00:00,0.1696183979511261
2020-01-03 19:00:00,0.1742885410785675
2020-01-03 20:00:00,0.1426045298576355
2020-01-03 21:00:00,0.14150196313858032
2020-01-03 22:00:00,0.09904459118843079
2020-01-03 23:00:00,0.14430926740169525
2020-01-04 00:00:00,0.12429389357566833
2020-01-04 01:00:00,0.1345960795879364
2020-01-04 02:00:00,0.14656278491020203
2020-01-04 03:00:00,0.175173819065094
2020-01-04 04:00:00,0.1908838152885437
2020-01-04 05:00:00,0.15370771288871765
2020-01-04 06:00:00,0.15942220389842987
2020-01-04 07:00:00,0.220576673746109
2020-01-04 08:00:00,0.18410935997962952
2020-01-04 09:00:00,0.15967346727848053
2020-01-04 10:00:00,0.28358957171440125
2020-01-04 11:00:00,0.25419706106185913
2020-01-04 12:00:00,0.25613781809806824
2020-01-04 13:00:00,0.2848050594329834
2020-01-04 14:00:00,0.3313072919845581
2020-01-04 15:00:00,0.3168298900127411
2020-01-04 16:00:00,0.33763715624809265
2020-01-04 17:00:00,0.30261996388435364
2020-01-04 18:00:00,0.29328063130378723
2020-01-04 19:00:00,0.32541707158088684
2020-01-04 20:00:00,0.2795262932777405
2020-01-04 21:00:00,0.2482769787311554
2020-01-04 22:00:00,0.2659118175506592
2020-01-04 23:00:00,0.238866925239563
2020-01-05 00:00:00,0.223491370677948
2020-01-05 01:00:00,0.20699909329414368
2020-01-05 02:00:00,0.21213573217391968
2020-01-05 03:00:00,0.2173973023891449
2020-01-05 04:00:00,0.22118350863456726
2020-01-05 05:00:00,0.07805527746677399
2020-01-05 06:00:00,-0.009078748524188995
2020-01-05 07:00:00,0.012292347848415375
2020-01-05 08:00:00,0.008447661995887756
2020-01-05 09:00:00,0.021141037344932556
2020-01-05 10:00:00,0.03313852846622467
2020-01-05 11:00:00,0.0290154330432415
2020-01-05 12:00:00,0.03087373822927475
2020-01-05 13:00:00,0.031116440892219543
2020-01-05 14:00:00,0.03350849449634552
2020-01-05 15:00:00,0.0305468887090683
2020-01-05 16:00:00,0.022655799984931946
2020-01-05 17:00:00,0.024374715983867645
2020-01-05 18:00:00,0.02287735417485237
2020-01-05 19:00:00,0.02262597158551216
2020-01-05 20:00:00,0.023389853537082672
2020-01-05 21:00:00,0.02549847960472107
2020-01-05 22:00:00,0.023963429033756256
2020-01-05 23:00:00,0.02326851338148117
2020-01-06 00:00:00,0.027092494070529938
2020-01-06 01:00:00,0.02491731196641922
2020-01-06 02:00:00,0.026296403259038925
2020-01-06 03:00:00,0.026277270168066025
2020-01-06 04:00:00,0.025068163871765137
2020-01-06 05:00:00,0.025896448642015457
2020-01-06 06:00:00,0.027548816055059433
2020-01-06 07:00:00,0.025531824678182602
2020-01-06 08:00:00,0.031044915318489075
2020-01-06 09:00:00,0.03367315232753754
2020-01-06 10:00:00,0.04031721502542496
2020-01-06 11:00:00,0.038075800985097885
2020-01-06 12:00:00,0.03798320144414902
2020-01-06 13:00:00,0.041032690554857254
2020-01-06 14:00:00,0.04178210347890854
2020-01-06 15:00:00,0.041692815721035004
2020-01-06 16:00:00,0.03973381966352463
2020-01-06 17:00:00,0.04013257473707199
2020-01-06 18:00:00,0.04165656119585037
2020-01-06 19:00:00,0.0434926301240921
2020-01-06 20:00:00,0.047885145992040634
2020-01-06 21:00:00,0.04185720160603523
2020-01-06 22:00:00,0.03928784281015396
2020-01-06 23:00:00,0.04298785328865051
2020-01-07 00:00:00,0.04811907187104225
2020-01-07 01:00:00,0.04763929545879364
2020-01-07 02:00:00,0.04947580769658089
2020-01-07 03:00:00,0.05032728239893913
2020-01-07 04:00:00,0.04742975905537605
2020-01-07 05:00:00,0.0559145025908947
2020-01-07 06:00:00,0.06330152601003647
2020-01-07 07:00:00,0.06632198393344879
2020-01-07 08:00:00,0.06812780350446701
2020-01-07 09:00:00,0.06998244673013687
2020-01-07 10:00:00,0.0911022424697876
2020-01-07 11:00:00,0.0718255490064621
2020-01-07 12:00:00,0.06973123550415039
2020-01-07 13:00:00,0.09763796627521515
2020-01-07 14:00:00,0.08916795253753662
2020-01-07 15:00:00,0.09079687297344208
2020-01-07 16:00:00,0.08851644396781921
2020-01-07 17:00:00,0.08926182240247726
2020-01-07 18:00:00,0.08645214140415192
2020-01-07 19:00:00,0.07120490074157715
2020-01-07 20:00:00,0.06638257950544357
2020-01-07 21:00:00,0.08327293395996094
2020-01-07 22:00:00,0.08789849281311035
2020-01-07 23:00:00,0.08747704327106476
2020-01-08 00:00:00,0.09645147621631622
2020-01-08 01:00:00,0.08877807855606079
2020-01-08 02:00:00,0.07874231040477753
2020-01-08 03:00:00,0.08177094906568527
2020-01-08 04:00:00,0.0570661760866642
2020-01-08 05:00:00,0.059459757059812546
2020-01-08 06:00:00,0.0864136815071106
2020-01-08 07:00:00,0.12443878501653671
2020-01-08 08:00:00,0.22328710556030273
2020-01-08 09:00:00,0.2839204967021942
2020-01-08 10:00:00,0.40385591983795166
2020-01-08 11:00:00,0.36934182047843933
2020-01-08 12:00:00,0.2529919445514679
2020-01-08 13:00:00,0.2780998647212982
2020-01-08 14:00:00,0.17207640409469604
2020-01-08 15:00:00,0.20790845155715942
2020-01-08 16:00:00,0.20904392004013062
2020-01-08 17:00:00,0.19384118914604187
2020-01-08 18:00:00,0.1811935007572174
2020-01-08 19:00:00,0.119157575070858
2020-01-08 20:00:00,0.10021941363811493
2020-01-08 21:00:00,0.08958933502435684
2020-01-08 22:00:00,0.08913417905569077
2020-01-08 23:00:00,0.09963946789503098
2020-01-09 00:00:00,0.10014025121927261
2020-01-09 01:00:00,0.09511712193489075
2020-01-09 02:00:00,0.07614684104919434
2020-01-09 03:00:00,0.05621118098497391
2020-01-09 04:00:00,0.04296369478106499
2020-01-09 05:00:00,0.07646411657333374
2020-01-09 06:00:00,0.10047776997089386
2020-01-09 07:00:00,0.1027417853474617
2020-01-09 08:00:00,0.21479883790016174
2020-01-09 09:00:00,0.26419001817703247
2020-01-09 10:00:00,0.3002638816833496
2020-01-09 11:00:00,0.25536444783210754
2020-01-09 12:00:00,0.28682562708854675
2020-01-09 13:00:00,0.3706599771976471
2020-01-09 14:00:00,0.29763370752334595
2020-01-09 15:00:00,0.28054073452949524
2020-01-09 16:00:00,0.2717936635017395
2020-01-09 17:00:00,0.2748619019985199
2020-01-09 18:00:00,0.2608135938644409
2020-01-09 19:00:00,0.21660292148590088
2020-01-09 20:00:00,0.20952385663986206
2020-01-09 21:00:00,0.1935163140296936
2020-01-09 22:00:00,0.18815243244171143
2020-01-09 23:00:00,0.2040172517299652
2020-01-10 00:00:00,0.2151498794555664
2020-01-10 01:00:00,0.20528075098991394
2020-01-10 02:00:00,0.19586840271949768
2020-01-10 03:00:00,0.18760910630226135
2020-01-10 04:00:00,0.1699722707271576
2020-01-10 05:00:00,0.18447163701057434
2020-01-10 06:00:00,0.27275264263153076
2020-01-10 07:00:00,0.2815946638584137
2020-01-10 08:00:00,0.2688911259174347
2020-01-10 09:00:00,0.22256973385810852
2020-01-10 10:00:00,0.27374687790870667
2020-01-10 11:00:00,0.2984055280685425
2020-01-10 12:00:00,0.26990750432014465
2020-01-10 13:00:00,0.28165316581726074
2020-01-10 14:00:00,0.3017590343952179
2020-01-10 15:00:00,0.24580040574073792
2020-01-10 16:00:00,0.19879290461540222
2020-01-10 17:00:00,0.20137202739715576
2020-01-10 18:00:00,0.17662516236305237
2020-01-10 19:00:00,0.2043849229812622
2020-01-10 20:00:00,0.23299971222877502
2020-01-10 21:00:00,0.19611549377441406
2020-01-10 22:00:00,0.19866445660591125
2020-01-10 23:00:00,0.2099342942237854
2020-01-11 00:00:00,0.2018904685974121
2020-01-11 01:00:00,0.20650410652160645
2020-01-11 02:00:00,0.18741989135742188
2020-01-11 03:00:00,0.17494413256645203
2020-01-11 04:00:00,0.18204131722450256
2020-01-11 05:00:00,0.17710942029953003
2020-01-11 06:00:00,0.21614131331443787
2020-01-11 07:00:00,0.24743500351905823
2020-01-11 08:00:00,0.22067707777023315
2020-01-11 09:00:00,0.24316087365150452
2020-01-11 10:00:00,0.302603155374527
2020-01-11 11:00:00,0.36368271708488464
2020-01-11 12:00:00,0.336412638425827
2020-01-11 13:00:00,0.30515769124031067
2020-01-11 14:00:00,0.08967207372188568
2020-01-11 15:00:00,0.09532803297042847
2020-01-11 16:00:00,0.025818604975938797
2020-01-11 17:00:00,0.0559268519282341
2020-01-11 18:00:00,0.13567045331001282
2020-01-11 19:00:00,0.11978260427713394
2020-01-11 20:00:00,0.13549581170082092
2020-01-11 21:00:00,0.04798654466867447
2020-01-11 22:00:00,0.05423639342188835
2020-01-11 23:00:00,0.04191789776086807
2020-01-12 00:00:00,0.06492757797241211
2020-01-12 01:00:00,0.05718023702502251
2020-01-12 02:00:00,0.07473011314868927
2020-01-12 03:00:00,0.10085359960794449
2020-01-12 04:00:00,0.10693499445915222
2020-01-12 05:00:00,0.07748477160930634
2020-01-12 06:00:00,0.05737540125846863
2020-01-12 07:00:00,0.049804020673036575
2020-01-12 08:00:00,0.056997187435626984
2020-01-12 09:00:00,0.04577064514160156
2020-01-12 10:00:00,0.04900915548205376
2020-01-12 11:00:00,0.05583404377102852
2020-01-12 12:00:00,0.0534234493970871
2020-01-12 13:00:00,0.055645402520895004
2020-01-12 14:00:00,0.055399149656295776
2020-01-12 15:00:00,0.062074266374111176
2020-01-12 16:00:00,0.06729358434677124
2020-01-12 17:00:00,0.07179590314626694
2020-01-12 18:00:00,0.07951165735721588
2020-01-12 19:00:00,0.07788917422294617
2020-01-12 20:00:00,0.08445637673139572
2020-01-12 21:00:00,0.08956636488437653
2020-01-12 22:00:00,0.10218217968940735
2020-01-12 23:00:00,0.09549038857221603
2020-01-13 00:00:00,0.08920398354530334
2020-01-13 01:00:00,0.08844146132469177
2020-01-13 02:00:00,0.1129976361989975
2020-01-13 03:00:00,0.12397032976150513
2020-01-13 04:00:00,0.1066390722990036
2020-01-13 05:00:00,0.11083868145942688
2020-01-13 06:00:00,0.11453293263912201
2020-01-13 07:00:00,0.11875714361667633
2020-01-13 08:00:00,0.12172063440084457
2020-01-13 09:00:00,0.1363455355167389
2020-01-13 10:00:00,0.12657341361045837
2020-01-13 11:00:00,0.0886310338973999
2020-01-13 12:00:00,0.0788702443242073
2020-01-13 13:00:00,0.10332417488098145
2020-01-13 14:00:00,0.10575079917907715
2020-01-13 15:00:00,0.1112118661403656
2020-01-13 16:00:00,0.10773302614688873
2020-01-13 17:00:00,0.11097684502601624
2020-01-13 18:00:00,0.103182353079319
2020-01-13 19:00:00,0.10583743453025818
2020-01-13 20:00:00,0.09598662704229355
2020-01-13 21:00:00,0.0828968733549118
2020-01-13 22:00:00,0.07193514704704285
2020-01-13 23:00:00,0.07041561603546143
2020-01-14 00:00:00,0.07247646152973175
2020-01-14 01:00:00,0.07111242413520813
2020-01-14 02:00:00,0.0734088346362114
2020-01-14 03:00:00,0.07292552292346954
2020-01-14 04:00:00,0.07360997051000595
2020-01-14 05:00:00,0.0740567296743393
2020-01-14 06:00:00,0.07635758072137833
2020-01-14 07:00:00,0.07538733631372452
2020-01-14 08:00:00,0.06861764192581177
2020-01-14 09:00:00,0.06572742015123367
2020-01-14 10:00:00,0.06783662736415863
2020-01-14 11:00:00,0.067418672144413
2020-01-14 12:00:00,0.07012151181697845
2020-01-14 13:00:00,0.07074157148599625
2020-01-14 14:00:00,0.07100378721952438
2020-01-14 15:00:00,0.07277914136648178
2020-01-14 16:00:00,0.07224668562412262
2020-01-14 17:00:00,0.07087904214859009
2020-01-14 18:00:00,0.07272420823574066
2020-01-14 19:00:00,0.06557390093803406
2020-01-14 20:00:00,0.06396624445915222
2020-01-14 21:00:00,0.068283811211586
2020-01-14 22:00:00,0.0702747106552124
2020-01-14 23:00:00,0.07064372301101685
2020-01-15 00:00:00,0.07337141782045364
2020-01-15 01:00:00,0.07533423602581024
2020-01-15 02:00:00,0.07940356433391571
2020-01-15 03:00:00,0.0818871483206749
2020-01-15 04:00:00,0.08506280183792114
2020-01-15 05:00:00,0.08279561251401901
2020-01-15 06:00:00,0.0783483237028122
2020-01-15 07:00:00,0.07806693017482758
2020-01-15 08:00:00,0.08525368571281433
2020-01-15 09:00:00,0.08431123942136765
2020-01-15 10:00:00,0.0828847587108612
2020-01-15 11:00:00,0.0690268874168396
2020-01-15 12:00:00,0.07619646191596985
2020-01-15 13:00:00,0.07873722910881042
2020-01-15 14:00:00,0.08062244951725006
2020-01-15 15:00:00,0.07668156921863556
2020-01-15 16:00:00,0.07954920083284378
2020-01-15 17:00:00,0.07757458835840225
2020-01-15 18:00:00,0.07809752225875854
2020-01-15 19:00:00,0.08078983426094055
2020-01-15 20:00:00,0.08429834246635437
2020-01-15 21:00:00,0.08912695199251175
2020-01-15 22:00:00,0.08138783276081085
2020-01-15 23:00:00,0.08489474654197693
2020-01-16 00:00:00,0.08912759274244308
2020-01-16 01:00:00,0.09770505130290985
2020-01-16 02:00:00,0.09052804112434387
2020-01-16 03:00:00,0.08578865975141525
2020-01-16 04:00:00,0.08184897154569626
2020-01-16 05:00:00,0.08708830177783966
2020-01-16 06:00:00,0.08675266802310944
2020-01-16 07:00:00,0.0848175436258316
2020-01-16 08:00:00,0.0834527462720871
2020-01-16 09:00:00,0.08284489065408707
2020-01-16 10:00:00,0.08147209137678146
2020-01-16 11:00:00,0.08097714185714722
2020-01-16 12:00:00,0.09018980711698532
2020-01-16 13:00:00,0.09346611797809601
2020-01-16 14:00:00,0.0954979732632637
2020-01-16 15:00:00,0.09521791338920593
2020-01-16 16:00:00,0.10346716642379761
2020-01-16 17:00:00,0.11663388460874557
2020-01-16 18:00:00,0.12035848200321198
2020-01-16 19:00:00,0.11160388588905334
2020-01-16 20:00:00,0.09622916579246521
2020-01-16 21:00:00,0.10381302982568741
2020-01-16 22:00:00,0.09937283396720886
2020-01-16 23:00:00,0.09818480163812637
2020-01-17 00:00:00,0.11305757611989975
2020-01-17 01:00:00,0.1635543704032898
2020-01-17 02:00:00,0.10835323482751846
2020-01-17 03:00:00,0.13007080554962158
2020-01-17 04:00:00,0.13350072503089905
2020-01-17 05:00:00,0.10725151002407074
2020-01-17 06:00:00,0.1419171392917633
2020-01-17 07:00:00,0.13777947425842285
2020-01-17 08:00:00,0.09982031583786011
2020-01-17 09:00:00,0.14481279253959656
2020-01-17 10:00:00,0.1697755753993988
2020-01-17 11:00:00,0.14204376935958862
2020-01-17 12:00:00,0.15738752484321594
2020-01-17 13:00:00,0.20598259568214417
2020-01-17 14:00:00,0.20988455414772034
2020-01-17 15:00:00,0.1919260025024414
2020-01-17 16:00:00,0.17123359441757202
2020-01-17 17:00:00,0.19008073210716248
2020-01-17 18:00:00,0.18463028967380524
2020-01-17 19:00:00,0.16753876209259033
2020-01-17 20:00:00,0.18870022892951965
2020-01-17 21:00:00,0.1859435737133026
2020-01-17 22:00:00,0.1727629154920578
2020-01-17 23:00:00,0.17316439747810364
2020-01-18 00:00:00,0.15750238299369812
2020-01-18 01:00:00,0.15562152862548828
2020-01-18 02:00:00,0.10992306470870972
2020-01-18 03:00:00,0.09623394161462784
2020-01-18 04:00:00,0.0952053815126419
2020-01-18 05:00:00,0.09914681315422058
2020-01-18 06:00:00,0.14013227820396423
2020-01-18 07:00:00,0.13925695419311523
2020-01-18 08:00:00,0.12968623638153076
2020-01-18 09:00:00,0.11661829799413681
2020-01-18 10:00:00,0.14368721842765808
2020-01-18 11:00:00,0.14203689992427826
2020-01-18 12:00:00,0.13623207807540894
2020-01-18 13:00:00,0.1381380558013916
2020-01-18 14:00:00,0.1359861195087433
2020-01-18 15:00:00,0.13695257902145386
2020-01-18 16:00:00,0.1365717351436615
2020-01-18 17:00:00,0.13194940984249115
2020-01-18 18:00:00,0.12239430099725723
2020-01-18 19:00:00,0.11190259456634521
2020-01-18 20:00:00,0.10352440923452377
2020-01-18 21:00:00,0.10981770604848862
2020-01-18 22:00:00,0.10548048466444016
2020-01-18 23:00:00,0.10417871177196503
2020-01-19 00:00:00,0.09760838001966476
2020-01-19 01:00:00,0.09142384678125381
2020-01-19 02:00:00,0.09660211205482483
2020-01-19 03:00:00,0.09684330970048904
2020-01-19 04:00:00,0.09745470434427261
2020-01-19 05:00:00,0.09338774532079697
2020-01-19 06:00:00,0.09883452206850052
2020-01-19 07:00:00,0.09380276501178741
2020-01-19 08:00:00,0.09826712310314178
2020-01-19 09:00:00,0.09298565238714218
2020-01-19 10:00:00,0.10090416669845581
2020-01-19 11:00:00,0.10100894421339035
2020-01-19 12:00:00,0.09508110582828522
2020-01-19 13:00:00,0.09211345762014389
2020-01-19 14:00:00,0.0914342850446701
2020-01-19 15:00:00,0.08952111005783081
2020-01-19 16:00:00,0.08652745187282562
2020-01-19 17:00:00,0.08885704725980759
2020-01-19 18:00:00,0.0923558697104454
2020-01-19 19:00:00,0.08490432798862457
2020-01-19 20:00:00,0.07939428836107254
2020-01-19 21:00:00,0.06466634571552277
2020-01-19 22:00:00,0.05962789058685303
2020-01-19 23:00:00,0.0586569644510746
2020-01-20 00:00:00,0.049935851246118546
2020-01-20 01:00:00,0.0497003048658371
2020-01-20 02:00:00,0.04673080891370773
2020-01-20 03:00:00,0.04437200725078583
2020-01-20 04:00:00,0.04696554318070412
2020-01-20 05:00:00,0.043949395418167114
2020-01-20 06:00:00,0.04778095334768295
2020-01-20 07:00:00,0.04724273085594177
2020-01-20 08:00:00,0.049490801990032196
2020-01-20 09:00:00,0.056031517684459686
2020-01-20 10:00:00,0.0551738515496254
2020-01-20 11:00:00,0.057116612792015076
2020-01-20 12:00:00,0.059276677668094635
2020-01-20 13:00:00,0.06265857815742493
2020-01-20 14:00:00,0.06318144500255585
2020-01-20 15:00:00,0.06157614290714264
2020-01-20 16:00:00,0.05900976434350014
2020-01-20 17:00:00,0.05925038829445839
2020-01-20 18:00:00,0.059256136417388916
2020-01-20 19:00:00,0.05979730933904648
2020-01-20 20:00:00,0.06223783269524574
2020-01-20 21:00:00,0.06267095357179642
2020-01-20 22:00:00,0.05926985293626785
2020-01-20 23:00:00,0.07217247039079666
2020-01-21 00:00:00,0.09135845303535461
2020-01-21 01:00:00,0.07398593425750732
2020-01-21 02:00:00,0.07706338912248611
2020-01-21 03:00:00,0.08085880428552628
2020-01-21 04:00:00,0.08128028362989426
2020-01-21 05:00:00,0.08897323906421661
2020-01-21 06:00:00,0.10239091515541077
2020-01-21 07:00:00,0.10310517251491547
2020-01-21 08:00:00,0.11681342869997025
2020-01-21 09:00:00,0.12986020743846893
2020-01-21 10:00:00,0.18161718547344208
2020-01-21 11:00:00,0.17859989404678345
2020-01-21 12:00:00,0.15347439050674438
2020-01-21 13:00:00,0.2078622579574585
2020-01-21 14:00:00,0.18553876876831055
2020-01-21 15:00:00,0.18473893404006958
2020-01-21 16:00:00,0.1881379783153534
2020-01-21 17:00:00,0.181533545255661
2020-01-21 18:00:00,0.17991456389427185
2020-01-21 19:00:00,0.1049887016415596
2020-01-21 20:00:00,0.07366263121366501
2020-01-21 21:00:00,0.0880088061094284
2020-01-21 22:00:00,0.09268568456172943
2020-01-21 23:00:00,0.07898411154747009
2020-01-22 00:00:00,0.07671564817428589
2020-01-22 01:00:00,0.09543205052614212
2020-01-22 02:00:00,0.08739862591028214
2020-01-22 03:00:00,0.09742535650730133
2020-01-22 04:00:00,0.10235850512981415
2020-01-22 05:00:00,0.08998475223779678
2020-01-22 06:00:00,0.12135572731494904
2020-01-22 07:00:00,0.15517792105674744
2020-01-22 08:00:00,0.18155261874198914
2020-01-22 09:00:00,0.2601693868637085
2020-01-22 10:00:00,0.3051341772079468
2020-01-22 11:00:00,0.2758438289165497
2020-01-22 12:00:00,0.3613269329071045
2020-01-22 13:00:00,0.3878834545612335
2020-01-22 14:00:00,0.36577025055885315
2020-01-22 15:00:00,0.37128064036369324
2020-01-22 16:00:00,0.3401899039745331
2020-01-22 17:00:00,0.2902113199234009
2020-01-22 18:00:00,0.27619078755378723
2020-01-22 19:00:00,0.258408784866333
2020-01-22 20:00:00,0.2636363208293915
2020-01-22 21:00:00,0.2088734209537506
2020-01-22 22:00:00,0.2061992585659027
2020-01-22 23:00:00,0.20445746183395386
2020-01-23 00:00:00,0.22061124444007874
2020-01-23 01:00:00,0.22237923741340637
2020-01-23 02:00:00,0.23446273803710938
2020-01-23 03:00:00,0.1991209089756012
2020-01-23 04:00:00,0.18675562739372253
2020-01-23 05:00:00,0.20509740710258484
2020-01-23 06:00:00,0.2902601957321167
2020-01-23 07:00:00,0.3065949082374573
2020-01-23 08:00:00,0.2691371738910675
2020-01-23 09:00:00,0.26844972372055054
2020-01-23 10:00:00,0.274621844291687
2020-01-23 11:00:00,0.2013539969921112
2020-01-23 12:00:00,0.14720407128334045
2020-01-23 13:00:00,0.1307290494441986
2020-01-23 14:00:00,0.1217515841126442
2020-01-23 15:00:00,0.12906023859977722
2020-01-23 16:00:00,0.11090481281280518
2020-01-23 17:00:00,0.09820134937763214
2020-01-23 18:00:00,0.08484518527984619
2020-01-23 19:00:00,0.08181456476449966
2020-01-23 20:00:00,0.09402169287204742
2020-01-23 21:00:00,0.100318044424057
2020-01-23 22:00:00,0.10227066278457642
2020-01-23 23:00:00,0.11024543642997742
2020-01-24 00:00:00,0.11275407671928406
2020-01-24 01:00:00,0.11599037796258926
2020-01-24 02:00:00,0.11235171556472778
2020-01-24 03:00:00,0.11821315437555313
2020-01-24 04:00:00,0.13134123384952545
2020-01-24 05:00:00,0.14450949430465698
2020-01-24 06:00:00,0.1550196409225464
2020-01-24 07:00:00,0.20614132285118103
2020-01-24 08:00:00,0.24173343181610107
2020-01-24 09:00:00,0.33240482211112976
2020-01-24 10:00:00,0.3799135982990265
2020-01-24 11:00:00,0.3542879819869995
2020-01-24 12:00:00,0.3480437397956848
2020-01-24 13:00:00,0.4122529625892639
2020-01-24 14:00:00,0.3610563278198242
2020-01-24 15:00:00,0.3338206708431244
2020-01-24 16:00:00,0.3178430497646332
2020-01-24 17:00:00,0.301323801279068
2020-01-24 18:00:00,0.2925606966018677
2020-01-24 19:00:00,0.2252100706100464
2020-01-24 20:00:00,0.2470424473285675
2020-01-24 21:00:00,0.21422430872917175
2020-01-24 22:00:00,0.18237733840942383
2020-01-24 23:00:00,0.1767009049654007
2020-01-25 00:00:00,0.1781521737575531
2020-01-25 01:00:00,0.18084129691123962
2020-01-25 02:00:00,0.15731275081634521
2020-01-25 03:00:00,0.15908581018447876
2020-01-25 04:00:00,0.1608576476573944
2020-01-25 05:00:00,0.2044307291507721
2020-01-25 06:00:00,0.20842084288597107
2020-01-25 07:00:00,0.24663183093070984
2020-01-25 08:00:00,0.2523652911186218
2020-01-25 09:00:00,0.27900993824005127
2020-01-25 10:00:00,0.33765655755996704
2020-01-25 11:00:00,0.33905038237571716
2020-01-25 12:00:00,0.3683701753616333
2020-01-25 13:00:00,0.41157132387161255
2020-01-25 14:00:00,0.375537246465683
2020-01-25 15:00:00,0.36706826090812683
2020-01-25 16:00:00,0.33964431285858154
2020-01-25 17:00:00,0.31150317192077637
2020-01-25 18:00:00,0.29562440514564514
2020-01-25 19:00:00,0.2685360312461853
2020-01-25 20:00:00,0.23871594667434692
2020-01-25 21:00:00,0.22857937216758728
2020-01-25 22:00:00,0.22807615995407104
2020-01-25 23:00:00,0.22124424576759338
2020-01-26 00:00:00,0.22034454345703125
2020-01-26 01:00:00,0.22646719217300415
2020-01-26 02:00:00,0.19389721751213074
2020-01-26 03:00:00,0.1873868852853775
2020-01-26 04:00:00,0.22951006889343262
2020-01-26 05:00:00,0.2187252640724182
2020-01-26 06:00:00,0.2275959551334381
2020-01-26 07:00:00,0.22129759192466736
2020-01-26 08:00:00,0.23346781730651855
2020-01-26 09:00:00,0.26770472526550293
2020-01-26 10:00:00,0.29557424783706665
2020-01-26 11:00:00,0.2803725302219391
2020-01-26 12:00:00,0.2813050150871277
2020-01-26 13:00:00,0.25477150082588196
2020-01-26 14:00:00,0.18660995364189148
2020-01-26 15:00:00,0.1551538109779358
2020-01-26 16:00:00,0.15385088324546814
2020-01-26 17:00:00,0.18822911381721497
2020-01-26 18:00:00,0.22361204028129578
2020-01-26 19:00:00,0.22480818629264832
2020-01-26 20:00:00,0.24051478505134583
2020-01-26 21:00:00,0.22320330142974854
2020-01-26 22:00:00,0.2447865605354309
2020-01-26 23:00:00,0.2401103675365448
2020-01-27 00:00:00,0.2384861707687378
2020-01-27 01:00:00,0.2244875729084015
2020-01-27 02:00:00,0.22582390904426575
2020-01-27 03:00:00,0.1999967396259308
2020-01-27 04:00:00,0.11564463376998901
2020-01-27 05:00:00,0.1252148449420929
2020-01-27 06:00:00,0.15435007214546204
2020-01-27 07:00:00,0.15739767253398895
2020-01-27 08:00:00,0.20013636350631714
2020-01-27 09:00:00,0.20827797055244446
2020-01-27 10:00:00,0.208245187997818
2020-01-27 11:00:00,0.18686014413833618
2020-01-27 12:00:00,0.20093363523483276
2020-01-27 13:00:00,0.1978982388973236
2020-01-27 14:00:00,0.19626152515411377
2020-01-27 15:00:00,0.16097751259803772
2020-01-27 16:00:00,0.12688162922859192
2020-01-27 17:00:00,0.18652600049972534
2020-01-27 18:00:00,0.21156585216522217
2020-01-27 19:00:00,0.17824304103851318
2020-01-27 20:00:00,0.18148648738861084
2020-01-27 21:00:00,0.21477356553077698
2020-01-27 22:00:00,0.20609760284423828
2020-01-27 23:00:00,0.26582807302474976
2020-01-28 00:00:00,-0.008192963898181915
2020-01-28 01:00:00,0.042618826031684875
2020-01-28 02:00:00,0.16613104939460754
2020-01-28 03:00:00,0.14726859331130981
2020-01-28 04:00:00,0.14059090614318848
2020-01-28 05:00:00,0.04209701716899872
2020-01-28 06:00:00,0.06346635520458221
2020-01-28 07:00:00,0.08347272872924805
2020-01-28 08:00:00,0.0759960189461708
2020-01-28 09:00:00,0.08899790048599243
2020-01-28 10:00:00,0.0984451174736023
2020-01-28 11:00:00,0.11873537302017212
2020-01-28 12:00:00,0.12025675177574158
2020-01-28 13:00:00,0.10230317711830139
2020-01-28 14:00:00,0.10214739292860031
2020-01-28 15:00:00,0.11076004803180695
2020-01-28 16:00:00,0.1125604584813118
2020-01-28 17:00:00,0.11355720460414886
2020-01-28 18:00:00,0.14198662340641022
2020-01-28 19:00:00,0.15373243391513824
2020-01-28 20:00:00,0.1984672248363495
2020-01-28 21:00:00,0.20135703682899475
2020-01-28 22:00:00,0.21759501099586487
2020-01-28 23:00:00,0.21163567900657654
2020-01-29 00:00:00,0.22026315331459045
2020-01-29 01:00:00,0.20546922087669373
2020-01-29 02:00:00,0.20243269205093384
2020-01-29 03:00:00,0.19760096073150635
2020-01-29 04:00:00,0.17890924215316772
2020-01-29 05:00:00,0.18086150288581848
2020-01-29 06:00:00,0.194011390209198
2020-01-29 07:00:00,0.19434469938278198
2020-01-29 08:00:00,0.18720901012420654
2020-01-29 09:00:00,0.1660575270652771
2020-01-29 10:00:00,0.07704420387744904
2020-01-29 11:00:00,0.050644755363464355
2020-01-29 12:00:00,0.06198645010590553
2020-01-29 13:00:00,0.031095627695322037
2020-01-29 14:00:00,0.03462812304496765
2020-01-29 15:00:00,0.028514936566352844
2020-01-29 16:00:00,0.029167018830776215
2020-01-29 17:00:00,0.02758435159921646
2020-01-29 18:00:00,0.0321006216108799
2020-01-29 19:00:00,0.034778378903865814
2020-01-29 20:00:00,0.03246453404426575
2020-01-29 21:00:00,0.030607566237449646
2020-01-29 22:00:00,0.0430186428129673
2020-01-29 23:00:00,0.04225891828536987
2020-01-30 00:00:00,0.0352390855550766
2020-01-30 01:00:00,0.029309973120689392
2020-01-30 02:00:00,0.018253792077302933
2020-01-30 03:00:00,0.015626009553670883
2020-01-30 04:00:00,0.014742307364940643
2020-01-30 05:00:00,0.014245927333831787
2020-01-30 06:00:00,0.02209978923201561
2020-01-30 07:00:00,0.008183080703020096
2020-01-30 08:00:00,0.025057043880224228
2020-01-30 09:00:00,0.030949637293815613
2020-01-30 10:00:00,0.04856250062584877
2020-01-30 11:00:00,0.04634051024913788
2020-01-30 12:00:00,0.037064582109451294
2020-01-30 13:00:00,0.040688712149858475
2020-01-30 14:00:00,0.03862658143043518
2020-01-30 15:00:00,0.03846049681305885
2020-01-30 16:00:00,0.0393771268427372
2020-01-30 17:00:00,0.04279845580458641
2020-01-30 18:00:00,0.054112549871206284
2020-01-30 19:00:00,0.050052497535943985
2020-01-30 20:00:00,0.052332572638988495
2020-01-30 21:00:00,0.0572165884077549
2020-01-30 22:00:00,0.06663720309734344
2020-01-30 23:00:00,0.06629577279090881
2020-01-31 00:00:00,0.06568285822868347
2020-01-31 01:00:00,0.05568134784698486
2020-01-31 02:00:00,0.04213870316743851
2020-01-31 03:00:00,0.04035678133368492
2020-01-31 04:00:00,0.057119108736515045
2020-01-31 05:00:00,0.05801990255713463
2020-01-31 06:00:00,0.09793436527252197
2020-01-31 07:00:00,0.12652751803398132
2020-01-31 08:00:00,0.18558473885059357
2020-01-31 09:00:00,0.19692841172218323
2020-01-31 10:00:00,0.2359224259853363
2020-01-31 11:00:00,0.23450082540512085
2020-01-31 12:00:00,0.20931988954544067
2020-01-31 13:00:00,0.23549723625183105
