{
	"/Lotus/Upgrades/Mods/Randomized/PlayerMeleeWeaponRandomModRare:WeaponMeleeDamageMod": 1,
	"/Lotus/Upgrades/Mods/Randomized/PlayerMeleeWeaponRandomModRare:WeaponArmorPiercingDamageMod": 2,
	"/Lotus/Upgrades/Mods/Randomized/PlayerMeleeWeaponRandomModRare:WeaponImpactDamageMod": 3,
	"/Lotus/Upgrades/Mods/Randomized/PlayerMeleeWeaponRandomModRare:WeaponSlashDamageMod": 4,
	"/Lotus/Upgrades/Mods/Randomized/PlayerMeleeWeaponRandomModRare:WeaponCritChanceMod": 5,
	"/Lotus/Upgrades/Mods/Randomized/PlayerMeleeWeaponRandomModRare:WeaponCritDamageMod": 6,
	"/Lotus/Upgrades/Mods/Randomized/PlayerMeleeWeaponRandomModRare:WeaponElectricityDamageMod": 7,
	"/Lotus/Upgrades/Mods/Randomized/PlayerMeleeWeaponRandomModRare:WeaponFireDamageMod": 8,
	"/Lotus/Upgrades/Mods/Randomized/PlayerMeleeWeaponRandomModRare:WeaponFreezeDamageMod": 9,
	"/Lotus/Upgrades/Mods/Randomized/PlayerMeleeWeaponRandomModRare:WeaponToxinDamageMod": 10,
	"/Lotus/Upgrades/Mods/Randomized/PlayerMeleeWeaponRandomModRare:WeaponProcTimeMod": 11,
	"/Lotus/Upgrades/Mods/Randomized/PlayerMeleeWeaponRandomModRare:WeaponMeleeFactionDamageCorpus": 12,
	"/Lotus/Upgrades/Mods/Randomized/PlayerMeleeWeaponRandomModRare:WeaponMeleeFactionDamageGrineer": 13,
	"/Lotus/Upgrades/Mods/Randomized/PlayerMeleeWeaponRandomModRare:WeaponMeleeFactionDamageInfested": 14,
	"/Lotus/Upgrades/Mods/Randomized/PlayerMeleeWeaponRandomModRare:WeaponFireRateMod": 15,
	"/Lotus/Upgrades/Mods/Randomized/PlayerMeleeWeaponRandomModRare:WeaponStunChanceMod": 16,
	"/Lotus/Upgrades/Mods/Randomized/PlayerMeleeWeaponRandomModRare:ComboDurationMod": 17,
	"/Lotus/Upgrades/Mods/Randomized/PlayerMeleeWeaponRandomModRare:WeaponChannelingDamage": 18,
	"/Lotus/Upgrades/Mods/Randomized/PlayerMeleeWeaponRandomModRare:WeaponMeleeChargeRateMod": 19,
	"/Lotus/Upgrades/Mods/Randomized/PlayerMeleeWeaponRandomModRare:SlideAttackCritChanceMod": 20,
	"/Lotus/Upgrades/Mods/Randomized/PlayerMeleeWeaponRandomModRare:WeaponMeleeRangeIncMod": 21,
	"/Lotus/Upgrades/Mods/Randomized/PlayerMeleeWeaponRandomModRare:WeaponMeleeFinisherDamageMod": 22,
	"/Lotus/Upgrades/Mods/Randomized/LotusRifleRandomModRare:WeaponArmorPiercingDamageMod": 23,
	"/Lotus/Upgrades/Mods/Randomized/LotusRifleRandomModRare:WeaponCritChanceMod": 24,
	"/Lotus/Upgrades/Mods/Randomized/LotusRifleRandomModRare:WeaponCritDamageMod": 25,
	"/Lotus/Upgrades/Mods/Randomized/LotusRifleRandomModRare:WeaponElectricityDamageMod": 26,
	"/Lotus/Upgrades/Mods/Randomized/LotusRifleRandomModRare:WeaponFireDamageMod": 27,
	"/Lotus/Upgrades/Mods/Randomized/LotusRifleRandomModRare:WeaponFireRateMod": 28,
	"/Lotus/Upgrades/Mods/Randomized/LotusRifleRandomModRare:WeaponFreezeDamageMod": 29,
	"/Lotus/Upgrades/Mods/Randomized/LotusRifleRandomModRare:WeaponImpactDamageMod": 30,
	"/Lotus/Upgrades/Mods/Randomized/LotusRifleRandomModRare:WeaponProcTimeMod": 31,
	"/Lotus/Upgrades/Mods/Randomized/LotusRifleRandomModRare:WeaponSlashDamageMod": 32,
	"/Lotus/Upgrades/Mods/Randomized/LotusRifleRandomModRare:WeaponStunChanceMod": 33,
	"/Lotus/Upgrades/Mods/Randomized/LotusRifleRandomModRare:WeaponToxinDamageMod": 34,
	"/Lotus/Upgrades/Mods/Randomized/LotusRifleRandomModRare:WeaponAmmoMaxMod": 35,
	"/Lotus/Upgrades/Mods/Randomized/LotusRifleRandomModRare:WeaponClipMaxMod": 36,
	"/Lotus/Upgrades/Mods/Randomized/LotusRifleRandomModRare:WeaponDamageAmountMod": 37,
	"/Lotus/Upgrades/Mods/Randomized/LotusRifleRandomModRare:WeaponFireIterationsMod": 38,
	"/Lotus/Upgrades/Mods/Randomized/LotusRifleRandomModRare:WeaponProjectileSpeedMod": 39,
	"/Lotus/Upgrades/Mods/Randomized/LotusRifleRandomModRare:WeaponPunctureDepthMod": 40,
	"/Lotus/Upgrades/Mods/Randomized/LotusRifleRandomModRare:WeaponRecoilReductionMod": 41,
	"/Lotus/Upgrades/Mods/Randomized/LotusRifleRandomModRare:WeaponReloadSpeedMod": 42,
	"/Lotus/Upgrades/Mods/Randomized/LotusRifleRandomModRare:WeaponFactionDamageCorpus": 43,
	"/Lotus/Upgrades/Mods/Randomized/LotusRifleRandomModRare:WeaponFactionDamageGrineer": 44,
	"/Lotus/Upgrades/Mods/Randomized/LotusRifleRandomModRare:WeaponFactionDamageInfested": 45,
	"/Lotus/Upgrades/Mods/Randomized/LotusRifleRandomModRare:WeaponZoomFovMod": 46,
	"/Lotus/Upgrades/Mods/Randomized/LotusShotgunRandomModRare:WeaponArmorPiercingDamageMod": 47,
	"/Lotus/Upgrades/Mods/Randomized/LotusShotgunRandomModRare:WeaponCritChanceMod": 48,
	"/Lotus/Upgrades/Mods/Randomized/LotusShotgunRandomModRare:WeaponCritDamageMod": 49,
	"/Lotus/Upgrades/Mods/Randomized/LotusShotgunRandomModRare:WeaponElectricityDamageMod": 50,
	"/Lotus/Upgrades/Mods/Randomized/LotusShotgunRandomModRare:WeaponFireDamageMod": 51,
	"/Lotus/Upgrades/Mods/Randomized/LotusShotgunRandomModRare:WeaponFireRateMod": 52,
	"/Lotus/Upgrades/Mods/Randomized/LotusShotgunRandomModRare:WeaponFreezeDamageMod": 53,
	"/Lotus/Upgrades/Mods/Randomized/LotusShotgunRandomModRare:WeaponImpactDamageMod": 54,
	"/Lotus/Upgrades/Mods/Randomized/LotusShotgunRandomModRare:WeaponProcTimeMod": 55,
	"/Lotus/Upgrades/Mods/Randomized/LotusShotgunRandomModRare:WeaponSlashDamageMod": 56,
	"/Lotus/Upgrades/Mods/Randomized/LotusShotgunRandomModRare:WeaponStunChanceMod": 57,
	"/Lotus/Upgrades/Mods/Randomized/LotusShotgunRandomModRare:WeaponToxinDamageMod": 58,
	"/Lotus/Upgrades/Mods/Randomized/LotusShotgunRandomModRare:WeaponAmmoMaxMod": 59,
	"/Lotus/Upgrades/Mods/Randomized/LotusShotgunRandomModRare:WeaponClipMaxMod": 60,
	"/Lotus/Upgrades/Mods/Randomized/LotusShotgunRandomModRare:WeaponDamageAmountMod": 61,
	"/Lotus/Upgrades/Mods/Randomized/LotusShotgunRandomModRare:WeaponFireIterationsMod": 62,
	"/Lotus/Upgrades/Mods/Randomized/LotusShotgunRandomModRare:WeaponProjectileSpeedMod": 63,
	"/Lotus/Upgrades/Mods/Randomized/LotusShotgunRandomModRare:WeaponPunctureDepthMod": 64,
	"/Lotus/Upgrades/Mods/Randomized/LotusShotgunRandomModRare:WeaponRecoilReductionMod": 65,
	"/Lotus/Upgrades/Mods/Randomized/LotusShotgunRandomModRare:WeaponReloadSpeedMod": 66,
	"/Lotus/Upgrades/Mods/Randomized/LotusShotgunRandomModRare:WeaponFactionDamageCorpus": 67,
	"/Lotus/Upgrades/Mods/Randomized/LotusShotgunRandomModRare:WeaponFactionDamageGrineer": 68,
	"/Lotus/Upgrades/Mods/Randomized/LotusShotgunRandomModRare:WeaponFactionDamageInfested": 69,
	"/Lotus/Upgrades/Mods/Randomized/LotusPistolRandomModRare:WeaponArmorPiercingDamageMod": 70,
	"/Lotus/Upgrades/Mods/Randomized/LotusPistolRandomModRare:WeaponCritChanceMod": 71,
	"/Lotus/Upgrades/Mods/Randomized/LotusPistolRandomModRare:WeaponCritDamageMod": 72,
	"/Lotus/Upgrades/Mods/Randomized/LotusPistolRandomModRare:WeaponElectricityDamageMod": 73,
	"/Lotus/Upgrades/Mods/Randomized/LotusPistolRandomModRare:WeaponFireDamageMod": 74,
	"/Lotus/Upgrades/Mods/Randomized/LotusPistolRandomModRare:WeaponFireRateMod": 75,
	"/Lotus/Upgrades/Mods/Randomized/LotusPistolRandomModRare:WeaponFreezeDamageMod": 76,
	"/Lotus/Upgrades/Mods/Randomized/LotusPistolRandomModRare:WeaponImpactDamageMod": 77,
	"/Lotus/Upgrades/Mods/Randomized/LotusPistolRandomModRare:WeaponProcTimeMod": 78,
	"/Lotus/Upgrades/Mods/Randomized/LotusPistolRandomModRare:WeaponSlashDamageMod": 79,
	"/Lotus/Upgrades/Mods/Randomized/LotusPistolRandomModRare:WeaponStunChanceMod": 80,
	"/Lotus/Upgrades/Mods/Randomized/LotusPistolRandomModRare:WeaponToxinDamageMod": 81,
	"/Lotus/Upgrades/Mods/Randomized/LotusPistolRandomModRare:WeaponAmmoMaxMod": 82,
	"/Lotus/Upgrades/Mods/Randomized/LotusPistolRandomModRare:WeaponClipMaxMod": 83,
	"/Lotus/Upgrades/Mods/Randomized/LotusPistolRandomModRare:WeaponDamageAmountMod": 84,
	"/Lotus/Upgrades/Mods/Randomized/LotusPistolRandomModRare:WeaponFireIterationsMod": 85,
	"/Lotus/Upgrades/Mods/Randomized/LotusPistolRandomModRare:WeaponProjectileSpeedMod": 86,
	"/Lotus/Upgrades/Mods/Randomized/LotusPistolRandomModRare:WeaponPunctureDepthMod": 87,
	"/Lotus/Upgrades/Mods/Randomized/LotusPistolRandomModRare:WeaponRecoilReductionMod": 88,
	"/Lotus/Upgrades/Mods/Randomized/LotusPistolRandomModRare:WeaponReloadSpeedMod": 89,
	"/Lotus/Upgrades/Mods/Randomized/LotusPistolRandomModRare:WeaponFactionDamageCorpus": 90,
	"/Lotus/Upgrades/Mods/Randomized/LotusPistolRandomModRare:WeaponFactionDamageGrineer": 91,
	"/Lotus/Upgrades/Mods/Randomized/LotusPistolRandomModRare:WeaponFactionDamageInfested": 92,
	"/Lotus/Upgrades/Mods/Randomized/LotusPistolRandomModRare:WeaponZoomFovMod": 93,
	"/Lotus/Upgrades/Mods/Randomized/LotusModularMeleeRandomModRare:WeaponMeleeDamageMod": 94,
	"/Lotus/Upgrades/Mods/Randomized/LotusModularMeleeRandomModRare:WeaponArmorPiercingDamageMod": 95,
	"/Lotus/Upgrades/Mods/Randomized/LotusModularMeleeRandomModRare:WeaponImpactDamageMod": 96,
	"/Lotus/Upgrades/Mods/Randomized/LotusModularMeleeRandomModRare:WeaponSlashDamageMod": 97,
	"/Lotus/Upgrades/Mods/Randomized/LotusModularMeleeRandomModRare:WeaponCritChanceMod": 98,
	"/Lotus/Upgrades/Mods/Randomized/LotusModularMeleeRandomModRare:WeaponCritDamageMod": 99,
	"/Lotus/Upgrades/Mods/Randomized/LotusModularMeleeRandomModRare:WeaponElectricityDamageMod": 100,
	"/Lotus/Upgrades/Mods/Randomized/LotusModularMeleeRandomModRare:WeaponFireDamageMod": 101,
	"/Lotus/Upgrades/Mods/Randomized/LotusModularMeleeRandomModRare:WeaponFreezeDamageMod": 102,
	"/Lotus/Upgrades/Mods/Randomized/LotusModularMeleeRandomModRare:WeaponToxinDamageMod": 103,
	"/Lotus/Upgrades/Mods/Randomized/LotusModularMeleeRandomModRare:WeaponProcTimeMod": 104,
	"/Lotus/Upgrades/Mods/Randomized/LotusModularMeleeRandomModRare:WeaponMeleeFactionDamageCorpus": 105,
	"/Lotus/Upgrades/Mods/Randomized/LotusModularMeleeRandomModRare:WeaponMeleeFactionDamageGrineer": 106,
	"/Lotus/Upgrades/Mods/Randomized/LotusModularMeleeRandomModRare:WeaponMeleeFactionDamageInfested": 107,
	"/Lotus/Upgrades/Mods/Randomized/LotusModularMeleeRandomModRare:WeaponFireRateMod": 108,
	"/Lotus/Upgrades/Mods/Randomized/LotusModularMeleeRandomModRare:WeaponStunChanceMod": 109,
	"/Lotus/Upgrades/Mods/Randomized/LotusModularMeleeRandomModRare:ComboDurationMod": 110,
	"/Lotus/Upgrades/Mods/Randomized/LotusModularMeleeRandomModRare:WeaponChannelingDamage": 111,
	"/Lotus/Upgrades/Mods/Randomized/LotusModularMeleeRandomModRare:WeaponMeleeChargeRateMod": 112,
	"/Lotus/Upgrades/Mods/Randomized/LotusModularMeleeRandomModRare:SlideAttackCritChanceMod": 113,
	"/Lotus/Upgrades/Mods/Randomized/LotusModularMeleeRandomModRare:WeaponMeleeRangeIncMod": 114,
	"/Lotus/Upgrades/Mods/Randomized/LotusModularMeleeRandomModRare:WeaponMeleeFinisherDamageMod": 115,
	"/Lotus/Upgrades/Mods/Randomized/LotusModularPistolRandomModRare:WeaponArmorPiercingDamageMod": 116,
	"/Lotus/Upgrades/Mods/Randomized/LotusModularPistolRandomModRare:WeaponCritChanceMod": 117,
	"/Lotus/Upgrades/Mods/Randomized/LotusModularPistolRandomModRare:WeaponCritDamageMod": 118,
	"/Lotus/Upgrades/Mods/Randomized/LotusModularPistolRandomModRare:WeaponElectricityDamageMod": 119,
	"/Lotus/Upgrades/Mods/Randomized/LotusModularPistolRandomModRare:WeaponFireDamageMod": 120,
	"/Lotus/Upgrades/Mods/Randomized/LotusModularPistolRandomModRare:WeaponFireRateMod": 121,
	"/Lotus/Upgrades/Mods/Randomized/LotusModularPistolRandomModRare:WeaponFreezeDamageMod": 122,
	"/Lotus/Upgrades/Mods/Randomized/LotusModularPistolRandomModRare:WeaponImpactDamageMod": 123,
	"/Lotus/Upgrades/Mods/Randomized/LotusModularPistolRandomModRare:WeaponProcTimeMod": 124,
	"/Lotus/Upgrades/Mods/Randomized/LotusModularPistolRandomModRare:WeaponSlashDamageMod": 125,
	"/Lotus/Upgrades/Mods/Randomized/LotusModularPistolRandomModRare:WeaponStunChanceMod": 126,
	"/Lotus/Upgrades/Mods/Randomized/LotusModularPistolRandomModRare:WeaponToxinDamageMod": 127,
	"/Lotus/Upgrades/Mods/Randomized/LotusModularPistolRandomModRare:WeaponAmmoMaxMod": 128,
	"/Lotus/Upgrades/Mods/Randomized/LotusModularPistolRandomModRare:WeaponClipMaxMod": 129,
	"/Lotus/Upgrades/Mods/Randomized/LotusModularPistolRandomModRare:WeaponDamageAmountMod": 130,
	"/Lotus/Upgrades/Mods/Randomized/LotusModularPistolRandomModRare:WeaponFireIterationsMod": 131,
	"/Lotus/Upgrades/Mods/Randomized/LotusModularPistolRandomModRare:WeaponProjectileSpeedMod": 132,
	"/Lotus/Upgrades/Mods/Randomized/LotusModularPistolRandomModRare:WeaponPunctureDepthMod": 133,
	"/Lotus/Upgrades/Mods/Randomized/LotusModularPistolRandomModRare:WeaponRecoilReductionMod": 134,
	"/Lotus/Upgrades/Mods/Randomized/LotusModularPistolRandomModRare:WeaponReloadSpeedMod": 135,
	"/Lotus/Upgrades/Mods/Randomized/LotusModularPistolRandomModRare:WeaponFactionDamageCorpus": 136,
	"/Lotus/Upgrades/Mods/Randomized/LotusModularPistolRandomModRare:WeaponFactionDamageGrineer": 137,
	"/Lotus/Upgrades/Mods/Randomized/LotusModularPistolRandomModRare:WeaponFactionDamageInfested": 138,
	"/Lotus/Upgrades/Mods/Randomized/LotusModularPistolRandomModRare:WeaponZoomFovMod": 139,
	"/Lotus/Upgrades/Mods/Randomized/LotusArchgunRandomModRare:WeaponArmorPiercingDamageMod": 140,
	"/Lotus/Upgrades/Mods/Randomized/LotusArchgunRandomModRare:WeaponCritChanceMod": 141,
	"/Lotus/Upgrades/Mods/Randomized/LotusArchgunRandomModRare:WeaponCritDamageMod": 142,
	"/Lotus/Upgrades/Mods/Randomized/LotusArchgunRandomModRare:WeaponElectricityDamageMod": 143,
	"/Lotus/Upgrades/Mods/Randomized/LotusArchgunRandomModRare:WeaponFireDamageMod": 144,
	"/Lotus/Upgrades/Mods/Randomized/LotusArchgunRandomModRare:WeaponFireRateMod": 145,
	"/Lotus/Upgrades/Mods/Randomized/LotusArchgunRandomModRare:WeaponFreezeDamageMod": 146,
	"/Lotus/Upgrades/Mods/Randomized/LotusArchgunRandomModRare:WeaponImpactDamageMod": 147,
	"/Lotus/Upgrades/Mods/Randomized/LotusArchgunRandomModRare:WeaponProcTimeMod": 148,
	"/Lotus/Upgrades/Mods/Randomized/LotusArchgunRandomModRare:WeaponSlashDamageMod": 149,
	"/Lotus/Upgrades/Mods/Randomized/LotusArchgunRandomModRare:WeaponStunChanceMod": 150,
	"/Lotus/Upgrades/Mods/Randomized/LotusArchgunRandomModRare:WeaponToxinDamageMod": 151,
	"/Lotus/Upgrades/Mods/Randomized/LotusArchgunRandomModRare:WeaponAmmoMaxMod": 152,
	"/Lotus/Upgrades/Mods/Randomized/LotusArchgunRandomModRare:WeaponClipMaxMod": 153,
	"/Lotus/Upgrades/Mods/Randomized/LotusArchgunRandomModRare:WeaponDamageAmountMod": 154,
	"/Lotus/Upgrades/Mods/Randomized/LotusArchgunRandomModRare:WeaponFireIterationsMod": 155,
	"/Lotus/Upgrades/Mods/Randomized/LotusArchgunRandomModRare:WeaponPunctureDepthMod": 156,
	"/Lotus/Upgrades/Mods/Randomized/LotusArchgunRandomModRare:WeaponRecoilReductionMod": 157,
	"/Lotus/Upgrades/Mods/Randomized/LotusArchgunRandomModRare:WeaponReloadSpeedMod": 158,
	"/Lotus/Upgrades/Mods/Randomized/LotusArchgunRandomModRare:WeaponFactionDamageCorpus": 159,
	"/Lotus/Upgrades/Mods/Randomized/LotusArchgunRandomModRare:WeaponFactionDamageGrineer": 160,
	"/Lotus/Upgrades/Mods/Randomized/LotusArchgunRandomModRare:WeaponZoomFovMod": 161,
	"/Lotus/Upgrades/Mods/Randomized/PlayerMeleeWeaponRandomModRare:WeaponMeleeComboEfficiencyMod": 162,
	"/Lotus/Upgrades/Mods/Randomized/PlayerMeleeWeaponRandomModRare:WeaponMeleeComboInitialBonusMod": 163,
	"/Lotus/Upgrades/Mods/Randomized/PlayerMeleeWeaponRandomModRare:WeaponMeleeComboPointsOnHitMod": 164,
	"/Lotus/Upgrades/Mods/Randomized/PlayerMeleeWeaponRandomModRare:WeaponMeleeComboBonusOnHitMod": 165,
	"/Lotus/Upgrades/Mods/Randomized/LotusModularMeleeRandomModRare:WeaponMeleeComboEfficiencyMod": 166,
	"/Lotus/Upgrades/Mods/Randomized/LotusModularMeleeRandomModRare:WeaponMeleeComboInitialBonusMod": 167,
	"/Lotus/Upgrades/Mods/Randomized/LotusModularMeleeRandomModRare:WeaponMeleeComboPointsOnHitMod": 168,
	"/Lotus/Upgrades/Mods/Randomized/LotusModularMeleeRandomModRare:WeaponMeleeComboBonusOnHitMod": 169
}