<?xml version="1.0" encoding="UTF-8" standalone="no"?>
<!-- Created with Inkscape (http://www.inkscape.org/) -->

<svg
   width="72.130417mm"
   height="89.110023mm"
   viewBox="0 0 72.130417 89.110023"
   version="1.1"
   id="svg867"
   inkscape:version="1.1.2 (0a00cf5339, 2022-02-04)"
   sodipodi:docname="drawing.svg"
   xmlns:inkscape="http://www.inkscape.org/namespaces/inkscape"
   xmlns:sodipodi="http://sodipodi.sourceforge.net/DTD/sodipodi-0.dtd"
   xmlns="http://www.w3.org/2000/svg"
   xmlns:svg="http://www.w3.org/2000/svg">
  <sodipodi:namedview
     id="namedview869"
     pagecolor="#505050"
     bordercolor="#eeeeee"
     borderopacity="1"
     inkscape:pageshadow="0"
     inkscape:pageopacity="0"
     inkscape:pagecheckerboard="0"
     inkscape:document-units="mm"
     showgrid="false"
     inkscape:zoom="1.622695"
     inkscape:cx="181.18008"
     inkscape:cy="239.72466"
     inkscape:window-width="1920"
     inkscape:window-height="1051"
     inkscape:window-x="0"
     inkscape:window-y="0"
     inkscape:window-maximized="1"
     inkscape:current-layer="layer1" />
  <defs
     id="defs864" />
  <g
     inkscape:label="Layer 1"
     inkscape:groupmode="layer"
     id="layer1"
     transform="translate(77.110239,46.39973)">
    <g
       id="g25206"
       transform="translate(-49.523916,-291.00229)">
      <path
         id="rect53646-7"
         style="fill:#ffffff;stroke:#000000;stroke-width:1.20256;stroke-linecap:round;stroke-linejoin:bevel"
         d="m -24.214015,245.20384 h 65.385802 c 1.535149,0 2.771027,1.23588 2.771027,2.77103 v 82.3654 c 0,1.53515 -1.235878,2.77103 -2.771027,2.77103 h -65.385802 c -1.535149,0 -2.771028,-1.23588 -2.771028,-2.77103 v -82.3654 c 0,-1.53515 1.235879,-2.77103 2.771028,-2.77103 z" />
      <g
         aria-label="?"
         id="text2232"
         style="font-size:69.4121px;line-height:1.25;font-family:'DejaVu Serif';-inkscape-font-specification:'DejaVu Serif, Normal';stroke-width:1.73531">
        <path
           d="m 1.39533,310.89967 q 0,-1.89799 1.2879199,-3.2198 1.3218125,-1.32182 3.2536923,-1.32182 1.8640945,0 3.185907,1.32182 1.3218128,1.32181 1.3218128,3.2198 0,1.86409 -1.3218128,3.1859 -1.3218125,1.32182 -3.185907,1.32182 -1.9318798,0 -3.2536923,-1.28792 Q 1.39533,312.79765 1.39533,310.89967 Z m -7.4902707,-44.83995 q 3.5926185,-1.59295 6.81241819,-2.37248 3.25369231,-0.77953 6.10067301,-0.77953 7.5241635,0 11.8624195,3.62651 4.372149,3.62651 4.372149,9.79497 0,6.30402 -3.762081,10.30335 -3.72819,3.99933 -11.2862455,5.72786 v 8.60873 H 3.8355992 v -11.11679 q 5.9989952,-1.45738 9.0154388,-4.88053 3.050337,-3.42316 3.050337,-8.71041 0,-4.64329 -2.474162,-7.32081 -2.474162,-2.67751 -6.744633,-2.67751 -3.8637596,0 -6.33792142,2.23691 -2.44026918,2.20302 -3.15201438,6.37181 h -3.2875849 z"
           id="path954" />
      </g>
    </g>
  </g>
</svg>
