<?xml version="1.0" encoding="UTF-8" standalone="no"?>
<!-- Created with Inkscape (http://www.inkscape.org/) -->

<svg
   width="332.84225mm"
   height="409.92368mm"
   viewBox="0 0 332.84225 409.92367"
   version="1.1"
   id="svg51590"
   inkscape:version="1.1.2 (0a00cf5339, 2022-02-04)"
   sodipodi:docname="boss_orange.svg"
   inkscape:export-xdpi="11.1533"
   inkscape:export-ydpi="11.1533"
   xmlns:inkscape="http://www.inkscape.org/namespaces/inkscape"
   xmlns:sodipodi="http://sodipodi.sourceforge.net/DTD/sodipodi-0.dtd"
   xmlns="http://www.w3.org/2000/svg"
   xmlns:svg="http://www.w3.org/2000/svg">
  <sodipodi:namedview
     id="namedview51592"
     pagecolor="#505050"
     bordercolor="#eeeeee"
     borderopacity="1"
     inkscape:pageshadow="0"
     inkscape:pageopacity="0"
     inkscape:pagecheckerboard="0"
     inkscape:document-units="mm"
     showgrid="false"
     inkscape:object-paths="true"
     inkscape:snap-midpoints="true"
     fit-margin-top="0"
     fit-margin-left="0"
     fit-margin-right="0"
     fit-margin-bottom="0"
     inkscape:zoom="0.41"
     inkscape:cx="556.09756"
     inkscape:cy="787.80488"
     inkscape:window-width="1920"
     inkscape:window-height="1051"
     inkscape:window-x="0"
     inkscape:window-y="0"
     inkscape:window-maximized="1"
     inkscape:current-layer="layer1" />
  <defs
     id="defs51587" />
  <g
     inkscape:label="Layer 1"
     inkscape:groupmode="layer"
     id="layer1"
     transform="translate(79.866961,-14.528186)">
    <rect
       style="fill:#ffffff;stroke:#000000;stroke-width:3.92368;stroke-linecap:round;stroke-linejoin:bevel;stroke-miterlimit:4;stroke-dasharray:none"
       id="rect53646"
       width="328.91858"
       height="406"
       x="-77.905121"
       y="16.490026"
       ry="6.361248"
       inkscape:export-xdpi="11.153296"
       inkscape:export-ydpi="11.153296" />
    <text
       xml:space="preserve"
       style="font-style:normal;font-weight:normal;font-size:91.1235px;line-height:1.25;font-family:sans-serif;fill:#ff5500;fill-opacity:1;stroke:none;stroke-width:2.2781"
       x="-45.688976"
       y="111.6258"
       id="text3693"><tspan
         sodipodi:role="line"
         style="fill:#ff5500;fill-opacity:1;stroke-width:2.2781"
         x="-45.688976"
         y="111.6258"
         id="tspan1884">BOSS</tspan></text>
  </g>
</svg>
