<?xml version="1.0" encoding="UTF-8" standalone="no"?>
<!-- Created with Inkscape (http://www.inkscape.org/) -->

<svg
   width="332.84225mm"
   height="205.7265mm"
   viewBox="0 0 332.84225 205.7265"
   version="1.1"
   id="svg51590"
   inkscape:version="1.1 (c68e22c387, 2021-05-23)"
   sodipodi:docname="vault1_blue_2.svg"
   inkscape:export-xdpi="11.111839"
   inkscape:export-ydpi="11.111839"
   xmlns:inkscape="http://www.inkscape.org/namespaces/inkscape"
   xmlns:sodipodi="http://sodipodi.sourceforge.net/DTD/sodipodi-0.dtd"
   xmlns="http://www.w3.org/2000/svg"
   xmlns:svg="http://www.w3.org/2000/svg">
  <sodipodi:namedview
     id="namedview51592"
     pagecolor="#505050"
     bordercolor="#eeeeee"
     borderopacity="1"
     inkscape:pageshadow="0"
     inkscape:pageopacity="0"
     inkscape:pagecheckerboard="0"
     inkscape:document-units="mm"
     showgrid="false"
     inkscape:object-paths="true"
     inkscape:snap-midpoints="false"
     fit-margin-top="0"
     fit-margin-left="0"
     fit-margin-right="0"
     fit-margin-bottom="0"
     inkscape:zoom="0.70710678"
     inkscape:cx="611.64736"
     inkscape:cy="337.28993"
     inkscape:window-width="1920"
     inkscape:window-height="1017"
     inkscape:window-x="-8"
     inkscape:window-y="-8"
     inkscape:window-maximized="1"
     inkscape:current-layer="layer1"
     inkscape:snap-bbox="true"
     inkscape:snap-bbox-midpoints="true"
     showguides="true"
     inkscape:guide-bbox="true"
     inkscape:snap-bbox-edge-midpoints="true"
     inkscape:bbox-nodes="true"
     inkscape:bbox-paths="true" />
  <defs
     id="defs51587" />
  <g
     inkscape:label="Layer 1"
     inkscape:groupmode="layer"
     id="layer1"
     transform="translate(79.866961,-14.528186)">
    <rect
       style="fill:#ffffff;stroke:#000000;stroke-width:3.92368;stroke-linecap:round;stroke-linejoin:bevel;stroke-miterlimit:4;stroke-dasharray:none"
       id="rect53646"
       width="328.91858"
       height="201.80283"
       x="-251.01346"
       y="16.490026"
       ry="6.361248"
       inkscape:export-xdpi="96"
       inkscape:export-ydpi="96"
       transform="scale(-1,1)" />
    <g
       id="g3663"
       transform="translate(2.0975436e-7,30.469945)">
      <g
         id="g51086"
         transform="matrix(0.26458333,0,0,0.26458333,-60.749995,54.37801)">
        <path
           style="fill:#0081b3;fill-opacity:1"
           d="m 296.8,230.324 c -3.651,0 -7.116,-1.647 -9.441,-4.49 L 175.529,89.171 c -3.427,-4.188 -3.745,-10.144 -0.783,-14.679 l 39.911,-61.1 c 2.264,-3.467 6.108,-5.555 10.221,-5.555 h 143.841 c 4.115,0 7.956,2.088 10.224,5.555 l 39.907,61.1 c 2.963,4.535 2.646,10.491 -0.782,14.679 L 306.239,225.833 c -2.326,2.844 -5.787,4.491 -9.439,4.491 z"
           id="path132" />
        <g
           id="g140"
           style="fill:#00a9ff;fill-opacity:1">
          <path
             style="fill:#00a9ff;fill-opacity:1"
             d="m 219.317,9.202 c -1.856,0.956 -3.474,2.376 -4.657,4.188 l -39.913,61.101 c -1.51,2.313 -2.164,4.998 -1.99,7.63 h 75.449 l 9.372,-14.347 z"
             id="path134" />
          <path
             style="fill:#00a9ff;fill-opacity:1"
             d="M 418.851,74.493 378.939,13.392 c -1.183,-1.812 -2.799,-3.233 -4.658,-4.188 l -38.261,58.57 9.373,14.349 h 75.45 c 0.174,-2.633 -0.477,-5.318 -1.992,-7.63 z"
             id="path136" />
          <polygon
             style="fill:#00a9ff;fill-opacity:1"
             points="248.507,82.123 296.8,230.35 345.394,82.123 "
             id="polygon138" />
        </g>
        <polygon
           style="fill:#00cced;fill-opacity:1"
           points="296.729,7.837 248.206,82.123 345.394,82.123 296.869,7.837 "
           id="polygon142" />
        <path
           style="opacity:0.1;enable-background:new"
           d="M 279.027,175.799 208.14,89.171 c -3.427,-4.188 -3.745,-10.144 -0.783,-14.679 l 39.911,-61.1 c 2.264,-3.467 6.108,-5.555 10.221,-5.555 h -32.61 c -4.113,0 -7.957,2.088 -10.221,5.555 l -39.911,61.1 c -2.962,4.535 -2.645,10.491 0.783,14.679 l 111.829,136.662 c 2.324,2.842 5.785,4.487 9.432,4.49 z"
           id="path144" />
        <path
           d="m 281.292,230.794 c 3.829,4.681 9.48,7.367 15.507,7.367 6.026,0 11.678,-2.684 15.505,-7.364 l 63.384,-77.457 c 2.742,-3.35 2.248,-8.287 -1.102,-11.028 -3.348,-2.741 -8.287,-2.247 -11.028,1.102 l -50.07,61.189 37.584,-114.643 h 56.227 l -27.494,33.601 c -2.742,3.35 -2.248,8.287 1.102,11.028 3.349,2.742 8.287,2.249 11.028,-1.102 l 32.201,-39.351 c 5.625,-6.873 6.139,-16.49 1.278,-23.927 L 385.504,9.101 C 381.774,3.402 375.5,0 368.72,0 H 224.879 c -6.786,0 -13.059,3.404 -16.782,9.106 l -39.911,61.1 c -4.86,7.439 -4.346,17.055 1.279,23.927 z M 186.301,89.959 h 56.516 l 37.39,114.76 z m 188.943,-67.901 34.113,52.228 h -59.721 l -4.254,-6.512 z m -14.55,-6.385 -24.673,37.771 -24.672,-37.771 z m -29.781,58.613 h -16.4 c -4.328,0 -7.837,3.509 -7.837,7.837 0,4.328 3.509,7.837 7.837,7.837 h 20.063 L 296.822,205.123 259.301,89.959 h 27 c 4.328,0 7.837,-3.509 7.837,-7.837 0,-4.328 -3.509,-7.837 -7.837,-7.837 H 262.684 L 296.798,22.059 Z M 282.249,15.673 257.577,53.444 232.905,15.673 Z m -63.893,6.388 29.861,45.713 -4.253,6.511 h -59.721 z"
           id="path148" />
      </g>
      <g
         id="g51086-36"
         transform="matrix(0.26458333,0,0,0.26458333,76.801445,56.451549)">
        <path
           style="fill:#0081b3;fill-opacity:1"
           d="m 296.8,230.324 c -3.651,0 -7.116,-1.647 -9.441,-4.49 L 175.529,89.171 c -3.427,-4.188 -3.745,-10.144 -0.783,-14.679 l 39.911,-61.1 c 2.264,-3.467 6.108,-5.555 10.221,-5.555 h 143.841 c 4.115,0 7.956,2.088 10.224,5.555 l 39.907,61.1 c 2.963,4.535 2.646,10.491 -0.782,14.679 L 306.239,225.833 c -2.326,2.844 -5.787,4.491 -9.439,4.491 z"
           id="path132-14" />
        <g
           id="g140-29"
           style="fill:#00a9ff;fill-opacity:1">
          <path
             style="fill:#00a9ff;fill-opacity:1"
             d="m 219.317,9.202 c -1.856,0.956 -3.474,2.376 -4.657,4.188 l -39.913,61.101 c -1.51,2.313 -2.164,4.998 -1.99,7.63 h 75.449 l 9.372,-14.347 z"
             id="path134-5" />
          <path
             style="fill:#00a9ff;fill-opacity:1"
             d="M 418.851,74.493 378.939,13.392 c -1.183,-1.812 -2.799,-3.233 -4.658,-4.188 l -38.261,58.57 9.373,14.349 h 75.45 c 0.174,-2.633 -0.477,-5.318 -1.992,-7.63 z"
             id="path136-3" />
          <polygon
             style="fill:#00a9ff;fill-opacity:1"
             points="296.8,230.35 345.394,82.123 248.507,82.123 "
             id="polygon138-36" />
        </g>
        <polygon
           style="fill:#00cced;fill-opacity:1"
           points="345.394,82.123 296.869,7.837 296.729,7.837 248.206,82.123 "
           id="polygon142-07" />
        <path
           style="opacity:0.1;enable-background:new"
           d="M 279.027,175.799 208.14,89.171 c -3.427,-4.188 -3.745,-10.144 -0.783,-14.679 l 39.911,-61.1 c 2.264,-3.467 6.108,-5.555 10.221,-5.555 h -32.61 c -4.113,0 -7.957,2.088 -10.221,5.555 l -39.911,61.1 c -2.962,4.535 -2.645,10.491 0.783,14.679 l 111.829,136.662 c 2.324,2.842 5.785,4.487 9.432,4.49 z"
           id="path144-5" />
        <path
           d="m 281.292,230.794 c 3.829,4.681 9.48,7.367 15.507,7.367 6.026,0 11.678,-2.684 15.505,-7.364 l 63.384,-77.457 c 2.742,-3.35 2.248,-8.287 -1.102,-11.028 -3.348,-2.741 -8.287,-2.247 -11.028,1.102 l -50.07,61.189 37.584,-114.643 h 56.227 l -27.494,33.601 c -2.742,3.35 -2.248,8.287 1.102,11.028 3.349,2.742 8.287,2.249 11.028,-1.102 l 32.201,-39.351 c 5.625,-6.873 6.139,-16.49 1.278,-23.927 L 385.504,9.101 C 381.774,3.402 375.5,0 368.72,0 H 224.879 c -6.786,0 -13.059,3.404 -16.782,9.106 l -39.911,61.1 c -4.86,7.439 -4.346,17.055 1.279,23.927 z M 186.301,89.959 h 56.516 l 37.39,114.76 z m 188.943,-67.901 34.113,52.228 h -59.721 l -4.254,-6.512 z m -14.55,-6.385 -24.673,37.771 -24.672,-37.771 z m -29.781,58.613 h -16.4 c -4.328,0 -7.837,3.509 -7.837,7.837 0,4.328 3.509,7.837 7.837,7.837 h 20.063 L 296.822,205.123 259.301,89.959 h 27 c 4.328,0 7.837,-3.509 7.837,-7.837 0,-4.328 -3.509,-7.837 -7.837,-7.837 H 262.684 L 296.798,22.059 Z M 282.249,15.673 257.577,53.444 232.905,15.673 Z m -63.893,6.388 29.861,45.713 -4.253,6.511 h -59.721 z"
           id="path148-89" />
      </g>
    </g>
  </g>
</svg>
