<?xml version="1.0" encoding="UTF-8" standalone="no"?>
<!-- Created with Inkscape (http://www.inkscape.org/) -->

<svg
   width="332.84225mm"
   height="205.7265mm"
   viewBox="0 0 332.84225 205.7265"
   version="1.1"
   id="svg51590"
   sodipodi:docname="vault1_green_2.svg"
   inkscape:version="1.1 (c68e22c387, 2021-05-23)"
   xmlns:inkscape="http://www.inkscape.org/namespaces/inkscape"
   xmlns:sodipodi="http://sodipodi.sourceforge.net/DTD/sodipodi-0.dtd"
   xmlns="http://www.w3.org/2000/svg"
   xmlns:svg="http://www.w3.org/2000/svg">
  <sodipodi:namedview
     id="namedview51592"
     pagecolor="#505050"
     bordercolor="#eeeeee"
     borderopacity="1"
     inkscape:pageshadow="0"
     inkscape:pageopacity="0"
     inkscape:pagecheckerboard="0"
     inkscape:document-units="mm"
     showgrid="false"
     inkscape:object-paths="true"
     inkscape:snap-midpoints="true"
     fit-margin-top="0"
     fit-margin-left="0"
     fit-margin-right="0"
     fit-margin-bottom="0"
     inkscape:zoom="0.52410025"
     inkscape:cx="544.74311"
     inkscape:cy="313.87125"
     inkscape:window-width="1920"
     inkscape:window-height="1017"
     inkscape:window-x="-8"
     inkscape:window-y="-8"
     inkscape:window-maximized="1"
     inkscape:current-layer="layer1"
     inkscape:snap-bbox="true"
     inkscape:snap-bbox-midpoints="true" />
  <defs
     id="defs51587" />
  <g
     inkscape:label="Layer 1"
     inkscape:groupmode="layer"
     id="layer1"
     transform="translate(79.866961,-14.528186)">
    <rect
       style="fill:#ffffff;stroke:#000000;stroke-width:3.92368;stroke-linecap:round;stroke-linejoin:bevel;stroke-miterlimit:4;stroke-dasharray:none"
       id="rect53646"
       width="328.91858"
       height="201.80283"
       x="-77.905121"
       y="16.490026"
       ry="6.361248"
       inkscape:export-xdpi="11.141615"
       inkscape:export-ydpi="11.141615" />
    <g
       id="g55117"
       transform="translate(-13.80676,1.5143676)">
      <g
         id="g51117-3"
         transform="matrix(0.26458333,0,0,0.26458333,55.380837,66.165304)"
         inkscape:export-xdpi="12.563029"
         inkscape:export-ydpi="12.563029">
        <path
           style="fill:#e5ae36"
           d="m 119.73,504.163 c -3.201,0 -6.399,-1.158 -8.904,-3.473 L 23.294,419.752 c -2.625,-2.425 -4.111,-5.814 -4.111,-9.36 V 233.49 c 0,-3.581 1.517,-7 4.187,-9.43 l 87.532,-79.656 c 2.493,-2.27 5.659,-3.402 8.827,-3.402 3.167,0 6.333,1.134 8.824,3.402 l 87.532,79.656 c 2.668,2.43 4.19,5.849 4.19,9.43 v 176.902 c 0,3.547 -1.49,6.936 -4.115,9.36 l -87.53,80.938 c -2.502,2.315 -5.702,3.473 -8.9,3.473 z"
           id="path110-0" />
        <polygon
           style="fill:#009300;fill-opacity:1"
           points="19.183,410.392 71.237,393.535 71.237,250.166 19.183,233.49 "
           id="polygon112-8" />
        <g
           id="g118-2"
           style="fill:#008900;fill-opacity:1">
          <path
             style="fill:#008900;fill-opacity:1"
             d="m 168.22,393.716 -48.49,44.839 v 65.608 c 3.198,0 6.398,-1.158 8.9,-3.473 l 87.532,-80.938 c 2.625,-2.425 4.115,-5.814 4.115,-9.36 z"
             id="path114-4" />
          <path
             style="fill:#008900;fill-opacity:1"
             d="m 119.73,141.001 c -3.168,0 -6.335,1.134 -8.827,3.402 l -87.532,79.656 c -2.67,2.43 -4.187,5.849 -4.187,9.43 l 52.054,16.858 48.493,-44.129 v -65.217 z"
             id="path116-5" />
        </g>
        <g
           id="g124-7"
           style="fill:#006600;fill-opacity:1">
          <path
             style="fill:#006600;fill-opacity:1"
             d="m 216.088,224.06 -87.532,-79.656 c -2.492,-2.27 -5.657,-3.402 -8.824,-3.402 v 65.218 l 48.49,44.129 52.057,-16.858 c -0.001,-3.582 -1.525,-7.001 -4.191,-9.431 z"
             id="path120-0" />
          <path
             style="fill:#006600;fill-opacity:1"
             d="m 19.183,410.392 c 0,3.547 1.487,6.936 4.111,9.36 l 87.532,80.938 c 2.504,2.314 5.704,3.473 8.904,3.473 V 438.555 L 71.237,393.716 Z"
             id="path122-3" />
        </g>
        <polygon
           style="fill:#004e00;fill-opacity:1"
           points="71.237,393.716 71.237,250.348 119.73,206.219 168.22,250.348 168.22,393.716 119.73,438.555 "
           id="polygon126-6" />
        <path
           style="opacity:0.1;enable-background:new"
           d="m 55.882,419.752 c -2.625,-2.425 -4.112,-5.814 -4.112,-9.36 V 233.49 c 0,-3.581 1.517,-7 4.187,-9.43 l 63.772,-58.035 v -25.024 c -3.168,0 -6.335,1.134 -8.827,3.402 L 23.37,224.059 c -2.67,2.43 -4.187,5.849 -4.187,9.43 v 176.902 c 0,3.547 1.487,6.936 4.111,9.36 l 87.532,80.938 c 2.504,2.314 5.702,3.473 8.904,3.473 v -25.373 z"
           id="path128-2" />
        <polygon
           style="fill:#009300;fill-opacity:1"
           points="168.22,250.348 168.22,393.716 220.278,410.392 220.278,233.49 "
           id="polygon130-0" />
        <path
           d="m 133.831,138.61 c -3.856,-3.512 -8.863,-5.445 -14.101,-5.445 -5.238,0 -10.246,1.934 -14.102,5.444 l -87.533,79.657 c -4.288,3.904 -6.748,9.453 -6.748,15.225 v 176.902 c 0,5.714 2.417,11.223 6.628,15.114 l 87.533,80.938 c 3.874,3.582 8.927,5.555 14.222,5.555 5.298,0 10.349,-1.974 14.22,-5.556 l 87.531,-80.936 c 4.215,-3.894 6.633,-9.404 6.633,-15.117 v -83.339 c 0,-4.328 -3.509,-7.837 -7.837,-7.837 -4.328,0 -7.837,3.509 -7.837,7.837 v 72.6 l -36.383,-11.655 v -131.95 l 36.383,-11.782 v 53.53 c 0,4.328 3.509,7.837 7.837,7.837 4.328,0 7.837,-3.509 7.837,-7.837 V 233.49 c 0,-5.767 -2.46,-11.316 -6.752,-15.226 z m -21.938,15.487 v 48.658 L 69.326,241.491 29.892,228.72 Z M 27.02,244.266 63.4,256.048 v 131.95 l -36.38,11.654 c 0,0 0,-155.386 0,-155.386 z M 111.893,491.003 29.9,415.188 69.274,402.575 111.893,441.982 Z M 209.557,415.187 127.567,491 v -49.018 l 42.616,-39.407 z M 170.132,241.492 158.871,231.244 c -3.199,-2.912 -8.156,-2.679 -11.071,0.521 -2.913,3.201 -2.679,8.158 0.521,11.071 l 12.062,10.977 V 390.29 L 119.73,427.882 79.074,390.29 V 253.813 l 40.656,-36.998 8.746,7.958 c 3.201,2.912 8.158,2.679 11.071,-0.521 2.913,-3.202 2.679,-8.158 -0.521,-11.071 l -11.457,-10.427 v -48.655 l 81.999,74.62 z"
           id="path150-0" />
      </g>
      <g
         id="g51117-4"
         transform="matrix(0.26458333,0,0,0.26458333,81.983632,-5.1110644)"
         inkscape:export-xdpi="12.563029"
         inkscape:export-ydpi="12.563029">
        <path
           style="fill:#e5ae36"
           d="m 119.73,504.163 c -3.201,0 -6.399,-1.158 -8.904,-3.473 L 23.294,419.752 c -2.625,-2.425 -4.111,-5.814 -4.111,-9.36 V 233.49 c 0,-3.581 1.517,-7 4.187,-9.43 l 87.532,-79.656 c 2.493,-2.27 5.659,-3.402 8.827,-3.402 3.167,0 6.333,1.134 8.824,3.402 l 87.532,79.656 c 2.668,2.43 4.19,5.849 4.19,9.43 v 176.902 c 0,3.547 -1.49,6.936 -4.115,9.36 l -87.53,80.938 c -2.502,2.315 -5.702,3.473 -8.9,3.473 z"
           id="path110-2" />
        <polygon
           style="fill:#009300;fill-opacity:1"
           points="71.237,393.535 71.237,250.166 19.183,233.49 19.183,410.392 "
           id="polygon112-6" />
        <g
           id="g118-3"
           style="fill:#008900;fill-opacity:1">
          <path
             style="fill:#008900;fill-opacity:1"
             d="m 168.22,393.716 -48.49,44.839 v 65.608 c 3.198,0 6.398,-1.158 8.9,-3.473 l 87.532,-80.938 c 2.625,-2.425 4.115,-5.814 4.115,-9.36 z"
             id="path114-6" />
          <path
             style="fill:#008900;fill-opacity:1"
             d="m 119.73,141.001 c -3.168,0 -6.335,1.134 -8.827,3.402 l -87.532,79.656 c -2.67,2.43 -4.187,5.849 -4.187,9.43 l 52.054,16.858 48.493,-44.129 v -65.217 z"
             id="path116-7" />
        </g>
        <g
           id="g124-8"
           style="fill:#006600;fill-opacity:1">
          <path
             style="fill:#006600;fill-opacity:1"
             d="m 216.088,224.06 -87.532,-79.656 c -2.492,-2.27 -5.657,-3.402 -8.824,-3.402 v 65.218 l 48.49,44.129 52.057,-16.858 c -0.001,-3.582 -1.525,-7.001 -4.191,-9.431 z"
             id="path120-8" />
          <path
             style="fill:#006600;fill-opacity:1"
             d="m 19.183,410.392 c 0,3.547 1.487,6.936 4.111,9.36 l 87.532,80.938 c 2.504,2.314 5.704,3.473 8.904,3.473 V 438.555 L 71.237,393.716 Z"
             id="path122-67" />
        </g>
        <polygon
           style="fill:#004e00;fill-opacity:1"
           points="119.73,438.555 71.237,393.716 71.237,250.348 119.73,206.219 168.22,250.348 168.22,393.716 "
           id="polygon126-3" />
        <path
           style="opacity:0.1;enable-background:new"
           d="m 55.882,419.752 c -2.625,-2.425 -4.112,-5.814 -4.112,-9.36 V 233.49 c 0,-3.581 1.517,-7 4.187,-9.43 l 63.772,-58.035 v -25.024 c -3.168,0 -6.335,1.134 -8.827,3.402 L 23.37,224.059 c -2.67,2.43 -4.187,5.849 -4.187,9.43 v 176.902 c 0,3.547 1.487,6.936 4.111,9.36 l 87.532,80.938 c 2.504,2.314 5.702,3.473 8.904,3.473 v -25.373 z"
           id="path128-4" />
        <polygon
           style="fill:#009300;fill-opacity:1"
           points="168.22,393.716 220.278,410.392 220.278,233.49 168.22,250.348 "
           id="polygon130-09" />
        <path
           d="m 133.831,138.61 c -3.856,-3.512 -8.863,-5.445 -14.101,-5.445 -5.238,0 -10.246,1.934 -14.102,5.444 l -87.533,79.657 c -4.288,3.904 -6.748,9.453 -6.748,15.225 v 176.902 c 0,5.714 2.417,11.223 6.628,15.114 l 87.533,80.938 c 3.874,3.582 8.927,5.555 14.222,5.555 5.298,0 10.349,-1.974 14.22,-5.556 l 87.531,-80.936 c 4.215,-3.894 6.633,-9.404 6.633,-15.117 v -83.339 c 0,-4.328 -3.509,-7.837 -7.837,-7.837 -4.328,0 -7.837,3.509 -7.837,7.837 v 72.6 l -36.383,-11.655 v -131.95 l 36.383,-11.782 v 53.53 c 0,4.328 3.509,7.837 7.837,7.837 4.328,0 7.837,-3.509 7.837,-7.837 V 233.49 c 0,-5.767 -2.46,-11.316 -6.752,-15.226 z m -21.938,15.487 v 48.658 L 69.326,241.491 29.892,228.72 Z M 27.02,244.266 63.4,256.048 v 131.95 l -36.38,11.654 c 0,0 0,-155.386 0,-155.386 z M 111.893,491.003 29.9,415.188 69.274,402.575 111.893,441.982 Z M 209.557,415.187 127.567,491 v -49.018 l 42.616,-39.407 z M 170.132,241.492 158.871,231.244 c -3.199,-2.912 -8.156,-2.679 -11.071,0.521 -2.913,3.201 -2.679,8.158 0.521,11.071 l 12.062,10.977 V 390.29 L 119.73,427.882 79.074,390.29 V 253.813 l 40.656,-36.998 8.746,7.958 c 3.201,2.912 8.158,2.679 11.071,-0.521 2.913,-3.202 2.679,-8.158 -0.521,-11.071 l -11.457,-10.427 v -48.655 l 81.999,74.62 z"
           id="path150-05" />
      </g>
    </g>
  </g>
</svg>
