{
  "extends": [
    "config:recommended",
    ":semanticCommitTypeAll(chore)",
    "regexManagers:dockerfileVersions",
    "regexManagers:gitlabPipelineVersions"
  ],
  "labels": [
    "dependencies"
  ],
  "assigneesFromCodeOwners": true,
  "rebaseWhen": "auto",
  "automerge": true,
  "platformAutomerge": true,
  "dependencyDashboard": true,
  "dependencyDashboardApproval": false,
  "dependencyDashboardAutoclose": true,
  "prHourlyLimit": 0,
  "prConcurrentLimit": 0,
  "branchConcurrentLimit": 0,
  "semanticCommits": "enabled",
  "skipInstalls": true,
  "major": {
    "commitBody": "Major dependency update"
  },
  "commitMessageExtra": "from {{{displayFrom}}} to {{{displayTo}}}",
  "packageRules": [
    {
      "description": "Trigger manual intervention for major updates",
      "automerge": false,
      "dependencyDashboardApproval": true,
      "matchUpdateTypes": [
        "major"
      ]
    },
    {
      "description": "Automatic PR and Merge if success",
      "automerge": true,
      "dependencyDashboardApproval": false,
      "matchUpdateTypes": [
        "minor",
        "patch",
        "pin",
        "digest"
      ]
    }
  ]
}
