Objeto do Contrato,Tipo de Procedimento,Tipo(s) de Contrato,CPVs,Entidade(s) Adjudicante(s),Entidade(s) Adjudicatária(s),Preço Contratual,Data de Publicação,Data de Celebração do Contrato,Prazo de Execução,Local de Execução,Fundamentação,Data de Fecho do Contrato,Preço Total Efetivo,Causas das Alterações ao Prazo,Causas das Alterações ao Preço,Estado,N.º registo do Acordo Quadro,Descrição do Acordo Quadro,Procedimento Centralizado
Prestação de Serviços Médicos de Urgência Geral,Ajuste Direto Regime Geral,Aquisição de serviços,"85121100-4, Serviços de médicos de clínica geral","Centro Hospitalar Universitário do Algarve, E. P. E. (510745997)","Ernesto Olmedo, Unipessoal, Lda (513913416)","2.112,00 €",21-06-2018,14-06-2018,16 dias,"Portugal, Faro, Faro","Artigo 24.º, n.º 1, alínea e), subalínea ii) do Código dos Contratos Públicos",14-06-2018,"2.112,00 €",,,,Não aplicável.,Não aplicável.,FALSE
87-2010-2018 - Aquisição de Mobiliário Diverso,Consulta Prévia,Aquisição de bens móveis,"39100000-3, Mobiliário","Centro Hospitalar Universitário do Algarve, E. P. E. (510745997)",Vitor manuel Maçarico Ferreira dos Santos  (121639363),"22.804,50 €",21-06-2018,22-05-2018,223 dias,"Portugal, Faro, Lagos<BR/>Portugal, Faro, Portimão<BR/>Portugal, Faro, Faro","Artigo 20.º, n.º 1, alínea c) do Código dos Contratos Públicos","","",,,,Não aplicável.,Não aplicável.,FALSE
UpGrade TAC SOMATOM - Imagiologia Portimão,Ajuste Direto Regime Geral,Aquisição de bens móveis,"33115200-1, Scanners de tomografia axial computorizada","Centro Hospitalar Universitário do Algarve, E. P. E. (510745997)","SIEMENS  HEALTHCARE , LDA (507925173)","176.000,00 €",21-06-2018,05-06-2018,180 dias,"Portugal, Faro, Portimão","Artigo 24.º, n.º 1, alínea e), subalínea ii) do Código dos Contratos Públicos","","",,,,Não aplicável.,Não aplicável.,FALSE
Base de Dados Online p/Profissionais de Saúde,Consulta Prévia,Aquisição de serviços,"72320000-4, Serviços relacionados com bases de dados","Centro Hospitalar Universitário do Algarve, E. P. E. (510745997)",EBSCO - Information Services BV (B85765766),"15.000,00 €",20-06-2018,06-06-2018,180 dias,"Portugal, Faro, Lagos<BR/>Portugal, Faro, Faro<BR/>Portugal, Faro, Portimão","Artigo 20.º, n.º 1, alínea c) do Código dos Contratos Públicos","","",,,,Não aplicável.,Não aplicável.,FALSE
a video conferência ( 87/1667/18),Consulta Prévia,Aquisição de bens móveis,"32323300-6, Equipamento para vídeo","Centro Hospitalar Universitário do Algarve, E. P. E. (510745997)","CLEVERMASTER-SOC. EQUIP. AUDIOVI. MULTIMÉDIA, LDA (513997059)","7.080,00 €",18-06-2018,14-06-2018,8 dias,"Portugal, Faro, Faro<BR/>Portugal, Faro, Portimão","Artigo 20.º, n.º 1, alínea c) do Código dos Contratos Públicos","","",,,,Não aplicável.,Não aplicável.,FALSE
Aquisição de Monitores,Concurso público,Aquisição de bens móveis,"33100000-1, Equipamento médico","Centro Hospitalar Universitário do Algarve, E.P.E. (510745997)","CLINIFAR - PROD. CLINICOS E FARMACEUTICOS, S.A. (503281115), IBERDATA - Equipamentos, SA (501904921)","112.900,00 €",18-06-2018,25-05-2018,274 dias,"Portugal, Faro, Portimão<BR/>Portugal, Faro, Lagos<BR/>Portugal, Faro, Faro","Artigo 20.º, n.º 1, alínea b) do Código dos Contratos Públicos","","",,,,Não aplicável.,Não aplicável.,FALSE
Aquisição de Equipamentos para Pneumologia,Concurso público,Aquisição de bens móveis,"33100000-1, Equipamento médico","Centro Hospitalar Universitário do Algarve, E.P.E. (510745997)","SISTEMAS INTEGRALES DE LA MEDICINA , S.A. - SUCURSAL EM PORTUGAL (980488842)","89.900,00 €",15-06-2018,11-06-2018,213 dias,"Portugal, Faro, Faro<BR/>Portugal, Faro, Portimão","Artigo 20.º, n.º 1, alínea b) do Código dos Contratos Públicos","","",,,,Não aplicável.,Não aplicável.,FALSE
Prestação de Serviços Médicos de Dermatologia,Ajuste Direto Regime Geral,Aquisição de serviços,"85121282-3, Serviços de dermatologia","Centro Hospitalar Universitário do Algarve, E. P. E. (510745997)","POLICLINICA DA MO, LDA (507433858)","27.343,68 €",15-06-2018,28-03-2018,360 dias,"Portugal, Faro, Portimão","Artigo 24.º, n.º 1, alínea e), subalínea ii) do Código dos Contratos Públicos","","",,,,Não aplicável.,Não aplicável.,FALSE
"Fornecimento de 58 Equipamentos de ar condicionado do tipo """"SPLIT"""" ",Concurso público,Aquisição de bens móveis,"39717200-3, Aparelhos de ar condicionado","Centro Hospitalar Universitário do Algarve, E.P.E. (510745997)","Cisec - Soluções Técnicas de Engenharia e Serviços, S.A. (500205698)","45.614,78 €",15-06-2018,05-06-2018,243 dias,"Portugal, Faro, Vila Real Sto Antonio<BR/>Portugal, Faro, Loulé<BR/>Portugal, Faro, Albufeira<BR/>Portugal, Faro, Lagos<BR/>Portugal, Faro, Portimão<BR/>Portugal, Faro, Faro","Artigo 20.º, n.º 1, alínea b) do Código dos Contratos Públicos","","",,,,Não aplicável.,Não aplicável.,FALSE
Fornecimento de Gás Propono,Concurso público,Aquisição de serviços,"50000000-5, Serviços de reparação e manutenção","Centro Hospitalar Universitário do Algarve, E. P. E. (510745997)","Rubis Energia Portugal, S.A. (513108890)","46.634,44 €",15-06-2018,29-05-2018,213 dias,"Portugal, Faro, São Brás de Alportel<BR/>Portugal, Faro, Faro","Artigo 20.º, n.º 1, alínea b) do Código dos Contratos Públicos","","",,,,Não aplicável.,Não aplicável.,FALSE
Prest. Serviços médicos de Urgência Geral,Ajuste Direto Regime Geral,Aquisição de serviços,"85121100-4, Serviços de médicos de clínica geral","Centro Hospitalar Universitário do Algarve, E. P. E. (510745997)","Alejandro Martin Peres, Unipessoal, Lda (513913874)","46.800,00 €",15-06-2018,11-06-2018,270 dias,"Portugal, Faro, Faro<BR/>Portugal, Faro, Portimão","Artigo 24.º, n.º 1, alínea e), subalínea ii) do Código dos Contratos Públicos","","",,,,Não aplicável.,Não aplicável.,FALSE
62/2472/2018 - Aquisição Fixador  Externo (Modulo Punho) p/dia 06-06-2018,Ajuste Direto Regime Geral,Aquisição de bens móveis,"33183200-8, Próteses ortopédicas","Centro Hospitalar Universitário do Algarve, E. P. E. (510745997)","JOHNSON & JOHNSON, LDA (500153370)","3.148,96 €",14-06-2018,05-06-2018,3 dias,"Portugal, Faro, Faro<BR/>Portugal, Faro, Portimão","Artigo 24.º, n.º 1, alínea e), subalínea ii) do Código dos Contratos Públicos","","",,,,Não aplicável.,Não aplicável.,FALSE
Proc. 67/2092/2018- Reparação perneiras-Bloco Operatorio-Unid.Portimão,Ajuste Direto Regime Geral,Aquisição de serviços,"50422000-9, Serviços de reparação e manutenção de equipamento cirúrgico","Centro Hospitalar Universitário do Algarve, E. P. E. (510745997)","MEDICINALIA-CORMEDICA, LDA (500684324)","1.614,23 €",14-06-2018,20-04-2018,30 dias,"Portugal, Faro, Portimão","Artigo 24.º, n.º 1, alínea e), subalínea ii) do Código dos Contratos Públicos","","",,,,Não aplicável.,Não aplicável.,FALSE
Proc. 68/1985/2018-Treino de utilização clinica de equipamento Lokomat-Unid.CMR Sul,Ajuste Direto Regime Geral,Aquisição de serviços,"80561000-4, Serviços de formação em matéria de saúde","Centro Hospitalar Universitário do Algarve, E. P. E. (510745997)","TEPREL - EQUIPAMENTO MÉDICOS, S.A. (502262184)","2.450,00 €",14-06-2018,17-05-2018,30 dias,"Portugal, Faro, São Brás de Alportel","Artigo 24.º, n.º 1, alínea e), subalínea iii) do Código dos Contratos Públicos","","",,,,Não aplicável.,Não aplicável.,FALSE
Proc. 67/1984/2018- Reparação de Equipamento LOKOMAT - Unid.CMRSul,Ajuste Direto Regime Geral,Aquisição de serviços,"50421000-2, Serviços de reparação e manutenção de equipamento médico","Centro Hospitalar Universitário do Algarve, E. P. E. (510745997)","TEPREL - EQUIPAMENTO MÉDICOS, S.A. (502262184)","20.121,00 €",14-06-2018,17-05-2018,30 dias,"Portugal, Faro, São Brás de Alportel","Artigo 24.º, n.º 1, alínea e), subalínea iii) do Código dos Contratos Públicos","","",,,,Não aplicável.,Não aplicável.,FALSE
Proc. 68/1931/2018- Serviço de Portagens- Fevº a Dezº /2018,Ajuste Direto Regime Geral,Aquisição de serviços,"63712210-8, Serviços de portagem em auto-estradas","Centro Hospitalar Universitário do Algarve, E. P. E. (510745997)","PETRÓLEOS DE PORTUGAL - PETROGAL, SA (500697370)","29.900,00 €",14-06-2018,05-04-2018,334 dias,"Portugal, Faro, Portimão<BR/>Portugal, Faro, Faro","Artigo 24.º, n.º 1, alínea e), subalínea ii) do Código dos Contratos Públicos","","",,,,Não aplicável.,Não aplicável.,FALSE
Aquisição de Cortinas Hospitalares,Concurso público,Aquisição de bens móveis,"39515100-6, Cortinados","Centro Hospitalar Universitário do Algarve, E.P.E. (510745997)","EUGENIO PEREIRA,LDA (503989525)","67.227,00 €",13-06-2018,21-05-2018,274 dias,"Portugal, Faro, Portimão<BR/>Portugal, Faro, Faro<BR/>Portugal, Faro, Lagos","Artigo 20.º, n.º 1, alínea b) do Código dos Contratos Públicos","","",,,,Não aplicável.,Não aplicável.,FALSE
92/1850/18-Aquisição de Máscaras,Ajuste Direto Regime Geral,Aquisição de bens móveis,"33140000-3, Material médico de consumo","Centro Hospitalar Universitário do Algarve, E. P. E. (510745997)","INTERSURGICAL PORTUGAL,LDA. (503480045)","600,00 €",12-06-2018,06-04-2018,271 dias,"Portugal, Faro, Faro","Artigo 24.º, n.º 1, alínea b) do Código dos Contratos Públicos","","",,,,Não aplicável.,Não aplicável.,FALSE
82/2440/2018 - Aquisição Material Cirurgia Ligamentoplastia,Consulta Prévia,Aquisição de bens móveis,"33183100-7, Implantes ortopédicos","Centro Hospitalar Universitário do Algarve, E. P. E. (510745997)","SMITH & NEPHEW - PROD. FARMACEUTICOS, LDA. (503552461)","1.437,00 €",12-06-2018,04-06-2018,3 dias,"Portugal, Faro, Portimão<BR/>Portugal, Faro, Faro","Artigo 20.º, n.º 1, alínea c) do Código dos Contratos Públicos","","",,,,Não aplicável.,Não aplicável.,FALSE
Sistema de lavagem para Próteses,Consulta Prévia,Aquisição de bens móveis,"33183200-8, Próteses ortopédicas","Centro Hospitalar Universitário do Algarve, E. P. E. (510745997)","ORTOIMPLANTE - SOC. DE ORTOPEDIA, LDA. (502654414)","7.600,00 €",12-06-2018,12-06-2018,202 dias,"Portugal, Faro, Portimão<BR/>Portugal, Faro, Faro","Artigo 20.º, n.º 1, alínea c) do Código dos Contratos Públicos","","",,,,Não aplicável.,Não aplicável.,FALSE
61/357/2018 Medicamento Etanercept,Ajuste Direto Regime Geral,Aquisição de bens móveis,"33690000-3, Medicamentos vários","Centro Hospitalar Universitário do Algarve, E. P. E. (510745997)","Pfizer Biofarmacêutica, Sociedade Unipessoal Lda. (513300376)","189.504,00 €",12-06-2018,05-01-2018,60 dias,"Portugal, Faro, Faro","Artigo 24.º, n.º 1, alínea e) do Código dos Contratos Públicos","","",,,,Não aplicável.,Não aplicável.,FALSE
"92/2420/2018 - Aquisição de Material Oftalmologia - """"Mangas e Implantes Oculares""""",Ajuste Direto Regime Geral,Aquisição de bens móveis,"33140000-3, Material médico de consumo","Centro Hospitalar Universitário do Algarve, E. P. E. (510745997)","José Cotta - Equipamentos Médicos e Serviços, S.A. (500155739)","922,50 €",12-06-2018,29-05-2018,210 dias,"Portugal, Faro, Faro<BR/>Portugal, Faro, Portimão","Artigo 24.º, n.º 1, alínea b) do Código dos Contratos Públicos","","",,,,Não aplicável.,Não aplicável.,FALSE
61/4020/2017 Medicamento Octocog alfa 1000,Ajuste Direto Regime Geral,Aquisição de bens móveis,"33690000-3, Medicamentos vários","Centro Hospitalar Universitário do Algarve, E. P. E. (510745997)","Shire Pharmaceuticals Portugal, Lda. (509264662)","81.009,50 €",11-06-2018,31-10-2017,60 dias,"Portugal, Faro, Faro","Artigo 24.º, n.º 1, alínea e) do Código dos Contratos Públicos","","",,,,Não aplicável.,Não aplicável.,FALSE
61/3985/2017 Medicamentos Etanercept,Ajuste Direto Regime Geral,Aquisição de bens móveis,"33690000-3, Medicamentos vários","Centro Hospitalar Universitário do Algarve, E. P. E. (510745997)","Pfizer Biofarmacêutica, Sociedade Unipessoal Lda. (513300376)","197.400,00 €",11-06-2018,25-10-2017,60 dias,"Portugal, Faro, Faro","Artigo 24.º, n.º 1, alínea e) do Código dos Contratos Públicos","","",,,,Não aplicável.,Não aplicável.,FALSE
61/3973/2017 Medicamentos Dolutegravir 50 mg,Ajuste Direto Regime Geral,Aquisição de bens móveis,"33690000-3, Medicamentos vários","Centro Hospitalar Universitário do Algarve, E. P. E. (510745997)","ViiV Healthcare, Unipessoal Lda (509117961)","110.000,25 €",11-06-2018,03-11-2017,60 dias,"Portugal, Faro, Faro","Artigo 24.º, n.º 1, alínea e) do Código dos Contratos Públicos","","",,,,Não aplicável.,Não aplicável.,FALSE
"92/2402/2018 - Aquisição de Material Oftalmologia - """"Implante Retina""""",Ajuste Direto Regime Geral,Aquisição de bens móveis,"33184100-4, Implantes cirúrgicos","Centro Hospitalar Universitário do Algarve, E. P. E. (510745997)","OFTALDATA - PRODUTOS P\ OFTALMOLOGIA, LDA (504887459)","1.174,00 €",11-06-2018,30-05-2018,210 dias,"Portugal, Faro, Portimão<BR/>Portugal, Faro, Faro","Artigo 24.º, n.º 1, alínea b) do Código dos Contratos Públicos","","",,,,Não aplicável.,Não aplicável.,FALSE
61/3972/2017 Medicamentos Octocog alfa 500,Ajuste Direto Regime Geral,Aquisição de bens móveis,"33690000-3, Medicamentos vários","Centro Hospitalar Universitário do Algarve, E. P. E. (510745997)","Shire Pharmaceuticals Portugal, Lda. (509264662)","12.463,20 €",11-06-2018,09-10-2017,60 dias,"Portugal, Faro, Faro","Artigo 24.º, n.º 1, alínea e) do Código dos Contratos Públicos","","",,,,Não aplicável.,Não aplicável.,FALSE
61/3971/2017 Medicamento Octocog alfa 500,Ajuste Direto Regime Geral,Aquisição de bens móveis,"33690000-3, Medicamentos vários","Centro Hospitalar Universitário do Algarve, E. P. E. (510745997)","Bayer Portugal, Lda (500043256)","15.000,00 €",11-06-2018,02-11-2017,60 dias,"Portugal, Faro, Faro","Artigo 24.º, n.º 1, alínea e) do Código dos Contratos Públicos","","",,,,Não aplicável.,Não aplicável.,FALSE
61/3881/2017 Reagentes para Imunoquimica,Ajuste Direto Regime Geral,Aquisição de bens móveis,"33696500-0, Reagentes de laboratório","Centro Hospitalar Universitário do Algarve, E. P. E. (510745997)","Abbott Laboratórios, Lda. (500006148)","90.507,98 €",11-06-2018,16-10-2017,90 dias,"Portugal, Faro, Faro","Artigo 24.º, n.º 1, alínea e) do Código dos Contratos Públicos","","",,,,Não aplicável.,Não aplicável.,FALSE
61/3879/2017 Medicamento Infliximab 100 mg,Ajuste Direto Regime Geral,Aquisição de bens móveis,"33690000-3, Medicamentos vários","Centro Hospitalar Universitário do Algarve, E. P. E. (510745997)","Merck Sharp & Dohme, Lda. (500191360)","80.937,50 €",11-06-2018,31-10-2017,61 dias,"Portugal, Faro, Faro","Artigo 24.º, n.º 1, alínea e) do Código dos Contratos Públicos","","",,,,Não aplicável.,Não aplicável.,FALSE
"61/3782/2017 AA 3.5 g/l+glucose 191,5 g/l+Lipidos 28,1 g/l + Electrólitos",Ajuste Direto Regime Geral,Aquisição de bens móveis,"33690000-3, Medicamentos vários","Centro Hospitalar Universitário do Algarve, E. P. E. (510745997)","Baxter Médico Farmacêutica, Lda. (503347345)","13.902,24 €",11-06-2018,21-09-2017,101 dias,"Portugal, Faro, Faro","Artigo 24.º, n.º 1, alínea e) do Código dos Contratos Públicos","","",,,,Não aplicável.,Não aplicável.,FALSE
