Objeto do Contrato,Tipo de Procedimento,Tipo(s) de Contrato,CPVs,Entidade(s) Adjudicante(s),Entidade(s) Adjudicatária(s),Preço Contratual,Data de Publicação,Data de Celebração do Contrato,Prazo de Execução,Local de Execução,Fundamentação,Data de Fecho do Contrato,Preço Total Efetivo,Causas das Alterações ao Prazo,Causas das Alterações ao Preço,Estado,N.º registo do Acordo Quadro,Descrição do Acordo Quadro,Procedimento Centralizado
4S0110/2017 PREST SERV MEDICOS MCDT´S - ECOGRAFIAS E MAMOGRAFIAS - NOVEMBRO,Ajuste Direto Regime Geral,Aquisição de serviços,"85150000-5, Serviços de imagiologia médica","Centro Hospitalar Barreiro Montijo, E. P. E. (509186998)","Clínica Radiológica do Rosário, Lda (502711604)","7.515,36 €",10-03-2018,15-11-2017,30 dias,"Portugal, Setúbal, Barreiro","Artigo 20.º, n.º 1, alínea a) do Código dos Contratos Públicos",30-11-2017,"7.521,92 €","",Nº EXAMES REALIZADO SUPERIOR AO ESTIMADO,,Não aplicável.,Não aplicável.,FALSE
4S0109/2017 PREST SERV MEDICOS MCDT´S - ECOGRAFIAS E MAMOGRAFIAS - OUTUBRO,Ajuste Direto Regime Geral,Aquisição de serviços,"85150000-5, Serviços de imagiologia médica","Centro Hospitalar Barreiro Montijo, E. P. E. (509186998)","Clínica Radiológica do Rosário, Lda (502711604)","7.515,36 €",10-03-2018,07-10-2017,31 dias,"Portugal, Setúbal, Barreiro","Artigo 20.º, n.º 1, alínea a) do Código dos Contratos Públicos",31-10-2017,"8.731,92 €","",Nº EXAMES REALIZADOS SUPERIOR AO ESTIMADO,,Não aplicável.,Não aplicável.,FALSE
PREST SERV MEDICOS MCDT´S - ECOGRAFIAS E MAMOGRAFIAS - SETEMBRO,Ajuste Direto Regime Geral,Aquisição de serviços,"85150000-5, Serviços de imagiologia médica","Centro Hospitalar Barreiro Montijo, E. P. E. (509186998)","Clínica Radiológica do Rosário, Lda (502711604)","7.515,36 €",10-03-2018,08-09-2017,30 dias,"Portugal, Setúbal, Barreiro","Artigo 20.º, n.º 1, alínea a) do Código dos Contratos Públicos",30-09-2017,"5.845,58 €","",Nº EXAMES REALIZADOS INFERIOR AO ESTIMADO,,Não aplicável.,Não aplicável.,FALSE
4S0097/2017 MCDTs ECOGRAFIAS - AGOSTO,Ajuste Direto Regime Geral,Aquisição de serviços,"85150000-5, Serviços de imagiologia médica","Centro Hospitalar Barreiro Montijo, E. P. E. (509186998)","Clínica Radiológica do Rosário, Lda (502711604)","7.515,36 €",10-03-2018,04-08-2017,31 dias,"Portugal, Setúbal, Barreiro","Artigo 20.º, n.º 1, alínea a) do Código dos Contratos Públicos",31-08-2017,"9.761,86 €","",Nº EXAMES REALIZADOS SUPERIOR AO ESTIMADO,,Não aplicável.,Não aplicável.,FALSE
FI0689/2017 - IMUNOGLOBULINA ANTI-D 1500 U.I. (750 UI/ML AMP 2 ML) SOL INJ,Ao abrigo de acordo-quadro (art.º 259.º),Aquisição de bens móveis,"33600000-6, Produtos farmacêuticos","Centro Hospitalar Barreiro Montijo, E. P. E. (509186998)","C S L BEHRING UNIPESSOAL,LDA. (503047201)","1.100,40 €",09-03-2018,20-12-2017,60 dias,"Portugal, Setúbal, Barreiro",Artigo 259.º do Código dos Contratos Públicos,21-12-2017,"1.100,40 €","","",,1423488,ACORDO QUADRO PARA FORNECIMENTO DE DERIVADOS DO PLASMA HUMANO ÀS INSTITUIÇÕES E SERVIÇOS DO SERVIÇO NACIONAL DE SAÚDE CP 2015/9,FALSE
4SEX0028/2017 - ANÚNCIOS NA IMPRENSA NACIONAL CASA DA MOEDA,Ajuste Direto Regime Geral,Aquisição de serviços,"98300000-6, Serviços diversos","Centro Hospitalar Barreiro Montijo, E. P. E. (509186998)","Imprensa Nacional - Casa da Moeda, S. A. (500792887)","14.400,00 €",09-03-2018,17-01-2017,365 dias,"Portugal, Setúbal, Barreiro","Artigo 24.º, n.º 1, alínea e) do Código dos Contratos Públicos",29-12-2017,"6.257,73 €","",A Necessidade de publicações foi inferior ao previsto.,,Não aplicável.,Não aplicável.,FALSE
FEXC0106/2017 - NIVOLUMAB 40MG (10MG/ML FR 4ML) SOL INJ,Ajuste Direto Regime Geral,Aquisição de bens móveis,"33600000-6, Produtos farmacêuticos","Centro Hospitalar Barreiro Montijo, E. P. E. (509186998)",BRISTOL MYERS SQUIBB-FARM. POR (500048193),"2.280,00 €",09-03-2018,20-12-2017,60 dias,"Portugal, Setúbal, Barreiro","Artigo 24.º, n.º 1, alínea b) do Código dos Contratos Públicos",21-12-2017,"2.280,00 €","","",,Não aplicável.,Não aplicável.,FALSE
FI0546/2017 - VORICONAZOL 200 MG CAPS,Ao abrigo de acordo-quadro (art.º 259.º),Aquisição de bens móveis,"33600000-6, Produtos farmacêuticos","Centro Hospitalar Barreiro Montijo, E. P. E. (509186998)","LABORATORIOS PFIZER, S.A. (500162166)","1.823,96 €",09-03-2018,19-12-2017,60 dias,"Portugal, Setúbal, Barreiro",Artigo 259.º do Código dos Contratos Públicos,20-12-2017,"1.823,96 €","","",,1422736,CP 2015/41 - ACORDO QUADRO PARA FORNECIMENTO DE MEDICAMENTOS ANTI-INFECIOSOS: ANTIVÍRICOS E ANTIFÚNGICOS ÀS INSTITUIÇÕES E SERVIÇOS DO SERVIÇO NACIONAL DE SAÚDE,FALSE
FI0686/2017 - ABACAVIR 600 MG + LAMIVUDINA 300 MG COMP (A729 CIRC 1),Ao abrigo de acordo-quadro (art.º 259.º),Aquisição de bens móveis,"33600000-6, Produtos farmacêuticos","Centro Hospitalar Barreiro Montijo, E. P. E. (509186998)","VIIVHIV HEALTHCARE UNIPESSOAL, LDA (509117961)","14.400,00 €",09-03-2018,19-12-2017,60 dias,"Portugal, Setúbal, Barreiro",Artigo 259.º do Código dos Contratos Públicos,22-12-2017,"14.400,00 €","","",,1120578,"CONCURSO PÚBLICO PARA A CELEBRAÇÃO DE CONTRATOS PÚBLICOS DE APROVISIONAMENTO PARA A ÁREA DA SAÚDE, COM VISTA AO FORNECIMENTO DE MEDICAMENTOS ANTI-RETROVIRAIS, ÀS INSTITUIÇÕES E SERVIÇOS DO SERVIÇO NACIONAL DE SAÚDE  ",FALSE
FI0684/2017 - CIPROTERONA 100MG COMP (C1438 CIRC 8),Ao abrigo de acordo-quadro (art.º 259.º),Aquisição de bens móveis,"33600000-6, Produtos farmacêuticos","Centro Hospitalar Barreiro Montijo, E. P. E. (509186998)","BAYER PORTUGAL, S.A. (500043256)","179,00 €",09-03-2018,18-12-2017,60 dias,"Portugal, Setúbal, Barreiro",Artigo 259.º do Código dos Contratos Públicos,19-12-2017,"179,00 €","","",,1771819,CP 2015/6 - Acordo quadro para o fornecimento de Medicamentos do Foro Oncológico,FALSE
4SEX0023/2017 - FORNECIMENTO DE SERVIÇOS DE POLICIA - HOSPITAL DO BARREIRO,Ajuste Direto Regime Geral,Aquisição de serviços,"79710000-4, Serviços de segurança","Centro Hospitalar Barreiro Montijo, E. P. E. (509186998)",Polícia de Segurança Pública (600006662),"75.036,00 €",09-03-2018,30-12-2016,365 dias,"Portugal, Setúbal, Barreiro","Artigo 24.º, n.º 1, alínea e) do Código dos Contratos Públicos",30-09-2017,"36.814,99 €",Nº1 a) do artº 332º,Nº1 a) do artº 332º,,Não aplicável.,Não aplicável.,FALSE
40028/2018 DM Esterilização,Ajuste Direto Regime Geral,Aquisição de bens móveis,"33198200-6, Saquetas e invólucros de papel para esterilização","Centro Hospitalar Barreiro Montijo, E. P. E. (509186998)","DIMOR LUSITANA, LDA (500730741)","1.957,20 €",09-03-2018,29-01-2018,365 dias,"Portugal, Setúbal, Barreiro","Artigo 20.º, n.º 1, alínea a) do Código dos Contratos Públicos","","","","",,Não aplicável.,Não aplicável.,FALSE
4S0078/2017 - FORNECIMENTO DE SERVIÇOS DE JARDINAGEM,Ajuste Direto Regime Geral,Aquisição de serviços,"98300000-6, Serviços diversos","Centro Hospitalar Barreiro Montijo, E. P. E. (509186998)","Eulen, S.A. - Sucursal em Portugal (980122538)","13.800,00 €",09-03-2018,03-05-2017,24 dias,"Portugal, Setúbal, Barreiro","Artigo 20.º, n.º 1, alínea a) do Código dos Contratos Públicos",31-12-2017,"7.314,15 €","",O adjudicatário não efetuou o nº de horas contratadas,,Não aplicável.,Não aplicável.,FALSE
FI0683/2017 - ETANERCEPT 50 MG/ML CANETA SOL INJ (E380 CIRC 1),Ao abrigo de acordo-quadro (art.º 259.º),Aquisição de bens móveis,"33600000-6, Produtos farmacêuticos","Centro Hospitalar Barreiro Montijo, E. P. E. (509186998)","PFIZER BIOFARMACÊUTICA, SOC. UNIPESSOAL,LDA (513300376)","17.375,16 €",09-03-2018,12-12-2017,60 dias,"Portugal, Setúbal, Barreiro",Artigo 259.º do Código dos Contratos Públicos,20-12-2017,"17.375,16 €","","",,1771819,CP 2015/6 - Acordo quadro para o fornecimento de Medicamentos do Foro Oncológico,FALSE
40003/2018 DM Electromedicina,Ajuste Direto Regime Geral,Aquisição de bens móveis,"33124130-5, Material para diagnóstico","CHBM - Centro Hospital Barreiro Montijo, EPE (509186998)","Ezequiel Panão Jorge, Lda. (501412727)","656,25 €",09-03-2018,05-03-2018,365 dias,"Portugal, Setúbal, Barreiro","Artigo 20.º, n.º 1, alínea a) do Código dos Contratos Públicos","","","","",,Não aplicável.,Não aplicável.,FALSE
FEXC0105/2017 - CABAZITAXEL 60MG SOL INJ,Ajuste Direto Regime Geral,Aquisição de bens móveis,"33600000-6, Produtos farmacêuticos","Centro Hospitalar Barreiro Montijo, E. P. E. (509186998)","SANOFI - PROD. FARMACÊUTICOS, LDA. (500134960)","15.884,00 €",09-03-2018,18-12-2017,20 dias,"Portugal, Setúbal, Barreiro","Artigo 24.º, n.º 1, alínea b) do Código dos Contratos Públicos",20-12-2017,"15.884,00 €","","",,Não aplicável.,Não aplicável.,FALSE
4S0086/2017 - P.S. DE ALIMENTAÇÃO - MAIO E JUNHO - CHBM,Ajuste Direto Regime Geral,Aquisição de serviços,"55100000-1, Serviços de hotelaria","Centro Hospitalar Barreiro Montijo, E. P. E. (509186998)","UNISELF - SOCIEDADE DE RESTAURANTES PÚBLICOS E PRIVADOS, SA. (501323325)","159.456,28 €",09-03-2018,18-05-2017,60 dias,"Portugal, Setúbal, Barreiro","Artigo 24.º, n.º 1, alínea c) do Código dos Contratos Públicos",30-06-2017,"140.995,02 €","",P.S. de Alimentação necessária inferior ao previsto.,,Não aplicável.,Não aplicável.,FALSE
FI0681/2017 - IMATINIB 400 MG (GIST) COMP REVES (I258 CIRC 1),Ao abrigo de acordo-quadro (art.º 259.º),Aquisição de bens móveis,"33600000-6, Produtos farmacêuticos","Centro Hospitalar Barreiro Montijo, E. P. E. (509186998)",NOVARTIS FARMACEUTICA (500063524),"7.594,72 €",09-03-2018,12-12-2017,60 dias,"Portugal, Setúbal, Barreiro",Artigo 259.º do Código dos Contratos Públicos,19-12-2017,"7.594,72 €","","",,1771819,CP 2015/6 - Acordo quadro para o fornecimento de Medicamentos do Foro Oncológico,FALSE
FI0680/2017 - EMTRICITABINA 200 MG + TENOFOVIR 245 MG COMP,Ao abrigo de acordo-quadro (art.º 259.º),Aquisição de bens móveis,"33600000-6, Produtos farmacêuticos","Centro Hospitalar Barreiro Montijo, E. P. E. (509186998)","GILEAD SCIENCES, LDA. (503604704)","174.726,42 €",09-03-2018,14-12-2017,60 dias,"Portugal, Setúbal, Barreiro",Artigo 259.º do Código dos Contratos Públicos,19-12-2017,"174.726,42 €","","",,1120578,"CONCURSO PÚBLICO PARA A CELEBRAÇÃO DE CONTRATOS PÚBLICOS DE APROVISIONAMENTO PARA A ÁREA DA SAÚDE, COM VISTA AO FORNECIMENTO DE MEDICAMENTOS ANTI-RETROVIRAIS, ÀS INSTITUIÇÕES E SERVIÇOS DO SERVIÇO NACIONAL DE SAÚDE  ",FALSE
"4S0049/2017 - PLATAFORMA ELETRÓNICA DE CONTRATAÇÃO PÚBLICA """" VORTALHEALTH""""",Ajuste Direto Regime Geral,Aquisição de serviços,"98300000-6, Serviços diversos","Centro Hospitalar Barreiro Montijo, E. P. E. (509186998)","Vortal - Comércio Eletrónico Consultadoria e Multimédia, S.A (505141019)","6.792,00 €",09-03-2018,06-02-2017,365 dias,"Portugal, Setúbal, Barreiro","Artigo 20.º, n.º 1, alínea a) do Código dos Contratos Públicos",31-03-2017,"1.698,00 €","","Na sequência da Circular Informativa nº 3 da SPMS, de 23-2-2017",,Não aplicável.,Não aplicável.,FALSE
4S0025/2017 - P.S. DE ALIMENTAÇÃO - PLANO DE CONTINGÊNCIA E MEDICINA DO HOSPITAL DO MONTIJO,Ajuste Direto Regime Geral,Aquisição de serviços,"55100000-1, Serviços de hotelaria","Centro Hospitalar Barreiro Montijo, E. P. E. (509186998)","ITAU - Instituto Técnico de Alimentação Humana, SA (500142858)","37.168,15 €",09-03-2018,13-01-2017,90 dias,"Portugal, Setúbal, Barreiro","Artigo 20.º, n.º 1, alínea a) do Código dos Contratos Públicos",31-03-2017,"36.911,78 €","",Necessidade inferior ao previsto,,Não aplicável.,Não aplicável.,FALSE
4S0024/2017 - RECOLHA E TRATAMENTO DE RESÍDUOS SÓLIDOS - JANEIRO 2017,Ajuste Direto Regime Geral,Aquisição de serviços,"90510000-5, Tratamento e eliminação de resíduos","Centro Hospitalar Barreiro Montijo, E. P. E. (509186998)",Serviço de Utilização Comum dos Hospitais (500900469),"14.200,00 €",09-03-2018,30-01-2017,30 dias,"Portugal, Setúbal, Barreiro","Artigo 20.º, n.º 1, alínea a) do Código dos Contratos Públicos",31-01-2017,"17.212,89 €","",Quantidade de resíduos recolhidos superior ao previsto,,Não aplicável.,Não aplicável.,FALSE
4I0038/2018 Manga mista sem fole 5cm,Ao abrigo de acordo-quadro (art.º 259.º),Aquisição de bens móveis,"33198200-6, Saquetas e invólucros de papel para esterilização","Centro Hospitalar Barreiro Montijo, E. P. E. (509186998)","DIMOR LUSITANA, LDA (500730741)","197,60 €",09-03-2018,19-01-2018,365 dias,"Portugal, Setúbal, Barreiro",Artigo 259.º do Código dos Contratos Públicos,"","","","",,1974943,CP 2016/43 - Acordo quadro para fornecimento de Material para Empacotamento em Esterilização às Instituições e Serviços do Serviço Nacional de Saúde.,FALSE
4I0026/2018 Campos operatorios,Ao abrigo de acordo-quadro (art.º 259.º),Aquisição de bens móveis,"39518200-8, Lençóis para blocos operatórios","Centro Hospitalar Barreiro Montijo, E. P. E. (509186998)",BASTOS VIEGAS (500042772),"1.485,54 €",09-03-2018,29-12-2017,365 dias,"Portugal, Setúbal, Barreiro",Artigo 259.º do Código dos Contratos Públicos,"","","","",,2497138,CP 2016/42 - Acordo quadro para o fornecimento de Campos Operatórios,FALSE
4I0043/2018 DM para bombas de insulina,Ao abrigo de acordo-quadro (art.º 259.º),Aquisição de bens móveis,"33000000-0, Equipamento médico, medicamentos e produtos para cuidados pessoais","Centro Hospitalar Barreiro Montijo, E. P. E. (509186998)","ROCHE - SISTEMAS DE DIAGNOSTICO, LDA (504282921)","20.546,50 €",09-03-2018,26-02-2018,365 dias,"Portugal, Setúbal, Barreiro",Artigo 259.º do Código dos Contratos Públicos,"","","","",,1442148,ACORDO QUADRO PARA FORNECIMENTO DE BOMBAS DE PERFUSÃO SUBCUTANEA CONTINUA DE INSULINA E RESPETIVOS CONSUMÍVEIS ÀS INSTITUIÇÕES E SERVIÇOS DO SERVIÇO NACIONAL DE SAÚDE. CP 2015/29,FALSE
FI0676/2017 - PEMETREXED 500 MG FRS/AMP SOL INJ (P533 CIRC 1),Ao abrigo de acordo-quadro (art.º 259.º),Aquisição de bens móveis,"33600000-6, Produtos farmacêuticos","Centro Hospitalar Barreiro Montijo, E. P. E. (509186998)","LILLY FARMA, LDA (500165602)","8.795,60 €",09-03-2018,14-12-2017,60 dias,"Portugal, Setúbal, Barreiro",Artigo 259.º do Código dos Contratos Públicos,19-12-2017,"8.795,60 €","","",,1771819,CP 2015/6 - Acordo quadro para o fornecimento de Medicamentos do Foro Oncológico,FALSE
FI0671/2017 - ETANERCEPT 50 MG/ML SER SOL INJ (E332 CIRC 1),Ao abrigo de acordo-quadro (art.º 259.º),Aquisição de bens móveis,"33600000-6, Produtos farmacêuticos","Centro Hospitalar Barreiro Montijo, E. P. E. (509186998)","PFIZER BIOFARMACÊUTICA, SOC. UNIPESSOAL,LDA (513300376)","6.316,80 €",09-03-2018,13-12-2017,60 dias,"Portugal, Setúbal, Barreiro",Artigo 259.º do Código dos Contratos Públicos,15-12-2017,"6.316,80 €","","",,1771819,CP 2015/6 - Acordo quadro para o fornecimento de Medicamentos do Foro Oncológico,FALSE
40049/2017 Compressas de TNT,Ajuste Direto Regime Geral,Aquisição de bens móveis,"33141119-7, Compressas","CHBM - Centro Hospital Barreiro Montijo, EPE (509186998)","ALBINO DIAS ANDRADE, LDA (500013810)","10.369,41 €",09-03-2018,30-01-2017,365 dias,"Portugal, Setúbal, Barreiro","Artigo 20.º, n.º 1, alínea a) do Código dos Contratos Públicos",29-12-2017,"9.519,09 €","",redução de consumo,,Não aplicável.,Não aplicável.,FALSE
FI0675/2018 - EPIRRUBICINA 200MG E 50MG (E328 E E39 CIRC 8),Ao abrigo de acordo-quadro (art.º 259.º),Aquisição de bens móveis,"33600000-6, Produtos farmacêuticos","Centro Hospitalar Barreiro Montijo, E. P. E. (509186998)","ACCORD HEALTHCARE, UNIPESSOAL, LDA (508622263)","387,80 €",09-03-2018,13-12-2017,60 dias,"Portugal, Setúbal, Barreiro",Artigo 259.º do Código dos Contratos Públicos,14-12-2017,"387,80 €","","",,1771819,CP 2015/6 - Acordo quadro para o fornecimento de Medicamentos do Foro Oncológico,FALSE
FI0673/2017 - FLUOROURACILO 5000 MG (50 MG/ML FRS/AMP 100 ML) SOL INJ (F179 CIRC 8),Ao abrigo de acordo-quadro (art.º 259.º),Aquisição de bens móveis,"33600000-6, Produtos farmacêuticos","Centro Hospitalar Barreiro Montijo, E. P. E. (509186998)","ACCORD HEALTHCARE, UNIPESSOAL, LDA (508622263)","613,90 €",09-03-2018,12-12-2017,60 dias,"Portugal, Setúbal, Barreiro",Artigo 259.º do Código dos Contratos Públicos,15-12-2017,"613,90 €","","",,1370278,CP 2015/51 - Acordo quadro para fornecimento de medicamentos usados nas afeções cutâneas às instituições e serviços do serviço nacional de saúde,FALSE
4I0048/2017 Suportes rodados para soros,Ao abrigo de acordo-quadro (art.º 259.º),Aquisição de bens móveis,"33600000-6, Produtos farmacêuticos","CHBM - Centro Hospital Barreiro Montijo, EPE (509186998)","ANASTACIO SALDANHA UNIPESSOAL, LDA. (505804441)","642,00 €",06-03-2018,31-10-2017,365 dias,"Portugal, Setúbal, Barreiro",Artigo 259.º do Código dos Contratos Públicos,29-12-2017,"642,00 €","","",,1587913,Acordo Quadro para fornecimento de Equipamentos e Dispositivos Médicos de uso comum em internamento e ambulatório - Parte I às instituições e serviços do Serviço Nacional de Saúde.,FALSE
4I0034/2017 Sistema de conexão Luer Lock M/F,Ao abrigo de acordo-quadro (art.º 259.º),Aquisição de bens móveis,"33000000-0, Equipamento médico, medicamentos e produtos para cuidados pessoais","Centro Hospitalar Barreiro Montijo, E. P. E. (509186998)","VYGON PORTUGAL, LDA (503232785)","199,50 €",06-03-2018,04-04-2017,365 dias,"Portugal, Setúbal, Barreiro",Artigo 259.º do Código dos Contratos Públicos,29-12-2017,"165,30 €","",redução consumos,,412727,CONCURSO PÚBLICO PARA A CELEBRAÇÃO DE CONTRATOS PÚBLICOS DE APROVISIONAMENTO PARA AQUISIÇÃO DE MATERIAL CATETERES,FALSE
4I0045/2017 Consumíveis para bombas perfusão insulina,Ao abrigo de acordo-quadro (art.º 259.º),Aquisição de bens móveis,"33000000-0, Equipamento médico, medicamentos e produtos para cuidados pessoais","Centro Hospitalar Barreiro Montijo, E. P. E. (509186998)","ROCHE SISTEMAS DE DIAGNÓSTICOS, LDA (504282921)","3.904,33 €",06-03-2018,19-10-2017,365 dias,"Portugal, Setúbal, Barreiro",Artigo 259.º do Código dos Contratos Públicos,29-12-2017,"3.904,33 €","",redução consumos,,1442148,ACORDO QUADRO PARA FORNECIMENTO DE BOMBAS DE PERFUSÃO SUBCUTANEA CONTINUA DE INSULINA E RESPETIVOS CONSUMÍVEIS ÀS INSTITUIÇÕES E SERVIÇOS DO SERVIÇO NACIONAL DE SAÚDE. CP 2015/29,FALSE
4I0046/2017 Andarilho,Ao abrigo de acordo-quadro (art.º 259.º),Aquisição de bens móveis,"33600000-6, Produtos farmacêuticos","CHBM - Centro Hospital Barreiro Montijo, EPE (509186998)",quilaban (500399670),"35,70 €",06-03-2018,22-09-2017,365 dias,"Portugal, Setúbal, Barreiro",Artigo 259.º do Código dos Contratos Públicos,29-12-2017,"35,70 €","","",,1587913,Acordo Quadro para fornecimento de Equipamentos e Dispositivos Médicos de uso comum em internamento e ambulatório - Parte I às instituições e serviços do Serviço Nacional de Saúde.,FALSE
4I0029/2017 Cadeiras de duche,Ao abrigo de acordo-quadro (art.º 259.º),Aquisição de bens móveis,"33000000-0, Equipamento médico, medicamentos e produtos para cuidados pessoais","Centro Hospitalar Barreiro Montijo, E. P. E. (509186998)","ANASTACIO SALDANHA UNIPESSOAL, LDA. (505804441)","1.024,00 €",06-03-2018,29-12-2017,365 dias,"Portugal, Setúbal, Barreiro",Artigo 259.º do Código dos Contratos Públicos,29-12-2017,"1.024,00 €","","",,2159355,CP 2016/84 - Acordo quadro para fornecimento de Cadeiras de Rodas para uso em meio hospitalar às Instituições e Serviços do Serviço Nacional de Saúde,FALSE
4I0036/2017 Cadeiras de rodas e duche,Ao abrigo de acordo-quadro (art.º 259.º),Aquisição de bens móveis,"33193120-6, Cadeiras de rodas","CHBM - Centro Hospital Barreiro Montijo, EPE (509186998)","ANASTACIO SALDANHA UNIPESSOAL, LDA. (505804441)","512,00 €",05-03-2018,23-05-2017,365 dias,"Portugal, Setúbal, Barreiro",Artigo 259.º do Código dos Contratos Públicos,29-12-2017,"512,00 €","","",,2159355,CP 2016/84 - Acordo quadro para fornecimento de Cadeiras de Rodas para uso em meio hospitalar às Instituições e Serviços do Serviço Nacional de Saúde,FALSE
FI0677/2017 - CARBOPLATINA 600 MG (10 MG/ML)SOL INJ 60 ML FRS/AMP (C867 CIRC 8),Ao abrigo de acordo-quadro (art.º 259.º),Aquisição de bens móveis,"33600000-6, Produtos farmacêuticos","Centro Hospitalar Barreiro Montijo, E. P. E. (509186998)","ACCORD HEALTHCARE, UNIPESSOAL, LDA (508622263)","575,80 €",02-03-2018,13-12-2017,60 dias,"Portugal, Setúbal, Barreiro",Artigo 259.º do Código dos Contratos Públicos,15-12-2017,"575,80 €","","",,1771819,CP 2015/6 - Acordo quadro para o fornecimento de Medicamentos do Foro Oncológico,FALSE
FI0670/2017 - SUNITINIB 50 MG CAPS (S348 CIRC 1),Ao abrigo de acordo-quadro (art.º 259.º),Aquisição de bens móveis,"33600000-6, Produtos farmacêuticos","Centro Hospitalar Barreiro Montijo, E. P. E. (509186998)","PFIZER BIOFARMACÊUTICA, SOC. UNIPESSOAL,LDA (513300376)","7.520,79 €",02-03-2018,12-12-2017,60 dias,"Portugal, Setúbal, Barreiro",Artigo 259.º do Código dos Contratos Públicos,14-12-2017,"7.520,79 €","","",,1771819,CP 2015/6 - Acordo quadro para o fornecimento de Medicamentos do Foro Oncológico,FALSE
FI0672/2017 - DEGARRELIX 80 MG PO SOL INJ (D336 CIRC 8),Ao abrigo de acordo-quadro (art.º 259.º),Aquisição de bens móveis,"33600000-6, Produtos farmacêuticos","Centro Hospitalar Barreiro Montijo, E. P. E. (509186998)","FERRING PORTUGUESA - PROD. FARM. SOC. UNIP., LDA. (502034831)","7.304,40 €",02-03-2018,12-12-2017,60 dias,"Portugal, Setúbal, Barreiro",Artigo 259.º do Código dos Contratos Públicos,14-12-2017,"7.304,40 €","","",,1771819,CP 2015/6 - Acordo quadro para o fornecimento de Medicamentos do Foro Oncológico,FALSE
FI0674/2017 - OXALIPLATINA 200 MG (5 MG/ML FRS/AMP 40 ML) SOL INJ (O928 CIRC 8),Ao abrigo de acordo-quadro (art.º 259.º),Aquisição de bens móveis,"33600000-6, Produtos farmacêuticos","Centro Hospitalar Barreiro Montijo, E. P. E. (509186998)","ACCORD HEALTHCARE, UNIPESSOAL, LDA (508622263)","1.131,60 €",02-03-2018,12-12-2017,60 dias,"Portugal, Setúbal, Barreiro",Artigo 259.º do Código dos Contratos Públicos,14-12-2017,"1.131,60 €","","",,1771819,CP 2015/6 - Acordo quadro para o fornecimento de Medicamentos do Foro Oncológico,FALSE
FI0669/2017 - RITUXIMAB 500 MG (10 MG/ML FRS/AMP 50 ML) SOL INJ (R62 CIRC 1),Ao abrigo de acordo-quadro (art.º 259.º),Aquisição de bens móveis,"33600000-6, Produtos farmacêuticos","Centro Hospitalar Barreiro Montijo, E. P. E. (509186998)","ROCHE FARMACEUTICA QUIMICA, LDA (500233810)","9.214,92 €",02-03-2018,11-12-2017,60 dias,"Portugal, Setúbal, Barreiro",Artigo 259.º do Código dos Contratos Públicos,15-12-2017,"9.214,92 €","","",,1771819,CP 2015/6 - Acordo quadro para o fornecimento de Medicamentos do Foro Oncológico,FALSE
FI0651/2017 - PROGESTERONA 100 MG CAPS MOLE,Ao abrigo de acordo-quadro (art.º 259.º),Aquisição de bens móveis,"33600000-6, Produtos farmacêuticos","Centro Hospitalar Barreiro Montijo, E. P. E. (509186998)","JABA RECORDATI, S.A (500492867)","55,24 €",02-03-2018,11-12-2017,60 dias,"Portugal, Setúbal, Barreiro",Artigo 259.º do Código dos Contratos Públicos,14-12-2017,"55,24 €","","",,1459323,CP 2015/20,FALSE
40064/2017 - Aquisição de Reagentes para Teste Respiratório c/ Carbono,Ajuste Direto Regime Geral,Aquisição de bens móveis,"33696500-0, Reagentes de laboratório","CHBM - Centro Hospital Barreiro Montijo, EPE (509186998)","IBERLAB & IMUNOREAGE-SOL. LABORAT., LDA (503406694)","5.000,00 €",02-03-2018,20-02-2017,365 dias,"Portugal, Setúbal, Barreiro","Artigo 20.º, n.º 1, alínea a) do Código dos Contratos Públicos",29-12-2017,"5.000,00 €","","",,Não aplicável.,Não aplicável.,FALSE
FI0666/2017 - CISPLATINA 100 MG (1 MG/ML)SOL INJ 100 ML FRS/AMP (C227 CIRC 8),Ao abrigo de acordo-quadro (art.º 259.º),Aquisição de bens móveis,"33600000-6, Produtos farmacêuticos","Centro Hospitalar Barreiro Montijo, E. P. E. (509186998)","TEVA-PHARMA - PRODUTOS FARMACÊUTICOS, LDA. (507045491)","190,00 €",02-03-2018,11-12-2017,60 dias,"Portugal, Setúbal, Barreiro",Artigo 259.º do Código dos Contratos Públicos,13-12-2017,"190,00 €","","",,1771819,CP 2015/6 - Acordo quadro para o fornecimento de Medicamentos do Foro Oncológico,FALSE
FI0667/2017 - ZOLEDRONATO 4 MG (0.8 MG/ML FRS/AMP 5 ML) SOL INJ,Ao abrigo de acordo-quadro (art.º 259.º),Aquisição de bens móveis,"33600000-6, Produtos farmacêuticos","Centro Hospitalar Barreiro Montijo, E. P. E. (509186998)","HIKMA FARMACEUTICA (PORTUGAL), LDA. (502266791)","235,00 €",02-03-2018,11-12-2017,60 dias,"Portugal, Setúbal, Barreiro",Artigo 259.º do Código dos Contratos Públicos,15-12-2017,"235,00 €","","",,1410779,CP 2015/47 - Acordo quadro para fornecimento de medicamentos do aparelho locomotor às instituições e serviços do serviço nacional de saúde,FALSE
FI0664/2017 - INFLIXIMAB 100 MG FRS PO SOL INJ (I287 CIRC 1),Ao abrigo de acordo-quadro (art.º 259.º),Aquisição de bens móveis,"33600000-6, Produtos farmacêuticos","Centro Hospitalar Barreiro Montijo, E. P. E. (509186998)","MERCK SHARP & DOHME, LDA (500191360)","12.950,00 €",02-03-2018,07-12-2017,60 dias,"Portugal, Setúbal, Barreiro",Artigo 259.º do Código dos Contratos Públicos,11-12-2017,"12.950,00 €","","",,1771819,CP 2015/6 - Acordo quadro para o fornecimento de Medicamentos do Foro Oncológico,FALSE
FI0663/2017 - DOLUTEGRAVIR 50 MG + ABACAVIR 600 MG + LAMIVUDINA 300 MG COMP (D503 CIRC 8),Ao abrigo de acordo-quadro (art.º 259.º),Aquisição de bens móveis,"33600000-6, Produtos farmacêuticos","Centro Hospitalar Barreiro Montijo, E. P. E. (509186998)","VIIVHIV HEALTHCARE UNIPESSOAL, LDA (509117961)","112.000,21 €",02-03-2018,07-12-2017,60 dias,"Portugal, Setúbal, Barreiro",Artigo 259.º do Código dos Contratos Públicos,12-12-2017,"112.000,21 €","","",,1513257,Acordo quadro para fornecimento de Medicamentos diversos II   às Instituições e Serviços do Serviço Nacional de Saúde,FALSE
40038/2017 - FORNECIMENTO DE REAGENTES - MARCADOR TUMORAL NSE,Ajuste Direto Regime Geral,Aquisição de bens móveis,"33696500-0, Reagentes de laboratório","Centro Hospitalar Barreiro Montijo, E. P. E. (509186998)","Roche Sistemas de Diagnósticos, Soc.Unip., Lda (504282921)","5.754,00 €",02-03-2018,15-03-2017,365 dias,"Portugal, Setúbal, Barreiro","Artigo 20.º, n.º 1, alínea a) do Código dos Contratos Públicos",29-12-2017,"4.521,00 €","",Necessidade inferior à previsão,,Não aplicável.,Não aplicável.,FALSE
FI0665/2017 - INFLIXIMAB 100 MG (INFLECTRA) PÓ SOL INJ (I251 CIRC 1),Ao abrigo de acordo-quadro (art.º 259.º),Aquisição de bens móveis,"33600000-6, Produtos farmacêuticos","Centro Hospitalar Barreiro Montijo, E. P. E. (509186998)","LABORATORIOS PFIZER, S.A. (500162166)","13.468,80 €",02-03-2018,07-12-2017,60 dias,"Portugal, Setúbal, Barreiro",Artigo 259.º do Código dos Contratos Públicos,11-12-2017,"13.468,80 €","","",,1771819,CP 2015/6 - Acordo quadro para o fornecimento de Medicamentos do Foro Oncológico,FALSE
FI0658/2017 - PEMETREXED 500 MG FRS/AMP SOL INJ (P533 CIRC 1),Ao abrigo de acordo-quadro (art.º 259.º),Aquisição de bens móveis,"33600000-6, Produtos farmacêuticos","Centro Hospitalar Barreiro Montijo, E. P. E. (509186998)","LILLY FARMA, LDA (500165602)","8.795,70 €",02-03-2018,05-12-2017,60 dias,"Portugal, Setúbal, Barreiro",Artigo 259.º do Código dos Contratos Públicos,07-12-2017,"8.795,70 €","","",,1422736,CP 2015/41 - ACORDO QUADRO PARA FORNECIMENTO DE MEDICAMENTOS ANTI-INFECIOSOS: ANTIVÍRICOS E ANTIFÚNGICOS ÀS INSTITUIÇÕES E SERVIÇOS DO SERVIÇO NACIONAL DE SAÚDE,FALSE
FI0659/2017 - CARBOPLATINA 450 MG E CARBOPLATINA 600 MG (C53 E C867 CIRC 8),Ao abrigo de acordo-quadro (art.º 259.º),Aquisição de bens móveis,"33600000-6, Produtos farmacêuticos","Centro Hospitalar Barreiro Montijo, E. P. E. (509186998)","ACCORD HEALTHCARE, UNIPESSOAL, LDA (508622263)","762,80 €",02-03-2018,29-11-2017,60 dias,"Portugal, Setúbal, Barreiro",Artigo 259.º do Código dos Contratos Públicos,07-12-2017,"762,80 €","","",,1771819,CP 2015/6 - Acordo quadro para o fornecimento de Medicamentos do Foro Oncológico,FALSE
FI0661/2017 - PACLITAXEL 300 MG (6 MG/ML FRS/AMP 50 ML) SOL INJ,Ao abrigo de acordo-quadro (art.º 259.º),Aquisição de bens móveis,"33600000-6, Produtos farmacêuticos","Centro Hospitalar Barreiro Montijo, E. P. E. (509186998)",AUROVITAS UNIPESSOAL (513053239),"600,00 €",02-03-2018,05-12-2017,60 dias,"Portugal, Setúbal, Barreiro",Artigo 259.º do Código dos Contratos Públicos,11-12-2017,"600,00 €","","",,1771819,CP 2015/6 - Acordo quadro para o fornecimento de Medicamentos do Foro Oncológico,FALSE
4I0011/2017 EQUIPAMENTO DE INFORMATICA (PROCEDIMENTO N 2016UMC438,Ao abrigo de acordo-quadro (art.º 259.º),Aquisição de bens móveis,"30230000-0, Equipamento informático","CHBM - Centro Hospital Barreiro Montijo, EPE (509186998)","INFORMANTEM-INFORMATICA E MANUTENÇAO,S.A (503670693)","18.973,85 €",02-03-2018,22-02-2017,25 dias,"Portugal, Setúbal, Barreiro",Artigo 259.º do Código dos Contratos Públicos,04-05-2017,"18.973,85 €","","",,1196657,Acordo Quadro para aquisição e aluguer operacional de equipamento informático,TRUE
FI0660/2017 - IMATINIB 400 MG (GIST) COMP REVES (I258 CIRC 1),Ao abrigo de acordo-quadro (art.º 259.º),Aquisição de bens móveis,"33600000-6, Produtos farmacêuticos","Centro Hospitalar Barreiro Montijo, E. P. E. (509186998)",NOVARTIS FARMACEUTICA (500063524),"7.594,72 €",02-03-2018,30-11-2017,60 dias,"Portugal, Setúbal, Barreiro",Artigo 259.º do Código dos Contratos Públicos,05-12-2017,"7.594,72 €","","",,1771819,CP 2015/6 - Acordo quadro para o fornecimento de Medicamentos do Foro Oncológico,FALSE
FI0655/2017 - FLUOROURACILO 5000 MG (50 MG/ML FRS/AMP 100 ML) SOL INJ (F179 CIRC 8),Ao abrigo de acordo-quadro (art.º 259.º),Aquisição de bens móveis,"33600000-6, Produtos farmacêuticos","Centro Hospitalar Barreiro Montijo, E. P. E. (509186998)","ACCORD HEALTHCARE, UNIPESSOAL, LDA (508622263)","438,50 €",02-03-2018,27-11-2017,60 dias,"Portugal, Setúbal, Barreiro",Artigo 259.º do Código dos Contratos Públicos,29-11-2017,"438,50 €","","",,1370278,CP 2015/51 - Acordo quadro para fornecimento de medicamentos usados nas afeções cutâneas às instituições e serviços do serviço nacional de saúde,FALSE
FI0650/2017 - SUGAMADEX 200 MG (100MG/ML AMP 2ML) SOL INJ AMP (S646 CIRC 8),Ao abrigo de acordo-quadro (art.º 259.º),Aquisição de bens móveis,"33600000-6, Produtos farmacêuticos","Centro Hospitalar Barreiro Montijo, E. P. E. (509186998)","MERCK SHARP & DOHME, LDA (500191360)","11.144,55 €",02-03-2018,27-11-2017,60 dias,"Portugal, Setúbal, Barreiro",Artigo 259.º do Código dos Contratos Públicos,01-12-2017,"11.144,55 €","","",,1338581,"Acordo quadro para fornecimento de Medicação antialérgica, medicamentos usados no tratamento de intoxicações, vitaminas e sais minerais e grupo 20.9 - outros produtos às instituições e serviços do serviço nacional de saúde",FALSE
FI0656/2017 - INFLIXIMAB 100 MG (INFLECTRA) PÓ SOL INJ (I251 CIRC 1),Ao abrigo de acordo-quadro (art.º 259.º),Aquisição de bens móveis,"33600000-6, Produtos farmacêuticos","Centro Hospitalar Barreiro Montijo, E. P. E. (509186998)","LABORATORIOS PFIZER, S.A. (500162166)","4.489,60 €",02-03-2018,27-11-2017,60 dias,"Portugal, Setúbal, Barreiro",Artigo 259.º do Código dos Contratos Públicos,28-11-2017,"4.489,60 €","","",,1771819,CP 2015/6 - Acordo quadro para o fornecimento de Medicamentos do Foro Oncológico,FALSE
40069/2017 DM Posições Desertas Esterilização,Ajuste Direto Regime Geral,Aquisição de bens móveis,"33198200-6, Saquetas e invólucros de papel para esterilização","CHBM - Centro Hospital Barreiro Montijo, EPE (509186998)","EUROCASMEDICA,S.A. (503322105)","62,40 €",02-03-2018,06-03-2017,365 dias,"Portugal, Setúbal, Barreiro","Artigo 20.º, n.º 1, alínea a) do Código dos Contratos Públicos",29-12-2017,"280,80 €","",aumento de consumos,,Não aplicável.,Não aplicável.,FALSE
40069/2017 DM Posições Desertas Esterilização,Ajuste Direto Regime Geral,Aquisição de bens móveis,"33198200-6, Saquetas e invólucros de papel para esterilização","CHBM - Centro Hospital Barreiro Montijo, EPE (509186998)","FACTOR PLUS, SA (502810645)","15.200,00 €",02-03-2018,08-03-2017,365 dias,"Portugal, Setúbal, Barreiro","Artigo 20.º, n.º 1, alínea a) do Código dos Contratos Públicos",29-12-2017,"3.921,60 €","",diminuição de consumos,,Não aplicável.,Não aplicável.,FALSE
FI0653/2017 - SORAFENIB 200 MG COMP (S421 CIRC 1),Ao abrigo de acordo-quadro (art.º 259.º),Aquisição de bens móveis,"33600000-6, Produtos farmacêuticos","Centro Hospitalar Barreiro Montijo, E. P. E. (509186998)","BAYER PORTUGAL, S.A. (500043256)","9.238,82 €",02-03-2018,27-11-2017,60 dias,"Portugal, Setúbal, Barreiro",Artigo 259.º do Código dos Contratos Públicos,29-11-2017,"9.238,82 €","","",,1771819,CP 2015/6 - Acordo quadro para o fornecimento de Medicamentos do Foro Oncológico,FALSE
4S0087/2017 - Prestação de Higiene e Limpeza no CHBM - Maio a Julho de 2017,Ajuste Direto Regime Geral,Aquisição de serviços,"55100000-1, Serviços de hotelaria","Centro Hospitalar Barreiro Montijo, E. P. E. (509186998)","Eulen, S.A. - Sucursal em Portugal (980122538)","198.034,80 €",01-03-2018,18-05-2017,90 dias,"Portugal, Setúbal, Barreiro","Artigo 24.º, n.º 1, alínea c) do Código dos Contratos Públicos",10-08-2017,"220.038,67 €","",O período da contratação da Prestação de Serviços foi alargado,,Não aplicável.,Não aplicável.,FALSE
4S0077/2017 - Prestação de Serviços de Higiene e Limpeza - Abril 2017,Ajuste Direto Regime Geral,Aquisição de serviços,"55100000-1, Serviços de hotelaria","Centro Hospitalar Barreiro Montijo, E. P. E. (509186998)","Eulen, S.A. - Sucursal em Portugal (980122538)","64.708,85 €",01-03-2018,31-03-2017,30 dias,"Portugal, Setúbal, Barreiro","Artigo 20.º, n.º 1, alínea a) do Código dos Contratos Públicos",30-04-2017,"64.708,85 €","","",,Não aplicável.,Não aplicável.,FALSE
110019/2017 Fornecimento de DM para Endoscopias e Próteses de Gastro,Concurso público,Aquisição de bens móveis,"33140000-3, Material médico de consumo","Centro Hospitalar Barreiro Montijo, E. P. E. (509186998)","CAREWILL, LDA (507484851)","7.350,00 €",01-03-2018,02-02-2017,365 dias,"Portugal, Setúbal, Barreiro","Artigo 20.º, n.º 1, alínea b) do Código dos Contratos Públicos",29-12-2017,"2.685,00 €","",redução de consumos,,Não aplicável.,Não aplicável.,FALSE
40063/2017 Fornecimento de reservatórios para terapia de vácuo,Ajuste Direto Regime Geral,Aquisição de bens móveis,"33000000-0, Equipamento médico, medicamentos e produtos para cuidados pessoais","Centro Hospitalar Barreiro Montijo, E. P. E. (509186998)","JMV PRODUTOS HOSPITALARES, LDA (501887148)","5.435,10 €",01-03-2018,24-04-2017,365 dias,"Portugal, Setúbal, Barreiro","Artigo 20.º, n.º 1, alínea a) do Código dos Contratos Públicos",29-12-2017,"6.679,10 €","",aumento de consumos,,Não aplicável.,Não aplicável.,FALSE
4S0063/2017 - Prestação de Serviços de Higiene e Limpeza no CHBM - Março 2017,Ajuste Direto Regime Geral,Aquisição de serviços,"55100000-1, Serviços de hotelaria","Centro Hospitalar Barreiro Montijo, E. P. E. (509186998)","Eulen, S.A. - Sucursal em Portugal (980122538)","66.011,60 €",01-03-2018,02-03-2017,30 dias,"Portugal, Setúbal, Barreiro","Artigo 20.º, n.º 1, alínea a) do Código dos Contratos Públicos",31-03-2017,"66.011,60 €","","",,Não aplicável.,Não aplicável.,FALSE
40063/2017 Fornecimento de reservatórios para terapia de vácuo,Ajuste Direto Regime Geral,Aquisição de bens móveis,"33000000-0, Equipamento médico, medicamentos e produtos para cuidados pessoais","Centro Hospitalar Barreiro Montijo, E. P. E. (509186998)","MEDICINÁLIA CORMEDICA, LDA (500684324)","5.162,50 €",01-03-2018,28-04-2017,365 dias,"Portugal, Setúbal, Barreiro","Artigo 20.º, n.º 1, alínea a) do Código dos Contratos Públicos",29-12-2017,"11.350,00 €","",aumento de consumo,,Não aplicável.,Não aplicável.,FALSE
110019/2017 Fornecimento de DM para Endoscopias e Próteses de Gastro,Concurso público,Aquisição de bens móveis,"33140000-3, Material médico de consumo","Centro Hospitalar Barreiro Montijo, E. P. E. (509186998)","ENDOTÉCNICA, Material Cirúrgica;Lda (503818348)","5.268,00 €",01-03-2018,02-02-2017,365 dias,"Portugal, Setúbal, Barreiro","Artigo 20.º, n.º 1, alínea b) do Código dos Contratos Públicos",29-12-2017,"520,00 €","",redução de consumos,,Não aplicável.,Não aplicável.,FALSE
110019/2017 Fornecimento de DM para Endoscopias e Próteses de Gastro,Concurso público,Aquisição de bens móveis,"33140000-3, Material médico de consumo","Centro Hospitalar Barreiro Montijo, E. P. E. (509186998)",Higiplus (507320662),"8.804,00 €",01-03-2018,02-02-2017,365 dias,"Portugal, Setúbal, Barreiro","Artigo 20.º, n.º 1, alínea b) do Código dos Contratos Públicos",29-12-2017,"5.441,00 €","",redução de consumos,,Não aplicável.,Não aplicável.,FALSE
110019/2017 Fornecimento de DM para Endoscopias e Próteses de Gastro,Concurso público,Aquisição de bens móveis,"33140000-3, Material médico de consumo","Centro Hospitalar Barreiro Montijo, E. P. E. (509186998)",Olympus Iberia.S.A.U. (980474710),"5.583,00 €",01-03-2018,02-02-2017,365 dias,"Portugal, Setúbal, Barreiro","Artigo 20.º, n.º 1, alínea b) do Código dos Contratos Públicos",29-12-2017,"3.787,00 €","",redução de consumos,,Não aplicável.,Não aplicável.,FALSE
110019/2017 Fornecimento de DM para Endoscopias e Próteses de Gastro,Concurso público,Aquisição de bens móveis,"33140000-3, Material médico de consumo","Centro Hospitalar Barreiro Montijo, E. P. E. (509186998)","BIOSONDA-COM.MAT.HOSPITALAR, (501463313)","19.361,00 €",01-03-2018,01-02-2017,365 dias,"Portugal, Setúbal, Barreiro","Artigo 20.º, n.º 1, alínea b) do Código dos Contratos Públicos",29-12-2017,"10.304,00 €","",redução de consumos,,Não aplicável.,Não aplicável.,FALSE
110019/2017 Fornecimento de DM para Endoscopias e Próteses de Gastro,Concurso público,Aquisição de bens móveis,"33140000-3, Material médico de consumo","Centro Hospitalar Barreiro Montijo, E. P. E. (509186998)","MEDICINÁLIA CORMEDICA, LDA (500684324)","850,00 €",01-03-2018,01-02-2017,365 dias,"Portugal, Setúbal, Barreiro","Artigo 20.º, n.º 1, alínea b) do Código dos Contratos Públicos",29-12-2017,"1.190,00 €","",redução de consumos,,Não aplicável.,Não aplicável.,FALSE
110019/2017 Fornecimento de DM para Endoscopias e Próteses de Gastro,Concurso público,Aquisição de bens móveis,"33140000-3, Material médico de consumo","Centro Hospitalar Barreiro Montijo, E. P. E. (509186998)","ALVES & CIA (IRMAOS), LDA (500310068)","46.133,90 €",01-03-2018,02-02-2017,365 dias,"Portugal, Setúbal, Barreiro","Artigo 20.º, n.º 1, alínea b) do Código dos Contratos Públicos",29-12-2017,"42.029,90 €","",redução de consumos,,Não aplicável.,Não aplicável.,FALSE
40002/2018 DM de Emergência,Ajuste Direto Regime Geral,Aquisição de bens móveis,"33140000-3, Material médico de consumo","CHBM - Centro Hospital Barreiro Montijo, EPE (509186998)","INTERSURGICAL PORTUGAL,LDA. (503480045)","2.525,00 €",01-03-2018,26-01-2018,365 dias,"Portugal, Setúbal, Barreiro","Artigo 20.º, n.º 1, alínea a) do Código dos Contratos Públicos","","","","",,Não aplicável.,Não aplicável.,FALSE
40002/2018 DM de Emergência,Ajuste Direto Regime Geral,Aquisição de bens móveis,"33140000-3, Material médico de consumo","CHBM - Centro Hospital Barreiro Montijo, EPE (509186998)","IBERDATA EQUIPAMENTOS, LDA (501904921)","2.002,38 €",01-03-2018,26-01-2018,365 dias,"Portugal, Setúbal, Barreiro","Artigo 20.º, n.º 1, alínea a) do Código dos Contratos Públicos","","","","",,Não aplicável.,Não aplicável.,FALSE
40002/2018 DM de Emergência,Ajuste Direto Regime Geral,Aquisição de bens móveis,"33140000-3, Material médico de consumo","CHBM - Centro Hospital Barreiro Montijo, EPE (509186998)","MEDTRONIC PORTUGAL, LDA (504223933)","2.112,00 €",01-03-2018,26-01-2018,365 dias,"Portugal, Setúbal, Barreiro","Artigo 20.º, n.º 1, alínea a) do Código dos Contratos Públicos","","","","",,Não aplicável.,Não aplicável.,FALSE
40002/2018 DM de Emergência,Ajuste Direto Regime Geral,Aquisição de bens móveis,"33140000-3, Material médico de consumo","CHBM - Centro Hospital Barreiro Montijo, EPE (509186998)","BIOSONDA-COM.MAT.HOSPITALAR, (501463313)","1.128,00 €",01-03-2018,26-01-2018,365 dias,"Portugal, Setúbal, Barreiro","Artigo 20.º, n.º 1, alínea a) do Código dos Contratos Públicos","","","","",,Não aplicável.,Não aplicável.,FALSE
40008/2018 DM Entubação,Ajuste Direto Regime Geral,Aquisição de bens móveis,"33141641-5, Sondas","CHBM - Centro Hospital Barreiro Montijo, EPE (509186998)","INTERSURGICAL PORTUGAL,LDA. (503480045)","5.900,68 €",01-03-2018,15-01-2018,365 dias,"Portugal, Setúbal, Barreiro","Artigo 20.º, n.º 1, alínea a) do Código dos Contratos Públicos","","","","",,Não aplicável.,Não aplicável.,FALSE
40008/2018 DM Entubação,Ajuste Direto Regime Geral,Aquisição de bens móveis,"33141641-5, Sondas","CHBM - Centro Hospital Barreiro Montijo, EPE (509186998)","ANASTACIO SALDANHA UNIPESSOAL, LDA. (505804441)","5.159,00 €",01-03-2018,15-01-2018,365 dias,"Portugal, Setúbal, Barreiro","Artigo 20.º, n.º 1, alínea a) do Código dos Contratos Públicos","","","","",,Não aplicável.,Não aplicável.,FALSE
40008/2018 DM Entubação,Ajuste Direto Regime Geral,Aquisição de bens móveis,"33141641-5, Sondas","CHBM - Centro Hospital Barreiro Montijo, EPE (509186998)","TELEFLEX MEDICAL, SAU (EX-ARROW IBÉRICA,  SA) (980249783)","1.015,00 €",01-03-2018,15-01-2018,365 dias,"Portugal, Setúbal, Barreiro","Artigo 20.º, n.º 1, alínea a) do Código dos Contratos Públicos","","","","",,Não aplicável.,Não aplicável.,FALSE
40008/2018 DM Entubação,Ajuste Direto Regime Geral,Aquisição de bens móveis,"33141641-5, Sondas","CHBM - Centro Hospital Barreiro Montijo, EPE (509186998)",H.R.-PRODUTOS QUIMICOS LDA (501895558),"1.135,11 €",01-03-2018,15-01-2018,365 dias,"Portugal, Setúbal, Barreiro","Artigo 20.º, n.º 1, alínea a) do Código dos Contratos Públicos","","","","",,Não aplicável.,Não aplicável.,FALSE
40008/2018 DM Entubação,Ajuste Direto Regime Geral,Aquisição de bens móveis,"33141641-5, Sondas","CHBM - Centro Hospital Barreiro Montijo, EPE (509186998)",OVERPHARMA (505792362),"3.099,99 €",01-03-2018,15-01-2018,365 dias,"Portugal, Setúbal, Barreiro","Artigo 20.º, n.º 1, alínea a) do Código dos Contratos Públicos","","","","",,Não aplicável.,Não aplicável.,FALSE
40008/2018 DM Entubação,Ajuste Direto Regime Geral,Aquisição de bens móveis,"33141641-5, Sondas","CHBM - Centro Hospital Barreiro Montijo, EPE (509186998)","VYGON PORTUGAL, LDA (503232785)","159,55 €",01-03-2018,15-01-2018,365 dias,"Portugal, Setúbal, Barreiro","Artigo 20.º, n.º 1, alínea a) do Código dos Contratos Públicos","","","","",,Não aplicável.,Não aplicável.,FALSE
40008/2018 DM Entubação,Ajuste Direto Regime Geral,Aquisição de bens móveis,"33141641-5, Sondas","CHBM - Centro Hospital Barreiro Montijo, EPE (509186998)",SMITH MEDICAL (507445937),"114,00 €",01-03-2018,15-01-2018,365 dias,"Portugal, Setúbal, Barreiro","Artigo 20.º, n.º 1, alínea a) do Código dos Contratos Públicos","","","","",,Não aplicável.,Não aplicável.,FALSE
40008/2018 DM Entubação,Ajuste Direto Regime Geral,Aquisição de bens móveis,"33141641-5, Sondas","CHBM - Centro Hospital Barreiro Montijo, EPE (509186998)","MEDTRONIC PORTUGAL, LDA. (504223933)","1.216,47 €",01-03-2018,15-01-2018,365 dias,"Portugal, Setúbal, Barreiro","Artigo 20.º, n.º 1, alínea a) do Código dos Contratos Públicos","","","","",,Não aplicável.,Não aplicável.,FALSE
FI0693/2017 - RITUXIMAB 500 MG (TRUXIMA) PÓ SOL INJ,Ao abrigo de acordo-quadro (art.º 259.º),Aquisição de bens móveis,"33600000-6, Produtos farmacêuticos","Centro Hospitalar Barreiro Montijo, E. P. E. (509186998)","PHARMAKERN PORTUGAL-PROD. FARMAC., LDA (507002571)","14.200,00 €",01-03-2018,27-12-2017,60 dias,"Portugal, Setúbal, Barreiro",Artigo 259.º do Código dos Contratos Públicos,29-12-2017,"14.200,00 €","","",,1771819,CP 2015/6 - Acordo quadro para o fornecimento de Medicamentos do Foro Oncológico,FALSE
"FI0152/2017 - PREDNISOLONA 20 MG COMP., PREDNISOLONA 5 ML COMP",Ao abrigo de acordo-quadro (art.º 259.º),Aquisição de bens móveis,"33600000-6, Produtos farmacêuticos","Centro Hospitalar Barreiro Montijo, E. P. E. (509186998)",ANGELINI FARMACEUTICA (500583650),"52,56 €",01-03-2018,11-12-2017,60 dias,"Portugal, Setúbal, Barreiro",Artigo 259.º do Código dos Contratos Públicos,14-12-2017,"52,56 €","","",,1415640,CP 2015/7 - ACORDO QUADRO PARA FORNECIMENTO DE HORMONAS E OUTROS MEDICAMENTOS USADOS NO TRATAMENTO DAS DOENÇAS ENDÓCRINAS ÀS INSTITUIÇÕES E SERVIÇOS DO SERVIÇO NACIONAL DE SAÚDE,FALSE
FI0232/2017 - PENSO DE MEL AMORFO ( GEL/PASTA),Ao abrigo de acordo-quadro (art.º 259.º),Aquisição de bens móveis,"33600000-6, Produtos farmacêuticos","Centro Hospitalar Barreiro Montijo, E. P. E. (509186998)",QUEENLABS-ESPEC FARMACÊUTICAS LDA (503984485),"132,42 €",01-03-2018,18-12-2017,60 dias,"Portugal, Setúbal, Barreiro",Artigo 259.º do Código dos Contratos Públicos,21-12-2017,"132,42 €","","",,1315192,Acordo Quadro para fornecimento de material de penso de efeito terapêutico às Instituições e Serviços do Serviço Nacional de Saúde,FALSE
FI0616/2017 - LIDOCAINA 2% (20 MG/GR) BISNAGA GELE,Ao abrigo de acordo-quadro (art.º 259.º),Aquisição de bens móveis,"33600000-6, Produtos farmacêuticos","Centro Hospitalar Barreiro Montijo, E. P. E. (509186998)","SIDEFARMA-SOC. IND. EXPANSÃO FARMACEUTICA, SA (500717419)","750,00 €",01-03-2018,30-11-2017,60 dias,"Portugal, Setúbal, Barreiro",Artigo 259.º do Código dos Contratos Públicos,30-11-2017,"750,00 €","","",,1370278,CP 2015/51 - Acordo quadro para fornecimento de medicamentos usados nas afeções cutâneas às instituições e serviços do serviço nacional de saúde,FALSE
