freguesia,acronym,validVotesPercentage,votes,dicofre
Rosmaninhal,PS,64.67,97,050512
Rosmaninhal,PPD/PSD.CDS-PP,22,33,050512
Rosmaninhal,PCP-PEV,4.67,7,050512
Rosmaninhal,B.E.,2.67,4,050512
Rosmaninhal,PPM,2.67,4,050512
Rosmaninhal,MPT,2,3,050512
Rosmaninhal,PCTP/MRPP,1.33,2,050512
Rosmaninhal,L,0,0,050512
Rosmaninhal,MAS,0,0,050512
Rosmaninhal,PAN,0,0,050512
Rosmaninhal,PDA,0,0,050512
Rosmaninhal,PND,0,0,050512
Rosmaninhal,PNR,0,0,050512
Rosmaninhal,POUS,0,0,050512
Rosmaninhal,PPV,0,0,050512
Rosmaninhal,PTP,0,0,050512
