freguesia,acronym,validVotesPercentage,votes,dicofre
São João da Boa Vista,PS,59.51,122,061612
São João da Boa Vista,PPD/PSD,18.54,38,061612
São João da Boa Vista,B.E.,11.22,23,061612
São João da Boa Vista,PAN,4.88,10,061612
São João da Boa Vista,PCP-PEV,2.93,6,061612
São João da Boa Vista,R.I.R.,1.46,3,061612
São João da Boa Vista,CDS-PP,0.98,2,061612
São João da Boa Vista,PCTP/MRPP,0.49,1,061612
São João da Boa Vista,A,0,0,061612
São João da Boa Vista,CH,0,0,061612
São João da Boa Vista,IL,0,0,061612
São João da Boa Vista,JPP,0,0,061612
São João da Boa Vista,L,0,0,061612
São João da Boa Vista,MAS,0,0,061612
São João da Boa Vista,MPT,0,0,061612
São João da Boa Vista,NC,0,0,061612
São João da Boa Vista,PDR,0,0,061612
São João da Boa Vista,PNR,0,0,061612
São João da Boa Vista,PPM,0,0,061612
São João da Boa Vista,PURP,0,0,061612
