Objeto do Contrato,Tipo de Procedimento,Tipo(s) de Contrato,CPVs,Entidade(s) Adjudicante(s),Entidade(s) Adjudicatária(s),Preço Contratual,Data de Publicação,Data de Celebração do Contrato,Prazo de Execução,Local de Execução,Fundamentação,Data de Fecho do Contrato,Preço Total Efetivo,Causas das Alterações ao Prazo,Causas das Alterações ao Preço,Estado,N.º registo do Acordo Quadro,Descrição do Acordo Quadro,Procedimento Centralizado
Software RHVnet,Ajuste Direto Regime Geral,Aquisição de bens móveis,"30000000-9, Máquinas, equipamento e material de escritório e de informática, excepto mobiliário e pacotes de programas (software)",Centro de Medicina de Reabilitação da Região Centro - Rovisco Pais (503767336),Advancing TO (506002144),"9.645,00 €",30-09-2015,10-01-2014,365 dias,"Portugal, Coimbra, Cantanhede","Artigo 26.º, n.º 1, alínea a) do Código dos Contratos Públicos",31-12-2014,"9.645,00 €",,,,Não aplicável.,Não aplicável.,FALSE
Água de mesa,Ajuste Direto Regime Geral,Aquisição de bens móveis,"15981100-9, Água mineral não gaseificada",Centro de Medicina de Reabilitação da Região Centro - Rovisco Pais (503767336),"CAT, CRL (500335710)","5.418,00 €",29-09-2015,23-01-2014,90 dias,"Portugal, Coimbra, Cantanhede","Artigo 26.º, n.º 1, alínea a) do Código dos Contratos Públicos",13-05-2014,"5.418,00 €",,,,Não aplicável.,Não aplicável.,FALSE
acordo de cooperação julho a dezembro,Ajuste Direto Regime Geral,Aquisição de serviços,"75100000-7, Serviços relacionados com a administração pública",Centro de Medicina de Reabilitação da Região Centro - Rovisco Pais (503767336),"UNIDADE LOCAL DE SAUDE DO NORDESTE, EPE (509932584)","9.509,48 €",28-09-2015,01-07-2014,180 dias,"Portugal, Coimbra, Cantanhede","Artigo 27.º, n.º 1, alínea a) do Código dos Contratos Públicos",31-12-2014,"9.509,48 €",,,,Não aplicável.,Não aplicável.,FALSE
