freguesia,acronym,validVotesPercentage,votes,dicofre
Pedrógão Grande,PS,35.36,198,101302
Pedrógão Grande,PPD/PSD,33.21,186,101302
Pedrógão Grande,B.E.,6.43,36,101302
Pedrógão Grande,PAN,5.54,31,101302
Pedrógão Grande,CDS-PP,4.64,26,101302
Pedrógão Grande,PPM.PPV/CDC,4.64,26,101302
Pedrógão Grande,A,2.5,14,101302
Pedrógão Grande,PCP-PEV,2.32,13,101302
Pedrógão Grande,PURP,1.07,6,101302
Pedrógão Grande,L,0.89,5,101302
Pedrógão Grande,PCTP/MRPP,0.89,5,101302
Pedrógão Grande,PDR,0.89,5,101302
Pedrógão Grande,IL,0.54,3,101302
Pedrógão Grande,MAS,0.36,2,101302
Pedrógão Grande,NC,0.36,2,101302
Pedrógão Grande,PNR,0.36,2,101302
Pedrógão Grande,PTP,0,0,101302
