freguesia,acronym,validVotesPercentage,votes,dicofre
União das freguesias de Souto e Tabaçô,PPD/PSD,36.58,109,160162
União das freguesias de Souto e Tabaçô,PS,24.16,72,160162
União das freguesias de Souto e Tabaçô,PDR,22.82,68,160162
União das freguesias de Souto e Tabaçô,B.E.,4.03,12,160162
União das freguesias de Souto e Tabaçô,CDS-PP,3.69,11,160162
União das freguesias de Souto e Tabaçô,PAN,2.68,8,160162
União das freguesias de Souto e Tabaçô,A,1.34,4,160162
União das freguesias de Souto e Tabaçô,PNR,1.01,3,160162
União das freguesias de Souto e Tabaçô,PCTP/MRPP,0.67,2,160162
União das freguesias de Souto e Tabaçô,PPM.PPV/CDC,0.67,2,160162
União das freguesias de Souto e Tabaçô,PURP,0.67,2,160162
União das freguesias de Souto e Tabaçô,IL,0.34,1,160162
União das freguesias de Souto e Tabaçô,L,0.34,1,160162
União das freguesias de Souto e Tabaçô,NC,0.34,1,160162
União das freguesias de Souto e Tabaçô,PCP-PEV,0.34,1,160162
União das freguesias de Souto e Tabaçô,PTP,0.34,1,160162
União das freguesias de Souto e Tabaçô,MAS,0,0,160162
