Objeto do Contrato,Tipo de Procedimento,Tipo(s) de Contrato,CPVs,Entidade(s) Adjudicante(s),Entidade(s) Adjudicatária(s),Preço Contratual,Data de Publicação,Data de Celebração do Contrato,Prazo de Execução,Local de Execução,Fundamentação,Data de Fecho do Contrato,Preço Total Efetivo,Causas das Alterações ao Prazo,Causas das Alterações ao Preço,Estado,N.º registo do Acordo Quadro,Descrição do Acordo Quadro,Procedimento Centralizado
Prestação de serviços de seguro de frota,Ajuste Direto Regime Geral,Aquisição de serviços,"66510000-8, Serviços de seguros","Unidade Local de Saúde de Matosinhos, E. P. E. (506361390)",Luis Ferraz-Corretores de Seguros Lda. (502616326),"5.425,28 €",02-03-2017,30-11-2016,365 dias,"Portugal, Porto, Matosinhos","Artigo 20.º, n.º 1, alínea a) do Código dos Contratos Públicos","","",,,,Não aplicável.,Não aplicável.,FALSE
Contratação de veículo tipo Tuk Tuk à ULSM,Ajuste Direto Regime Geral,Aquisição de serviços,"60100000-9, Serviços de transporte rodoviário","Unidade Local de Saúde de Matosinhos, E. P. E. (506361390)",ECOLOTOURS-TURISMO LDA (510330096),"28.750,00 €",02-03-2017,01-01-2017,365 dias,"Portugal, Porto, Matosinhos","Artigo 20.º, n.º 1, alínea a) do Código dos Contratos Públicos","","",,,,Não aplicável.,Não aplicável.,FALSE
Crizotinib 200mg,Ajuste Direto Regime Geral,Aquisição de bens móveis,"33600000-6, Produtos farmacêuticos","Unidade Local de Saúde de Matosinhos, E. P. E. (506361390)",PFIZER BIOFARMACEUTICA SOC UNIPESSOAL LDA (513300376),"68.264,59 €",02-03-2017,16-02-2017,306 dias,"Portugal, Porto, Matosinhos","Artigo 24.º, n.º 1, alínea e) do Código dos Contratos Públicos","","",,,,Não aplicável.,Não aplicável.,FALSE
Aquisição de perneiras para cama de parto,Ajuste Direto Regime Geral,Aquisição de bens móveis,"33192120-9, Camas de hospital","Unidade Local de Saúde de Matosinhos, E. P. E. (506361390)","Iberdata Equipamentos, SA (501904921)","5.658,66 €",01-03-2017,18-01-2017,45 dias,"Portugal, Porto, Matosinhos","Artigo 20.º, n.º 1, alínea a) do Código dos Contratos Públicos",07-02-2017,"5.658,66 €",,,,Não aplicável.,Não aplicável.,FALSE
Ramucirumab 10 mg/10ml,Ajuste Direto Regime Geral,Aquisição de bens móveis,"33600000-6, Produtos farmacêuticos","Unidade Local de Saúde de Matosinhos, EPE (ULSM) (506361390)",LILLY PORTUGAL - PRODUTOS FARMACEUTICOS LDA (500165602),"29.900,00 €",22-02-2017,22-02-2017,365 dias,"Portugal, Porto, Matosinhos","Artigo 24.º, n.º 1, alínea e) do Código dos Contratos Públicos","","",,,,Não aplicável.,Não aplicável.,FALSE
