freguesia,acronym,validVotesPercentage,votes,dicofre
Landim,PS,43.2,610,031221
Landim,PPD/PSD,34.42,486,031221
Landim,B.E.,8.5,120,031221
Landim,CDS-PP,4.39,62,031221
Landim,PAN,2.76,39,031221
Landim,PCP-PEV,2.55,36,031221
Landim,R.I.R.,0.85,12,031221
Landim,L,0.71,10,031221
Landim,A,0.5,7,031221
Landim,IL,0.5,7,031221
Landim,CH,0.35,5,031221
Landim,MPT,0.28,4,031221
Landim,PDR,0.21,3,031221
Landim,NC,0.14,2,031221
Landim,PCTP/MRPP,0.14,2,031221
Landim,PNR,0.14,2,031221
Landim,PPM,0.14,2,031221
Landim,PTP,0.14,2,031221
Landim,MAS,0.07,1,031221
Landim,JPP,0,0,031221
Landim,PURP,0,0,031221
