freguesia,acronym,validVotesPercentage,votes,dicofre
Arranhó,PPD/PSD.CDS-PP,37.63,254,110201
Arranhó,PS,34.22,231,110201
Arranhó,PCP-PEV,10.22,69,110201
Arranhó,MPT,9.04,61,110201
Arranhó,B.E.,2.22,15,110201
Arranhó,PAN,1.63,11,110201
Arranhó,PCTP/MRPP,1.48,10,110201
Arranhó,L,0.89,6,110201
Arranhó,PND,0.74,5,110201
Arranhó,PPV,0.44,3,110201
Arranhó,PTP,0.44,3,110201
Arranhó,PDA,0.3,2,110201
Arranhó,PNR,0.3,2,110201
Arranhó,PPM,0.3,2,110201
Arranhó,MAS,0.15,1,110201
Arranhó,POUS,0,0,110201
