freguesia,acronym,validVotesPercentage,votes,dicofre
Caniçal,PS,55.81,946,310402
Caniçal,PPD/PSD,28.79,488,310402
Caniçal,B.E.,3.48,59,310402
Caniçal,JPP,3.48,59,310402
Caniçal,CDS-PP,3.42,58,310402
Caniçal,PAN,0.94,16,310402
Caniçal,CH,0.77,13,310402
Caniçal,PCTP/MRPP,0.59,10,310402
Caniçal,PCP-PEV,0.53,9,310402
Caniçal,PURP,0.35,6,310402
Caniçal,R.I.R.,0.35,6,310402
Caniçal,A,0.29,5,310402
Caniçal,MPT,0.29,5,310402
Caniçal,PNR,0.29,5,310402
Caniçal,IL,0.18,3,310402
Caniçal,NC,0.12,2,310402
Caniçal,PTP,0.12,2,310402
Caniçal,L,0.06,1,310402
Caniçal,PDR,0.06,1,310402
Caniçal,PPM,0.06,1,310402
