freguesia,acronym,validVotesPercentage,votes,dicofre
Rabal,PPD/PSD,51.52,51,040234
Rabal,PS,24.24,24,040234
Rabal,PCP-PEV,9.09,9,040234
Rabal,CDS-PP,7.07,7,040234
Rabal,PCTP/MRPP,3.03,3,040234
Rabal,B.E.,2.02,2,040234
Rabal,A,1.01,1,040234
Rabal,PAN,1.01,1,040234
Rabal,R.I.R.,1.01,1,040234
Rabal,CH,0,0,040234
Rabal,IL,0,0,040234
Rabal,L,0,0,040234
Rabal,NC,0,0,040234
Rabal,PDR,0,0,040234
Rabal,PNR,0,0,040234
Rabal,PPM,0,0,040234
Rabal,PTP,0,0,040234
Rabal,PURP,0,0,040234
