Objeto do Contrato,Tipo de Procedimento,Tipo(s) de Contrato,CPVs,Entidade(s) Adjudicante(s),Entidade(s) Adjudicatária(s),Preço Contratual,Data de Publicação,Data de Celebração do Contrato,Prazo de Execução,Local de Execução,Fundamentação,Data de Fecho do Contrato,Preço Total Efetivo,Causas das Alterações ao Prazo,Causas das Alterações ao Preço,Estado,N.º registo do Acordo Quadro,Descrição do Acordo Quadro,Procedimento Centralizado
Aquisição de Gases Medicinais,Ajuste Direto Regime Geral,Aquisição de bens móveis,"24100000-5, Gases","Hospital Distrital de Santarém, E. P. E. (506361462)","AIR LIQUIDE MEDICINAL, S.A  (501576436)","2.412,62 €",28-12-2017,10-11-2017,50 dias,"Portugal, Santarém, Santarém","Artigo 20.º, n.º 1, alínea a) do Código dos Contratos Públicos",,,,,,Não aplicável.,Não aplicável.,FALSE
Aquisição de Respiradores P1 e P2,Ajuste Direto Regime Geral,Aquisição de bens móveis,"33140000-3, Material médico de consumo","Hospital Distrital de Santarém, EPE (506361462)",Factor Plus (502810645),"8.075,00 €",27-12-2017,17-11-2017,40 dias,"Portugal, Santarém, Santarém","Artigo 20.º, n.º 1, alínea a) do Código dos Contratos Públicos",,,,,,Não aplicável.,Não aplicável.,FALSE
Aquisição de Jogo Tubos Flexiv. Histero-Pump,Ajuste Direto Regime Geral,Aquisição de bens móveis,"33140000-3, Material médico de consumo","Hospital Distrital de Santarém, EPE (506361462)","GRUPO TAPER - EQUIPAMENTOS DE PRECISÃO CIENTIFICA, LDA  (506886336)","844,00 €",27-12-2017,10-11-2017,45 dias,"Portugal, Santarém, Santarém","Artigo 20.º, n.º 1, alínea a) do Código dos Contratos Públicos",,,,,,Não aplicável.,Não aplicável.,FALSE
Suturas Mecânicas,Ajuste Direto Regime Geral,Aquisição de bens móveis,"33140000-3, Material médico de consumo","Hospital Distrital de Santarém, E. P. E. (506361462)",Medtronic Portugal (504223933),"60.660,00 €",27-12-2017,24-10-2017,120 dias,"Portugal, Santarém, Santarém","Artigo 24.º, n.º 1, alínea a) do Código dos Contratos Públicos",,,,,,Não aplicável.,Não aplicável.,FALSE
Aquisição e Instalação  Equipamento Anatomia Patológica,Concurso público,Aquisição de bens móveis,"38000000-5, Equipamento laboratorial, óptico e de precisão (exc. óculos)","Hospital Distrital de Santarém, E. P. E. (506361462)","Enzifarma,SA (503636975)","10.100,00 €",27-12-2017,05-12-2017,30 dias,"Portugal, Santarém, Santarém","Artigo 20.º, n.º 1, alínea b) do Código dos Contratos Públicos",,,,,,Não aplicável.,Não aplicável.,FALSE
Aquisição Pensos p/ Queimados 40x60,Ajuste Direto Regime Geral,Aquisição de bens móveis,"33141110-4, Pensos","Hospital Distrital de Santarém, EPE (506361462)","DOCWORLD, LDA (508592909)","2.400,00 €",22-12-2017,21-11-2017,40 dias,"Portugal, Santarém, Santarém","Artigo 20.º, n.º 1, alínea a) do Código dos Contratos Públicos",,,,,,Não aplicável.,Não aplicável.,FALSE
Aquisição de Películas Radiográficas para Impressora Lazer Dryview,Ajuste Direto Regime Geral,Aquisição de bens móveis,"32354110-3, Películas radiográficas","Hospital Distrital de Santarém, EPE (506361462)",Carestream Health Portugal Lda (508054320),"2.943,72 €",22-12-2017,17-11-2017,40 dias,"Portugal, Santarém, Santarém","Artigo 26.º, n.º 1, alínea a) do Código dos Contratos Públicos",,,,,,Não aplicável.,Não aplicável.,FALSE
