Objeto do Contrato,Tipo de Procedimento,Tipo(s) de Contrato,CPVs,Entidade(s) Adjudicante(s),Entidade(s) Adjudicatária(s),Preço Contratual,Data de Publicação,Data de Celebração do Contrato,Prazo de Execução,Local de Execução,Fundamentação,Data de Fecho do Contrato,Preço Total Efetivo,Causas das Alterações ao Prazo,Causas das Alterações ao Preço,Estado,N.º registo do Acordo Quadro,Descrição do Acordo Quadro,Procedimento Centralizado
AD 277/2015 - Aquisição de Testes Psicológicos para os ACES,Ajuste Direto Regime Geral,Aquisição de bens móveis,"33156000-8, Material para testes psicológicos","Administração Regional de Saúde do Algarve, I. P. (503148709)","Edipsico - Edições e Investigação em Psicologia, Lda. (503466085)","480,54 €",01-10-2015,22-09-2015,92 dias,"Portugal, Faro, Faro","Artigo 20.º, n.º 1, alínea a) do Código dos Contratos Públicos",26-10-2015,"480,54 €",Quantidades fornecidas - pagamento efetuado,"",,Não aplicável.,Não aplicável.,FALSE
AD 277/2015 - Aquisição de Testes Psicológicos para os ACES,Ajuste Direto Regime Geral,Aquisição de bens móveis,"33156000-8, Material para testes psicológicos","Administração Regional de Saúde do Algarve, I. P. (503148709)","C.E.G.O.C. - T.E.A., Lda. (500059918)","4.368,79 €",01-10-2015,22-09-2015,92 dias,"Portugal, Faro, Faro","Artigo 20.º, n.º 1, alínea a) do Código dos Contratos Públicos",28-10-2015,"4.368,79 €",Quantidades fornecidas - pagamento efetuado,"",,Não aplicável.,Não aplicável.,FALSE
SC/249/2015 - Aquisição de Lancetas,Ao abrigo de acordo-quadro (art.º 259.º),Aquisição de bens móveis,"33141900-9, Lancetas para sangria","Administração Regional de Saúde do Algarve, I. P. (503148709)",Iberlab & Imunoreage (503406694),"1.080,00 €",01-10-2015,25-08-2015,92 dias,"Portugal, Faro, Faro",Artigo 259.º do Código dos Contratos Públicos,"","","","",,611510,"CONCURSO PÚBLICO PARA A CELEBRAÇÃO DE CONTRATOS PÚBLICOS DE APROVISIONAMENTO PARA A ÁREA DA SAÚDE, COM VISTA AO FORNECIMENTO DE MATERIAL DE PREVENÇÃO E DETEÇÃO HIV ÀS INSTITUIÇÕES E SERVIÇOS DO SERVIÇO NACIONAL DE SAÚDE",FALSE
SC/249/2015 - Aquisição de Lancetas,Ao abrigo de acordo-quadro (art.º 259.º),Aquisição de bens móveis,"33141900-9, Lancetas para sangria","Administração Regional de Saúde do Algarve, I. P. (503148709)",Sarstedt (503019461),"2.820,48 €",01-10-2015,25-08-2015,92 dias,"Portugal, Faro, Faro",Artigo 259.º do Código dos Contratos Públicos,"","","","",,611510,"CONCURSO PÚBLICO PARA A CELEBRAÇÃO DE CONTRATOS PÚBLICOS DE APROVISIONAMENTO PARA A ÁREA DA SAÚDE, COM VISTA AO FORNECIMENTO DE MATERIAL DE PREVENÇÃO E DETEÇÃO HIV ÀS INSTITUIÇÕES E SERVIÇOS DO SERVIÇO NACIONAL DE SAÚDE",FALSE
Manutenção e Assistência Técnica ao Software PACS SYNAPSE,Ajuste Direto Regime Geral,Aquisição de serviços,"72261000-2, Serviços de assistência em matéria de software","Administração Regional de Saúde do Algarve, I. P. (503148709)",FUJIFILM EUROPE GMBH (980456517),"26.480,00 €",01-10-2015,04-09-2015,365 dias,"Portugal, Faro, Faro","Artigo 24.º, n.º 1, alínea e) do Código dos Contratos Públicos",22-12-2015,"26.480,00 €","","",,Não aplicável.,Não aplicável.,FALSE
AD 225/2015 - Aquisição de sacos de plástico para o ano de 2015,Ajuste Direto Regime Geral,Aquisição de bens móveis,"19640000-4, Sacos de polietileno para recolha de lixo e resíduos","Administração Regional de Saúde do Algarve, I. P. (503148709)","Plasticolors - Transformação de Matérias Plásticas, Lda. (504183346)","630,50 €",30-09-2015,28-09-2015,94 dias,"Portugal, Faro, Faro","Artigo 20.º, n.º 1, alínea a) do Código dos Contratos Públicos",31-12-2015,"630,50 €","","",,Não aplicável.,Não aplicável.,FALSE
AD 225/2015 - Aquisição de sacos de plástico para o ano de 2015,Ajuste Direto Regime Geral,Aquisição de bens móveis,"19640000-4, Sacos de polietileno para recolha de lixo e resíduos","Administração Regional de Saúde do Algarve, I. P. (503148709)","JBSHIGI, LDA (513110461)","15.871,00 €",30-09-2015,28-09-2015,94 dias,"Portugal, Faro, Faro","Artigo 20.º, n.º 1, alínea a) do Código dos Contratos Públicos",31-12-2015,"15.871,00 €","","",,Não aplicável.,Não aplicável.,FALSE
SC/115/2015 - Aquisição de Medicamentos Gerais.3,Ao abrigo de acordo-quadro (art.º 259.º),Aquisição de bens móveis,"33690000-3, Medicamentos vários","Administração Regional de Saúde do Algarve, I. P. (503148709)","Merck Sharp & Dohme, Lda. (500191360)","1.141,03 €",29-09-2015,29-09-2015,93 dias,"Portugal, Faro, Faro",Artigo 259.º do Código dos Contratos Públicos,01-12-2015,"971,41 €","",Quantidades Fornecidas,,1179911,"CONCURSO PÚBLICO PARA A CELEBRAÇÃO DE CONTRATOS PÚBLICOS DE APROVISIONAMENTO PARA A ÁREA DA SAÚDE, MEDICAMENTOS DO SISTEMA NERVOSO CEREBROSPINAL, EXCETO: ANESTÉSICOS, RELAXANTES MUSCULARES, ANALGÉSICOS, ANTIPIRÉTICOS, ANTIDEPRESSORES E ANTIPSICÓTICOS, ÀS INSTITUIÇÕES E SERVIÇOS DO SERVIÇO NACIONAL DE SAÚDE",FALSE
SC/239/2015 - Aquisição de Medicamentos Gerais.12,Ao abrigo de acordo-quadro (art.º 259.º),Aquisição de bens móveis,"33690000-3, Medicamentos vários","Administração Regional de Saúde do Algarve, I. P. (503148709)","Labesfal - Laboratórios Almiro, S.A. (501169580)","3.323,95 €",28-09-2015,28-09-2015,94 dias,"Portugal, Faro, Faro",Artigo 259.º do Código dos Contratos Públicos,10-11-2015,"3.220,55 €","",Quantidades fornecidas,,611371,"CONCURSO PÚBLICO PARA A CELEBRAÇÃO DE CONTRATOS PÚBLICOS DE APROVISIONAMENTO PARA A ÁREA DA SAÚDE, COM VISTA AO FORNECIMENTO DE MEDICAMENTOS ANESTÉSICOS E RELAXANTES MUSCULARES, ÀS INSTITUIÇÕES E SERVIÇOS DO SERVIÇO NACIONAL DE SAÚDE    ",FALSE
AD 189/2015 - Aquisição de filtros e outro material de laboratório,Ajuste Direto Regime Geral,Aquisição de bens móveis,"33696500-0, Reagentes de laboratório","Administração Regional de Saúde do Algarve, I. P. (503148709)",Interface - Equipamento e Tecnica Lda (501379860),"1.910,00 €",25-09-2015,25-09-2015,91 dias,"Portugal, Faro, Faro","Artigo 20.º, n.º 1, alínea a) do Código dos Contratos Públicos",31-12-2015,"1.910,00 €","","",,Não aplicável.,Não aplicável.,FALSE
AD 261/2015 - Aquisição de Escalas de Avaliação para os ACES,Ajuste Direto Regime Geral,Aquisição de bens móveis,"33156000-8, Material para testes psicológicos","Administração Regional de Saúde do Algarve, I. P. (503148709)","CEGOC - TEA, LDA (500059918)","17.291,73 €",22-09-2015,09-09-2015,52 dias,"Portugal, Faro, Faro","Artigo 20.º, n.º 1, alínea a) do Código dos Contratos Públicos",26-10-2015,"17.291,73 €",Quantidades fornecidas - pagamento efetuado,"",,Não aplicável.,Não aplicável.,FALSE
