freguesia,acronym,validVotesPercentage,votes,dicofre
União das freguesias de Ancede e Ribadouro,PS,55.14,595,130221
União das freguesias de Ancede e Ribadouro,PPD/PSD,27.34,295,130221
União das freguesias de Ancede e Ribadouro,B.E.,5.19,56,130221
União das freguesias de Ancede e Ribadouro,CDS-PP,2.78,30,130221
União das freguesias de Ancede e Ribadouro,R.I.R.,1.95,21,130221
União das freguesias de Ancede e Ribadouro,PAN,1.58,17,130221
União das freguesias de Ancede e Ribadouro,PCP-PEV,1.39,15,130221
União das freguesias de Ancede e Ribadouro,PCTP/MRPP,1.2,13,130221
União das freguesias de Ancede e Ribadouro,CH,0.83,9,130221
União das freguesias de Ancede e Ribadouro,L,0.65,7,130221
União das freguesias de Ancede e Ribadouro,IL,0.46,5,130221
União das freguesias de Ancede e Ribadouro,PTP,0.37,4,130221
União das freguesias de Ancede e Ribadouro,PNR,0.28,3,130221
União das freguesias de Ancede e Ribadouro,A,0.19,2,130221
União das freguesias de Ancede e Ribadouro,NC,0.19,2,130221
União das freguesias de Ancede e Ribadouro,JPP,0.09,1,130221
União das freguesias de Ancede e Ribadouro,MAS,0.09,1,130221
União das freguesias de Ancede e Ribadouro,MPT,0.09,1,130221
União das freguesias de Ancede e Ribadouro,PDR,0.09,1,130221
União das freguesias de Ancede e Ribadouro,PURP,0.09,1,130221
União das freguesias de Ancede e Ribadouro,PPM,0,0,130221
