freguesia,acronym,validVotesPercentage,votes,dicofre
Macieira de Sarnes,PS,42.84,431,011305
Macieira de Sarnes,PPD/PSD,28.73,289,011305
Macieira de Sarnes,B.E.,14.41,145,011305
Macieira de Sarnes,PCP-PEV,5.47,55,011305
Macieira de Sarnes,PAN,3.68,37,011305
Macieira de Sarnes,CDS-PP,2.49,25,011305
Macieira de Sarnes,PCTP/MRPP,0.4,4,011305
Macieira de Sarnes,R.I.R.,0.4,4,011305
Macieira de Sarnes,CH,0.3,3,011305
Macieira de Sarnes,PPM,0.3,3,011305
Macieira de Sarnes,IL,0.2,2,011305
Macieira de Sarnes,NC,0.2,2,011305
Macieira de Sarnes,PDR,0.2,2,011305
Macieira de Sarnes,A,0.1,1,011305
Macieira de Sarnes,L,0.1,1,011305
Macieira de Sarnes,MPT,0.1,1,011305
Macieira de Sarnes,PURP,0.1,1,011305
Macieira de Sarnes,JPP,0,0,011305
Macieira de Sarnes,PNR,0,0,011305
Macieira de Sarnes,PTP,0,0,011305
