Objeto do Contrato,Tipo de Procedimento,Tipo(s) de Contrato,CPVs,Entidade(s) Adjudicante(s),Entidade(s) Adjudicatária(s),Preço Contratual,Data de Publicação,Data de Celebração do Contrato,Prazo de Execução,Local de Execução,Fundamentação,Data de Fecho do Contrato,Preço Total Efetivo,Causas das Alterações ao Prazo,Causas das Alterações ao Preço,Estado,N.º registo do Acordo Quadro,Descrição do Acordo Quadro,Procedimento Centralizado
Consumo de energia na Instituição,Ajuste Direto Regime Geral,Aquisição de serviços,"65000000-3, Serviços públicos",Centro de Medicina de Reabilitação da Região Centro - Rovisco Pais (503767336),"EDP-Comercial-Comercialização de Energia, S.A. (503504564)","7.826,80 €",06-06-2013,02-01-2013,30 dias,"Portugal, Coimbra, Cantanhede","Artigo 27.º, n.º 1, alínea a) do Código dos Contratos Públicos",,,,,,Não aplicável.,Não aplicável.,
"Gas a granel, maio/2013",Ajuste Direto Regime Geral,Aquisição de serviços,"76000000-3, Serviços relacionados com as indústrias do gás e do petróleo",Centro de Medicina de Reabilitação da Região Centro - Rovisco Pais (503767336),"Petroleos de Portugal, Petrogal S.A. (500697370)","6.959,60 €",06-06-2013,02-01-2013,30 dias,"Portugal, Coimbra, Cantanhede","Artigo 27.º, n.º 1, alínea a) do Código dos Contratos Públicos",,,,,,Não aplicável.,Não aplicável.,
