Objeto do Contrato,Tipo de Procedimento,Tipo(s) de Contrato,CPVs,Entidade(s) Adjudicante(s),Entidade(s) Adjudicatária(s),Preço Contratual,Data de Publicação,Data de Celebração do Contrato,Prazo de Execução,Local de Execução,Fundamentação,Data de Fecho do Contrato,Preço Total Efetivo,Causas das Alterações ao Prazo,Causas das Alterações ao Preço,Estado,N.º registo do Acordo Quadro,Descrição do Acordo Quadro,Procedimento Centralizado
"P259-2018-100 Aquisição Medicamentos CP 2015/47, 2015/7, 2016/18, 2017/6 e 2017/61 para instituições do SNS.",Ao abrigo de acordo-quadro (art.º 259.º),Aquisição de bens móveis,"33600000-6, Produtos farmacêuticos","Centro Hospitalar Cova da Beira, EPE (506361659)","Fresenius Kabi Pharma Portugal, Lda. (504293753)","1.551,96 €",07-09-2018,27-08-2018,122 dias,"Portugal, Castelo Branco, Covilhã",Artigo 259.º do Código dos Contratos Públicos,,,,,,1410779,CP 2015/47 - Acordo quadro para fornecimento de medicamentos do aparelho locomotor às instituições e serviços do serviço nacional de saúde,TRUE
"P259-2018-100 Aquisição Medicamentos CP 2015/47, 2015/7, 2016/18, 2017/6 e 2017/61 para instituições do SNS.",Ao abrigo de acordo-quadro (art.º 259.º),Aquisição de bens móveis,"33600000-6, Produtos farmacêuticos","Centro Hospitalar Cova da Beira, EPE (506361659)","Novartis Farma - Produtos Farmacêuticos, S.A. (500268215)","74.831,48 €",07-09-2018,27-08-2018,153 dias,"Portugal, Castelo Branco, Covilhã","Artigo 24.º, n.º 1, alínea e), subalínea i) do Código dos Contratos Públicos",,,,,,1410779,CP 2015/47 - Acordo quadro para fornecimento de medicamentos do aparelho locomotor às instituições e serviços do serviço nacional de saúde,TRUE
"AD-2018-54 - Ajuste Direto para Aquisição do Medicamento U20 - USTECINUMAB [45 MG/ 0,5 ML; SOL INJ; SERINGA] para as Instituições do Serviço Nacional de Saúde",Ajuste Direto Regime Geral,Aquisição de bens móveis,"33600000-6, Produtos farmacêuticos","Centro Hospitalar Cova da Beira, E. P. E. (506361659)","Janssen-Cilag Farmacêutica, Lda. (500189412)","48.891,80 €",07-09-2018,27-08-2018,122 dias,Portugal,"Artigo 24.º, n.º 1, alínea e), subalínea iii) do Código dos Contratos Públicos",,,,,,Não aplicável.,Não aplicável.,TRUE
P259-2018-75 - Aquisição Centralizada de Medicamentos  nos termos do Despacho n.º 1571-B/2016.,Ao abrigo de acordo-quadro (art.º 259.º),Aquisição de bens móveis,"33600000-6, Produtos farmacêuticos","Centro Hospitalar Cova da Beira, E. P. E. (506361659)","Octapharma - produtos Farmacêuticos, Lda. (502820780)","180.087,60 €",07-09-2018,27-08-2018,122 dias,"Portugal, Castelo Branco, Covilhã","Artigo 24.º, n.º 1, alínea e), subalínea i) do Código dos Contratos Públicos",,,,,,2800702,CP 2017/9 - Acordo quadro para fornecimento de Derivados do Plasma Humano às Instituições e Serviços do Serviço Nacional de Saúde,FALSE
CONVITE À APRESENTAÇÃO DE PROPOSTA ao fornecedor com o qual tenha sido homologado CPA ao abrigo do ACORDO QUADRO 2016/18 - Medicamentos do grupo 4: sangue; ACORDO QUADRO 2017/61 – Medicamentos diversos e ACORDO QUADRO 2017/6 – Medicamentos do foro oncológico e imunomoduladores.,Ao abrigo de acordo-quadro (art.º 259.º),Aquisição de bens móveis,"33600000-6, Produtos farmacêuticos","Centro Hospitalar Cova da Beira, E. P. E. (506361659)","Teva Pharma - Proddutos Farmacêuticos, Lda. (507045491)","8.637,72 €",07-09-2018,27-08-2018,122 dias,Portugal,Artigo 259.º do Código dos Contratos Públicos,,,,,,2969238,"CP 2017/6 - Acordo Quadro para fornecimento de Medicamentos do Foro Oncológico e Imunomoduladores, às Instituições e Serviços do Serviço Nacional de Saúde",TRUE
CONVITE À APRESENTAÇÃO DE PROPOSTA ao fornecedor com o qual tenha sido homologado CPA ao abrigo do ACORDO QUADRO 2016/18 - Medicamentos do grupo 4: sangue; ACORDO QUADRO 2017/61 – Medicamentos diversos e ACORDO QUADRO 2017/6 – Medicamentos do foro oncológico e imunomoduladores.,Ao abrigo de acordo-quadro (art.º 259.º),Aquisição de bens móveis,"33600000-6, Produtos farmacêuticos","Centro Hospitalar Cova da Beira, E. P. E. (506361659)","Sanofi - Produtos Farmacêuticos, Lda. (500134960)","73.942,57 €",07-09-2018,27-08-2018,122 dias,Portugal,Artigo 259.º do Código dos Contratos Públicos,,,,,,2969238,"CP 2017/6 - Acordo Quadro para fornecimento de Medicamentos do Foro Oncológico e Imunomoduladores, às Instituições e Serviços do Serviço Nacional de Saúde",TRUE
CONVITE À APRESENTAÇÃO DE PROPOSTA ao fornecedor com o qual tenha sido homologado CPA ao abrigo do ACORDO QUADRO 2016/18 - Medicamentos do grupo 4: sangue; ACORDO QUADRO 2017/61 – Medicamentos diversos e ACORDO QUADRO 2017/6 – Medicamentos do foro oncológico e imunomoduladores.,Ao abrigo de acordo-quadro (art.º 259.º),Aquisição de bens móveis,"33600000-6, Produtos farmacêuticos","Centro Hospitalar Cova da Beira, E. P. E. (506361659)","Ferrer Portugal, S.A. (500069190)","1.260,60 €",07-09-2018,27-08-2018,122 dias,Portugal,Artigo 259.º do Código dos Contratos Públicos,,,,,,2969238,"CP 2017/6 - Acordo Quadro para fornecimento de Medicamentos do Foro Oncológico e Imunomoduladores, às Instituições e Serviços do Serviço Nacional de Saúde",TRUE
AD-2018-41 - Aquisição Centralizada de Medicamento E451-ETANERCEPT DOENTES EM TRATAMENTO.,Ajuste Direto Regime Geral,Aquisição de bens móveis,"33600000-6, Produtos farmacêuticos","Centro Hospitalar Cova da Beira, E. P. E. (506361659)",Biogen Portugal Sociedade Farmaceutica Unipessoal (506415740),"7.280,00 €",07-09-2018,27-08-2018,122 dias,"Portugal, Castelo Branco, Covilhã","Artigo 24.º, n.º 1, alínea e), subalínea i) do Código dos Contratos Públicos",,,,,,Não aplicável.,Não aplicável.,FALSE
"AD-2018-55 - Aquisição Centralizada de Medicamento L403 -LEUPRORRELINA (22,5Mg).",Ajuste Direto Regime Geral,Aquisição de bens móveis,"33600000-6, Produtos farmacêuticos","Centro Hospitalar Cova da Beira, E. P. E. (506361659)","ASTELLAS FARMA, LDA. (502540249)","4.487,40 €",07-09-2018,10-08-2018,153 dias,"Portugal, Castelo Branco, Covilhã","Artigo 24.º, n.º 1, alínea e), subalínea i) do Código dos Contratos Públicos",,,,,,Não aplicável.,Não aplicável.,FALSE
"P259-2018-88 - Aquisição Centralizada de Medicamentos ao abrigo do CP 2017/6, nos termos do Despacho n.º 1571-B/2016.",Ao abrigo de acordo-quadro (art.º 259.º),Aquisição de bens móveis,"33600000-6, Produtos farmacêuticos","Centro Hospitalar Cova da Beira, E. P. E. (506361659)",Astra Zeneca -  Produtos Farmacêuticos (502942240),"831,27 €",07-09-2018,10-08-2018,153 dias,"Portugal, Castelo Branco, Covilhã",Artigo 259.º do Código dos Contratos Públicos,,,,,,2969238,"CP 2017/6 - Acordo Quadro para fornecimento de Medicamentos do Foro Oncológico e Imunomoduladores, às Instituições e Serviços do Serviço Nacional de Saúde",FALSE
P259-2018-104 - Aquisição Centralizada de Medicamentos nos termos do Despacho n.º 1571-B/2016.,Ao abrigo de acordo-quadro (art.º 259.º),Aquisição de bens móveis,"33600000-6, Produtos farmacêuticos","Centro Hospitalar Cova da Beira, E. P. E. (506361659)","Merck Sharp & Dohme, Lda. (500191360)","107.724,29 €",07-09-2018,03-08-2018,153 dias,"Portugal, Castelo Branco, Covilhã",Artigo 259.º do Código dos Contratos Públicos,,,,,,2726261,"Aquisição de Medicamentos desencadeada pela SPMS, no âmbito do Despacho 1571/B de 2016, ao abrigo do Acordo Quadro 2016/40, Ref.ª P259-AC-2017-15.",FALSE
"P259-2018-90 - Aquisição Centralizada de Medicamentos ao abrigo do CP 2016/40, nos termos do Despacho n.º 1571-B/2016.",Ao abrigo de acordo-quadro (art.º 259.º),Aquisição de bens móveis,"33600000-6, Produtos farmacêuticos","Centro Hospitalar Cova da Beira, E. P. E. (506361659)","Janssen-Cilag Farmacêutica, Lda. (500189412)","39.104,19 €",07-09-2018,03-08-2018,153 dias,"Portugal, Castelo Branco, Covilhã",Artigo 259.º do Código dos Contratos Públicos,,,,,,2726261,"Aquisição de Medicamentos desencadeada pela SPMS, no âmbito do Despacho 1571/B de 2016, ao abrigo do Acordo Quadro 2016/40, Ref.ª P259-AC-2017-15.",FALSE
AD-2018-45 - Aquisição Centralizada de Medicamentos P533 - Pemetrexedo (500Mg;Frs.) e P836 - Pemetrexedo (100Mg;Frs.),Ajuste Direto Regime Geral,Aquisição de bens móveis,"33600000-6, Produtos farmacêuticos","Centro Hospitalar Cova da Beira, E. P. E. (506361659)","LILLY PORTUGAL-PROD.FARMACEUTICOS, LDA (500165602)","112.407,64 €",07-09-2018,20-07-2018,183 dias,"Portugal, Castelo Branco, Covilhã","Artigo 24.º, n.º 1, alínea e), subalínea i) do Código dos Contratos Públicos",,,,,,Não aplicável.,Não aplicável.,FALSE
"P259-2018-80 - Aquisição Centralizada de Medicamentos ao abrigo do AQ 2016/40, nos termos do Despacho n.º 1571-B/2016.",Ao abrigo de acordo-quadro (art.º 259.º),Aquisição de bens móveis,"33600000-6, Produtos farmacêuticos","Centro Hospitalar Cova da Beira, E. P. E. (506361659)","Janssen-Cilag Farmacêutica, Lda. (500189412)","2.644,65 €",07-09-2018,20-07-2018,183 dias,"Portugal, Castelo Branco, Covilhã",Artigo 259.º do Código dos Contratos Públicos,,,,,,2726261,"Aquisição de Medicamentos desencadeada pela SPMS, no âmbito do Despacho 1571/B de 2016, ao abrigo do Acordo Quadro 2016/40, Ref.ª P259-AC-2017-15.",FALSE
"P259-2018-73 - Aquisição Centralizada de Medicamentos ao abrigo do AQ 2016/18, nos termos do Despacho n.º 1571-B/2016.",Ao abrigo de acordo-quadro (art.º 259.º),Aquisição de bens móveis,"33600000-6, Produtos farmacêuticos","Centro Hospitalar Cova da Beira, E. P. E. (506361659)","Bayer Portugal, Lda. (500043256)","852,16 €",07-09-2018,13-07-2018,183 dias,"Portugal, Castelo Branco, Covilhã",Artigo 259.º do Código dos Contratos Públicos,,,,,,2489595,CP 2016/18 - Acordo quadro para fornecimento de Medicamentos do Grupo 4: Sangue às Instituições e Serviços do Serviço Nacional de Saúde,FALSE
"P259-2018-77 - Aquisição Centralizada de Medicamentos ao abrigo do AQ 2016/40, nos termos do Despacho n.º 1571-B/2016.",Ao abrigo de acordo-quadro (art.º 259.º),Aquisição de bens móveis,"33600000-6, Produtos farmacêuticos","Centro Hospitalar Cova da Beira, E. P. E. (506361659)","AbbVie, Lda. (510229050)","5.539,74 €",07-09-2018,06-07-2018,183 dias,"Portugal, Castelo Branco, Covilhã",Artigo 259.º do Código dos Contratos Públicos,,,,,,2726261,"Aquisição de Medicamentos desencadeada pela SPMS, no âmbito do Despacho 1571/B de 2016, ao abrigo do Acordo Quadro 2016/40, Ref.ª P259-AC-2017-15.",FALSE
P259-2018-60 - Aquisição Centralizada de Medicamentos ao abrigo do AQ 2016/18 (Despacho n.º 1571-B/2016),Ao abrigo de acordo-quadro (art.º 259.º),Aquisição de bens móveis,"33600000-6, Produtos farmacêuticos","Centro Hospitalar Cova da Beira, E. P. E. (506361659)","Sanofi - Produtos Farmacêuticos, Lda. (500134960)","45.544,80 €",07-09-2018,04-07-2018,183 dias,"Portugal, Castelo Branco, Covilhã",Artigo 259.º do Código dos Contratos Públicos,,,,,,2489595,CP 2016/18 - Acordo quadro para fornecimento de Medicamentos do Grupo 4: Sangue às Instituições e Serviços do Serviço Nacional de Saúde,FALSE
P259-2018-70 - Aquisição Centralizada de Medicamentos ao abrigo do AQ 2017/6 - Medicamentos do foro oncológico,Ao abrigo de acordo-quadro (art.º 259.º),Aquisição de bens móveis,"33600000-6, Produtos farmacêuticos","Centro Hospitalar Cova da Beira, E. P. E. (506361659)","Teva Pharma - Produtos Farmacêuticos, Lda. (507045491)","4.162,86 €",06-09-2018,21-06-2018,183 dias,"Portugal, Castelo Branco, Covilhã",Artigo 259.º do Código dos Contratos Públicos,,,,,,2969238,"CP 2017/6 - Acordo Quadro para fornecimento de Medicamentos do Foro Oncológico e Imunomoduladores, às Instituições e Serviços do Serviço Nacional de Saúde",FALSE
P259-2018-30 - Aquisição centralizada de medicamentos ao abrigo do AQ 2017/9 - Derivados do plasma humano (Despacho 1571-B/2016),Ao abrigo de acordo-quadro (art.º 259.º),Aquisição de bens móveis,"33600000-6, Produtos farmacêuticos","Centro Hospitalar Cova da Beira, E. P. E. (506361659)","Octapharma - Produtos Farmacêuticos, Lda. (502820780)","546,42 €",06-09-2018,29-06-2018,183 dias,"Portugal, Castelo Branco, Covilhã",Artigo 259.º do Código dos Contratos Públicos,,,,,,2800702,CP 2017/9 - Acordo quadro para fornecimento de Derivados do Plasma Humano às Instituições e Serviços do Serviço Nacional de Saúde,FALSE
P259-2018-30 - Aquisição centralizada de medicamentos ao abrigo do AQ 2017/9 - Derivados do plasma humano (Despacho 1571-B/2016),Ao abrigo de acordo-quadro (art.º 259.º),Aquisição de bens móveis,"33600000-6, Produtos farmacêuticos","Centro Hospitalar Cova da Beira, E. P. E. (506361659)","Grifols Portugal, Lda. (502041285)","70.824,00 €",06-09-2018,26-06-2018,183 dias,"Portugal, Castelo Branco, Covilhã",Artigo 259.º do Código dos Contratos Públicos,,,,,,2800702,CP 2017/9 - Acordo quadro para fornecimento de Derivados do Plasma Humano às Instituições e Serviços do Serviço Nacional de Saúde,FALSE
Aquisição de Sacos de Plásticos,Consulta Prévia,Aquisição de bens móveis,"19640000-4, Sacos de polietileno para recolha de lixo e resíduos","Centro Hospitalar Cova da Beira, E. P. E. (506361659)","Visipapel, Lda. (502020733)","2.266,50 €",05-09-2018,23-07-2018,453 dias,"Portugal, Castelo Branco, Covilhã","Artigo 20.º, n.º 1, alínea c) do Código dos Contratos Públicos",,,,,,Não aplicável.,Não aplicável.,FALSE
Aquisição de Sacos de Plásticos,Consulta Prévia,Aquisição de bens móveis,"19640000-4, Sacos de polietileno para recolha de lixo e resíduos","Centro Hospitalar Cova da Beira, E. P. E. (506361659)","Rei Rei, Lda. (502897970)","2.149,00 €",05-09-2018,20-07-2018,153 dias,"Portugal, Castelo Branco, Covilhã","Artigo 20.º, n.º 1, alínea c) do Código dos Contratos Públicos",,,,,,Não aplicável.,Não aplicável.,FALSE
Fornecimento de Serviços de Transporte de Doentes ao CHCB,Consulta Prévia,Aquisição de serviços,"60000000-8, Serviços de transporte (excl. transporte de resíduos)","Centro Hospitalar Cova da Beira, E. P. E. (506361659)","Ambulâncias Albicastrense, Lda. (503369217)","29.200,00 €",05-09-2018,02-07-2018,183 dias,"Portugal, Castelo Branco, Covilhã","Artigo 20.º, n.º 1, alínea c) do Código dos Contratos Públicos",,,,,,Não aplicável.,Não aplicável.,FALSE
Aquisição de Medicamentos NIVOLUMAB,Ajuste Direto Regime Geral,Aquisição de bens móveis,"33600000-6, Produtos farmacêuticos","Centro Hospitalar Cova da Beira, E. P. E. (506361659)",Bristol-Myers Squibb (500048193),"127.189,98 €",05-09-2018,27-07-2018,153 dias,"Portugal, Castelo Branco, Covilhã","Artigo 24.º, n.º 1, alínea e), subalínea ii) do Código dos Contratos Públicos",,,,,,Não aplicável.,Não aplicável.,FALSE
Aquisição de medicamentos diversos,Ao abrigo de acordo-quadro (art.º 259.º),Aquisição de bens móveis,"33600000-6, Produtos farmacêuticos","Centro Hospitalar Cova da Beira, E. P. E. (506361659)","Farmoz - Sociedade Técnico Medicinal, S.A. (501505334)","267,12 €",05-09-2018,22-08-2018,133 dias,"Portugal, Castelo Branco, Covilhã",Artigo 259.º do Código dos Contratos Públicos,,,,,,2124520,CP 2016/55 - Medicamentos Diversos,FALSE
Aquisição de medicamentos diversos,Ao abrigo de acordo-quadro (art.º 259.º),Aquisição de bens móveis,"33600000-6, Produtos farmacêuticos","Centro Hospitalar Cova da Beira, E. P. E. (506361659)","teva Pharma Produtos Farmacêuticos, Lda. (507045491)","168,00 €",05-09-2018,22-08-2018,133 dias,"Portugal, Castelo Branco, Covilhã",Artigo 259.º do Código dos Contratos Públicos,,,,,,2124520,CP 2016/55 - Medicamentos Diversos,FALSE
Aquisição de Medicamentos diversos,Ao abrigo de acordo-quadro (art.º 259.º),Aquisição de bens móveis,"33600000-6, Produtos farmacêuticos","Centro Hospitalar Cova da Beira, E. P. E. (506361659)","Mylan, Lda. (502248793)","196,00 €",05-09-2018,22-08-2018,133 dias,"Portugal, Castelo Branco, Covilhã",Artigo 259.º do Código dos Contratos Públicos,,,,,,3053200,"CP 2017/64 - Acordo Quadro para fornecimento de Medicamentos Diversos, às Instituições e Serviços do Serviço Nacional de Saúde",FALSE
Aquisição de Medicamentos diversos,Ao abrigo de acordo-quadro (art.º 259.º),Aquisição de bens móveis,"33600000-6, Produtos farmacêuticos","Centro Hospitalar Cova da Beira, E. P. E. (506361659)","Fresenius Kabi Pharma Portugal, Lda. (504293753)","2.343,94 €",05-09-2018,21-08-2018,133 dias,"Portugal, Castelo Branco, Covilhã",Artigo 259.º do Código dos Contratos Públicos,,,,,,3053200,"CP 2017/64 - Acordo Quadro para fornecimento de Medicamentos Diversos, às Instituições e Serviços do Serviço Nacional de Saúde",FALSE
Aquisição de Medicamentos diversos,Ao abrigo de acordo-quadro (art.º 259.º),Aquisição de bens móveis,"33600000-6, Produtos farmacêuticos","Centro Hospitalar Cova da Beira, E. P. E. (506361659)","South Point Care, Especialidades Farmacêuticas, Lda. (508284872)","101,46 €",05-09-2018,21-08-2018,133 dias,"Portugal, Castelo Branco, Covilhã",Artigo 259.º do Código dos Contratos Públicos,,,,,,3053200,"CP 2017/64 - Acordo Quadro para fornecimento de Medicamentos Diversos, às Instituições e Serviços do Serviço Nacional de Saúde",FALSE
Aquisição de Medicamentos diversos,Ao abrigo de acordo-quadro (art.º 259.º),Aquisição de bens móveis,"33600000-6, Produtos farmacêuticos","Centro Hospitalar Cova da Beira, E. P. E. (506361659)","Bayer Portugal, Lda. (500043256)","178,20 €",05-09-2018,21-08-2018,133 dias,"Portugal, Castelo Branco, Covilhã",Artigo 259.º do Código dos Contratos Públicos,,,,,,3053200,"CP 2017/64 - Acordo Quadro para fornecimento de Medicamentos Diversos, às Instituições e Serviços do Serviço Nacional de Saúde",FALSE
Aquisição de Medicamentos diversos,Ao abrigo de acordo-quadro (art.º 259.º),Aquisição de bens móveis,"33600000-6, Produtos farmacêuticos","Centro Hospitalar Cova da Beira, E. P. E. (506361659)","BGP Products, Uniepssoal, Lda. (513263268)","6,60 €",05-09-2018,28-08-2018,133 dias,"Portugal, Castelo Branco, Covilhã",Artigo 259.º do Código dos Contratos Públicos,,,,,,3053200,"CP 2017/64 - Acordo Quadro para fornecimento de Medicamentos Diversos, às Instituições e Serviços do Serviço Nacional de Saúde",FALSE
Aquisição de Medicamentos diversos,Ao abrigo de acordo-quadro (art.º 259.º),Aquisição de bens móveis,"33600000-6, Produtos farmacêuticos","Centro Hospitalar Cova da Beira, E. P. E. (506361659)","Johnson & Johnson, Lda. (500153370)","232,00 €",05-09-2018,22-08-2018,133 dias,"Portugal, Castelo Branco, Covilhã",Artigo 259.º do Código dos Contratos Públicos,,,,,,3053200,"CP 2017/64 - Acordo Quadro para fornecimento de Medicamentos Diversos, às Instituições e Serviços do Serviço Nacional de Saúde",FALSE
Aquisição de Medicamentos diversos,Ao abrigo de acordo-quadro (art.º 259.º),Aquisição de bens móveis,"33600000-6, Produtos farmacêuticos","Centro Hospitalar Cova da Beira, E. P. E. (506361659)","Generis Farmacêutica, S.A. (508107997)","117,60 €",05-09-2018,22-08-2018,133 dias,"Portugal, Castelo Branco, Covilhã",Artigo 259.º do Código dos Contratos Públicos,,,,,,3053200,"CP 2017/64 - Acordo Quadro para fornecimento de Medicamentos Diversos, às Instituições e Serviços do Serviço Nacional de Saúde",FALSE
Prestação de Serviços de Exames de Medicina Nuclear,Concurso público,Aquisição de serviços,"85100000-0, Serviços de saúde","Centro Hospitalar Cova da Beira, EPE (506361659)","HPP Medicina Molecular, S.A. (506055787)","76.209,90 €",05-09-2018,30-07-2018,153 dias,"Portugal, Castelo Branco, Covilhã","Artigo 20.º, n.º 1, alínea b) do Código dos Contratos Públicos",,,,,,Não aplicável.,Não aplicável.,FALSE
Serviços de Manutenção para Equipamentos Médicos do CHCB,Concurso público,Aquisição de serviços,"50400000-9, Serviços de reparação e manutenção de equipamento médico e de precisão","Centro Hospitalar Cova da Beira, EPE (506361659)","Iberdata - Equipamentos, S.A. (501904921)","35.996,36 €",05-09-2018,22-06-2018,304 dias,"Portugal, Castelo Branco, Covilhã","Artigo 20.º, n.º 1, alínea b) do Código dos Contratos Públicos",,,,,,Não aplicável.,Não aplicável.,FALSE
Concurso Público com publicação no JOUE para aquisição de equipamentos de anestesia e de monitorização para Bloco Operatório,Concurso público,Aquisição de bens móveis,"33100000-1, Equipamento médico","Centro Hospitalar Cova da Beira, EPE (506361659)","Iberdata - Equipamentos, S.A. (501904921)","549.150,00 €",04-09-2018,13-08-2018,122 dias,"Portugal, Castelo Branco, Covilhã","Artigo 20.º, n.º 1, alínea a) do Código dos Contratos Públicos",,,,,,Não aplicável.,Não aplicável.,FALSE
"Aquisição de Medicamentos anti-infeciosos, exceto antivíricos e antifúngicos",Ao abrigo de acordo-quadro (art.º 259.º),Aquisição de bens móveis,"33600000-6, Produtos farmacêuticos","Centro Hospitalar Cova da Beira, E. P. E. (506361659)","Teva Pharma - Produtos Farmacêuticos, Lda. (507045491)","8.527,20 €",04-09-2018,21-08-2018,133 dias,"Portugal, Castelo Branco, Covilhã",Artigo 259.º do Código dos Contratos Públicos,,,,,,2775691,CP 2017/5 - Acordo Quadro para fornecimento de Medicamentos anti-infeciosos: exceto antivíricos e antifúngicos,FALSE
"Aquisição de Medicamentos anti-infeciosos, exceto antivíricos e antifúngicos",Ao abrigo de acordo-quadro (art.º 259.º),Aquisição de bens móveis,"33600000-6, Produtos farmacêuticos","Centro Hospitalar Cova da Beira, E. P. E. (506361659)","Farmoz - Sociedade Técnico Medicinal, S.A. (501505334)","274,40 €",04-09-2018,22-08-2018,133 dias,"Portugal, Castelo Branco, Covilhã",Artigo 259.º do Código dos Contratos Públicos,,,,,,2775691,CP 2017/5 - Acordo Quadro para fornecimento de Medicamentos anti-infeciosos: exceto antivíricos e antifúngicos,FALSE
"Aquisição de Medicamentos anti-infeciosos, exceto antivíricos e antifúngicos",Ao abrigo de acordo-quadro (art.º 259.º),Aquisição de bens móveis,"33600000-6, Produtos farmacêuticos","Centro Hospitalar Cova da Beira, E. P. E. (506361659)","Sandoz Farmacêutica, Lda. (506985261)","240,00 €",04-09-2018,20-08-2018,133 dias,"Portugal, Castelo Branco, Covilhã",Artigo 259.º do Código dos Contratos Públicos,,,,,,2775691,CP 2017/5 - Acordo Quadro para fornecimento de Medicamentos anti-infeciosos: exceto antivíricos e antifúngicos,FALSE
"Aquisição de Medicamentos anti-infeciosos, exceto antivíricos e antifúngicos",Ao abrigo de acordo-quadro (art.º 259.º),Aquisição de bens móveis,"33600000-6, Produtos farmacêuticos","Centro Hospitalar Cova da Beira, E. P. E. (506361659)","Ratiopharm - Comercio Indústria de Produtos Farmacêuticos, Lda. (502414910)","595,13 €",04-09-2018,21-08-2018,133 dias,"Portugal, Castelo Branco, Covilhã",Artigo 259.º do Código dos Contratos Públicos,,,,,,2775691,CP 2017/5 - Acordo Quadro para fornecimento de Medicamentos anti-infeciosos: exceto antivíricos e antifúngicos,FALSE
"Aquisição de Medicamentos anti-infeciosos, exceto antivíricos e antifúngicos",Ao abrigo de acordo-quadro (art.º 259.º),Aquisição de bens móveis,"33600000-6, Produtos farmacêuticos","Centro Hospitalar Cova da Beira, E. P. E. (506361659)","Pharmis Biofarmacêutica, Lda. (502595442)","2.240,49 €",04-09-2018,20-08-2018,133 dias,"Portugal, Castelo Branco, Covilhã",Artigo 259.º do Código dos Contratos Públicos,,,,,,2775691,CP 2017/5 - Acordo Quadro para fornecimento de Medicamentos anti-infeciosos: exceto antivíricos e antifúngicos,FALSE
"Aquisição de Medicamentos anti-infeciosos, exceto antivíricos e antifúngicos",Ao abrigo de acordo-quadro (art.º 259.º),Aquisição de bens móveis,"33600000-6, Produtos farmacêuticos","Centro Hospitalar Cova da Beira, E. P. E. (506361659)","Overpharma, Produtos Médicos e Farmacêuticos, Lda. (505792362)","5.850,00 €",04-09-2018,20-08-2018,133 dias,"Portugal, Castelo Branco, Covilhã",Artigo 259.º do Código dos Contratos Públicos,,,,,,2775691,CP 2017/5 - Acordo Quadro para fornecimento de Medicamentos anti-infeciosos: exceto antivíricos e antifúngicos,FALSE
"Aquisição de Medicamentos anti-infeciosos, exceto antivíricos e antifúngicos",Ao abrigo de acordo-quadro (art.º 259.º),Aquisição de bens móveis,"33600000-6, Produtos farmacêuticos","Centro Hospitalar Cova da Beira, E. P. E. (506361659)","Laboratórios Normon, S.A. (505654156)","10.858,00 €",04-09-2018,20-08-2018,133 dias,"Portugal, Castelo Branco, Covilhã",Artigo 259.º do Código dos Contratos Públicos,,,,,,2775691,CP 2017/5 - Acordo Quadro para fornecimento de Medicamentos anti-infeciosos: exceto antivíricos e antifúngicos,FALSE
"Aquisição de Medicamentos anti-infeciosos, exceto antivíricos e antifúngicos",Ao abrigo de acordo-quadro (art.º 259.º),Aquisição de bens móveis,"33600000-6, Produtos farmacêuticos","Centro Hospitalar Cova da Beira, E. P. E. (506361659)","Laboratórios Pfizer, Lda. (500162166)","911,60 €",04-09-2018,27-08-2018,122 dias,"Portugal, Castelo Branco, Covilhã",Artigo 259.º do Código dos Contratos Públicos,,,,,,2775691,CP 2017/5 - Acordo Quadro para fornecimento de Medicamentos anti-infeciosos: exceto antivíricos e antifúngicos,FALSE
"Aquisição de Medicamentos anti-infeciosos, exceto antivíricos e antifúngicos",Ao abrigo de acordo-quadro (art.º 259.º),Aquisição de bens móveis,"33600000-6, Produtos farmacêuticos","Centro Hospitalar Cova da Beira, E. P. E. (506361659)","Labesfal - Laboratórios Almiro, S.A. (501169580)","8.061,66 €",04-09-2018,20-08-2018,133 dias,"Portugal, Castelo Branco, Covilhã",Artigo 259.º do Código dos Contratos Públicos,,,,,,2775691,CP 2017/5 - Acordo Quadro para fornecimento de Medicamentos anti-infeciosos: exceto antivíricos e antifúngicos,FALSE
"Aquisição de Medicamentos anti-infeciosos, exceto antivíricos e antifúngicos",Ao abrigo de acordo-quadro (art.º 259.º),Aquisição de bens móveis,"33600000-6, Produtos farmacêuticos","Centro Hospitalar Cova da Beira, E. P. E. (506361659)","Hikma Farmacêutica (Portugal), S.A. (502266791)","5.690,50 €",04-09-2018,24-08-2018,130 dias,"Portugal, Castelo Branco, Covilhã",Artigo 259.º do Código dos Contratos Públicos,,,,,,2775691,CP 2017/5 - Acordo Quadro para fornecimento de Medicamentos anti-infeciosos: exceto antivíricos e antifúngicos,FALSE
"Aquisição de Medicamentos anti-infeciosos, exceto antivíricos e antifúngicos",Ao abrigo de acordo-quadro (art.º 259.º),Aquisição de bens móveis,"33600000-6, Produtos farmacêuticos","Centro Hospitalar Cova da Beira, E. P. E. (506361659)","GlaxoSmithkline - Produtos Farmacêuticos, Lda. (500139962)","43,78 €",04-09-2018,20-08-2018,133 dias,"Portugal, Castelo Branco, Covilhã",Artigo 259.º do Código dos Contratos Públicos,,,,,,2775691,CP 2017/5 - Acordo Quadro para fornecimento de Medicamentos anti-infeciosos: exceto antivíricos e antifúngicos,FALSE
"Aquisição de Medicamentos anti-infeciosos, exceto antivíricos e antifúngicos",Ao abrigo de acordo-quadro (art.º 259.º),Aquisição de bens móveis,"33600000-6, Produtos farmacêuticos","Centro Hospitalar Cova da Beira, E. P. E. (506361659)","Generis Farmacêutica, S.A. (508107997)","32.152,07 €",04-09-2018,22-08-2018,133 dias,"Portugal, Castelo Branco, Covilhã",Artigo 259.º do Código dos Contratos Públicos,,,,,,2775691,CP 2017/5 - Acordo Quadro para fornecimento de Medicamentos anti-infeciosos: exceto antivíricos e antifúngicos,FALSE
"Aquisição de Medicamentos anti-infeciosos, exceto antivíricos e antifúngicos",Ao abrigo de acordo-quadro (art.º 259.º),Aquisição de bens móveis,"33600000-6, Produtos farmacêuticos","Centro Hospitalar Cova da Beira, E. P. E. (506361659)",Fresenius Kabi Pharma Portugal (504293753),"9.402,00 €",04-09-2018,20-08-2018,133 dias,"Portugal, Castelo Branco, Covilhã",Artigo 259.º do Código dos Contratos Públicos,,,,,,2775691,CP 2017/5 - Acordo Quadro para fornecimento de Medicamentos anti-infeciosos: exceto antivíricos e antifúngicos,FALSE
Aquisição de Medicamentos usados nas afeções cutâneas,Ao abrigo de acordo-quadro (art.º 259.º),Aquisição de bens móveis,"33600000-6, Produtos farmacêuticos","Centro Hospitalar Cova da Beira, E. P. E. (506361659)","B. Braun Medical, Lda. (501506543)","150,00 €",04-09-2018,17-08-2018,133 dias,"Portugal, Castelo Branco, Covilhã",Artigo 259.º do Código dos Contratos Públicos,,,,,,2850371,"CP 2017/51 - Acordo Quadro para fornecimento de Medicamentos usados nas afeções cutâneas, às Instituições e Serviços do Serviço Nacional de Saúde",FALSE
Aquisição de Medicamentos usados nas afeções cutâneas,Ao abrigo de acordo-quadro (art.º 259.º),Aquisição de bens móveis,"33600000-6, Produtos farmacêuticos","Centro Hospitalar Cova da Beira, E. P. E. (506361659)","Sanofi-Produtos Farmacêuticos, Lda. (500134960)","1.125,00 €",04-09-2018,22-08-2018,133 dias,"Portugal, Castelo Branco, Covilhã",Artigo 259.º do Código dos Contratos Públicos,,,,,,2850371,"CP 2017/51 - Acordo Quadro para fornecimento de Medicamentos usados nas afeções cutâneas, às Instituições e Serviços do Serviço Nacional de Saúde",FALSE
Aquisição de Medicamentos usados nas afeções cutâneas,Ao abrigo de acordo-quadro (art.º 259.º),Aquisição de bens móveis,"33600000-6, Produtos farmacêuticos","Centro Hospitalar Cova da Beira, E. P. E. (506361659)","Farmoz - Soc. Técnico Medicinal, S.A. (501505334)","55,00 €",04-09-2018,22-08-2018,133 dias,"Portugal, Castelo Branco, Covilhã",Artigo 259.º do Código dos Contratos Públicos,,,,,,2850371,"CP 2017/51 - Acordo Quadro para fornecimento de Medicamentos usados nas afeções cutâneas, às Instituições e Serviços do Serviço Nacional de Saúde",FALSE
Aquisição de Medicamentos usados nas afeções cutâneas,Ao abrigo de acordo-quadro (art.º 259.º),Aquisição de bens móveis,"33600000-6, Produtos farmacêuticos","Centro Hospitalar Cova da Beira, E. P. E. (506361659)","Johnson & Johnson, Lda. (500153370)","50,00 €",04-09-2018,22-08-2018,133 dias,"Portugal, Castelo Branco, Covilhã",Artigo 259.º do Código dos Contratos Públicos,,,,,,2850371,"CP 2017/51 - Acordo Quadro para fornecimento de Medicamentos usados nas afeções cutâneas, às Instituições e Serviços do Serviço Nacional de Saúde",FALSE
Aquisição de Medicamentos usados nas afeções cutâneas,Ao abrigo de acordo-quadro (art.º 259.º),Aquisição de bens móveis,"33600000-6, Produtos farmacêuticos","Centro Hospitalar Cova da Beira, E. P. E. (506361659)","Merck Sharp & Dohme, Lda. (500191360)","441,10 €",04-09-2018,16-08-2018,133 dias,"Portugal, Castelo Branco, Covilhã",Artigo 259.º do Código dos Contratos Públicos,,,,,,2850371,"CP 2017/51 - Acordo Quadro para fornecimento de Medicamentos usados nas afeções cutâneas, às Instituições e Serviços do Serviço Nacional de Saúde",FALSE
Aquisição de Medicamentos Diversos,Ao abrigo de acordo-quadro (art.º 259.º),Aquisição de bens móveis,"33600000-6, Produtos farmacêuticos","Centro Hospitalar Cova da Beira, E. P. E. (506361659)","Novartis Farma - Produtos Farmacêuticos, S.A. (500063524)","6.559,98 €",04-09-2018,20-08-2018,133 dias,"Portugal, Castelo Branco, Covilhã",Artigo 259.º do Código dos Contratos Públicos,,,,,,2545980,CP 2017/61 - Acordo quadro para fornecimento de Medicamentos Diversos   às Instituições e Serviços do Serviço Nacional de Saúde,FALSE
Aquisição de Medicamentos Diversos,Ao abrigo de acordo-quadro (art.º 259.º),Aquisição de bens móveis,"33600000-6, Produtos farmacêuticos","Centro Hospitalar Cova da Beira, E. P. E. (506361659)","Labesfal - Laboratórios Almiro, S.A. (501169580)","665,00 €",04-09-2018,16-08-2018,133 dias,"Portugal, Castelo Branco, Covilhã",Artigo 259.º do Código dos Contratos Públicos,,,,,,2545980,CP 2017/61 - Acordo quadro para fornecimento de Medicamentos Diversos   às Instituições e Serviços do Serviço Nacional de Saúde,FALSE
Aquisição de Medicamentos Diversos,Ao abrigo de acordo-quadro (art.º 259.º),Aquisição de bens móveis,"33600000-6, Produtos farmacêuticos","Centro Hospitalar Cova da Beira, E. P. E. (506361659)","Laboratórios Inibsa, S.A. (500139571)","107,80 €",04-09-2018,20-08-2018,122 dias,"Portugal, Castelo Branco, Covilhã",Artigo 259.º do Código dos Contratos Públicos,,,,,,2545980,CP 2017/61 - Acordo quadro para fornecimento de Medicamentos Diversos   às Instituições e Serviços do Serviço Nacional de Saúde,FALSE
Aquisição de Medicamentos Diversos,Ao abrigo de acordo-quadro (art.º 259.º),Aquisição de bens móveis,"33600000-6, Produtos farmacêuticos","Centro Hospitalar Cova da Beira, E. P. E. (506361659)","Gilead Sciences, Lda. (503604704)","2.677,92 €",04-09-2018,16-08-2018,138 dias,"Portugal, Castelo Branco, Covilhã",Artigo 259.º do Código dos Contratos Públicos,,,,,,2545980,CP 2017/61 - Acordo quadro para fornecimento de Medicamentos Diversos   às Instituições e Serviços do Serviço Nacional de Saúde,FALSE
Aquisição de Medicamentos Diversos,Ao abrigo de acordo-quadro (art.º 259.º),Aquisição de bens móveis,"33600000-6, Produtos farmacêuticos","Centro Hospitalar Cova da Beira, E. P. E. (506361659)","Baxter Médico - Farmacêutica, Lda. (503347345)","334,60 €",04-09-2018,22-08-2018,133 dias,"Portugal, Castelo Branco, Covilhã",Artigo 259.º do Código dos Contratos Públicos,,,,,,2545980,CP 2017/61 - Acordo quadro para fornecimento de Medicamentos Diversos   às Instituições e Serviços do Serviço Nacional de Saúde,FALSE
Aquisição de Medicamentos Diversos,Ao abrigo de acordo-quadro (art.º 259.º),Aquisição de bens móveis,"33600000-6, Produtos farmacêuticos","Centro Hospitalar Cova da Beira, E. P. E. (506361659)",Laboratorios Bial (500220913),"12,75 €",04-09-2018,21-08-2018,133 dias,"Portugal, Castelo Branco, Covilhã",Artigo 259.º do Código dos Contratos Públicos,,,,,,2545980,CP 2017/61 - Acordo quadro para fornecimento de Medicamentos Diversos   às Instituições e Serviços do Serviço Nacional de Saúde,FALSE
