freguesia,acronym,validVotesPercentage,votes,dicofre
Alvite,PPD/PSD.CDS-PP,44.83,104,180702
Alvite,PS,40.95,95,180702
Alvite,PCP-PEV,6.47,15,180702
Alvite,MPT,3.45,8,180702
Alvite,B.E.,1.29,3,180702
Alvite,L,1.29,3,180702
Alvite,PCTP/MRPP,1.29,3,180702
Alvite,PND,0.43,1,180702
Alvite,MAS,0,0,180702
Alvite,PAN,0,0,180702
Alvite,PDA,0,0,180702
Alvite,PNR,0,0,180702
Alvite,POUS,0,0,180702
Alvite,PPM,0,0,180702
Alvite,PPV,0,0,180702
Alvite,PTP,0,0,180702
