Objeto do Contrato,Tipo de Procedimento,Tipo(s) de Contrato,CPVs,Entidade(s) Adjudicante(s),Entidade(s) Adjudicatária(s),Preço Contratual,Data de Publicação,Data de Celebração do Contrato,Prazo de Execução,Local de Execução,Fundamentação,Data de Fecho do Contrato,Preço Total Efetivo,Causas das Alterações ao Prazo,Causas das Alterações ao Preço,Estado,N.º registo do Acordo Quadro,Descrição do Acordo Quadro,Procedimento Centralizado
AD103897 AQUISIÇÃO CENTRALIZADA P/SPMS-MEDICAMENTOS-AD-AC-2017-46 - ANO 2017,Ajuste Direto Regime Geral,Aquisição de bens móveis,"33630000-5, Medicamentos usados em dermatologia e para o aparelho músculo-esquelético","Centro Hospitalar de Lisboa Ocidental, E. P. E. (507618319)","CELGENE SOCIEDADE UNIPESSOAL, LDA (507791690)","59.096,04 €",10-08-2017,29-05-2017,365 dias,"Portugal, Lisboa, Lisboa","Artigo 24.º, n.º 1, alínea e) do Código dos Contratos Públicos",,,,,,Não aplicável.,Não aplicável.,FALSE
AQ100937 AQUISIÇÃO CENRALIZADA P/SPMS MEDICAMENTOS-P259-AC-2017-76- ANO 2017,Ajuste Direto Regime Geral,Aquisição de bens móveis,"33650000-1, Anti-infecciosos gerais de uso sistémico, vacinas, antineoplásicos e imunomoduladores","Centro Hospitalar de Lisboa Ocidental, E. P. E. (507618319)","ASTRA-ZENECA PRODUTOS FARMACEUTICOS, LDA (502942240)","150.981,32 €",10-08-2017,19-06-2017,365 dias,"Portugal, Lisboa, Lisboa",Artigo 258.º do Código dos Contratos Públicos,,,,,,Não aplicável.,Não aplicável.,FALSE
AQ100907 AQUISIÇAO CENTRALIZADA PELA SPMS-MEDICAMENTOS-P259-AC-2017-61- ANO 2017,Ajuste Direto Regime Geral,Aquisição de bens móveis,"33650000-1, Anti-infecciosos gerais de uso sistémico, vacinas, antineoplásicos e imunomoduladores","Centro Hospitalar de Lisboa Ocidental, E. P. E. (507618319)","PFIZER BIOFARMACEUTICA, SOCIEDADE UNIPESSOAL, LDA (513300376)","36.051,57 €",10-08-2017,26-05-2017,365 dias,"Portugal, Lisboa, Lisboa",Artigo 258.º do Código dos Contratos Públicos,,,,,,Não aplicável.,Não aplicável.,FALSE
AQ100757 AQUISIÇAO CENTRALIZADA P/SPMS-MEDICAMENTOS-P259-AC-2017-11 - ANO 2017,Ajuste Direto Regime Geral,Aquisição de bens móveis,"33650000-1, Anti-infecciosos gerais de uso sistémico, vacinas, antineoplásicos e imunomoduladores","Centro Hospitalar de Lisboa Ocidental, E. P. E. (507618319)",ASTELLAS FARMA (502540249),"272.231,40 €",10-08-2017,03-05-2017,365 dias,"Portugal, Lisboa, Lisboa",Artigo 258.º do Código dos Contratos Públicos,,,,,,Não aplicável.,Não aplicável.,FALSE
AQ100837 AQUISIÇÃO CENTRALIZADA PELA SPMS-MEDICAMENTOS-P259-AC-2017-46 - ANO 2017,Ajuste Direto Regime Geral,Aquisição de bens móveis,"33650000-1, Anti-infecciosos gerais de uso sistémico, vacinas, antineoplásicos e imunomoduladores","Centro Hospitalar de Lisboa Ocidental, E. P. E. (507618319)","LILLY PORTUGAL PRODUTOS FARMACEUTICOS, LDA (500165602)","35.182,40 €",10-08-2017,18-05-2017,365 dias,"Portugal, Lisboa, Lisboa",Artigo 258.º do Código dos Contratos Públicos,,,,,,Não aplicável.,Não aplicável.,FALSE
AQ100507 AQUISIÇÃO CENTRALIZADA PELA SPMS-MEDICAMENTOS-P259-AC-2017-24 - ANO 2017,Ajuste Direto Regime Geral,Aquisição de bens móveis,"33650000-1, Anti-infecciosos gerais de uso sistémico, vacinas, antineoplásicos e imunomoduladores","Centro Hospitalar de Lisboa Ocidental, E. P. E. (507618319)","NOVARTIS FARMA PRODUTOS FARMACEUTICOS, S.A. (500063524)","179.074,95 €",10-08-2017,13-04-2017,365 dias,"Portugal, Lisboa, Lisboa",Artigo 258.º do Código dos Contratos Públicos,,,,,,Não aplicável.,Não aplicável.,FALSE
AQ100617 AQUISIÇÃO CENTRALIZADA PELA SPMS .MEDICAMENTOS -P259-AC-2017-16 - no 2017,Ajuste Direto Regime Geral,Aquisição de bens móveis,"33650000-1, Anti-infecciosos gerais de uso sistémico, vacinas, antineoplásicos e imunomoduladores","Centro Hospitalar de Lisboa Ocidental, E. P. E. (507618319)","Abbvie, lda (510229050)","1.703.722,50 €",10-08-2017,09-05-2017,365 dias,"Portugal, Lisboa, Lisboa",Artigo 258.º do Código dos Contratos Públicos,,,,,,Não aplicável.,Não aplicável.,FALSE
AQ100787 AQUISIÇÃO CENTRALIZADA PELA SPMS - MEDICAMENTOS-P259-AC-2017-45 - ANO 2017,Ajuste Direto Regime Geral,Aquisição de bens móveis,"33650000-1, Anti-infecciosos gerais de uso sistémico, vacinas, antineoplásicos e imunomoduladores","Centro Hospitalar de Lisboa Ocidental, E. P. E. (507618319)","JANSSEN CILAG FARMACEUTICA, LDA (500189412)","1.631.701,38 €",10-08-2017,15-05-2017,365 dias,"Portugal, Lisboa, Lisboa",Artigo 258.º do Código dos Contratos Públicos,,,,,,Não aplicável.,Não aplicável.,FALSE
AQ100637 AQUISIÇÃO CENTRALIZADA PELA SPMS - MEDICAMENTOS-P259-AC-2017-10 - ANO 2017,Ajuste Direto Regime Geral,Aquisição de bens móveis,"33620000-2, Medicamentos para o sangue, para os órgãos hematopoiéticos e para o aparelho cardiovascular","Centro Hospitalar de Lisboa Ocidental, E. P. E. (507618319)","ROCHE FARMACEUTICA QUIMICA, LDA (500233810)","782.884,35 €",10-08-2017,08-05-2017,365 dias,"Portugal, Lisboa, Lisboa",Artigo 258.º do Código dos Contratos Públicos,,,,,,Não aplicável.,Não aplicável.,FALSE
AD104027 AQUISIÇÃO CENTRALIZADA P/SPMS-AD-AC-2017-48 - MEDICAMENTOS 2017,Ajuste Direto Regime Geral,Aquisição de bens móveis,"33620000-2, Medicamentos para o sangue, para os órgãos hematopoiéticos e para o aparelho cardiovascular","Centro Hospitalar de Lisboa Ocidental, E. P. E. (507618319)","CELGENE SOCIEDADE UNIPESSOAL, LDA (507791690)","224.990,44 €",10-08-2017,22-05-2017,365 dias,"Portugal, Lisboa, Lisboa","Artigo 24.º, n.º 1, alínea e) do Código dos Contratos Públicos",,,,,,Não aplicável.,Não aplicável.,FALSE
AQ100947 AQUISIÇÃO CENTRALIZADA PELA SPMS  MEDICAMENTOS-P259-AC-2017-65 - 2017,Ajuste Direto Regime Geral,Aquisição de bens móveis,"33650000-1, Anti-infecciosos gerais de uso sistémico, vacinas, antineoplásicos e imunomoduladores","Centro Hospitalar de Lisboa Ocidental, E. P. E. (507618319)",BRISTOL MYERS SQUIBB FARMACEUTICA PORTUGUESA. S.A. (500048193),"360.455,07 €",10-08-2017,03-07-2017,365 dias,"Portugal, Lisboa, Lisboa",Artigo 258.º do Código dos Contratos Públicos,,,,,,Não aplicável.,Não aplicável.,FALSE
AQ101397 AQUISIÇÃO DE MEDICAMENTOS TRATAMENTO HEPATITE LEDIPASVIR+SOFOSBUVIR 2017,Ajuste Direto Regime Geral,Aquisição de bens móveis,"33620000-2, Medicamentos para o sangue, para os órgãos hematopoiéticos e para o aparelho cardiovascular","Centro Hospitalar de Lisboa Ocidental, E. P. E. (507618319)","GILEAD SCIENCES, LDA (503604704)","87.348,66 €",10-08-2017,07-08-2017,365 dias,"Portugal, Lisboa, Lisboa",Artigo 258.º do Código dos Contratos Públicos,,,,,,Não aplicável.,Não aplicável.,FALSE
"AD801177 - AR CONDICIONADO - S. PATOLOGIA CLINICA DO CHLO, EPE (HEM)",Ajuste Direto Regime Geral,Aquisição de bens móveis,"31000000-6, Maquinaria, aparelhagem, equipamento e consumíveis eléctricos; iluminação","Centro Hospitalar de Lisboa Ocidental, E. P. E. (507618319)",HEPAFILTRA LDA (503615072),"8.850,00 €",10-08-2017,26-07-2017,66 dias,"Portugal, Lisboa, Lisboa","Artigo 20.º, n.º 1, alínea a) do Código dos Contratos Públicos",,,,,,Não aplicável.,Não aplicável.,FALSE
AQ100857 AQUISIÇÃO CENTRALIZADA PELA SPMS MEDICAMENTOS NILOTINIB - 2017,Ajuste Direto Regime Geral,Aquisição de bens móveis,"33610000-9, Medicamentos para o tracto digestivo e o metabolismo","Centro Hospitalar de Lisboa Ocidental, E. P. E. (507618319)","NOVARTIS FARMA PRODUTOS FARMACEUTICOS, D.A. (500063524)","182.926,26 €",09-08-2017,26-05-2017,365 dias,"Portugal, Lisboa, Lisboa",Artigo 258.º do Código dos Contratos Públicos,,,,,,Não aplicável.,Não aplicável.,FALSE
AQ100137 FORNECIMENTO DE MEDICAMENTOS DO G.F.T.6 ANO 2017,Ajuste Direto Regime Geral,Aquisição de bens móveis,"33620000-2, Medicamentos para o sangue, para os órgãos hematopoiéticos e para o aparelho cardiovascular","Centro Hospitalar de Lisboa Ocidental, E. P. E. (507618319)","SANOFI PRODUTOS FARMACEUTICOS, LDA (500134960)","318.134,40 €",09-08-2017,25-01-2017,365 dias,"Portugal, Lisboa, Lisboa",Artigo 258.º do Código dos Contratos Públicos,,,,,,Não aplicável.,Não aplicável.,FALSE
AD100187 AQUISIÇÃO URGENTE DE PLASMA HUMANO 2017,Ajuste Direto Regime Geral,Aquisição de bens móveis,"33620000-2, Medicamentos para o sangue, para os órgãos hematopoiéticos e para o aparelho cardiovascular","Centro Hospitalar de Lisboa Ocidental, E. P. E. (507618319)",INSTITUTO PORTUGUES DO SANGUE (502423943),"43.840,00 €",09-08-2017,17-01-2017,365 dias,"Portugal, Lisboa, Lisboa",Artigo 258.º do Código dos Contratos Públicos,,,,,,Não aplicável.,Não aplicável.,FALSE
AQ100177 AQUISIÇÃO DE MEDICAMENTOS G.F.T. 10 MEDIC.ANTIALERGICA ANO 2017,Ajuste Direto Regime Geral,Aquisição de bens móveis,"33660000-4, Medicamentos para o sistema nervoso e para os órgãos sensoriais","Centro Hospitalar de Lisboa Ocidental, E. P. E. (507618319)","BAYER PORTUGAL, LDA (500043256)","81,92 €",09-08-2017,24-05-2017,365 dias,"Portugal, Lisboa, Lisboa",Artigo 258.º do Código dos Contratos Públicos,,,,,,Não aplicável.,Não aplicável.,FALSE
AQ100747 AQUISIÇÃO DE MEDICAMENTOS TRATAMENTO HEPATITE SOFOSBUVIR+LEDIPASVIR 2017,Ajuste Direto Regime Geral,Aquisição de bens móveis,"33620000-2, Medicamentos para o sangue, para os órgãos hematopoiéticos e para o aparelho cardiovascular","Centro Hospitalar de Lisboa Ocidental, E. P. E. (507618319)","GILEAD SCIENCES, LDA (503604704)","92.367,66 €",09-08-2017,10-05-2017,365 dias,"Portugal, Lisboa, Lisboa",Artigo 258.º do Código dos Contratos Públicos,,,,,,Não aplicável.,Não aplicável.,FALSE
AQ100917 AQUISIÇÃO CENTRALIZADA PELA SPMS-P259-AC-2017-73-MEDICAMENTOS 2017,Ajuste Direto Regime Geral,Aquisição de bens móveis,"33690000-3, Medicamentos vários","Centro Hospitalar de Lisboa Ocidental, E. P. E. (507618319)","MERCK SHARP & DOHME, LDA (500191360)","118.426,20 €",09-08-2017,26-05-2017,365 dias,"Portugal, Lisboa, Lisboa",Artigo 258.º do Código dos Contratos Públicos,,,,,,Não aplicável.,Não aplicável.,FALSE
AD800947 - SISTEMA SPLITS PARA CLIMATIZAÇÃO ADAPTAÇÃO PISO 4 HEM,Ajuste Direto Regime Geral,Aquisição de bens móveis,"31000000-6, Maquinaria, aparelhagem, equipamento e consumíveis eléctricos; iluminação","Centro Hospitalar de Lisboa Ocidental, EPE (CHLO) (507618319)",HEPAFILTRA LDA (503615072),"15.830,00 €",09-08-2017,26-07-2017,66 dias,"Portugal, Lisboa, Lisboa","Artigo 20.º, n.º 1, alínea a) do Código dos Contratos Públicos",,,,,,Não aplicável.,Não aplicável.,FALSE
AD801227 - SISTEMA MONOSPLIT - NEUROTRAUMATOLOGIA DO HEM,Ajuste Direto Regime Geral,Aquisição de bens móveis,"42000000-6, Máquinas industriais","Centro Hospitalar de Lisboa Ocidental, E. P. E. (507618319)",HEPAFILTRA LDA (503615072),"23.310,00 €",09-08-2017,31-07-2017,66 dias,"Portugal, Lisboa, Lisboa","Artigo 20.º, n.º 1, alínea a) do Código dos Contratos Públicos",,,,,,Não aplicável.,Não aplicável.,FALSE
AD801237 - AR CONDICIONADO CIRURGIA PISO 5 DO HEM,Ajuste Direto Regime Geral,Aquisição de bens móveis,"31000000-6, Maquinaria, aparelhagem, equipamento e consumíveis eléctricos; iluminação","Centro Hospitalar de Lisboa Ocidental, E. P. E. (507618319)",HEPAFILTRA LFA (503615072),"24.220,00 €",09-08-2017,28-07-2017,66 dias,"Portugal, Lisboa, Lisboa","Artigo 20.º, n.º 1, alínea a) do Código dos Contratos Públicos",,,,,,Não aplicável.,Não aplicável.,FALSE
AQ100987 AQUISIÇÃO CENTRALIZADA P/SPMS MEDICAMENTOS-P259-AC-2017-98-2017,Ajuste Direto Regime Geral,Aquisição de bens móveis,"33620000-2, Medicamentos para o sangue, para os órgãos hematopoiéticos e para o aparelho cardiovascular","Centro Hospitalar de Lisboa Ocidental, E. P. E. (507618319)","BAYER PORTUGAL, LDA (500043256)","115.286,16 €",09-08-2017,04-07-2017,365 dias,"Portugal, Lisboa, Lisboa",Artigo 258.º do Código dos Contratos Públicos,,,,,,Não aplicável.,Não aplicável.,FALSE
AQ100657-AQUISIÇÃO CENTRALIZADA P/SPMS-P259-AC-2017-53 MEDICAMENTOS SORAFENIB-2017,Ajuste Direto Regime Geral,Aquisição de bens móveis,"33620000-2, Medicamentos para o sangue, para os órgãos hematopoiéticos e para o aparelho cardiovascular","Centro Hospitalar de Lisboa Ocidental, E. P. E. (507618319)","BAYER PORTUGAL, LDA (500043256)","21.557,26 €",09-08-2017,19-04-2017,365 dias,"Portugal, Lisboa, Lisboa",Artigo 258.º do Código dos Contratos Públicos,,,,,,Não aplicável.,Não aplicável.,FALSE
AD104007 AQUISIÇÃO CENTRALIZADA P/SPMS MEDICAMENTOS -AD-AC-2017-47-LENALIDOMIDA-2017,Ajuste Direto Regime Geral,Aquisição de bens móveis,"33620000-2, Medicamentos para o sangue, para os órgãos hematopoiéticos e para o aparelho cardiovascular","Centro Hospitalar de Lisboa Ocidental, E. P. E. (507618319)","CELGENE SOC.UNIPESSOAL, LDA (507791690)","106.870,28 €",09-08-2017,19-05-2017,365 dias,"Portugal, Lisboa, Lisboa","Artigo 24.º, n.º 1, alínea e) do Código dos Contratos Públicos",,,,,,Não aplicável.,Não aplicável.,FALSE
AQ100357 AQUISIÇÃO DE MEDICAMENTOS TRATAMENTO HEPATITE SOFOSBUVIR+LEDIPASVIR 2017,Ajuste Direto Regime Geral,Aquisição de bens móveis,"33620000-2, Medicamentos para o sangue, para os órgãos hematopoiéticos e para o aparelho cardiovascular","Centro Hospitalar de Lisboa Ocidental, E. P. E. (507618319)","GILEAD SCIENCES, LDA (503604704)","816.251,94 €",09-08-2017,01-02-2017,365 dias,"Portugal, Lisboa, Lisboa",Artigo 258.º do Código dos Contratos Públicos,,,,,,Não aplicável.,Não aplicável.,FALSE
Aquisição de Material Disposable do Bloco Operatório - Parte I-A,Ao abrigo de acordo-quadro (art.º 259.º),Aquisição de bens móveis,"33140000-3, Material médico de consumo","Centro Hospitalar de Lisboa Ocidental, E. P. E. (507618319)","OASIPOR - IMPORTACAO E EXPORTACAO, S. A (502260750)","11.454,50 €",09-08-2017,12-07-2017,365 dias,"Portugal, Lisboa, Lisboa",Artigo 259.º do Código dos Contratos Públicos,,,,,,2078840,CP 2016/24 - Acordo quadro para fornecimento de Material disposable de bloco operatório - Parte I-A às Instituições e Serviços do Serviço Nacional de Saúde,FALSE
Aquisição de Material Disposable do Bloco Operatório - Parte I-A,Ao abrigo de acordo-quadro (art.º 259.º),Aquisição de bens móveis,"33140000-3, Material médico de consumo","Centro Hospitalar de Lisboa Ocidental, E. P. E. (507618319)","QUILABAN,LDA. (500399670)","62.554,59 €",09-08-2017,12-07-2017,365 dias,"Portugal, Lisboa, Lisboa",Artigo 259.º do Código dos Contratos Públicos,,,,,,2078840,CP 2016/24 - Acordo quadro para fornecimento de Material disposable de bloco operatório - Parte I-A às Instituições e Serviços do Serviço Nacional de Saúde,FALSE
Aquisição de Material Disposable do Bloco Operatório - Parte I-A,Ao abrigo de acordo-quadro (art.º 259.º),Aquisição de bens móveis,"33140000-3, Material médico de consumo","Centro Hospitalar de Lisboa Ocidental, E. P. E. (507618319)","SFERAMED-MEDICAL SUPPLIER,LDA. (509762344)","15.544,00 €",09-08-2017,12-07-2017,365 dias,"Portugal, Lisboa, Lisboa",Artigo 259.º do Código dos Contratos Públicos,,,,,,2078840,CP 2016/24 - Acordo quadro para fornecimento de Material disposable de bloco operatório - Parte I-A às Instituições e Serviços do Serviço Nacional de Saúde,FALSE
Aquisição de Material Disposable do Bloco Operatório - Parte I-A,Ao abrigo de acordo-quadro (art.º 259.º),Aquisição de bens móveis,"33140000-3, Material médico de consumo","Centro Hospitalar de Lisboa Ocidental, E. P. E. (507618319)","DOCWORLD, Lda (508592909)","37.848,00 €",09-08-2017,12-07-2017,365 dias,"Portugal, Lisboa, Lisboa",Artigo 259.º do Código dos Contratos Públicos,,,,,,2078840,CP 2016/24 - Acordo quadro para fornecimento de Material disposable de bloco operatório - Parte I-A às Instituições e Serviços do Serviço Nacional de Saúde,FALSE
"Aquisição de Sistemas de Soro C/ Arejador e filtro para o CHLO, no Ano de 2017",Concurso público,Locação de bens móveis,"33140000-3, Material médico de consumo","Centro Hospitalar de Lisboa Ocidental, E. P. E. (507618319)","P.M.H. PRODUTOS MEDICO HOSPITALARES, SA (502376899)","87.747,89 €",08-08-2017,14-07-2017,365 dias,"Portugal, Lisboa, Lisboa","Artigo 20.º, n.º 1, alínea b) do Código dos Contratos Públicos",,,,,,Não aplicável.,Não aplicável.,FALSE
CONSTRUÇÃO DA NOVA SALA DE ESPERA DA URGÊNCIA GERAL,Ajuste Direto Regime Geral,Outros Tipos (Concessão de exploração de bens do domínio público),"71500000-3, Serviços relacionados com a construção","Centro Hospitalar de Lisboa Ocidental, EPE (CHLO) (507618319)","VCJ - projetos, Imóveis e Consultadoria, Lda (504148036)","89.903,31 €",07-08-2017,01-08-2017,47 dias,"Portugal, Lisboa, Lisboa","Artigo 20.º, n.º 1, alínea a) do Código dos Contratos Públicos",,,,,,Não aplicável.,Não aplicável.,FALSE
AQ100737 AQUISIÇÃO DE MEDICAMENTO TRATAMENTO HEPATITE LEDIPASVIR+SOFOSBUVIR 2017,Ajuste Direto Regime Geral,Aquisição de bens móveis,"33620000-2, Medicamentos para o sangue, para os órgãos hematopoiéticos e para o aparelho cardiovascular","Centro Hospitalar de Lisboa Ocidental, E. P. E. (507618319)","GILEAD SCIENCES, LDA (503604704)","336.681,42 €",07-08-2017,10-05-2017,365 dias,"Portugal, Lisboa, Lisboa",Artigo 258.º do Código dos Contratos Públicos,,,,,,Não aplicável.,Não aplicável.,FALSE
AQ100697 AQUISIÇÃO MEDICAMENTOS TRATAMENTO HEPATITE SOFOSBUVIR+LEDIPASVIR 2017,Ajuste Direto Regime Geral,Aquisição de bens móveis,"33620000-2, Medicamentos para o sangue, para os órgãos hematopoiéticos e para o aparelho cardiovascular","Centro Hospitalar de Lisboa Ocidental, E. P. E. (507618319)","GILEAD SCIENCES, LDA (503604704)","339.356,64 €",07-08-2017,10-05-2017,365 dias,"Portugal, Lisboa, Lisboa",Artigo 258.º do Código dos Contratos Públicos,,,,,,Não aplicável.,Não aplicável.,FALSE
AQ100477 AQUISIÇÃO DE MEDICAMENTOS TRATAMENTO HEPATITE SOFOSBUVIR+LEDIPASVIR 2017,Ajuste Direto Regime Geral,Aquisição de bens móveis,"33620000-2, Medicamentos para o sangue, para os órgãos hematopoiéticos e para o aparelho cardiovascular","Centro Hospitalar de Lisboa Ocidental, E. P. E. (507618319)","GILEAD SCIENCES, LDA (503604704)","308.229,81 €",07-08-2017,09-03-2017,365 dias,"Portugal, Lisboa, Lisboa",Artigo 258.º do Código dos Contratos Públicos,,,,,,Não aplicável.,Não aplicável.,FALSE
AQ100717 AQUISIÇÃO DE MEDICAMENTOSD TRATAMENTO HEPATITE SOFOSBUVI+LEDIPASVIR  2017,Ajuste Direto Regime Geral,Aquisição de bens móveis,"33620000-2, Medicamentos para o sangue, para os órgãos hematopoiéticos e para o aparelho cardiovascular","Centro Hospitalar de Lisboa Ocidental, E. P. E. (507618319)","GILEADA SCIENCES, LDA (503604704)","318.267,81 €",07-08-2017,10-05-2017,365 dias,"Portugal, Lisboa, Lisboa",Artigo 258.º do Código dos Contratos Públicos,,,,,,Não aplicável.,Não aplicável.,FALSE
AQ100727 AQUISIÇÃO MEDICAMENTOS TRATAMENTO HEPATITE SOFOSBUVIR + LEDIPASVIR 2017,Ajuste Direto Regime Geral,Aquisição de bens móveis,"33620000-2, Medicamentos para o sangue, para os órgãos hematopoiéticos e para o aparelho cardiovascular","Centro Hospitalar de Lisboa Ocidental, E. P. E. (507618319)","GILEAD SCIENCES, LDA (503604704)","344.375,64 €",07-08-2017,10-05-2017,365 dias,"Portugal, Lisboa, Lisboa",Artigo 258.º do Código dos Contratos Públicos,,,,,,Não aplicável.,Não aplicável.,FALSE
AD103307 AQUISIÇÃO MEDICAMENTOS TRATAMENTO HEPATITE ZEPATIER 2017,Ajuste Direto Regime Geral,Aquisição de bens móveis,"33620000-2, Medicamentos para o sangue, para os órgãos hematopoiéticos e para o aparelho cardiovascular","Centro Hospitalar de Lisboa Ocidental, E. P. E. (507618319)",MERCK SHARPR & DOHME (500191360),"6.700,74 €",07-08-2017,28-04-2017,365 dias,"Portugal, Lisboa, Lisboa","Artigo 24.º, n.º 1, alínea e) do Código dos Contratos Públicos",,,,,,Não aplicável.,Não aplicável.,FALSE
AD104387 AQUISIÇÃO DE MEDICAMENTOSPARA TRATAMENTO HEPATITE DACLATASVIR 2017,Ajuste Direto Regime Geral,Aquisição de bens móveis,"33620000-2, Medicamentos para o sangue, para os órgãos hematopoiéticos e para o aparelho cardiovascular","Centro Hospitalar de Lisboa Ocidental, EPE (CHLO) (507618319)","BRISTOL MYERS SQUIBB FARMACEUTICA PORTUGUESA, S.A. (500048193)","102.407,90 €",07-08-2017,19-06-2017,365 dias,"Portugal, Lisboa, Lisboa","Artigo 24.º, n.º 1, alínea e) do Código dos Contratos Públicos",,,,,,Não aplicável.,Não aplicável.,FALSE
AD104407 AQUISIÇÃO DE MEDICAMENTOS TRATAMENTO HEPATITE ZEPATIER 2017,Ajuste Direto Regime Geral,Aquisição de bens móveis,"33620000-2, Medicamentos para o sangue, para os órgãos hematopoiéticos e para o aparelho cardiovascular","Centro Hospitalar de Lisboa Ocidental, E. P. E. (507618319)",MERCK SHARP & DOHME (500191360),"14.205,56 €",04-08-2017,19-06-2017,365 dias,"Portugal, Lisboa, Lisboa","Artigo 24.º, n.º 1, alínea e) do Código dos Contratos Públicos",,,,,,Não aplicável.,Não aplicável.,FALSE
AQ100707 AQUISIÇÃO DE MEDICAMENTOS TRATAMENTO HEPATITE SOFOSBUVIR -2017,Ajuste Direto Regime Geral,Aquisição de bens móveis,"33620000-2, Medicamentos para o sangue, para os órgãos hematopoiéticos e para o aparelho cardiovascular","Centro Hospitalar de Lisboa Ocidental, E. P. E. (507618319)","GILEAD SCIENCES, LDA (503604704)","329.318,64 €",04-08-2017,10-05-2017,365 dias,"Portugal, Lisboa, Lisboa",Artigo 258.º do Código dos Contratos Públicos,,,,,,Não aplicável.,Não aplicável.,FALSE
AD111956 AQUISIÇÃO DE  MEDICAMENTOS TRATAMENTO HEPATITE VIEKIRAX+EXVIERA 2017,Ajuste Direto Regime Geral,Aquisição de bens móveis,"33620000-2, Medicamentos para o sangue, para os órgãos hematopoiéticos e para o aparelho cardiovascular","Centro Hospitalar de Lisboa Ocidental, E. P. E. (507618319)","ABBVIE, LDA (510229050)","32.128,01 €",04-08-2017,30-12-2016,365 dias,"Portugal, Lisboa, Lisboa","Artigo 24.º, n.º 1, alínea e) do Código dos Contratos Públicos",,,,,,Não aplicável.,Não aplicável.,FALSE
AQ100377 AQUISIÇÃO DE MEDICAMENTOS TRATAMENTO HEPATITE SOFOSBUVIR+LEDIPASVIR 2017,Ajuste Direto Regime Geral,Aquisição de bens móveis,"33620000-2, Medicamentos para o sangue, para os órgãos hematopoiéticos e para o aparelho cardiovascular","Centro Hospitalar de Lisboa Ocidental, E. P. E. (507618319)","GILEAD SCIENCES, LDA (503604704)","277.102,98 €",04-08-2017,01-03-2017,365 dias,"Portugal, Lisboa, Lisboa",Artigo 258.º do Código dos Contratos Públicos,,,,,,Não aplicável.,Não aplicável.,FALSE
AD101237 AQUISIÇÃO DE MEDICAMENTOS PARA TRATAMENTO HEPATITE ANO 2017,Ajuste Direto Regime Geral,Aquisição de bens móveis,"33620000-2, Medicamentos para o sangue, para os órgãos hematopoiéticos e para o aparelho cardiovascular","Centro Hospitalar de Lisboa Ocidental, E. P. E. (507618319)","ABBVIE, LDA (510229050)","46.906,92 €",04-08-2017,13-02-2017,365 dias,"Portugal, Lisboa, Lisboa","Artigo 24.º, n.º 1, alínea e) do Código dos Contratos Públicos",,,,,,Não aplicável.,Não aplicável.,FALSE
AD103537 AQUISIÇÃO MEDICAMENTOS PARA TRATAMENTO HEPATITE 2017,Ajuste Direto Regime Geral,Aquisição de bens móveis,"33620000-2, Medicamentos para o sangue, para os órgãos hematopoiéticos e para o aparelho cardiovascular","Centro Hospitalar de Lisboa Ocidental, EPE (CHLO) (507618319)","ABBVIE, LDA (510229050)","21.000,00 €",04-08-2017,08-05-2017,365 dias,"Portugal, Lisboa, Lisboa","Artigo 24.º, n.º 1, alínea e) do Código dos Contratos Públicos",,,,,,Não aplicável.,Não aplicável.,FALSE
AD103627 AQUISIÇÃO DE MEDICAMENTOS TYRATAMENTO HEPATITE 2017,Ajuste Direto Regime Geral,Aquisição de bens móveis,"33620000-2, Medicamentos para o sangue, para os órgãos hematopoiéticos e para o aparelho cardiovascular","Centro Hospitalar de Lisboa Ocidental, EPE (CHLO) (507618319)",BRISTOL MYERS SQYUIBB COMPANY (500048193),"76.805,92 €",04-08-2017,10-05-2017,365 dias,"Portugal, Lisboa, Lisboa","Artigo 24.º, n.º 1, alínea e) do Código dos Contratos Públicos",,,,,,Não aplicável.,Não aplicável.,FALSE
AD103547 AQUISIÇÃO MEDICAMENTOS TRATAMENTO HEPATITE ZEPATIER 2017,Ajuste Direto Regime Geral,Aquisição de bens móveis,"33620000-2, Medicamentos para o sangue, para os órgãos hematopoiéticos e para o aparelho cardiovascular","Centro Hospitalar de Lisboa Ocidental, EPE (CHLO) (507618319)",MERCK SHARP & DOHME (500191360),"13.401,47 €",04-08-2017,08-05-2017,365 dias,"Portugal, Lisboa, Lisboa","Artigo 24.º, n.º 1, alínea e) do Código dos Contratos Públicos",,,,,,Não aplicável.,Não aplicável.,FALSE
AD100897 AQUISIÇÃO MEDICAMENTOS TRATAMENTO HEPATITE 2017,Ajuste Direto Regime Geral,Aquisição de bens móveis,"33620000-2, Medicamentos para o sangue, para os órgãos hematopoiéticos e para o aparelho cardiovascular","Centro Hospitalar de Lisboa Ocidental, E. P. E. (507618319)","ABBVIE, LDA (510229050)","30.843,00 €",04-08-2017,31-01-2017,365 dias,"Portugal, Lisboa, Lisboa","Artigo 24.º, n.º 1, alínea e) do Código dos Contratos Públicos",,,,,,Não aplicável.,Não aplicável.,FALSE
AD100877 AQUISIÇÃO DE MEDICAMENTOS DASABUVIR+OMBITASVIR+PARITAPRAVIR+RITONAVIR 2017,Ajuste Direto Regime Geral,Aquisição de bens móveis,"33620000-2, Medicamentos para o sangue, para os órgãos hematopoiéticos e para o aparelho cardiovascular","Centro Hospitalar de Lisboa Ocidental, E. P. E. (507618319)","ABBVIE, LDA (510229050)","32.128,01 €",04-08-2017,31-01-2017,365 dias,"Portugal, Lisboa, Lisboa","Artigo 24.º, n.º 1, alínea e) do Código dos Contratos Públicos",,,,,,Não aplicável.,Não aplicável.,FALSE
AD101347 AQUISIÇÃO DE MEDICAMENTOS TRATAMENTO HEPATITE ZEPATIER 2017,Ajuste Direto Regime Geral,Aquisição de bens móveis,"33620000-2, Medicamentos para o sangue, para os órgãos hematopoiéticos e para o aparelho cardiovascular","Centro Hospitalar de Lisboa Ocidental, EPE (CHLO) (507618319)",MERCK SHARP & DOHME (500191360),"13.401,47 €",04-08-2017,01-03-2017,365 dias,"Portugal, Lisboa, Lisboa","Artigo 24.º, n.º 1, alínea e) do Código dos Contratos Públicos",,,,,,Não aplicável.,Não aplicável.,FALSE
AD102077 AQUISIÇÃO DE MEDICAMENTOS TRATAMENTO HEPATITE ZEPATIER 2017,Ajuste Direto Regime Geral,Aquisição de bens móveis,"33620000-2, Medicamentos para o sangue, para os órgãos hematopoiéticos e para o aparelho cardiovascular","Centro Hospitalar de Lisboa Ocidental, EPE (CHLO) (507618319)",MERCK SHARP & DOHME (500191360),"7.102,78 €",04-08-2017,09-03-2017,365 dias,"Portugal, Lisboa, Lisboa","Artigo 24.º, n.º 1, alínea e) do Código dos Contratos Públicos",,,,,,Não aplicável.,Não aplicável.,FALSE
AD102127 AQUISIÇÃO DE MEDICAMENTOS TRATAMENTO HEPATITE DAKLINZA 2017,Ajuste Direto Regime Geral,Aquisição de bens móveis,"33620000-2, Medicamentos para o sangue, para os órgãos hematopoiéticos e para o aparelho cardiovascular","Centro Hospitalar de Lisboa Ocidental, EPE (CHLO) (507618319)",BRISTOL MYERS SQUIBB COMPANY (500048193),"128.009,86 €",04-08-2017,17-03-2017,365 dias,"Portugal, Lisboa, Lisboa","Artigo 24.º, n.º 1, alínea e) do Código dos Contratos Públicos",,,,,,Não aplicável.,Não aplicável.,FALSE
AD102267 AQUISIÇÃO DE MEDICAMENTOS TRATAMENTO HEPATITE ZEPATIER 2017,Ajuste Direto Regime Geral,Aquisição de bens móveis,"33620000-2, Medicamentos para o sangue, para os órgãos hematopoiéticos e para o aparelho cardiovascular","Centro Hospitalar de Lisboa Ocidental, EPE (CHLO) (507618319)",MERCK SHARP & DOHME (500191360),"80.408,77 €",04-08-2017,20-03-2017,365 dias,"Portugal, Lisboa, Lisboa","Artigo 24.º, n.º 1, alínea e) do Código dos Contratos Públicos",,,,,,Não aplicável.,Não aplicável.,FALSE
AD102157 AQUISIÇÃO DE MEDICAMENTOS TRATAMENTO HEPATITE DASABUVIR+OMBITASVIR+PARITAPREVIR+RITONAVIR 2017,Ajuste Direto Regime Geral,Aquisição de bens móveis,"33620000-2, Medicamentos para o sangue, para os órgãos hematopoiéticos e para o aparelho cardiovascular","Centro Hospitalar de Lisboa Ocidental, E. P. E. (507618319)","ABBVIE, LDA (510229050)","16.064,01 €",04-08-2017,17-03-2017,365 dias,"Portugal, Lisboa, Lisboa","Artigo 24.º, n.º 1, alínea e) do Código dos Contratos Públicos",,,,,,Não aplicável.,Não aplicável.,FALSE
AD102257 AQUISIÇÃO DE MEDICAMENTOS TRATAMENTO HEPATITE DAKLINZA 2017,Ajuste Direto Regime Geral,Aquisição de bens móveis,"33620000-2, Medicamentos para o sangue, para os órgãos hematopoiéticos e para o aparelho cardiovascular","Centro Hospitalar de Lisboa Ocidental, EPE (CHLO) (507618319)",BRISTOL MYERS SQUIBB COMPANY (500048193),"204.815,79 €",04-08-2017,20-03-2017,365 dias,"Portugal, Lisboa, Lisboa","Artigo 24.º, n.º 1, alínea e) do Código dos Contratos Públicos",,,,,,Não aplicável.,Não aplicável.,FALSE
AD102357 AQUISIÇÃO DE MEDICAMENTOS TRATAMENTO HEPATITE DASABUVIR+OMBITASVIR+PARITAPREVIR+RITONAVIR 2017,Ajuste Direto Regime Geral,Aquisição de bens móveis,"33620000-2, Medicamentos para o sangue, para os órgãos hematopoiéticos e para o aparelho cardiovascular","Centro Hospitalar de Lisboa Ocidental, EPE (CHLO) (507618319)","ABBVIE, LDA (510229050)","16.064,01 €",04-08-2017,20-03-2017,365 dias,"Portugal, Lisboa, Lisboa","Artigo 24.º, n.º 1, alínea e) do Código dos Contratos Públicos",,,,,,Não aplicável.,Não aplicável.,FALSE
AD105427 AQUISIÇÃO DE MEDICAMENTOS TRATAMENTO HEPATITE SOFOSBUVIR+VELPATASVIR 2017,Ajuste Direto Regime Geral,Aquisição de bens móveis,"33600000-6, Produtos farmacêuticos","Centro Hospitalar de Lisboa Ocidental, EPE (CHLO) (507618319)",GILEAD SCIENCES (503604704),"46.183,83 €",04-08-2017,07-07-2017,365 dias,"Portugal, Lisboa, Lisboa","Artigo 24.º, n.º 1, alínea e) do Código dos Contratos Públicos",,,,,,Não aplicável.,Não aplicável.,FALSE
SERVIÇOS DE TRATAMENTO DE RESIDUOS HOSPITALARES NO CHLO EPE – de julho a agosto de 2017,Ajuste Direto Regime Geral,Aquisição de serviços,"90524100-7, Serviços de recolha de resíduos hospitalares","Centro Hospitalar de Lisboa Ocidental, EPE (CHLO) (507618319)",Serviço de Utilização Comum dos Hospitais (500900469),"103.467,38 €",31-07-2017,10-07-2017,62 dias,"Portugal, Lisboa, Lisboa","Artigo 27.º, n.º 1, alínea a) do Código dos Contratos Públicos",,,,,,Não aplicável.,Não aplicável.,FALSE
Aquisição de Nastros e Fitas Cirúrgicas para o CHLO,Ao abrigo de acordo-quadro (art.º 259.º),Aquisição de bens móveis,"33140000-3, Material médico de consumo","Centro Hospitalar de Lisboa Ocidental, E. P. E. (507618319)","DOCWORLD, Lda (508592909)","2.586,25 €",31-07-2017,10-07-2017,365 dias,"Portugal, Lisboa, Lisboa",Artigo 259.º do Código dos Contratos Públicos,,,,,,2183753,CP 2016/82 - Acordo quadro para fornecimento de Nastros e Fitas Cirúrgicas às Instituições e Serviços do Serviço Nacional de Saúde,FALSE
Aquisição de Nastros e Fitas Cirúrgicas para o CHLO,Ao abrigo de acordo-quadro (art.º 259.º),Aquisição de bens móveis,"33140000-3, Material médico de consumo","Centro Hospitalar de Lisboa Ocidental, E. P. E. (507618319)","Bastos Viegas, S.A. (500042772)","2.843,71 €",31-07-2017,10-07-2017,365 dias,"Portugal, Lisboa, Lisboa",Artigo 259.º do Código dos Contratos Públicos,,,,,,2183753,CP 2016/82 - Acordo quadro para fornecimento de Nastros e Fitas Cirúrgicas às Instituições e Serviços do Serviço Nacional de Saúde,FALSE
Aquisição de Nastros e Fitas Cirurgicas para o CHLO,Ao abrigo de acordo-quadro (art.º 259.º),Aquisição de bens móveis,"33140000-3, Material médico de consumo","Centro Hospitalar de Lisboa Ocidental, E. P. E. (507618319)","Bastos Viegas, S.A. (500042772)","4.946,00 €",31-07-2017,10-07-2017,365 dias,"Portugal, Lisboa, Lisboa",Artigo 259.º do Código dos Contratos Públicos,,,,,,2183753,CP 2016/82 - Acordo quadro para fornecimento de Nastros e Fitas Cirúrgicas às Instituições e Serviços do Serviço Nacional de Saúde,FALSE
AQUISIÇÃO DE TECLADOS E RATOS HIGIENIZÁVEIS PARA O CHLO,Ajuste Direto Regime Geral,Aquisição de bens móveis,"30000000-9, Máquinas, equipamento e material de escritório e de informática, excepto mobiliário e pacotes de programas (software)","Centro Hospitalar de Lisboa Ocidental, E. P. E. (507618319)","JUDEKO, LDA (508242576)","6.240,00 €",31-07-2017,18-07-2017,30 dias,"Portugal, Lisboa, Lisboa","Artigo 20.º, n.º 1, alínea a) do Código dos Contratos Públicos",,,,,,Não aplicável.,Não aplicável.,FALSE
