Objeto do Contrato,Tipo de Procedimento,Tipo(s) de Contrato,CPVs,Entidade(s) Adjudicante(s),Entidade(s) Adjudicatária(s),Preço Contratual,Data de Publicação,Data de Celebração do Contrato,Prazo de Execução,Local de Execução,Fundamentação,Data de Fecho do Contrato,Preço Total Efetivo,Causas das Alterações ao Prazo,Causas das Alterações ao Preço,Estado,N.º registo do Acordo Quadro,Descrição do Acordo Quadro,Procedimento Centralizado
"Prestação Serviços Externos de Gestão do Projeto ePatientCentric do Centro Hospitalar S. João, EPE",Ajuste Direto Regime Geral,Aquisição de serviços,"79421000-1, Serviços de gestão de projectos, excepto projectos de construção","Centro Hospitalar de São João, E. P. E. (509821197)",Skillmind - Consultoria de Gestão e Formação Lda. (507650387),"60.610,54 €",02-07-2012,13-06-2012,201 dias,"Portugal, Porto, Porto","Artigo 20.º, n.º 1, alínea a) do Código dos Contratos Públicos",,,,,,Não aplicável.,Não aplicável.,
"Substituição do pavimento do corredor do Bloco Central do Centro Hospitalar S. João, EPE",Ajuste Direto Regime Geral,Aquisição de serviços,"50000000-5, Serviços de reparação e manutenção","Centro Hospitalar de São João, E. P. E. (509821197)","Jofilhos - Sociedade de Construções, Lda. (500854386)","31.895,62 €",02-07-2012,28-06-2012,30 dias,"Portugal, Porto, Porto","Artigo 20.º, n.º 1, alínea a) do Código dos Contratos Públicos",,,,,,Não aplicável.,Não aplicável.,
