freguesia,acronym,validVotesPercentage,votes,dicofre
Frechas,PPD/PSD.CDS-PP,41.14,123,040716
Frechas,PS,41.14,123,040716
Frechas,PCP-PEV,5.35,16,040716
Frechas,MPT,4.68,14,040716
Frechas,B.E.,3.34,10,040716
Frechas,PAN,1.34,4,040716
Frechas,L,1,3,040716
Frechas,PCTP/MRPP,0.67,2,040716
Frechas,MAS,0.33,1,040716
Frechas,PND,0.33,1,040716
Frechas,PPM,0.33,1,040716
Frechas,PTP,0.33,1,040716
Frechas,PDA,0,0,040716
Frechas,PNR,0,0,040716
Frechas,POUS,0,0,040716
Frechas,PPV,0,0,040716
