Objeto do Contrato,Tipo de Procedimento,Tipo(s) de Contrato,CPVs,Entidade(s) Adjudicante(s),Entidade(s) Adjudicatária(s),Preço Contratual,Data de Publicação,Data de Celebração do Contrato,Prazo de Execução,Local de Execução,Fundamentação,Data de Fecho do Contrato,Preço Total Efetivo,Causas das Alterações ao Prazo,Causas das Alterações ao Preço,Estado,N.º registo do Acordo Quadro,Descrição do Acordo Quadro,Procedimento Centralizado
Medicamentos,Ajuste Direto Regime Geral,Aquisição de bens móveis,"33000000-0, Equipamento médico, medicamentos e produtos para cuidados pessoais",Centro Hospitalar Psiquiátrico de Lisboa (508338476),Alloga Portugal (504507230),"862,36 €",21-04-2016,18-08-2015,365 dias,"Portugal, Lisboa, Lisboa","Artigo 24.º, n.º 1, alínea e) do Código dos Contratos Públicos",31-12-2015,"862,36 €",,"",,Não aplicável.,Não aplicável.,FALSE
Medicamentos,Ajuste Direto Regime Geral,Aquisição de bens móveis,"33000000-0, Equipamento médico, medicamentos e produtos para cuidados pessoais",Centro Hospitalar Psiquiátrico de Lisboa (508338476),Confar (500070229),"128,00 €",21-04-2016,18-02-2015,365 dias,"Portugal, Lisboa, Lisboa","Artigo 24.º, n.º 1, alínea e) do Código dos Contratos Públicos",31-12-2015,"128,00 €",,"",,Não aplicável.,Não aplicável.,FALSE
411018/2015,Ajuste Direto Regime Geral,Aquisição de bens móveis,"33000000-0, Equipamento médico, medicamentos e produtos para cuidados pessoais",Centro Hospitalar Psiquiátrico de Lisboa (508338476),Servier Portugal (502177420),"325,59 €",21-04-2016,18-03-2015,365 dias,"Portugal, Lisboa, Lisboa","Artigo 24.º, n.º 1, alínea e) do Código dos Contratos Públicos",31-12-2015,"325,59 €",,"",,Não aplicável.,Não aplicável.,FALSE
411019/2015,Ajuste Direto Regime Geral,Aquisição de bens móveis,"33000000-0, Equipamento médico, medicamentos e produtos para cuidados pessoais",Centro Hospitalar Psiquiátrico de Lisboa (508338476),Norgine Portugal (508676746),"2.430,00 €",21-04-2016,18-02-2015,365 dias,"Portugal, Lisboa, Lisboa","Artigo 24.º, n.º 1, alínea e) do Código dos Contratos Públicos",31-12-2015,"2.430,00 €",,"",,Não aplicável.,Não aplicável.,FALSE
Serv. Arquitetura para mês Abril 2016,Ajuste Direto Regime Geral,Aquisição de serviços,"71000000-8, Serviços de arquitectura, construção, engenharia e inspecção",Centro Hospitalar Psiquiátrico de Lisboa (508338476),"Land Concept-Unipessoal, Lda (513079009)","807,00 €",20-04-2016,30-04-2015,30 dias,"Portugal, Lisboa, Lisboa","Artigo 24.º, n.º 1, alínea c) do Código dos Contratos Públicos",30-04-2015,"807,00 €",,"",,Não aplicável.,Não aplicável.,FALSE
Medicamentos dos CPA 06 dos SPMS,Ao abrigo de acordo-quadro (art.º 259.º),Aquisição de bens móveis,"33000000-0, Equipamento médico, medicamentos e produtos para cuidados pessoais",Centro Hospitalar Psiquiátrico de Lisboa (508338476),Bayer (500043256),"1.233,61 €",20-04-2016,07-04-2015,240 dias,"Portugal, Lisboa, Lisboa",Artigo 259.º do Código dos Contratos Públicos,31-12-2015,"1.233,61 €",,"",,1224054,"CONCURSO PÚBLICO PARA A CELEBRAÇÃO DE CONTRATOS PÚBLICOS DE APROVISIONAMENTO PARA A ÁREA DA SAÚDE, COM VISTA AO FORNECIMENTO DE MEDICAMENTOS DO FORO ONCOLÓGICO II, ÀS INSTITUIÇÕES E SERVIÇOS DO SERVIÇO NACIONAL DE SAÚDE  ",FALSE
Serv. Arquitetura de Março,Ajuste Direto Regime Geral,Aquisição de serviços,"71000000-8, Serviços de arquitectura, construção, engenharia e inspecção",Centro Hospitalar Psiquiátrico de Lisboa (508338476),"Land Concept - Unipessoal, LDA (513079009)","807,00 €",20-04-2016,31-03-2015,31 dias,"Portugal, Lisboa, Lisboa","Artigo 24.º, n.º 1, alínea c) do Código dos Contratos Públicos",31-03-2015,"807,00 €",,"",,Não aplicável.,Não aplicável.,FALSE
Consultoria de Arquitetura para mês de Fevereiro 2015,Ajuste Direto Regime Geral,Aquisição de serviços,"71000000-8, Serviços de arquitectura, construção, engenharia e inspecção",Centro Hospitalar Psiquiátrico de Lisboa (508338476),"Land Concept-Unipessoal, Lda. (513079009)","807,00 €",20-04-2016,09-02-2015,28 dias,"Portugal, Lisboa, Lisboa","Artigo 24.º, n.º 1, alínea c) do Código dos Contratos Públicos",28-02-2015,"807,00 €",,"",,Não aplicável.,Não aplicável.,FALSE
Consultadoria de Arquitetura para mês de Janeiro 2015,Ajuste Direto Regime Geral,Aquisição de serviços,"71000000-8, Serviços de arquitectura, construção, engenharia e inspecção",Centro Hospitalar Psiquiátrico de Lisboa (508338476),Land Concept (513079009),"807,00 €",20-04-2016,23-01-2015,30 dias,"Portugal, Lisboa, Lisboa","Artigo 24.º, n.º 1, alínea c) do Código dos Contratos Públicos",30-01-2015,"807,00 €",,"",,Não aplicável.,Não aplicável.,FALSE
"Alimentação de para o CHPL de Outubro a Dezembro, 2015",Ao abrigo de acordo-quadro (art.º 259.º),Aquisição de serviços,"55320000-9, Serviços de provimento de refeições",Centro Hospitalar Psiquiátrico de Lisboa (508338476),Gertal (500126623),"230.654,50 €",20-04-2016,01-10-2015,90 dias,"Portugal, Lisboa, Lisboa",Artigo 259.º do Código dos Contratos Públicos,31-12-2015,"230.654,50 €",,"",,1125527,Acordo quadro para o fornecimento de refeições confecionadas,FALSE
41100115 Medicamentos Urgentes,Ajuste Direto Regime Geral,Aquisição de bens móveis,"33000000-0, Equipamento médico, medicamentos e produtos para cuidados pessoais",Centro Hospitalar Psiquiátrico de Lisboa (508338476),Alliance Healtcare (502693150),"12.000,00 €",20-04-2016,03-02-2015,365 dias,"Portugal, Lisboa, Lisboa","Artigo 20.º, n.º 1, alínea a) do Código dos Contratos Públicos",31-12-2015,"12.000,00 €",,"",,Não aplicável.,Não aplicável.,FALSE
41200615 Reagentes  Exclusivos da Batista Marques,Ajuste Direto Regime Geral,Aquisição de bens móveis,"33000000-0, Equipamento médico, medicamentos e produtos para cuidados pessoais",Centro Hospitalar Psiquiátrico de Lisboa (508338476),Batista Marques (501439110),"2.261,69 €",20-04-2016,04-02-2015,365 dias,"Portugal, Lisboa, Lisboa","Artigo 20.º, n.º 1, alínea a) do Código dos Contratos Públicos",31-12-2015,"2.261,69 €",,"",,Não aplicável.,Não aplicável.,FALSE
41200415 Reagentes Exclusivos da Biomerieux,Ajuste Direto Regime Geral,Aquisição de bens móveis,"33000000-0, Equipamento médico, medicamentos e produtos para cuidados pessoais",Centro Hospitalar Psiquiátrico de Lisboa (508338476),Biomerieux (501524177),"20.042,10 €",19-04-2016,04-02-2015,365 dias,"Portugal, Lisboa, Lisboa","Artigo 20.º, n.º 1, alínea a) do Código dos Contratos Públicos",31-12-2015,"20.042,10 €",,"",,Não aplicável.,Não aplicável.,FALSE
41200315 Reagentes Exclusivos da  Siemens,Ajuste Direto Regime Geral,Aquisição de bens móveis,"33000000-0, Equipamento médico, medicamentos e produtos para cuidados pessoais",Centro Hospitalar Psiquiátrico de Lisboa (508338476),Siemens Healtcare (507925173),"39.880,00 €",19-04-2016,29-01-2015,365 dias,"Portugal, Lisboa, Lisboa","Artigo 20.º, n.º 1, alínea a) do Código dos Contratos Públicos",31-12-2015,"39.880,00 €",,"",,Não aplicável.,Não aplicável.,FALSE
41200215 Reagentes Exclusivos da Horiba,Ajuste Direto Regime Geral,Aquisição de bens móveis,"33000000-0, Equipamento médico, medicamentos e produtos para cuidados pessoais",Centro Hospitalar Psiquiátrico de Lisboa (508338476),Horiba (980158583),"27.135,52 €",19-04-2016,29-01-2015,365 dias,"Portugal, Lisboa, Lisboa","Artigo 20.º, n.º 1, alínea a) do Código dos Contratos Públicos",31-12-2015,"27.135,52 €",,"",,Não aplicável.,Não aplicável.,FALSE
41200515 - Reagentes Exclusivos da Menarini,Ajuste Direto Regime Geral,Aquisição de bens móveis,"33000000-0, Equipamento médico, medicamentos e produtos para cuidados pessoais",Centro Hospitalar Psiquiátrico de Lisboa (508338476),Menarini (502610069),"7.370,23 €",19-04-2016,02-02-2015,365 dias,"Portugal, Lisboa, Lisboa","Artigo 20.º, n.º 1, alínea a) do Código dos Contratos Públicos",31-12-2015,"7.370,23 €",,"",,Não aplicável.,Não aplicável.,FALSE
412001115 Reagentes Gerais,Ajuste Direto Regime Geral,Aquisição de bens móveis,"33696500-0, Reagentes de laboratório",Centro Hospitalar Psiquiátrico de Lisboa (508338476),Alere (502518863),"3.355,02 €",19-04-2016,02-02-2015,365 dias,"Portugal, Lisboa, Lisboa","Artigo 20.º, n.º 1, alínea a) do Código dos Contratos Públicos",31-12-2015,"3.355,02 €",,"",,Não aplicável.,Não aplicável.,FALSE
41100215 Medicamentos com mais um titular AIM,Ajuste Direto Regime Geral,Aquisição de bens móveis,"33690000-3, Medicamentos vários",Centro Hospitalar Psiquiátrico de Lisboa (508338476),Meda Pharma (500082090),"4.386,72 €",19-04-2016,13-02-2015,365 dias,"Portugal, Lisboa, Lisboa","Artigo 20.º, n.º 1, alínea a) do Código dos Contratos Públicos",31-12-2015,"4.386,72 €",,"",,Não aplicável.,Não aplicável.,FALSE
Nutrição e Outros Prod Farmaceuticos  com mais um titular AIM,Ajuste Direto Regime Geral,Aquisição de bens móveis,"33600000-6, Produtos farmacêuticos",Centro Hospitalar Psiquiátrico de Lisboa (508338476),Fresenius Kabi (504293753),"7.826,39 €",19-04-2016,25-02-2015,365 dias,"Portugal, Lisboa, Lisboa","Artigo 20.º, n.º 1, alínea a) do Código dos Contratos Públicos",31-12-2015,"7.826,39 €",,"",,Não aplicável.,Não aplicável.,FALSE
Aquisição de Medicamentos urgentes,Ajuste Direto Regime Geral,Aquisição de bens móveis,"33000000-0, Equipamento médico, medicamentos e produtos para cuidados pessoais",Centro Hospitalar Psiquiátrico de Lisboa (508338476),Alliance Healtcare (502693150),"12.000,00 €",18-04-2016,17-01-2014,365 dias,"Portugal, Lisboa, Lisboa","Artigo 20.º, n.º 1, alínea a) do Código dos Contratos Públicos",31-12-2014,"12.000,00 €",,"",,Não aplicável.,Não aplicável.,FALSE
Serv. Medicina Geral e Familiar mês de Fevereiro 2015,Ajuste Direto Regime Geral,Aquisição de serviços,"85000000-9, Serviços de saúde e acção social",Centro Hospitalar Psiquiátrico de Lisboa (508338476),HELPED (506069010),"1.441,75 €",18-04-2016,09-02-2015,28 dias,"Portugal, Lisboa, Lisboa","Artigo 24.º, n.º 1, alínea c) do Código dos Contratos Públicos",28-02-2015,"439,80 €",,"Valor inferior devido a prestador ter efetuado menos horas, valor Faturado",,Não aplicável.,Não aplicável.,FALSE
Consultoria Jurídica de Março a Dez. 2015,Ajuste Direto Regime Geral,Aquisição de serviços,"79000000-4, Serviços a empresas: direito, comercialização, consultoria, recrutamento, impressão e segurança",Centro Hospitalar Psiquiátrico de Lisboa (508338476),José Santana Carlos (103423893),"16.078,10 €",18-04-2016,27-02-2015,304 dias,"Portugal, Lisboa, Lisboa","Artigo 24.º, n.º 1, alínea c) do Código dos Contratos Públicos",28-02-2015,"16.078,10 €",,"",,Não aplicável.,Não aplicável.,FALSE
Consultoria Jurídica para mês de Fevereiro,Ajuste Direto Regime Geral,Aquisição de serviços,"79000000-4, Serviços a empresas: direito, comercialização, consultoria, recrutamento, impressão e segurança",Centro Hospitalar Psiquiátrico de Lisboa (508338476),José Santana Carlos (103423893),"1.607,81 €",18-04-2016,09-02-2015,28 dias,"Portugal, Lisboa, Lisboa","Artigo 24.º, n.º 1, alínea c) do Código dos Contratos Públicos",28-02-2015,"1.607,81 €",,"",,Não aplicável.,Não aplicável.,FALSE
Serv. Consultadoria Jurídica para Mês de Janeiro 2015,Ajuste Direto Regime Geral,Aquisição de serviços,"79000000-4, Serviços a empresas: direito, comercialização, consultoria, recrutamento, impressão e segurança",Centro Hospitalar Psiquiátrico de Lisboa (508338476),José Santana Carlos (103423893),"1.607,81 €",18-04-2016,23-01-2015,365 dias,"Portugal, Lisboa, Lisboa","Artigo 24.º, n.º 1, alínea c) do Código dos Contratos Públicos",31-01-2015,"1.607,81 €",,"",,Não aplicável.,Não aplicável.,FALSE
Serviços na Área de Encenação de Teatro para o CHPL Ano 2016,Ajuste Direto Regime Geral,Aquisição de serviços,"92000000-1, Serviços recreativos, culturais e desportivos",Centro Hospitalar Psiquiátrico de Lisboa (508338476),SPAUTORES (500257841),"10.240,44 €",18-04-2016,29-01-2015,365 dias,"Portugal, Lisboa, Lisboa","Artigo 24.º, n.º 1, alínea e) do Código dos Contratos Públicos",31-12-2015,"10.240,44 €",,"",,Não aplicável.,Não aplicável.,FALSE
Serviços de Psiquiatria para o mês de Março a Dezembro 2015,Ajuste Direto Regime Geral,Aquisição de serviços,"85000000-9, Serviços de saúde e acção social",Centro Hospitalar Psiquiátrico de Lisboa (508338476),Omnipsi (509523188),"8.215,20 €",15-04-2016,02-03-2015,220 dias,"Portugal, Lisboa, Lisboa","Artigo 24.º, n.º 1, alínea c) do Código dos Contratos Públicos",31-12-2015,"2.000,00 €",,Valor efetivo corresponde ao valor Faturado devido a horas de Serviço prestada terem sido inferiores,,Não aplicável.,Não aplicável.,FALSE
Serv. Psiquiatria para mês de Fevereiro 2015,Ajuste Direto Regime Geral,Aquisição de serviços,"85000000-9, Serviços de saúde e acção social",Centro Hospitalar Psiquiátrico de Lisboa (508338476),"Omnipsi-Unipessoal, Lda. (509523188)","821,52 €",14-04-2016,05-03-2015,28 dias,"Portugal, Lisboa, Lisboa","Artigo 24.º, n.º 1, alínea c) do Código dos Contratos Públicos",05-03-2015,"160,00 €",,"Valor efetivo corresponde ao valor Faturado, número de horas de trabalho inferiores",,Não aplicável.,Não aplicável.,FALSE
Serv. Psiquiatria para o mês de Janeiro 2015,Ajuste Direto Regime Geral,Aquisição de serviços,"85000000-9, Serviços de saúde e acção social",Centro Hospitalar Psiquiátrico de Lisboa (508338476),"OMNIPSI - Unipessoal, Lda. (509523188)","821,52 €",14-04-2016,05-03-2015,31 dias,"Portugal, Lisboa, Lisboa","Artigo 24.º, n.º 1, alínea c) do Código dos Contratos Públicos",05-03-2015,"160,00 €",,Valor efetivo corresponde ao valor Faturado dado a prestadora ter prestado menos horas de trabalho,,Não aplicável.,Não aplicável.,FALSE
Serv. Arquitetura Paisagista para o mês de Dezembro 2015,Ajuste Direto Regime Geral,Aquisição de serviços,"71000000-8, Serviços de arquitectura, construção, engenharia e inspecção",Centro Hospitalar Psiquiátrico de Lisboa (508338476),"Regina Monteiro Baptista - Unipessoal, Lda. (509682570)","1.008,75 €",14-04-2016,20-11-2015,31 dias,"Portugal, Lisboa, Lisboa","Artigo 24.º, n.º 1, alínea c) do Código dos Contratos Públicos",31-12-2015,"1.008,75 €",,"",,Não aplicável.,Não aplicável.,FALSE
Serv. de Arquitetura Paisagista para mês de Novembro 2015,Ajuste Direto Regime Geral,Aquisição de serviços,"71000000-8, Serviços de arquitectura, construção, engenharia e inspecção",Centro Hospitalar Psiquiátrico de Lisboa (508338476),"Regina Monteiro Baptista - Unipessoal, Lda. (509682570)","1.008,75 €",14-04-2016,02-11-2015,30 dias,"Portugal, Lisboa, Lisboa","Artigo 24.º, n.º 1, alínea c) do Código dos Contratos Públicos",30-11-2015,"507,60 €",,Valor efetivo corresponde ao valor Faturado dado a prestadora só ter 67 horas presenciais,,Não aplicável.,Não aplicável.,FALSE
Serv. Arquitetura Paisagista para mês Outubro 2015,Ajuste Direto Regime Geral,Aquisição de serviços,"71000000-8, Serviços de arquitectura, construção, engenharia e inspecção",Centro Hospitalar Psiquiátrico de Lisboa (508338476),"Regina Monteiro Baptista - Unipessoal, lda. (509682570)","1.008,75 €",14-04-2016,13-10-2015,31 dias,"Portugal, Lisboa, Lisboa","Artigo 24.º, n.º 1, alínea c) do Código dos Contratos Públicos",30-10-2015,"1.008,75 €",,"",,Não aplicável.,Não aplicável.,FALSE
Serviços de Arquitetura Paisagista para meses de Setembro 2015,Ajuste Direto Regime Geral,Aquisição de serviços,"71000000-8, Serviços de arquitectura, construção, engenharia e inspecção",Centro Hospitalar Psiquiátrico de Lisboa (508338476),Regina Monteiro Baptista - Unipessoal Lda. (509682570),"1.008,75 €",14-04-2016,22-09-2015,30 dias,"Portugal, Lisboa, Lisboa","Artigo 24.º, n.º 1, alínea c) do Código dos Contratos Públicos",30-09-2015,"1.008,75 €",,"",,Não aplicável.,Não aplicável.,FALSE
Serv. Arquitetura Paisagista para mês de Agosto 2015,Ajuste Direto Regime Geral,Aquisição de serviços,"71000000-8, Serviços de arquitectura, construção, engenharia e inspecção",Centro Hospitalar Psiquiátrico de Lisboa (508338476),Regina Monteiro Baptista - Unipessoal Lda. (509682570),"1.008,75 €",14-04-2016,24-08-2015,31 dias,"Portugal, Lisboa, Lisboa","Artigo 24.º, n.º 1, alínea c) do Código dos Contratos Públicos",31-08-2015,"1.008,75 €",,"",,Não aplicável.,Não aplicável.,FALSE
Serv. de Arquitetura Paisagista para mês de Julho 2015,Ajuste Direto Regime Geral,Aquisição de serviços,"71000000-8, Serviços de arquitectura, construção, engenharia e inspecção",Centro Hospitalar Psiquiátrico de Lisboa (508338476),"Regina Monteiro Baptista - Unipessoal, Lda. (509682570)","1.008,75 €",14-04-2016,13-07-2015,31 dias,"Portugal, Lisboa, Lisboa","Artigo 24.º, n.º 1, alínea c) do Código dos Contratos Públicos",31-07-2015,"1.008,75 €",,"",,Não aplicável.,Não aplicável.,FALSE
Serv. Arq. Paisagista para mês de Junho,Ajuste Direto Regime Geral,Aquisição de serviços,"71000000-8, Serviços de arquitectura, construção, engenharia e inspecção",Centro Hospitalar Psiquiátrico de Lisboa (508338476),"Regina Monteiro Baptista - Unipessoal, Lda. (509682570)","1.008,75 €",13-04-2016,11-06-2015,30 dias,"Portugal, Lisboa, Lisboa","Artigo 24.º, n.º 1, alínea c) do Código dos Contratos Públicos",11-06-2015,"1.008,75 €",,"",,Não aplicável.,Não aplicável.,FALSE
Serv. Arquitetura Paisagista para mês de Maio,Ajuste Direto Regime Geral,Aquisição de serviços,"71000000-8, Serviços de arquitectura, construção, engenharia e inspecção",Centro Hospitalar Psiquiátrico de Lisboa (508338476),Regina Monteiro Baptista - Unipessoal Lda. (509682570),"1.008,75 €",13-04-2016,15-05-2015,31 dias,"Portugal, Lisboa, Lisboa","Artigo 24.º, n.º 1, alínea c) do Código dos Contratos Públicos",31-05-2015,"1.008,75 €",,"",,Não aplicável.,Não aplicável.,FALSE
Consultoria de Arquitetura Paisagista para Abril,Ajuste Direto Regime Geral,Aquisição de serviços,"71000000-8, Serviços de arquitectura, construção, engenharia e inspecção",Centro Hospitalar Psiquiátrico de Lisboa (508338476),Regina Monteiro Baptista - Unipessoal (509682570),"951,20 €",13-04-2016,30-04-2015,30 dias,"Portugal, Lisboa, Lisboa","Artigo 24.º, n.º 1, alínea c) do Código dos Contratos Públicos",30-04-2015,"951,20 €",,"",,Não aplicável.,Não aplicável.,FALSE
Consultoria de Arquitetura Paisagista de Março 2015,Ajuste Direto Regime Geral,Aquisição de serviços,"71000000-8, Serviços de arquitectura, construção, engenharia e inspecção",Centro Hospitalar Psiquiátrico de Lisboa (508338476),"Regina Monteiro Baptista, Unipessoal Lda. (509682570)","951,20 €",13-04-2016,31-03-2015,31 dias,"Portugal, Lisboa, Lisboa","Artigo 24.º, n.º 1, alínea c) do Código dos Contratos Públicos",31-03-2015,"951,20 €",,"",,Não aplicável.,Não aplicável.,FALSE
Consultoria De Arquitetura Paisagista para mês Fevereiro,Ajuste Direto Regime Geral,Aquisição de serviços,"71000000-8, Serviços de arquitectura, construção, engenharia e inspecção",Centro Hospitalar Psiquiátrico de Lisboa (CHPL) (508338476),"Regina Monteiro Baptista, Unipessoal Lda. (509682570)","951,20 €",12-04-2016,09-02-2015,28 dias,"Portugal, Lisboa, Lisboa","Artigo 24.º, n.º 1, alínea c) do Código dos Contratos Públicos",28-02-2015,"951,20 €",,"",,Não aplicável.,Não aplicável.,FALSE
Consultoria de Arquitetura Paisagista para o mês de Janeiro,Ajuste Direto Regime Geral,Aquisição de serviços,"71000000-8, Serviços de arquitectura, construção, engenharia e inspecção",Centro Hospitalar Psiquiátrico de Lisboa (508338476),"Regina Monteiro Baptista, Unipessoal Lda. (509682570)","951,20 €",12-04-2016,23-01-2015,31 dias,"Portugal, Lisboa, Lisboa","Artigo 24.º, n.º 1, alínea c) do Código dos Contratos Públicos",31-01-2015,"951,20 €",,"",,Não aplicável.,Não aplicável.,FALSE
Anestesiologia para mês Fevereiro,Ajuste Direto Regime Geral,Aquisição de serviços,"85000000-9, Serviços de saúde e acção social",Centro Hospitalar Psiquiátrico de Lisboa (508338476),Kelly Services (506434770),"1.016,68 €",12-04-2016,09-02-2015,28 dias,"Portugal, Lisboa, Lisboa","Artigo 24.º, n.º 1, alínea c) do Código dos Contratos Públicos",28-02-2016,"997,90 €",,Valor efetivamente Faturado,,Não aplicável.,Não aplicável.,FALSE
Anestesiologia para mês de Janeiro 2015,Ajuste Direto Regime Geral,Aquisição de serviços,"85000000-9, Serviços de saúde e acção social",Centro Hospitalar Psiquiátrico de Lisboa (508338476),Kelly Services (506434770),"1.016,68 €",12-04-2016,23-01-2015,31 dias,"Portugal, Lisboa, Lisboa","Artigo 24.º, n.º 1, alínea c) do Código dos Contratos Públicos",31-01-2015,"1.016,68 €",,"",,Não aplicável.,Não aplicável.,FALSE
