Objeto do Contrato,Tipo de Procedimento,Tipo(s) de Contrato,CPVs,Entidade(s) Adjudicante(s),Entidade(s) Adjudicatária(s),Preço Contratual,Data de Publicação,Data de Celebração do Contrato,Prazo de Execução,Local de Execução,Fundamentação,Data de Fecho do Contrato,Preço Total Efetivo,Causas das Alterações ao Prazo,Causas das Alterações ao Preço,Estado,N.º registo do Acordo Quadro,Descrição do Acordo Quadro,Procedimento Centralizado
Serviços de higiene e limpeza - ACES XXII,Ajuste Direto Regime Geral,Aquisição de serviços,"90910000-9, Serviços de limpeza","Administração Regional de Saúde de Lisboa e Vale do Tejo, I.P. (503148776)","Benalimpa, Lda (503453234)","1.875,00 €",29-07-2011,22-07-2011,92 dias,"Portugal, Santarém, Coruche","Artigo 24.º, n.º 1, alínea e) do Código dos Contratos Públicos","","",,,,Não aplicável.,Não aplicável.,
"Lavagem e tratamento de roupa do serviço farmacêutico da ARSLVT,IP - Ano de 2011.",Ajuste Direto Regime Geral,Aquisição de serviços,"98390000-3, Outros serviços","Administração Regional de Saúde de Lisboa e Vale do Tejo, I.P. (503148776)",Such- Serviço de Utilização Comum Hospitais (500900469),"544,36 €",29-07-2011,26-07-2011,365 dias,"Portugal, Lisboa, Lisboa","Artigo 24.º, n.º 1, alínea e) do Código dos Contratos Públicos","","",,,,Não aplicável.,Não aplicável.,
Portes de envio na aquisição de contentores para recolha de agulhas contaminadas.,Ajuste Direto Regime Geral,Aquisição de serviços,"98390000-3, Outros serviços","Administração Regional de Saúde de Lisboa e Vale do Tejo, I.P. (503148776)","Aviquimica - Importações e Manufacturas,Lda (500039720)","11,00 €",29-07-2011,21-07-2011,30 dias,"Portugal, Lisboa, Lisboa","Artigo 24.º, n.º 1, alínea e) do Código dos Contratos Públicos","","",,,,Não aplicável.,Não aplicável.,
Serviços de higiene e limpeza - ACES XVII Oeste I - Oeste Norte,Ajuste Direto Regime Geral,Aquisição de serviços,"90910000-9, Serviços de limpeza","Administração Regional de Saúde de Lisboa e Vale do Tejo, I.P. (503148776)",JSL Tomas (501667067),"909,15 €",29-07-2011,22-07-2011,92 dias,"Portugal, Santarém","Artigo 24.º, n.º 1, alínea e) do Código dos Contratos Públicos","","",,,,Não aplicável.,Não aplicável.,
Serviços de vigilância e segurança - ACES VI - Loures,Ajuste Direto Regime Geral,Aquisição de serviços,"79710000-4, Serviços de segurança","Administração Regional de Saúde de Lisboa e Vale do Tejo, I.P. (503148776)","Prestibel, SA (501326456)","30.367,20 €",29-07-2011,22-07-2011,363 dias,"Portugal, Lisboa, Loures","Artigo 24.º, n.º 1, alínea e) do Código dos Contratos Públicos","","",,,,Não aplicável.,Não aplicável.,
Serviços de higiene e limpeza - ACES XII Grande Lisboa - Vila Franca de Xira,Ajuste Direto Regime Geral,Aquisição de serviços,"90910000-9, Serviços de limpeza","Administração Regional de Saúde de Lisboa e Vale do Tejo, I.P. (503148776)","Vadeca Serviços, SA (506164454)","71.940,00 €",29-07-2011,12-05-2011,178 dias,"Portugal, Lisboa, Vila Franca de Xira","Artigo 24.º, n.º 1, alínea e) do Código dos Contratos Públicos","","",,,,Não aplicável.,Não aplicável.,
Serviços de higiene e limpeza - ACEA XIV Peninsula de Setúbal II - Seixal/Sesimbra,Ajuste Direto Regime Geral,Aquisição de serviços,"90910000-9, Serviços de limpeza","Administração Regional de Saúde de Lisboa e Vale do Tejo, I.P. (503148776)",Fenix Cleaning (505402459),"12.695,05 €",29-07-2011,08-07-2011,147 dias,"Portugal, Setúbal","Artigo 24.º, n.º 1, alínea e) do Código dos Contratos Públicos","","",,,,Não aplicável.,Não aplicável.,
Serviços de higiene e limpeza - ACES XII,Ajuste Direto Regime Geral,Aquisição de serviços,"90910000-9, Serviços de limpeza","Administração Regional de Saúde de Lisboa e Vale do Tejo, I.P. (503148776)",Number One (504451332),"37.719,30 €",29-07-2011,19-07-2011,178 dias,"Portugal, Lisboa, Vila Franca de Xira","Artigo 24.º, n.º 1, alínea e) do Código dos Contratos Públicos","","",,,,Não aplicável.,Não aplicável.,
Serviços de higiene e limpeza - ACES XIV Peninsula de Setubal II - Seixal/Sesimbra,Ajuste Direto Regime Geral,Aquisição de serviços,"90910000-9, Serviços de limpeza","Administração Regional de Saúde de Lisboa e Vale do Tejo, I.P. (503148776)",Number One (504451332),"18.808,26 €",28-07-2011,19-07-2011,178 dias,"Portugal, Setúbal","Artigo 24.º, n.º 1, alínea e) do Código dos Contratos Públicos","","",,,,Não aplicável.,Não aplicável.,
Serviços de higiene e limpeza - ACES V Grande Lisboa-Odivelas,Ajuste Direto Regime Geral,Aquisição de serviços,"90910000-9, Serviços de limpeza","Administração Regional de Saúde de Lisboa e Vale do Tejo, I.P. (503148776)",Number One (504451332),"95.016,84 €",28-07-2011,19-07-2011,178 dias,"Portugal, Lisboa, Odivelas","Artigo 24.º, n.º 1, alínea e) do Código dos Contratos Públicos","","",,,,Não aplicável.,Não aplicável.,
REAGENTES E MEIOS DE CULTURA DIVERSOS,Ajuste Direto Regime Geral,Outros Tipos (artº 24 al. e) nº 1),"33696500-0, Reagentes de laboratório","Administração Regional de Saúde de Lisboa e Vale do Tejo, I.P. (503148776)","BIOMERIEUX PORTUGAL, Lda. (501524177)","7.157,35 €",28-07-2011,22-07-2011,2 dias,"Portugal, Lisboa, Lisboa","Artigo 24.º, n.º 1, alínea e) do Código dos Contratos Públicos","","",,,,Não aplicável.,Não aplicável.,
Serviços de higiene e limpeza - ACES XIV Peninsula de Setúbal II - Seixal/Sesimbra,Ajuste Direto Regime Geral,Aquisição de serviços,"90910000-9, Serviços de limpeza","Administração Regional de Saúde de Lisboa e Vale do Tejo, I.P. (503148776)",Number One (504451332),"20.972,70 €",28-07-2011,19-07-2011,178 dias,"Portugal, Setúbal","Artigo 24.º, n.º 1, alínea e) do Código dos Contratos Públicos","","",,,,Não aplicável.,Não aplicável.,
REAGENTES DIVERSOS PARA COLORAÇÃO DE LAMINAS,Ajuste Direto Regime Geral,Outros Tipos (artº 24 al. e) nº 1),"33696500-0, Reagentes de laboratório","Administração Regional de Saúde de Lisboa e Vale do Tejo, I.P. (503148776)","VIDROLAB 2, S.A. (501450629)","4.136,00 €",28-07-2011,18-07-2011,2 dias,"Portugal, Lisboa, Lisboa","Artigo 24.º, n.º 1, alínea e) do Código dos Contratos Públicos","","",,,,Não aplicável.,Não aplicável.,
"Empreitada de Recuperação da Unidade de Saúde Familiar (USF) 7ª Colina, na Extensão de Saúde Angelina Vidal, no Centro de Saúde da Penha de França.",Ajuste Direto Regime Geral,"Outros Tipos (Previsto no art.º 1º do DL 48/2008, de 13 de março, alterado DL 31/2009, de 4 de Fevereiro, prorrogado pelo DL 25/2010, de 29 de Março.)<br/>Empreitadas de obras públicas","45453100-8, Obras de recuperação","Administração Regional de Saúde de Lisboa e Vale do Tejo, I.P. (503148776)","GEFIS - CONSTRUÇÃO, GESTÃO E FISCALIZAÇÃO, LDA. (502018801)","690.680,18 €",28-07-2011,18-07-2011,180 dias,"Portugal, Lisboa, Lisboa","Artigo 1.º do Decreto-Lei n.º 48/2008, de 13.03","","",,,,Não aplicável.,Não aplicável.,
Públicação de anúncio em Diário da República com a referência n.º 404899062,Ajuste Direto Regime Geral,Aquisição de serviços,"98390000-3, Outros serviços","Administração Regional de Saúde de Lisboa e Vale do Tejo, I.P. (503148776)","Imprensa Nacional Casa da Moeda, S.A. (500792887)","310,91 €",27-07-2011,22-07-2011,30 dias,"Portugal, Lisboa, Lisboa","Artigo 24.º, n.º 1, alínea e) do Código dos Contratos Públicos","","",,,,Não aplicável.,Não aplicável.,
Aquisição de serviços de higiene e limpeza - ACES III Grande Lisboa - Lisboa Central (Av. António Augusto Aguiar),Ajuste Direto Regime Geral,Aquisição de serviços,"90910000-9, Serviços de limpeza","Administração Regional de Saúde de Lisboa e Vale do Tejo, I.P. (503148776)","Ambiente e Jardim, Lda (503245178)","1.860,00 €",27-07-2011,06-07-2011,92 dias,"Portugal, Lisboa, Lisboa","Artigo 24.º, n.º 1, alínea e) do Código dos Contratos Públicos","","",,,,Não aplicável.,Não aplicável.,
VACINA DUPLA (Td) - MONODOSE,Ajuste Direto Regime Geral,Outros Tipos (Artº 26 al. e) nº 1),"33651600-4, Vacinas","Administração Regional de Saúde de Lisboa e Vale do Tejo, I.P. (503148776)","SOMOS COMPRAS/SPMS, EPE (508096197)","138.225,00 €",27-07-2011,21-07-2011,1 dias,"Portugal, Lisboa, Lisboa","Artigo 26.º, n.º 1, alínea e) do Código dos Contratos Públicos","","",,,,Não aplicável.,Não aplicável.,
Serviços de higiene e limpeza - ACES XVII Oeste I - Oeste Norte (USF Santa Maria - Benedita). Periodo de 01/07/2011 a 30/09/2011,Ajuste Direto Regime Geral,Aquisição de serviços,"90910000-9, Serviços de limpeza","Administração Regional de Saúde de Lisboa e Vale do Tejo, I.P. (503148776)",Restaurilimpa (503215198),"2.009,34 €",26-07-2011,07-07-2011,92 dias,"Portugal, Santarém, Tomar","Artigo 24.º, n.º 1, alínea e) do Código dos Contratos Públicos","","",,,,Não aplicável.,Não aplicável.,
REAGENTES DIVERSOS P/ LAB. DE SAUDE PUBLICA DE SETUBAL,Ajuste Direto Regime Geral,Outros Tipos (artº 24 al. e) nº 1),"33696500-0, Reagentes de laboratório","Administração Regional de Saúde de Lisboa e Vale do Tejo, I.P. (503148776)","BIO RAD LABORATORIES, Lda. (501301321)","854,00 €",25-07-2011,08-06-2011,15 dias,"Portugal, Lisboa, Lisboa","Artigo 24.º, n.º 1, alínea e) do Código dos Contratos Públicos","","",,,,Não aplicável.,Não aplicável.,
Renovação do Licenciamento da Solução Vitahiscare para a USF Alcais,Ajuste Direto Regime Geral,Aquisição de bens móveis,"22456000-1, Licenças","Administração Regional de Saúde de Lisboa e Vale do Tejo, I.P. (503148776)","PT PRIME - Soluções Empresariais de Telecom. e Sistemas, S.A. (502840757)","2.183,72 €",22-07-2011,27-06-2011,2 dias,"Portugal, Lisboa, Cascais",Artigo 258.º do Código dos Contratos Públicos,"","",,,,Não aplicável.,Não aplicável.,
Renovação do Licenciamento da Solução Vitahiscare para a USF Mãe d´Água,Ajuste Direto Regime Geral,Aquisição de bens móveis,"22456000-1, Licenças","Administração Regional de Saúde de Lisboa e Vale do Tejo, I.P. (503148776)","PT PRIME - Soluções Empresariais de Telecomunicações e Sistemas, S.A. (502840757)","1.403,82 €",22-07-2011,27-06-2011,2 dias,"Portugal, Lisboa, Sintra",Artigo 258.º do Código dos Contratos Públicos,"","",,,,Não aplicável.,Não aplicável.,
Renovação do Licenciamento da Solução Vitahiscare para a USF Mactamã,Ajuste Direto Regime Geral,Aquisição de bens móveis,"22456000-1, Licenças","Administração Regional de Saúde de Lisboa e Vale do Tejo, I.P. (503148776)","PT PRIME - Soluções Empresariais de Telecom. e Sistemas, S.A. (502840757)","3.119,60 €",22-07-2011,27-06-2011,2 dias,"Portugal, Lisboa, Sintra",Artigo 258.º do Código dos Contratos Públicos,"","",,,,Não aplicável.,Não aplicável.,
Renovação da Solução de Gestão de Atendimento para a USF Arco Íris - Hardware,Ajuste Direto Regime Geral,Aquisição de bens móveis,"31711310-9, Sistema de registo de presenças","Administração Regional de Saúde de Lisboa e Vale do Tejo, I.P. (503148776)","PT PRIME - Soluções Empresariais de Telecom. e Sistemas, S.A (502840757)","39,38 €",22-07-2011,08-07-2011,2 dias,"Portugal, Lisboa, Amadora",Artigo 258.º do Código dos Contratos Públicos,"","",,,,Não aplicável.,Não aplicável.,
Renovação do Licenciamento da Solução Vitahiscare para a USF Santiago de Palmela,Ajuste Direto Regime Geral,Aquisição de bens móveis,"22456000-1, Licenças","Administração Regional de Saúde de Lisboa e Vale do Tejo, I.P. (503148776)","PT PRIME - Soluções Empresariais de Telecom. e Sistemas, S.A. (502840757)","2.339,70 €",22-07-2011,27-06-2011,2 dias,"Portugal, Setúbal, Palmela",Artigo 258.º do Código dos Contratos Públicos,"","",,,,Não aplicável.,Não aplicável.,
Renovação da Solução de Gestão de Atendimento USF Quinta da Lomba - Hardware,Ajuste Direto Regime Geral,Aquisição de bens móveis,"31711310-9, Sistema de registo de presenças","Administração Regional de Saúde de Lisboa e Vale do Tejo, I.P. (503148776)","PT PRIME - Soluções Empresariais de Telecom. e Sistemas, S.A. (502840757)","393,80 €",22-07-2011,07-07-2011,2 dias,"Portugal, Setúbal, Barreiro",Artigo 258.º do Código dos Contratos Públicos,"","",,,,Não aplicável.,Não aplicável.,
Renovação da Solução de Gestão de Atendimento USF Santiago Palmela - Hardware,Ajuste Direto Regime Geral,Aquisição de bens móveis,"31711310-9, Sistema de registo de presenças","Administração Regional de Saúde de Lisboa e Vale do Tejo, I.P. (503148776)","PT PRIME - Soluções Empresariais de Telecom. e Sistemas, S.A. (502840757)","118,10 €",22-07-2011,07-07-2011,2 dias,"Portugal, Setúbal, Palmela",Artigo 258.º do Código dos Contratos Públicos,"","",,,,Não aplicável.,Não aplicável.,
Renovação da Solução de Gestão de Atendimento USF S. João da Talha - Hardware,Ajuste Direto Regime Geral,Aquisição de bens móveis,"31711310-9, Sistema de registo de presenças","Administração Regional de Saúde de Lisboa e Vale do Tejo, I.P. (503148776)","PT PRIME - Soluções Empresariais de Telecom. e Sistemas, S.A. (502840757)","118,10 €",22-07-2011,07-07-2011,2 dias,"Portugal, Lisboa, Loures",Artigo 258.º do Código dos Contratos Públicos,"","",,,,Não aplicável.,Não aplicável.,
Renovação do Licenciamento Vitahiscare para a USF S. João da Talha,Ajuste Direto Regime Geral,Aquisição de bens móveis,"22456000-1, Licenças","Administração Regional de Saúde de Lisboa e Vale do Tejo, I.P. (503148776)","PT PRIME - Soluções Empresariais de Telecom. e Sistemas, S.A. (502840757)","1.559,77 €",22-07-2011,08-07-2011,2 dias,"Portugal, Lisboa, Loures",Artigo 258.º do Código dos Contratos Públicos,"","",,,,Não aplicável.,Não aplicável.,
Renovação do Licenciamento Vitahiscare para a USF S. João Ev. de Lóios,Ajuste Direto Regime Geral,Aquisição de bens móveis,"22456000-1, Licenças","Administração Regional de Saúde de Lisboa e Vale do Tejo, I.P. (503148776)","PT PRIME - Soluções Empresariais de Telecom. e Sistemas, S.A. (502840757)","935,86 €",22-07-2011,08-07-2011,2 dias,"Portugal, Lisboa, Lisboa",Artigo 258.º do Código dos Contratos Públicos,"","",,,,Não aplicável.,Não aplicável.,
Renovação do Licenciamento Vitahiscare para a USF Mactamã,Ajuste Direto Regime Geral,Aquisição de bens móveis,"22456000-1, Licenças","Administração Regional de Saúde de Lisboa e Vale do Tejo, I.P. (503148776)","PT PRIME - Soluções Empresariais de Telecom. e Sistemas, S.A. (502840757)","1.299,80 €",22-07-2011,08-07-2011,2 dias,"Portugal, Lisboa, Sintra",Artigo 258.º do Código dos Contratos Públicos,"","",,,,Não aplicável.,Não aplicável.,
Renovação do Licenciamento Vitahiscare para a USF Mãe d´Água,Ajuste Direto Regime Geral,Aquisição de bens móveis,"22456000-1, Licenças","Administração Regional de Saúde de Lisboa e Vale do Tejo, I.P. (503148776)","PT PRIME - Soluções Empresariais de Telecom. e Sistemas, S.A. (502840757)","584,92 €",22-07-2011,08-07-2011,2 dias,"Portugal, Lisboa, Sintra","Artigo 31.º, n.º 3 do Código dos Contratos Públicos","","",,,,Não aplicável.,Não aplicável.,
Renovação do Licenciamento Vitahiscare para a USF Andreas,Ajuste Direto Regime Geral,Aquisição de bens móveis,"22456000-1, Licenças","Administração Regional de Saúde de Lisboa e Vale do Tejo, I.P. (503148776)","PT PRIME - Soluções Empresariais de Telecom. e Sistemas, S.A. (502840757)","1.819,72 €",22-07-2011,08-07-2011,2 dias,"Portugal, Lisboa, Mafra",Artigo 258.º do Código dos Contratos Públicos,"","",,,,Não aplicável.,Não aplicável.,
Renovação do Licenciamento Vitahiscare para a USF Rosinha,Ajuste Direto Regime Geral,Aquisição de bens móveis,"22456000-1, Licenças","Administração Regional de Saúde de Lisboa e Vale do Tejo, I.P. (503148776)","PT PRIME - Soluções Empresariais de Telecom. e Sistemas, S.A. (502840757)","857,87 €",22-07-2011,08-07-2011,2 dias,"Portugal, Setúbal, Sesimbra",Artigo 258.º do Código dos Contratos Públicos,"","",,,,Não aplicável.,Não aplicável.,
Renovação  da Solução de Gestão de Atendimento para a USF Mãe d´Água - Hardware,Ajuste Direto Regime Geral,Aquisição de bens móveis,"31711310-9, Sistema de registo de presenças","Administração Regional de Saúde de Lisboa e Vale do Tejo, I.P. (503148776)","PT PRIME - Soluções Empresariais de Telecom. e Sistemas, S.A. (502840757)","157,50 €",22-07-2011,07-07-2011,2 dias,"Portugal, Lisboa, Sintra",Artigo 258.º do Código dos Contratos Públicos,"","",,,,Não aplicável.,Não aplicável.,
Renovação  da Solução de Gestão de Atendimento para a USF Mactamã - Hardware,Ajuste Direto Regime Geral,Aquisição de bens móveis,"31711310-9, Sistema de registo de presenças","Administração Regional de Saúde de Lisboa e Vale do Tejo, I.P. (503148776)","PT PRIME - Soluções Empresariais de Telecom. e Sistemas, S.A. (502840757)","157,50 €",22-07-2011,07-07-2011,2 dias,"Portugal, Lisboa, Sintra",Artigo 258.º do Código dos Contratos Públicos,"","",,,,Não aplicável.,Não aplicável.,
Renovação  da Solução de Gestão de Atendimento para a USF Emergir - Hardware,Ajuste Direto Regime Geral,Aquisição de bens móveis,"31711310-9, Sistema de registo de presenças","Administração Regional de Saúde de Lisboa e Vale do Tejo, I.P. (503148776)","PT PRIME - Soluções Empresariais de Telecom. e Sistemas, S.A. (502840757)","196,90 €",22-07-2011,07-07-2011,2 dias,"Portugal, Lisboa, Cascais",Artigo 258.º do Código dos Contratos Públicos,"","",,,,Não aplicável.,Não aplicável.,
Renovação do Licenciamento Vitahiscare para a USF Santiago de Palmela,Ajuste Direto Regime Geral,Aquisição de bens móveis,"22456000-1, Licenças","Administração Regional de Saúde de Lisboa e Vale do Tejo, I.P. (503148776)","PT PRIME - Soluções Empresariais de Telecom. e Sistemas, S.A. (502840757)","194,97 €",22-07-2011,08-07-2011,2 dias,"Portugal, Setúbal, Palmela",Artigo 258.º do Código dos Contratos Públicos,"","",,,,Não aplicável.,Não aplicável.,
Renovação do Licenciamento Vitahiscare para a USF São Domingos de Gusmão,Ajuste Direto Regime Geral,Aquisição de bens móveis,"22456000-1, Licenças","Administração Regional de Saúde de Lisboa e Vale do Tejo, I.P. (503148776)","PT PRIME - Soluções Empresariais de Telecom. e Sistemas, S.A. (502840757)","1.559,77 €",22-07-2011,08-07-2011,2 dias,"Portugal, Lisboa, Cascais",Artigo 258.º do Código dos Contratos Públicos,"","",,,,Não aplicável.,Não aplicável.,
Renovação da Solução de Gestão de Atendimento para a USF Amora Saudável - Hardware,Ajuste Direto Regime Geral,Aquisição de bens móveis,"31711310-9, Sistema de registo de presenças","Administração Regional de Saúde de Lisboa e Vale do Tejo, I.P. (503148776)","PT PRIME - Soluções Empresariais de Telecom. e Sistemas, S.A. (502840757)","236,25 €",22-07-2011,08-07-2011,2 dias,"Portugal, Setúbal, Seixal",Artigo 258.º do Código dos Contratos Públicos,"","",,,,Não aplicável.,Não aplicável.,
"Cópias adicionais para os serviços centrais da ARSLVT, IP - ano 2011",Ajuste Direto Regime Geral,Aquisição de serviços,"98390000-3, Outros serviços","Administração Regional de Saúde de Lisboa e Vale do Tejo, I.P. (503148776)","Sicnet, SA (502115866)","11.896,08 €",22-07-2011,11-07-2011,365 dias,"Portugal, Lisboa, Lisboa","Artigo 24.º, n.º 1, alínea e) do Código dos Contratos Públicos","","",,,,Não aplicável.,Não aplicável.,
Cópias adicionais do ano 2010,Ajuste Direto Regime Geral,Aquisição de serviços,"98390000-3, Outros serviços","Administração Regional de Saúde de Lisboa e Vale do Tejo, I.P. (503148776)","Sicnet, SA (502115866)","8.754,04 €",22-07-2011,11-07-2011,30 dias,"Portugal, Lisboa, Lisboa","Artigo 24.º, n.º 1, alínea e) do Código dos Contratos Públicos","","",,,,Não aplicável.,Não aplicável.,
Renovação da Solução de Gestão de Atendimento para a USF S. João Evangelista de Lóios - Hardware,Ajuste Direto Regime Geral,Aquisição de bens móveis,"31711310-9, Sistema de registo de presenças","Administração Regional de Saúde de Lisboa e Vale do Tejo, I.P. (503148776)","PT PRIME - Soluções Empresariais de Telecom. e Sistemas, S.A. (502840757)","118,10 €",22-07-2011,07-07-2011,2 dias,"Portugal, Lisboa, Lisboa",Artigo 258.º do Código dos Contratos Públicos,"","",,,,Não aplicável.,Não aplicável.,
"Fornecimento de energia eléctrica para a Av. EUA, Lt. 53 e 53 D para o ano de 2011.",Ajuste Direto Regime Geral,Aquisição de serviços,"98390000-3, Outros serviços","Administração Regional de Saúde de Lisboa e Vale do Tejo, I.P. (503148776)","EDP Serviço Universal, SA (507846044)","5.000,00 €",22-07-2011,15-07-2011,365 dias,"Portugal, Lisboa, Lisboa","Artigo 24.º, n.º 1, alínea e) do Código dos Contratos Públicos","","",,,,Não aplicável.,Não aplicável.,
Renovação do Licenciamento Vitahiscare para a USF Loures Saudável,Ajuste Direto Regime Geral,Aquisição de bens móveis,"22456000-1, Licenças","Administração Regional de Saúde de Lisboa e Vale do Tejo, I.P. (503148776)","PT PRIME - Soluções Empresariais de Telecom. e Sistemas, S.A. (502840757)","2.001,68 €",22-07-2011,08-07-2011,2 dias,"Portugal, Lisboa, Loures",Artigo 258.º do Código dos Contratos Públicos,"","",,,,Não aplicável.,Não aplicável.,
Renovação do Licenciamento Vitahiscare para a USF Emergir,Ajuste Direto Regime Geral,Aquisição de bens móveis,"22456000-1, Licenças","Administração Regional de Saúde de Lisboa e Vale do Tejo, I.P. (503148776)","PT PRIME - Soluções Empresariais de Telecom. e Sistemas, S.A. (502840757)","1.455,78 €",22-07-2011,08-07-2011,2 dias,"Portugal, Lisboa, Cascais",Artigo 258.º do Código dos Contratos Públicos,"","",,,,Não aplicável.,Não aplicável.,
Renovação do Licenciamento Vitahiscare para a USF Quinta da Lomba,Ajuste Direto Regime Geral,Aquisição de bens móveis,"22456000-1, Licenças","Administração Regional de Saúde de Lisboa e Vale do Tejo, I.P. (503148776)","PT PRIME - Soluções Empresariais de Telecom. e Sistemas, S.A. (502840757)","1.182,79 €",22-07-2011,08-07-2011,2 dias,"Portugal, Setúbal, Barreiro",Artigo 258.º do Código dos Contratos Públicos,"","",,,,Não aplicável.,Não aplicável.,
Renovação da Solução de Gestão de Atendimento para a USF Artemisa - Hardware,Ajuste Direto Regime Geral,Aquisição de bens móveis,"31711310-9, Sistema de registo de presenças","Administração Regional de Saúde de Lisboa e Vale do Tejo, I.P. (503148776)","PT PRIME- Soluções Empresariais de Telecom. e Sistemas, S.A. (502840757)","157,50 €",22-07-2011,08-07-2011,2 dias,"Portugal, Lisboa, Cascais",Artigo 258.º do Código dos Contratos Públicos,"","",,,,Não aplicável.,Não aplicável.,
Renovação do Licenciamento Vitahiscare para a USF Arco Íris,Ajuste Direto Regime Geral,Aquisição de bens móveis,"22456000-1, Licenças","Administração Regional de Saúde de Lisboa e Vale do Tejo, I.P. (503148776)","PT PRIME - Soluções Empresariais de Telecom. e Sistemas, S.A. (502840757)","168,97 €",22-07-2011,08-07-2011,2 dias,"Portugal, Lisboa, Amadora",Artigo 258.º do Código dos Contratos Públicos,"","",,,,Não aplicável.,Não aplicável.,
Renovação do Licenciamento Vitahiscare para a USF Amora Saudável,Ajuste Direto Regime Geral,Aquisição de bens móveis,"22456000-1, Licenças","Administração Regional de Saúde de Lisboa e Vale do Tejo, I.P. (503148776)","PT PRIME - Soluções Empresariais de Telecom. e Sistemas, S.A. (502840757)","1.663,74 €",22-07-2011,08-07-2011,2 dias,"Portugal, Setúbal, Seixal",Artigo 258.º do Código dos Contratos Públicos,"","",,,,Não aplicável.,Não aplicável.,
Renovação do Licenciamento Vitahiscare para a USF Descobertas,Ajuste Direto Regime Geral,Aquisição de bens móveis,"22456000-1, Licenças","Administração Regional de Saúde de Lisboa e Vale do Tejo, I.P. (503148776)","PT PRIME - Soluções Empresariais de Telecom. e Sistemas, S.A. (502840757)","337,94 €",22-07-2011,08-07-2011,2 dias,"Portugal, Lisboa, Lisboa",Artigo 258.º do Código dos Contratos Públicos,"","",,,,Não aplicável.,Não aplicável.,
Renovação da Solução de Gestão de Atendimento para a USF Andreas - Hardware,Ajuste Direto Regime Geral,Aquisição de bens móveis,"31711310-9, Sistema de registo de presenças","Administração Regional de Saúde de Lisboa e Vale do Tejo, I.P. (503148776)","PT PRIME - Soluções Empresariais de Telecom. e Sistemas, S.A. (502840757)","393,80 €",22-07-2011,08-07-2011,2 dias,"Portugal, Lisboa, Mafra",Artigo 258.º do Código dos Contratos Públicos,"","",,,,Não aplicável.,Não aplicável.,
Aquisição de acessos de banda larga móvel,Ajuste Direto Regime Geral,Aquisição de bens móveis,"32510000-1, Sistema de telecomunicações sem fio","Administração Regional de Saúde de Lisboa e Vale do Tejo, I.P. (503148776)","TMN - Telecomunicações Móveis Nacionais, S.A. (502600268)","35.635,20 €",22-07-2011,20-07-2011,1 dias,"Portugal, Lisboa, Lisboa",Artigo 258.º do Código dos Contratos Públicos,"","",,,,Não aplicável.,Não aplicável.,
Serviços de uma prestação de serviços de vigilância e segurança no ACES II (Ext. Lóios e Agrupamento Lisboa Oriental). Periodo de 01/01/2011 a 31/12/2011.,Ajuste Direto Regime Geral,Aquisição de serviços,"90910000-9, Serviços de limpeza","Administração Regional de Saúde de Lisboa e Vale do Tejo, I.P. (503148776)","Prestibel, SA (501326456)","97.470,00 €",22-07-2011,08-07-2011,365 dias,"Portugal, Lisboa, Lisboa","Artigo 24.º, n.º 1, alínea e) do Código dos Contratos Públicos","","",,,,Não aplicável.,Não aplicável.,
POLI (Na2SO4) PENTOSANO + AZULENO (HEPARINOIDE),Ajuste Direto Regime Geral,Outros Tipos (artº 24 nº 1 al. e)),"33690000-3, Medicamentos vários","Administração Regional de Saúde de Lisboa e Vale do Tejo, I.P. (503148776)","BENE FARMACEUTICA, Lda. (508735696)","16.500,00 €",22-07-2011,01-07-2011,15 dias,"Portugal, Lisboa, Lisboa","Artigo 24.º, n.º 1, alínea e) do Código dos Contratos Públicos","","",,,,Não aplicável.,Não aplicável.,
CONTROLO DE QUALIDADE EXTERNO - MICROBACTERIAS - EXAME CULTURAL - CODIGO NQ-SAPTMCT,Ajuste Direto Regime Geral,Outros Tipos (artº 24 al. e) nº 1),"33696500-0, Reagentes de laboratório","Administração Regional de Saúde de Lisboa e Vale do Tejo, I.P. (503148776)","BIOGNOSTICA, Lda. (504441256)","486,00 €",22-07-2011,18-07-2011,1 dias,"Portugal, Lisboa, Lisboa","Artigo 24.º, n.º 1, alínea e) do Código dos Contratos Públicos","","",,,,Não aplicável.,Não aplicável.,
Renovação da Solução de Gestão de Atendimento para a USF S. Domingos Gusmão - Hardware,Ajuste Direto Regime Geral,Aquisição de bens móveis,"31711310-9, Sistema de registo de presenças","Administração Regional de Saúde de Lisboa e Vale do Tejo, I.P. (503148776)","PT PRIME - Soluções Empresariais de Telecom. e Sistemas, S.A. (502840757)","196,90 €",21-07-2011,07-07-2011,2 dias,"Portugal, Lisboa, Cascais",Artigo 258.º do Código dos Contratos Públicos,"","",,,,Não aplicável.,Não aplicável.,
Renovação da Solução de Gestão de Atendimento para a USF Descobertas - Hardware,Ajuste Direto Regime Geral,Aquisição de bens móveis,"31711310-9, Sistema de registo de presenças","Administração Regional de Saúde de Lisboa e Vale do Tejo, I.P. (503148776)",PT PRIME - Soluções Empresariais de Telecomunicações e Sistemas S.A. (502840757),"78,70 €",21-07-2011,08-07-2011,2 dias,"Portugal, Lisboa, Lisboa",Artigo 258.º do Código dos Contratos Públicos,"","",,,,Não aplicável.,Não aplicável.,
Renovação da Solução de Gestão de Atendimento para a USF Rosinha - Hardware,Ajuste Direto Regime Geral,Aquisição de bens móveis,"31711310-9, Sistema de registo de presenças","Administração Regional de Saúde de Lisboa e Vale do Tejo, I.P. (503148776)",PT PRIME - Soluções Empresariais de Telecom. e Sistemas S.A. (502840757),"118,10 €",21-07-2011,08-07-2011,2 dias,"Portugal, Setúbal, Seixal",Artigo 258.º do Código dos Contratos Públicos,"","",,,,Não aplicável.,Não aplicável.,
Renovação do Licenciamento Vitahiscare  para a USF Parque da Cidade,Ajuste Direto Regime Geral,Aquisição de bens móveis,"22456000-1, Licenças","Administração Regional de Saúde de Lisboa e Vale do Tejo, I.P. (503148776)","PT PRIME - Soluções Empresariais de Telecom. e Sistemas, S.A. (502840757)","1.247,81 €",21-07-2011,08-07-2011,2 dias,"Portugal, Lisboa, Lisboa",Artigo 258.º do Código dos Contratos Públicos,"","",,,,Não aplicável.,Não aplicável.,
Renovação do Licenciamento para a USF Alcais,Ajuste Direto Regime Geral,Aquisição de bens móveis,"22456000-1, Licenças","Administração Regional de Saúde de Lisboa e Vale do Tejo, I.P. (503148776)","PT PRIME - Soluções Empresariais de Telec. e Sistemas, S.A. (502840757)","1.119,14 €",21-07-2011,08-07-2011,2 dias,"Portugal, Lisboa, Cascais",Artigo 258.º do Código dos Contratos Públicos,"","",,,,Não aplicável.,Não aplicável.,
Renovação da Solução de Gestão de Atendimento para a USF Monte Pedral - Hardware,Ajuste Direto Regime Geral,Aquisição de bens móveis,"31711310-9, Sistema de registo de presenças","Administração Regional de Saúde de Lisboa e Vale do Tejo, I.P. (503148776)","PT PRIME - Soluções Empresariais de Telecomunicações e Sistemas, S.A. (502840757)","39,38 €",21-07-2011,08-07-2011,2 dias,"Portugal, Lisboa, Lisboa",Artigo 258.º do Código dos Contratos Públicos,"","",,,,Não aplicável.,Não aplicável.,
Renovação do Licenciamento VITAhisCARE para a USF Monte Pedral,Ajuste Direto Regime Geral,Aquisição de bens móveis,"22456000-1, Licenças","Administração Regional de Saúde de Lisboa e Vale do Tejo, I.P. (503148776)","PT PRIME - Soluções Empresariais de Telecomunicações e Sistemas, S.A. (502840757)","155,98 €",21-07-2011,08-07-2011,2 dias,"Portugal, Lisboa, Lisboa",Artigo 258.º do Código dos Contratos Públicos,"","",,,,Não aplicável.,Não aplicável.,
Aquisição de oxigénio medecinal B50 e compact BB 5,Ajuste Direto Regime Geral,Aquisição de bens móveis,"24111900-4, Oxigénio","Administração Regional de Saúde de Lisboa e Vale do Tejo, I.P. (503148776)","Air Liquide Medicinal, S.A. (501576436)","76,14 €",21-07-2011,01-03-2011,5 dias,"Portugal, Santarém, Ourém","Artigo 24.º, n.º 1, alínea e) do Código dos Contratos Públicos",01-03-2011,"76,14 €",,,,Não aplicável.,Não aplicável.,
