freguesia,acronym,validVotesPercentage,votes,dicofre
Pó,PS,42.11,160,100505
Pó,PPD/PSD,35,133,100505
Pó,CDS-PP,8.16,31,100505
Pó,B.E.,3.68,14,100505
Pó,PCP-PEV,3.68,14,100505
Pó,PAN,1.58,6,100505
Pó,CH,1.05,4,100505
Pó,IL,0.79,3,100505
Pó,PNR,0.79,3,100505
Pó,PDR,0.53,2,100505
Pó,PPM,0.53,2,100505
Pó,PURP,0.53,2,100505
Pó,R.I.R.,0.53,2,100505
Pó,A,0.26,1,100505
Pó,JPP,0.26,1,100505
Pó,MPT,0.26,1,100505
Pó,PCTP/MRPP,0.26,1,100505
Pó,L,0,0,100505
Pó,MAS,0,0,100505
Pó,NC,0,0,100505
Pó,PTP,0,0,100505
