freguesia,acronym,validVotesPercentage,votes,dicofre
Vila do Porto,PS,51.97,277,410105
Vila do Porto,PPD/PSD,18.01,96,410105
Vila do Porto,B.E.,12.57,67,410105
Vila do Porto,PAN,3.56,19,410105
Vila do Porto,PCP-PEV,3.38,18,410105
Vila do Porto,A,2.25,12,410105
Vila do Porto,CDS-PP,2.06,11,410105
Vila do Porto,L,1.31,7,410105
Vila do Porto,NC,1.31,7,410105
Vila do Porto,IL,0.94,5,410105
Vila do Porto,PDR,0.94,5,410105
Vila do Porto,PNR,0.56,3,410105
Vila do Porto,PPM.PPV/CDC,0.56,3,410105
Vila do Porto,PURP,0.38,2,410105
Vila do Porto,MAS,0.19,1,410105
Vila do Porto,PCTP/MRPP,0,0,410105
Vila do Porto,PTP,0,0,410105
