freguesia,acronym,validVotesPercentage,votes,dicofre
Cota,PPD/PSD.CDS-PP,58.76,208,182310
Cota,PS,25.42,90,182310
Cota,MPT,3.11,11,182310
Cota,PND,3.11,11,182310
Cota,PCP-PEV,2.54,9,182310
Cota,PAN,1.98,7,182310
Cota,PTP,1.13,4,182310
Cota,B.E.,0.85,3,182310
Cota,PPV,0.85,3,182310
Cota,L,0.56,2,182310
Cota,PCTP/MRPP,0.56,2,182310
Cota,PNR,0.56,2,182310
Cota,MAS,0.28,1,182310
Cota,POUS,0.28,1,182310
Cota,PDA,0,0,182310
Cota,PPM,0,0,182310
