Objeto do Contrato,Tipo de Procedimento,Tipo(s) de Contrato,CPVs,Entidade(s) Adjudicante(s),Entidade(s) Adjudicatária(s),Preço Contratual,Data de Publicação,Data de Celebração do Contrato,Prazo de Execução,Local de Execução,Fundamentação,Data de Fecho do Contrato,Preço Total Efetivo,Causas das Alterações ao Prazo,Causas das Alterações ao Preço,Estado,N.º registo do Acordo Quadro,Descrição do Acordo Quadro,Procedimento Centralizado
"Serviços de Custódia de Arquivo do CHSJ, EPE",Ajuste Direto Regime Geral,Aquisição de serviços,"79000000-4, Serviços a empresas: direito, comercialização, consultoria, recrutamento, impressão e segurança","Centro Hospitalar de São João, E. P. E. (509821197)","EAD - Empresa de Arquivo de Documentação, S.A. (507616944)","35.772,00 €",09-06-2016,24-04-2015,100 dias,"Portugal, Porto, Porto","Artigo 20.º, n.º 1, alínea a) do Código dos Contratos Públicos",,,,,,Não aplicável.,Não aplicável.,FALSE
"Aquisição de serviços de Apoio especializado a ferramentas Microsoft do CHSJ, EPE",Ajuste Direto Regime Geral,Aquisição de serviços,"73000000-2, Serviços de investigação e desenvolvimento e serviços de consultoria conexos","Centro Hospitalar de São João, E. P. E. (509821197)","Winprovit - Soluções Inteligentes, S.A. (507478045)","8.750,00 €",09-06-2016,20-05-2015,100 dias,"Portugal, Porto, Porto","Artigo 20.º, n.º 1, alínea a) do Código dos Contratos Públicos",,,,,,Não aplicável.,Não aplicável.,FALSE
"Aquisição de serviços de criação, conceção e execução de campanha publicitária, de média e de divulgação no âmbito do projeto Nascer São João do CHSJ, EPE",Ajuste Direto Regime Geral,Aquisição de serviços,"73000000-2, Serviços de investigação e desenvolvimento e serviços de consultoria conexos","Centro Hospitalar de São João, E. P. E. (509821197)",Virtualcare (510394639),"6.500,00 €",09-06-2016,20-03-2015,100 dias,"Portugal, Porto, Porto","Artigo 20.º, n.º 1, alínea a) do Código dos Contratos Públicos",,,,,,Não aplicável.,Não aplicável.,FALSE
"Aquisição de serviços de criação, conceção e execução de campanha publicitária, de média e de divulgação no âmbito do projeto Nascer São João do CHSJ, EPE",Ajuste Direto Regime Geral,Aquisição de serviços,"73000000-2, Serviços de investigação e desenvolvimento e serviços de consultoria conexos","Centro Hospitalar de São João, E. P. E. (509821197)","Ska - Publicidade, S.A (505508974)","49.750,00 €",09-06-2016,27-08-2015,100 dias,"Portugal, Porto, Porto","Artigo 20.º, n.º 1, alínea a) do Código dos Contratos Públicos",,,,,,Não aplicável.,Não aplicável.,FALSE
"Aquisição de serviços de Desenvolvimento Criativo, para o CHSJ, EPE.",Ajuste Direto Regime Geral,Aquisição de serviços,"73000000-2, Serviços de investigação e desenvolvimento e serviços de consultoria conexos","Centro Hospitalar de São João, E. P. E. (509821197)","Canalimagem - Publicidade e Meios, Lda (507408977)","8.250,00 €",09-06-2016,20-03-2015,100 dias,"Portugal, Porto, Porto","Artigo 20.º, n.º 1, alínea a) do Código dos Contratos Públicos",,,,,,Não aplicável.,Não aplicável.,FALSE
"Aquisição de serviços de Migração de base de dados do SIDEP do CHSJ, EPE",Ajuste Direto Regime Geral,Aquisição de serviços,"72000000-5, Serviços de TI: consultoria, desenvolvimento de software, Internet e apoio","Centro Hospitalar de São João, E. P. E. (509821197)",VirtualCare (510394639),"5.500,00 €",09-06-2016,20-05-2015,100 dias,"Portugal, Porto, Porto","Artigo 20.º, n.º 1, alínea a) do Código dos Contratos Públicos",,,,,,Não aplicável.,Não aplicável.,FALSE
procedimento nº14000316-aquisição de acessórios para Gases Medicinais para o serviço de Instalações e Equipamentos do CHSJ EPE,Ajuste Direto Regime Geral,Aquisição de bens móveis,"24100000-5, Gases","Centro Hospitalar de São João, E. P. E. (509821197)",Air Liquide Medicinal SA (501576436),"19.993,50 €",08-06-2016,04-05-2016,365 dias,"Portugal, Porto, Porto","Artigo 20.º, n.º 1, alínea a) do Código dos Contratos Públicos",,,,,,Não aplicável.,Não aplicável.,FALSE
"Aquisição de Serviços de Desenho de Soluções para o Hospital de Dia do CHSJ, EPE",Ajuste Direto Regime Geral,Aquisição de serviços,"73000000-2, Serviços de investigação e desenvolvimento e serviços de consultoria conexos","Centro Hospitalar de São João, E. P. E. (509821197)",Kaizen Institute Portugal (508830001),"18.200,00 €",08-06-2016,24-03-2015,100 dias,"Portugal, Porto, Porto","Artigo 20.º, n.º 1, alínea a) do Código dos Contratos Públicos",,,,,,Não aplicável.,Não aplicável.,FALSE
"Procedimento nº 84008215 - Aquisição de Serviços de Desenvolvimento de Projeto de Sinalética para o CHSJ, EPE",Ajuste Direto Regime Geral,Aquisição de serviços,"79400000-8, Serviços de consultoria em matéria comercial e de gestão e serviços conexos","Centro Hospitalar de São João, E. P. E. (509821197)","Razão, lda (503161195)","69.930,00 €",08-06-2016,18-02-2015,100 dias,"Portugal, Porto, Porto","Artigo 20.º, n.º 1, alínea a) do Código dos Contratos Públicos",,,,,,Não aplicável.,Não aplicável.,FALSE
"aquisição de serviços comercialização de uma plataforma operacional e estratégica de suporte inteligente á decisão clinica, administrativa e financeira -bussiness inteligence, do centro hospitalar são joao EPE",Ajuste Direto Regime Geral,Aquisição de serviços,"72700000-7, Serviços de rede informática","Centro Hospitalar de São João, E. P. E. (509821197)","JP BALTAZAR, LDA (506365018)","30.000,00 €",07-06-2016,29-06-2015,100 dias,"Portugal, Porto, Porto","Artigo 20.º, n.º 1, alínea a) do Código dos Contratos Públicos",,,,,,Não aplicável.,Não aplicável.,FALSE
"Contrato manutenção aos equipamentos de Frio do CHSJ, EPE para o ano 2016",Ajuste Direto Regime Geral,Aquisição de serviços,"50000000-5, Serviços de reparação e manutenção","Centro Hospitalar de São João, E. P. E. (509821197)","Climanor - Manutenção de equipamento industriais, Lda (504563106)","53.696,79 €",02-06-2016,20-05-2016,365 dias,"Portugal, Porto, Porto","Artigo 20.º, n.º 1, alínea a) do Código dos Contratos Públicos",,,,,,Não aplicável.,Não aplicável.,FALSE
"Contrato de manutenção e assistência técnica aos equipamentos de anestesia e monitorização do CHSJ, EPE, para o ano 2016",Ajuste Direto Regime Geral,Aquisição de serviços,"50000000-5, Serviços de reparação e manutenção","Centro Hospitalar de São João, E. P. E. (509821197)","General Electric Portuguesa, S.A. (500357129)","57.786,16 €",02-06-2016,18-05-2016,365 dias,"Portugal, Porto, Porto","Artigo 24.º, n.º 1, alínea e) do Código dos Contratos Públicos",,,,,,Não aplicável.,Não aplicável.,FALSE
