freguesia,acronym,validVotesPercentage,votes,dicofre
"União das freguesias de Viatodos, Grimancelos, Minhotães e Monte de Fralães",PPD/PSD,44.64,975,0302FG
"União das freguesias de Viatodos, Grimancelos, Minhotães e Monte de Fralães",PS,35.85,783,0302FG
"União das freguesias de Viatodos, Grimancelos, Minhotães e Monte de Fralães",B.E.,7.28,159,0302FG
"União das freguesias de Viatodos, Grimancelos, Minhotães e Monte de Fralães",CDS-PP,4.9,107,0302FG
"União das freguesias de Viatodos, Grimancelos, Minhotães e Monte de Fralães",PAN,1.83,40,0302FG
"União das freguesias de Viatodos, Grimancelos, Minhotães e Monte de Fralães",PCP-PEV,1.37,30,0302FG
"União das freguesias de Viatodos, Grimancelos, Minhotães e Monte de Fralães",R.I.R.,0.78,17,0302FG
"União das freguesias de Viatodos, Grimancelos, Minhotães e Monte de Fralães",IL,0.69,15,0302FG
"União das freguesias de Viatodos, Grimancelos, Minhotães e Monte de Fralães",PCTP/MRPP,0.6,13,0302FG
"União das freguesias de Viatodos, Grimancelos, Minhotães e Monte de Fralães",CH,0.55,12,0302FG
"União das freguesias de Viatodos, Grimancelos, Minhotães e Monte de Fralães",L,0.37,8,0302FG
"União das freguesias de Viatodos, Grimancelos, Minhotães e Monte de Fralães",A,0.32,7,0302FG
"União das freguesias de Viatodos, Grimancelos, Minhotães e Monte de Fralães",PDR,0.27,6,0302FG
"União das freguesias de Viatodos, Grimancelos, Minhotães e Monte de Fralães",MPT,0.18,4,0302FG
"União das freguesias de Viatodos, Grimancelos, Minhotães e Monte de Fralães",NC,0.18,4,0302FG
"União das freguesias de Viatodos, Grimancelos, Minhotães e Monte de Fralães",JPP,0.05,1,0302FG
"União das freguesias de Viatodos, Grimancelos, Minhotães e Monte de Fralães",PNR,0.05,1,0302FG
"União das freguesias de Viatodos, Grimancelos, Minhotães e Monte de Fralães",PTP,0.05,1,0302FG
"União das freguesias de Viatodos, Grimancelos, Minhotães e Monte de Fralães",PURP,0.05,1,0302FG
"União das freguesias de Viatodos, Grimancelos, Minhotães e Monte de Fralães",MAS,0,0,0302FG
"União das freguesias de Viatodos, Grimancelos, Minhotães e Monte de Fralães",PPM,0,0,0302FG
