freguesia,acronym,validVotesPercentage,votes,dicofre
Fail e Vila Chã de Sá,PS,39.35,447,182338
Fail e Vila Chã de Sá,PPD/PSD,37.59,427,182338
Fail e Vila Chã de Sá,B.E.,8.45,96,182338
Fail e Vila Chã de Sá,CDS-PP,4.58,52,182338
Fail e Vila Chã de Sá,PAN,2.38,27,182338
Fail e Vila Chã de Sá,PCP-PEV,1.85,21,182338
Fail e Vila Chã de Sá,CH,1.5,17,182338
Fail e Vila Chã de Sá,A,0.7,8,182338
Fail e Vila Chã de Sá,IL,0.7,8,182338
Fail e Vila Chã de Sá,PCTP/MRPP,0.62,7,182338
Fail e Vila Chã de Sá,R.I.R.,0.62,7,182338
Fail e Vila Chã de Sá,L,0.53,6,182338
Fail e Vila Chã de Sá,MPT,0.18,2,182338
Fail e Vila Chã de Sá,NC,0.18,2,182338
Fail e Vila Chã de Sá,PDR,0.18,2,182338
Fail e Vila Chã de Sá,PNR,0.18,2,182338
Fail e Vila Chã de Sá,PPM,0.18,2,182338
Fail e Vila Chã de Sá,PTP,0.18,2,182338
Fail e Vila Chã de Sá,PURP,0.09,1,182338
Fail e Vila Chã de Sá,JPP,0,0,182338
