freguesia,acronym,validVotesPercentage,votes,dicofre
Cativelos,PS,46.55,108,090603
Cativelos,PPD/PSD.CDS-PP,33.62,78,090603
Cativelos,MPT,6.03,14,090603
Cativelos,PCP-PEV,3.88,9,090603
Cativelos,PND,3.45,8,090603
Cativelos,B.E.,2.59,6,090603
Cativelos,L,0.86,2,090603
Cativelos,MAS,0.86,2,090603
Cativelos,PTP,0.86,2,090603
Cativelos,PAN,0.43,1,090603
Cativelos,PCTP/MRPP,0.43,1,090603
Cativelos,PPM,0.43,1,090603
Cativelos,PDA,0,0,090603
Cativelos,PNR,0,0,090603
Cativelos,POUS,0,0,090603
Cativelos,PPV,0,0,090603
