freguesia,acronym,validVotesPercentage,votes,dicofre
Souto,PPD/PSD,36.81,60,031014
Souto,PS,29.45,48,031014
Souto,CDS-PP,15.34,25,031014
Souto,B.E.,5.52,9,031014
Souto,PCP-PEV,5.52,9,031014
Souto,A,1.84,3,031014
Souto,L,1.23,2,031014
Souto,PAN,1.23,2,031014
Souto,PTP,1.23,2,031014
Souto,MAS,0.61,1,031014
Souto,PCTP/MRPP,0.61,1,031014
Souto,PPM.PPV/CDC,0.61,1,031014
Souto,IL,0,0,031014
Souto,NC,0,0,031014
Souto,PDR,0,0,031014
Souto,PNR,0,0,031014
Souto,PURP,0,0,031014
