freguesia,acronym,validVotesPercentage,votes,dicofre
Fornelos e Queijada,PPD/PSD.CDS-PP,63.91,324,160758
Fornelos e Queijada,PS,17.95,91,160758
Fornelos e Queijada,MPT,6.51,33,160758
Fornelos e Queijada,B.E.,2.17,11,160758
Fornelos e Queijada,PCP-PEV,2.17,11,160758
Fornelos e Queijada,PND,1.38,7,160758
Fornelos e Queijada,PPV,1.18,6,160758
Fornelos e Queijada,L,0.99,5,160758
Fornelos e Queijada,PTP,0.99,5,160758
Fornelos e Queijada,MAS,0.79,4,160758
Fornelos e Queijada,PAN,0.59,3,160758
Fornelos e Queijada,PPM,0.59,3,160758
Fornelos e Queijada,PCTP/MRPP,0.39,2,160758
Fornelos e Queijada,PNR,0.39,2,160758
Fornelos e Queijada,PDA,0,0,160758
Fornelos e Queijada,POUS,0,0,160758
