Objeto do Contrato,Tipo de Procedimento,Tipo(s) de Contrato,CPVs,Entidade(s) Adjudicante(s),Entidade(s) Adjudicatária(s),Preço Contratual,Data de Publicação,Data de Celebração do Contrato,Prazo de Execução,Local de Execução,Fundamentação,Data de Fecho do Contrato,Preço Total Efetivo,Causas das Alterações ao Prazo,Causas das Alterações ao Preço,Estado,N.º registo do Acordo Quadro,Descrição do Acordo Quadro,Procedimento Centralizado
MEDICAMENTOS DO APARELHO CARDIOVASCULAR,Ajuste Direto Regime Geral,Aquisição de bens móveis,"33622000-6, Medicamentos para o aparelho cardiovascular","Centro Hospitalar do Baixo Vouga, E.P.E. (510123210)","OVERPHARMA - PROD. MED. FARMACÊUTICOS, LDA (505792362), SHIRE PHARMACEUTICALS PORTUGAL, LDA (509264662), LABORATORIOS VITORIA (500162220), PROSPA-LAB FARMACEUTICOS,SA (500130248)","3.594,18 €",06-05-2014,31-03-2014,275 dias,"Portugal, Aveiro","Artigo 20.º, n.º 1, alínea a) do Código dos Contratos Públicos",31-12-2014,"3.218,27 €",-,-,,Não aplicável.,Não aplicável.,FALSE
MEDICAMENTOS DO SISTEMA NERVOSO CENTRAL,Ajuste Direto Regime Geral,Aquisição de bens móveis,"33660000-4, Medicamentos para o sistema nervoso e para os órgãos sensoriais","Centro Hospitalar do Baixo Vouga, E.P.E. (510123210)","B.BRAUN MEDICAL, LDA (501506543), ROCHE FARMACEUTICA QUIMICA,LDA (500233810), SANOFI - PRODUTOS FARMACÊUTICOS, LDA (500134960), H.R. HOSPITALAR, LDA (501895558), LABORATORIOS INIBSA, S.A. (500139571), LABORATORIOS VITORIA (500162220), PHARMIS BIOFARMACEUTICA, LDA. (502595442), CPH PHARMA - COMP.PORTUG.HIGIENE PROD. FARMACEUTICOS, SA (500069190)","26.419,58 €",06-05-2014,31-03-2014,275 dias,"Portugal, Aveiro","Artigo 20.º, n.º 1, alínea a) do Código dos Contratos Públicos",31-03-2015,"22.287,04 €",.,.,,Não aplicável.,Não aplicável.,FALSE
MEDICAMENTOS ANTIBACTERIANOS,Ajuste Direto Regime Geral,Aquisição de bens móveis,"33651100-9, Antibacterianos de uso sistémico","Centro Hospitalar do Baixo Vouga, E.P.E. (510123210)","LABORATORIOS VITORIA (500162220), LABORATORIOS ATRAL,SA (500162085)","4.945,90 €",05-05-2014,31-03-2014,275 dias,"Portugal, Aveiro","Artigo 20.º, n.º 1, alínea a) do Código dos Contratos Públicos",31-12-2014,"4.383,00 €",.,.,,Não aplicável.,Não aplicável.,FALSE
