Objeto do Contrato,Tipo de Procedimento,Tipo(s) de Contrato,CPVs,Entidade(s) Adjudicante(s),Entidade(s) Adjudicatária(s),Preço Contratual,Data de Publicação,Data de Celebração do Contrato,Prazo de Execução,Local de Execução,Fundamentação,Data de Fecho do Contrato,Preço Total Efetivo,Causas das Alterações ao Prazo,Causas das Alterações ao Preço,Estado,N.º registo do Acordo Quadro,Descrição do Acordo Quadro,Procedimento Centralizado
FORNECIMENTO DE ELECTRICIDADE 1º TRIMESTRE DE 2017,Ajuste Direto Regime Geral,Aquisição de serviços,"65310000-9, Distribuição de electricidade","Centro Hospitalar do Algarve, E. P. E. (510745997)","EDP COMERCIAL - COMERCIALIZAÇÃO DE ENERGIA, S.A. (503504564)","447.785,59 €",21-04-2017,09-03-2017,90 dias,"Portugal, Faro, Portimão<BR/>Portugal, Faro, Lagos<BR/>Portugal, Faro, Faro","Artigo 24.º, n.º 1, alínea c) do Código dos Contratos Públicos",31-03-2017,"263.230,30 €",,Valor efectivo inferior ao valor inicialmente estimado,,Não aplicável.,Não aplicável.,FALSE
Produtos de Apoio,Ajuste Direto Regime Geral,Aquisição de serviços,"85111400-4, Serviços hospitalares de reabilitação","Centro Hospitalar do Algarve, E.P.E. (510745997)",PORTOPÉDICO COMÉRCIO E APLICAÇÃO DE PRODUTOS ORTOPEDICOS (509829953),"4.847,40 €",20-04-2017,09-03-2017,90 dias,"Portugal<BR/>Portugal, Faro, Faro","Artigo 20.º, n.º 1, alínea a) do Código dos Contratos Públicos","","",,"",,Não aplicável.,Não aplicável.,FALSE
Produtos de Apoio,Ajuste Direto Regime Geral,Aquisição de serviços,"85111400-4, Serviços hospitalares de reabilitação","Centro Hospitalar do Algarve, E.P.E. (510745997)",Ortobalance (513555587),"3.404,80 €",20-04-2017,09-03-2017,90 dias,"Portugal, Faro, Faro<BR/>Portugal","Artigo 20.º, n.º 1, alínea a) do Código dos Contratos Públicos","","",,"",,Não aplicável.,Não aplicável.,FALSE
Produtos de Apoio,Ajuste Direto Regime Geral,Aquisição de serviços,"85111400-4, Serviços hospitalares de reabilitação","Centro Hospitalar do Algarve, E.P.E. (510745997)",Rehactivar (513252967),"1.656,64 €",20-04-2017,09-03-2017,90 dias,"Portugal, Faro, Faro<BR/>Portugal","Artigo 20.º, n.º 1, alínea a) do Código dos Contratos Públicos","","",,"",,Não aplicável.,Não aplicável.,FALSE
Produtos de Apoio,Ajuste Direto Regime Geral,Aquisição de serviços,"85111400-4, Serviços hospitalares de reabilitação","Centro Hospitalar do Algarve, E.P.E. (510745997)",Impulse (513076891),"968,86 €",20-04-2017,09-03-2017,90 dias,"Portugal, Faro, Faro","Artigo 22.º, n.º 1, alínea b) do Código dos Contratos Públicos","","",,"",,Não aplicável.,Não aplicável.,FALSE
Produtos de Apoio,Ajuste Direto Regime Geral,Aquisição de serviços,"85111400-4, Serviços hospitalares de reabilitação","Centro Hospitalar do Algarve, E.P.E. (510745997)",Lab. Dentarios (502276878),"1.303,00 €",20-04-2017,09-03-2017,90 dias,"Portugal, Faro, Faro","Artigo 20.º, n.º 1, alínea a) do Código dos Contratos Públicos","","",,"",,Não aplicável.,Não aplicável.,FALSE
Produtos de Apoio,Ajuste Direto Regime Geral,Aquisição de serviços,"85111400-4, Serviços hospitalares de reabilitação","Centro Hospitalar do Algarve, E.P.E. (510745997)",optimax (503358380),"537,20 €",20-04-2017,09-03-2017,90 dias,"Portugal, Faro, Faro","Artigo 20.º, n.º 1, alínea a) do Código dos Contratos Públicos","","",,"",,Não aplicável.,Não aplicável.,FALSE
Produtos de Apoio,Ajuste Direto Regime Geral,Aquisição de serviços,"85111400-4, Serviços hospitalares de reabilitação","Centro Hospitalar do Algarve, E.P.E. (510745997)",António Moutinho & Cª. Lda (500025550),"415,09 €",20-04-2017,09-03-2017,90 dias,"Portugal, Faro, Faro<BR/>Portugal","Artigo 20.º, n.º 1, alínea a) do Código dos Contratos Públicos","","",,"",,Não aplicável.,Não aplicável.,FALSE
Produtos de Apoio,Ajuste Direto Regime Geral,Aquisição de serviços,"85111400-4, Serviços hospitalares de reabilitação","Centro Hospitalar do Algarve, E.P.E. (510745997)","Ortopedia Moderna, Lda (500481300)","36.153,55 €",20-04-2017,09-03-2017,90 dias,"Portugal, Faro, Faro","Artigo 20.º, n.º 1, alínea a) do Código dos Contratos Públicos","","",,"",,Não aplicável.,Não aplicável.,FALSE
Produtos de Apoio,Ajuste Direto Regime Geral,Aquisição de serviços,"85111400-4, Serviços hospitalares de reabilitação","Centro Hospitalar do Algarve, E.P.E. (510745997)",OrtoAtlas (513781790),"8.038,86 €",20-04-2017,09-03-2017,90 dias,"Portugal, Faro, Faro","Artigo 20.º, n.º 1, alínea a) do Código dos Contratos Públicos","","",,"",,Não aplicável.,Não aplicável.,FALSE
Produtos de Apoio,Ajuste Direto Regime Geral,Aquisição de serviços,"85111400-4, Serviços hospitalares de reabilitação","Centro Hospitalar do Algarve, E. P. E. (510745997)","AMÉRICO QUINT. FILHOS-PROD. ORT. ,LDA. (508988390)","11.403,12 €",20-04-2017,09-03-2017,90 dias,"Portugal, Faro, Faro","Artigo 20.º, n.º 1, alínea a) do Código dos Contratos Públicos","","",,"",,Não aplicável.,Não aplicável.,FALSE
Produtos de Apoio,Ajuste Direto Regime Geral,Aquisição de serviços,"85111400-4, Serviços hospitalares de reabilitação","Centro Hospitalar do Algarve, E. P. E. (510745997)",Ortobalance (513555587),"429,00 €",20-04-2017,09-03-2017,90 dias,"Portugal, Faro, Faro","Artigo 20.º, n.º 1, alínea a) do Código dos Contratos Públicos","","",,"",,Não aplicável.,Não aplicável.,FALSE
Produtos de Apoio,Ajuste Direto Regime Geral,Aquisição de serviços,"85111400-4, Serviços hospitalares de reabilitação","Centro Hospitalar do Algarve, E. P. E. (510745997)","Ortopedia Moderna, Lda (500481300)","27.218,20 €",20-04-2017,09-03-2017,90 dias,"Portugal, Faro, Faro","Artigo 20.º, n.º 1, alínea a) do Código dos Contratos Públicos","","",,"",,Não aplicável.,Não aplicável.,FALSE
Pacemakeres,Ajuste Direto Regime Geral,Aquisição de bens móveis,"33123210-3, Aparelhos para monitorização cardíaca","Centro Hospitalar do Algarve, E.P.E. (510745997)",LIVANOVA (505514010),"23.440,00 €",20-04-2017,13-04-2017,92 dias,"Portugal, Faro, Faro","Artigo 20.º, n.º 1, alínea a) do Código dos Contratos Públicos","","",,"",,Não aplicável.,Não aplicável.,FALSE
67/00001567/2017 UpGrade Artis - Sala Hemodinâmica,Ajuste Direto Regime Geral,Aquisição de bens móveis,"33100000-1, Equipamento médico","Centro Hospitalar do Algarve, E. P. E. (510745997)","SIEMENS HEALTHCARE, LDA. (507925173)","348.600,00 €",19-04-2017,19-04-2017,271 dias,"Portugal, Faro, Faro","Artigo 20.º, n.º 1, alínea a) do Código dos Contratos Públicos","","",,"",,Não aplicável.,Não aplicável.,FALSE
Aquisição de seringa  3 peças 50/60 ml-,Ao abrigo de acordo-quadro (art.º 259.º),Aquisição de bens móveis,"33140000-3, Material médico de consumo","Centro Hospitalar do Algarve, E. P. E. (510745997)","B. Braun Medical, Lda. (501506543)","4.710,76 €",18-04-2017,17-04-2017,259 dias,"Portugal, Faro, Portimão<BR/>Portugal, Faro, Lagos<BR/>Portugal, Faro, Faro","Artigo 20.º, n.º 1, alínea b) do Código dos Contratos Públicos","","",,"",,1341769,"ACORDO QUADRO PARA FORNECIMENTO DE SERINGAS, AGULHAS E CONTENTORES ÀS INSTITUIÇÕES E SERVIÇOS DO SERVIÇO NACIONAL DE SAÚDE PROGRAMA DE CONCURSO",FALSE
Contrato Assistência Técnica a Equipamentos de Segurança Contra Risco de Incêndio do CHAlgarve para 2017 - Proc.78.273.2017,Ajuste Direto Regime Geral,Aquisição de serviços,"50000000-5, Serviços de reparação e manutenção","Centro Hospitalar do Algarve, E. P. E. (510745997)",Acciona Facility Services SA (503431397),"11.999,00 €",18-04-2017,02-03-2017,365 dias,"Portugal, Faro, Faro","Artigo 20.º, n.º 1, alínea a) do Código dos Contratos Públicos","","",,"",,Não aplicável.,Não aplicável.,FALSE
Serviços Médicos Imagiologia,Ajuste Direto Regime Geral,Aquisição de serviços,"85150000-5, Serviços de imagiologia médica","Centro Hospitalar do Algarve, E. P. E. (510745997)","Radiflower - Unipessoal, Lda (508643287)","24.960,00 €",18-04-2017,28-03-2017,180 dias,"Portugal, Faro, Portimão<BR/>Portugal, Faro, Faro","Artigo 24.º, n.º 1, alínea e) do Código dos Contratos Públicos",30-06-2017,"19.920,00 €",,"O valor inicial do Contrato teve por base as necessidades estimadas para o período de 1 Janeiro de 2017 a 30 Junho de 2017, o valor final reflecte as necessidades efectivas.",,Não aplicável.,Não aplicável.,FALSE
Serviços Médicos Urgência Geral e Básica,Ajuste Direto Regime Geral,Aquisição de serviços,"85121100-4, Serviços de médicos de clínica geral","Centro Hospitalar do Algarve, E. P. E. (510745997)","Acosta, Perilla & Pizon - Serviços de Saúde, Lda (513221034)","31.200,00 €",18-04-2017,04-04-2017,180 dias,"Portugal, Faro, Faro<BR/>Portugal, Faro, Loulé<BR/>Portugal, Faro, Albufeira","Artigo 24.º, n.º 1, alínea e) do Código dos Contratos Públicos",30-06-2017,"16.775,00 €",,"O valor inicial teve por base o valor estimado para o período de Janeiro a Junho de 2017, o valor final reflecte o efectivo no período.",,Não aplicável.,Não aplicável.,FALSE
Prestação de Serviços na Área dos Seguros Ramo Automóvel,Ajuste Direto Regime Geral,Aquisição de serviços,"66510000-8, Serviços de seguros","Centro Hospitalar do Algarve, E. P. E. (510745997)","Companhia de Seguros Açoreana,SA (512004048)","6.344,80 €",18-04-2017,17-03-2017,365 dias,"Portugal, Faro, Portimão<BR/>Portugal, Faro, Lagos<BR/>Portugal, Faro, Faro","Artigo 20.º, n.º 1, alínea a) do Código dos Contratos Públicos","","",,"",,Não aplicável.,Não aplicável.,FALSE
Serviços Médicos Ortopedia,Ajuste Direto Regime Geral,Aquisição de serviços,"85121283-0, Serviços de ortopedia","Centro Hospitalar do Algarve, E. P. E. (510745997)","Génio Curioso, Lda (510090745)","31.200,00 €",18-04-2017,12-04-2017,90 dias,"Portugal, Faro, Portimão<BR/>Portugal, Faro, Faro","Artigo 24.º, n.º 1, alínea e) do Código dos Contratos Públicos",15-05-2017,"23.400,00 €",,"O valor inicial teve por base o estimado para o período de 1 Janeiro a 31 de Março de 2017, o valor final reflecte o valor efetivo",,Não aplicável.,Não aplicável.,FALSE
Prestação de Serviços de Teleradiologia - Janeiro e Fevereiro de 2017,Ajuste Direto Regime Geral,Aquisição de serviços,"85100000-0, Serviços de saúde","Centro Hospitalar do Algarve, E. P. E. (510745997)","IMI-IMAGENS MEDICAS INTEGRADAS, SA (501721037)","44.620,00 €",17-04-2017,01-01-2017,59 dias,"Portugal, Faro, Faro<BR/>Portugal, Faro, Portimão","Artigo 24.º, n.º 1, alínea c) do Código dos Contratos Públicos","","",,"",,Não aplicável.,Não aplicável.,FALSE
Prestação de Serviços de Transporte de Valores,Ajuste Direto Regime Geral,Aquisição de serviços,"79710000-4, Serviços de segurança","Centro Hospitalar do Algarve, E. P. E. (510745997)","Loomis Portugal, SA (506632768)","10.920,00 €",17-04-2017,30-03-2017,365 dias,"Portugal, Faro, Portimão<BR/>Portugal, Faro, Faro","Artigo 20.º, n.º 1, alínea a) do Código dos Contratos Públicos","","",,"",,Não aplicável.,Não aplicável.,FALSE
67/00001683/2017 UpGrade TIM Ressonância Magnética,Ajuste Direto Regime Geral,Aquisição de bens móveis,"33113000-5, Equipamento de imagiologia por ressonância magnética","Centro Hospitalar do Algarve, E. P. E. (510745997)","SIEMENS HEALTHCARE, LDA (507925173)","349.900,00 €",17-04-2017,17-04-2017,271 dias,"Portugal, Faro, Faro","Artigo 20.º, n.º 1, alínea a) do Código dos Contratos Públicos","","",,"",,Não aplicável.,Não aplicável.,FALSE
75/00002066/2017 Aquisição Toner Original Canon e Epson,Ajuste Direto Regime Geral,Aquisição de bens móveis,"30125100-2, Cartuchos de tinta (toner)","Centro Hospitalar do Algarve, E. P. E. (510745997)",Top Toner (504242644),"3.811,50 €",13-04-2017,10-04-2017,264 dias,"Portugal, Faro, Faro<BR/>Portugal, Faro, Lagos<BR/>Portugal, Faro, Portimão","Artigo 20.º, n.º 1, alínea a) do Código dos Contratos Públicos","","",,"",,Não aplicável.,Não aplicável.,FALSE
75/00002066/2017 Aquisição Toner Original Canon e Epson,Ajuste Direto Regime Geral,Aquisição de bens móveis,"30125100-2, Cartuchos de tinta (toner)","Centro Hospitalar do Algarve, E. P. E. (510745997)","PRN Informática, Lda. (504100327)","5.184,00 €",13-04-2017,10-04-2017,264 dias,"Portugal, Faro, Portimão<BR/>Portugal, Faro, Faro<BR/>Portugal, Faro, Lagos","Artigo 20.º, n.º 1, alínea a) do Código dos Contratos Públicos","","",,"",,Não aplicável.,Não aplicável.,FALSE
Revisão de Prótese Total do Joelho,Concurso público,Aquisição de bens móveis,"33183200-8, Próteses ortopédicas","Centro Hospitalar do Algarve, E. P. E. (510745997)",JOHNSON & JOHNSON PROD.PROF. (500153370),"147.500,00 €",13-04-2017,11-04-2017,262 dias,"Portugal, Faro, Portimão<BR/>Portugal, Faro, Faro","Artigo 20.º, n.º 1, alínea b) do Código dos Contratos Públicos","","",,"",,Não aplicável.,Não aplicável.,FALSE
Aquisição de Material de Estomatologia,Ajuste Direto Regime Geral,Aquisição de bens móveis,"33140000-3, Material médico de consumo","Centro Hospitalar do Algarve, E. P. E. (510745997)",DentaLeader (980187036),"353,20 €",12-04-2017,10-04-2017,266 dias,"Portugal, Faro, Lagos<BR/>Portugal, Faro, Faro<BR/>Portugal, Faro, Portimão","Artigo 20.º, n.º 1, alínea a) do Código dos Contratos Públicos","","",,"",,Não aplicável.,Não aplicável.,FALSE
Aquisição de Material de Estomatologia,Ajuste Direto Regime Geral,Aquisição de bens móveis,"33140000-3, Material médico de consumo","Centro Hospitalar do Algarve, E. P. E. (510745997)",MONTELLANO (500196494),"2.259,38 €",12-04-2017,10-04-2017,266 dias,"Portugal, Faro, Faro<BR/>Portugal, Faro, Portimão<BR/>Portugal, Faro, Lagos","Artigo 20.º, n.º 1, alínea a) do Código dos Contratos Públicos","","",,"",,Não aplicável.,Não aplicável.,FALSE
