freguesia,acronym,validVotesPercentage,votes,dicofre
Aldeia Velha,PPD/PSD.CDS-PP,56.94,82,091106
Aldeia Velha,PS,26.39,38,091106
Aldeia Velha,PCP-PEV,4.86,7,091106
Aldeia Velha,MPT,4.17,6,091106
Aldeia Velha,PCTP/MRPP,2.78,4,091106
Aldeia Velha,PAN,1.39,2,091106
Aldeia Velha,PND,1.39,2,091106
Aldeia Velha,L,0.69,1,091106
Aldeia Velha,MAS,0.69,1,091106
Aldeia Velha,PDA,0.69,1,091106
Aldeia Velha,B.E.,0,0,091106
Aldeia Velha,PNR,0,0,091106
Aldeia Velha,POUS,0,0,091106
Aldeia Velha,PPM,0,0,091106
Aldeia Velha,PPV,0,0,091106
Aldeia Velha,PTP,0,0,091106
