freguesia,acronym,validVotesPercentage,votes,dicofre
Gaula,JPP,42.27,858,310804
Gaula,PPD/PSD,23.1,469,310804
Gaula,PS,20.69,420,310804
Gaula,B.E.,4.04,82,310804
Gaula,CDS-PP,3.05,62,310804
Gaula,PCP-PEV,1.38,28,310804
Gaula,PDR,0.79,16,310804
Gaula,PTP,0.79,16,310804
Gaula,L,0.54,11,310804
Gaula,PAN,0.54,11,310804
Gaula,CH,0.49,10,310804
Gaula,PCTP/MRPP,0.49,10,310804
Gaula,R.I.R.,0.49,10,310804
Gaula,PURP,0.44,9,310804
Gaula,IL,0.3,6,310804
Gaula,A,0.25,5,310804
Gaula,PPM,0.2,4,310804
Gaula,MPT,0.1,2,310804
Gaula,PNR,0.05,1,310804
Gaula,NC,0,0,310804
