Objeto do Contrato,Tipo de Procedimento,Tipo(s) de Contrato,CPVs,Entidade(s) Adjudicante(s),Entidade(s) Adjudicatária(s),Preço Contratual,Data de Publicação,Data de Celebração do Contrato,Prazo de Execução,Local de Execução,Fundamentação,Data de Fecho do Contrato,Preço Total Efetivo,Causas das Alterações ao Prazo,Causas das Alterações ao Preço,Estado,N.º registo do Acordo Quadro,Descrição do Acordo Quadro,Procedimento Centralizado
Prótese Tubular Valvulada Biológica,Ajuste Direto Regime Geral,Aquisição de bens móveis,"33000000-0, Equipamento médico, medicamentos e produtos para cuidados pessoais",Centro Hospitalar de Lisboa Central E.P.E. (508080142),Medtronic (504223933),"13.600,00 €",30-04-2013,22-04-2013,30 dias,"Portugal, Lisboa, Lisboa","Artigo 24.º, n.º 1, alínea c) do Código dos Contratos Públicos",,,,,,Não aplicável.,Não aplicável.,
Material para osteossíntese de coluna,Ajuste Direto Regime Geral,Aquisição de bens móveis,"33000000-0, Equipamento médico, medicamentos e produtos para cuidados pessoais",Centro Hospitalar de Lisboa Central E.P.E. (508080142),Zimmer (980151716),"9.770,00 €",30-04-2013,22-04-2013,1 dias,"Portugal, Lisboa, Lisboa","Artigo 24.º, n.º 1, alínea c) do Código dos Contratos Públicos",,,,,,Não aplicável.,Não aplicável.,
Material de osteossintese para coluna,Ajuste Direto Regime Geral,Aquisição de bens móveis,"33000000-0, Equipamento médico, medicamentos e produtos para cuidados pessoais",Centro Hospitalar de Lisboa Central E.P.E. (508080142),Medtronic (504223933),"19.900,00 €",30-04-2013,23-04-2013,1 dias,"Portugal, Lisboa, Lisboa","Artigo 24.º, n.º 1, alínea c) do Código dos Contratos Públicos",,,,,,Não aplicável.,Não aplicável.,
Aquisição de consumiveis para dois equipamentos integra cusa excel,Concurso público,Aquisição de bens móveis,"33140000-3, Material médico de consumo",Centro Hospitalar de Lisboa Central E.P.E. (508080142),"SOCIME II - Produtos Médicos, Lda (504453939)","147.862,00 €",29-04-2013,29-04-2013,236 dias,"Portugal, Lisboa, Lisboa","Artigo 20.º, n.º 1, alínea b) do Código dos Contratos Públicos",,,,,,Não aplicável.,Não aplicável.,
"Aquisição de batas cirúrgicas, conjuntos calça/casaco, mascaras, barretes e avental",Ajuste Direto Regime Geral,Aquisição de bens móveis,"33140000-3, Material médico de consumo",Centro Hospitalar de Lisboa Central E.P.E. (508080142),"BASTOS VIEGAS, SA (500042772)","44.520,88 €",29-04-2013,26-04-2013,249 dias,"Portugal, Lisboa, Lisboa",Artigo 258.º do Código dos Contratos Públicos,,,,,,Não aplicável.,Não aplicável.,
Aquisição de Reagente Determinante Glucose no Sangue,Ajuste Direto Regime Geral,Aquisição de bens móveis,"33600000-6, Produtos farmacêuticos",Centro Hospitalar de Lisboa Central E.P.E. (508080142),"Abbott Laboratórios, Lda. (500006148)","24.000,00 €",24-04-2013,24-04-2013,275 dias,"Portugal, Lisboa, Lisboa","Artigo 20.º, n.º 1, alínea a) do Código dos Contratos Públicos",,,,,,Não aplicável.,Não aplicável.,
"""""Identif. automat. bacilos gram negativos""""",Ajuste Direto Regime Geral,Aquisição de bens móveis,"33696500-0, Reagentes de laboratório",Centro Hospitalar de Lisboa Central E.P.E. (508080142),Biomérieux Portugal (501524177),"7.633,00 €",24-04-2013,24-04-2013,252 dias,"Portugal, Lisboa, Lisboa","Artigo 26.º, n.º 1, alínea a) do Código dos Contratos Públicos",,,,,,Não aplicável.,Não aplicável.,
"aquisição de polielectrolitico p/ rep. NA hemofiltração c/ citrato, saco 5000ml",Ajuste Direto Regime Geral,Aquisição de bens móveis,"33000000-0, Equipamento médico, medicamentos e produtos para cuidados pessoais",Centro Hospitalar de Lisboa Central E.P.E. (508080142),Gambro Lundia AB - Sucursal em Portugal (980367751),"34.000,00 €",24-04-2013,24-04-2013,251 dias,"Portugal, Lisboa, Lisboa","Artigo 20.º, n.º 1, alínea a) do Código dos Contratos Públicos",,,,,,Não aplicável.,Não aplicável.,
aquisição de microesferas 100-300um para quimioembolização,Ajuste Direto Regime Geral,Aquisição de bens móveis,"33000000-0, Equipamento médico, medicamentos e produtos para cuidados pessoais",Centro Hospitalar de Lisboa Central E.P.E. (508080142),Terumo Europe Espana SL (980472024),"26.565,00 €",23-04-2013,23-04-2013,60 dias,"Portugal, Lisboa, Lisboa","Artigo 20.º, n.º 1, alínea a) do Código dos Contratos Públicos",,,,,,Não aplicável.,Não aplicável.,
Aquisição de Moroctocog Alfa 500UI pó sol inj fr IV.,Ajuste Direto Regime Geral,Aquisição de bens móveis,"33600000-6, Produtos farmacêuticos",Centro Hospitalar de Lisboa Central E.P.E. (508080142),"Laboratórios Pfizer, Lda. (500162166)","206.994,00 €",23-04-2013,15-04-2013,280 dias,"Portugal, Lisboa, Lisboa","Artigo 24.º, n.º 1, alínea e) do Código dos Contratos Públicos",,,,,,Não aplicável.,Não aplicável.,
"Próteses, parafusos e placas para maxilo-facial e material para artroscopia",Ajuste Direto Regime Geral,Aquisição de bens móveis,"33000000-0, Equipamento médico, medicamentos e produtos para cuidados pessoais",Centro Hospitalar de Lisboa Central E.P.E. (508080142),Biomet Portugal Unipessoal (500254990),"6.224,00 €",23-04-2013,27-03-2013,1 dias,"Portugal, Lisboa, Lisboa","Artigo 24.º, n.º 1, alínea c) do Código dos Contratos Públicos",,,,,,Não aplicável.,Não aplicável.,
Diverso material de osteossíntese,Ajuste Direto Regime Geral,Aquisição de bens móveis,"33000000-0, Equipamento médico, medicamentos e produtos para cuidados pessoais",Centro Hospitalar de Lisboa Central E.P.E. (508080142),Stryker Portugal (504594214),"79.878,15 €",23-04-2013,23-04-2013,10 dias,"Portugal, Lisboa, Lisboa","Artigo 24.º, n.º 1, alínea c) do Código dos Contratos Públicos",,,,,,Não aplicável.,Não aplicável.,
"Empreitada para Remodelação da Enfermaria de Pediatria Médica 5.1 - Unidade de Cuidados Intermédios Neonatais do CHLC, EPE - Hospital Dona Estefânia",Concurso público,Empreitadas de obras públicas,"45000000-7, Construção",Centro Hospitalar de Lisboa Central E.P.E. (508080142),ICEBLOCK (504299590),"224.965,00 €",22-04-2013,19-04-2013,45 dias,"Portugal, Lisboa, Lisboa","Artigo 19.º, alínea b) do Código dos Contratos Públicos",,,,,,Não aplicável.,Não aplicável.,
Próteses Joelho Primárias,Concurso público,Aquisição de bens móveis,"33183200-8, Próteses ortopédicas",Centro Hospitalar de Lisboa Central E.P.E. (508080142),"Biomet Portugal Unipessoal, Lda (500254990)","136.440,00 €",22-04-2013,19-04-2013,240 dias,"Portugal, Lisboa, Lisboa","Artigo 20.º, n.º 1, alínea b) do Código dos Contratos Públicos",,,,,,Não aplicável.,Não aplicável.,
Próteses Anca Primárias,Concurso público,Aquisição de bens móveis,"33183200-8, Próteses ortopédicas",Centro Hospitalar de Lisboa Central E.P.E. (508080142),Johnson & Johnson Medical (500153370),"170.575,00 €",22-04-2013,19-04-2013,240 dias,"Portugal, Lisboa, Lisboa","Artigo 20.º, n.º 1, alínea b) do Código dos Contratos Públicos",,,,,,Não aplicável.,Não aplicável.,
