Objeto do Contrato,Tipo de Procedimento,Tipo(s) de Contrato,CPVs,Entidade(s) Adjudicante(s),Entidade(s) Adjudicatária(s),Preço Contratual,Data de Publicação,Data de Celebração do Contrato,Prazo de Execução,Local de Execução,Fundamentação,Data de Fecho do Contrato,Preço Total Efetivo,Causas das Alterações ao Prazo,Causas das Alterações ao Preço,Estado,N.º registo do Acordo Quadro,Descrição do Acordo Quadro,Procedimento Centralizado
AQUISIÇÃO DE SERVIÇOS DE SEGUROS DE VIDA PARA OS DADORES E POTENCIAIS DADORES VIVOS DE ORGÃOS,Ao abrigo de acordo-quadro (art.º 259.º),Aquisição de serviços,"66510000-8, Serviços de seguros","Centro Hospitalar de Lisboa Ocidental, E. P. E. (507618319)","Willis - Corretores de Seguros, S.A. (500188629)","361,83 €",28-09-2017,14-07-2017,365 dias,"Portugal, Lisboa, Lisboa",Artigo 259.º do Código dos Contratos Públicos,,,,,,2648015,CONCURSO PÚBLICO COM PUBLICAÇÃO NO JOUE PARA A CELEBRAÇÃO DE ACORDO  QUADRO PARA A PRESTAÇÃO DE SERVIÇOS DE SEGUROS DE VIDA PARA OS DADORES E POTENCIAIS DADORES  VIVOS DE ÓRGÃOS,FALSE
"AQUISIÇÃO DE SERVIÇOS PARA A INSTALAÇÃO, PARAMETRIZAÇÃO, E CONFIGURAÇÃO DE INFRAESTRUTURA DE GESTÃO DE SERVICE DESK",Ajuste Direto Regime Geral,Aquisição de serviços,"72200000-7, Serviços de consultoria e de programação de software","Centro Hospitalar de Lisboa Ocidental, E. P. E. (507618319)","IT Square, Consultoria, Desenvolvimento e Suporte (509981887)","27.220,00 €",28-09-2017,07-09-2017,30 dias,"Portugal, Lisboa, Lisboa","Artigo 20.º, n.º 1, alínea a) do Código dos Contratos Públicos",,,,,,Não aplicável.,Não aplicável.,FALSE
AQUISIÇÃO DE 30 LICENÇAS DRAGON MEDICAL E RESPETIVA INTEGRAÇÃO COM O APLICATIVO RIS DO CHLO (SIIMA),Ajuste Direto Regime Geral,Aquisição de serviços,"72500000-0, Serviços relacionados com a informática","Centro Hospitalar de Lisboa Ocidental, EPE (CHLO) (507618319)","First Solutions, SA (505345978)","67.880,00 €",25-09-2017,30-08-2017,122 dias,"Portugal, Lisboa, Lisboa","Artigo 24.º, n.º 1, alínea e) do Código dos Contratos Públicos",,,,,,Não aplicável.,Não aplicável.,FALSE
"Aquisição de SERVIÇOS DE TRATAMENTO DE RESIDUOS HOSPITALARES NO CHLO EPE, para o mes setembro 2017",Ajuste Direto Regime Geral,Aquisição de serviços,"90524100-7, Serviços de recolha de resíduos hospitalares","Centro Hospitalar de Lisboa Ocidental, E. P. E. (507618319)",SUCH | Serviço de Utilização Comum dos Hospitais (500900469),"51.733,69 €",22-09-2017,04-09-2017,30 dias,"Portugal, Lisboa, Lisboa","Artigo 27.º, n.º 1, alínea a) do Código dos Contratos Públicos",,,,,,Não aplicável.,Não aplicável.,FALSE
"Aquisição de serviços de alimentação no CHLO, EPE",Concurso público,Aquisição de serviços,"55320000-9, Serviços de provimento de refeições","Centro Hospitalar de Lisboa Ocidental, EPE (CHLO) (507618319)","Itau - Instituto Técnico de Alimentação Humana, SA (500142858)","665.944,24 €",22-09-2017,21-09-2017,122 dias,"Portugal, Lisboa, Lisboa<BR/>Portugal, Lisboa, Oeiras","Artigo 20.º, n.º 1, alínea b) do Código dos Contratos Públicos",,,,,,Não aplicável.,Não aplicável.,FALSE
