Objeto do Contrato,Tipo de Procedimento,Tipo(s) de Contrato,CPVs,Entidade(s) Adjudicante(s),Entidade(s) Adjudicatária(s),Preço Contratual,Data de Publicação,Data de Celebração do Contrato,Prazo de Execução,Local de Execução,Fundamentação,Data de Fecho do Contrato,Preço Total Efetivo,Causas das Alterações ao Prazo,Causas das Alterações ao Preço,Estado,N.º registo do Acordo Quadro,Descrição do Acordo Quadro,Procedimento Centralizado
MATERIAL TRATAMENTO,Ajuste Direto Regime Geral,Aquisição de bens móveis,"33000000-0, Equipamento médico, medicamentos e produtos para cuidados pessoais","Centro Hospitalar e Universitário de Coimbra, E. P. E. (510103448)","CAREFUSION PORTUGAL 332 - PRODUTOS MEDICOS, LDA (503898554)","9.024,00 €",11-11-2016,09-11-2016,60 dias,"Portugal, Coimbra, Coimbra","Artigo 24.º, n.º 1, alínea e) do Código dos Contratos Públicos",30-12-2016,"8.990,00 €",,AQUISIÇAO PARCIAL,,Não aplicável.,Não aplicável.,FALSE
SISTEMA ENCERRAMENTO ARTERIAL,Ajuste Direto Regime Geral,Aquisição de bens móveis,"33000000-0, Equipamento médico, medicamentos e produtos para cuidados pessoais","Centro Hospitalar e Universitário de Coimbra, E. P. E. (510103448)","CARDINAL HEALTH PORTUGAL 513 UNIPESSOAL, LDA (513620834)","9.800,00 €",11-11-2016,11-11-2016,60 dias,"Portugal, Coimbra, Coimbra","Artigo 24.º, n.º 1, alínea e) do Código dos Contratos Públicos",30-12-2016,"1.400,00 €",,Aquisiçao parcial,,Não aplicável.,Não aplicável.,FALSE
Regularização manutençao equi. climatização-HG/MBB-Jun-Set,Ajuste Direto Regime Geral,Aquisição de serviços,"50000000-5, Serviços de reparação e manutenção","Centro Hospitalar e Universitário de Coimbra, E. P. E. (510103448)",Cisec (500205698),"32.827,32 €",11-11-2016,02-11-2016,90 dias,"Portugal, Coimbra, Coimbra","Artigo 20.º, n.º 1, alínea a) do Código dos Contratos Públicos","","",,"",,Não aplicável.,Não aplicável.,FALSE
Manutenção de Extintores de Incêndio do H.S.Cid,Ajuste Direto Regime Geral,Aquisição de serviços,"50000000-5, Serviços de reparação e manutenção","Centro Hospitalar e Universitário de Coimbra, E. P. E. (510103448)",Extintel (501391460),"305,30 €",11-11-2016,10-11-2016,366 dias,"Portugal, Coimbra, Coimbra","Artigo 20.º, n.º 1, alínea a) do Código dos Contratos Públicos","","",,"",,Não aplicável.,Não aplicável.,FALSE
040228142016,Ajuste Direto Regime Geral,Aquisição de bens móveis,"33000000-0, Equipamento médico, medicamentos e produtos para cuidados pessoais","Centro Hospitalar e Universitário de Coimbra, E. P. E. (510103448)","B BRAUN MEDICAL, LDA (501506543)","8.970,00 €",10-11-2016,04-11-2016,20 dias,"Portugal, Coimbra, Coimbra","Artigo 24.º, n.º 1, alínea e) do Código dos Contratos Públicos","","",,"",,Não aplicável.,Não aplicável.,FALSE
040229722016,Ajuste Direto Regime Geral,Aquisição de bens móveis,"33000000-0, Equipamento médico, medicamentos e produtos para cuidados pessoais","Centro Hospitalar e Universitário de Coimbra, E. P. E. (510103448)",BRAINLAB SALES (198159823),"7.776,00 €",10-11-2016,04-11-2016,20 dias,"Portugal, Coimbra, Coimbra","Artigo 24.º, n.º 1, alínea e) do Código dos Contratos Públicos","","",,"",,Não aplicável.,Não aplicável.,FALSE
Kit de endoprótese Aorto-uni ou bi-ilíaca,Ajuste Direto Regime Geral,Aquisição de bens móveis,"33000000-0, Equipamento médico, medicamentos e produtos para cuidados pessoais","Centro Hospitalar e Universitário de Coimbra, E. P. E. (510103448)","BIOSONDA - COMERCIO MAT. HOSPITALAR, LDA (501463313)","8.500,00 €",09-11-2016,03-11-2016,5 dias,"Portugal, Coimbra, Coimbra","Artigo 24.º, n.º 1, alínea e) do Código dos Contratos Públicos","","",,"",,Não aplicável.,Não aplicável.,FALSE
Kit´s de endoprótese aorto torácica e bi-ilíaca,Ajuste Direto Regime Geral,Aquisição de bens móveis,"33000000-0, Equipamento médico, medicamentos e produtos para cuidados pessoais","Centro Hospitalar e Universitário de Coimbra, E. P. E. (510103448)","BIOSONDA - COMERCIO MAT. HOSPITALAR, LDA (501463313)","23.000,00 €",09-11-2016,03-11-2016,5 dias,"Portugal, Coimbra, Coimbra","Artigo 24.º, n.º 1, alínea e) do Código dos Contratos Públicos","","",,"",,Não aplicável.,Não aplicável.,FALSE
Kit de endoprótese aorto-uni ou bi-ilíaca,Ajuste Direto Regime Geral,Aquisição de bens móveis,"33000000-0, Equipamento médico, medicamentos e produtos para cuidados pessoais","Centro Hospitalar e Universitário de Coimbra, E. P. E. (510103448)","MEDTRONIC PORTUGAL, LDA (504223933)","27.000,00 €",09-11-2016,24-10-2016,5 dias,"Portugal, Coimbra, Coimbra","Artigo 24.º, n.º 1, alínea e) do Código dos Contratos Públicos","","",,"",,Não aplicável.,Não aplicável.,FALSE
040229652016,Ajuste Direto Regime Geral,Aquisição de bens móveis,"33000000-0, Equipamento médico, medicamentos e produtos para cuidados pessoais","Centro Hospitalar e Universitário de Coimbra, E. P. E. (510103448)","MEDTRONIC PORTUGAL, LDA (504223933)","7.140,00 €",09-11-2016,08-11-2016,20 dias,"Portugal, Coimbra, Coimbra","Artigo 24.º, n.º 1, alínea e) do Código dos Contratos Públicos","","",,"",,Não aplicável.,Não aplicável.,FALSE
CATETER DIAGNOSTICO MULTIPOLAR_BOSTON,Ajuste Direto Regime Geral,Aquisição de bens móveis,"33000000-0, Equipamento médico, medicamentos e produtos para cuidados pessoais","Centro Hospitalar e Universitário de Coimbra, E. P. E. (510103448)","BOSTON SCIENTIFIC PORTUGAL, LDA (504988964)","7.000,00 €",09-11-2016,26-10-2016,120 dias,"Portugal, Coimbra, Coimbra","Artigo 24.º, n.º 1, alínea e) do Código dos Contratos Públicos",30-12-2016,"7.000,00 €",,"",,Não aplicável.,Não aplicável.,FALSE
040227722016 - COLUNA,Ajuste Direto Regime Geral,Aquisição de bens móveis,"33000000-0, Equipamento médico, medicamentos e produtos para cuidados pessoais","Centro Hospitalar e Universitário de Coimbra, E.P. (510103448)",MEDTRONIC (504223933),"5.200,00 €",09-11-2016,08-11-2016,15 dias,"Portugal, Coimbra, Coimbra","Artigo 24.º, n.º 1, alínea e) do Código dos Contratos Públicos","","",,"",,Não aplicável.,Não aplicável.,FALSE
040229592016 - OSTEOSSINTESE,Ajuste Direto Regime Geral,Aquisição de bens móveis,"33000000-0, Equipamento médico, medicamentos e produtos para cuidados pessoais","Centro Hospitalar e Universitário de Coimbra, E.P. (510103448)",JOHNSON (500153370),"13.016,03 €",09-11-2016,09-11-2016,10 dias,"Portugal, Coimbra, Coimbra","Artigo 24.º, n.º 1, alínea e) do Código dos Contratos Públicos","","",,"",,Não aplicável.,Não aplicável.,FALSE
040229812016 - OUTRO MATERIAL DE CONSUMO,Ajuste Direto Regime Geral,Aquisição de bens móveis,"33000000-0, Equipamento médico, medicamentos e produtos para cuidados pessoais","Centro Hospitalar e Universitário de Coimbra, E.P. (510103448)",EPJ (506820513),"9.857,20 €",09-11-2016,09-11-2016,10 dias,"Portugal, Coimbra, Coimbra","Artigo 24.º, n.º 1, alínea e) do Código dos Contratos Públicos","","",,"",,Não aplicável.,Não aplicável.,FALSE
040228852016 - outro material de consumo,Ajuste Direto Regime Geral,Aquisição de bens móveis,"33000000-0, Equipamento médico, medicamentos e produtos para cuidados pessoais","Centro Hospitalar e Universitário de Coimbra, E. P. E. (510103448)",JOHNSON (500153370),"9.000,00 €",09-11-2016,09-11-2016,20 dias,"Portugal, Coimbra, Coimbra","Artigo 24.º, n.º 1, alínea e) do Código dos Contratos Públicos","","",,"",,Não aplicável.,Não aplicável.,FALSE
Trastuzumab emtansina pó conc sol inj fr IV,Ajuste Direto Regime Geral,Aquisição de bens móveis,"33698000-9, Produtos para fins clínicos","Centro Hospitalar e Universitário de Coimbra, E. P. E. (510103448)","ROCHE FARMACEUTICA QUIMICA, LDA (500233810)","65.851,35 €",07-11-2016,01-04-2015,365 dias,"Portugal, Coimbra, Coimbra","Artigo 24.º, n.º 1, alínea e) do Código dos Contratos Públicos",31-12-2015,"65.851,35 €",,"",,Não aplicável.,Não aplicável.,FALSE
Daclatasvir 60 mg comp,Ajuste Direto Regime Geral,Aquisição de bens móveis,"33698000-9, Produtos para fins clínicos","Centro Hospitalar e Universitário de Coimbra, E. P. E. (510103448)","BRISTOL MYERS SQUIBB FARM.PORTUGUESA, SA (500048193)","62.078,12 €",07-11-2016,17-03-2015,365 dias,"Portugal, Coimbra, Coimbra","Artigo 24.º, n.º 1, alínea e) do Código dos Contratos Públicos",31-12-2015,"62.078,12 €",,"",,Não aplicável.,Não aplicável.,FALSE
Daclatasvir 60 mg comp,Ajuste Direto Regime Geral,Aquisição de bens móveis,"33698000-9, Produtos para fins clínicos","Centro Hospitalar e Universitário de Coimbra, E. P. E. (510103448)","BRISTOL MYERS SQUIBB FARM.PORTUGUESA, SA (500048193)","62.078,12 €",07-11-2016,23-03-2015,365 dias,"Portugal, Coimbra, Coimbra","Artigo 24.º, n.º 1, alínea e) do Código dos Contratos Públicos",31-12-2015,"62.078,12 €",,"",,Não aplicável.,Não aplicável.,FALSE
0401125020115 - Sofosbuvir  400mg,Ajuste Direto Regime Geral,Aquisição de bens móveis,"33698000-9, Produtos para fins clínicos","Centro Hospitalar e Universitário de Coimbra, E. P. E. (510103448)","GILEAD SCIENCES, LDA (503604704)","41.164,83 €",07-11-2016,18-06-2015,360 dias,"Portugal, Coimbra, Coimbra","Artigo 24.º, n.º 1, alínea e) do Código dos Contratos Públicos",31-12-2015,"41.164,83 €",,"",,Não aplicável.,Não aplicável.,FALSE
0401124920115 - Ledipasvir 90mg+Sofosbuvir  400mg,Ajuste Direto Regime Geral,Aquisição de bens móveis,"33698000-9, Produtos para fins clínicos","Centro Hospitalar e Universitário de Coimbra, E. P. E. (510103448)","GILEAD SCIENCES, LDA (503604704)","92.367,66 €",07-11-2016,20-06-2015,360 dias,"Portugal, Coimbra, Coimbra","Artigo 24.º, n.º 1, alínea e) do Código dos Contratos Públicos",31-12-2015,"92.367,66 €",,"",,Não aplicável.,Não aplicável.,FALSE
Daclatasvir 60 mg comp,Ajuste Direto Regime Geral,Aquisição de bens móveis,"33698000-9, Produtos para fins clínicos","Centro Hospitalar e Universitário de Coimbra, E. P. E. (510103448)","BRISTOL MYERS SQUIBB FARM.PORTUGUESA, SA (500048193)","62.078,12 €",07-11-2016,17-03-2015,365 dias,"Portugal, Coimbra, Coimbra","Artigo 24.º, n.º 1, alínea e) do Código dos Contratos Públicos",31-12-2015,"62.078,12 €",,"",,Não aplicável.,Não aplicável.,FALSE
Daclatasvir 60 mg comp,Ajuste Direto Regime Geral,Aquisição de bens móveis,"33698000-9, Produtos para fins clínicos","Centro Hospitalar e Universitário de Coimbra, E. P. E. (510103448)","BRISTOL MYERS SQUIBB FARM.PORTUGUESA, SA (500048193)","62.078,12 €",07-11-2016,17-03-2015,365 dias,"Portugal, Coimbra, Coimbra","Artigo 24.º, n.º 1, alínea e) do Código dos Contratos Públicos",31-12-2015,"62.078,12 €",,"",,Não aplicável.,Não aplicável.,FALSE
Simeprevir 150 mg cáps,Ajuste Direto Regime Geral,Aquisição de bens móveis,"33698000-9, Produtos para fins clínicos","Centro Hospitalar e Universitário de Coimbra, E. P. E. (510103448)","JANSSEN CILAG FARMACEUTICA, LDA (500189412)","27.048,99 €",07-11-2016,16-03-2015,365 dias,"Portugal, Coimbra, Coimbra","Artigo 24.º, n.º 1, alínea e) do Código dos Contratos Públicos",31-12-2015,"27.048,99 €",,"",,Não aplicável.,Não aplicável.,FALSE
Pomalidomida 3 mg cáps,Ajuste Direto Regime Geral,Aquisição de bens móveis,"33698000-9, Produtos para fins clínicos","Centro Hospitalar e Universitário de Coimbra, E. P. E. (510103448)",CELGENE LOGISTICS SÁRI (GB894489453),"9.562,00 €",07-11-2016,19-03-2015,365 dias,"Portugal, Coimbra, Coimbra","Artigo 24.º, n.º 1, alínea e) do Código dos Contratos Públicos",31-12-2015,"9.562,00 €",,"",,Não aplicável.,Não aplicável.,FALSE
Hipromelose 20 mg/g fr 10 g,Ajuste Direto Regime Geral,Aquisição de bens móveis,"33698000-9, Produtos para fins clínicos","Centro Hospitalar e Universitário de Coimbra, E. P. E. (510103448)",DAVI II - FARMACÊUTICA S.A (508309450),"5.820,00 €",07-11-2016,16-04-2015,365 dias,"Portugal, Coimbra, Coimbra","Artigo 24.º, n.º 1, alínea e) do Código dos Contratos Públicos",31-12-2015,"5.820,00 €",,"",,Não aplicável.,Não aplicável.,FALSE
Trabectedina 1 mg pó conc sol inj fr IV,Ajuste Direto Regime Geral,Aquisição de bens móveis,"33698000-9, Produtos para fins clínicos","Centro Hospitalar e Universitário de Coimbra, E. P. E. (510103448)",LOGIFARMA-LOGÍSTICA FARMACÊUTICA S.A. (503934640),"179.460,00 €",07-11-2016,02-04-2015,365 dias,"Portugal, Coimbra, Coimbra","Artigo 24.º, n.º 1, alínea e) do Código dos Contratos Públicos",31-12-2015,"179.460,00 €",,"",,Não aplicável.,Não aplicável.,FALSE
Aquisição de Material de Consumo Clinico,Ajuste Direto Regime Geral,Aquisição de bens móveis,"33000000-0, Equipamento médico, medicamentos e produtos para cuidados pessoais","Centro Hospitalar e Universitário de Coimbra, E. P. E. (510103448)","JOHNSON & JOHNSON, LDA (500153370)","5.397,24 €",07-11-2016,19-10-2016,20 dias,"Portugal, Coimbra, Coimbra","Artigo 24.º, n.º 1, alínea e) do Código dos Contratos Públicos","","",,"",,Não aplicável.,Não aplicável.,FALSE
040112482015 - Ledipasvir 90mg+Sofosbuvir 400mg,Ajuste Direto Regime Geral,Aquisição de bens móveis,"33698000-9, Produtos para fins clínicos","Centro Hospitalar e Universitário de Coimbra, E. P. E. (510103448)","GILEAD SCIENCES, LDA (503604704)","46.183,83 €",07-11-2016,18-06-2015,360 dias,"Portugal, Coimbra, Coimbra","Artigo 24.º, n.º 1, alínea e) do Código dos Contratos Públicos",31-12-2015,"46.183,83 €",,"",,Não aplicável.,Não aplicável.,FALSE
040112472015 - Ledipasvir 90mg+Sofosbuvir 400mg,Ajuste Direto Regime Geral,Aquisição de bens móveis,"33698000-9, Produtos para fins clínicos","Centro Hospitalar e Universitário de Coimbra, E. P. E. (510103448)","GILEAD SCIENCES, LDA (503604704)","46.183,83 €",07-11-2016,18-06-2015,360 dias,"Portugal, Coimbra, Coimbra","Artigo 24.º, n.º 1, alínea e) do Código dos Contratos Públicos",18-06-2015,"46.183,83 €",,"",,Não aplicável.,Não aplicável.,FALSE
040112452015 - Ledipasvir 90mg+Sofosbuvir 400mg,Ajuste Direto Regime Geral,Aquisição de bens móveis,"33698000-9, Produtos para fins clínicos","Centro Hospitalar e Universitário de Coimbra, E. P. E. (510103448)","GILEAD SCIENCES, LDA (503604704)","92.367,66 €",07-11-2016,20-06-2015,360 dias,"Portugal, Coimbra, Coimbra","Artigo 24.º, n.º 1, alínea e) do Código dos Contratos Públicos",31-12-2015,"92.367,66 €",,"",,Não aplicável.,Não aplicável.,FALSE
040112452015 - Ledipasvir 90mg+Sofosbuvir 400mg,Ajuste Direto Regime Geral,Aquisição de bens móveis,"33698000-9, Produtos para fins clínicos","Centro Hospitalar e Universitário de Coimbra, E. P. E. (510103448)","GILEAD SCIENCES, LDA (503604704)","92.367,66 €",07-11-2016,20-06-2015,360 dias,"Portugal, Coimbra, Coimbra","Artigo 24.º, n.º 1, alínea e) do Código dos Contratos Públicos",31-12-2015,"92.367,66 €",,"",,Não aplicável.,Não aplicável.,FALSE
040112442015 - Sofosbuvir 400mg,Ajuste Direto Regime Geral,Aquisição de bens móveis,"33698000-9, Produtos para fins clínicos","Centro Hospitalar e Universitário de Coimbra, E. P. E. (510103448)","GILEAD SCIENCES, LDA (503604704)","82.329,66 €",07-11-2016,20-06-2015,360 dias,"Portugal, Coimbra, Coimbra","Artigo 24.º, n.º 1, alínea e) do Código dos Contratos Públicos",31-12-2015,"82.329,66 €",,"",,Não aplicável.,Não aplicável.,FALSE
040112432015 - Ledipasvir 90mg+Sofosbuvir 400mg,Ajuste Direto Regime Geral,Aquisição de bens móveis,"33698000-9, Produtos para fins clínicos","Centro Hospitalar e Universitário de Coimbra, E. P. E. (510103448)","GILEAD SCIENCES, LDA (503604704)","46.183,83 €",07-11-2016,18-06-2015,360 dias,"Portugal, Coimbra, Coimbra","Artigo 24.º, n.º 1, alínea e) do Código dos Contratos Públicos",31-12-2015,"46.183,83 €",,"",,Não aplicável.,Não aplicável.,FALSE
Pelicula pol n/adesiva multicamada 38x61 cm apósito,Ajuste Direto Regime Geral,Aquisição de bens móveis,"33698000-9, Produtos para fins clínicos","Centro Hospitalar e Universitário de Coimbra, E. P. E. (510103448)","JMV PRODUTOS HOSPITALARES, LDA (501887148)","2.340,00 €",07-11-2016,16-04-2015,365 dias,"Portugal, Coimbra, Coimbra","Artigo 24.º, n.º 1, alínea e) do Código dos Contratos Públicos",31-12-2015,"2.340,00 €",,"",,Não aplicável.,Não aplicável.,FALSE
Radiofarmacos para cardiologia,Ajuste Direto Regime Geral,Aquisição de bens móveis,"33698000-9, Produtos para fins clínicos","Centro Hospitalar e Universitário de Coimbra, E. P. E. (510103448)","SATIS RADIOSOTOPOS P.C.SOBRELECTRICAS, LDA (500098140), ISODER ISOTOPOS E DERIVADOS, SA (502241594)","60.403,40 €",07-11-2016,06-05-2015,365 dias,"Portugal, Coimbra, Coimbra","Artigo 20.º, n.º 1, alínea a) do Código dos Contratos Públicos",31-12-2015,"60.403,40 €",,"",,Não aplicável.,Não aplicável.,FALSE
Unidade de Eletrocirurgia para a Obstetrícia - Bloco Operatório Periférico,Ajuste Direto Regime Geral,Aquisição de bens móveis,"33000000-0, Equipamento médico, medicamentos e produtos para cuidados pessoais","Centro Hospitalar e Universitário de Coimbra, E. P. E. (510103448)","Bacelar & Irmão, Lda (500532818)","6.466,53 €",07-11-2016,07-11-2016,30 dias,"Portugal, Coimbra, Coimbra","Artigo 20.º, n.º 1, alínea a) do Código dos Contratos Públicos","","",,"",,Não aplicável.,Não aplicável.,FALSE
"Sildenafil 0,8 mg/ml sol inj fr 20 ml IV",Ajuste Direto Regime Geral,Aquisição de bens móveis,"33698000-9, Produtos para fins clínicos","Centro Hospitalar e Universitário de Coimbra, E. P. E. (510103448)","LABORATORIOS PFIZER, LDA (500162166)","3.412,08 €",07-11-2016,27-03-2015,365 dias,"Portugal, Coimbra, Coimbra","Artigo 24.º, n.º 1, alínea e) do Código dos Contratos Públicos",31-12-2015,"3.412,08 €",,"",,Não aplicável.,Não aplicável.,FALSE
Gluconato de zinco 10 mg/10 ml sol inj,Ajuste Direto Regime Geral,Aquisição de bens móveis,"33698000-9, Produtos para fins clínicos","Centro Hospitalar e Universitário de Coimbra, E. P. E. (510103448)","OVERPHARMA-PRODUTOS MÉDICOS E FARMACÉUTICOS,LDA (505792362)","746,50 €",07-11-2016,04-05-2015,365 dias,"Portugal, Coimbra, Coimbra","Artigo 24.º, n.º 1, alínea e) do Código dos Contratos Públicos",07-12-2015,"746,50 €",,"",,Não aplicável.,Não aplicável.,FALSE
Pomalidomida 2 mg cáps,Ajuste Direto Regime Geral,Aquisição de bens móveis,"33698000-9, Produtos para fins clínicos","Centro Hospitalar e Universitário de Coimbra, E. P. E. (510103448)",CELGENE LOGISTICS SÁRI (GB894489453),"9.562,00 €",07-11-2016,19-03-2015,365 dias,"Portugal, Coimbra, Coimbra","Artigo 24.º, n.º 1, alínea e) do Código dos Contratos Públicos",31-12-2015,"9.562,00 €",,"",,Não aplicável.,Não aplicável.,FALSE
Etoposido 50 mg cáps,Ajuste Direto Regime Geral,Aquisição de bens móveis,"33698000-9, Produtos para fins clínicos","Centro Hospitalar e Universitário de Coimbra, E.P. (510103448)",WEP CLINICAL (WE PHARMA) (GB944893866),"11.700,00 €",04-11-2016,30-03-2015,365 dias,"Portugal, Coimbra, Coimbra","Artigo 24.º, n.º 1, alínea e) do Código dos Contratos Públicos",31-12-2015,"11.700,00 €",,"",,Não aplicável.,Não aplicável.,FALSE
Etossuximida 50 mg/ml xar,Ajuste Direto Regime Geral,Aquisição de bens móveis,"33698000-9, Produtos para fins clínicos","Centro Hospitalar e Universitário de Coimbra, E.P. (510103448)","LABORATORIOS PFIZER, LDA (500162166)","1.066,00 €",04-11-2016,18-03-2015,365 dias,"Portugal, Coimbra, Coimbra","Artigo 24.º, n.º 1, alínea e) do Código dos Contratos Públicos",31-12-2015,"1.066,00 €",,"",,Não aplicável.,Não aplicável.,FALSE
Eculizumab 300 mg sol inj fr 30 ml IV,Ajuste Direto Regime Geral,Aquisição de bens móveis,"33698000-9, Produtos para fins clínicos","Centro Hospitalar e Universitário de Coimbra, E.P. (510103448)",ALEXION PHARMA INTERNATIONAL TRADING (DE815460271),"157.226,40 €",04-11-2016,18-04-2015,365 dias,"Portugal, Coimbra, Coimbra","Artigo 24.º, n.º 1, alínea e) do Código dos Contratos Públicos",31-12-2015,"157.226,40 €",,"",,Não aplicável.,Não aplicável.,FALSE
Dantroleno 20 mg pó sol inj fr IV,Ajuste Direto Regime Geral,Aquisição de bens móveis,"33698000-9, Produtos para fins clínicos","Centro Hospitalar e Universitário de Coimbra, E.P. (510103448)",WEP CLINICAL (WE PHARMA) (GB944893866),"30.599,99 €",04-11-2016,30-03-2015,365 dias,"Portugal, Coimbra, Coimbra","Artigo 24.º, n.º 1, alínea e) do Código dos Contratos Públicos",31-12-2015,"30.599,99 €",,"",,Não aplicável.,Não aplicável.,FALSE
Radiofarmacos não tecneciados,Ajuste Direto Regime Geral,Aquisição de bens móveis,"33698000-9, Produtos para fins clínicos","Centro Hospitalar e Universitário de Coimbra, E.P. (510103448)","ISODER ISOTOPOS E DERIVADOS, SA (502241594)","16.170,00 €",04-11-2016,28-04-2015,365 dias,"Portugal, Coimbra, Coimbra","Artigo 20.º, n.º 1, alínea a) do Código dos Contratos Públicos",31-12-2015,"16.170,00 €",,"",,Não aplicável.,Não aplicável.,FALSE
Radiofarmacos para terapeutica,Ajuste Direto Regime Geral,Aquisição de bens móveis,"33698000-9, Produtos para fins clínicos","Centro Hospitalar e Universitário de Coimbra, E.P. (510103448)","ISODER ISOTOPOS E DERIVADOS, SA (502241594)","37.371,00 €",04-11-2016,05-05-2015,365 dias,"Portugal, Coimbra, Coimbra","Artigo 20.º, n.º 1, alínea a) do Código dos Contratos Públicos",31-12-2015,"37.371,00 €",,"",,Não aplicável.,Não aplicável.,FALSE
Pegaspargase 3750 U.I. sol inj,Ajuste Direto Regime Geral,Aquisição de bens móveis,"33698000-9, Produtos para fins clínicos","Centro Hospitalar e Universitário de Coimbra, E.P. (510103448)",ALLOGA PORTUGAL - ARMAZ. E DISTRIB. FARMAC. (504507230),"195.000,00 €",04-11-2016,07-04-2015,365 dias,"Portugal, Coimbra, Coimbra","Artigo 24.º, n.º 1, alínea e) do Código dos Contratos Públicos",31-12-2015,"195.000,00 €",,"",,Não aplicável.,Não aplicável.,FALSE
"Corticotropina 0,25 mg/1 ml sol inj fr 1 ml IV",Ajuste Direto Regime Geral,Aquisição de bens móveis,"33698000-9, Produtos para fins clínicos","Centro Hospitalar e Universitário de Coimbra, E.P. (510103448)",WEP CLINICAL (WE PHARMA) (GB944893866),"20.880,00 €",04-11-2016,09-03-2015,365 dias,"Portugal, Coimbra, Coimbra","Artigo 24.º, n.º 1, alínea e) do Código dos Contratos Públicos",31-12-2015,"20.880,00 €",,"",,Não aplicável.,Não aplicável.,FALSE
Doxiciclina 100 mg/5 ml sol inj,Ajuste Direto Regime Geral,Aquisição de bens móveis,"33698000-9, Produtos para fins clínicos","Centro Hospitalar e Universitário de Coimbra, E.P. (510103448)","LABORATORIOS PFIZER, LDA (500162166)","650,00 €",04-11-2016,18-03-2015,365 dias,"Portugal, Coimbra, Coimbra","Artigo 24.º, n.º 1, alínea e) do Código dos Contratos Públicos",31-12-2015,"650,00 €",,"",,Não aplicável.,Não aplicável.,FALSE
Estreptozocina 1000 mg pó sol inj,Ajuste Direto Regime Geral,Aquisição de bens móveis,"33698000-9, Produtos para fins clínicos","Centro Hospitalar e Universitário de Coimbra, E.P. (510103448)","ETIOPHARMA, SA (509393357)","73.200,00 €",04-11-2016,16-04-2015,365 dias,"Portugal, Coimbra, Coimbra","Artigo 24.º, n.º 1, alínea e) do Código dos Contratos Públicos",31-12-2015,"73.200,00 €",,"",,Não aplicável.,Não aplicável.,FALSE
Etoposido 100 mg cáps,Ajuste Direto Regime Geral,Aquisição de bens móveis,"33698000-9, Produtos para fins clínicos","Centro Hospitalar e Universitário de Coimbra, E.P. (510103448)",WEP CLINICAL (WE PHARMA) (GB944893866),"6.450,00 €",04-11-2016,30-03-2015,365 dias,"Portugal, Coimbra, Coimbra","Artigo 24.º, n.º 1, alínea e) do Código dos Contratos Públicos",31-12-2015,"6.450,00 €",,"",,Não aplicável.,Não aplicável.,FALSE
Bosutinib 500 mg comp,Ajuste Direto Regime Geral,Aquisição de bens móveis,"33698000-9, Produtos para fins clínicos","Centro Hospitalar e Universitário de Coimbra, E. P. E. (510103448)","LABORATORIOS PFIZER, LDA (500162166)","37.534,11 €",04-11-2016,26-03-2015,365 dias,"Portugal, Coimbra, Coimbra","Artigo 24.º, n.º 1, alínea e) do Código dos Contratos Públicos",31-12-2015,"37.534,11 €",,"",,Não aplicável.,Não aplicável.,FALSE
"Fludrocortisona 0,1 mg comp",Ajuste Direto Regime Geral,Aquisição de bens móveis,"33698000-9, Produtos para fins clínicos","Centro Hospitalar e Universitário de Coimbra, E.P. (510103448)","ETIOPHARMA, SA (509393357)","2.250,00 €",04-11-2016,11-03-2015,365 dias,"Portugal, Coimbra, Coimbra","Artigo 24.º, n.º 1, alínea e) do Código dos Contratos Públicos",31-12-2015,"2.250,00 €",,"",,Não aplicável.,Não aplicável.,FALSE
Labetalol 100 mg/20 ml sol inj,Ajuste Direto Regime Geral,Aquisição de bens móveis,"33698000-9, Produtos para fins clínicos","Centro Hospitalar e Universitário de Coimbra, E.P. (510103448)","ETIOPHARMA, SA (509393357)","17.940,00 €",04-11-2016,15-04-2015,365 dias,"Portugal, Coimbra, Coimbra","Artigo 24.º, n.º 1, alínea e) do Código dos Contratos Públicos",31-12-2015,"17.940,00 €",,"",,Não aplicável.,Não aplicável.,FALSE
Neomicina 400 mg comp,Ajuste Direto Regime Geral,Aquisição de bens móveis,"33698000-9, Produtos para fins clínicos","Centro Hospitalar e Universitário de Coimbra, E.P. (510103448)","ETIOPHARMA, SA (509393357)","1.620,00 €",04-11-2016,11-03-2015,365 dias,"Portugal, Coimbra, Coimbra","Artigo 24.º, n.º 1, alínea e) do Código dos Contratos Públicos",31-12-2015,"1.620,00 €",,"",,Não aplicável.,Não aplicável.,FALSE
Nitrato de prata 50 mg lápis cut,Ajuste Direto Regime Geral,Aquisição de bens móveis,"33698000-9, Produtos para fins clínicos","Centro Hospitalar e Universitário de Coimbra, E.P. (510103448)","B BRAUN MEDICAL, LDA (501506543)","1.488,00 €",04-11-2016,03-03-2015,365 dias,"Portugal, Coimbra, Coimbra","Artigo 24.º, n.º 1, alínea e) do Código dos Contratos Públicos",31-12-2015,"1.488,00 €",,"",,Não aplicável.,Não aplicável.,FALSE
"Oxibuprocaína 2 mg/0,5 ml col. sol",Ajuste Direto Regime Geral,Aquisição de bens móveis,"33698000-9, Produtos para fins clínicos","Centro Hospitalar e Universitário de Coimbra, E. P. E. (510103448)","BAUSCH & LOMB, SA (980218764)","650,00 €",04-11-2016,11-03-2015,365 dias,"Portugal, Coimbra, Coimbra","Artigo 24.º, n.º 1, alínea e) do Código dos Contratos Públicos",31-12-2015,"650,00 €",,"",,Não aplicável.,Não aplicável.,FALSE
Mercaptopurina 50 mg comp,Ajuste Direto Regime Geral,Aquisição de bens móveis,"33698000-9, Produtos para fins clínicos","Centro Hospitalar e Universitário de Coimbra, E.P. (510103448)","DUXPHARMA UNIPESSOAL, LDA (510803679)","8.250,00 €",04-11-2016,03-03-2015,365 dias,"Portugal, Coimbra, Coimbra","Artigo 24.º, n.º 1, alínea e) do Código dos Contratos Públicos",31-12-2015,"8.250,00 €",,"",,Não aplicável.,Não aplicável.,FALSE
Metirapona 250 mg cáps,Ajuste Direto Regime Geral,Aquisição de bens móveis,"33698000-9, Produtos para fins clínicos","Centro Hospitalar e Universitário de Coimbra, E.P. (510103448)",WEP CLINICAL (WE PHARMA) (GB944893866),"18.900,00 €",04-11-2016,30-03-2015,365 dias,"Portugal, Coimbra, Coimbra","Artigo 24.º, n.º 1, alínea e) do Código dos Contratos Públicos",31-12-2015,"18.900,00 €",,"",,Não aplicável.,Não aplicável.,FALSE
Gerador 99MO/99MTC ger radio col elui IV oftalmico,Ajuste Direto Regime Geral,Aquisição de bens móveis,"33698000-9, Produtos para fins clínicos","Centro Hospitalar e Universitário de Coimbra, E.P. (510103448)","SATIS RADIOSOTOPOS P.C.SOBRELECTRICAS, LDA (500098140)","51.520,00 €",04-11-2016,10-04-2015,365 dias,"Portugal, Coimbra, Coimbra","Artigo 24.º, n.º 1, alínea b) do Código dos Contratos Públicos",31-12-2015,"116.320,00 €",,"",,Não aplicável.,Não aplicável.,FALSE
Miltefosina 50 mg cáps,Ajuste Direto Regime Geral,Aquisição de bens móveis,"33698000-9, Produtos para fins clínicos","Centro Hospitalar e Universitário de Coimbra, E.P. (510103448)",WEP CLINICAL (WE PHARMA) (GB944893866),"69.930,00 €",04-11-2016,30-03-2015,365 dias,"Portugal, Coimbra, Coimbra","Artigo 24.º, n.º 1, alínea e) do Código dos Contratos Públicos",30-03-2015,"69.930,00 €",,"",,Não aplicável.,Não aplicável.,FALSE
Minoxidil 5 mg comp,Ajuste Direto Regime Geral,Aquisição de bens móveis,"33698000-9, Produtos para fins clínicos","Centro Hospitalar e Universitário de Coimbra, E.P. (510103448)","LABORATORIOS PFIZER, LDA (500162166)","210,52 €",04-11-2016,18-06-2015,365 dias,"Portugal, Coimbra, Coimbra","Artigo 24.º, n.º 1, alínea e) do Código dos Contratos Públicos",31-12-2015,"210,52 €",,"",,Não aplicável.,Não aplicável.,FALSE
Ibrutinib 140 mg cáps,Ajuste Direto Regime Geral,Aquisição de bens móveis,"33698000-9, Produtos para fins clínicos","Centro Hospitalar e Universitário de Coimbra, E.P. (510103448)","JANSSEN CILAG FARMACEUTICA, LDA (500189412)","66.834,90 €",04-11-2016,30-03-2015,365 dias,"Portugal, Coimbra, Coimbra","Artigo 24.º, n.º 1, alínea e) do Código dos Contratos Públicos",31-12-2015,"66.834,90 €",,"",,Não aplicável.,Não aplicável.,FALSE
L-Ornitina pó oral emb 100 G,Ajuste Direto Regime Geral,Aquisição de bens móveis,"33698000-9, Produtos para fins clínicos","Centro Hospitalar e Universitário de Coimbra, E.P. (510103448)",NUTRICIA ADVANCED MEDICAL NUTRICION UNIPE. LDA (507558286),"4.629,07 €",04-11-2016,28-10-2015,365 dias,"Portugal, Coimbra, Coimbra","Artigo 24.º, n.º 1, alínea e) do Código dos Contratos Públicos",31-12-2015,"4.629,07 €",,"",,Não aplicável.,Não aplicável.,FALSE
Imunoglobulina humana contra a varicela 25 U.I./ml sol inj fr 20 ml IV,Ajuste Direto Regime Geral,Aquisição de bens móveis,"33698000-9, Produtos para fins clínicos","Centro Hospitalar e Universitário de Coimbra, E. P. E. (510103448)",WEP CLINICAL (WE PHARMA) (GB944893866),"11.980,00 €",04-11-2016,30-03-2015,365 dias,"Portugal, Coimbra, Coimbra","Artigo 24.º, n.º 1, alínea e) do Código dos Contratos Públicos",31-12-2015,"11.980,00 €",,"",,Não aplicável.,Não aplicável.,FALSE
"Isoprenalina 0,2 mg/1 ml sol inj fr 1 ml Icardiaca IM IV SC",Ajuste Direto Regime Geral,Aquisição de bens móveis,"33698000-9, Produtos para fins clínicos","Centro Hospitalar e Universitário de Coimbra, E. P. E. (510103448)","IDIS THE WORLD MEDICINES, LMTD (700513982)","1.960,00 €",04-11-2016,07-04-2015,365 dias,"Portugal, Coimbra, Coimbra","Artigo 24.º, n.º 1, alínea e) do Código dos Contratos Públicos",31-12-2015,"1.960,00 €",,"",,Não aplicável.,Não aplicável.,FALSE
Levocartinina 1000 mg/5 ml sol inj fr 5 ml IM IV,Ajuste Direto Regime Geral,Aquisição de bens móveis,"33698000-9, Produtos para fins clínicos","Centro Hospitalar e Universitário de Coimbra, E. P. E. (510103448)",LUSO MEDICAMENTA - SOC. TÉCN. FARMACÊUTICA (507150473),"60,00 €",04-11-2016,03-03-2015,365 dias,"Portugal, Coimbra, Coimbra","Artigo 24.º, n.º 1, alínea e) do Código dos Contratos Públicos",31-12-2015,"60,00 €",,"",,Não aplicável.,Não aplicável.,FALSE
"Levotiroxina sódica 0,5 mg pó sol inj",Ajuste Direto Regime Geral,Aquisição de bens móveis,"33698000-9, Produtos para fins clínicos","Centro Hospitalar e Universitário de Coimbra, E. P. E. (510103448)","IDIS THE WORLD MEDICINES, LMTD (700513982)","11.536,00 €",04-11-2016,08-04-2015,365 dias,"Portugal, Coimbra, Coimbra","Artigo 24.º, n.º 1, alínea e) do Código dos Contratos Públicos",31-12-2015,"11.536,00 €",,"",,Não aplicável.,Não aplicável.,FALSE
SET P/ECMO C/OXIGENADOR,Ajuste Direto Regime Geral,Aquisição de bens móveis,"33000000-0, Equipamento médico, medicamentos e produtos para cuidados pessoais","Centro Hospitalar e Universitário de Coimbra, E.P. (510103448)","GETINGE GROUP PORTUGAL, UNIP LDA (MAQUET PORT) (506819698)","12.000,00 €",04-11-2016,25-10-2016,120 dias,"Portugal, Coimbra, Coimbra","Artigo 24.º, n.º 1, alínea e) do Código dos Contratos Públicos",30-12-2016,"12.000,00 €",,"",,Não aplicável.,Não aplicável.,FALSE
MATERIAL TRATAMENTO,Ajuste Direto Regime Geral,Aquisição de bens móveis,"33000000-0, Equipamento médico, medicamentos e produtos para cuidados pessoais","Centro Hospitalar e Universitário de Coimbra, E.P. (510103448)","PMH PRODUTOS MEDIC. HOSPITAL, SA (502376899)","8.617,05 €",04-11-2016,25-10-2016,120 dias,"Portugal, Coimbra, Coimbra","Artigo 24.º, n.º 1, alínea e) do Código dos Contratos Públicos",30-12-2016,"8.617,05 €",,"",,Não aplicável.,Não aplicável.,FALSE
PROLONGADORES E RAMPA,Ajuste Direto Regime Geral,Aquisição de bens móveis,"33000000-0, Equipamento médico, medicamentos e produtos para cuidados pessoais","Centro Hospitalar e Universitário de Coimbra, E.P. (510103448)","PMH PRODUTOS MEDIC. HOSPITAL, SA (502376899)","8.069,20 €",04-11-2016,25-10-2016,120 dias,"Portugal, Coimbra, Coimbra","Artigo 24.º, n.º 1, alínea e) do Código dos Contratos Públicos",30-12-2016,"31.846,00 €",,AQUISIÇÃO PARCIAL,,Não aplicável.,Não aplicável.,FALSE
MATERIAL TRATAMENTO,Ajuste Direto Regime Geral,Aquisição de bens móveis,"33000000-0, Equipamento médico, medicamentos e produtos para cuidados pessoais","Centro Hospitalar e Universitário de Coimbra, E.P. (510103448)","B BRAUN MEDICAL, LDA (501506543)","5.169,00 €",03-11-2016,25-10-2016,120 dias,"Portugal, Coimbra, Coimbra","Artigo 24.º, n.º 1, alínea e) do Código dos Contratos Públicos",30-12-2016,"4.679,00 €",,AQUISIÇAO PARCIAL,,Não aplicável.,Não aplicável.,FALSE
CATETER ECO INTRACOMUNITARIO,Ajuste Direto Regime Geral,Aquisição de bens móveis,"33000000-0, Equipamento médico, medicamentos e produtos para cuidados pessoais","Centro Hospitalar e Universitário de Coimbra, E.P. (510103448)",VOLCANO EUROPE (BE59842345),"9.900,00 €",03-11-2016,25-10-2016,120 dias,"Portugal, Coimbra, Coimbra","Artigo 24.º, n.º 1, alínea e) do Código dos Contratos Públicos",30-12-2016,"8.100,00 €",,AQUISIÇAO PARCIAL,,Não aplicável.,Não aplicável.,FALSE
SISTEMA MECANICO,Ajuste Direto Regime Geral,Aquisição de bens móveis,"33000000-0, Equipamento médico, medicamentos e produtos para cuidados pessoais","Centro Hospitalar e Universitário de Coimbra, E.P. (510103448)","ABBOTT LABORATORIOS, LDA (500006148)","6.750,00 €",03-11-2016,25-10-2016,120 dias,"Portugal, Coimbra, Coimbra","Artigo 24.º, n.º 1, alínea e) do Código dos Contratos Públicos",30-12-2016,"6.885,00 €",,AQUISIÇAO PARCIAL,,Não aplicável.,Não aplicável.,FALSE
MATERIAL VAC,Ajuste Direto Regime Geral,Aquisição de bens móveis,"33000000-0, Equipamento médico, medicamentos e produtos para cuidados pessoais","Centro Hospitalar e Universitário de Coimbra, E. P. E. (510103448)","EXPOMEDICA SOC. EXPORTAÇAO IMPORT.MAT. MEDIC., LDA (501886621)","5.015,00 €",03-11-2016,21-09-2016,365 dias,"Portugal, Coimbra, Coimbra","Artigo 24.º, n.º 1, alínea e) do Código dos Contratos Públicos",30-12-2016,"5.015,00 €",,"",,Não aplicável.,Não aplicável.,FALSE
Oxigenador de membrana para adultos com Sets,Ajuste Direto Regime Geral,Aquisição de bens móveis,"33186100-8, Oxigenador","Centro Hospitalar e Universitário de Coimbra, E. P. E. (510103448)","LUSOPALEX, LDA (503531588)","43.400,00 €",02-11-2016,20-07-2016,360 dias,"Portugal, Coimbra, Coimbra","Artigo 24.º, n.º 1, alínea e) do Código dos Contratos Públicos","","",,"",,Não aplicável.,Não aplicável.,FALSE
Kit neuroestimulação medular recarregável c/ eletrodo  p/ implante cervical,Ajuste Direto Regime Geral,Aquisição de bens móveis,"33184100-4, Implantes cirúrgicos","Centro Hospitalar e Universitário de Coimbra, E. P. E. (510103448)","MEDTRONIC PORTUGAL, LDA (504223933)","15.750,00 €",02-11-2016,30-09-2016,20 dias,"Portugal, Coimbra, Coimbra","Artigo 20.º, n.º 1, alínea a) do Código dos Contratos Públicos","","",,"",,Não aplicável.,Não aplicável.,FALSE
Gerador não recarregável duplo canal p/ implante DBS; Gerador recarregável duplo canal p/implante DBS,Ajuste Direto Regime Geral,Aquisição de bens móveis,"33184100-4, Implantes cirúrgicos","Centro Hospitalar e Universitário de Coimbra, E. P. E. (510103448)","MEDTRONIC PORTUGAL, LDA (504223933)","32.050,00 €",02-11-2016,27-10-2016,20 dias,"Portugal, Coimbra, Coimbra","Artigo 24.º, n.º 1, alínea e) do Código dos Contratos Públicos",31-12-2016,"32.050,00 €",,"",,Não aplicável.,Não aplicável.,FALSE
Consultoria do projeto MASSTRPLAN-UGOC Pat.Clinica,Ajuste Direto Regime Geral,Aquisição de serviços,"73210000-7, Serviços de consultoria em matéria de investigação","Centro Hospitalar e Universitário de Coimbra, E. P. E. (510103448)",PAULA MARGARIDA DOS SANTOS LARANJEIRA (221608737),"9.000,00 €",02-11-2016,28-10-2016,92 dias,"Portugal, Coimbra, Coimbra","Artigo 20.º, n.º 1, alínea a) do Código dos Contratos Públicos","","",,"",,Não aplicável.,Não aplicável.,FALSE
Cardioversore camara única; Cardioversore  dupla camara,Ajuste Direto Regime Geral,Aquisição de bens móveis,"33182210-4, Estimulador cardíaco (pacemaker)","Centro Hospitalar e Universitário de Coimbra, E. P. E. (510103448)","MEDTRONIC PORTUGAL, LDA (504223933)","141.000,00 €",02-11-2016,11-10-2016,20 dias,"Portugal, Coimbra, Coimbra","Artigo 24.º, n.º 1, alínea e) do Código dos Contratos Públicos","","",,"",,Não aplicável.,Não aplicável.,FALSE
Válvulas biológica c/ stent aortica Anel rígido tricuspide; Valvula biológica c/ stent mitral; anel rígido mitral,Ajuste Direto Regime Geral,Aquisição de bens móveis,"33184300-6, Próteses cardíacas","Centro Hospitalar e Universitário de Coimbra, E. P. E. (510103448)","EDWARDS LIFESCIENCES , LDA (508014832)","60.318,00 €",02-11-2016,30-09-2016,20 dias,"Portugal, Coimbra, Coimbra","Artigo 24.º, n.º 1, alínea e) do Código dos Contratos Públicos","","",,"",,Não aplicável.,Não aplicável.,FALSE
MATERIAL TRATAMENTO,Ajuste Direto Regime Geral,Aquisição de bens móveis,"33000000-0, Equipamento médico, medicamentos e produtos para cuidados pessoais","Centro Hospitalar e Universitário de Coimbra, E. P. E. (510103448)","TELEFLEX MEDICAL, SAU (EX-ARROW IBÉRICA,  SA) (980249783)","6.289,50 €",02-11-2016,25-10-2016,120 dias,"Portugal, Coimbra, Coimbra","Artigo 24.º, n.º 1, alínea e) do Código dos Contratos Públicos","","",,"",,Não aplicável.,Não aplicável.,FALSE
