freguesia,acronym,validVotesPercentage,votes,dicofre
São Barnabé,PS,55.38,72,020206
São Barnabé,PPD/PSD.CDS-PP,25.38,33,020206
São Barnabé,PCP-PEV,7.69,10,020206
São Barnabé,PCTP/MRPP,3.85,5,020206
São Barnabé,B.E.,2.31,3,020206
São Barnabé,L,2.31,3,020206
São Barnabé,MPT,1.54,2,020206
São Barnabé,MAS,0.77,1,020206
São Barnabé,PND,0.77,1,020206
São Barnabé,PAN,0,0,020206
São Barnabé,PDA,0,0,020206
São Barnabé,PNR,0,0,020206
São Barnabé,POUS,0,0,020206
São Barnabé,PPM,0,0,020206
São Barnabé,PPV,0,0,020206
São Barnabé,PTP,0,0,020206
