freguesia,acronym,validVotesPercentage,votes,dicofre
União das freguesias de São Romão e Santiago,PPD/PSD,36.78,32,180122
União das freguesias de São Romão e Santiago,PS,20.69,18,180122
União das freguesias de São Romão e Santiago,CDS-PP,12.64,11,180122
União das freguesias de São Romão e Santiago,B.E.,8.05,7,180122
União das freguesias de São Romão e Santiago,PCP-PEV,6.9,6,180122
União das freguesias de São Romão e Santiago,PAN,5.75,5,180122
União das freguesias de São Romão e Santiago,A,3.45,3,180122
União das freguesias de São Romão e Santiago,PCTP/MRPP,2.3,2,180122
União das freguesias de São Romão e Santiago,PNR,2.3,2,180122
União das freguesias de São Romão e Santiago,NC,1.15,1,180122
União das freguesias de São Romão e Santiago,IL,0,0,180122
União das freguesias de São Romão e Santiago,L,0,0,180122
União das freguesias de São Romão e Santiago,MAS,0,0,180122
União das freguesias de São Romão e Santiago,PDR,0,0,180122
União das freguesias de São Romão e Santiago,PPM.PPV/CDC,0,0,180122
União das freguesias de São Romão e Santiago,PTP,0,0,180122
União das freguesias de São Romão e Santiago,PURP,0,0,180122
