Objeto do Contrato,Tipo de Procedimento,Tipo(s) de Contrato,CPVs,Entidade(s) Adjudicante(s),Entidade(s) Adjudicatária(s),Preço Contratual,Data de Publicação,Data de Celebração do Contrato,Prazo de Execução,Local de Execução,Fundamentação,Data de Fecho do Contrato,Preço Total Efetivo,Causas das Alterações ao Prazo,Causas das Alterações ao Preço,Estado,N.º registo do Acordo Quadro,Descrição do Acordo Quadro,Procedimento Centralizado
REPARAÇÃO DE VIATURA 41-GZ-00,Ajuste Direto Regime Geral,Aquisição de serviços,"50100000-6, Serviços de reparação e manutenção de veículos e equipamento afim, e serviços conexos","Instituto Nacional de Emergência Médica, I. P. (501356126)","MYCARCENTER, LDA. (500286540)","6.483,57 €",21-06-2014,12-06-2014,5 dias,"Portugal, Lisboa, Lisboa","Artigo 20.º, n.º 1, alínea a) do Código dos Contratos Públicos",,,,,,Não aplicável.,Não aplicável.,FALSE
REPARAÇÃO DE VIATURA 40-HC-48 (MOTOR),Ajuste Direto Regime Geral,Aquisição de bens móveis,"34300000-0, Peças e acessórios para veículos e seus motores","Instituto Nacional de Emergência Médica, I. P. (501356126)","LEONEL MAGALHÃES & BAPTISTA SILVA, LDA. (513026371)","9.393,10 €",21-06-2014,12-06-2014,5 dias,"Portugal, Lisboa, Lisboa","Artigo 20.º, n.º 1, alínea a) do Código dos Contratos Públicos",,,,,,Não aplicável.,Não aplicável.,FALSE
REPARAÇÃO DE VIATURA 34-38-XO (CABEÇA DE MOTOR),Ajuste Direto Regime Geral,Aquisição de bens móveis,"34300000-0, Peças e acessórios para veículos e seus motores","Instituto Nacional de Emergência Médica, I. P. (501356126)","G. C. P. AUTO, LDA (503252743)","6.082,76 €",21-06-2014,23-05-2014,5 dias,"Portugal, Lisboa, Lisboa","Artigo 20.º, n.º 1, alínea a) do Código dos Contratos Públicos",,,,,,Não aplicável.,Não aplicável.,FALSE
REPARAÇÃO DE VIATURA 78-EP-31 (MOTOR),Ajuste Direto Regime Geral,Aquisição de bens móveis,"34300000-0, Peças e acessórios para veículos e seus motores","Instituto Nacional de Emergência Médica, I. P. (501356126)",JAPAUTOMOTIVE (505897210),"8.180,12 €",21-06-2014,10-05-2014,5 dias,"Portugal, Lisboa, Lisboa","Artigo 20.º, n.º 1, alínea a) do Código dos Contratos Públicos",,,,,,Não aplicável.,Não aplicável.,FALSE
REPARAÇÃO DE VIATURA 77-CC-49 (MOTOR),Ajuste Direto Regime Geral,Aquisição de bens móveis,"34300000-0, Peças e acessórios para veículos e seus motores","Instituto Nacional de Emergência Médica, I. P. (501356126)","G. C. P. AUTO, LDA. (503252743)","5.985,98 €",21-06-2014,30-04-2014,5 dias,"Portugal, Lisboa, Lisboa","Artigo 20.º, n.º 1, alínea a) do Código dos Contratos Públicos",,,,,,Não aplicável.,Não aplicável.,FALSE
REPARAÇÃO DE VIATURA 07-EJ-68,Ajuste Direto Regime Geral,Aquisição de serviços,"50100000-6, Serviços de reparação e manutenção de veículos e equipamento afim, e serviços conexos","Instituto Nacional de Emergência Médica, I. P. (501356126)",JAPAUTOMOTIVE (505897210),"5.526,53 €",21-06-2014,02-05-2014,5 dias,"Portugal, Lisboa, Lisboa","Artigo 20.º, n.º 1, alínea a) do Código dos Contratos Públicos",,,,,,Não aplicável.,Não aplicável.,FALSE
REPARAÇÃO DE VIATURA 40-HC-52 (MOTOR),Ajuste Direto Regime Geral,Aquisição de bens móveis,"34300000-0, Peças e acessórios para veículos e seus motores","Instituto Nacional de Emergência Médica, I. P. (501356126)","MELVAR, SA (500189862)","6.568,10 €",21-06-2014,08-05-2014,5 dias,"Portugal, Lisboa, Lisboa","Artigo 20.º, n.º 1, alínea a) do Código dos Contratos Públicos",,,,,,Não aplicável.,Não aplicável.,FALSE
REPARAÇÃO DE VIATURA 56-GR-03 (MOTOR),Ajuste Direto Regime Geral,Aquisição de bens móveis,"34300000-0, Peças e acessórios para veículos e seus motores","Instituto Nacional de Emergência Médica, I. P. (501356126)","AUTO LPM LAMY PINTO MARIO, LDA. (501373209)","8.331,30 €",21-06-2014,10-05-2014,5 dias,"Portugal, Lisboa, Lisboa","Artigo 20.º, n.º 1, alínea a) do Código dos Contratos Públicos",,,,,,Não aplicável.,Não aplicável.,FALSE
REPARAÇÃO DE VIATURA 34-60-XO (MOTOR),Ajuste Direto Regime Geral,Aquisição de bens móveis,"34300000-0, Peças e acessórios para veículos e seus motores","Instituto Nacional de Emergência Médica, I. P. (501356126)","LGA, SA (502004975)","7.419,30 €",21-06-2014,13-05-2014,5 dias,"Portugal, Lisboa, Lisboa","Artigo 20.º, n.º 1, alínea a) do Código dos Contratos Públicos",,,,,,Não aplicável.,Não aplicável.,FALSE
REPARAÇÃO DE VIATURA 04-GV-10 (MOTOR),Ajuste Direto Regime Geral,Aquisição de bens móveis,"34300000-0, Peças e acessórios para veículos e seus motores","Instituto Nacional de Emergência Médica, I. P. (501356126)",JAPAUTOMOTIVE (505897210),"10.695,06 €",21-06-2014,16-04-2014,5 dias,"Portugal, Lisboa, Lisboa","Artigo 20.º, n.º 1, alínea a) do Código dos Contratos Públicos",,,,,,Não aplicável.,Não aplicável.,FALSE
REPARAÇÃO DE VIATURA 44-FA-78,Ajuste Direto Regime Geral,Aquisição de serviços,"50100000-6, Serviços de reparação e manutenção de veículos e equipamento afim, e serviços conexos","Instituto Nacional de Emergência Médica, I. P. (501356126)","CAETANO AUTO, SA (505955342)","5.485,40 €",21-06-2014,27-03-2014,5 dias,"Portugal, Lisboa, Lisboa","Artigo 20.º, n.º 1, alínea a) do Código dos Contratos Públicos",,,,,,Não aplicável.,Não aplicável.,FALSE
REPARAÇÃO DE VIATURA 55-GR-94 (MOTOR),Ajuste Direto Regime Geral,Aquisição de bens móveis,"34300000-0, Peças e acessórios para veículos e seus motores","Instituto Nacional de Emergência Médica, I. P. (501356126)","TECAUTO, SA (500279861)","9.139,56 €",21-06-2014,05-05-2014,5 dias,"Portugal, Lisboa, Lisboa","Artigo 20.º, n.º 1, alínea a) do Código dos Contratos Públicos",,,,,,Não aplicável.,Não aplicável.,FALSE
REPARAÇÃO DE VIATURA 14-GZ-90 (MOTOR),Ajuste Direto Regime Geral,Aquisição de bens móveis,"34300000-0, Peças e acessórios para veículos e seus motores","Instituto Nacional de Emergência Médica, I. P. (501356126)","GAVIS, SA (500125996)","7.522,78 €",21-06-2014,21-05-2014,5 dias,"Portugal, Lisboa, Lisboa","Artigo 20.º, n.º 1, alínea a) do Código dos Contratos Públicos",,,,,,Não aplicável.,Não aplicável.,FALSE
REPARAÇÃO DE VIATURA 33-74-XR (CAIXA DE VELOCIDADES),Ajuste Direto Regime Geral,Aquisição de bens móveis,"34300000-0, Peças e acessórios para veículos e seus motores","Instituto Nacional de Emergência Médica, I. P. (501356126)","MELVAR, SA (500189862)","5.170,86 €",21-06-2014,21-03-2014,5 dias,"Portugal, Lisboa, Lisboa","Artigo 20.º, n.º 1, alínea a) do Código dos Contratos Públicos",,,,,,Não aplicável.,Não aplicável.,FALSE
REPARAÇÃO DE VIATURA 34-63-XO,Ajuste Direto Regime Geral,Aquisição de serviços,"50100000-6, Serviços de reparação e manutenção de veículos e equipamento afim, e serviços conexos","Instituto Nacional de Emergência Médica, I. P. (501356126)",JAPAUTOMOTIVE (505897210),"6.109,34 €",21-06-2014,27-03-2014,5 dias,"Portugal, Lisboa, Lisboa","Artigo 20.º, n.º 1, alínea a) do Código dos Contratos Públicos",,,,,,Não aplicável.,Não aplicável.,FALSE
REPARAÇÃO DE VIATURA 40-GZ-79,Ajuste Direto Regime Geral,Aquisição de serviços,"50100000-6, Serviços de reparação e manutenção de veículos e equipamento afim, e serviços conexos","Instituto Nacional de Emergência Médica, I. P. (501356126)","G.C.P. AUTO, LDA. (503252743)","5.344,53 €",21-06-2014,27-03-2014,5 dias,"Portugal, Lisboa, Lisboa","Artigo 20.º, n.º 1, alínea a) do Código dos Contratos Públicos",,,,,,Não aplicável.,Não aplicável.,FALSE
"Fornecimento de 1000 conector p/controlo digital de aspiração, 1000 máscara de inalação de o2 alta concentração – adulto, 240 máscara de bolso com estojo, 100 swivel c/traqueia p/doente ventilado e 3900 eléctrodo ecg aderente adulto.  ",Ajuste Direto Regime Geral,Aquisição de bens móveis,"33000000-0, Equipamento médico, medicamentos e produtos para cuidados pessoais","Instituto Nacional de Emergência Médica, I. P. (501356126)",H.R. LDA. (501895558),"2.008,10 €",21-06-2014,21-06-2014,1 dias,"Portugal, Lisboa, Lisboa","Artigo 20.º, n.º 1, alínea a) do Código dos Contratos Públicos",,,,,,Não aplicável.,Não aplicável.,FALSE
Fornecimento de 30 Kits de alteração para aspiradores de mucosidades Laerdal LSU.,Ajuste Direto Regime Geral,Aquisição de bens móveis,"33000000-0, Equipamento médico, medicamentos e produtos para cuidados pessoais","Instituto Nacional de Emergência Médica, I. P. (501356126)","MEDICINÁLIA CORMÉDICA, LDA. (500684324)","2.460,00 €",21-06-2014,18-06-2014,15 dias,"Portugal, Lisboa, Lisboa","Artigo 24.º, n.º 1, alínea e) do Código dos Contratos Públicos",,,,,,Não aplicável.,Não aplicável.,FALSE
"Fornecimento de 500 cateter endovenoso periférico c/ proteção - 14g, 500 cateter endovenoso periférico c/ proteção - 16g, 600 cateter endovenoso periférico c/ proteção - 18g, 1000 cateter endovenoso periférico c/ proteção - 20g, 1000 cateter endovenoso periférico 22g, 1000 cateter endovenoso periférico 24g, 1000 seringa irrecup. 2ml, 2000 seringa irrecup. 5ml, 4000 seringa irrecup. 10ml e 800 seringa irrecup. 20ml.  ",Ajuste Direto Regime Geral,Aquisição de bens móveis,"33000000-0, Equipamento médico, medicamentos e produtos para cuidados pessoais","Instituto Nacional de Emergência Médica, I. P. (501356126)","B. BRAUN MEDICAL, LDA. (501506543)","0,00 €",21-06-2014,20-06-2014,1 dias,"Portugal, Lisboa, Lisboa","Artigo 26.º, n.º 1, alínea e) do Código dos Contratos Públicos",,,,,,1237846,AQUISIÇÃO DE CATETERES E SERINGA IRRECUPERÁVEL,FALSE
"Fornecimento de 3000 sist. administ.soro c/arejador c/ ligação Luer Lock, 50 tubo endotraqueal s/cuff 3, 50 tubo endotraqueal s/cuff 4, 50 tubo endotraqueal s/cuff 4,5, 50 tubo endotraqueal c/cuff 5, 100 tubo endotraqueal c/cuff 7,5, 800 sonda aspiração tipo Yankauer.  ",Ajuste Direto Regime Geral,Aquisição de bens móveis,"33000000-0, Equipamento médico, medicamentos e produtos para cuidados pessoais","Instituto Nacional de Emergência Médica, I. P. (501356126)","ROCHA NEVES, LDA. (500233691)","1.382,00 €",21-06-2014,20-06-2014,10 dias,"Portugal, Lisboa, Lisboa","Artigo 20.º, n.º 1, alínea a) do Código dos Contratos Públicos",,,,,,Não aplicável.,Não aplicável.,FALSE
"Fornecimento de 40 noradrenalina, sol.inj. 10mg/10ml, amp.10ml.",Ajuste Direto Regime Geral,Aquisição de bens móveis,"33000000-0, Equipamento médico, medicamentos e produtos para cuidados pessoais","Instituto Nacional de Emergência Médica, I. P. (501356126)","LABESFAL, S.A. (501169580)","0,00 €",21-06-2014,20-06-2014,1 dias,"Portugal, Lisboa, Lisboa","Artigo 26.º, n.º 1, alínea e) do Código dos Contratos Públicos",,,,,,1237842,AQUISIÇÃO DE NORADRENALINA,FALSE
Fornecimento de 50 mantas isotérmicas não descartáveis e 20 estetoscópios adulto.,Ajuste Direto Regime Geral,Aquisição de bens móveis,"33000000-0, Equipamento médico, medicamentos e produtos para cuidados pessoais","Instituto Nacional de Emergência Médica, I. P. (501356126)","AMBEX, LDA. (507593111)","1.327,50 €",21-06-2014,20-06-2014,30 dias,"Portugal, Lisboa, Lisboa","Artigo 20.º, n.º 1, alínea a) do Código dos Contratos Públicos",,,,,,Não aplicável.,Não aplicável.,FALSE
Fornecimento de 420 rolos de adesivo comum 5cm x 5m.,Ajuste Direto Regime Geral,Aquisição de bens móveis,"33000000-0, Equipamento médico, medicamentos e produtos para cuidados pessoais","Instituto Nacional de Emergência Médica, I. P. (501356126)","BSN MEDICAL, S.A. (505385058)","504,00 €",21-06-2014,20-06-2014,2 dias,"Portugal, Lisboa, Lisboa","Artigo 20.º, n.º 1, alínea a) do Código dos Contratos Públicos",,,,,,Não aplicável.,Não aplicável.,FALSE
Fornecimento de 10 macas estabilizadoras de vácuo adulto.,Ajuste Direto Regime Geral,Aquisição de bens móveis,"33000000-0, Equipamento médico, medicamentos e produtos para cuidados pessoais","Instituto Nacional de Emergência Médica, I. P. (501356126)","SILVERSTAR, LDA. (510771904)","1.250,00 €",21-06-2014,20-06-2014,30 dias,"Portugal, Lisboa, Lisboa","Artigo 20.º, n.º 1, alínea a) do Código dos Contratos Públicos",,,,,,Não aplicável.,Não aplicável.,FALSE
Fornecimento de 1200 mantas isotérmicas dupla face descartável.,Ajuste Direto Regime Geral,Aquisição de bens móveis,"33000000-0, Equipamento médico, medicamentos e produtos para cuidados pessoais","Instituto Nacional de Emergência Médica, I. P. (501356126)","SANO-TÉCNICA, LDA (500239819)","2.388,00 €",21-06-2014,20-06-2014,1 dias,"Portugal, Lisboa, Lisboa","Artigo 20.º, n.º 1, alínea a) do Código dos Contratos Públicos",,,,,,Não aplicável.,Não aplicável.,FALSE
Reparação de um monitor MEK sn 700-03L-722,Ajuste Direto Regime Geral,Aquisição de serviços,"50000000-5, Serviços de reparação e manutenção","Instituto Nacional de Emergência Médica, I. P. (501356126)","SPACE, LDA. (507662407)","190,00 €",18-06-2014,13-05-2014,30 dias,"Portugal, Lisboa, Lisboa","Artigo 24.º, n.º 1, alínea e) do Código dos Contratos Públicos",,,,,,Não aplicável.,Não aplicável.,FALSE
Reparação de um aspirador accuvac sn 13074/2004,Ajuste Direto Regime Geral,Aquisição de serviços,"50000000-5, Serviços de reparação e manutenção","Instituto Nacional de Emergência Médica, I. P. (501356126)","FUTURVIDA, LDA. (504260510)","40,00 €",18-06-2014,05-03-2014,30 dias,"Portugal, Lisboa, Lisboa","Artigo 24.º, n.º 1, alínea e) do Código dos Contratos Públicos",,,,,,Não aplicável.,Não aplicável.,FALSE
Reparação de seringa infusora BBRAUN sn 133512,Ajuste Direto Regime Geral,Aquisição de serviços,"50000000-5, Serviços de reparação e manutenção","Instituto Nacional de Emergência Médica, I. P. (501356126)","B. BRAUN MEDICAL, LDA. (501506543)","143,67 €",18-06-2014,13-05-2014,30 dias,"Portugal, Lisboa, Lisboa","Artigo 24.º, n.º 1, alínea e) do Código dos Contratos Públicos",,,,,,Não aplicável.,Não aplicável.,FALSE
Reparação de seringa infusora BBRAUN sn 97296,Ajuste Direto Regime Geral,Aquisição de serviços,"50000000-5, Serviços de reparação e manutenção","Instituto Nacional de Emergência Médica, I. P. (501356126)","B. BRAUN MEDICAL, LDA. (501506543)","494,68 €",18-06-2014,07-05-2014,30 dias,"Portugal, Lisboa, Lisboa","Artigo 24.º, n.º 1, alínea e) do Código dos Contratos Públicos",,,,,,Não aplicável.,Não aplicável.,FALSE
Reparação de seringa infusora BBRAUN sn 82361.,Ajuste Direto Regime Geral,Aquisição de serviços,"50000000-5, Serviços de reparação e manutenção","Instituto Nacional de Emergência Médica, I. P. (501356126)","B. BRAUN MEDICAL, LDA. (501506543)","322,74 €",18-06-2014,13-05-2014,30 dias,"Portugal, Lisboa, Lisboa","Artigo 24.º, n.º 1, alínea e) do Código dos Contratos Públicos",,,,,,Não aplicável.,Não aplicável.,FALSE
Reparação de uma seringa infusora BBRAUN sn 108846,Ajuste Direto Regime Geral,Aquisição de serviços,"50000000-5, Serviços de reparação e manutenção","Instituto Nacional de Emergência Médica, I. P. (501356126)","B. BRAUN MEDICAL, LDA. (501506543)","313,97 €",18-06-2014,13-05-2014,30 dias,"Portugal, Lisboa, Lisboa","Artigo 24.º, n.º 1, alínea e) do Código dos Contratos Públicos",,,,,,Não aplicável.,Não aplicável.,FALSE
Reparação de uma seringa infusora BBRAUN sn 105098,Ajuste Direto Regime Geral,Aquisição de serviços,"50000000-5, Serviços de reparação e manutenção","Instituto Nacional de Emergência Médica, I. P. (501356126)","B. BRAUN MEDICAL, LDA. (501506543)","601,64 €",18-06-2014,13-05-2014,30 dias,"Portugal, Lisboa, Lisboa","Artigo 24.º, n.º 1, alínea e) do Código dos Contratos Públicos",,,,,,Não aplicável.,Não aplicável.,FALSE
Reparação de uma seringa BBRAUN sn 88842,Ajuste Direto Regime Geral,Aquisição de serviços,"50000000-5, Serviços de reparação e manutenção","Instituto Nacional de Emergência Médica, I. P. (501356126)","B. BRAUN MEDICAL, LDA. (501506543)","370,78 €",18-06-2014,08-05-2014,30 dias,"Portugal, Lisboa, Lisboa","Artigo 24.º, n.º 1, alínea e) do Código dos Contratos Públicos",,,,,,Não aplicável.,Não aplicável.,FALSE
Reparação de seringa BBRAUN,Ajuste Direto Regime Geral,Aquisição de serviços,"50000000-5, Serviços de reparação e manutenção","Instituto Nacional de Emergência Médica, I. P. (501356126)","B. BRAUN MEDICAL, LDA. (501506543)","99,42 €",18-06-2014,08-05-2014,30 dias,"Portugal, Lisboa, Lisboa","Artigo 24.º, n.º 1, alínea e) do Código dos Contratos Públicos",,,,,,Não aplicável.,Não aplicável.,FALSE
Reparação de uma seringa BBRAUN sn179657,Ajuste Direto Regime Geral,Aquisição de serviços,"50000000-5, Serviços de reparação e manutenção","Instituto Nacional de Emergência Médica, I. P. (501356126)","B. BRAUN MEDICAL, LDA. (501506543)","397,84 €",18-06-2014,30-05-2014,30 dias,"Portugal, Lisboa, Lisboa","Artigo 24.º, n.º 1, alínea e) do Código dos Contratos Públicos",,,,,,Não aplicável.,Não aplicável.,FALSE
Reparação de um monitor nonim sn 500238995,Ajuste Direto Regime Geral,Aquisição de serviços,"50000000-5, Serviços de reparação e manutenção","Instituto Nacional de Emergência Médica, I. P. (501356126)","SPACE, LDA. (507662407)","258,79 €",18-06-2014,22-05-2014,30 dias,"Portugal, Lisboa, Lisboa","Artigo 24.º, n.º 1, alínea e) do Código dos Contratos Públicos",,,,,,Não aplicável.,Não aplicável.,FALSE
Reparação de um LP 12 sn 32203620,Ajuste Direto Regime Geral,Aquisição de serviços,"50000000-5, Serviços de reparação e manutenção","Instituto Nacional de Emergência Médica, I. P. (501356126)",PHYSIO PORTUGAL SALES (510137946),"3.222,10 €",18-06-2014,30-05-2014,30 dias,"Portugal, Lisboa, Lisboa","Artigo 24.º, n.º 1, alínea e) do Código dos Contratos Públicos",,,,,,Não aplicável.,Não aplicável.,FALSE
Reparação de um LP 12 sn 30290033,Ajuste Direto Regime Geral,Aquisição de serviços,"50000000-5, Serviços de reparação e manutenção","Instituto Nacional de Emergência Médica, I. P. (501356126)",PHYSIO PORTUGAL SALES (510137946),"1.493,80 €",18-06-2014,30-05-2014,30 dias,"Portugal, Lisboa, Lisboa","Artigo 24.º, n.º 1, alínea e) do Código dos Contratos Públicos",,,,,,Não aplicável.,Não aplicável.,FALSE
Reparação de um LP 15 sn 40983330,Ajuste Direto Regime Geral,Aquisição de serviços,"50000000-5, Serviços de reparação e manutenção","Instituto Nacional de Emergência Médica, I. P. (501356126)",PHYSIO PORTUGAL SALES (510137946),"378,00 €",18-06-2014,30-05-2014,30 dias,"Portugal, Lisboa, Lisboa","Artigo 24.º, n.º 1, alínea e) do Código dos Contratos Públicos",,,,,,Não aplicável.,Não aplicável.,FALSE
Reparação de um LP 12 sn 30290036,Ajuste Direto Regime Geral,Aquisição de serviços,"50000000-5, Serviços de reparação e manutenção","Instituto Nacional de Emergência Médica, I. P. (501356126)",PHYSIO PORTUGAL SALES (510137946),"156,24 €",18-06-2014,30-05-2014,30 dias,"Portugal, Lisboa, Lisboa","Artigo 24.º, n.º 1, alínea e) do Código dos Contratos Públicos",,,,,,Não aplicável.,Não aplicável.,FALSE
Reparação de uma seringa infusora BBRAUN sn 35355,Ajuste Direto Regime Geral,Aquisição de serviços,"50000000-5, Serviços de reparação e manutenção","Instituto Nacional de Emergência Médica, I. P. (501356126)","B. BRAUN MEDICAL, LDA. (501506543)","219,29 €",18-06-2014,19-05-2014,30 dias,"Portugal, Lisboa, Lisboa","Artigo 24.º, n.º 1, alínea e) do Código dos Contratos Públicos",,,,,,Não aplicável.,Não aplicável.,FALSE
Reparação de uma seringa infusora bbraun sn 108963,Ajuste Direto Regime Geral,Aquisição de serviços,"50000000-5, Serviços de reparação e manutenção","Instituto Nacional de Emergência Médica, I. P. (501356126)","B. BRAUN MEDICAL, LDA. (501506543)","71,28 €",18-06-2014,19-05-2014,30 dias,"Portugal, Lisboa, Lisboa","Artigo 24.º, n.º 1, alínea e) do Código dos Contratos Públicos",,,,,,Não aplicável.,Não aplicável.,FALSE
Reparação de seringa infusora bbraun sn 77830,Ajuste Direto Regime Geral,Aquisição de serviços,"50000000-5, Serviços de reparação e manutenção","Instituto Nacional de Emergência Médica, I. P. (501356126)","B. BRAUN MEDICAL, LDA. (501506543)","517,71 €",18-06-2014,13-05-2014,30 dias,"Portugal, Lisboa, Lisboa","Artigo 24.º, n.º 1, alínea e) do Código dos Contratos Públicos",,,,,,Não aplicável.,Não aplicável.,FALSE
Reparação de seringa infusora BBRAUN sn 88790.,Ajuste Direto Regime Geral,Aquisição de serviços,"50000000-5, Serviços de reparação e manutenção","Instituto Nacional de Emergência Médica, I. P. (501356126)","B. BRAUN MEDICAL, LDA. (501506543)","401,06 €",18-06-2014,09-05-2014,30 dias,"Portugal, Lisboa, Lisboa","Artigo 24.º, n.º 1, alínea e) do Código dos Contratos Públicos",,,,,,Não aplicável.,Não aplicável.,FALSE
Reparação de um aspirador WEINMANN sn 10304.,Ajuste Direto Regime Geral,Aquisição de serviços,"50000000-5, Serviços de reparação e manutenção","Instituto Nacional de Emergência Médica, I. P. (501356126)","FUTURVIDA, LDA. (504260510)","232,80 €",18-06-2014,18-03-2014,30 dias,"Portugal, Lisboa, Lisboa","Artigo 24.º, n.º 1, alínea e) do Código dos Contratos Públicos",,,,,,Não aplicável.,Não aplicável.,FALSE
Reparação de um aspirador weinmann sn 18521.,Ajuste Direto Regime Geral,Aquisição de serviços,"50000000-5, Serviços de reparação e manutenção","Instituto Nacional de Emergência Médica, I. P. (501356126)","FUTURVIDA, LDA. (504260510)","294,04 €",18-06-2014,30-05-2014,30 dias,"Portugal, Lisboa, Lisboa","Artigo 24.º, n.º 1, alínea e) do Código dos Contratos Públicos",,,,,,Não aplicável.,Não aplicável.,FALSE
Reparação de um LP 12 sn 32205007,Ajuste Direto Regime Geral,Aquisição de serviços,"50000000-5, Serviços de reparação e manutenção","Instituto Nacional de Emergência Médica, I. P. (501356126)",PHYSIO PORTUGAL SALES (510137946),"348,91 €",18-06-2014,30-05-2014,30 dias,"Portugal, Lisboa, Lisboa","Artigo 24.º, n.º 1, alínea e) do Código dos Contratos Públicos",,,,,,Não aplicável.,Não aplicável.,FALSE
Reparação de um LP 12 sn 13083108,Ajuste Direto Regime Geral,Aquisição de serviços,"50000000-5, Serviços de reparação e manutenção","Instituto Nacional de Emergência Médica, I. P. (501356126)",PHYSIO PORTUGAL SALES (510137946),"1.552,77 €",18-06-2014,30-05-2014,30 dias,"Portugal, Lisboa, Lisboa","Artigo 24.º, n.º 1, alínea e) do Código dos Contratos Públicos",,,,,,Não aplicável.,Não aplicável.,FALSE
Reparação de LP 12 sn 35810147.,Ajuste Direto Regime Geral,Aquisição de serviços,"50000000-5, Serviços de reparação e manutenção","Instituto Nacional de Emergência Médica, I. P. (501356126)",PHYSIO PORTUGAL SALES (510137946),"353,82 €",18-06-2014,30-05-2014,30 dias,"Portugal, Lisboa, Lisboa","Artigo 24.º, n.º 1, alínea e) do Código dos Contratos Públicos",,,,,,Não aplicável.,Não aplicável.,FALSE
Reparação de um LP1000 sn 40071373.,Ajuste Direto Regime Geral,Aquisição de serviços,"50000000-5, Serviços de reparação e manutenção","Instituto Nacional de Emergência Médica, I. P. (501356126)",PHYSIO PORTUGAL SALES (510137946),"156,24 €",18-06-2014,30-05-2014,30 dias,"Portugal, Lisboa, Lisboa","Artigo 24.º, n.º 1, alínea e) do Código dos Contratos Públicos",,,,,,Não aplicável.,Não aplicável.,FALSE
Reparação de um LP 12 sn 35810142.,Ajuste Direto Regime Geral,Aquisição de serviços,"50000000-5, Serviços de reparação e manutenção","Instituto Nacional de Emergência Médica, I. P. (501356126)",PHYSIO PORTUGAL SALES (510137946),"209,91 €",18-06-2014,30-05-2014,30 dias,"Portugal, Lisboa, Lisboa","Artigo 24.º, n.º 1, alínea e) do Código dos Contratos Públicos",,,,,,Não aplicável.,Não aplicável.,FALSE
Reparação de um LP 12 sn 30290023,Ajuste Direto Regime Geral,Aquisição de serviços,"50000000-5, Serviços de reparação e manutenção","Instituto Nacional de Emergência Médica, I. P. (501356126)",PHYSIO PORTUGAL SALES (510137946),"1.002,21 €",18-06-2014,30-05-2014,30 dias,"Portugal, Lisboa, Lisboa","Artigo 24.º, n.º 1, alínea e) do Código dos Contratos Públicos",,,,,,Não aplicável.,Não aplicável.,FALSE
Reparação de uma incubadora de transporte air-shields modelo TI 500 sn XC00140.,Ajuste Direto Regime Geral,Aquisição de serviços,"50000000-5, Serviços de reparação e manutenção","Instituto Nacional de Emergência Médica, I. P. (501356126)","SANO-TÉCNICA, LDA. (500239819)","543,00 €",18-06-2014,30-05-2014,30 dias,"Portugal, Lisboa, Lisboa","Artigo 24.º, n.º 1, alínea e) do Código dos Contratos Públicos",,,,,,Não aplicável.,Não aplicável.,FALSE
"Fornecimento de 1000 tubos de conexão o2, 200 cânulas orofarin.irrecupe. nº2, 800 cânulas orofarin.irrecupe. nº3, 800 cânulas orofarin.irrecupe. nº4, 400 traqueia simples descartável para ventilador, 120 máscara de insuflador manual nº4 (descartável), 1000 máscaras de insuflador manual nº5 (descartável), 8000 máscaras inalação o2 c/tubo de conexão – adulto.",Ajuste Direto Regime Geral,Aquisição de bens móveis,"33000000-0, Equipamento médico, medicamentos e produtos para cuidados pessoais","Instituto Nacional de Emergência Médica, I. P. (501356126)",INTERSURGICAL (503480045),"5.506,00 €",12-06-2014,11-06-2014,1 dias,"Portugal, Lisboa, Lisboa","Artigo 20.º, n.º 1, alínea a) do Código dos Contratos Públicos",,,,,,Não aplicável.,Não aplicável.,FALSE
"Fornecimento de 200 frascos de Glucagon, pó p/sol. inj. 1mg.",Ajuste Direto Regime Geral,Aquisição de bens móveis,"33000000-0, Equipamento médico, medicamentos e produtos para cuidados pessoais","Instituto Nacional de Emergência Médica, I. P. (501356126)","NOVO NORDISK, LDA (501485210)","2.730,00 €",12-06-2014,09-06-2014,3 dias,"Portugal, Lisboa, Lisboa","Artigo 24.º, n.º 1, alínea e) do Código dos Contratos Públicos",,,,,,Não aplicável.,Não aplicável.,FALSE
"Fornecimento de 50 frascos de dobutamina, sol.p/perfusão 12,5mg/ml, fr.20ml.",Ajuste Direto Regime Geral,Aquisição de bens móveis,"33000000-0, Equipamento médico, medicamentos e produtos para cuidados pessoais","Instituto Nacional de Emergência Médica, I. P. (501356126)","GENERIS FARMACÊUTICA, S.A. (508107997)","0,00 €",12-06-2014,09-06-2014,1 dias,"Portugal, Lisboa, Lisboa","Artigo 26.º, n.º 1, alínea e) do Código dos Contratos Públicos",,,,,,1233148,AQUISIÇÃO DE DOBUTAMINA,FALSE
Fornecimento de 800 contentor para recolha de cortantes contaminados 500cc c/tampa de segurança.,Ajuste Direto Regime Geral,Aquisição de bens móveis,"33000000-0, Equipamento médico, medicamentos e produtos para cuidados pessoais","Instituto Nacional de Emergência Médica, I. P. (501356126)",OVERPHARMA (505792362),"0,00 €",12-06-2014,05-06-2014,2 dias,"Portugal, Lisboa, Lisboa","Artigo 26.º, n.º 1, alínea e) do Código dos Contratos Públicos",,,,,,1233140,AQUISIÇÃO DE CONTENTOR PARA RECOLHA DE CORTANTES,FALSE
Fornecimento de 400 talas de madeira espessura 3mm; comprimento 90cm; largura 8cm e 600 talas de madeira espessura 3mm; comprimento 50cm; largura 8cm.,Ajuste Direto Regime Geral,Aquisição de bens móveis,"33000000-0, Equipamento médico, medicamentos e produtos para cuidados pessoais","Instituto Nacional de Emergência Médica, I. P. (501356126)","EXTINCÊNDIOS, LDA. (501390324)","1.520,00 €",12-06-2014,05-06-2014,20 dias,"Portugal, Lisboa, Lisboa","Artigo 20.º, n.º 1, alínea a) do Código dos Contratos Públicos",,,,,,Não aplicável.,Não aplicável.,FALSE
"Fornecimento de 10.000 óculos de administração de o2 adulto, 1000 sondas aspiração CH 16, 500 máscaras inalação o2 c/tubo de conexão – pediátrica e 200 máscaras de inalação o2 adulto c/ nebulizador.  ",Ajuste Direto Regime Geral,Aquisição de bens móveis,"33000000-0, Equipamento médico, medicamentos e produtos para cuidados pessoais","Instituto Nacional de Emergência Médica, I. P. (501356126)",OVERPHARMA (505792362),"2.323,00 €",12-06-2014,05-06-2014,2 dias,"Portugal, Lisboa, Lisboa","Artigo 20.º, n.º 1, alínea a) do Código dos Contratos Públicos",,,,,,Não aplicável.,Não aplicável.,FALSE
Fornecimento de 348 rolos de pano microroll.,Ajuste Direto Regime Geral,Aquisição de bens móveis,"39000000-2, Mobiliário (incl. de escritório), acessórios, aparelhos domésticos (excl. iluminação) e produtos de limpeza","Instituto Nacional de Emergência Médica, I. P. (501356126)","A. MENDES DA SILVA, LDA. (502064080)","4.906,80 €",12-06-2014,04-06-2014,3 dias,"Portugal, Lisboa, Lisboa","Artigo 20.º, n.º 1, alínea a) do Código dos Contratos Públicos",,,,,,Não aplicável.,Não aplicável.,FALSE
Fornecimento de 50.880 lençóis descartáveis 80x210cm.,Ajuste Direto Regime Geral,Aquisição de bens móveis,"33000000-0, Equipamento médico, medicamentos e produtos para cuidados pessoais","Instituto Nacional de Emergência Médica, I. P. (501356126)",M.U.C. (502379308),"11.193,60 €",12-06-2014,19-05-2014,2 dias,"Portugal, Lisboa, Lisboa","Artigo 20.º, n.º 1, alínea a) do Código dos Contratos Públicos",,,,,,Não aplicável.,Não aplicável.,FALSE
Fornecimento de 4020 maços toalhetes papel p/mãos ZIG-ZAG.,Ajuste Direto Regime Geral,Aquisição de bens móveis,"39000000-2, Mobiliário (incl. de escritório), acessórios, aparelhos domésticos (excl. iluminação) e produtos de limpeza","Instituto Nacional de Emergência Médica, I. P. (501356126)",SERVISAN (500246530),"2.677,32 €",12-06-2014,04-06-2014,5 dias,"Portugal, Lisboa, Lisboa","Artigo 20.º, n.º 1, alínea a) do Código dos Contratos Públicos",,,,,,Não aplicável.,Não aplicável.,FALSE
Aquisição de antivírus,Ajuste Direto Regime Geral,Aquisição de bens móveis,"48000000-8, Pacotes de software e sistemas de informação","Instituto Nacional de Emergência Médica, I. P. (501356126)","WiseIT - Managed Services Provider, Lda. (510829570)","6.718,00 €",11-06-2014,06-06-2014,365 dias,"Portugal, Lisboa, Lisboa","Artigo 20.º, n.º 1, alínea a) do Código dos Contratos Públicos",,,,,,Não aplicável.,Não aplicável.,FALSE
