Objeto do Contrato,Tipo de Procedimento,Tipo(s) de Contrato,CPVs,Entidade(s) Adjudicante(s),Entidade(s) Adjudicatária(s),Preço Contratual,Data de Publicação,Data de Celebração do Contrato,Prazo de Execução,Local de Execução,Fundamentação,Data de Fecho do Contrato,Preço Total Efetivo,Causas das Alterações ao Prazo,Causas das Alterações ao Preço,Estado,N.º registo do Acordo Quadro,Descrição do Acordo Quadro,Procedimento Centralizado
Prestação de serviços de manutenção e assistência técnica preventiva e corretiva à Central de Tratamento de Água (CTAH) e Pré-Filtração da Hemodiálise (UF) do Hospital Amato Lusitano,Consulta Prévia,Aquisição de serviços,"71356200-0, Serviços de assistência técnica","Unidade Local de Saúde de Castelo Branco, EPE (509309844)","FRESENIUS MEDICAL CARE PORTUGAL, SA (503070220)","72.000,00 €",25-01-2019,15-01-2019,1095 dias,"Portugal, Castelo Branco, Castelo Branco","Artigo 20.º, n.º 1, alínea c) do Código dos Contratos Públicos",,,,,,Não aplicável.,Não aplicável.,FALSE
Prestação de Serviços de Comunicações Convergentes Fixas-Móveis para a ULSCB,Ajuste Direto Regime Geral,Aquisição de serviços,"64200000-8, Serviços de telecomunicações","UNIDADE LOCAL DE SAÚDE DE CASTELO BRANCO, E.P.E. (509309844)",NOS SA (502604751),"19.945,00 €",22-01-2019,03-12-2018,730 dias,"Portugal, Castelo Branco, Castelo Branco","Artigo 20.º, n.º 1, alínea d) do Código dos Contratos Públicos",,,,,,Não aplicável.,Não aplicável.,FALSE
