Objeto do Contrato,Tipo de Procedimento,Tipo(s) de Contrato,CPVs,Entidade(s) Adjudicante(s),Entidade(s) Adjudicatária(s),Preço Contratual,Data de Publicação,Data de Celebração do Contrato,Prazo de Execução,Local de Execução,Fundamentação,Data de Fecho do Contrato,Preço Total Efetivo,Causas das Alterações ao Prazo,Causas das Alterações ao Preço,Estado,N.º registo do Acordo Quadro,Descrição do Acordo Quadro,Procedimento Centralizado
Desenvolvimento de software “Portal de registo nacional de estudos clínicos,Ajuste Direto Regime Geral,Aquisição de serviços,"72232000-0, Desenvolvimento de software de processamento de transacções e de software à medida","Infarmed - Autoridade Nacional do Medicamento e Produtos de Saúde, IP (600037002)",ALTRANPORTUGAL (504272179),"73.977,50 €",20-02-2015,20-01-2015,150 dias,Portugal,"Artigo 20.º, n.º 1, alínea a) do Código dos Contratos Públicos",,,,,,Não aplicável.,Não aplicável.,FALSE
"Desenvolvimento de Aplicação “Gestão de Autorizações para Aquisição Direta de Medicamentos, Gestão de Auxiliares de Farmácia e Emissão de certificados de Distribuição de DM” ",Ajuste Direto Regime Geral,Aquisição de serviços,"72230000-6, Serviços de desenvolvimento de software à medida","INFARMED - Autoridade Nacional do Medicamento e Produtos de Saúde, I. P. (600037002)","INDRA SISTEMAS PORTUGAL, S.A. (506176142)","30.200,00 €",19-02-2015,20-01-2015,90 dias,Portugal,"Artigo 20.º, n.º 1, alínea a) do Código dos Contratos Públicos",,,,,,Não aplicável.,Não aplicável.,FALSE
"Aquisição de Plataforma aplicacional para difusão massiva de e-mail, com serviços de configuração para 3 anos ",Ajuste Direto Regime Geral,Aquisição de serviços,"72260000-5, Serviços relacionados com software","INFARMED - Autoridade Nacional do Medicamento e Produtos de Saúde, I. P. (600037002)","IPBRICK, S.A (504837958)","23.160,00 €",19-02-2015,20-01-2015,1095 dias,Portugal,"Artigo 20.º, n.º 1, alínea a) do Código dos Contratos Públicos",,,,,,Não aplicável.,Não aplicável.,FALSE
"Aquisição de Access Points , Controlodadora Wireless e respetiva manutenção por 3 anos ",Ajuste Direto Regime Geral,Locação de bens móveis,"32581000-9, Equipamento para comunicação de dados","INFARMED - Autoridade Nacional do Medicamento e Produtos de Saúde, I. P. (600037002)","REGRA - SISTEMAS DE INFORMAÇÃO, S.A. (500229147)","52.803,19 €",19-02-2015,27-01-2015,1095 dias,Portugal,"Artigo 20.º, n.º 1, alínea a) do Código dos Contratos Públicos",,,,,,Não aplicável.,Não aplicável.,FALSE
Aquisição de serviços para renovação de licenças e updates Checkpoint por 3 anos,Ajuste Direto Regime Geral,Aquisição de bens móveis,"48210000-3, Pacote de software para ligações em rede","INFARMED - Autoridade Nacional do Medicamento e Produtos de Saúde, I. P. (600037002)","LAYER8 - SHIELD DOMAIN, S.A. (509985211)","73.100,00 €",18-02-2015,26-01-2015,1095 dias,Portugal,"Artigo 20.º, n.º 1, alínea a) do Código dos Contratos Públicos",,,,,,Não aplicável.,Não aplicável.,FALSE
"Aquisição de serviços de Catering, para apoio à realização/organização de reuniões durante o ano de 2015 ",Ajuste Direto Regime Geral,Outros Tipos (Prestação do Serviço Universal),"55500000-5, Serviços de cantinas e de fornecimento de refeições (catering)","INFARMED - Autoridade Nacional do Medicamento e Produtos de Saúde, I. P. (600037002)",SERVIÇOS DE UTILIZAÇÃO COMUM DOS HOSPITAIS - SUCH (500900469),"30.000,00 €",18-02-2015,29-01-2015,365 dias,Portugal,"Artigo 20.º, n.º 1, alínea a) do Código dos Contratos Públicos",,,,,,Não aplicável.,Não aplicável.,FALSE
"Aquisição de serviços de refeitório - bar/cafetaria -, para fornecimento de refeições e apoio dentro das salas de reuniões do INFARMED, I.P. durante o ano de 2015.",Ajuste Direto Regime Geral,Outros Tipos (Prestação do Serviço Universal),"55300000-3, Serviços de mesa e de restauração","INFARMED - Autoridade Nacional do Medicamento e Produtos de Saúde, I. P. (600037002)",SERVIÇO DE UTILIZAÇÃO COMUM DOS HOSPITAIS - SUCH (500900469),"24.000,00 €",18-02-2015,02-02-2015,365 dias,Portugal,"Artigo 20.º, n.º 1, alínea a) do Código dos Contratos Públicos",,,,,,Não aplicável.,Não aplicável.,FALSE
