Objeto do Contrato,Tipo de Procedimento,Tipo(s) de Contrato,CPVs,Entidade(s) Adjudicante(s),Entidade(s) Adjudicatária(s),Preço Contratual,Data de Publicação,Data de Celebração do Contrato,Prazo de Execução,Local de Execução,Fundamentação,Data de Fecho do Contrato,Preço Total Efetivo,Causas das Alterações ao Prazo,Causas das Alterações ao Preço,Estado,N.º registo do Acordo Quadro,Descrição do Acordo Quadro,Procedimento Centralizado
Aquisição de equipamento informático para projeto MedOn,Ajuste Direto Regime Geral,Aquisição de bens móveis,"30236000-2, Equipamento informático diverso","Centro Hospitalar Cova da Beira, E. P. E. (506361659)","ATM - Sistemas de Informação e Serviços, S.A. (509784267)","15.845,00 €",30-03-2017,21-02-2017,1095 dias,"Portugal, Castelo Branco, Covilhã","Artigo 20.º, n.º 1, alínea a) do Código dos Contratos Públicos",,"",,,,Não aplicável.,Não aplicável.,FALSE
Aquisição de gestão de filas de atendimento na Consulta Externa,Ajuste Direto Regime Geral,Aquisição de bens móveis,"48445000-9, Pacote de software para gestão da relação com os clientes",CHCB (506361659),"Cerner Portugal, Unipessoal, Lda. (513269843)","73.900,00 €",29-03-2017,21-11-2016,730 dias,"Portugal, Castelo Branco, Covilhã","Artigo 20.º, n.º 1, alínea a) do Código dos Contratos Públicos",,"73.900,00 €",,,,Não aplicável.,Não aplicável.,FALSE
Aquisição de uma Unidade de Telemetria para Reabilitação Cardíaca,Ajuste Direto Regime Geral,Aquisição de bens móveis,"33123210-3, Aparelhos para monitorização cardíaca","Centro Hospitalar Cova da Beira, EPE (506361659)","Cardio Solutions, Lda. (507158865)","20.800,00 €",29-03-2017,10-03-2017,730 dias,"Portugal, Castelo Branco, Covilhã","Artigo 20.º, n.º 1, alínea a) do Código dos Contratos Públicos",,"",,,,Não aplicável.,Não aplicável.,FALSE
Aquisição de serviços médicos de anestesiologia,Ajuste Direto Regime Geral,Aquisição de serviços,"85121000-3, Serviços de prática médica","Centro Hospitalar Cova da Beira, E. P. E. (506361659)","Marco Dornelles Unipessoal, Lda. (510362656)","31.099,20 €",21-03-2017,29-04-2016,244 dias,"Portugal, Castelo Branco, Covilhã","Artigo 20.º, n.º 1, alínea a) do Código dos Contratos Públicos",,"",,,,Não aplicável.,Não aplicável.,FALSE
Aquisição de serviços de manutenção de tecnologias datacenter,Ajuste Direto Regime Geral,Aquisição de serviços,"72267100-0, Manutenção de software para as tecnologias da infomação","Centro Hospitalar Cova da Beira, EPE (506361659)","Iten Solutions - Sistemas de Informação, S.A. (510728189)","10.567,82 €",21-03-2017,05-12-2016,365 dias,"Portugal, Castelo Branco, Covilhã","Artigo 20.º, n.º 1, alínea a) do Código dos Contratos Públicos",,"",,,,Não aplicável.,Não aplicável.,FALSE
