Objeto do Contrato,Tipo de Procedimento,Tipo(s) de Contrato,CPVs,Entidade(s) Adjudicante(s),Entidade(s) Adjudicatária(s),Preço Contratual,Data de Publicação,Data de Celebração do Contrato,Prazo de Execução,Local de Execução,Fundamentação,Data de Fecho do Contrato,Preço Total Efetivo,Causas das Alterações ao Prazo,Causas das Alterações ao Preço,Estado,N.º registo do Acordo Quadro,Descrição do Acordo Quadro,Procedimento Centralizado
POLIURETANO SACROCOCCIGEO C/ REBORDO ADESIVADO 15X18,Ao abrigo de acordo-quadro (art.º 259.º),Aquisição de bens móveis,"33000000-0, Equipamento médico, medicamentos e produtos para cuidados pessoais","Administração Regional de Saúde do Alentejo, I. P. (503148768)","Paul Hartmann, Lda (502271728)","6.693,84 €",24-08-2016,09-06-2015,210 dias,"Portugal, Évora",Artigo 259.º do Código dos Contratos Públicos,31-12-2015,"6.693,84 €",,,,552526,"CONCURSO PÚBLICO PARA A CELEBRAÇÃO DE CONTRATOS PÚBLICOS DE APROVISIONAMENTO PARA A ÁREA DA SAÚDE, COM VISTA AO FORNECIMENTO DE DISPOSITIVOS MÉDICOS DIVERSOS",FALSE
ESPONJA GELATINA 80X50X10,Ao abrigo de acordo-quadro (art.º 259.º),Aquisição de bens móveis,"33000000-0, Equipamento médico, medicamentos e produtos para cuidados pessoais","Administração Regional de Saúde do Alentejo, I. P. (503148768)","Clinifar, S.A. (503281115)","1.490,00 €",24-08-2016,09-06-2015,210 dias,"Portugal, Évora",Artigo 259.º do Código dos Contratos Públicos,31-12-2015,"1.490,00 €",,,,552526,"CONCURSO PÚBLICO PARA A CELEBRAÇÃO DE CONTRATOS PÚBLICOS DE APROVISIONAMENTO PARA A ÁREA DA SAÚDE, COM VISTA AO FORNECIMENTO DE DISPOSITIVOS MÉDICOS DIVERSOS",FALSE
CARBOXIMETILCELULOSE SODICA 10X10 (HIDROFIBRA) CARBOXIMETILCELULOSE SODICA 15X15 (HIDROFIBRA) CARBOXIMETILCELULOSE SODICA COM PRATA 05X05 CARBOXIMETILCELULOSE SODICA COM PRATA 10X10,Ao abrigo de acordo-quadro (art.º 259.º),Aquisição de bens móveis,"33000000-0, Equipamento médico, medicamentos e produtos para cuidados pessoais","Administração Regional de Saúde do Alentejo, I. P. (503148768)","Kvtech Portugal - Prod.Médicos Unipessoal,Lda. (508671531)","34.575,00 €",24-08-2016,18-06-2015,210 dias,"Portugal, Évora",Artigo 259.º do Código dos Contratos Públicos,31-12-2015,"34.575,00 €",,,,552526,"CONCURSO PÚBLICO PARA A CELEBRAÇÃO DE CONTRATOS PÚBLICOS DE APROVISIONAMENTO PARA A ÁREA DA SAÚDE, COM VISTA AO FORNECIMENTO DE DISPOSITIVOS MÉDICOS DIVERSOS",FALSE
BOLSA TERMOSOLDADA PARA ESTERILIZACAO A VAPOR 200 X 400,Ao abrigo de acordo-quadro (art.º 259.º),Aquisição de bens móveis,"33000000-0, Equipamento médico, medicamentos e produtos para cuidados pessoais","Administração Regional de Saúde do Alentejo, I. P. (503148768)",BASTOS VIEGAS SA (500042772),"123,00 €",24-08-2016,10-12-2015,20 dias,"Portugal, Évora",Artigo 259.º do Código dos Contratos Públicos,31-12-2015,"123,00 €",,,,540623,"CONCURSO PÚBLICO PARA A CELEBRAÇÃO DE CONTRATOS PÚBLICOS DE APROVISIONAMENTO PARA A ÁREA DA SAÚDE, COM VISTA AO FORNECIMENTO DE MATERIAL DISPOSABLE DE BLOCO OPERATÓRIO - PARTE 3, ÀS INSTITUIÇÕES E SERVIÇOS DO SERVIÇO NACIONAL DE SAÚDE",FALSE
MANGA MISTA EM ROLO  PARA ESTERILIZACAO 10 MANGA MISTA EM ROLO  PARA ESTERILIZACAO 20,Ao abrigo de acordo-quadro (art.º 259.º),Aquisição de bens móveis,"33000000-0, Equipamento médico, medicamentos e produtos para cuidados pessoais","Administração Regional de Saúde do Alentejo, I. P. (503148768)",Helder Gonçalves (503855421),"1.783,20 €",24-08-2016,10-12-2015,20 dias,"Portugal, Évora",Artigo 259.º do Código dos Contratos Públicos,31-12-2015,"1.783,20 €",,,,540623,"CONCURSO PÚBLICO PARA A CELEBRAÇÃO DE CONTRATOS PÚBLICOS DE APROVISIONAMENTO PARA A ÁREA DA SAÚDE, COM VISTA AO FORNECIMENTO DE MATERIAL DISPOSABLE DE BLOCO OPERATÓRIO - PARTE 3, ÀS INSTITUIÇÕES E SERVIÇOS DO SERVIÇO NACIONAL DE SAÚDE",FALSE
Testes Rápidos VIH,Ao abrigo de acordo-quadro (art.º 259.º),Aquisição de bens móveis,"33000000-0, Equipamento médico, medicamentos e produtos para cuidados pessoais","Administração Regional de Saúde do Alentejo, I. P. (503148768)","ALERE,LDA (502518863)","741,00 €",24-08-2016,22-06-2015,120 dias,"Portugal, Évora",Artigo 259.º do Código dos Contratos Públicos,31-12-2015,"741,00 €",,,,611510,"CONCURSO PÚBLICO PARA A CELEBRAÇÃO DE CONTRATOS PÚBLICOS DE APROVISIONAMENTO PARA A ÁREA DA SAÚDE, COM VISTA AO FORNECIMENTO DE MATERIAL DE PREVENÇÃO E DETEÇÃO HIV ÀS INSTITUIÇÕES E SERVIÇOS DO SERVIÇO NACIONAL DE SAÚDE",FALSE
Resguardos 60 x 60,Ao abrigo de acordo-quadro (art.º 259.º),Aquisição de bens móveis,"33000000-0, Equipamento médico, medicamentos e produtos para cuidados pessoais","Administração Regional de Saúde do Alentejo, I. P. (503148768)","Medline international Portugal, Unipessoal, Lda. (510533515)","656,00 €",24-08-2016,10-12-2015,20 dias,"Portugal, Évora",Artigo 259.º do Código dos Contratos Públicos,31-12-2015,"656,00 €",,,,1210117,"CONCURSO PÚBLICO PARA A CELEBRAÇÃO DE CONTRATOS PÚBLICOS DE APROVISIONAMENTO PARA A ÁREA DA SAÚDE, COM VISTA AO FORNECIMENTO DE MATERIAL DE INCONTINENCIA E ALIVIO DE PRESSÃO, ÀS INSTITUIÇÕES E SERVIÇOS DO SERVIÇO NACIONAL DE SAÚDE",FALSE
"MANGA MISTA EM ROLO  PARA ESTERILIZACAO  7,5 MANGA MISTA EM ROLO  PARA ESTERILIZACAO 10 ",Ao abrigo de acordo-quadro (art.º 259.º),Aquisição de bens móveis,"33000000-0, Equipamento médico, medicamentos e produtos para cuidados pessoais","Administração Regional de Saúde do Alentejo, I. P. (503148768)",Helder Gonçalves (503855421),"200,76 €",24-08-2016,11-03-2015,280 dias,"Portugal, Évora",Artigo 259.º do Código dos Contratos Públicos,31-12-2015,"200,76 €",,,,540623,"CONCURSO PÚBLICO PARA A CELEBRAÇÃO DE CONTRATOS PÚBLICOS DE APROVISIONAMENTO PARA A ÁREA DA SAÚDE, COM VISTA AO FORNECIMENTO DE MATERIAL DISPOSABLE DE BLOCO OPERATÓRIO - PARTE 3, ÀS INSTITUIÇÕES E SERVIÇOS DO SERVIÇO NACIONAL DE SAÚDE",FALSE
TESTE DE ESTERILIZACAO BOWIE DICK BOLSA TERMOSOLDADA PARA ESTERILIZACAO A VAPOR 200 X 400 BOLSA TERMOSOLDADA  PARA ESTERILIZACAO A VAPOR 250 X 500,Ao abrigo de acordo-quadro (art.º 259.º),Aquisição de bens móveis,"33000000-0, Equipamento médico, medicamentos e produtos para cuidados pessoais","Administração Regional de Saúde do Alentejo, I. P. (503148768)","BASTOS VIEGAS, S.A. (500042772)","1.428,00 €",24-08-2016,20-04-2015,280 dias,"Portugal, Évora",Artigo 259.º do Código dos Contratos Públicos,31-12-2015,"1.428,00 €",,,,540623,"CONCURSO PÚBLICO PARA A CELEBRAÇÃO DE CONTRATOS PÚBLICOS DE APROVISIONAMENTO PARA A ÁREA DA SAÚDE, COM VISTA AO FORNECIMENTO DE MATERIAL DISPOSABLE DE BLOCO OPERATÓRIO - PARTE 3, ÀS INSTITUIÇÕES E SERVIÇOS DO SERVIÇO NACIONAL DE SAÚDE",FALSE
TAMPA UNIVERSAL P CATETER E PROLONGAMENTO DE CATETER PERFURADOR DE TRANSFERÊNCIA DUPLO PROLONGAMENTO MACHO/FEMEA 25 CM SISTEMA DE TORNEIRAS DE 3 VIAS COM PROLOGAMENTO,Ao abrigo de acordo-quadro (art.º 259.º),Aquisição de bens móveis,"33000000-0, Equipamento médico, medicamentos e produtos para cuidados pessoais","Administração Regional de Saúde do Alentejo, I. P. (503148768)",Pergut Portugal (501799729),"374,50 €",24-08-2016,24-03-2015,280 dias,"Portugal, Évora",Artigo 259.º do Código dos Contratos Públicos,31-12-2015,"374,50 €",,,,1212278,"CONCURSO PÚBLICO PARA A CELEBRAÇÃO DE CONTRATOS PÚBLICOS DE APROVISIONAMENTO PARA A ÁREA DA SAÚDE, COM VISTA AO FORNECIMENTO DE CATETERES, ÀS INSTITUIÇÕES E SERVIÇOS DO SERVIÇO NACIONAL DE SAÚDE",FALSE
CATETER IRRECUPERAVEL PARA VENOPUNCAO C/SISTEMA D SEGURANCA 18 G CATETER IRRECUPERAVEL PARA VENOPUNCAO C/SISTEMA D SEGURANCA 20 G CATETER IRRECUPERAVEL PARA VENOPUNCAO C/SISTEMA D SEGURANCA 22 G CATETER IRRECUPERAVEL PARA VENOPUNCAO C/SISTEMA D SEGURANCA 24 G,Ao abrigo de acordo-quadro (art.º 259.º),Aquisição de bens móveis,"33000000-0, Equipamento médico, medicamentos e produtos para cuidados pessoais","Administração Regional de Saúde do Alentejo, I. P. (503148768)","Smiths Medical ( Portugal), Unipessoal Lda (507445937)","7.100,00 €",24-08-2016,24-03-2015,280 dias,"Portugal, Évora",Artigo 259.º do Código dos Contratos Públicos,31-12-2015,"7.100,00 €",,,,1212278,"CONCURSO PÚBLICO PARA A CELEBRAÇÃO DE CONTRATOS PÚBLICOS DE APROVISIONAMENTO PARA A ÁREA DA SAÚDE, COM VISTA AO FORNECIMENTO DE CATETERES, ÀS INSTITUIÇÕES E SERVIÇOS DO SERVIÇO NACIONAL DE SAÚDE",FALSE
LUVA EXAME EM NITRILO NÃO ESTÉRIL  AQL 1 (S/ LATEX E S/ PÓ) TAM. S (par) LUVA EXAME  EM NITRILO NÃO ESTÉRIL  AQL 1 (S/ LATEX E S/ PÓ) TAM. M (par) LUVA EXAME EM NITRILO NÃO ESTÉRIL  AQL 1 (S/ LATEX E S/ PÓ) TAM. L (par),Ao abrigo de acordo-quadro (art.º 259.º),Aquisição de bens móveis,"33000000-0, Equipamento médico, medicamentos e produtos para cuidados pessoais","Administração Regional de Saúde do Alentejo, I. P. (503148768)","DOCWORLD, Lda (508592909)","15.535,00 €",23-08-2016,11-03-2015,280 dias,"Portugal, Évora",Artigo 259.º do Código dos Contratos Públicos,31-12-2015,"15.535,00 €",,,,544071,"CONCURSO PÚBLICO PARA A CELEBRAÇÃO DE CONTRATOS PÚBLICOS DE APROVISIONAMENTO PARA A ÁREA DA SAÚDE, COM VISTA AO FORNECIMENTO DE LUVAS PARA USO MÉDICO, ÀS INSTITUIÇÕES E SERVIÇOS DO SERVIÇO NACIONAL DE SAÚDE",FALSE
"LUVA CIRURGICA LATEX ESTÉRIL SEM PÓ, AQL 1, N.6,5; PAR LUVA CIRURGICA LATEX ESTÉRIL SEM PÓ, AQL 1, N.7; PAR LUVA CIRURGICA LATEX ESTÉRIL SEM PÓ, AQL 1, N.7,5; PAR ",Ao abrigo de acordo-quadro (art.º 259.º),Aquisição de bens móveis,"33000000-0, Equipamento médico, medicamentos e produtos para cuidados pessoais","Administração Regional de Saúde do Alentejo, I. P. (503148768)","Medline international Portugal, Unipessoal, Lda. (510533515)","3.102,00 €",23-08-2016,20-04-2015,280 dias,"Portugal, Évora",Artigo 259.º do Código dos Contratos Públicos,31-12-2015,"3.102,00 €",,,,544071,"CONCURSO PÚBLICO PARA A CELEBRAÇÃO DE CONTRATOS PÚBLICOS DE APROVISIONAMENTO PARA A ÁREA DA SAÚDE, COM VISTA AO FORNECIMENTO DE LUVAS PARA USO MÉDICO, ÀS INSTITUIÇÕES E SERVIÇOS DO SERVIÇO NACIONAL DE SAÚDE",FALSE
Aquisição de consumíveis Cobas e Reflotron,Ajuste Direto Regime Geral,Aquisição de bens móveis,"33000000-0, Equipamento médico, medicamentos e produtos para cuidados pessoais","Administração Regional de Saúde do Alentejo, I. P. (503148768)","ROCHE SISTEMAS DE DIAGNOSTICOS, LDA   (504282921)","5.320,81 €",23-08-2016,01-04-2015,250 dias,"Portugal, Faro","Artigo 24.º, n.º 1, alínea e) do Código dos Contratos Públicos",31-12-2015,"5.320,81 €",,,,Não aplicável.,Não aplicável.,FALSE
CARBOXIMETILCELULOSE SODICA 10X10 (HIDROFIBRA) CARBOXIMETILCELULOSE SODICA 15X15 (HIDROFIBRA) CARBOXIMETILCELULOSE SODICA COM PRATA 10X10,Ao abrigo de acordo-quadro (art.º 259.º),Aquisição de bens móveis,"33000000-0, Equipamento médico, medicamentos e produtos para cuidados pessoais","Administração Regional de Saúde do Alentejo, I. P. (503148768)",KVTECH PORTUGAL - PRODUTOS MEDICOS UNIP (508671531),"15.292,00 €",23-08-2016,26-11-2015,19 dias,"Portugal, Évora",Artigo 259.º do Código dos Contratos Públicos,31-12-2015,"15.292,00 €",,,,1315192,Acordo Quadro para fornecimento de material de penso de efeito terapêutico às Instituições e Serviços do Serviço Nacional de Saúde,FALSE
COMPRESSA DE MALHA N/ADERENTE C/PETROLATO LIQUIDO 7.6X7.6,Ao abrigo de acordo-quadro (art.º 259.º),Aquisição de bens móveis,"33000000-0, Equipamento médico, medicamentos e produtos para cuidados pessoais","Administração Regional de Saúde do Alentejo, I. P. (503148768)","Covidien Portugal - Produtos de Saúde, Unipessoal, Lda (503413410)","210,60 €",23-08-2016,26-11-2015,19 dias,"Portugal, Évora",Artigo 259.º do Código dos Contratos Públicos,31-12-2015,"210,60 €",,,,1315192,Acordo Quadro para fornecimento de material de penso de efeito terapêutico às Instituições e Serviços do Serviço Nacional de Saúde,FALSE
"POLIURETANO C/ REBORDO ADESIVADO 14,5X14,5  ",Ao abrigo de acordo-quadro (art.º 259.º),Aquisição de bens móveis,"33000000-0, Equipamento médico, medicamentos e produtos para cuidados pessoais","Administração Regional de Saúde do Alentejo, I. P. (503148768)","Clinifar, S.A. (503281115)","524,00 €",23-08-2016,26-11-2015,19 dias,"Portugal, Évora",Artigo 259.º do Código dos Contratos Públicos,31-12-2015,"524,00 €",,,,1315192,Acordo Quadro para fornecimento de material de penso de efeito terapêutico às Instituições e Serviços do Serviço Nacional de Saúde,FALSE
Aquisição de 33 Seguros Automóvel para as viaturas da ARSA,Ajuste Direto Regime Geral,Aquisição de serviços,"66516100-1, Serviços de seguros de responsabilidade civil para automóveis","Administração Regional de Saúde do Alentejo, I. P. (503148768)","João Mata, Lda. (500150141)","3.822,00 €",22-08-2016,02-08-2016,365 dias,"Portugal, Évora","Artigo 20.º, n.º 1, alínea a) do Código dos Contratos Públicos",10-08-2016,"3.822,00 €",,,,Não aplicável.,Não aplicável.,FALSE
