freguesia,acronym,validVotesPercentage,votes,dicofre
Sabugueiro,PS,42.5,85,091210
Sabugueiro,PPD/PSD,19,38,091210
Sabugueiro,B.E.,14,28,091210
Sabugueiro,PCP-PEV,10,20,091210
Sabugueiro,CH,5.5,11,091210
Sabugueiro,CDS-PP,3.5,7,091210
Sabugueiro,PCTP/MRPP,1.5,3,091210
Sabugueiro,IL,1,2,091210
Sabugueiro,PAN,1,2,091210
Sabugueiro,R.I.R.,1,2,091210
Sabugueiro,A,0.5,1,091210
Sabugueiro,PDR,0.5,1,091210
Sabugueiro,L,0,0,091210
Sabugueiro,MPT,0,0,091210
Sabugueiro,NC,0,0,091210
Sabugueiro,PNR,0,0,091210
Sabugueiro,PPM,0,0,091210
Sabugueiro,PTP,0,0,091210
Sabugueiro,PURP,0,0,091210
