Objeto do Contrato,Tipo de Procedimento,Tipo(s) de Contrato,CPVs,Entidade(s) Adjudicante(s),Entidade(s) Adjudicatária(s),Preço Contratual,Data de Publicação,Data de Celebração do Contrato,Prazo de Execução,Local de Execução,Fundamentação,Data de Fecho do Contrato,Preço Total Efetivo,Causas das Alterações ao Prazo,Causas das Alterações ao Preço,Estado,N.º registo do Acordo Quadro,Descrição do Acordo Quadro,Procedimento Centralizado
Aquisição de 30 frascos de Vacina BCG,Ao abrigo de acordo-quadro (art.º 258.º),Aquisição de bens móveis,"33651600-4, Vacinas","Administração Regional de Saúde do Norte, I.P. (503135593)","J.M. Farmacêutiva, S.A. (503550558)","267,00 €",09-09-2011,25-08-2011,13 dias,"Portugal, Braga",Artigo 258.º do Código dos Contratos Públicos,"","",,,,Não definido.,Não definido.,
"Aquisição de Aquisição Eq. Medico-Cirurgico, Mob Hospitalar para diversas Unidades de Saúde",Ajuste Direto Regime Geral,Aquisição de bens móveis,"33100000-1, Equipamento médico","Administração Regional de Saúde do Norte, I.P. (503135593)","Só Saúde - José Arantes Amorim, Unipessoal Lda (508055180)","32.487,36 €",05-09-2011,25-08-2011,20 dias,"Portugal, Braga, Vila Verde<BR/>Portugal, Braga, Braga<BR/>Portugal, Braga, Barcelos","Artigo 20.º, n.º 1, alínea a) do Código dos Contratos Públicos",14-09-2011,"32.487,36 €",,,,Não aplicável.,Não aplicável.,
