Objeto do Contrato,Tipo de Procedimento,Tipo(s) de Contrato,CPVs,Entidade(s) Adjudicante(s),Entidade(s) Adjudicatária(s),Preço Contratual,Data de Publicação,Data de Celebração do Contrato,Prazo de Execução,Local de Execução,Fundamentação,Data de Fecho do Contrato,Preço Total Efetivo,Causas das Alterações ao Prazo,Causas das Alterações ao Preço,Estado,N.º registo do Acordo Quadro,Descrição do Acordo Quadro,Procedimento Centralizado
REPARAÇAO RX PORTATIL PRATIX PLUS 100,Ajuste Direto Regime Geral,Aquisição de serviços,"50000000-5, Serviços de reparação e manutenção","Unidade Local de Saúde do Nordeste, E. P. E. (509932584)",PHILIPS (500216843),"8.887,34 €",20-05-2015,15-01-2015,150 dias,"Portugal, Braganca, Bragança","Artigo 20.º, n.º 1, alínea a) do Código dos Contratos Públicos",04-05-2015,"8.887,34 €",,,,Não aplicável.,Não aplicável.,FALSE
REPARAÇAO INTENSIFICADOR IMAGEM BV 300,Ajuste Direto Regime Geral,Aquisição de serviços,"50000000-5, Serviços de reparação e manutenção","Unidade Local de Saúde do Nordeste, E. P. E. (509932584)",PHILIPS (500216843),"11.508,00 €",20-05-2015,09-05-2014,240 dias,"Portugal, Braganca, Bragança","Artigo 20.º, n.º 1, alínea a) do Código dos Contratos Públicos",31-12-2014,"11.508,00 €",,,,Não aplicável.,Não aplicável.,FALSE
REVISAO DAS UPS,Ajuste Direto Regime Geral,Aquisição de serviços,"50000000-5, Serviços de reparação e manutenção","Unidade Local de Saúde do Nordeste, E. P. E. (509932584)",SUCH (500900469),"12.716,25 €",20-05-2015,31-12-2014,240 dias,"Portugal, Braganca, Bragança","Artigo 20.º, n.º 1, alínea a) do Código dos Contratos Públicos",31-12-2014,"12.716,25 €",,,,Não aplicável.,Não aplicável.,FALSE
Ventilador,Ajuste Direto Regime Geral,Aquisição de bens móveis,"33000000-0, Equipamento médico, medicamentos e produtos para cuidados pessoais","Unidade Local de Saúde do Nordeste, E. P. E. (509932584)",Medicinalia Cormedica (500684324),"27.160,00 €",19-05-2015,16-04-2015,90 dias,"Portugal, Braganca, Bragança","Artigo 20.º, n.º 1, alínea a) do Código dos Contratos Públicos",31-12-2015,"27.160,00 €",,,,Não aplicável.,Não aplicável.,FALSE
Gerador de Dioxido de Cloro,Ajuste Direto Regime Geral,Aquisição de bens móveis,"31120000-3, Geradores","Unidade Local de Saúde do Nordeste, E. P. E. (509932584)",WsterCare (506550672),"17.366,00 €",19-05-2015,06-05-2015,60 dias,"Portugal, Braganca, Bragança","Artigo 20.º, n.º 1, alínea a) do Código dos Contratos Públicos",31-12-2015,"17.366,00 €",,,,Não aplicável.,Não aplicável.,FALSE
Colocação de Pala em Vidro,Ajuste Direto Regime Geral,Concessão de obras públicas,"45440000-3, Pintura e colocação de vidros","Unidade Local de Saúde do Nordeste, E. P. E. (509932584)",Vidraria Brigantina (501586849),"7.880,00 €",19-05-2015,04-03-2015,30 dias,"Portugal, Braganca, Bragança","Artigo 19.º, alínea a) do Código dos Contratos Públicos","","",,,,Não aplicável.,Não aplicável.,FALSE
Reagentes para Coagulação,Concurso público,Aquisição de bens móveis,"33696500-0, Reagentes de laboratório","Unidade Local de Saúde do Nordeste, E. P. E (509932584)",werfen (501086110),"54.459,29 €",19-05-2015,30-04-2015,245 dias,"Portugal, Braganca, Bragança","Artigo 20.º, n.º 1, alínea b) do Código dos Contratos Públicos",31-12-2015,"54.459,29 €",,,,Não aplicável.,Não aplicável.,FALSE
Aquisição de camas,Ajuste Direto Regime Geral,Aquisição de bens móveis,"33192100-3, Camas para medicina","Unidade Local de Saúde do Nordeste, E. P. E. (509932584)",Bramedica (508560152),"7.227,80 €",18-05-2015,17-03-2015,30 dias,"Portugal, Braganca, Bragança","Artigo 20.º, n.º 1, alínea a) do Código dos Contratos Públicos",31-12-2015,"7.227,80 €",,,,Não aplicável.,Não aplicável.,FALSE
Obras de Beneficiação no Bloco Operatório,Ajuste Direto Regime Geral,Concessão de obras públicas,"45200000-9, Obras de construção total ou parcial e de engenharia civil","Unidade Local de Saúde do Nordeste, E. P. E. (509932584)",Imotua (503593508),"9.613,84 €",15-05-2015,13-01-2015,30 dias,"Portugal, Braganca, Bragança","Artigo 19.º, alínea a) do Código dos Contratos Públicos","","",,,,Não aplicável.,Não aplicável.,FALSE
REPARAÇAO MAMOGRAFO PHILIPS,Ajuste Direto Regime Geral,Aquisição de serviços,"50000000-5, Serviços de reparação e manutenção","Unidade Local de Saúde do Nordeste, E. P. E. (509932584)",PHILIPS (500216843),"5.594,00 €",15-05-2015,05-06-2014,200 dias,"Portugal, Braganca, Bragança","Artigo 20.º, n.º 1, alínea a) do Código dos Contratos Públicos",31-12-2014,"5.594,00 €",,,,Não aplicável.,Não aplicável.,FALSE
Climatização no novo espaço dos Cuidados Intensivos,Ajuste Direto Regime Geral,Aquisição de bens móveis,"42512000-8, Instalações de ar condicionado","Unidade Local de Saúde do Nordeste, E. P. E. (509932584)",Mecatermica (504854674),"34.258,90 €",15-05-2015,29-01-2015,60 dias,"Portugal, Braganca, Bragança","Artigo 20.º, n.º 1, alínea a) do Código dos Contratos Públicos","","",,,,Não aplicável.,Não aplicável.,FALSE
REPARAÇAO CHILLER WESPER,Ajuste Direto Regime Geral,Aquisição de serviços,"50000000-5, Serviços de reparação e manutenção","Unidade Local de Saúde do Nordeste, E. P. E. (509932584)",MECATERMICA (504854674),"9.210,00 €",15-05-2015,05-03-2014,290 dias,"Portugal, Braganca, Bragança","Artigo 20.º, n.º 1, alínea a) do Código dos Contratos Públicos",05-03-2014,"9.210,00 €",,,,Não aplicável.,Não aplicável.,FALSE
REVISAO DAS CAMAS,Ajuste Direto Regime Geral,Aquisição de serviços,"50000000-5, Serviços de reparação e manutenção","Unidade Local de Saúde do Nordeste, E. P. E. (509932584)",MUNDINTER (500199906),"6.109,48 €",15-05-2015,11-11-2014,50 dias,"Portugal, Braganca, Bragança","Artigo 20.º, n.º 1, alínea a) do Código dos Contratos Públicos",31-12-2014,"6.109,48 €",,,,Não aplicável.,Não aplicável.,FALSE
AQUISIÇAO AMPOLA,Ajuste Direto Regime Geral,Aquisição de bens móveis,"33111000-1, Aparelhos para radiologia","Unidade Local de Saúde do Nordeste, E. P. E. (509932584)",PHILIPS (500216843),"16.536,76 €",15-05-2015,14-07-2014,170 dias,"Portugal, Braganca, Bragança","Artigo 20.º, n.º 1, alínea a) do Código dos Contratos Públicos",31-12-2014,"16.536,76 €",,,,Não aplicável.,Não aplicável.,FALSE
