freguesia,acronym,validVotesPercentage,votes,dicofre
Carvoeiro,PPD/PSD.CDS-PP,46.96,108,141304
Carvoeiro,PS,36.09,83,141304
Carvoeiro,PCP-PEV,4.78,11,141304
Carvoeiro,MPT,3.91,9,141304
Carvoeiro,B.E.,3.04,7,141304
Carvoeiro,PTP,1.3,3,141304
Carvoeiro,L,0.87,2,141304
Carvoeiro,PCTP/MRPP,0.87,2,141304
Carvoeiro,MAS,0.43,1,141304
Carvoeiro,PAN,0.43,1,141304
Carvoeiro,PDA,0.43,1,141304
Carvoeiro,PND,0.43,1,141304
Carvoeiro,PPM,0.43,1,141304
Carvoeiro,PNR,0,0,141304
Carvoeiro,POUS,0,0,141304
Carvoeiro,PPV,0,0,141304
