Objeto do Contrato,Tipo de Procedimento,Tipo(s) de Contrato,CPVs,Entidade(s) Adjudicante(s),Entidade(s) Adjudicatária(s),Preço Contratual,Data de Publicação,Data de Celebração do Contrato,Prazo de Execução,Local de Execução,Fundamentação,Data de Fecho do Contrato,Preço Total Efetivo,Causas das Alterações ao Prazo,Causas das Alterações ao Preço,Estado,N.º registo do Acordo Quadro,Descrição do Acordo Quadro,Procedimento Centralizado
AQUISIÇÃO E INSTALAÇÃO DE UM LASER DE FOTOCOAGULAÇÃO PASCAL,Ajuste Direto Regime Geral,Aquisição de bens móveis,"33169100-3, Laser cirúrgico","Hospital Professor Doutor Fernando Fonseca, E. P. E. (503035416)",Lusopalex (503531588),"81.300,00 €",21-09-2018,10-09-2018,30 dias,"Portugal, Lisboa, Amadora","Artigo 24.º, n.º 1, alínea e), subalínea ii) do Código dos Contratos Públicos",,,,,,Não aplicável.,Não aplicável.,FALSE
Empreitada para reestruturação do SNL-UNGC,Consulta Prévia,Empreitadas de obras públicas,"45000000-7, Construção","Hospital Professor Doutor Fernando Fonseca, E. P. E. (503035416)","Socodefil – Sociedade de Construções Manuel Delgado & Filhos, Lda. (500742219)","19.875,01 €",19-09-2018,14-09-2018,20 dias,"Portugal, Lisboa, Amadora","Artigo 19.º, alínea c) do Código dos Contratos Públicos",,,,,,Não aplicável.,Não aplicável.,FALSE
