freguesia,acronym,validVotesPercentage,votes,dicofre
Sobral de São Miguel,PPD/PSD.CDS-PP,41.42,70,050322
Sobral de São Miguel,PS,33.14,56,050322
Sobral de São Miguel,PCP-PEV,7.1,12,050322
Sobral de São Miguel,MPT,4.14,7,050322
Sobral de São Miguel,B.E.,2.96,5,050322
Sobral de São Miguel,PCTP/MRPP,2.96,5,050322
Sobral de São Miguel,PND,1.78,3,050322
Sobral de São Miguel,PTP,1.78,3,050322
Sobral de São Miguel,L,1.18,2,050322
Sobral de São Miguel,MAS,1.18,2,050322
Sobral de São Miguel,PPV,1.18,2,050322
Sobral de São Miguel,PAN,0.59,1,050322
Sobral de São Miguel,PPM,0.59,1,050322
Sobral de São Miguel,PDA,0,0,050322
Sobral de São Miguel,PNR,0,0,050322
Sobral de São Miguel,POUS,0,0,050322
