freguesia,acronym,validVotesPercentage,votes,dicofre
Sampriz,PPD/PSD.CDS-PP,47.32,53,160619
Sampriz,PS,34.82,39,160619
Sampriz,PCP-PEV,3.57,4,160619
Sampriz,L,2.68,3,160619
Sampriz,MPT,2.68,3,160619
Sampriz,B.E.,1.79,2,160619
Sampriz,PPM,1.79,2,160619
Sampriz,PTP,1.79,2,160619
Sampriz,PCTP/MRPP,0.89,1,160619
Sampriz,PND,0.89,1,160619
Sampriz,POUS,0.89,1,160619
Sampriz,PPV,0.89,1,160619
Sampriz,MAS,0,0,160619
Sampriz,PAN,0,0,160619
Sampriz,PDA,0,0,160619
Sampriz,PNR,0,0,160619
