freguesia,acronym,validVotesPercentage,votes,dicofre
Santalha,PPD/PSD,45.83,33,041221
Santalha,PS,41.67,30,041221
Santalha,CDS-PP,2.78,2,041221
Santalha,PURP,2.78,2,041221
Santalha,B.E.,1.39,1,041221
Santalha,PAN,1.39,1,041221
Santalha,PCP-PEV,1.39,1,041221
Santalha,PDR,1.39,1,041221
Santalha,PTP,1.39,1,041221
Santalha,A,0,0,041221
Santalha,IL,0,0,041221
Santalha,L,0,0,041221
Santalha,MAS,0,0,041221
Santalha,NC,0,0,041221
Santalha,PCTP/MRPP,0,0,041221
Santalha,PNR,0,0,041221
Santalha,PPM.PPV/CDC,0,0,041221
