Objeto do Contrato,Tipo de Procedimento,Tipo(s) de Contrato,CPVs,Entidade(s) Adjudicante(s),Entidade(s) Adjudicatária(s),Preço Contratual,Data de Publicação,Data de Celebração do Contrato,Prazo de Execução,Local de Execução,Fundamentação,Data de Fecho do Contrato,Preço Total Efetivo,Causas das Alterações ao Prazo,Causas das Alterações ao Preço,Estado,N.º registo do Acordo Quadro,Descrição do Acordo Quadro,Procedimento Centralizado
"Prestação de serviços para divulgação de um spot áudio com duração de 20 segundos no Grupo Rádio Renascença, referente à campanha de publicidade do Plano Inverno & Saúde",Ajuste Direto Regime Geral,Aquisição de serviços,"92210000-6, Serviços de rádio",Direcção-Geral da Saúde (DGS) (600037100),"Intervoz Publicidade, SA (500140871)","9.998,00 €",30-12-2016,30-12-2016,30 dias,"Portugal, Lisboa","Artigo 20.º, n.º 1, alínea a) do Código dos Contratos Públicos",,,,,,Não aplicável.,Não aplicável.,FALSE
Prestação de serviços para exposição de vídeos da campanha “Eu Fumo Tu Fumas” na rede de cinemas NOS,Ajuste Direto Regime Geral,Aquisição de serviços,"79900000-3, Serviços empresariais diversos e afins",Direcção-Geral da Saúde (DGS) (600037100),"NOSPUB, Publicidade e Conteúdos, SA (504311115)","9.984,00 €",30-12-2016,22-12-2016,15 dias,"Portugal, Lisboa","Artigo 20.º, n.º 1, alínea a) do Código dos Contratos Públicos",,,,,,Não aplicável.,Não aplicável.,FALSE
Aquisição de 10.000 testes rápidos de deteção VIH/SIDA de 3ª geração,Ajuste Direto Regime Geral,Aquisição de bens móveis,"33000000-0, Equipamento médico, medicamentos e produtos para cuidados pessoais",Direção-Geral da Saúde (600037100),Biomérieux Portugal Ldª (501524177),"11.800,00 €",28-12-2016,20-08-2015,120 dias,"Portugal, Lisboa","Artigo 20.º, n.º 1, alínea a) do Código dos Contratos Públicos",,,,,,Não aplicável.,Não aplicável.,FALSE
