Objeto do Contrato,Tipo de Procedimento,Tipo(s) de Contrato,CPVs,Entidade(s) Adjudicante(s),Entidade(s) Adjudicatária(s),Preço Contratual,Data de Publicação,Data de Celebração do Contrato,Prazo de Execução,Local de Execução,Fundamentação,Data de Fecho do Contrato,Preço Total Efetivo,Causas das Alterações ao Prazo,Causas das Alterações ao Preço,Estado,N.º registo do Acordo Quadro,Descrição do Acordo Quadro,Procedimento Centralizado
Aquisição de Medicamentos Antipsicóticos ao abrigo do acordo quadro Nº2016/019,Ao abrigo de acordo-quadro (art.º 259.º),Aquisição de bens móveis,"33600000-6, Produtos farmacêuticos","Centro Hospitalar de Entre o Douro e Vouga, E.P.E. (508878462)","Janssen Cilag Farmacêutica, Lda (500189412)","183.075,60 €",12-03-2018,24-01-2018,340 dias,"Portugal, Aveiro, Santa Maria da Feira",Artigo 259.º do Código dos Contratos Públicos,,,,,,2356543,CP 2016/19 - Medicamentos Antipsicóticos,FALSE
Aquisição de Medicamentos Antipsicóticos ao abrigo do acordo quadro Nº2016/019,Ao abrigo de acordo-quadro (art.º 259.º),Aquisição de bens móveis,"33600000-6, Produtos farmacêuticos","Centro Hospitalar de Entre o Douro e Vouga, E.P.E. (508878462)","TECNIMEDE, SA (500626413)","163,60 €",12-03-2018,24-01-2018,340 dias,"Portugal, Aveiro, Santa Maria da Feira",Artigo 259.º do Código dos Contratos Públicos,,,,,,2356543,CP 2016/19 - Medicamentos Antipsicóticos,FALSE
Aquisição de Medicamentos Antipsicóticos ao abrigo do acordo quadro Nº2016/019,Ao abrigo de acordo-quadro (art.º 259.º),Aquisição de bens móveis,"33600000-6, Produtos farmacêuticos","Centro Hospitalar de Entre o Douro e Vouga, E.P.E. (508878462)","SANOFI - PRODUTOS FARMACEUTICOS , LDA (500134960)","1.043,56 €",12-03-2018,24-01-2018,340 dias,"Portugal, Aveiro, Santa Maria da Feira",Artigo 259.º do Código dos Contratos Públicos,,,,,,2356543,CP 2016/19 - Medicamentos Antipsicóticos,FALSE
Aquisição de Medicamentos Antipsicóticos ao abrigo do acordo quadro Nº2016/019,Ao abrigo de acordo-quadro (art.º 259.º),Aquisição de bens móveis,"33600000-6, Produtos farmacêuticos","Centro Hospitalar de Entre o Douro e Vouga, E.P.E. (508878462)",RATIOPHARMA (502414910),"6.400,00 €",12-03-2018,24-01-2018,340 dias,"Portugal, Aveiro, Santa Maria da Feira",Artigo 259.º do Código dos Contratos Públicos,,,,,,2356543,CP 2016/19 - Medicamentos Antipsicóticos,FALSE
Aquisição de Medicamentos Antipsicóticos ao abrigo do acordo quadro Nº2016/019,Ao abrigo de acordo-quadro (art.º 259.º),Aquisição de bens móveis,"33600000-6, Produtos farmacêuticos","Centro Hospitalar de Entre o Douro e Vouga, E.P.E. (508878462)",PROFARIN-DIST.PROD.FARM.IND. (500223238),"9,58 €",12-03-2018,24-01-2018,340 dias,"Portugal, Aveiro, Santa Maria da Feira",Artigo 259.º do Código dos Contratos Públicos,,,,,,2356543,CP 2016/19 - Medicamentos Antipsicóticos,FALSE
Aquisição de Medicamentos Antipsicóticos ao abrigo do acordo quadro Nº2016/019,Ao abrigo de acordo-quadro (art.º 259.º),Aquisição de bens móveis,"33600000-6, Produtos farmacêuticos","Centro Hospitalar de Entre o Douro e Vouga, E.P.E. (508878462)",PHARMAKERN PORTUGAL PRDUTOS FARMACEUTICOS SOCIEDADE UNIPESSOAL LDA. (507002571),"225,95 €",12-03-2018,24-01-2018,340 dias,"Portugal, Aveiro, Santa Maria da Feira",Artigo 259.º do Código dos Contratos Públicos,,,,,,2356543,CP 2016/19 - Medicamentos Antipsicóticos,FALSE
Aquisição de Medicamentos Antipsicóticos ao abrigo do acordo quadro Nº2016/019,Ao abrigo de acordo-quadro (art.º 259.º),Aquisição de bens móveis,"33600000-6, Produtos farmacêuticos","Centro Hospitalar de Entre o Douro e Vouga, E.P.E. (508878462)",OVERPHARMA (505792362),"4.800,00 €",12-03-2018,24-01-2018,340 dias,"Portugal, Aveiro, Santa Maria da Feira",Artigo 259.º do Código dos Contratos Públicos,,,,,,2356543,CP 2016/19 - Medicamentos Antipsicóticos,FALSE
Aquisição de Medicamentos Antipsicóticos ao abrigo do acordo quadro Nº2016/019,Ao abrigo de acordo-quadro (art.º 259.º),Aquisição de bens móveis,"33600000-6, Produtos farmacêuticos","Centro Hospitalar de Entre o Douro e Vouga, E.P.E. (508878462)","LABESFAL-LABORATORIOS ALMIRO, SA (501169580)","23,14 €",12-03-2018,24-01-2018,340 dias,"Portugal, Aveiro, Santa Maria da Feira",Artigo 259.º do Código dos Contratos Públicos,,,,,,2356543,CP 2016/19 - Medicamentos Antipsicóticos,FALSE
Aquisição de Medicamentos Antipsicóticos ao abrigo do acordo quadro Nº2016/019,Ao abrigo de acordo-quadro (art.º 259.º),Aquisição de bens móveis,"33600000-6, Produtos farmacêuticos","Centro Hospitalar de Entre o Douro e Vouga, E.P.E. (508878462)","Generis Farmacêutica, SA: (508107997)","840,90 €",12-03-2018,24-01-2018,340 dias,"Portugal, Aveiro, Santa Maria da Feira",Artigo 259.º do Código dos Contratos Públicos,,,,,,2356543,CP 2016/19 - Medicamentos Antipsicóticos,FALSE
Aquisição de Medicamentos Antipsicóticos ao abrigo do acordo quadro Nº2016/019,Ao abrigo de acordo-quadro (art.º 259.º),Aquisição de bens móveis,"33600000-6, Produtos farmacêuticos","Centro Hospitalar de Entre o Douro e Vouga, E.P.E. (508878462)",Aurovitas Unipessoal Lda (513053239),"714,50 €",12-03-2018,24-01-2018,340 dias,"Portugal, Aveiro, Santa Maria da Feira",Artigo 259.º do Código dos Contratos Públicos,,,,,,2356543,CP 2016/19 - Medicamentos Antipsicóticos,FALSE
Aquisição de Prestação de Serviços de Transporte de Utentes - Lote 1,Ajuste Direto Regime Geral,Aquisição de serviços,"85000000-9, Serviços de saúde e acção social","Centro Hospitalar de Entre o Douro e Vouga, E.P.E. (508878462)","Transportes Força de Viver, Lda (508557372)","65.000,00 €",09-03-2018,20-12-2017,60 dias,"Portugal, Aveiro, Santa Maria da Feira","Artigo 20.º, n.º 1, alínea a) do Código dos Contratos Públicos",,,,,,Não aplicável.,Não aplicável.,FALSE
"LS_140326.622017 - Licenciamento, Contrato de Manutenção e Actualizações às Soluções do bHealth e do bHealth Flow instalados no CHEDV - ano 2017",Ajuste Direto Regime Geral,Aquisição de serviços,"72000000-5, Serviços de TI: consultoria, desenvolvimento de software, Internet e apoio","Centro Hospitalar de Entre o Douro e Vouga, E.P.E. (508878462)","Byme - Information technology, Lda (507790960)","10.575,00 €",09-03-2018,16-11-2017,365 dias,"Portugal, Aveiro, Santa Maria da Feira","Artigo 21.º, n.º 1, alínea a) do Código dos Contratos Públicos",,,,,,Não aplicável.,Não aplicável.,FALSE
Aquisição de prestação de serviços na área de Consultoria da Comunicação,Ajuste Direto Regime Geral,Aquisição de serviços,"72000000-5, Serviços de TI: consultoria, desenvolvimento de software, Internet e apoio","Centro Hospitalar de Entre o Douro e Vouga, E.P.E. (508878462)","GLOBIPROTEC Unipessoal, Lda (508194970)","21.000,00 €",06-03-2018,30-01-2018,365 dias,"Portugal, Aveiro, Santa Maria da Feira","Artigo 20.º, n.º 1, alínea a) do Código dos Contratos Públicos",,,,,,Não aplicável.,Não aplicável.,FALSE
14/03676.62/2017 - Aquisição de Prestação de Serviços de Transporte de Utentes – Lote 2; Lote 3,Ajuste Direto Regime Geral,Aquisição de serviços,"85000000-9, Serviços de saúde e acção social","Centro Hospitalar de Entre o Douro e Vouga, E.P.E. (508878462)","Azeméis Ambulâncias, Lda (503220973)","60.000,00 €",05-03-2018,20-12-2017,60 dias,"Portugal, Aveiro, Santa Maria da Feira","Artigo 20.º, n.º 1, alínea a) do Código dos Contratos Públicos",,,,,,Não aplicável.,Não aplicável.,FALSE
14/00185.62/2018 - Aquisição de Seguro de Acidentes de Trabalho,Ajuste Direto Regime Geral,Aquisição de serviços,"66000000-0, Serviços de finanças e seguros","Centro Hospitalar de Entre o Douro e Vouga, E.P.E. (508878462)",Sosel - Corretores de Seguros SA (502379707),"222.063,38 €",05-03-2018,29-12-2017,180 dias,"Portugal, Aveiro, Santa Maria da Feira","Artigo 24.º, n.º 1, alínea c) do Código dos Contratos Públicos",,,,,,Não aplicável.,Não aplicável.,FALSE
03/00104.62/2016 - Aquisição de Prestação de Serviços para Elaboração de Projecto de Remodelação das Urgências do Hospital de São João da Madeira,Ajuste Direto Regime Geral,Aquisição de serviços,"71223000-7, Serviços de arquitectura para trabalhos de ampliação de edifícios","CENTRO HOSPITALAR DE ENTRE O DOURO E VOUGA, E.P.E. (508878462)","ORANGE – ARQUITECTURA E GESTÃO DE PROJECTO, LDA (506212980)","9.600,00 €",05-03-2018,27-10-2016,41 dias,"Portugal, Aveiro, São João da Madeira","Artigo 20.º, n.º 1, alínea a) do Código dos Contratos Públicos",,,,,,Não aplicável.,Não aplicável.,FALSE
