freguesia,acronym,validVotesPercentage,votes,dicofre
Mértola,PCP-PEV,39.66,401,020904
Mértola,PS,38.97,394,020904
Mértola,PPD/PSD.CDS-PP,7.72,78,020904
Mértola,B.E.,3.66,37,020904
Mértola,MPT,3.66,37,020904
Mértola,PCTP/MRPP,2.37,24,020904
Mértola,L,1.48,15,020904
Mértola,MAS,0.49,5,020904
Mértola,PNR,0.49,5,020904
Mértola,PTP,0.49,5,020904
Mértola,PAN,0.4,4,020904
Mértola,PDA,0.2,2,020904
Mértola,PND,0.2,2,020904
Mértola,PPM,0.1,1,020904
Mértola,PPV,0.1,1,020904
Mértola,POUS,0,0,020904
