Objeto do Contrato,Tipo de Procedimento,Tipo(s) de Contrato,CPVs,Entidade(s) Adjudicante(s),Entidade(s) Adjudicatária(s),Preço Contratual,Data de Publicação,Data de Celebração do Contrato,Prazo de Execução,Local de Execução,Fundamentação,Data de Fecho do Contrato,Preço Total Efetivo,Causas das Alterações ao Prazo,Causas das Alterações ao Preço,Estado,N.º registo do Acordo Quadro,Descrição do Acordo Quadro,Procedimento Centralizado
Contrato de Manutenção do Microscópio Electrónico da Anatomia Patológica,Ajuste Direto Regime Geral,Aquisição de serviços,"50000000-5, Serviços de reparação e manutenção",Hospital Prof. Doutor Fernando Fonseca E.P.E. (503035416),"IZASA SCIENTIFIC, LDA (513252088)","8.577,82 €",09-03-2018,28-11-2017,365 dias,"Portugal, Lisboa, Amadora","Artigo 20.º, n.º 1, alínea a) do Código dos Contratos Públicos",,,,,,Não aplicável.,Não aplicável.,FALSE
Sistemas de Pacemaker - 2018,Concurso público,Aquisição de bens móveis,"33182210-4, Estimulador cardíaco (pacemaker)","Hospital Professor Doutor Fernando Fonseca, E. P. E. (503035416)",ST JUDE MEDICAL PORTUGA (504180746),"192.000,00 €",09-03-2018,26-02-2018,308 dias,"Portugal, Lisboa, Amadora","Artigo 20.º, n.º 1, alínea b) do Código dos Contratos Públicos",,,,,,Não aplicável.,Não aplicável.,FALSE
Sistemas de Pacemaker - 2018,Concurso público,Aquisição de bens móveis,"33182210-4, Estimulador cardíaco (pacemaker)","Hospital Professor Doutor Fernando Fonseca, E. P. E. (503035416)",Medtronic Portugal Lda (504223933),"60.000,00 €",09-03-2018,16-02-2018,318 dias,"Portugal, Lisboa, Amadora","Artigo 20.º, n.º 1, alínea b) do Código dos Contratos Públicos",,,,,,Não aplicável.,Não aplicável.,FALSE
Sistemas de Pacemaker - 2018,Concurso público,Aquisição de bens móveis,"33182210-4, Estimulador cardíaco (pacemaker)","Hospital Professor Doutor Fernando Fonseca, E. P. E. (503035416)",BOSTON  SCIENTIFIC  PORTUGAL -DISPOSITIVOS MÉDICOS (504988964),"30.000,00 €",09-03-2018,15-02-2018,319 dias,"Portugal, Lisboa, Amadora","Artigo 20.º, n.º 1, alínea b) do Código dos Contratos Públicos",,,,,,Não aplicável.,Não aplicável.,FALSE
Sistemas de Pacemaker - 2018,Concurso público,Aquisição de bens móveis,"33182210-4, Estimulador cardíaco (pacemaker)","Hospital Professor Doutor Fernando Fonseca, E. P. E. (503035416)","LIVANOVA PORTUGAL, Lda (505514010)","81.545,00 €",09-03-2018,16-02-2018,318 dias,"Portugal, Lisboa, Amadora","Artigo 20.º, n.º 1, alínea b) do Código dos Contratos Públicos",,,,,,Não aplicável.,Não aplicável.,FALSE
Sistemas de Pacemaker - 2018,Concurso público,Aquisição de bens móveis,"33182210-4, Estimulador cardíaco (pacemaker)","Hospital Professor Doutor Fernando Fonseca, E. P. E. (503035416)","BIOTRONIK PORTUGAL, UNIPESSOAL LDA. (510726941)","85.400,00 €",09-03-2018,15-02-2018,319 dias,"Portugal, Lisboa, Amadora","Artigo 20.º, n.º 1, alínea b) do Código dos Contratos Públicos",,,,,,Não aplicável.,Não aplicável.,FALSE
Aquisição de Osimertinib Oral 80Mg Comp - 2018,Ajuste Direto Regime Geral,Aquisição de bens móveis,"33600000-6, Produtos farmacêuticos",Hospital Prof. Doutor Fernando Fonseca E.P.E. (503035416),"ASTRAZENECA- PRODUTOS FARMACEUTICOS, LDA. (502942240)","132.871,92 €",02-03-2018,05-02-2018,329 dias,"Portugal, Lisboa, Amadora","Artigo 24.º, n.º 1, alínea e) do Código dos Contratos Públicos",,,,,,Não aplicável.,Não aplicável.,FALSE
