Objeto do Contrato,Tipo de Procedimento,Tipo(s) de Contrato,CPVs,Entidade(s) Adjudicante(s),Entidade(s) Adjudicatária(s),Preço Contratual,Data de Publicação,Data de Celebração do Contrato,Prazo de Execução,Local de Execução,Fundamentação,Data de Fecho do Contrato,Preço Total Efetivo,Causas das Alterações ao Prazo,Causas das Alterações ao Preço,Estado,N.º registo do Acordo Quadro,Descrição do Acordo Quadro,Procedimento Centralizado
Aquisição de equipamentos de cópia e impressão,Concurso público,Aquisição de bens móveis,"30120000-6, Equipamento para fotocópia e impressão em offset","SPMS - Serviços Partilhados do Ministério da Saúde, E. P. E. (509540716)","Iten Solutions - Sistemas de Informação, SA (510728189)","44.984,52 €",19-05-2017,21-03-2017,30 dias,Portugal,"Artigo 20.º, n.º 1, alínea b) do Código dos Contratos Públicos",,,,,,Não aplicável.,Não aplicável.,FALSE
Equipamentos de cópia e impressão,Concurso público,Aquisição de bens móveis,"30121000-3, Equipamento para fotocópia e termocópia","SPMS - Serviços Partilhados do Ministério da Saúde, E. P. E. (509540716)","CANON PORTUGAL, S.A. (507477740)","60.468,45 €",15-05-2017,20-12-2016,30 dias,Portugal,"Artigo 20.º, n.º 1, alínea b) do Código dos Contratos Públicos",,,,,,Não aplicável.,Não aplicável.,FALSE
