Objeto do Contrato,Tipo de Procedimento,Tipo(s) de Contrato,CPVs,Entidade(s) Adjudicante(s),Entidade(s) Adjudicatária(s),Preço Contratual,Data de Publicação,Data de Celebração do Contrato,Prazo de Execução,Local de Execução,Fundamentação,Data de Fecho do Contrato,Preço Total Efetivo,Causas das Alterações ao Prazo,Causas das Alterações ao Preço,Estado,N.º registo do Acordo Quadro,Descrição do Acordo Quadro,Procedimento Centralizado
"170020/2017 Forn. e montagem mobiliário hospitalar para diversos serviços do HDS,EPE",Concurso público,Aquisição de bens móveis,"39100000-3, Mobiliário","Hospital Distrital de Santarém, E. P. E. (506361462)","Fresinde, Equip. Industriais, Lda (502365889)","880,00 €",10-01-2018,18-10-2017,30 dias,"Portugal, Santarém, Santarém","Artigo 20.º, n.º 1, alínea b) do Código dos Contratos Públicos",,,,,,Não aplicável.,Não aplicável.,FALSE
170020/2017 Fornecimento e montagem mobiliaáio hospitalar,Concurso público,Aquisição de bens móveis,"39100000-3, Mobiliário","Hospital Distrital de Santarém, E. P. E. (506361462)","Industrial Laborum Iberica, SA (506692027)","8.541,00 €",10-01-2018,18-10-2017,45 dias,"Portugal, Santarém, Santarém","Artigo 20.º, n.º 1, alínea b) do Código dos Contratos Públicos",,,,,,Não aplicável.,Não aplicável.,FALSE
170020/2017 Fornecimento e montagem de mobiliário hospitalar para diversos Serviços,Concurso público,Aquisição de bens móveis,"39100000-3, Mobiliário","Hospital Distrital de Santarém, E. P. E. (506361462)","Biq Health Solution, Lda (504105337)","28.805,00 €",10-01-2018,31-10-2017,45 dias,"Portugal, Santarém, Santarém","Artigo 20.º, n.º 1, alínea b) do Código dos Contratos Públicos",,,,,,Não aplicável.,Não aplicável.,FALSE
"170029/2017 Proj. beneficiação Serviço Psiquiatria, Anatomia Patologica e Rede Predial de Àguas",Concurso público,Empreitadas de obras públicas,"71242000-6, Preparação de projecto e concepção, estimativa de custos","Hospital Distrital de Santarém, E. P. E. (506361462)","Parábolas Momentos, Engenharia e Consultoria, Lda (514128011)","24.799,00 €",10-01-2018,21-12-2017,170 dias,"Portugal, Santarém, Santarém","Artigo 19.º, alínea b) do Código dos Contratos Públicos",,,,,,Não aplicável.,Não aplicável.,FALSE
Aquisição de Películas Radiográficas,Ajuste Direto Regime Geral,Aquisição de bens móveis,"32354110-3, Películas radiográficas","Hospital Distrital de Santarém, EPE (506361462)","Carestream Health Portugal, Lda (508054320)","5.326,40 €",10-01-2018,10-01-2018,365 dias,"Portugal, Santarém, Santarém","Artigo 26.º, n.º 1, alínea a) do Código dos Contratos Públicos",,,,,,Não aplicável.,Não aplicável.,FALSE
PREST SERV ASSIST TECNICA ELETROBISTURIS ANO 2016,Ajuste Direto Regime Geral,Aquisição de serviços,"50000000-5, Serviços de reparação e manutenção","Hospital Distrital de Santarém, E. P. E. (506361462)","CLINIFAR, S.A.. (503281115)","2.030,00 €",09-01-2018,21-12-2017,365 dias,"Portugal, Santarém, Santarém","Artigo 20.º, n.º 1, alínea a) do Código dos Contratos Públicos",,,,,,Não aplicável.,Não aplicável.,FALSE
PRESTAÇÃO SERVIÇOS MCDT - LINFOCINTIGRAFIA PARA DETECÇÃO GANGLIO SENTINELA,Ajuste Direto Regime Geral,Concessão de serviços públicos,"85121000-3, Serviços de prática médica","Hospital Distrital de Santarém, E. P. E. (506361462)","ATOMEDICAL-LABORATÓRIO DE MEDICINA NUCLEAR, S.A. (501916148)","1.800,00 €",09-01-2018,21-12-2017,59 dias,"Portugal, Santarém, Santarém","Artigo 20.º, n.º 1, alínea a) do Código dos Contratos Públicos",,,,,,Não aplicável.,Não aplicável.,FALSE
FORNECIMENTO DE COMBUSTÍVEIS MÊS DE JANEIRO 2018,Ajuste Direto Regime Geral,Aquisição de bens móveis,"09100000-0, Combustíveis","Hospital Distrital de Santarém, EPE (506361462)","Petróleos de Portugal - Petrogal, SA ( Galp Energia, SGPS, S.A. ) (500697370)","3.478,89 €",09-01-2018,03-01-2018,31 dias,"Portugal, Santarém, Santarém","Artigo 20.º, n.º 1, alínea a) do Código dos Contratos Públicos",,,,,,Não aplicável.,Não aplicável.,FALSE
Aquisição e Instalação de Mobiliário Hospitalar,Concurso público,Aquisição de bens móveis,"33192000-2, Mobiliário para fins médicos","Hospital Distrital de Santarém, E. P. E. (506361462)","Sano-Técnica, Lda (500239819)","67.600,00 €",08-01-2018,27-12-2017,30 dias,"Portugal, Santarém, Santarém","Artigo 20.º, n.º 1, alínea b) do Código dos Contratos Públicos",,,,,,Não aplicável.,Não aplicável.,FALSE
170024/2017 Aquisição de motores para cirurgia ortopédica,Concurso público,Aquisição de bens móveis,"33100000-1, Equipamento médico","Hospital Distrital de Santarém, EPE (506361462)","Zimmer Biomet Unipessoal, Lda (500254990)","29.529,00 €",08-01-2018,21-12-2017,30 dias,"Portugal, Santarém, Santarém","Artigo 20.º, n.º 1, alínea b) do Código dos Contratos Públicos",,,,,,Não aplicável.,Não aplicável.,FALSE
Aquisição de Sacos para Cadáver,Concurso público,Aquisição de bens móveis,"33922000-9, Sacos para transporte de cadáveres","Hospital Distrital de Santarém, E. P. E. (506361462)","M.U.C.-Material de Utilidade Clínica, Lda (502379308)","2.913,38 €",05-01-2018,14-12-2017,360 dias,"Portugal, Santarém, Santarém","Artigo 20.º, n.º 1, alínea b) do Código dos Contratos Públicos",,,,,,Não aplicável.,Não aplicável.,FALSE
"Aquisição de Material de Higiene, Alimentação e Conforto",Concurso público,Aquisição de bens móveis,"33700000-7, Produtos para cuidados pessoais","Hospital Distrital de Santarém, EPE (506361462)","HR-Hospitalar, Lda (501895558)","314,65 €",05-01-2018,14-12-2017,360 dias,"Portugal, Santarém, Santarém","Artigo 20.º, n.º 1, alínea b) do Código dos Contratos Públicos",,,,,,Não aplicável.,Não aplicável.,FALSE
"Aquisição de Material de Higiene, Alimentação e Conforto",Concurso público,Aquisição de bens móveis,"33700000-7, Produtos para cuidados pessoais","Hospital Distrital de Santarém, EPE (506361462)","João Antunes Amaro, Lda (500149003)","5.510,03 €",05-01-2018,14-12-2017,360 dias,"Portugal, Santarém, Santarém","Artigo 20.º, n.º 1, alínea b) do Código dos Contratos Públicos",,,,,,Não aplicável.,Não aplicável.,FALSE
470044/2017 Aquisição de diverso equipamento de escritório,Ajuste Direto Regime Geral,Aquisição de bens móveis,"30200000-1, Equipamento e material informático","Hospital Distrital de Santarém, E. P. E. (506361462)","BUROTICA-SOC.EST. E EQUIP.,SA (501178503)","1.100,00 €",02-01-2018,14-12-2017,30 dias,"Portugal, Santarém, Santarém","Artigo 20.º, n.º 1, alínea a) do Código dos Contratos Públicos",,,,,,Não aplicável.,Não aplicável.,FALSE
470044/2017 Aquisição de diverso equipamento de escritório,Ajuste Direto Regime Geral,Aquisição de bens móveis,"30200000-1, Equipamento e material informático","Hospital Distrital de Santarém, E. P. E. (506361462)",Olmar (508831989),"1.860,00 €",02-01-2018,14-12-2017,30 dias,"Portugal, Santarém, Santarém","Artigo 20.º, n.º 1, alínea a) do Código dos Contratos Públicos",,,,,,Não aplicável.,Não aplicável.,FALSE
770034/2017 Aquisição de Ecocardiógrafo Portátil,Ajuste Direto Regime Geral,Aquisição de bens móveis,"33100000-1, Equipamento médico","Hospital Distrital de Santarém, E. P. E. (506361462)","General Electric Portugal, Lda (500357129)","16.555,00 €",02-01-2018,18-12-2017,30 dias,"Portugal, Santarém, Santarém","Artigo 26.º, n.º 1, alínea a) do Código dos Contratos Públicos",,,,,,Não aplicável.,Não aplicável.,FALSE
FORNECIMENTO E MONTAGEM SISTEMA AVAC BLOCO OPERATÓRIO E BLOCO PARTOS,Concurso público,Empreitadas de obras públicas,"45331000-6, Instalação de aquecimento, ventilação e ar condicionado","Hospital Distrital de Santarém, E. P. E. (506361462)","Termotérmica, Instalações Especiais, Lda (504013432)","1.154.070,24 €",02-01-2018,20-12-2017,270 dias,"Portugal, Santarém, Santarém","Artigo 19.º, alínea b) do Código dos Contratos Públicos",,,,,,Não aplicável.,Não aplicável.,FALSE
Aquisição Sistema Respiratório de Ressuscitação Manual - AMBU,Ajuste Direto Regime Geral,Aquisição de bens móveis,"33100000-1, Equipamento médico","Hospital Distrital de Santarém, EPE (506361462)","Iberdata-Equipamentos, SA (501904921)","1.950,00 €",02-01-2018,17-11-2017,5 dias,"Portugal, Santarém, Santarém","Artigo 24.º, n.º 1, alínea e) do Código dos Contratos Públicos",,,,,,Não aplicável.,Não aplicável.,FALSE
