Objeto do Contrato,Tipo de Procedimento,Tipo(s) de Contrato,CPVs,Entidade(s) Adjudicante(s),Entidade(s) Adjudicatária(s),Preço Contratual,Data de Publicação,Data de Celebração do Contrato,Prazo de Execução,Local de Execução,Fundamentação,Data de Fecho do Contrato,Preço Total Efetivo,Causas das Alterações ao Prazo,Causas das Alterações ao Preço,Estado,N.º registo do Acordo Quadro,Descrição do Acordo Quadro,Procedimento Centralizado
Processo n.º 14800202. ACES Pinhal Litoral. Substituição da caixilharia orientada a poente e sul. Extensão de Saúde da Maceira.,Ajuste Direto Regime Geral,Empreitadas de obras públicas,"45262700-8, Obras de transformação de edifícios","Administração Regional de Saúde do Centro, I. P. (503122165)","Mesis - Engenharia, Lda (507830814)","10.784,99 €",21-04-2014,17-04-2014,60 dias,"Portugal, Leiria, Leiria","Artigo 19.º, alínea a) do Código dos Contratos Públicos","","",,"",,Não aplicável.,Não aplicável.,FALSE
Aquisição de um Titulador Automático para o Laboratório de Saúde Publica de Aveiro,Ajuste Direto Regime Geral,Aquisição de bens móveis,"38340000-0, Instrumentos para medição de quantidades","Administração Regional de Saúde do Centro, I. P. (503122165)",HANNA INSTRUMENTS PORTUGAL LDA (502540141),"6.173,10 €",21-04-2014,21-04-2014,30 dias,"Portugal, Aveiro, Aveiro","Artigo 20.º, n.º 1, alínea a) do Código dos Contratos Públicos","","",,"",,Não aplicável.,Não aplicável.,FALSE
Aquisição de medicamentos,Ao abrigo de acordo-quadro (art.º 259.º),Aquisição de bens móveis,"33690000-3, Medicamentos vários","Administração Regional de Saúde do Centro, I. P. (503122165)",LABORATORIO MEDINFAR SA (500384045),"9.827,00 €",17-04-2014,17-04-2014,180 dias,"Portugal, Coimbra, Coimbra",Artigo 259.º do Código dos Contratos Públicos,"","",,"",,602875,"CONCURSO PÚBLICO PARA A CELEBRAÇÃO DE CONTRATOS PÚBLICOS DE APROVISIONAMENTO PARA A ÁREA DA SAÚDE, COM VISTA AO FORNECIMENTO DE MEDICAMENTOS DE CONSUMO GERAL - USADOS NAS AFECÇÕES CUTÂNEAS, ÀS INSTITUIÇÕES E SERVIÇOS DO SERVIÇO NACIONAL DE SAÚDE",FALSE
Aquisição de medicamentos,Ao abrigo de acordo-quadro (art.º 259.º),Aquisição de bens móveis,"33690000-3, Medicamentos vários","Administração Regional de Saúde do Centro, I. P. (503122165)",MERCK SHARP&DOHME LDA (500191360),"3.885,00 €",17-04-2014,17-04-2014,180 dias,"Portugal, Coimbra, Coimbra",Artigo 259.º do Código dos Contratos Públicos,"","",,"",,602875,"CONCURSO PÚBLICO PARA A CELEBRAÇÃO DE CONTRATOS PÚBLICOS DE APROVISIONAMENTO PARA A ÁREA DA SAÚDE, COM VISTA AO FORNECIMENTO DE MEDICAMENTOS DE CONSUMO GERAL - USADOS NAS AFECÇÕES CUTÂNEAS, ÀS INSTITUIÇÕES E SERVIÇOS DO SERVIÇO NACIONAL DE SAÚDE",FALSE
Processo n.º 14900032. Alimentação dos frigoríficos de medicamentos por circuito socorrido pelo grupo de emergência - Centro de Saúde de Eiras.,Ajuste Direto Regime Geral,Aquisição de serviços,"50000000-5, Serviços de reparação e manutenção","Administração Regional de Saúde do Centro, I. P. (503122165)",Licinio Nobre de Victor A. Ferreira da Silva (187709831),"361,00 €",17-04-2014,13-03-2014,5 dias,"Portugal, Coimbra, Coimbra","Artigo 20.º, n.º 1, alínea a) do Código dos Contratos Públicos","","",,"",,Não aplicável.,Não aplicável.,FALSE
AQ - Combustíveis Rodoviários,Ao abrigo de acordo-quadro (art.º 259.º),Aquisição de bens móveis,"09100000-0, Combustíveis","Centro Hospitalar do Tâmega e Sousa, E. P. E. (508318262), Secretaria-Geral do Ministério da Saúde (600080684), Hospital de Magalhães Lemos, E. P. E. (502828790), Insituto Nacional de Saúde Dr. Ricardo Jorge, I.P. (501427511), Direcção-Geral da Saúde (600037100), Centro Medicina de Reabilitação da Região Centro Rovisco Pais (503767336), Centro Hospitalar de Trás-os-Montes e Alto Douro, E. P. E. (508100496), Unidade Local de Saúde de Matosinhos, E.P.E. (506361390), Unidade Local de Saúde do Litoral Alentejano, E.P.E. (510445152), Gabinete do Ministro da Saúde (600052303), Administração Regional de Saúde de Lisboa e Vale do Tejo, I. P. (503148776), Centro Hospitalar Psiquiátrico de Lisboa (508338476), Centro Hospitalar de Entre o Douro e Vouga, E.P.E. (508878462), Instituto Português Oncologia do Porto Francisco Gentil, E.P.E. (506362299), Hospital Arcebispo João Crisóstomo - Cantanhede (501626123), Centro Hospitalar do Médio Ave, E.P.E. (508093937), Administração Regional de Saúde do Centro, I. P. (503122165), Centro Hospitalar de Lisboa Central, E. P. E. (508080142), Instituto Nacional de Emergência Médica, I.P. (501356126), Hospital José Luciano de Castro - Anadia (501613021), Centro Hospitalar de Leiria, E.P.E. (509822932), Unidade Local de Saúde do Alto Minho, E. P. E. (508786193), Serviço de Intervenção nos Comportamentos Aditivos e nas Dependências (600084884), Gabinete do Secretário de Estado Adjunto do Ministro da Saúde (600071006), Centro Hospitalar Vila Nova de Gaia - Espinho, E. P. E. (508142156), Hospital Professor Doutor Fernando Fonseca, E.P.E. (503035416), Hospital Garcia de Orta, E.P.E. (506361470), Centro Hospitalar e Universitário de Coimbra, E. P. E. (510103448), Centro Hospitalar do Baixo Vouga, E.P.E. (510123210), Unidade Local de Saúde do Nordeste, E. P. E (509932584), CHO - Centro Hospitalar do Oeste (510412009), Administração Regional de Saúde do Alentejo, I. P. (503148768), Instituto Português do sangue (502423943), Centro Hospitalar do Alto Ave, E.P.E. (508080827), INFARMED - Autoridade Nacional do Medicamento e Produtos de Saúde I.P. (600037002), Unidade Local de Saúde da Guarda, E.P.E. (508752000), Unidade Local de Saúde do Baixo Alentejo, E.P.E. (508754275), Centro Hospitalar Lisboa Norte, E. P. E. (508481287), Inspeção-Geral das Atividades em Saúde (600018857), Hospital do Espírito Santo de Évora, E. P. E. (508085888), Hospital Distrital da Figueira da Foz, EPE (506361527), Hospital Dr. Francisco Zagalo - Ovar (501510150), Administração Central do Sistema de Saúde, I.P. (508188423), Hospital Santa Maria Maior, E.P.E. - Barcelos (506361381), Administração Regional de Saúde Algarve, I.P. (503148709), Administração Regional de Saúde do Norte, I. P. (503135593), Centro Hospitalar do Algarve, E. P. E. (510745997), Gabinete do Secretátio de Estado da Saúde (600052290), Instituto Português Oncologia de Coimbra Francisco Gentil, E.P.E. (506361438), Centro Hospitalar Barreiro Montijo, E.P.E. (509186998), Centro Hospitalar Tondela-Viseu, E.P.E. (509822940), Unidade Local de Saúde do Norte Alentejano, E. P. E. (508094461), Serviço Partilhados do Ministério da Saúde, E. P. E. (509540716), Hospital de Santarém, E.P.E. (506361462), Centro Hospitalar de Lisboa Ocidental, E.P.E. (507618319), Centro Hospitalar de São João, E. P. E. (509821197), Centro Hospitalar do Porto, E.P.E. (508331471)",Petróleos de Portugal - Petrogal SA (500697370),"20.031,90 €",17-04-2014,08-01-2014,335 dias,"Portugal, Évora, Évora",Artigo 259.º do Código dos Contratos Públicos,08-01-2014,"20.031,90 €",,"",,400324,Acordo quadro de fornecimento de combustíveis rodoviários,TRUE
"Aquisição de um aparelho para determinação de pH, temperatura e condutividade para o Laboratório de Saúde Pública de Coimbra ",Ajuste Direto Regime Geral,Aquisição de bens móveis,"38430000-8, Aparelhos de detecção e análise","Administração Regional de Saúde do Centro, I. P. (503122165)",DIAS DE SOUSA - INSTRUMENTAÇÃO ANALITICA E CIENTIFICA SA (504080857),"2.100,00 €",16-04-2014,16-04-2014,30 dias,"Portugal, Coimbra, Coimbra","Artigo 20.º, n.º 1, alínea a) do Código dos Contratos Públicos","","",,"",,Não aplicável.,Não aplicável.,FALSE
Aquisição de reagentes,Ajuste Direto Regime Geral,Aquisição de bens móveis,"33696500-0, Reagentes de laboratório","Administração Regional de Saúde do Centro, I. P. (503122165)","Biomérieux Portugal, Lda (501524177)","8.091,30 €",15-04-2014,15-04-2014,180 dias,"Portugal, Aveiro, Aveiro","Artigo 24.º, n.º 1, alínea e) do Código dos Contratos Públicos",28-11-2014,"8.075,31 €",,.,,Não aplicável.,Não aplicável.,FALSE
"Renovação do Licenciamento do antivírus Trend Micro para a ARSC,IP e ACES Baixo Vouga",Ajuste Direto Regime Geral,Aquisição de bens móveis,"48761000-0, Pacote de software antivírus","ADMINISTRAÇÃO REGIONAL DE SAÚDE DO CENTRO, I. P. (503122165)",INTEGRATOR (506619290),"5.781,90 €",14-04-2014,14-04-2014,5 dias,"Portugal, Coimbra, Coimbra","Artigo 20.º, n.º 1, alínea a) do Código dos Contratos Públicos","","",,"",,Não aplicável.,Não aplicável.,FALSE
