Objeto do Contrato,Tipo de Procedimento,Tipo(s) de Contrato,CPVs,Entidade(s) Adjudicante(s),Entidade(s) Adjudicatária(s),Preço Contratual,Data de Publicação,Data de Celebração do Contrato,Prazo de Execução,Local de Execução,Fundamentação,Data de Fecho do Contrato,Preço Total Efetivo,Causas das Alterações ao Prazo,Causas das Alterações ao Preço,Estado,N.º registo do Acordo Quadro,Descrição do Acordo Quadro,Procedimento Centralizado
Aquisição de serviços de análise à qualidade da água da rede predial-consumo humano-e controlo analítico da qualidade do ar interior no Edifício Egas Moniz da FMUL,Consulta Prévia,Aquisição de serviços,"71900000-7, Serviços laboratoriais",Faculdade Medicina Universidade de Lisboa (502662875),"Sagilab-Laboratório de Análise Técnicas,SA (504486799)","27.786,00 €",09-04-2019,21-03-2019,1095 dias,"Portugal, Lisboa, Lisboa","Artigo 20.º, n.º 1, alínea c) do Código dos Contratos Públicos","","","","",,Não aplicável.,Não aplicável.,FALSE
Aquisição de Serviços com vista ao Controlo Analítico da Água da Rede Predial - [PC/00300002/2019],Consulta Prévia,Aquisição de serviços,"90713100-9, Serviços de consultoria em matéria de abastecimento de água e de águas residuais fora do âmbito da construção","Centro Hospitalar do Baixo Vouga, E.P.E. (510123210)","SAGILAB-LABORATÓRIO ANÁLISES TÉCNICAS,LDA. (504486799)","24.789,00 €",03-04-2019,11-03-2019,1026 dias,"Portugal, Aveiro, Estarreja<BR/>Portugal, Aveiro, Aveiro<BR/>Portugal, Aveiro, Águeda","Artigo 20.º, n.º 1, alínea c) do Código dos Contratos Públicos","","","","",,Não aplicável.,Não aplicável.,FALSE
Aquisição de Serviços com vista ao Controlo Analítico das Águas Residuais - [PC/00300001/2019],Consulta Prévia,Aquisição de serviços,"90400000-1, Serviços relacionados com águas residuais","Centro Hospitalar do Baixo Vouga, E.P.E. (510123210)","SAGILAB-LABORATÓRIO ANÁLISES TÉCNICAS,LDA. (504486799)","31.320,00 €",03-04-2019,11-03-2019,1026 dias,"Portugal, Aveiro, Estarreja<BR/>Portugal, Aveiro, Águeda<BR/>Portugal, Aveiro, Aveiro","Artigo 20.º, n.º 1, alínea c) do Código dos Contratos Públicos","","","","",,Não aplicável.,Não aplicável.,FALSE
Prestação de Serviços de Análises Químicas para o Centro de Estudos de Águas do Instituto Superior de Engenharia do Porto,Consulta Prévia,Aquisição de serviços,"71620000-0, Serviços de análise",Instituto Superior de Engenharia do Porto (501540709),"SAGILAB-LABORATÓRIO ANÁLISES TÉCNICAS,LDA. (504486799)","8.750,00 €",19-03-2019,05-02-2019,365 dias,"Portugal, Porto, Porto","Artigo 20.º, n.º 1, alínea c) do Código dos Contratos Públicos","","","","",,Não aplicável.,Não aplicável.,FALSE
AT Controlo Qualidade Água CH e AQS 2019,Ajuste Direto Regime Geral,Aquisição de serviços,"71900000-7, Serviços laboratoriais","Centro Hospitalar Universitário de Lisboa Norte, E. P. E. (508481287)","SAGILAB-LABORATÓRIO ANÁLISES TÉCNICAS,LDA. (504486799)","14.018,00 €",14-02-2019,06-02-2019,328 dias,"Portugal, Lisboa, Lisboa","Artigo 20.º, n.º 1, alínea d) do Código dos Contratos Públicos","","","","",,Não aplicável.,Não aplicável.,FALSE
Prestação de Serviços de Análises Químicas para o Centro de Estudos de Águas do Instituto Superior de Engenharia do Porto,Consulta Prévia,Aquisição de serviços,"71620000-0, Serviços de análise",Instituto Superior de Engenharia do Porto (501540709),"SAGILAB-LABORATÓRIO ANÁLISES TÉCNICAS,LDA. (504486799)","270,25 €",11-02-2019,05-02-2019,333 dias,"Portugal, Porto, Porto","Artigo 20.º, n.º 1, alínea c) do Código dos Contratos Públicos",28-02-2019,"270,25 €","","",,Não aplicável.,Não aplicável.,FALSE
Prestação de serviço de análises químicas para o Centro de Estudos de águas - ISEP,Ajuste Direto Regime Geral,Aquisição de serviços,"71620000-0, Serviços de análise",Instituto Superior de Engenharia do Porto (501540709),"SAGILAB-LABORATÓRIO ANÁLISES TÉCNICAS,LDA. (504486799)","917,27 €",26-12-2018,15-12-2015,25 dias,"Portugal, Porto, Porto","Artigo 20.º, n.º 1, alínea a) do Código dos Contratos Públicos",07-12-2018,"917,27 €","","",,Não aplicável.,Não aplicável.,FALSE
Prestação de serviços de análises químicas e bacteriológicas aos circuitos de água das Piscinas Municipais de Faro,Concurso público,Aquisição de serviços,"71900000-7, Serviços laboratoriais",Município de Faro (506579425),Sagilab - Laboratório de Análises Técnicas S.A. (504486799),"29.320,80 €",12-12-2018,25-07-2018,1095 dias,"Portugal, Faro, Faro","Artigo 20.º, n.º 1, alínea b) do Código dos Contratos Públicos","","","","",,Não aplicável.,Não aplicável.,FALSE
Controlo Analítico da Água da Rede Predial,Consulta Prévia,Aquisição de serviços,"90713100-9, Serviços de consultoria em matéria de abastecimento de água e de águas residuais fora do âmbito da construção","Centro Hospitalar do Baixo Vouga, E. P. E. (510123210)","Sagilab - Laboratório Análises Técnicas, S.a (504486799)","8.187,00 €",26-10-2018,08-02-2018,327 dias,"Portugal, Aveiro, Aveiro<BR/>Portugal, Aveiro, Águeda<BR/>Portugal, Aveiro, Estarreja","Artigo 19.º, alínea c) do Código dos Contratos Públicos","","","","",,Não aplicável.,Não aplicável.,FALSE
O contrato tem por objeto a aquisição de serviços de análise de águas das Termas de Caldas de Aregos.,Ajuste Direto Regime Geral,Aquisição de serviços,"85148000-8, Serviços de análises clínicas",Município de Resende (506349381),"Sagilab - Laboratório Análises Técnicas, S.a (504486799)","6.044,00 €",27-08-2018,20-07-2018,180 dias,Portugal,"Artigo 20.º, n.º 1, alínea d) do Código dos Contratos Públicos","","","","",,Não aplicável.,Não aplicável.,FALSE
CONTROLO ANALITICO DE AGUA DA REDE PREDIAL DO CHS,Ajuste Direto Regime Geral,Aquisição de serviços,"90000000-7, Serviços relativos a águas residuais, resíduos, limpeza e ambiente","Centro Hospitalar de Setúbal, E. P. E. (507606787)","SAGILAB - LAB. ANALISES TÉCNICAS, SA (504486799)","7.248,50 €",20-06-2018,06-04-2018,365 dias,"Portugal, Setúbal, Setúbal","Artigo 20.º, n.º 1, alínea d) do Código dos Contratos Públicos","","","","",,Não aplicável.,Não aplicável.,FALSE
Aquisição de serviços de controlo de qualidade da água para consumo humano e  água quente sanitária para o ano de 2018,Ajuste Direto Regime Geral,Aquisição de serviços,"71900000-7, Serviços laboratoriais","Centro Hospitalar Lisboa Norte, E. P. E. (508481287)","Sagilab - Laboratorio de Analises, Sa (504486799)","9.259,00 €",15-06-2018,15-06-2018,199 dias,"Portugal, Lisboa, Lisboa","Artigo 20.º, n.º 1, alínea d) do Código dos Contratos Públicos","","","","",,Não aplicável.,Não aplicável.,FALSE
"Aquisição de serviços de análises e avaliação para os Serviços de Imuno, Nefro e Copa de Leites, para o CHSJ, EPE., para o ano 2018",Ajuste Direto Regime Geral,Aquisição de serviços,"71620000-0, Serviços de análise","Centro Hospitalar de São João, E. P. E. (509821197)","Sagilab - Laboratorio de Analises, Sa (504486799)","14.510,80 €",14-06-2018,02-01-2018,365 dias,"Portugal, Porto, Porto","Artigo 20.º, n.º 1, alínea a) do Código dos Contratos Públicos","","","","",,Não aplicável.,Não aplicável.,FALSE
P0/848/2018 Monitorização Legionella Pneumophila,Consulta Prévia,Aquisição de serviços,"71700000-5, Serviços de controlo e monitorização","Centro Hospitalar de Leiria, E. P. E. (509822932)","Sagilab - Laboratorio de Analises, Sa (504486799)","7.200,00 €",07-06-2018,07-06-2018,210 dias,"Portugal, Leiria, Leiria","Artigo 20.º, n.º 1, alínea c) do Código dos Contratos Públicos","","","","",,Não aplicável.,Não aplicável.,FALSE
Prestação de serviços de assistência técnica,Ajuste Direto Regime Geral,Aquisição de serviços,"71356200-0, Serviços de assistência técnica","Hospital do Espírito Santo de Évora, E. P. E. (508085888)","SAGILAB-LABORATÓRIO ANÁLISES TÉCNICAS,LDA. (504486799)","7.846,00 €",02-05-2018,21-02-2018,365 dias,"Portugal, Évora, Évora","Artigo 20.º, n.º 1, alínea a) do Código dos Contratos Públicos","","","","",,Não aplicável.,Não aplicável.,FALSE
Aquisição de Serviços com vista ao Controlo Analítico das Águas Residuais,Consulta Prévia,Aquisição de serviços,"90400000-1, Serviços relacionados com águas residuais","Centro Hospitalar do Baixo Vouga, E. P. E. (510123210)","SAGILAB-LABORATÓRIO ANÁLISES TÉCNICAS,LDA. (504486799)","10.440,00 €",30-04-2018,15-02-2018,320 dias,"Portugal, Aveiro, Aveiro<BR/>Portugal, Aveiro, Águeda<BR/>Portugal, Aveiro, Estarreja","Artigo 19.º, alínea c) do Código dos Contratos Públicos","","","","",,Não aplicável.,Não aplicável.,FALSE
aquisição de serviços de análises químicas e bacteriológicas à água das piscinas II,Concurso público,Aquisição de serviços,"85111820-4, Serviços de análise bacteriológica",Universidade de Lisboa (510739024),"SAGILAB-LABORATÓRIO ANÁLISES TÉCNICAS,LDA. (504486799)","8.604,00 €",13-03-2018,27-02-2018,1096 dias,"Portugal, Lisboa, Lisboa","Artigo 20.º, n.º 1, alínea b) do Código dos Contratos Públicos","","","","",,Não aplicável.,Não aplicável.,FALSE
Prestação de serviço de análises químicas para o Centro de Estudos de águas - ISEP,Ajuste Direto Regime Geral,Aquisição de serviços,"71620000-0, Serviços de análise",Instituto Superior de Engenharia do Porto (501540709),"SAGILAB-LABORATÓRIO ANÁLISES TÉCNICAS,LDA. (504486799)","8.000,00 €",23-02-2018,15-12-2015,365 dias,"Portugal, Porto, Porto","Artigo 20.º, n.º 1, alínea a) do Código dos Contratos Públicos",07-12-2018,"8.000,00 €","","",,Não aplicável.,Não aplicável.,FALSE
Prestação de serviço de análises químicas para o Centro de Estudos de águas - ISEP,Ajuste Direto Regime Geral,Aquisição de serviços,"71620000-0, Serviços de análise",Instituto Superior de Engenharia do Porto (501540709),"SAGILAB-LABORATÓRIO ANÁLISES TÉCNICAS,LDA. (504486799)","730,31 €",23-02-2018,15-12-2015,20 dias,"Portugal, Porto, Porto","Artigo 20.º, n.º 1, alínea a) do Código dos Contratos Públicos",31-12-2017,"730,31 €","","",,Não aplicável.,Não aplicável.,FALSE
Analise a águas da rede interna,Ajuste Direto Regime Geral,Aquisição de serviços,"71900000-7, Serviços laboratoriais","Hospital do Espírito Santo de Évora, E. P. E. (508085888)","Sagilab - Laboratório de Análises Técnicas, S.A. (504486799)","3.221,00 €",07-02-2018,28-07-2017,8 dias,"Portugal, Évora, Évora","Artigo 20.º, n.º 1, alínea a) do Código dos Contratos Públicos","","","","",,Não aplicável.,Não aplicável.,FALSE
Serviços de análises químicas e microbiológicas.,Concurso limitado por prévia qualificação,Aquisição de serviços,"90715000-2, Serviços de investigação da poluição",Serviço de Utilização Comum dos Hospitais (500900469),"Sagilab - Laboratório de Análises Técnicas, S.A. (504486799)","94.594,80 €",01-02-2018,16-01-2018,339 dias,Portugal,"Artigo 20.º, n.º 1, alínea b) do Código dos Contratos Públicos","","","","",,Não aplicável.,Não aplicável.,FALSE
Aquisição de Serviços de Análises e Avaliação - Sagilab,Ajuste Direto Regime Geral,Aquisição de serviços,"71620000-0, Serviços de análise","Centro Hospitalar de São João, E. P. E. (509821197)","Sagilab - Laboratório de Análises Técnicas, S.A. (504486799)","14.510,80 €",27-06-2017,12-01-2017,365 dias,"Portugal, Porto, Porto","Artigo 20.º, n.º 1, alínea a) do Código dos Contratos Públicos","","","","",,Não aplicável.,Não aplicável.,FALSE
Serviços de Controlo Analítico Higiosanitário e de Géneros Alimentícios,Ajuste Direto Regime Geral,Aquisição de serviços,"90000000-7, Serviços relativos a águas residuais, resíduos, limpeza e ambiente",Serviços de Acção Social da Universidade de Trás-os-Montes e Alto Douro (600039366),"Sagilab - Laboratório de Análises Técnicas, S.A. (504486799)","6.210,00 €",18-05-2017,18-05-2017,365 dias,"Portugal, Vila Real, Vila Real","Artigo 20.º, n.º 1, alínea a) do Código dos Contratos Públicos",18-05-2018,"6.210,00 €","","",,Não aplicável.,Não aplicável.,FALSE
Aquisição de Serviços de Controlo de Qualidade da Água para Consumo Humano e Água Quente Sanitária para o Ano de 2017,Ajuste Direto Regime Geral,Aquisição de serviços,"71900000-7, Serviços laboratoriais","CENTRO HOSPITALAR LISBOA NORTE, EPE (508481287)","Sagilab - Laboratório de Análises Técnicas, S.A. (504486799)","10.275,00 €",17-04-2017,08-02-2017,326 dias,"Portugal, Lisboa, Lisboa","Artigo 20.º, n.º 1, alínea a) do Código dos Contratos Públicos","","","","",,Não aplicável.,Não aplicável.,FALSE
Aquisição de Serviços com vista ao Controlo Analítico das Águas Residuais,Ajuste Direto Regime Geral,Aquisição de serviços,"90400000-1, Serviços relacionados com águas residuais","Centro Hospitalar do Baixo Vouga, E. P. E (CHBV, E. P. E.) (510123210)","Sagilab – Laboratório Análises Técnicas, S.A (504486799)","10.440,00 €",09-03-2017,13-02-2017,321 dias,"Portugal, Aveiro, Aveiro","Artigo 20.º, n.º 1, alínea a) do Código dos Contratos Públicos","","","","",,Não aplicável.,Não aplicável.,FALSE
Aquisição de Serviços com vista ao Controlo Analítico da Água da Rede Predial,Ajuste Direto Regime Geral,Aquisição de serviços,"90713100-9, Serviços de consultoria em matéria de abastecimento de água e de águas residuais fora do âmbito da construção","Centro Hospitalar do Baixo Vouga, E. P. E (CHBV, E. P. E.) (510123210)","Sagilab – Laboratório Análises Técnicas, S.A. (504486799)","8.035,00 €",09-03-2017,10-02-2017,324 dias,"Portugal, Aveiro, Aveiro","Artigo 20.º, n.º 1, alínea a) do Código dos Contratos Públicos","","","","",,Não aplicável.,Não aplicável.,FALSE
Prestação de serviço de análises químicas para o Centro de Estudos de águas - ISEP,Ajuste Direto Regime Geral,Aquisição de serviços,"71620000-0, Serviços de análise",Instituto Superior de Engenharia do Porto (501540709),"Sagilab - Laboratório de Análises Técnicas, S.A. (504486799)","7.100,00 €",12-01-2017,01-01-2017,365 dias,"Portugal, Porto, Porto","Artigo 20.º, n.º 1, alínea a) do Código dos Contratos Públicos",31-12-2017,"7.100,00 €","","",,Não aplicável.,Não aplicável.,FALSE
Prestação de serviço de análises químicas para o Centro de Estudos de águas - 4º trimestre de 2016 - ISEP/CEA/27791/2015,Ajuste Direto Regime Geral,Aquisição de serviços,"71620000-0, Serviços de análise",Instituto Superior de Engenharia do Porto (501540709),"Sagilab - Laboratório Análises Químicas, S.A. (504486799)","112,35 €",04-01-2017,05-12-2016,20 dias,"Portugal, Porto, Porto","Artigo 20.º, n.º 1, alínea a) do Código dos Contratos Públicos",05-12-2016,"112,35 €","","",,Não aplicável.,Não aplicável.,FALSE
Prestação de serviço de análises químicas para o Centro de Estudos de águas - 4º trimestre de 2016 - ISEP/CEA/27791/2015,Ajuste Direto Regime Geral,Aquisição de serviços,"71620000-0, Serviços de análise",Instituto Superior de Engenharia do Porto (501540709),"Sagilab - Laboratório Análises Químicas, S.A. (504486799)","1.930,00 €",06-12-2016,31-10-2016,90 dias,"Portugal, Porto, Porto","Artigo 20.º, n.º 1, alínea a) do Código dos Contratos Públicos",05-12-2016,"1.930,00 €","","",,Não aplicável.,Não aplicável.,FALSE
"Aquisição de serviços de análises e avaliação para o CHSJ, EPE",Ajuste Direto Regime Geral,Aquisição de serviços,"90000000-7, Serviços relativos a águas residuais, resíduos, limpeza e ambiente","Centro Hospitalar de São João, E. P. E. (509821197)","Sagilab - Laboratório Análises Técnicas, SA (504486799)","14.510,80 €",16-11-2016,08-08-2016,90 dias,"Portugal, Porto, Porto","Artigo 20.º, n.º 1, alínea a) do Código dos Contratos Públicos","","","","",,Não aplicável.,Não aplicável.,FALSE
Aquisição de Serviços com vista ao Controlo Analítico da Água da Rede Predial,Ajuste Direto Regime Geral,Aquisição de serviços,"90713100-9, Serviços de consultoria em matéria de abastecimento de água e de águas residuais fora do âmbito da construção","Centro Hospitalar do Baixo Vouga, E.P.E. (510123210)","Sagilab, Laboratório Análises Técnicas. S.A. (504486799)","8.035,00 €",13-09-2016,01-04-2016,275 dias,"Portugal, Aveiro, Aveiro","Artigo 20.º, n.º 1, alínea a) do Código dos Contratos Públicos","","","","",,Não aplicável.,Não aplicável.,FALSE
Aquisição de Serviços com vista ao Controlo Analítico das Águas Residuais,Ajuste Direto Regime Geral,Aquisição de serviços,"90400000-1, Serviços relacionados com águas residuais","Centro Hospitalar do Baixo Vouga, E.P.E. (510123210)","Sagilab – Laboratório Análises Técnicas, S.A. (504486799)","10.440,00 €",13-09-2016,05-04-2016,270 dias,"Portugal, Aveiro, Aveiro","Artigo 20.º, n.º 1, alínea a) do Código dos Contratos Públicos","","","","",,Não aplicável.,Não aplicável.,FALSE
PRESTAÇÃO DO SERVIÇO DE ANÁLISES LABORATORIAIS,Ajuste Direto Regime Geral,Aquisição de serviços,"79723000-8, Serviços de análise de resíduos",Serviços Municipalizados de Electricidade Águas e Saneamento Câmara Municipal da Maia (680015124),"SAGILAB-LABORATORIO DE ANALISES TECNICAS, SA (504486799)","11.328,00 €",30-05-2016,24-05-2016,730 dias,"Portugal, Porto, Maia","Artigo 20.º, n.º 1, alínea a) do Código dos Contratos Públicos","","","","",,Não aplicável.,Não aplicável.,FALSE
Serviços de Controlo Analítico da Água de Consumo no Hospital,Ajuste Direto Regime Geral,Aquisição de serviços,"90733100-5, Serviços de monitorização ou controlo da poluição de águas superficiais","Centro Hospitalar Vila Nova de Gaia - Espinho, E. P. E. (508142156)",SAGILAB (504486799),"14.634,00 €",06-05-2016,11-12-2014,365 dias,"Portugal, Porto, Vila Nova de Gaia","Artigo 20.º, n.º 1, alínea a) do Código dos Contratos Públicos","","","","",,Não aplicável.,Não aplicável.,FALSE
Prestação de serviço de análises Químicas para o Centro de Estudos de águas para o ano de 2016,Ajuste Direto Regime Geral,Aquisição de serviços,"71620000-0, Serviços de análise",Instituto Superior de Engenharia do Porto (501540709),"SAGILAB-LABORATÓRIO ANÁLISES TÉCNICAS,LDA. (504486799)","5.000,00 €",21-01-2016,01-01-2016,365 dias,"Portugal, Porto, Porto","Artigo 20.º, n.º 1, alínea a) do Código dos Contratos Públicos",31-10-2016,"5.000,00 €","","",,Não aplicável.,Não aplicável.,FALSE
Prestação de Serviços de Análises Químicas para o Centro de Estudos de Águas do Instituto Superior de Engenharia do Porto,Ajuste Direto Regime Geral,Aquisição de serviços,"71620000-0, Serviços de análise",Instituto Superior de Engenharia do Porto (501540709),"SAGILAB - LAB. ANALISES TECNICAS, SA (504486799)","78,64 €",18-12-2015,26-11-2015,365 dias,"Portugal, Porto, Porto","Artigo 20.º, n.º 1, alínea a) do Código dos Contratos Públicos",10-12-2015,"78,64 €","","",,Não aplicável.,Não aplicável.,FALSE
Subcontratação de análises fisico-quimicas,Ajuste Direto Regime Geral,Aquisição de serviços,"71620000-0, Serviços de análise",Instituto Superior de Engenharia do Porto (501540709),"SAGILAB-LABORATÓRIO ANÁLISES TÉCNICAS,LDA. (504486799)","2.285,47 €",10-12-2015,03-08-2015,153 dias,"Portugal, Porto, Porto","Artigo 20.º, n.º 1, alínea a) do Código dos Contratos Públicos",04-12-2015,"2.285,47 €","","",,Não aplicável.,Não aplicável.,FALSE
Prestação de Serviços de Análise dos Parâmetros das Águas Residuais,Ajuste Direto Regime Geral,Aquisição de serviços,"90400000-1, Serviços relacionados com águas residuais","Centro Hospitalar do Baixo Vouga, E. P. E (CHBV, E. P. E.) (510123210)","SAGILAB - LABORATÓRIO DE ANÁLISES TÉCNICAS, S.A. (504486799)","4.000,00 €",11-11-2015,27-05-2015,95 dias,"Portugal, Aveiro, Aveiro","Artigo 20.º, n.º 1, alínea a) do Código dos Contratos Públicos","","","","",,Não aplicável.,Não aplicável.,FALSE
80509215 - AD para Aquisição de Serviços para Controlo Analítico da Água de Consumo no Hospital,Ajuste Direto Regime Geral,Aquisição de serviços,"71900000-7, Serviços laboratoriais","Centro Hospitalar Vila Nova de Gaia - Espinho, E. P. E. (508142156)",SAGILAB (504486799),"5.958,00 €",03-06-2015,02-06-2015,180 dias,"Portugal, Porto, Vila Nova de Gaia","Artigo 24.º, n.º 1, alínea c) do Código dos Contratos Públicos","","","","",,Não aplicável.,Não aplicável.,FALSE
Controlo da Água para consumo Humano da Rede Predial,Ajuste Direto Regime Geral,Aquisição de serviços,"90713100-9, Serviços de consultoria em matéria de abastecimento de água e de águas residuais fora do âmbito da construção","Centro Hospitalar do Baixo Vouga, E. P. E (CHBV, E. P. E.) (510123210)",SAGILAB - LAB.ANÁLISES TÉCNICAS S.A. (504486799),"4.280,50 €",02-06-2015,05-03-2015,305 dias,"Portugal, Aveiro, Aveiro","Artigo 20.º, n.º 1, alínea a) do Código dos Contratos Públicos","","","","",,Não aplicável.,Não aplicável.,FALSE
Subcontratação de análises fisico-quimicas,Ajuste Direto Regime Geral,Aquisição de serviços,"71620000-0, Serviços de análise",Instituto Superior de Engenharia do Porto (501540709),"SAGILAB - LAB. ANALISES TECNICAS, SA (504486799)","7.600,00 €",23-01-2015,01-01-2015,365 dias,"Portugal, Porto, Porto","Artigo 20.º, n.º 1, alínea a) do Código dos Contratos Públicos",31-07-2015,"7.600,00 €","","",,Não aplicável.,Não aplicável.,FALSE
Subcontratação de análises,Ajuste Direto Regime Geral,Aquisição de serviços,"71620000-0, Serviços de análise",Instituto Superior de Engenharia do Porto (501540709),"Sagilab, Sa (504486799)","671,03 €",07-01-2015,30-12-2014,1 dias,"Portugal, Porto, Porto","Artigo 20.º, n.º 1, alínea a) do Código dos Contratos Públicos",30-12-2014,"671,03 €","","",,Não aplicável.,Não aplicável.,FALSE
Subcontratação de análises fisico-quimicas,Ajuste Direto Regime Geral,Aquisição de serviços,"71620000-0, Serviços de análise",Instituto Superior de Engenharia do Porto (501540709),Sagilab - Laboratório de análises técnicas (504486799),"771,22 €",04-12-2014,28-11-2014,1 dias,"Portugal, Porto, Porto","Artigo 20.º, n.º 1, alínea a) do Código dos Contratos Públicos",28-11-2014,"771,22 €","","",,Não aplicável.,Não aplicável.,FALSE
Subcontratação de análises fisico-quimicas,Ajuste Direto Regime Geral,Aquisição de serviços,"71620000-0, Serviços de análise",Instituto Superior de Engenharia do Porto (501540709),"Sagilab - Laboratório Análises Técnicas, SA (504486799)","650,42 €",04-11-2014,31-10-2014,1 dias,"Portugal, Porto, Porto","Artigo 20.º, n.º 1, alínea a) do Código dos Contratos Públicos",31-10-2014,"650,42 €","","",,Não aplicável.,Não aplicável.,FALSE
Subcontratação de analises,Ajuste Direto Regime Geral,Aquisição de serviços,"71620000-0, Serviços de análise",Instituto Superior de Engenharia do Porto (501540709),"Sagilab, Sa (504486799)","866,39 €",07-10-2014,30-09-2014,1 dias,"Portugal, Porto, Porto","Artigo 20.º, n.º 1, alínea a) do Código dos Contratos Públicos",30-09-2014,"866,39 €","","",,Não aplicável.,Não aplicável.,FALSE
Subcontratação de análises,Ajuste Direto Regime Geral,Aquisição de serviços,"71620000-0, Serviços de análise",Instituto Superior de Engenharia do Porto (501540709),"Sagilab, Laboratório Analises Técnicas, SA (504486799)","792,26 €",08-09-2014,29-07-2014,15 dias,"Portugal, Porto, Porto","Artigo 20.º, n.º 1, alínea a) do Código dos Contratos Públicos",29-07-2014,"792,26 €","","",,Não aplicável.,Não aplicável.,FALSE
Subcontratação de análises,Ajuste Direto Regime Geral,Aquisição de serviços,"71620000-0, Serviços de análise",Instituto Superior de Engenharia do Porto (501540709),"SAGILAB-LABORATÓRIO ANÁLISES TÉCNICAS,LDA. (504486799)","65,32 €",03-09-2014,27-08-2014,1 dias,"Portugal, Porto, Porto","Artigo 20.º, n.º 1, alínea a) do Código dos Contratos Públicos",27-08-2014,"65,32 €","","",,Não aplicável.,Não aplicável.,FALSE
Subcontratação de análises,Ajuste Direto Regime Geral,Aquisição de serviços,"71620000-0, Serviços de análise",Instituto Superior de Engenharia do Porto (501540709),"SAGILAB-LABORATÓRIO ANÁLISES TÉCNICAS,LDA. (504486799)","114,78 €",03-09-2014,12-08-2014,1 dias,"Portugal, Porto, Porto","Artigo 20.º, n.º 1, alínea a) do Código dos Contratos Públicos",12-08-2014,"114,78 €","","",,Não aplicável.,Não aplicável.,FALSE
Aquisição de controlo qualidade agua dialise-Nefrologia HG(julho),Ajuste Direto Regime Geral,Aquisição de serviços,"85000000-9, Serviços de saúde e acção social","Centro Hospitalar e Universitário de Coimbra, E. P. E. (510103448)",Sagilab (504486799),"526,00 €",28-07-2014,28-07-2014,31 dias,"Portugal, Coimbra, Coimbra","Artigo 20.º, n.º 1, alínea a) do Código dos Contratos Públicos","","","","",,Não aplicável.,Não aplicável.,FALSE
"Aquisição de serviços de avaliação fisica e microbiológica das CFL (Câmaras de Fluxo Laminar) e Salas de Colheita e Processamento das PBPC do CHSJ, EPE",Ajuste Direto Regime Geral,Aquisição de serviços,"71900000-7, Serviços laboratoriais","Centro Hospitalar de São João, E. P. E. (509821197)",Sagilab Lda. (504486799),"3.600,00 €",22-07-2014,14-07-2014,15 dias,"Portugal, Porto, Porto","Artigo 20.º, n.º 1, alínea a) do Código dos Contratos Públicos","","","","",,Não aplicável.,Não aplicável.,FALSE
Subcontratação de análises fisico-quimicas e bacteriologicas,Ajuste Direto Regime Geral,Aquisição de serviços,"71620000-0, Serviços de análise",Instituto Superior de Engenharia do Porto (501540709),"SAGILAB-LABORATÓRIO ANÁLISES TÉCNICAS,LDA. (504486799)","77,26 €",07-07-2014,30-06-2014,1 dias,"Portugal, Porto, Porto","Artigo 20.º, n.º 1, alínea a) do Código dos Contratos Públicos",30-06-2014,"77,26 €","","",,Não aplicável.,Não aplicável.,FALSE
Subcontratação de análises fisico-quimicas e bacteriologicas,Ajuste Direto Regime Geral,Aquisição de serviços,"71620000-0, Serviços de análise",Instituto Superior de Engenharia do Porto (501540709),"SAGILAB-LABORATÓRIO ANÁLISES TÉCNICAS,LDA. (504486799)","191,30 €",07-07-2014,27-06-2014,1 dias,"Portugal, Porto, Porto","Artigo 20.º, n.º 1, alínea a) do Código dos Contratos Públicos",27-06-2014,"191,30 €","","",,Não aplicável.,Não aplicável.,FALSE
Subcontratação de análises fisico-quimicas e bacteriologicas,Ajuste Direto Regime Geral,Aquisição de serviços,"71620000-0, Serviços de análise",Instituto Superior de Engenharia do Porto (501540709),"SAGILAB-LABORATÓRIO ANÁLISES TÉCNICAS,LDA. (504486799)","464,40 €",07-07-2014,27-06-2014,1 dias,"Portugal, Porto, Porto","Artigo 20.º, n.º 1, alínea a) do Código dos Contratos Públicos",27-06-2014,"464,40 €","","",,Não aplicável.,Não aplicável.,FALSE
PRESTAÇÃO DE SERVIÇO DE ANÁLISES LABORATORIAIS PELO PRAZO DE DOIS ANOS,Ajuste Direto Regime Geral,Aquisição de serviços,"79723000-8, Serviços de análise de resíduos",Serviços Municipalizados de Electricidade Águas e Saneamento Câmara Municipal da Maia (680015124),"SAGILAB-LABORATORIO ANALISES TECNICAS, S.A. (504486799)","11.328,00 €",25-06-2014,23-06-2014,730 dias,"Portugal, Porto, Maia","Artigo 20.º, n.º 1, alínea a) do Código dos Contratos Públicos",26-07-2016,"5.694,90 €","",TERMINO DO PRAZO DO CONTRATO,,Não aplicável.,Não aplicável.,FALSE
Subcontratação de análises,Ajuste Direto Regime Geral,Aquisição de serviços,"71620000-0, Serviços de análise",Instituto Superior de Engenharia do Porto (501540709),"Sagilab, Sa (504486799)","19,13 €",12-06-2014,29-05-2014,1 dias,"Portugal, Porto, Porto","Artigo 20.º, n.º 1, alínea a) do Código dos Contratos Públicos",29-05-2014,"19,13 €","","",,Não aplicável.,Não aplicável.,FALSE
Subcontratação de análises,Ajuste Direto Regime Geral,Aquisição de serviços,"71620000-0, Serviços de análise",Instituto Superior de Engenharia do Porto (501540709),"Sagilab, Sa (504486799)","38,26 €",12-06-2014,29-05-2014,1 dias,"Portugal, Porto, Porto","Artigo 20.º, n.º 1, alínea a) do Código dos Contratos Públicos",29-05-2014,"38,26 €","","",,Não aplicável.,Não aplicável.,FALSE
Subcontratação de análises,Ajuste Direto Regime Geral,Aquisição de serviços,"71620000-0, Serviços de análise",Instituto Superior de Engenharia do Porto (501540709),"Sagilab, Sa (504486799)","19,13 €",12-06-2014,29-05-2014,1 dias,"Portugal, Porto, Porto","Artigo 20.º, n.º 1, alínea a) do Código dos Contratos Públicos",29-05-2014,"19,13 €","","",,Não aplicável.,Não aplicável.,FALSE
Subcontratação de análises,Ajuste Direto Regime Geral,Aquisição de serviços,"71620000-0, Serviços de análise",Instituto Superior de Engenharia do Porto (501540709),"Sagilab, sa (504486799)","39,00 €",12-06-2014,29-05-2014,1 dias,"Portugal, Porto, Porto","Artigo 20.º, n.º 1, alínea a) do Código dos Contratos Públicos",29-05-2014,"39,00 €","","",,Não aplicável.,Não aplicável.,FALSE
Subcontratação de análises,Ajuste Direto Regime Geral,Aquisição de serviços,"71620000-0, Serviços de análise",Instituto Superior de Engenharia do Porto (501540709),"Sagilab, Sa (504486799)","19,13 €",12-06-2014,29-05-2014,1 dias,"Portugal, Porto, Porto","Artigo 20.º, n.º 1, alínea a) do Código dos Contratos Públicos",29-05-2014,"19,13 €","","",,Não aplicável.,Não aplicável.,FALSE
Subcontratação de análises,Ajuste Direto Regime Geral,Aquisição de serviços,"71620000-0, Serviços de análise",Instituto Superior de Engenharia do Porto (501540709),"Sagilab, Sa (504486799)","344,34 €",12-06-2014,29-05-2014,1 dias,"Portugal, Porto, Porto","Artigo 20.º, n.º 1, alínea a) do Código dos Contratos Públicos",29-05-2014,"344,34 €","","",,Não aplicável.,Não aplicável.,FALSE
Subcontratação de análises,Ajuste Direto Regime Geral,Aquisição de serviços,"71620000-0, Serviços de análise",Instituto Superior de Engenharia do Porto (501540709),"Sagilab, Sa (504486799)","19,13 €",12-06-2014,29-05-2014,1 dias,"Portugal, Porto, Porto","Artigo 20.º, n.º 1, alínea a) do Código dos Contratos Públicos",29-05-2014,"19,13 €","","",,Não aplicável.,Não aplicável.,FALSE
Subcontratação de análises,Ajuste Direto Regime Geral,Aquisição de serviços,"71620000-0, Serviços de análise",Instituto Superior de Engenharia do Porto (501540709),"Sagilab, Sa (504486799)","38,26 €",12-06-2014,29-05-2014,1 dias,"Portugal, Porto, Porto","Artigo 20.º, n.º 1, alínea a) do Código dos Contratos Públicos",29-05-2014,"38,26 €","","",,Não aplicável.,Não aplicável.,FALSE
Prestação de serviços de realização de análises químicas (água e superfície),Ajuste Direto Regime Geral,Aquisição de serviços,"85111820-4, Serviços de análise bacteriológica",Município de Coimbra (506415082),"Sagilab - Laboratório Análises Técnicas, S.A. (504486799)","10.750,43 €",26-05-2014,22-05-2014,365 dias,"Portugal, Coimbra, Coimbra","Artigo 20.º, n.º 1, alínea a) do Código dos Contratos Públicos",22-05-2015,"10.571,51 €","",A  prestação de serviços foi dada como concluída.,,Não aplicável.,Não aplicável.,FALSE
Subcontratação de análises,Ajuste Direto Regime Geral,Aquisição de serviços,"71620000-0, Serviços de análise",Instituto Superior de Engenharia do Porto (501540709),"Sagilab - Laboratório de análises Técnicas , SA (504486799)","267,82 €",14-05-2014,30-04-2014,30 dias,"Portugal, Porto, Porto","Artigo 20.º, n.º 1, alínea a) do Código dos Contratos Públicos",30-04-2014,"267,82 €","","",,Não aplicável.,Não aplicável.,FALSE
Subcontratação de análises fisico-quimicas e bacteriologicas,Ajuste Direto Regime Geral,Aquisição de serviços,"71620000-0, Serviços de análise",Instituto Superior de Engenharia do Porto (501540709),"Sagilab- Laboratório análises tecnicas, Sa (504486799)","2.123,80 €",06-05-2014,24-04-2014,1 dias,"Portugal, Porto, Porto","Artigo 20.º, n.º 1, alínea a) do Código dos Contratos Públicos",24-04-2014,"2.123,80 €","","",,Não aplicável.,Não aplicável.,FALSE
Subcontratação de análises fisico-quimicas e bacteriologicas,Ajuste Direto Regime Geral,Aquisição de serviços,"71620000-0, Serviços de análise",Instituto Superior de Engenharia do Porto (501540709),"Sagilab Laboratorio de Análises Tecnicas, Sa (504486799)","39,00 €",06-05-2014,24-04-2014,1 dias,"Portugal, Porto, Porto","Artigo 20.º, n.º 1, alínea a) do Código dos Contratos Públicos",24-04-2014,"39,00 €","","",,Não aplicável.,Não aplicável.,FALSE
Seleção de fornecedores para o acordo quadro de produtos para tratamento e análises das águas,Concurso público,Outros Tipos (Acordo quadro),"71620000-0, Serviços de análise",CI-AMAL - Comunidade Internacional do Algarve (502971096),"Agroleico - Laboratório de análises químicas e bacteriológicas, Lda. (501422790), Sagilab - Laboratório de análises técnicas, S.A. (504486799)","369,01 €",25-02-2014,19-02-2014,1095 dias,"Portugal, Faro","Artigo 20.º, n.º 1, alínea b) do Código dos Contratos Públicos","","","","",,609697,Acordo quadro de produtos para tratamento e análises das águas,TRUE
Prestação de Serviço de Análises Químicas sem possibilidade de subcontratação para o Centro de Estudos de Águas do Instituto Superior de Engenharia do Porto,Ajuste Direto Regime Geral,Aquisição de serviços,"85148000-8, Serviços de análises clínicas",Instituto Superior de Engenharia do Porto (501540709),"SAGILAB-LABORATÓRIO ANÁLISES TÉCNICAS,LDA. (504486799)","1,00 €",09-09-2013,24-08-2013,113 dias,"Portugal, Porto, Porto","Artigo 20.º, n.º 1, alínea a) do Código dos Contratos Públicos",24-08-2013,"1,00 €","","",,Não aplicável.,Não aplicável.,
"Ajuste direto para a realização de várias análises bacteriológicas e físico-químicas, para as Piscinas Municipais",Ajuste Direto Regime Geral,Aquisição de serviços,"85100000-0, Serviços de saúde",Município de Gondomar (506848957),"Sagilab - Laboratório Análises Técnicas, S.A. (504486799)","14.864,00 €",02-01-2013,28-12-2012,365 dias,"Portugal, Porto, Gondomar","Artigo 20.º, n.º 1, alínea a) do Código dos Contratos Públicos",30-12-2013,"14.054,06 €","",Verificou-se que houve serviços a menos relativamente aos inicialmente contratados.,,Não aplicável.,Não aplicável.,
Prestação de serviços de análises parasitológicas NE 3193306868 LAB<br/>INF-137/2012,Ajuste Direto Regime Geral,Aquisição de serviços,"90733100-5, Serviços de monitorização ou controlo da poluição de águas superficiais","Águas do Noroeste, S.A. (509436595)","Sagilab, Lda (504486799)","17.212,00 €",18-05-2012,03-02-2012,0 dias,"Portugal, Braga, Barcelos","Artigo 20.º, n.º 1, alínea a) do Código dos Contratos Públicos",31-12-2012,"14.574,00 €","",Trabalhos a menos,,Não aplicável.,Não aplicável.,
"Fornecimento contínuo de produtos químicos para a desinfeção e limpeza dos planos de água das piscinas municipais de faro e das fontes ornamentais, bem como a recolha de amostras para a elaboração de análises químicas aos planos de água das piscinas municipais de faro.",Concurso público,Outros Tipos (Não Preenchido),"98300000-6, Serviços diversos",Município de Faro (506579425),"Sagilab - Laboratório de Análises Técnicas, S.A. (504486799)","27.208,00 €",16-03-2012,08-02-2012,730 dias,"Portugal, Faro, Faro","Artigo 20.º, n.º 1, alínea b) do Código dos Contratos Públicos",08-02-2014,"27.208,00 €","","",,Não aplicável.,Não aplicável.,
Prestação de Serviço de Controlo da Qualidade dos Efluentes das ETARs durante o ano de 2012,Ajuste Direto Regime Geral,Aquisição de serviços,"90600000-3, Serviços de saneamento e limpeza em áreas urbanas ou rurais, e serviços conexos",Município de Baião (506854299),"Sagilab - Laboratório de Análises Técnicas, S.A. (504486799)","13.704,00 €",08-02-2012,03-02-2012,366 dias,"Portugal, Porto, Baião","Artigo 20.º, n.º 1, alínea a) do Código dos Contratos Públicos","","","","",,Não aplicável.,Não aplicável.,
Ajuste directo para a realização de várias análises bacteriológicas e físico químicas,Ajuste Direto Regime Geral,Aquisição de serviços,"85100000-0, Serviços de saúde",Município de Gondomar (506848957),"Sagilab - Laboratório Análises Técnicas, S.A. (504486799)","18.200,00 €",14-12-2011,07-12-2011,336 dias,"Portugal, Porto, Gondomar","Artigo 20.º, n.º 1, alínea a) do Código dos Contratos Públicos",01-04-2013,"16.939,51 €","",Verificou-se que houve serviços a menos relativamente aos inicialmente contratados.,,Não aplicável.,Não aplicável.,
Prestação de Serviço de Controlo da Qualidade dos Efluentes das ETARs de Julho a Dezembro de 2011,Ajuste Direto Regime Geral,Aquisição de serviços,"90600000-3, Serviços de saneamento e limpeza em áreas urbanas ou rurais, e serviços conexos",Município de Baião (506854299),"Sagilab - Laboratório Análises Técnicas, Lda. (504486799)","6.852,00 €",29-08-2011,22-08-2011,184 dias,"Portugal, Porto, Baião","Artigo 20.º, n.º 1, alínea a) do Código dos Contratos Públicos","","","","",,Não aplicável.,Não aplicável.,
Prestação de Serviço de Recolha de Análises das ETARs durante o 1º Semestre de 2011,Ajuste Direto Regime Geral,Aquisição de serviços,"90600000-3, Serviços de saneamento e limpeza em áreas urbanas ou rurais, e serviços conexos",Município de Baião (506854299),"SAGILAB - Laboratório Análises Técnicas, S.A. (504486799)","6.852,00 €",23-03-2011,16-03-2011,182 dias,"Portugal, Porto, Baião","Artigo 20.º, n.º 1, alínea a) do Código dos Contratos Públicos","","","","",,Não aplicável.,Não aplicável.,
Análises Parasitológicas,Ajuste Direto Regime Geral,Aquisição de serviços,"85111820-4, Serviços de análise bacteriológica","Águas do Noroeste, S.A. (509436595)",Sagilab (504486799),"12.200,00 €",20-01-2011,10-01-2011,0 dias,"Portugal, Braga, Barcelos","Artigo 20.º, n.º 1, alínea a) do Código dos Contratos Públicos",31-12-2011,"11.000,00 €",Não houve,Trabalhos a menos,,Não aplicável.,Não aplicável.,
"Realização de várias análises bacteriológicas e físico químicas, para as Piscinas Municipais",Ajuste Direto Regime Geral,Aquisição de serviços,"85148000-8, Serviços de análises clínicas",Município de Gondomar (506848957),"Sagilab - laboratório Análises Técnicas, S.A (504486799)","15.400,00 €",13-12-2010,06-12-2010,310 dias,"Portugal, Porto, Gondomar","Artigo 20.º, n.º 1, alínea a) do Código dos Contratos Públicos",28-09-2012,"14.169,02 €","",Verificou-se que houve serviços a menos relativamente aos inicialmente contratados.,,Não aplicável.,Não aplicável.,
"Análises químicas - realização de colheitas e análises (água, ar e superfície)",Ajuste Direto Regime Geral,Aquisição de serviços,"71900000-7, Serviços laboratoriais",Município de Coimbra (506415082),"Sagilab - Laboratório de Análises Técnicas, SA. (504486799)","18.937,92 €",16-08-2010,13-08-2010,365 dias,"Portugal, Coimbra, Coimbra","Artigo 20.º, n.º 1, alínea a) do Código dos Contratos Públicos",29-07-2011,"18.937,92 €","","",,Não aplicável.,Não aplicável.,
Prestação de Serviço de Controlo da Qualidade dos Efluentes das ETARs durante o ano de 2010,Ajuste Direto Regime Geral,Aquisição de serviços,"90491000-5, Serviços de inspecção de esgotos",Município de Baião (506854299),"Sagilab - Laboratórios de Análises Técnicas, S.A. (504486799)","9.960,00 €",10-05-2010,10-04-2010,365 dias,"Portugal, Porto, Baião","Artigo 20.º, n.º 1, alínea a) do Código dos Contratos Públicos","","","","",,Não aplicável.,Não aplicável.,
Ajuste directo para a realização de várias análises bacteriológicas e físico químicas das águas das Piscinas Municipais,Ajuste Direto Regime Geral,Aquisição de serviços,"71900000-7, Serviços laboratoriais",Município de Gondomar (506848957),Sagilab - Laboratório Análises Técnicas S.A. (504486799),"16.940,00 €",20-01-2010,13-01-2010,365 dias,"Portugal, Porto, Gondomar","Artigo 20.º, n.º 1, alínea a) do Código dos Contratos Públicos","","","","",,Não aplicável.,Não aplicável.,
Aquisição de Serviços para controlo analitico dos reservatórios a implementar nas Freguesias de Sanfins e Eiriz,Ajuste Direto Regime Geral,Aquisição de serviços,"98390000-3, Outros serviços",Município de Paços de Ferreira (502173297),"SAGILAB - Laboratório de Análises Técnicas, S.A. (504486799)","33.512,00 €",23-11-2009,23-11-2009,730 dias,"Portugal, Porto, Paços de Ferreira","Artigo 20.º, n.º 1, alínea a) do Código dos Contratos Públicos","","","","",,Não aplicável.,Não aplicável.,
Aquisição de reagentes.,Ajuste Direto Regime Geral,Aquisição de bens móveis,"33696500-0, Reagentes de laboratório","Instituto Nacional de Saúde Dr. Ricardo Jorge, I.P. (501427511)","Sagilab - Laboratório de Análises Técnicas, SA (504486799)","2.548,00 €",10-11-2009,01-10-2009,21 dias,"Portugal, Porto, Porto<BR/>Portugal, Lisboa, Lisboa","Artigo 20.º, n.º 1, alínea a) do Código dos Contratos Públicos","","","","",,Não aplicável.,Não aplicável.,
Controlo da qualidade dos efluentes das Etars,Ajuste Direto Regime Geral,"","",Município de Baião (506854299),"SAGILAB – Laboratório de Análises Técnicas, SA (504486799)","9.360,00 €",16-02-2009,"",10 dias,"",Não Preenchido,"","","","",,Não aplicável.,Não aplicável.,
