Objeto do Contrato,Tipo de Procedimento,Tipo(s) de Contrato,CPVs,Entidade(s) Adjudicante(s),Entidade(s) Adjudicatária(s),Preço Contratual,Data de Publicação,Data de Celebração do Contrato,Prazo de Execução,Local de Execução,Fundamentação,Data de Fecho do Contrato,Preço Total Efetivo,Causas das Alterações ao Prazo,Causas das Alterações ao Preço,Estado,N.º registo do Acordo Quadro,Descrição do Acordo Quadro,Procedimento Centralizado
Aquisição de UPS para a ULSAM,Ajuste Direto Regime Geral,Aquisição de bens móveis,"35113000-9, Equipamento de segurança","Unidade Local de Saúde do Alto Minho, EPE (ULSAM) (508786193)","Emerson Network Power, Lda. (503322520)","146,00 €",05-10-2015,01-10-2015,30 dias,"Portugal, Viana do Castelo, Viana do Castelo","Artigo 20.º, n.º 1, alínea a) do Código dos Contratos Públicos",,,,,,Não aplicável.,Não aplicável.,FALSE
Aquisição de UPS para a ULSAM,Ajuste Direto Regime Geral,Aquisição de bens móveis,"35113000-9, Equipamento de segurança","Unidade Local de Saúde do Alto Minho, EPE (ULSAM) (508786193)","Maxiglobal, S. A. (504320882)","3.280,12 €",05-10-2015,01-10-2015,30 dias,"Portugal, Viana do Castelo, Monção","Artigo 20.º, n.º 1, alínea a) do Código dos Contratos Públicos",,,,,,Não aplicável.,Não aplicável.,FALSE
Aquisição de Papeleiras Exteriores para a ULSAM,Ajuste Direto Regime Geral,Aquisição de bens móveis,"39150000-8, Mobiliário e equipamento diverso","Unidade Local de Saúde do Alto Minho, EPE (ULSAM) (508786193)","Decitrel Inovação - Tecnologias para Educação, S. A. (507883594)","2.926,00 €",01-10-2015,25-09-2015,30 dias,"Portugal, Viana do Castelo, Viana do Castelo","Artigo 20.º, n.º 1, alínea a) do Código dos Contratos Públicos",,,,,,Não aplicável.,Não aplicável.,FALSE
Aquisição de Carros Elevação Elétrica,Ajuste Direto Regime Geral,Aquisição de bens móveis,"33180000-5, Apoio funcional","Unidade Local de Saúde do Alto Minho, EPE (ULSAM) (508786193)","PROHS - Equipamento Hospitalar e Serviços Associados, S. A. (505005468)","4.500,00 €",01-10-2015,25-09-2015,30 dias,"Portugal, Viana do Castelo, Viana do Castelo","Artigo 20.º, n.º 1, alínea a) do Código dos Contratos Públicos",,,,,,Não aplicável.,Não aplicável.,FALSE
Aquisição de Cadeirões para a ULSAM,Ajuste Direto Regime Geral,Aquisição de bens móveis,"39150000-8, Mobiliário e equipamento diverso","Unidade Local de Saúde do Alto Minho, EPE (ULSAM) (508786193)","RMV Produtos Hospitalares Unipessoal, Lda. (507866347)","1.600,00 €",01-10-2015,25-09-2015,30 dias,"Portugal, Viana do Castelo","Artigo 20.º, n.º 1, alínea a) do Código dos Contratos Públicos",,,,,,Não aplicável.,Não aplicável.,FALSE
