freguesia,acronym,validVotesPercentage,votes,dicofre
Sandomil,PS,46.85,134,091212
Sandomil,PPD/PSD,31.82,91,091212
Sandomil,B.E.,5.59,16,091212
Sandomil,CDS-PP,3.85,11,091212
Sandomil,PPM.PPV/CDC,1.75,5,091212
Sandomil,PURP,1.75,5,091212
Sandomil,A,1.4,4,091212
Sandomil,IL,1.4,4,091212
Sandomil,PCP-PEV,1.4,4,091212
Sandomil,L,1.05,3,091212
Sandomil,PAN,1.05,3,091212
Sandomil,PCTP/MRPP,1.05,3,091212
Sandomil,PNR,0.7,2,091212
Sandomil,PTP,0.35,1,091212
Sandomil,MAS,0,0,091212
Sandomil,NC,0,0,091212
Sandomil,PDR,0,0,091212
