freguesia,acronym,validVotesPercentage,votes,dicofre
União das freguesias de Beja (Salvador e Santa Maria da Feira),PS,31.34,779,020520
União das freguesias de Beja (Salvador e Santa Maria da Feira),PCP-PEV,21.76,541,020520
União das freguesias de Beja (Salvador e Santa Maria da Feira),B.E.,13.92,346,020520
União das freguesias de Beja (Salvador e Santa Maria da Feira),PPD/PSD,11.67,290,020520
União das freguesias de Beja (Salvador e Santa Maria da Feira),CDS-PP,4.95,123,020520
União das freguesias de Beja (Salvador e Santa Maria da Feira),PAN,4.67,116,020520
União das freguesias de Beja (Salvador e Santa Maria da Feira),PPM.PPV/CDC,3.46,86,020520
União das freguesias de Beja (Salvador e Santa Maria da Feira),L,2.41,60,020520
União das freguesias de Beja (Salvador e Santa Maria da Feira),A,2.17,54,020520
União das freguesias de Beja (Salvador e Santa Maria da Feira),NC,1.05,26,020520
União das freguesias de Beja (Salvador e Santa Maria da Feira),PCTP/MRPP,1.01,25,020520
União das freguesias de Beja (Salvador e Santa Maria da Feira),PNR,0.56,14,020520
União das freguesias de Beja (Salvador e Santa Maria da Feira),IL,0.28,7,020520
União das freguesias de Beja (Salvador e Santa Maria da Feira),PDR,0.28,7,020520
União das freguesias de Beja (Salvador e Santa Maria da Feira),MAS,0.2,5,020520
União das freguesias de Beja (Salvador e Santa Maria da Feira),PURP,0.16,4,020520
União das freguesias de Beja (Salvador e Santa Maria da Feira),PTP,0.12,3,020520
