Objeto do Contrato,Tipo de Procedimento,Tipo(s) de Contrato,CPVs,Entidade(s) Adjudicante(s),Entidade(s) Adjudicatária(s),Preço Contratual,Data de Publicação,Data de Celebração do Contrato,Prazo de Execução,Local de Execução,Fundamentação,Data de Fecho do Contrato,Preço Total Efetivo,Causas das Alterações ao Prazo,Causas das Alterações ao Preço,Estado,N.º registo do Acordo Quadro,Descrição do Acordo Quadro,Procedimento Centralizado
Assistência técnica aos equipamentos UPS e refrigeração dos datacenter,Ajuste Direto Regime Geral,Aquisição de serviços,"50000000-5, Serviços de reparação e manutenção","Instituto Nacional de Emergência Médica, I. P. (501356126)","Integrator - Tecnologias de Informação, Lda. (506619290)","11.157,12 €",20-04-2016,11-04-2016,270 dias,"Portugal, Lisboa, Lisboa","Artigo 20.º, n.º 1, alínea a) do Código dos Contratos Públicos",,,,,,Não aplicável.,Não aplicável.,FALSE
Recolha de resíduos hospitalares,Ajuste Direto Regime Geral,Aquisição de serviços,"90000000-7, Serviços relativos a águas residuais, resíduos, limpeza e ambiente","Instituto Nacional de Emergência Médica, I. P. (501356126)","AMBIMED - Gestão Ambiental, Lda. (503593427)","17.646,00 €",20-04-2016,30-03-2016,365 dias,"Portugal, Portugal Continental","Artigo 20.º, n.º 1, alínea a) do Código dos Contratos Públicos",,,,,,Não aplicável.,Não aplicável.,FALSE
"Fornecimento de 2000 eléctrodos multifunções LP1000 QUICK-COMBO, 20 cabos USB para lp12 rohs accessory 11996-000288, 10 cabos paciente masimo RC LNCS paraLP15, 10 sen. d/dedo dura-sensor DS100A, 4 baterias para LP15 e 20 baterias LP 1000.",Ajuste Direto Regime Geral,Aquisição de bens móveis,"33000000-0, Equipamento médico, medicamentos e produtos para cuidados pessoais","Instituto Nacional de Emergência Médica, I. P. (501356126)","PHYSIO PORTUGAL SALES, UNIPESSOAL, LDA (510137946)","49.937,60 €",12-04-2016,07-03-2016,8 dias,"Portugal, Lisboa, Lisboa","Artigo 24.º, n.º 1, alínea e) do Código dos Contratos Públicos",,,,,,Não aplicável.,Não aplicável.,FALSE
REPARAÇÃO DE VIATURA MATRÍCULA 40-HC-88 (MOTOR),Ajuste Direto Regime Geral,Aquisição de bens móveis,"34300000-0, Peças e acessórios para veículos e seus motores","Instituto Nacional de Emergência Médica, I. P. (501356126)",HEROIS DAS ESTRELAS LDA (513617701),"7.427,27 €",12-04-2016,08-04-2016,5 dias,"Portugal, Lisboa, Lisboa","Artigo 20.º, n.º 1, alínea a) do Código dos Contratos Públicos",,,,,,Não aplicável.,Não aplicável.,FALSE
Aquisição de 200 rolos de pano para limpeza e desinfeção descartáveis,Ajuste Direto Regime Geral,Aquisição de bens móveis,"39000000-2, Mobiliário (incl. de escritório), acessórios, aparelhos domésticos (excl. iluminação) e produtos de limpeza","Instituto Nacional de Emergência Médica, I. P. (501356126)","SERVISAN-PRODUTOS,HIGIENE,SA (500246530)","4.540,00 €",12-04-2016,30-03-2016,5 dias,"Portugal, Lisboa, Lisboa","Artigo 20.º, n.º 1, alínea a) do Código dos Contratos Públicos",,,,,,Não aplicável.,Não aplicável.,FALSE
Assistência Técnica Elevadores,Ajuste Direto Regime Geral,Aquisição de serviços,"50000000-5, Serviços de reparação e manutenção","Instituto Nacional de Emergência Médica, I. P. (501356126)",Thyssenkrupp Elevadores SA (501445226),"3.252,48 €",12-04-2016,04-03-2016,31 dias,"Portugal, Lisboa, Lisboa","Artigo 20.º, n.º 1, alínea a) do Código dos Contratos Públicos",,,,,,Não aplicável.,Não aplicável.,FALSE
Desinfestação e controlo de pragas nas diversas instalações do INEM,Ajuste Direto Regime Geral,Aquisição de serviços,"90000000-7, Serviços relativos a águas residuais, resíduos, limpeza e ambiente","Instituto Nacional de Emergência Médica, I. P. (501356126)",AMBINORMA II (507583698),"2.326,75 €",12-04-2016,26-02-2016,306 dias,"Portugal, Lisboa, Lisboa","Artigo 20.º, n.º 1, alínea a) do Código dos Contratos Públicos",,,,,,Não aplicável.,Não aplicável.,FALSE
"Aquisição de serviços de gestão oficinal de frota pelo INEM, I.P., serviços estes que englobam a gestão da assistência, manutenção e reparações da frota de viaturas do Instituto em qualquer ponto do território do continente",Ajuste Direto Regime Geral,Aquisição de serviços,"50000000-5, Serviços de reparação e manutenção","Instituto Nacional de Emergência Médica, I. P. (501356126)","FINLOG - Aluguer e Comércio de Automóveis, S.A. (502584866)","502.000,00 €",11-04-2016,30-12-2015,60 dias,"Portugal, Portugal Continental","Artigo 27.º, n.º 1, alínea a) do Código dos Contratos Públicos",,,,,,Não aplicável.,Não aplicável.,FALSE
Aquisição de serviços de seguros,Ajuste Direto Regime Geral,Aquisição de serviços,"66000000-0, Serviços de finanças e seguros","Instituto Nacional de Emergência Médica, I. P. (501356126)","FIDELIDADE - Companhia de Seguros, S.A. (500918880)","767.143,61 €",11-04-2016,30-12-2015,366 dias,"Portugal, Portugal Continental","Artigo 27.º, n.º 1, alínea a) do Código dos Contratos Públicos",,,,,,Não aplicável.,Não aplicável.,FALSE
Manutenção para as aplicações Intergraph do Sistema Integrado de Atendimento e Despacho de Emergência Médica (SIADEM) e Site Utilizations Agreement (SUA),Ajuste Direto Regime Geral,Aquisição de serviços,"72000000-5, Serviços de TI: consultoria, desenvolvimento de software, Internet e apoio","Instituto Nacional de Emergência Médica, I. P. (501356126)","INTERGRAPH (PORTUGAL) - Sistemas de Computação Gráfica, S.A. (502679468)","198.184,12 €",11-04-2016,31-03-2016,366 dias,"Portugal, Porto, Porto<BR/>Portugal, Lisboa, Lisboa<BR/>Portugal, Coimbra, Coimbra","Artigo 24.º, n.º 1, alínea e) do Código dos Contratos Públicos",,,,,,Não aplicável.,Não aplicável.,FALSE
REPARAÇÃO DE VIATURA MATRÍCULA 40-GZ-96,Ajuste Direto Regime Geral,Aquisição de serviços,"50100000-6, Serviços de reparação e manutenção de veículos e equipamento afim, e serviços conexos","Instituto Nacional de Emergência Médica, I. P. (501356126)",CAETANO TECKNIK S.A. (500112967),"6.200,81 €",11-04-2016,08-04-2016,5 dias,"Portugal, Lisboa, Lisboa","Artigo 20.º, n.º 1, alínea a) do Código dos Contratos Públicos",,,,,,Não aplicável.,Não aplicável.,FALSE
REPARAÇÃO DE VIATURA MATRÍCULA 42-NJ-75,Ajuste Direto Regime Geral,Aquisição de serviços,"50100000-6, Serviços de reparação e manutenção de veículos e equipamento afim, e serviços conexos","Instituto Nacional de Emergência Médica, I. P. (501356126)",TANGENT EMOTION LDA (513636447),"5.827,30 €",11-04-2016,08-04-2016,5 dias,"Portugal, Lisboa, Lisboa","Artigo 20.º, n.º 1, alínea a) do Código dos Contratos Públicos",,,,,,Não aplicável.,Não aplicável.,FALSE
REPARAÇÃO DE VIATURA MATRÍCULA 34-38-XO,Ajuste Direto Regime Geral,Aquisição de serviços,"50100000-6, Serviços de reparação e manutenção de veículos e equipamento afim, e serviços conexos","Instituto Nacional de Emergência Médica, I. P. (501356126)",HEROIS DAS ESTRELAS LDA (513617701),"5.160,11 €",11-04-2016,08-04-2016,5 dias,"Portugal, Lisboa, Lisboa","Artigo 20.º, n.º 1, alínea a) do Código dos Contratos Públicos",,,,,,Não aplicável.,Não aplicável.,FALSE
REPARAÇÃO DE VIATURA MATRÍCULA 47-NJ-80,Ajuste Direto Regime Geral,Aquisição de serviços,"50100000-6, Serviços de reparação e manutenção de veículos e equipamento afim, e serviços conexos","Instituto Nacional de Emergência Médica, I. P. (501356126)",TANGENTE RADICAL LDA. (513681043),"5.355,13 €",11-04-2016,08-04-2016,5 dias,"Portugal, Lisboa, Lisboa","Artigo 20.º, n.º 1, alínea a) do Código dos Contratos Públicos",,,,,,Não aplicável.,Não aplicável.,FALSE
CONSUMOS ÁGUA 2016,Ajuste Direto Regime Geral,Aquisição de serviços,"65100000-4, Serviços de distribuição de água e serviços conexos","Instituto Nacional de Emergência Médica, I. P. (501356126)","EPAL, SA (500906840)","9.433,96 €",11-04-2016,15-02-2016,365 dias,"Portugal, Lisboa, Lisboa","Artigo 24.º, n.º 1, alínea e) do Código dos Contratos Públicos",,,,,,Não aplicável.,Não aplicável.,FALSE
REPARAÇÃO DE VIATURA MATRÍCULA 39-EP-14 (MOTOR),Ajuste Direto Regime Geral,Aquisição de bens móveis,"34300000-0, Peças e acessórios para veículos e seus motores","Instituto Nacional de Emergência Médica, I. P. (501356126)",JAPBLUE (510140106),"6.552,02 €",11-04-2016,15-03-2016,5 dias,"Portugal, Lisboa, Lisboa","Artigo 20.º, n.º 1, alínea a) do Código dos Contratos Públicos",,,,,,Não aplicável.,Não aplicável.,FALSE
REPARAÇÃO DE VIATURA MATRÍCULA 41-GZ-12 (MOTOR),Ajuste Direto Regime Geral,Aquisição de bens móveis,"34300000-0, Peças e acessórios para veículos e seus motores","Instituto Nacional de Emergência Médica, I. P. (501356126)","ARAL, LDA. (500492034)","9.558,15 €",11-04-2016,08-03-2016,5 dias,"Portugal, Lisboa, Lisboa","Artigo 20.º, n.º 1, alínea a) do Código dos Contratos Públicos",,,,,,Não aplicável.,Não aplicável.,FALSE
REPARAÇÃO DE VIATURA MATRÍCULA 14-GZ-82,Ajuste Direto Regime Geral,Aquisição de serviços,"50100000-6, Serviços de reparação e manutenção de veículos e equipamento afim, e serviços conexos","Instituto Nacional de Emergência Médica, I. P. (501356126)",TANGENTES E CORRENTES LDA. (513711058),"8.810,93 €",11-04-2016,24-03-2016,5 dias,"Portugal, Lisboa, Lisboa","Artigo 20.º, n.º 1, alínea a) do Código dos Contratos Públicos",,,,,,Não aplicável.,Não aplicável.,FALSE
