freguesia,acronym,validVotesPercentage,votes,dicofre
Amoreira,PS,34.36,89,101202
Amoreira,PPD/PSD,28.96,75,101202
Amoreira,B.E.,9.27,24,101202
Amoreira,CDS-PP,6.56,17,101202
Amoreira,PAN,6.18,16,101202
Amoreira,PCP-PEV,5.79,15,101202
Amoreira,PPM.PPV/CDC,2.32,6,101202
Amoreira,L,1.93,5,101202
Amoreira,PURP,1.54,4,101202
Amoreira,NC,1.16,3,101202
Amoreira,PNR,0.77,2,101202
Amoreira,A,0.39,1,101202
Amoreira,PCTP/MRPP,0.39,1,101202
Amoreira,PDR,0.39,1,101202
Amoreira,IL,0,0,101202
Amoreira,MAS,0,0,101202
Amoreira,PTP,0,0,101202
