freguesia,acronym,validVotesPercentage,votes,dicofre
Parada,PPD/PSD.CDS-PP,42.25,30,160515
Parada,PS,33.8,24,160515
Parada,MPT,5.63,4,160515
Parada,PCTP/MRPP,5.63,4,160515
Parada,L,2.82,2,160515
Parada,PCP-PEV,2.82,2,160515
Parada,B.E.,1.41,1,160515
Parada,PAN,1.41,1,160515
Parada,PDA,1.41,1,160515
Parada,PNR,1.41,1,160515
Parada,PTP,1.41,1,160515
Parada,MAS,0,0,160515
Parada,PND,0,0,160515
Parada,POUS,0,0,160515
Parada,PPM,0,0,160515
Parada,PPV,0,0,160515
