freguesia,acronym,validVotesPercentage,votes,dicofre
"União das freguesias de Messegães, Valadares e Sá",PS,43.07,118,160437
"União das freguesias de Messegães, Valadares e Sá",PPD/PSD,35.77,98,160437
"União das freguesias de Messegães, Valadares e Sá",B.E.,7.3,20,160437
"União das freguesias de Messegães, Valadares e Sá",CDS-PP,4.74,13,160437
"União das freguesias de Messegães, Valadares e Sá",PCP-PEV,1.46,4,160437
"União das freguesias de Messegães, Valadares e Sá",IL,1.09,3,160437
"União das freguesias de Messegães, Valadares e Sá",NC,1.09,3,160437
"União das freguesias de Messegães, Valadares e Sá",PAN,1.09,3,160437
"União das freguesias de Messegães, Valadares e Sá",PCTP/MRPP,1.09,3,160437
"União das freguesias de Messegães, Valadares e Sá",PDR,1.09,3,160437
"União das freguesias de Messegães, Valadares e Sá",CH,0.73,2,160437
"União das freguesias de Messegães, Valadares e Sá",L,0.36,1,160437
"União das freguesias de Messegães, Valadares e Sá",PNR,0.36,1,160437
"União das freguesias de Messegães, Valadares e Sá",PPM,0.36,1,160437
"União das freguesias de Messegães, Valadares e Sá",R.I.R.,0.36,1,160437
"União das freguesias de Messegães, Valadares e Sá",A,0,0,160437
"União das freguesias de Messegães, Valadares e Sá",JPP,0,0,160437
"União das freguesias de Messegães, Valadares e Sá",MPT,0,0,160437
"União das freguesias de Messegães, Valadares e Sá",PTP,0,0,160437
"União das freguesias de Messegães, Valadares e Sá",PURP,0,0,160437
