freguesia,acronym,validVotesPercentage,votes,dicofre
Funchal (Sé),PPD/PSD,43.36,604,310310
Funchal (Sé),PS,33.09,461,310310
Funchal (Sé),CDS-PP,6.25,87,310310
Funchal (Sé),B.E.,5.46,76,310310
Funchal (Sé),PCP-PEV,3.02,42,310310
Funchal (Sé),PAN,1.87,26,310310
Funchal (Sé),IL,1.44,20,310310
Funchal (Sé),JPP,1.22,17,310310
Funchal (Sé),L,0.79,11,310310
Funchal (Sé),PURP,0.72,10,310310
Funchal (Sé),PTP,0.65,9,310310
Funchal (Sé),CH,0.57,8,310310
Funchal (Sé),MPT,0.5,7,310310
Funchal (Sé),R.I.R.,0.36,5,310310
Funchal (Sé),A,0.29,4,310310
Funchal (Sé),PCTP/MRPP,0.22,3,310310
Funchal (Sé),NC,0.07,1,310310
Funchal (Sé),PDR,0.07,1,310310
Funchal (Sé),PPM,0.07,1,310310
Funchal (Sé),PNR,0,0,310310
