Objeto do Contrato,Tipo de Procedimento,Tipo(s) de Contrato,CPVs,Entidade(s) Adjudicante(s),Entidade(s) Adjudicatária(s),Preço Contratual,Data de Publicação,Data de Celebração do Contrato,Prazo de Execução,Local de Execução,Fundamentação,Data de Fecho do Contrato,Preço Total Efetivo,Causas das Alterações ao Prazo,Causas das Alterações ao Preço,Estado,N.º registo do Acordo Quadro,Descrição do Acordo Quadro,Procedimento Centralizado
420118/2017 - Conjuntos anestesia,Ajuste Direto Regime Geral,Aquisição de bens móveis,"33171000-9, Material para anestesia e reanimação","Hospital Distrital de Santarém, EPE (506361462)","Becton Dickinson, Unipessoal Lda (980245214)","7.788,00 €",29-09-2017,21-09-2017,120 dias,"Portugal, Santarém, Santarém","Artigo 24.º, n.º 1, alínea b) do Código dos Contratos Públicos",,,,,,Não aplicável.,Não aplicável.,FALSE
470035/2017 - Sinalização exterior horizontal e vertical,Ajuste Direto Regime Geral,Aquisição de bens móveis,"34996000-5, Equipamento de controlo, segurança ou sinalização para estradas","Hospital Distrital de Santarém, E. P. E. (506361462)","SinalNorte, Sinalização e Marcação de Estradas, Lda (501332464)","3.030,65 €",26-09-2017,08-09-2017,30 dias,"Portugal, Santarém, Santarém","Artigo 20.º, n.º 1, alínea a) do Código dos Contratos Públicos",,,,,,Não aplicável.,Não aplicável.,FALSE
"770023/2017 - Redutor de C02, Debitómetro e Vacuómetro ",Ajuste Direto Regime Geral,Aquisição de bens móveis,"33100000-1, Equipamento médico","Hospital Distrital de Santarém, E. P. E. (506361462)","Air Liquide Medicinal, SA (501576436)","14.006,94 €",26-09-2017,11-09-2017,30 dias,"Portugal, Santarém, Santarém","Artigo 26.º, n.º 1, alínea a) do Código dos Contratos Públicos",,,,,,Não aplicável.,Não aplicável.,FALSE
Sistemas de Pacemaker,Concurso público,Aquisição de bens móveis,"33182210-4, Estimulador cardíaco (pacemaker)","Hospital Distrital de Santarém, E. P. E. (506361462)","BIOTRONIK PORTUGAL UNIPESSOAL, LDA (510726941)","16.050,00 €",25-09-2017,28-07-2017,90 dias,"Portugal, Santarém, Santarém","Artigo 20.º, n.º 1, alínea b) do Código dos Contratos Públicos",,,,,,Não aplicável.,Não aplicável.,FALSE
Sistemas de Pacemaker,Concurso público,Aquisição de bens móveis,"33182210-4, Estimulador cardíaco (pacemaker)","Hospital Distrital de Santarém, E. P. E. (506361462)","ST JUDE MEDICAL PORTUGAL, LDA (504180746)","84.300,00 €",25-09-2017,31-07-2017,90 dias,"Portugal, Santarém, Santarém","Artigo 20.º, n.º 1, alínea b) do Código dos Contratos Públicos",,,,,,Não aplicável.,Não aplicável.,FALSE
Sistemas de Pacemaker,Concurso público,Aquisição de bens móveis,"33182210-4, Estimulador cardíaco (pacemaker)","Hospital Distrital de Santarém, E. P. E. (506361462)","BOSTON SCIENTIFIC PORTUGAL, LDA (504988964)","71.750,00 €",25-09-2017,28-07-2017,90 dias,"Portugal, Santarém, Santarém","Artigo 20.º, n.º 1, alínea b) do Código dos Contratos Públicos",,,,,,Não aplicável.,Não aplicável.,FALSE
Sistemas de Pacemaker,Concurso público,Aquisição de bens móveis,"33182210-4, Estimulador cardíaco (pacemaker)","Hospital Distrital de Santarém, E. P. E. (506361462)","LIVANOVA PORTUGAL, LDA (505514010)","14.120,00 €",25-09-2017,28-07-2017,90 dias,"Portugal, Santarém, Santarém","Artigo 20.º, n.º 1, alínea b) do Código dos Contratos Públicos",,,,,,Não aplicável.,Não aplicável.,FALSE
Renovação proc. 720157/2016 - Pulseiras para transmissão RFID para recém-nascido e pediatria,Ajuste Direto Regime Geral,Aquisição de bens móveis,"33000000-0, Equipamento médico, medicamentos e produtos para cuidados pessoais","Hospital Distrital de Santarém, E. P. E. (506361462)","3N ACTIVECARD, LDA (509864899)","9.635,25 €",25-09-2017,13-01-2017,352 dias,"Portugal, Santarém, Santarém","Artigo 26.º, n.º 1, alínea a) do Código dos Contratos Públicos",,,,,,Não aplicável.,Não aplicável.,FALSE
"Renovação proc. 720131/2016 - Sistemas para alimentação entérica para bomba infusora """"Infusomat Space""""",Ajuste Direto Regime Geral,Aquisição de bens móveis,"33000000-0, Equipamento médico, medicamentos e produtos para cuidados pessoais","Hospital Distrital de Santarém, E. P. E. (506361462)","B. Braun Medical, Lda (501506543)","11.241,00 €",25-09-2017,23-01-2017,360 dias,"Portugal, Santarém, Santarém","Artigo 26.º, n.º 1, alínea a) do Código dos Contratos Públicos",,,,,,Não aplicável.,Não aplicável.,FALSE
Renovação Ajuste Direto Nº 420082/2016 Etiquetas identificadoras para esterilização,Ajuste Direto Regime Geral,Aquisição de bens móveis,"33000000-0, Equipamento médico, medicamentos e produtos para cuidados pessoais","Hospital Distrital de Santarém, E. P. E. (506361462)",HÉLDER GONÇALVES - ASSISTÊNCIA TÉCNICA LDA (503855421),"463,40 €",22-09-2017,06-02-2017,328 dias,"Portugal, Santarém, Santarém","Artigo 26.º, n.º 1, alínea a) do Código dos Contratos Públicos",,,,,,Não aplicável.,Não aplicável.,FALSE
Renovação Ajuste Direto Nº 420089/2017 - Pipetas pasteurs e tubos poliestereno,Ajuste Direto Regime Geral,Aquisição de bens móveis,"33000000-0, Equipamento médico, medicamentos e produtos para cuidados pessoais","Hospital Distrital de Santarém, E. P. E. (506361462)","VWR -  INTERNACIONAL, LDA. (503842770)","572,00 €",22-09-2017,20-01-2017,345 dias,"Portugal, Santarém, Santarém","Artigo 26.º, n.º 1, alínea a) do Código dos Contratos Públicos",,,,,,Não aplicável.,Não aplicável.,FALSE
Renovação Ajuste Direto Nº 420089/2016 - Pipetas pasteurs e tubos poliestereno,Ajuste Direto Regime Geral,Aquisição de bens móveis,"33000000-0, Equipamento médico, medicamentos e produtos para cuidados pessoais","Hospital Distrital de Santarém, E. P. E. (506361462)","EZEQUIEL PANÃO JORGE, LDA. (501412727)","105,36 €",22-09-2017,20-01-2017,345 dias,"Portugal, Santarém, Santarém","Artigo 26.º, n.º 1, alínea a) do Código dos Contratos Públicos",,,,,,Não aplicável.,Não aplicável.,FALSE
Renovação Ajuste Direto Nº 420088/2016 - Eletrodos e sensores descartáveis,Ajuste Direto Regime Geral,Aquisição de bens móveis,"33000000-0, Equipamento médico, medicamentos e produtos para cuidados pessoais","Hospital Distrital de Santarém, E. P. E. (506361462)","IBERDATA, EQUIPAMENTOS S.A. (501904921)","210,00 €",22-09-2017,20-01-2017,345 dias,"Portugal, Santarém, Santarém","Artigo 26.º, n.º 1, alínea a) do Código dos Contratos Públicos",,,,,,Não aplicável.,Não aplicável.,FALSE
Renovação Ajuste Direto Nº 420088/2016 - Eletrodos e sensores descartáveis,Ajuste Direto Regime Geral,Aquisição de bens móveis,"33000000-0, Equipamento médico, medicamentos e produtos para cuidados pessoais","Hospital Distrital de Santarém, E. P. E. (506361462)"," MEDINFAR SOROLÓGICO, S.A (501197052)","1.464,00 €",22-09-2017,20-01-2017,345 dias,"Portugal, Santarém, Santarém","Artigo 26.º, n.º 1, alínea a) do Código dos Contratos Públicos",,,,,,Não aplicável.,Não aplicável.,FALSE
Renovação Ajuste Direto Nº 420086/2016 - Mini nebulizador c/ máscara p/ aerossol e conetores em y,Ajuste Direto Regime Geral,Aquisição de bens móveis,"33000000-0, Equipamento médico, medicamentos e produtos para cuidados pessoais","Hospital Distrital de Santarém, E. P. E. (506361462)","INTERSURGICAL PORTUGAL, LDA (503480045)","7.338,50 €",22-09-2017,13-01-2017,352 dias,"Portugal, Santarém, Santarém","Artigo 26.º, n.º 1, alínea a) do Código dos Contratos Públicos",,,,,,Não aplicável.,Não aplicável.,FALSE
Renovação Ajuste Direto Nº 420085/2016 - Imobilizadores de membros com anilhas,Ajuste Direto Regime Geral,Aquisição de bens móveis,"33000000-0, Equipamento médico, medicamentos e produtos para cuidados pessoais","Hospital Distrital de Santarém, E. P. E. (506361462)","FACTOR PLUS, LDA (502810645)","1.993,60 €",22-09-2017,19-01-2017,353 dias,"Portugal, Santarém, Santarém","Artigo 26.º, n.º 1, alínea a) do Código dos Contratos Públicos",,,,,,Não aplicável.,Não aplicável.,FALSE
Renovação Ajuste Direto Nº 420025/2016 - Material de Consumo Clínico,Ajuste Direto Regime Geral,Aquisição de bens móveis,"33000000-0, Equipamento médico, medicamentos e produtos para cuidados pessoais","Hospital Distrital de Santarém, E. P. E. (506361462)","VYGON PORTUGAL, LDA (503232785)","1.345,50 €",22-09-2017,11-01-2017,355 dias,"Portugal, Santarém, Santarém","Artigo 26.º, n.º 1, alínea a) do Código dos Contratos Públicos",,,,,,Não aplicável.,Não aplicável.,FALSE
Renovação Ajuste Direto Nº 420025/2016 - Material de Consumo Clínico,Ajuste Direto Regime Geral,Aquisição de bens móveis,"33000000-0, Equipamento médico, medicamentos e produtos para cuidados pessoais","Hospital Distrital de Santarém, E. P. E. (506361462)","PRODUTOS MEDICO HOSPITALARES, S.A. (502376899)","3.603,00 €",22-09-2017,11-01-2017,355 dias,"Portugal, Santarém, Santarém","Artigo 26.º, n.º 1, alínea a) do Código dos Contratos Públicos",,,,,,Não aplicável.,Não aplicável.,FALSE
Renovação Ajuste Direto Nº 420025/2016 - Material de Consumo Clínico,Ajuste Direto Regime Geral,Aquisição de bens móveis,"33000000-0, Equipamento médico, medicamentos e produtos para cuidados pessoais","Hospital Distrital de Santarém, E. P. E. (506361462)",INTERSURGICAL PORTUGAL LDA (503480045),"174,00 €",22-09-2017,11-01-2017,355 dias,"Portugal, Santarém, Santarém","Artigo 26.º, n.º 1, alínea a) do Código dos Contratos Públicos",,,,,,Não aplicável.,Não aplicável.,FALSE
Renovação Ajuste Direto Nº 420025/2016 - Material de consumo clínico,Ajuste Direto Regime Geral,Aquisição de bens móveis,"33000000-0, Equipamento médico, medicamentos e produtos para cuidados pessoais","Hospital Distrital de Santarém, E. P. E. (506361462)","H.R. - HOSPITALAR, LDA (501895558)","72,00 €",22-09-2017,11-01-2017,355 dias,"Portugal, Santarém, Santarém","Artigo 26.º, n.º 1, alínea a) do Código dos Contratos Públicos",,,,,,Não aplicável.,Não aplicável.,FALSE
DIVERSO MATERIAL CONSUMO CLINICO,Ajuste Direto Regime Geral,Aquisição de bens móveis,"33190000-8, Dispositivos e produtos médicos variados","Hospital Distrital de Santarém, EPE (506361462)","INTERSURGICAL PORTUGAL - COMÉRCIO DE PRODUTOS HOSPITALARES, LDA (503480045)","1.466,20 €",22-09-2017,15-09-2017,120 dias,"Portugal, Santarém, Santarém","Artigo 20.º, n.º 1, alínea a) do Código dos Contratos Públicos",,,,,,Não aplicável.,Não aplicável.,FALSE
Renovação Ajuste Direto Nº 420025/2016 - Material de consumo clínico,Ajuste Direto Regime Geral,Aquisição de bens móveis,"33000000-0, Equipamento médico, medicamentos e produtos para cuidados pessoais","Hospital Distrital de Santarém, E. P. E. (506361462)","DRAGER PORTUGAL, LDA (508771323)","1.800,00 €",22-09-2017,11-01-2017,355 dias,"Portugal, Santarém, Santarém","Artigo 26.º, n.º 1, alínea a) do Código dos Contratos Públicos",,,,,,Não aplicável.,Não aplicável.,FALSE
AQUISIÇÃO DE SUTURAS MECÂNICAS - RENOVAÇÃO 120003/2014,Ajuste Direto Regime Geral,Aquisição de bens móveis<br/>Sociedade,"33140000-3, Material médico de consumo","Hospital Distrital de Santarém, E. P. E. (506361462)","JOHNSON & JOHNSON, MEDICAL (500153370)","2.741,25 €",22-09-2017,27-01-2016,365 dias,"Portugal, Santarém, Santarém","Artigo 26.º, n.º 1, alínea a) do Código dos Contratos Públicos",,,,,,Não aplicável.,Não aplicável.,FALSE
AQUISIÇÃO DE SUTURAS MECÂNICAS - RENOVAÇÃO 120003/2014,Ajuste Direto Regime Geral,Aquisição de bens móveis<br/>Sociedade,"33140000-3, Material médico de consumo","Hospital Distrital de Santarém, E. P. E. (506361462)","GRUPO TAPER-EQUIPAMENTOS PRECISÃO CIENTIFICA, LDª (506886336)","1.122,00 €",22-09-2017,27-01-2016,365 dias,"Portugal, Santarém, Santarém","Artigo 26.º, n.º 1, alínea a) do Código dos Contratos Públicos",,,,,,Não aplicável.,Não aplicável.,FALSE
AQUISIÇÃO DE SUTURAS MECÂNICAS - RENOVAÇÃO 120003/2014,Ajuste Direto Regime Geral,Aquisição de bens móveis<br/>Sociedade,"33140000-3, Material médico de consumo","Hospital Distrital de Santarém, E. P. E. (506361462)","ENDOTECNICA,MATERIAL CIRURG LD (503818348)","9.916,00 €",22-09-2017,27-01-2016,365 dias,"Portugal, Santarém, Santarém","Artigo 26.º, n.º 1, alínea a) do Código dos Contratos Públicos",,,,,,Não aplicável.,Não aplicável.,FALSE
AQUISIÇÃO SUTURAS MECÂNICAS - RENOVAÇÃO 120003/2014,Ajuste Direto Regime Geral,Sociedade<br/>Aquisição de bens móveis,"33140000-3, Material médico de consumo","Hospital Distrital de Santarém, E. P. E. (506361462)",Covidien (503413410),"40.836,80 €",22-09-2017,29-02-2016,365 dias,"Portugal, Santarém, Santarém","Artigo 26.º, n.º 1, alínea a) do Código dos Contratos Públicos",,,,,,Não aplicável.,Não aplicável.,FALSE
AQUISIÇÃO DE SUTURAS MECÂNICAS II - RENOVAÇÃO 420040/2014,Ajuste Direto Regime Geral,Aquisição de bens móveis,"33140000-3, Material médico de consumo","Hospital Distrital de Santarém, E. P. E. (506361462)",Covidien Portugal (503413410),"34.019,50 €",21-09-2017,03-03-2016,365 dias,"Portugal, Santarém, Santarém","Artigo 26.º, n.º 1, alínea a) do Código dos Contratos Públicos",,,,,,Não aplicável.,Não aplicável.,FALSE
AQUISIÇÃO DE MANTAS TÉRMICAS - RENOVAÇÃO 420005/2015,Ajuste Direto Regime Geral,Aquisição de bens móveis,"33140000-3, Material médico de consumo","Hospital Distrital de Santarém, E. P. E. (506361462)",EUROCASMEDICA (503322105),"664,80 €",21-09-2017,23-03-2016,365 dias,"Portugal, Santarém, Santarém","Artigo 26.º, n.º 1, alínea a) do Código dos Contratos Públicos",,,,,,Não aplicável.,Não aplicável.,FALSE
AQUISIÇÃO DE MANTAS TÉRMICAS - RENOVAÇÃO 420005/2015,Ajuste Direto Regime Geral,Aquisição de bens móveis,"33140000-3, Material médico de consumo","Hospital Distrital de Santarém, E. P. E. (506361462)",COVIDIEN PORTUGAL  (504223933),"1.496,00 €",21-09-2017,23-03-2016,365 dias,"Portugal, Santarém, Santarém","Artigo 26.º, n.º 1, alínea a) do Código dos Contratos Públicos",,,,,,Não aplicável.,Não aplicável.,FALSE
MATERIAL DE ANESTESIA E BLOCO OPERATÓRIO - RENOVAÇÃO 120008/2014,Ajuste Direto Regime Geral,Aquisição de bens móveis,"33140000-3, Material médico de consumo","Hospital Distrital de Santarém, E. P. E. (506361462)"," VYGON, LDA. (503232785)","1.438,20 €",21-09-2017,18-01-2016,365 dias,"Portugal, Santarém, Santarém","Artigo 26.º, n.º 1, alínea a) do Código dos Contratos Públicos",,,,,,Não aplicável.,Não aplicável.,FALSE
MATERIAL DE ANESTESIA E BLOCO OPERATÓRIO - RENOVAÇÃO 120008/2014,Ajuste Direto Regime Geral,Aquisição de bens móveis,"33140000-3, Material médico de consumo","Hospital Distrital de Santarém, E. P. E. (506361462)",TELEFLEX MEDICAL S.A (980249783),"7.330,20 €",21-09-2017,18-01-2016,365 dias,"Portugal, Santarém, Santarém","Artigo 26.º, n.º 1, alínea a) do Código dos Contratos Públicos",,,,,,Não aplicável.,Não aplicável.,FALSE
MATERIAL DE ANESTESIA E BLOCO OPERATÓRIO - RENOVAÇÃO 120008/2014,Ajuste Direto Regime Geral,Aquisição de bens móveis,"33140000-3, Material médico de consumo","Hospital Distrital de Santarém, E. P. E. (506361462)","PULMOCOR-EQUIPAMENTO MEDICO,LD (501402578)","7.220,50 €",21-09-2017,18-01-2016,365 dias,"Portugal, Santarém, Santarém","Artigo 26.º, n.º 1, alínea a) do Código dos Contratos Públicos",,,,,,Não aplicável.,Não aplicável.,FALSE
MATERIAL DE ANESTESIA E BLOCO OPERATÓRIO - RENOVAÇÃO 120008/2014,Ajuste Direto Regime Geral,Aquisição de bens móveis,"33140000-3, Material médico de consumo","Hospital Distrital de Santarém, E. P. E. (506361462)","Linde Saúde, Sociedade Unipessoal, Lda (500125546)","4.560,00 €",21-09-2017,18-01-2016,365 dias,"Portugal, Santarém, Santarém","Artigo 26.º, n.º 1, alínea a) do Código dos Contratos Públicos",,,,,,Não aplicável.,Não aplicável.,FALSE
MATERIAL DE ANESTESIA E BLOCO OPERATÓRIO - RENOVAÇÃO 120008/2014,Ajuste Direto Regime Geral,Aquisição de bens móveis,"33140000-3, Material médico de consumo","Hospital Distrital de Santarém, E. P. E. (506361462)",INTERSURGICAL PORTUGAL (503480045),"7.774,50 €",21-09-2017,18-01-2016,365 dias,"Portugal, Santarém, Santarém","Artigo 26.º, n.º 1, alínea a) do Código dos Contratos Públicos",,,,,,Não aplicável.,Não aplicável.,FALSE
MATERIAL DE ANESTESIA E BLOCO OPERATÓRIO - RENOVAÇÃO 120008/2014,Ajuste Direto Regime Geral,Aquisição de bens móveis,"33140000-3, Material médico de consumo","Hospital Distrital de Santarém, E. P. E. (506361462)",B.BRAUN MEDICAL (501506543),"120,00 €",21-09-2017,18-01-2016,365 dias,"Portugal, Santarém, Santarém","Artigo 26.º, n.º 1, alínea a) do Código dos Contratos Públicos",,,,,,Não aplicável.,Não aplicável.,FALSE
MATERIAL DE ANESTESIA E BLOCO OPERATÓRIO - RENOVAÇÃO  120008/2014,Ajuste Direto Regime Geral,Aquisição de bens móveis,"33140000-3, Material médico de consumo","Hospital Distrital de Santarém, E. P. E. (506361462)",Covidien Portugal (503413410),"11.122,25 €",21-09-2017,15-02-2016,365 dias,"Portugal, Santarém, Santarém","Artigo 26.º, n.º 1, alínea a) do Código dos Contratos Públicos",,,,,,Não aplicável.,Não aplicável.,FALSE
"Renovação Concurso Público Nº 120015/2015 - Material para via aérea: aspiração, nebulização e administração O2",Ajuste Direto Regime Geral,Aquisição de bens móveis,"33000000-0, Equipamento médico, medicamentos e produtos para cuidados pessoais","Hospital Distrital de Santarém, E. P. E. (506361462)","Vygon Portugal, Lda (503232785)","614,85 €",21-09-2017,19-01-2016,340 dias,"Portugal, Santarém, Santarém","Artigo 26.º, n.º 1, alínea a) do Código dos Contratos Públicos",,,,,,Não aplicável.,Não aplicável.,FALSE
"Renovação Concurso Público Nº 120015/2015 - Material para via aérea: aspiração, nebulização e administração O2",Ajuste Direto Regime Geral,Aquisição de bens móveis,"33000000-0, Equipamento médico, medicamentos e produtos para cuidados pessoais","Hospital Distrital de Santarém, E. P. E. (506361462)","Teleflex Medical, S.A (980249783)","2.100,00 €",21-09-2017,19-01-2016,340 dias,"Portugal, Santarém, Santarém","Artigo 26.º, n.º 1, alínea a) do Código dos Contratos Públicos",,,,,,Não aplicável.,Não aplicável.,FALSE
"Renovação Concurso Público Nº 120015/2015 - Material para via aérea: aspiração, nebulização e administração O2",Ajuste Direto Regime Geral,Aquisição de bens móveis,"33000000-0, Equipamento médico, medicamentos e produtos para cuidados pessoais","Hospital Distrital de Santarém, E. P. E. (506361462)","H.R. - Produtos Químicos, Lda.  (501895558)","6.344,00 €",21-09-2017,19-01-2016,340 dias,"Portugal, Santarém, Santarém","Artigo 26.º, n.º 1, alínea a) do Código dos Contratos Públicos",,,,,,Não aplicável.,Não aplicável.,FALSE
