freguesia,acronym,validVotesPercentage,votes,dicofre
Ota,PS,35.75,153,110109
Ota,PPD/PSD.CDS-PP,22.66,97,110109
Ota,PCP-PEV,20.09,86,110109
Ota,MPT,6.54,28,110109
Ota,B.E.,3.04,13,110109
Ota,L,3.04,13,110109
Ota,PCTP/MRPP,2.57,11,110109
Ota,PND,2.1,9,110109
Ota,MAS,1.17,5,110109
Ota,PAN,0.93,4,110109
Ota,PPM,0.7,3,110109
Ota,PNR,0.47,2,110109
Ota,PDA,0.23,1,110109
Ota,POUS,0.23,1,110109
Ota,PPV,0.23,1,110109
Ota,PTP,0.23,1,110109
