Objeto do Contrato,Tipo de Procedimento,Tipo(s) de Contrato,CPVs,Entidade(s) Adjudicante(s),Entidade(s) Adjudicatária(s),Preço Contratual,Data de Publicação,Data de Celebração do Contrato,Prazo de Execução,Local de Execução,Fundamentação,Data de Fecho do Contrato,Preço Total Efetivo,Causas das Alterações ao Prazo,Causas das Alterações ao Preço,Estado,N.º registo do Acordo Quadro,Descrição do Acordo Quadro,Procedimento Centralizado
PRÓTESES  PARA CONTENÇÃO DE HÉRNIAS E INCONTINÊNCIA URINÁRIA,Ajuste Direto Regime Geral,Aquisição de bens móveis,"33140000-3, Material médico de consumo",Hospital Arcebispo João Crisóstomo - Cantanhede (501626123),"Overpharma (505792362), Moonsurge (506657035), C. R. BARD PORTUGAL, LDA. (502438274)","6.806,00 €",31-05-2017,17-01-2017,365 dias,"Portugal, Coimbra, Cantanhede","Artigo 20.º, n.º 1, alínea a) do Código dos Contratos Públicos",,,,,,Não aplicável.,Não aplicável.,FALSE
Realização de M.C.D.T. de anatomia patológica,Ajuste Direto Regime Geral,Aquisição de serviços,"85145000-7, Serviços prestados por laboratórios médicos",Hospital do Arcebispo João Crisóstomo  Cantanhede (501626123),CEDAP (504494562),"16.500,00 €",31-05-2017,04-01-2017,335 dias,"Portugal, Coimbra, Coimbra","Artigo 20.º, n.º 1, alínea a) do Código dos Contratos Públicos",,,,,,Não aplicável.,Não aplicável.,FALSE
Prestação de serviços de desinfestação hospitlar,Ajuste Direto Regime Geral,Aquisição de serviços,"90921000-9, Serviços de desinfecção e exterminação",Hospital do Arcebispo João Crisóstomo  Cantanhede (501626123),"ANTICIMEX,LDA (501863087)","445,00 €",31-05-2017,30-12-2016,365 dias,"Portugal, Coimbra, Cantanhede","Artigo 20.º, n.º 1, alínea a) do Código dos Contratos Públicos",,,,,,Não aplicável.,Não aplicável.,FALSE
"Recolha, transporte e eliminação de resíduos hospitalares",Ajuste Direto Regime Geral,Aquisição de serviços,"90524400-0, Recolha, transporte e eliminação de resíduos hospitalares",Hospital Arcebispo João Crisóstomo - Cantanhede (501626123),"AMBIMED-GESTÃO AMBIENTAL, LDA (503593427)","4.510,60 €",31-05-2017,30-11-2016,365 dias,"Portugal, Coimbra, Cantanhede","Artigo 20.º, n.º 1, alínea a) do Código dos Contratos Públicos",,,,,,Não aplicável.,Não aplicável.,FALSE
