Objeto do Contrato,Tipo de Procedimento,Tipo(s) de Contrato,CPVs,Entidade(s) Adjudicante(s),Entidade(s) Adjudicatária(s),Preço Contratual,Data de Publicação,Data de Celebração do Contrato,Prazo de Execução,Local de Execução,Fundamentação,Data de Fecho do Contrato,Preço Total Efetivo,Causas das Alterações ao Prazo,Causas das Alterações ao Preço,Estado,N.º registo do Acordo Quadro,Descrição do Acordo Quadro,Procedimento Centralizado
Aquisição de medicamentos,Ajuste Direto Regime Geral,Aquisição de bens móveis,"33690000-3, Medicamentos vários","Hospital do Espírito Santo de Évora, E. P. E. (508085888)",EUSAPHARMA (980376580),"4.200,00 €",10-04-2018,04-04-2018,240 dias,"Portugal, Évora, Évora","Artigo 24.º, n.º 1, alínea e), subalínea iii) do Código dos Contratos Públicos",,,,,,Não aplicável.,Não aplicável.,FALSE
Prestação de serviços de MCDT's no exterior,Ajuste Direto Regime Geral,Aquisição de serviços,"85120000-6, Serviços de prática médica e serviços conexos","Hospital do Espírito Santo de Évora, E. P. E. (508085888)",FISIEVE - CENTRO MED FIS REAB DE ÉVORA LDA (500991057),"30.000,00 €",10-04-2018,24-01-2018,365 dias,"Portugal, Évora, Évora","Artigo 20.º, n.º 1, alínea a) do Código dos Contratos Públicos",,,,,,Não aplicável.,Não aplicável.,FALSE
Prestação de serviços de MCDT's no exterior,Ajuste Direto Regime Geral,Aquisição de serviços,"71356300-1, Serviços de apoio técnico","Hospital do Espírito Santo de Évora, E. P. E. (508085888)",LNMD - Lab. de Neurogastrenterologia (514241810),"19.663,70 €",10-04-2018,10-01-2018,365 dias,"Portugal, Évora, Évora","Artigo 20.º, n.º 1, alínea a) do Código dos Contratos Públicos",,,,,,Não aplicável.,Não aplicável.,FALSE
Prestação de serviços de assistência técnica,Ajuste Direto Regime Geral,Aquisição de serviços,"71356200-0, Serviços de assistência técnica","Hospital do Espírito Santo de Évora, E. P. E. (508085888)","HELDER GONCALVES-ASSISTENCIA TECNICA EQUIP., LDA (503855421)","2.922,00 €",10-04-2018,07-02-2018,365 dias,"Portugal, Évora, Évora","Artigo 20.º, n.º 1, alínea a) do Código dos Contratos Públicos",,,,,,Não aplicável.,Não aplicável.,FALSE
Prestação de serviços de assistência técnica,Ajuste Direto Regime Geral,Aquisição de serviços,"71356200-0, Serviços de assistência técnica","Hospital do Espírito Santo de Évora, E. P. E. (508085888)","Schindler – Ascensores e Escadas Rolantes, SA (502353740)","3.827,35 €",10-04-2018,07-02-2018,365 dias,"Portugal, Évora, Évora","Artigo 20.º, n.º 1, alínea a) do Código dos Contratos Públicos",,,,,,Não aplicável.,Não aplicável.,FALSE
Prestação de serviços de assistência técnica,Ajuste Direto Regime Geral,Aquisição de serviços,"71356200-0, Serviços de assistência técnica","Hospital do Espírito Santo de Évora, E. P. E. (508085888)","A.J. Costa Irmãos, Ldª (500002576)","2.475,00 €",10-04-2018,07-02-2018,365 dias,"Portugal, Évora, Évora","Artigo 24.º, n.º 1, alínea e) do Código dos Contratos Públicos",,,,,,Não aplicável.,Não aplicável.,FALSE
Prestação de serviços de assistência técnica,Ajuste Direto Regime Geral,Aquisição de serviços,"71356200-0, Serviços de assistência técnica","Hospital do Espírito Santo de Évora, E. P. E. (508085888)","A. Mendes da Silva, Lda (502064080)","11.724,00 €",10-04-2018,07-02-2018,365 dias,"Portugal, Évora, Évora","Artigo 20.º, n.º 1, alínea a) do Código dos Contratos Públicos",,,,,,Não aplicável.,Não aplicável.,FALSE
DM Cardioversores Desfibrilhadores Implantáveis,Concurso público,Aquisição de bens móveis,"33182000-9, Material de assistência à função cardíaca","Hospital do Espírito Santo de Évora, E. P. E. (508085888)","ABBOTT MEDICAL PORTUGAL (504180746), LIVANOVA PORTUGAL, LDA. (505514010)","119.430,00 €",09-04-2018,07-02-2018,60 dias,"Portugal, Évora, Évora","Artigo 20.º, n.º 1, alínea b) do Código dos Contratos Públicos",,,,,,Não aplicável.,Não aplicável.,FALSE
Aquisição de Dispositivos Médicos; Pacemaker's,Concurso público,Aquisição de bens móveis,"33182210-4, Estimulador cardíaco (pacemaker)","Hospital do Espírito Santo de Évora, E. P. E. (508085888)","LIVANOVA PORTUGAL, LDA. (505514010), BOSTON SCIENTIFIC PORTUGAL - DISPOSITIVOS MEDICOS, LDA (504988964), BIOTRONIK PORTUGAL, UNIPESSOAL LDA. (510726941)","89.268,00 €",09-04-2018,07-02-2018,60 dias,"Portugal, Évora, Évora","Artigo 20.º, n.º 1, alínea b) do Código dos Contratos Públicos",,,,,,Não aplicável.,Não aplicável.,FALSE
Aquisição de dispositivos médicos vários,Ajuste Direto Regime Geral,Aquisição de bens móveis,"33140000-3, Material médico de consumo","Hospital do Espírito Santo de Évora, E. P. E. (508085888)","COLOPLAST PORTUGAL SOC. UNIP., LDA (EX PORGES) (503989037)","11.381,30 €",09-04-2018,14-02-2018,330 dias,"Portugal, Évora, Évora","Artigo 20.º, n.º 1, alínea a) do Código dos Contratos Públicos",,,,,,Não aplicável.,Não aplicável.,FALSE
Prestação de serviços de enfermagem,Ajuste Direto Regime Geral,Aquisição de serviços,"85140000-2, Serviços de saúde diversos","Hospital do Espírito Santo de Évora, E. P. E. (508085888)",Ana Margarida Fialho Vidigal (243459106),"11.700,00 €",09-04-2018,17-01-2018,180 dias,"Portugal, Évora, Évora","Artigo 20.º, n.º 1, alínea a) do Código dos Contratos Públicos",,,,,,Não aplicável.,Não aplicável.,FALSE
Aquisição de testes laboratoriais,Ajuste Direto Regime Geral,Aquisição de bens móveis,"33694000-1, Meios de diagnóstico","Hospital do Espírito Santo de Évora, E. P. E. (508085888)",Biocartis NV (BE0827475227),"60.900,00 €",09-04-2018,14-12-2017,365 dias,"Portugal, Évora, Évora","Artigo 24.º, n.º 1, alínea e) do Código dos Contratos Públicos",,,,,,Não aplicável.,Não aplicável.,FALSE
Aquisição de medicamentos: Rituximab,Ajuste Direto Regime Geral,Aquisição de bens móveis,"33690000-3, Medicamentos vários","Hospital do Espírito Santo de Évora, E. P. E. (508085888)",PHARMAKERN PORTUGAL PRODUTOS FARMACEUTICOS SOCIEDADE UNIPESSOAL LDA PORTUGAL (507002571),"42.450,00 €",09-04-2018,08-11-2017,365 dias,"Portugal, Évora, Évora","Artigo 20.º, n.º 1, alínea a) do Código dos Contratos Públicos",,,,,,Não aplicável.,Não aplicável.,FALSE
Prestação de serviços médicos em Angiologia e Cirurgia  Vascular,Ajuste Direto Regime Geral,Aquisição de serviços,"85121000-3, Serviços de prática médica","Hospital do Espírito Santo de Évora, E. P. E. (508085888)",Vasconcelos & Maia Ldª (510739458),"6.835,14 €",09-04-2018,28-09-2017,90 dias,"Portugal, Évora, Évora","Artigo 20.º, n.º 1, alínea a) do Código dos Contratos Públicos",,,,,,Não aplicável.,Não aplicável.,FALSE
Aquisição de medicamentos: Cabazitaxel 60mg,Ajuste Direto Regime Geral,Aquisição de bens móveis,"33690000-3, Medicamentos vários","Hospital do Espírito Santo de Évora, E. P. E. (508085888)","SANOFI PRODUTOS  FARMACEUTICOS, LDA  (500134960)","56.565,00 €",09-04-2018,28-09-2017,90 dias,"Portugal, Évora, Évora","Artigo 24.º, n.º 1, alínea e) do Código dos Contratos Públicos",,,,,,Não aplicável.,Não aplicável.,FALSE
Aquisição de medicamentos: Vedolizumab 300mg,Ajuste Direto Regime Geral,Aquisição de bens móveis,"33690000-3, Medicamentos vários","Hospital do Espírito Santo de Évora, E. P. E. (508085888)","TAKEDA- FARMACEUTICOS PORTUGAL, LDA (502801204)","60.000,00 €",09-04-2018,05-12-2017,365 dias,"Portugal, Évora, Évora","Artigo 24.º, n.º 1, alínea e) do Código dos Contratos Públicos",,,,,,Não aplicável.,Não aplicável.,FALSE
Aquisição de dispositivos médicos - Gel Hemostático,Ajuste Direto Regime Geral,Aquisição de bens móveis,"33140000-3, Material médico de consumo","Hospital do Espírito Santo de Évora, E. P. E. (508085888)",BAXTER MEDICO - FARMACEUTICA (503347345),"16.416,00 €",09-04-2018,05-12-2017,365 dias,"Portugal, Évora, Évora","Artigo 20.º, n.º 1, alínea a) do Código dos Contratos Públicos",,,,,,Não aplicável.,Não aplicável.,FALSE
Aquisição de dispositivos médicos de encavilhamento,Concurso público,Aquisição de bens móveis,"33183200-8, Próteses ortopédicas","Hospital do Espírito Santo de Évora, E. P. E. (508085888)","ZIMMER BIOMET PORTUGAL, UNIPESSOAL LDA  (500254990), Smith & Nephew Lda  (503552461)","97.140,00 €",09-04-2018,21-02-2018,300 dias,"Portugal, Évora, Évora","Artigo 20.º, n.º 1, alínea b) do Código dos Contratos Públicos",,,,,,Não aplicável.,Não aplicável.,FALSE
Prestação de serviços de consultoria jurídica,Ajuste Direto Regime Geral,Aquisição de serviços,"79100000-5, Serviços jurídicos","Hospital do Espírito Santo de Évora, E. P. E. (508085888)",CARLOS  GUERREIRO CUNHA (102549214),"26.148,00 €",09-04-2018,17-01-2018,365 dias,"Portugal, Évora, Évora","Artigo 20.º, n.º 1, alínea a) do Código dos Contratos Públicos",,,,,,Não aplicável.,Não aplicável.,FALSE
Aquisição de DM: Cateter permanente para hemodialise,Ajuste Direto Regime Geral,Aquisição de bens móveis,"33140000-3, Material médico de consumo","Hospital do Espírito Santo de Évora, E. P. E. (508085888)",Medinfar - Sorologico (501197052),"15.530,00 €",06-04-2018,31-01-2018,330 dias,"Portugal, Évora, Évora","Artigo 20.º, n.º 1, alínea a) do Código dos Contratos Públicos",,,,,,Não aplicável.,Não aplicável.,FALSE
Aquisição de reagentes laboratoriais,Concurso público,Aquisição de bens móveis,"33696200-7, Reagentes para análises ao sangue","Hospital do Espírito Santo de Évora, E. P. E. (508085888)","BIOMERIEUX PORTUGAL, LDA (501524177)","118.576,00 €",06-04-2018,24-01-2018,365 dias,"Portugal, Évora, Évora","Artigo 20.º, n.º 1, alínea b) do Código dos Contratos Públicos",,,,,,Não aplicável.,Não aplicável.,FALSE
Prestação de serviços de assistência técnica,Ajuste Direto Regime Geral,Aquisição de serviços,"71356200-0, Serviços de assistência técnica","Hospital do Espírito Santo de Évora, E. P. E. (508085888)","Getinge Group Portugal, Unipessoal, LDA. (506819698)","7.920,00 €",06-04-2018,07-02-2018,365 dias,"Portugal, Évora, Évora","Artigo 24.º, n.º 1, alínea e) do Código dos Contratos Públicos",,,,,,Não aplicável.,Não aplicável.,FALSE
Prestação de serviços de telerradiologia,Concurso público,Aquisição de serviços,"85150000-5, Serviços de imagiologia médica","Hospital do Espírito Santo de Évora, EPE (508085888)",DR CAMPOS COSTA CONSULTORIO TOMOG COMPUT SA (502082429),"209.577,50 €",06-04-2018,24-01-2018,365 dias,"Portugal, Évora, Évora","Artigo 20.º, n.º 1, alínea b) do Código dos Contratos Públicos",,,,,,Não aplicável.,Não aplicável.,FALSE
Prestação de serviços de assistência técnica,Ajuste Direto Regime Geral,Aquisição de serviços,"71356200-0, Serviços de assistência técnica","Hospital do Espírito Santo de Évora, E. P. E. (508085888)","José Cotta - Equipamentos Médicos e Serviços, Lda. (500155739)","10.362,75 €",06-04-2018,07-02-2018,365 dias,"Portugal, Évora, Évora","Artigo 24.º, n.º 1, alínea e) do Código dos Contratos Públicos",,,,,,Não aplicável.,Não aplicável.,FALSE
Aquisição de DM: Holter implantável,Concurso público,Aquisição de bens móveis,"33182000-9, Material de assistência à função cardíaca","Hospital do Espírito Santo de Évora, EPE (508085888)",MEDTRONIC PORTUGAL COMERCIO E DIST. APARELHOS MED. (504223933),"39.750,00 €",06-04-2018,31-01-2018,365 dias,"Portugal, Évora, Évora","Artigo 20.º, n.º 1, alínea b) do Código dos Contratos Públicos",,,,,,Não aplicável.,Não aplicável.,FALSE
"Aquisição de máquinas de sutura de pele, automáticas.",Ajuste Direto Regime Geral,Aquisição de bens móveis,"33190000-8, Dispositivos e produtos médicos variados","Hospital do Espírito Santo de Évora, E. P. E. (508085888)",MEDTRONIC PORTUGAL COMERCIO E DIST. APARELHOS MED. (504223933),"9.936,00 €",06-04-2018,21-02-2018,310 dias,"Portugal, Évora, Évora","Artigo 20.º, n.º 1, alínea a) do Código dos Contratos Públicos",,,,,,Não aplicável.,Não aplicável.,FALSE
Aquisição de equipamento de laparoscopia,Concurso público,Aquisição de bens móveis,"33100000-1, Equipamento médico","Hospital do Espírito Santo de Évora, EPE (508085888)",Olympus Iberia SAU (980474710),"62.989,98 €",06-04-2018,14-02-2018,30 dias,"Portugal, Évora, Évora","Artigo 20.º, n.º 1, alínea b) do Código dos Contratos Públicos",,,,,,Não aplicável.,Não aplicável.,FALSE
Aquisição de aparelho de RX transportável,Concurso público,Locação de bens móveis,"33124200-7, Aparelhos para radiodiagnóstico","Hospital do Espírito Santo de Évora, EPE (508085888)",Med X-Ray - Sistemas Médicos Lda (506187071),"113.985,00 €",06-04-2018,31-01-2018,30 dias,"Portugal, Évora, Évora","Artigo 20.º, n.º 1, alínea b) do Código dos Contratos Públicos",,,,,,Não aplicável.,Não aplicável.,FALSE
Prestação de serviços de análises clínicas no exterior,Concurso público,Aquisição de serviços,"85148000-8, Serviços de análises clínicas","Hospital do Espírito Santo de Évora, E. P. E. (508085888)",Dr. Joaquim Chaves-Laboratório de Análises Clínicas (500753636),"37.876,83 €",05-04-2018,24-01-2018,365 dias,"Portugal, Évora, Évora","Artigo 20.º, n.º 1, alínea b) do Código dos Contratos Públicos",,,,,,Não aplicável.,Não aplicável.,FALSE
Aquisição de reagentes para a detecção de infecções hospitalares,Concurso público,Aquisição de bens móveis,"33696200-7, Reagentes para análises ao sangue","Hospital do Espírito Santo de Évora, E. P. E. (508085888)","BAPTISTA MARQUES, DIAGNÓSTICA REAGENTES, LDA (501439110), BIOMERIEUX PORTUGAL, LDA (501524177), WERFEN PORTUGAL, LDA (501086110)","70.637,00 €",05-04-2018,31-01-2018,365 dias,"Portugal, Évora, Évora","Artigo 20.º, n.º 1, alínea b) do Código dos Contratos Públicos",,,,,,Não aplicável.,Não aplicável.,FALSE
Aquisição de corretivos da volémia,Ao abrigo de acordo-quadro (art.º 259.º),Aquisição de bens móveis,"33600000-6, Produtos farmacêuticos","Hospital do Espírito Santo de Évora, E. P. E. (508085888)","Fresenius Kabi Pharma, Lda. (504293753), B BRAUN MEDICAL, LDA (501506543)","256.653,94 €",05-04-2018,14-03-2018,300 dias,"Portugal, Évora, Évora",Artigo 259.º do Código dos Contratos Públicos,,,,,,2528675,CP 2017/3 - Acordo Quadro para fornecimento de corretivos da volémia e outras soluções estéreis,FALSE
Aquisição de MCDT's de radiologia no exterior,Concurso público,Aquisição de serviços,"85121200-5, Serviços de medicina especializada","Hospital do Espírito Santo de Évora, E. P. E. (508085888)",CDI - CLINICA DIAGNOSTICO POR IMAGEM (502830654),"64.895,45 €",05-04-2018,28-12-2017,60 dias,"Portugal, Évora, Évora",Artigo 155.º do Código dos Contratos Públicos,,,,,,Não aplicável.,Não aplicável.,FALSE
Aquisição de reagentes de biologia molecular,Concurso público,Aquisição de bens móveis,"33696200-7, Reagentes para análises ao sangue","Hospital do Espírito Santo de Évora, E. P. E. (508085888)","BIOMERIEUX PORTUGAL, LDA (501524177), Roche Sistemas (504282921), QUILABAN - QUIMICA LABORATORIAL ANALITICA, SA (500399670)","181.206,85 €",05-04-2018,21-02-2018,330 dias,"Portugal, Évora, Évora","Artigo 20.º, n.º 1, alínea b) do Código dos Contratos Públicos",,,,,,Não aplicável.,Não aplicável.,FALSE
Aquisição de suturas,Concurso público,Aquisição de bens móveis,"33141121-4, Suturas cirúrgicas","Hospital do Espírito Santo de Évora, E. P. E. (508085888)","B BRAUN MEDICAL, LDA (501506543)","38.132,04 €",05-04-2018,01-03-2018,300 dias,"Portugal, Évora, Évora","Artigo 20.º, n.º 1, alínea b) do Código dos Contratos Públicos",,,,,,Não aplicável.,Não aplicável.,FALSE
Prestação de serviço de assistência técnica,Concurso público,Aquisição de bens móveis,"33141420-0, Luvas para cirurgia","Hospital do Espírito Santo de Évora, E. P. E. (508085888)","MEDLINE INTERNATIONAL UNIPESSOAL, LDA (510533515), DOCWORLD (508592909), EPJMEDICA - ARTIGOS MÉDICOS HOSPITALARES (506820513)","116.280,03 €",05-04-2018,01-03-2018,300 dias,"Portugal, Évora, Évora","Artigo 20.º, n.º 1, alínea b) do Código dos Contratos Públicos",,,,,,Não aplicável.,Não aplicável.,FALSE
Prestação de serviços de assistência técnica,Ajuste Direto Regime Geral,Aquisição de serviços,"71356200-0, Serviços de assistência técnica","Hospital do Espírito Santo de Évora, E. P. E. (508085888)","Orona Portugal, Sociedade Unipessoal, Lda. (501606319)","2.124,00 €",05-04-2018,07-02-2018,365 dias,"Portugal, Évora, Évora","Artigo 24.º, n.º 1, alínea e) do Código dos Contratos Públicos",,,,,,Não aplicável.,Não aplicável.,FALSE
Prestação de serviços de assistência técnica,Ajuste Direto Regime Geral,Aquisição de serviços,"71356200-0, Serviços de assistência técnica","Hospital do Espírito Santo de Évora, E. P. E. (508085888)","Izasa Scientific, Lda. (513252088)","3.114,78 €",05-04-2018,07-02-2018,365 dias,"Portugal, Évora, Évora","Artigo 24.º, n.º 1, alínea e) do Código dos Contratos Públicos",,,,,,Não aplicável.,Não aplicável.,FALSE
Prestação de serviços de assistência técnica,Ajuste Direto Regime Geral,Aquisição de serviços,"71356200-0, Serviços de assistência técnica","Hospital do Espírito Santo de Évora, E. P. E. (508085888)","ATM - Assistência Total em Manutenção, S.A. (502700823)","4.200,00 €",04-04-2018,07-02-2018,365 dias,"Portugal, Évora, Évora","Artigo 20.º, n.º 1, alínea a) do Código dos Contratos Públicos",,,,,,Não aplicável.,Não aplicável.,FALSE
Prestação de Serviços Médicos de Ginecologia,Concurso público,Aquisição de serviços,"85121210-8, Serviços de ginecologia ou obstetrícia","Hospital do Espírito Santo de Évora, E. P. E. (508085888)","Medipeople - Soluções de Saúde e Educação, Lda. (508543436)","292.032,00 €",04-04-2018,24-01-2018,270 dias,"Portugal, Évora, Évora","Artigo 20.º, n.º 1, alínea b) do Código dos Contratos Públicos",,,,,,Não aplicável.,Não aplicável.,FALSE
Prestação de serviços de nutricionista,Ajuste Direto Regime Geral,Aquisição de serviços,"98300000-6, Serviços diversos","Hospital do Espírito Santo de Évora, E. P. E. (508085888)",Sofia Carmo Oliveira Alves (246637307),"10.000,00 €",04-04-2018,17-01-2018,180 dias,"Portugal, Évora, Évora","Artigo 20.º, n.º 1, alínea a) do Código dos Contratos Públicos",,,,,,Não aplicável.,Não aplicável.,FALSE
Prestação de serviços médicos de ortopedia,Ajuste Direto Regime Geral,Aquisição de serviços,"85120000-6, Serviços de prática médica e serviços conexos","Hospital do Espírito Santo de Évora, E. P. E. (508085888)","Talenter - Gestão de Projectos, SA (506111148)","95.760,00 €",04-04-2018,28-12-2017,60 dias,"Portugal, Évora, Évora","Artigo 24.º, n.º 1, alínea c) do Código dos Contratos Públicos",,,,,,Não aplicável.,Não aplicável.,FALSE
Prestação de serviços de assistência técnica,Ajuste Direto Regime Geral,Aquisição de serviços,"71356200-0, Serviços de assistência técnica","Hospital do Espírito Santo de Évora, E. P. E. (508085888)",Med X-Ray - Sistemas Médicos Lda (506187071),"3.017,50 €",04-04-2018,07-02-2018,365 dias,"Portugal, Évora, Évora","Artigo 24.º, n.º 1, alínea e) do Código dos Contratos Públicos",,,,,,Não aplicável.,Não aplicável.,FALSE
Prestação de serviços médicos de Cirurgia,Ajuste Direto Regime Geral,Aquisição de serviços,"85120000-6, Serviços de prática médica e serviços conexos","Hospital do Espírito Santo de Évora, E. P. E. (508085888)",MANOBRA DE SOBRA LDA (514115831),"15.189,20 €",04-04-2018,17-01-2018,270 dias,"Portugal, Évora, Évora","Artigo 20.º, n.º 1, alínea a) do Código dos Contratos Públicos",,,,,,Não aplicável.,Não aplicável.,FALSE
Prestação de serviços médicos de ORL,Ajuste Direto Regime Geral,Aquisição de serviços,"85120000-6, Serviços de prática médica e serviços conexos","Hospital do Espírito Santo de Évora, E. P. E. (508085888)",LUISA GARANITO - PRESTAÇÃO SERVIÇOS MÉDICOS LDA (507245539),"18.720,00 €",04-04-2018,31-01-2018,270 dias,"Portugal, Évora, Évora","Artigo 20.º, n.º 1, alínea a) do Código dos Contratos Públicos",,,,,,Não aplicável.,Não aplicável.,FALSE
Aquisição de sacos de polietileno,Concurso público,Aquisição de bens móveis,"19640000-4, Sacos de polietileno para recolha de lixo e resíduos","Hospital do Espírito Santo de Évora, E. P. E. (508085888)","Superhigiene Soc. Equip. Higiene indstial,Lda (503002011), Rei & Rei, Lda (502897970)","62.352,25 €",04-04-2018,17-01-2018,330 dias,"Portugal, Évora, Évora","Artigo 20.º, n.º 1, alínea b) do Código dos Contratos Públicos",,,,,,Não aplicável.,Não aplicável.,FALSE
Aquisição de equipamento de gastroenterologia,Ajuste Direto Regime Geral,Aquisição de bens móveis,"33100000-1, Equipamento médico","Hospital do Espírito Santo de Évora, E. P. E. (508085888)",Olympus Iberia SAU (980474710),"190.000,00 €",04-04-2018,26-02-2018,30 dias,"Portugal, Évora, Évora","Artigo 24.º, n.º 1, alínea e) do Código dos Contratos Públicos",,,,,,Não aplicável.,Não aplicável.,FALSE
Aquisição de Equipamento de RX Digital,Concurso público,Aquisição de bens móveis,"33111000-1, Aparelhos para radiologia","Hospital do Espírito Santo de Évora, E. P. E. (508085888)","Carestream Health Portugal, Lda. (508054320)","173.500,00 €",04-04-2018,27-02-2018,8 dias,"Portugal, Évora, Évora","Artigo 20.º, n.º 1, alínea b) do Código dos Contratos Públicos",,,,,,Não aplicável.,Não aplicável.,FALSE
Aquisição de 2 Incubadoras para Neonatologia,Concurso público,Aquisição de bens móveis,"33100000-1, Equipamento médico","Hospital do Espírito Santo de Évora, E. P. E. (508085888)","General Eletric Healthcare Portugal, Soc. Unipessoal, Lda. (500357129)","32.499,00 €",04-04-2018,26-02-2018,8 dias,"Portugal, Évora, Évora","Artigo 20.º, n.º 1, alínea b) do Código dos Contratos Públicos",,,,,,Não aplicável.,Não aplicável.,FALSE
Aquisição de monitor de controlo fetal,Ajuste Direto Regime Geral,Aquisição de bens móveis,"33100000-1, Equipamento médico","Hospital do Espírito Santo de Évora, E. P. E. (508085888)","Speculum - Artigos Médicos, SA (502996323)","31.880,00 €",03-04-2018,26-02-2018,8 dias,"Portugal, Évora, Évora","Artigo 20.º, n.º 1, alínea a) do Código dos Contratos Públicos",,,,,,Não aplicável.,Não aplicável.,FALSE
Aquisição de equipamento de fisioterapia,Ajuste Direto Regime Geral,Aquisição de bens móveis,"33100000-1, Equipamento médico","Hospital do Espírito Santo de Évora, E. P. E. (508085888)",Next (508540798),"2.395,08 €",03-04-2018,26-02-2018,8 dias,"Portugal, Évora, Évora","Artigo 20.º, n.º 1, alínea a) do Código dos Contratos Públicos",,,,,,Não aplicável.,Não aplicável.,FALSE
Aquisição de equipamento médico para medicina física e reabilitação,Ajuste Direto Regime Geral,Aquisição de bens móveis,"33100000-1, Equipamento médico","Hospital do Espírito Santo de Évora, E. P. E. (508085888)",SORISA ESTETICA E FISIOTERAPIA SA (500990441),"3.139,31 €",03-04-2018,26-02-2018,8 dias,"Portugal, Évora, Évora","Artigo 20.º, n.º 1, alínea a) do Código dos Contratos Públicos",,,,,,Não aplicável.,Não aplicável.,FALSE
Aquisição de equipamento de fototerapia,Ajuste Direto Regime Geral,Aquisição de bens móveis,"33100000-1, Equipamento médico","Hospital do Espírito Santo de Évora, E. P. E. (508085888)","Sano Técnica, Lda. (500239819)","7.000,00 €",03-04-2018,26-02-2018,8 dias,"Portugal, Évora, Évora","Artigo 20.º, n.º 1, alínea a) do Código dos Contratos Públicos",,,,,,Não aplicável.,Não aplicável.,FALSE
Aquisição de cardiotocógrafos,Concurso público,Aquisição de bens móveis,"33100000-1, Equipamento médico","Hospital do Espírito Santo de Évora, E. P. E. (508085888)","Speculum - Artigos Médicos, SA (502996323)","12.640,00 €",03-04-2018,26-02-2018,8 dias,"Portugal, Évora, Évora","Artigo 20.º, n.º 1, alínea b) do Código dos Contratos Públicos",,,,,,Não aplicável.,Não aplicável.,FALSE
Aquisição de eletroencefalógrafo portátil,Ajuste Direto Regime Geral,Aquisição de bens móveis,"33100000-1, Equipamento médico","Hospital do Espírito Santo de Évora, E. P. E. (508085888)",neural (502911212),"14.000,00 €",03-04-2018,26-02-2018,8 dias,"Portugal, Évora, Évora","Artigo 20.º, n.º 1, alínea a) do Código dos Contratos Públicos",,,,,,Não aplicável.,Não aplicável.,FALSE
Aquisição de Reagentes Microbiologia,Concurso público,Aquisição de bens móveis,"33696200-7, Reagentes para análises ao sangue","Hospital do Espírito Santo de Évora, E. P. E. (508085888)","BIOMERIEUX PORTUGAL, LDA (501524177), CSP SAUDE - CENTRO DE SERVIÇOS PARTILHADOS, S.A. (508440246)","146.613,38 €",03-04-2018,07-03-2018,270 dias,"Portugal, Évora, Évora","Artigo 20.º, n.º 1, alínea b) do Código dos Contratos Públicos",,,,,,Não aplicável.,Não aplicável.,FALSE
Aquisição de equipamento para esterilização,Ajuste Direto Regime Geral,Aquisição de bens móveis,"33100000-1, Equipamento médico","Hospital do Espírito Santo de Évora, E. P. E. (508085888)",PERGUT PORTUGAL-C.P.HOSP.MED (501799729),"16.905,00 €",03-04-2018,28-12-2017,8 dias,"Portugal, Évora, Évora","Artigo 20.º, n.º 1, alínea a) do Código dos Contratos Públicos",,,,,,Não aplicável.,Não aplicável.,FALSE
Aquisição de campos operatórios,Ao abrigo de acordo-quadro (art.º 259.º),Aquisição de bens móveis,"33140000-3, Material médico de consumo","Hospital do Espírito Santo de Évora, E. P. E. (508085888)",bastos viegas (500042772),"5.558,88 €",02-04-2018,14-03-2018,300 dias,"Portugal, Évora, Évora",Artigo 259.º do Código dos Contratos Públicos,,,,,,2497138,CP 2016/42 - Acordo quadro para o fornecimento de Campos Operatórios,FALSE
Aquisição de medicamentos vários,Ao abrigo de acordo-quadro (art.º 259.º),Aquisição de bens móveis,"33690000-3, Medicamentos vários","Hospital do Espírito Santo de Évora, E. P. E. (508085888)","Teva Pharma - Produtos Farmacêuticos, Lda. (507045491)","14.100,76 €",02-04-2018,21-02-2018,300 dias,"Portugal, Évora, Évora",Artigo 259.º do Código dos Contratos Públicos,,,,,,2556987,"CP 2017/65 - Acordo Quadro para fornecimento de Medicamentos de Várias áreas Terapêuticas, às Instituições e Serviços do Serviço Nacional de Saúde",FALSE
