freguesia,acronym,validVotesPercentage,votes,dicofre
"União das freguesias de Santa Maria da Feira, Travanca, Sanfins e Espargo",PPD/PSD,36.81,3504,010935
"União das freguesias de Santa Maria da Feira, Travanca, Sanfins e Espargo",PS,35.5,3380,010935
"União das freguesias de Santa Maria da Feira, Travanca, Sanfins e Espargo",B.E.,11.23,1069,010935
"União das freguesias de Santa Maria da Feira, Travanca, Sanfins e Espargo",PAN,3.77,359,010935
"União das freguesias de Santa Maria da Feira, Travanca, Sanfins e Espargo",CDS-PP,3.46,329,010935
"União das freguesias de Santa Maria da Feira, Travanca, Sanfins e Espargo",PCP-PEV,2.83,269,010935
"União das freguesias de Santa Maria da Feira, Travanca, Sanfins e Espargo",IL,1.78,169,010935
"União das freguesias de Santa Maria da Feira, Travanca, Sanfins e Espargo",L,0.85,81,010935
"União das freguesias de Santa Maria da Feira, Travanca, Sanfins e Espargo",R.I.R.,0.85,81,010935
"União das freguesias de Santa Maria da Feira, Travanca, Sanfins e Espargo",CH,0.72,69,010935
"União das freguesias de Santa Maria da Feira, Travanca, Sanfins e Espargo",PCTP/MRPP,0.53,50,010935
"União das freguesias de Santa Maria da Feira, Travanca, Sanfins e Espargo",A,0.43,41,010935
"União das freguesias de Santa Maria da Feira, Travanca, Sanfins e Espargo",PNR,0.24,23,010935
"União das freguesias de Santa Maria da Feira, Travanca, Sanfins e Espargo",PURP,0.21,20,010935
"União das freguesias de Santa Maria da Feira, Travanca, Sanfins e Espargo",MPT,0.2,19,010935
"União das freguesias de Santa Maria da Feira, Travanca, Sanfins e Espargo",NC,0.19,18,010935
"União das freguesias de Santa Maria da Feira, Travanca, Sanfins e Espargo",PTP,0.18,17,010935
"União das freguesias de Santa Maria da Feira, Travanca, Sanfins e Espargo",PDR,0.08,8,010935
"União das freguesias de Santa Maria da Feira, Travanca, Sanfins e Espargo",PPM,0.08,8,010935
"União das freguesias de Santa Maria da Feira, Travanca, Sanfins e Espargo",JPP,0.06,6,010935
