Objeto do Contrato,Tipo de Procedimento,Tipo(s) de Contrato,CPVs,Entidade(s) Adjudicante(s),Entidade(s) Adjudicatária(s),Preço Contratual,Data de Publicação,Data de Celebração do Contrato,Prazo de Execução,Local de Execução,Fundamentação,Data de Fecho do Contrato,Preço Total Efetivo,Causas das Alterações ao Prazo,Causas das Alterações ao Preço,Estado,N.º registo do Acordo Quadro,Descrição do Acordo Quadro,Procedimento Centralizado
Aquisição de<br/>10-Bancos de Capela<br/>1- Mesa em Pinho<br/>3-Cadeiras fixas com braço<br/>1- Ambão<br/>1-Mesa de apoio<br/>1-Armário,Ajuste Direto Regime Geral,Aquisição de bens móveis,"39100000-3, Mobiliário","Centro Hospitalar de Trás-os-Montes e Alto Douro, E.P.E (508100496)","HAWORTH - PORTUGAL MOBILIARIO DE ESCRITORIO, S.A (500077622)","6.320,70 €",22-01-2013,21-11-2012,20 dias,"Portugal, Viseu, Lamego","Artigo 20.º, n.º 1, alínea a) do Código dos Contratos Públicos",23-11-2012,"6.320,70 €",,,,Não aplicável.,Não aplicável.,
"Obras de remodelação do serviço de aprovisionamento da unidade de Vila Real do CHTMAD, EPE",Ajuste Direto Regime Geral,Empreitadas de obras públicas,"45453000-7, Obras de revisão e recuperação","Centro Hospitalar de Trás-os-Montes e Alto Douro, E.P.E (508100496)","Togamil Construções, Lda (502293934)","33.997,82 €",21-01-2013,26-12-2012,45 dias,"Portugal, Vila Real, Vila Real","Artigo 19.º, alínea a) do Código dos Contratos Públicos","","",,,,Não aplicável.,Não aplicável.,
"Obras de remodelação do serviço de pneumologia da unidade hospitalar de Vila Real, do CHTMAD, EPE",Ajuste Direto Regime Geral,Empreitadas de obras públicas,"45453000-7, Obras de revisão e recuperação","Centro Hospitalar de Trás-os-Montes e Alto Douro, E.P.E (508100496)","Togamil Construções, Lda (502293934)","39.215,53 €",21-01-2013,17-01-2013,45 dias,"Portugal, Vila Real, Vila Real","Artigo 19.º, alínea a) do Código dos Contratos Públicos","","",,,,Não aplicável.,Não aplicável.,
