freguesia,acronym,validVotesPercentage,votes,dicofre
União das freguesias de Mouraz e Vila Nova da Rainha,PPD/PSD.CDS-PP,47.51,200,182129
União das freguesias de Mouraz e Vila Nova da Rainha,PS,25.89,109,182129
União das freguesias de Mouraz e Vila Nova da Rainha,MPT,7.6,32,182129
União das freguesias de Mouraz e Vila Nova da Rainha,PCP-PEV,6.65,28,182129
União das freguesias de Mouraz e Vila Nova da Rainha,PND,2.61,11,182129
União das freguesias de Mouraz e Vila Nova da Rainha,PCTP/MRPP,2.38,10,182129
União das freguesias de Mouraz e Vila Nova da Rainha,B.E.,2.14,9,182129
União das freguesias de Mouraz e Vila Nova da Rainha,PAN,0.95,4,182129
União das freguesias de Mouraz e Vila Nova da Rainha,PTP,0.95,4,182129
União das freguesias de Mouraz e Vila Nova da Rainha,L,0.71,3,182129
União das freguesias de Mouraz e Vila Nova da Rainha,PNR,0.71,3,182129
União das freguesias de Mouraz e Vila Nova da Rainha,PPM,0.71,3,182129
União das freguesias de Mouraz e Vila Nova da Rainha,PPV,0.48,2,182129
União das freguesias de Mouraz e Vila Nova da Rainha,MAS,0.24,1,182129
União das freguesias de Mouraz e Vila Nova da Rainha,PDA,0.24,1,182129
União das freguesias de Mouraz e Vila Nova da Rainha,POUS,0.24,1,182129
