Objeto do Contrato,Tipo de Procedimento,Tipo(s) de Contrato,CPVs,Entidade(s) Adjudicante(s),Entidade(s) Adjudicatária(s),Preço Contratual,Data de Publicação,Data de Celebração do Contrato,Prazo de Execução,Local de Execução,Fundamentação,Data de Fecho do Contrato,Preço Total Efetivo,Causas das Alterações ao Prazo,Causas das Alterações ao Preço,Estado,N.º registo do Acordo Quadro,Descrição do Acordo Quadro,Procedimento Centralizado
AQUISIÇÃO DE DIVERSAS LÂMPADAS,Ajuste Direto Regime Geral,Aquisição de bens móveis,"31531000-7, Lâmpadas","Centro Hospitalar do Tâmega e Sousa, E. P. E. (508318262)","BIFASE - MATERIAL ELÉCTRICO E ELECTRÓNICO, LDA (504039920)","2.443,75 €",27-07-2016,01-04-2016,275 dias,"Portugal, Porto, Penafiel<BR/>Portugal, Porto, Amarante","Artigo 20.º, n.º 1, alínea a) do Código dos Contratos Públicos","","",,,,Não aplicável.,Não aplicável.,FALSE
AQUISIÇÃO DE DIVERSAS LÂMPADAS,Ajuste Direto Regime Geral,Aquisição de bens móveis,"31531000-7, Lâmpadas","Centro Hospitalar do Tâmega e Sousa, E. P. E. (508318262)","INTERLÂMPADAS - COMÉRCIO INTERNACIONAL DE LÂMPADAS, LDA (501571132)","4.742,15 €",27-07-2016,01-04-2016,275 dias,"Portugal, Porto, Penafiel<BR/>Portugal, Porto, Amarante","Artigo 20.º, n.º 1, alínea a) do Código dos Contratos Públicos","","",,,,Não aplicável.,Não aplicável.,FALSE
AQUISIÇÃO DE DIVERSAS LÂMPADAS,Ajuste Direto Regime Geral,Aquisição de bens móveis,"31531000-7, Lâmpadas","Centro Hospitalar do Tâmega e Sousa, E. P. E. (508318262)",RUI JORGE GARCIA DA COSTA (170292258),"172,80 €",27-07-2016,01-04-2016,275 dias,"Portugal, Porto, Amarante<BR/>Portugal, Porto, Penafiel","Artigo 20.º, n.º 1, alínea a) do Código dos Contratos Públicos","","",,,,Não aplicável.,Não aplicável.,FALSE
AQUISIÇÃO DE DIVERSO MATERIAL DE ELETRICIDADE,Ajuste Direto Regime Geral,Aquisição de bens móveis,"31000000-6, Maquinaria, aparelhagem, equipamento e consumíveis eléctricos; iluminação","Centro Hospitalar do Tâmega e Sousa, E. P. E. (508318262)","BIFASE - MATERIAL ELÉCTRICO E ELECTRÓNICO, LDA (504039920)","4.632,26 €",27-07-2016,02-05-2016,244 dias,"Portugal, Porto, Amarante<BR/>Portugal, Porto, Penafiel","Artigo 20.º, n.º 1, alínea a) do Código dos Contratos Públicos","","",,,,Não aplicável.,Não aplicável.,FALSE
AQUISIÇÃO DE DIVERSO MATERIAL DE ELETRICIDADE,Ajuste Direto Regime Geral,Aquisição de bens móveis,"31000000-6, Maquinaria, aparelhagem, equipamento e consumíveis eléctricos; iluminação","Centro Hospitalar do Tâmega e Sousa, E. P. E. (508318262)"," TELEMAX - TELECOMUNICAÇÕES E ELECTRÓNICA, LDA (502357240)","551,00 €",27-07-2016,02-05-2016,244 dias,"Portugal, Porto, Amarante<BR/>Portugal, Porto, Penafiel","Artigo 20.º, n.º 1, alínea a) do Código dos Contratos Públicos","","",,,,Não aplicável.,Não aplicável.,FALSE
Contratação de Prestação de Serviços de Saúde (Mariana Vilar),Ajuste Direto Regime Geral,Aquisição de serviços,"85100000-0, Serviços de saúde","Centro Hospitalar do Tâmega e Sousa, E. P. E. (508318262)",Mariana Sacchetti Freitas Vilar (230806902),"17.280,00 €",26-07-2016,15-07-2016,170 dias,"Portugal, Porto, Amarante<BR/>Portugal, Porto, Penafiel","Artigo 20.º, n.º 1, alínea a) do Código dos Contratos Públicos","","",,,,Não aplicável.,Não aplicável.,FALSE
Contratação de Prestação de Serviços de Saúde (Fernando Fontes Rato),Ajuste Direto Regime Geral,Aquisição de serviços,"85100000-0, Serviços de saúde","Centro Hospitalar do Tâmega e Sousa, E. P. E. (508318262)",Fernando Fontes Rato (189427337),"14.400,00 €",26-07-2016,15-07-2016,170 dias,"Portugal, Porto, Penafiel<BR/>Portugal, Porto, Amarante","Artigo 20.º, n.º 1, alínea a) do Código dos Contratos Públicos","","",,,,Não aplicável.,Não aplicável.,FALSE
Contratação de Prestação de Serviços de Saúde (Ana Margarida Cerqueira),Ajuste Direto Regime Geral,Aquisição de serviços,"85100000-0, Serviços de saúde","Centro Hospitalar do Tâmega e Sousa, E. P. E. (508318262)",Ana Margarida Campos Cerqueira (212004506),"14.400,00 €",26-07-2016,08-07-2016,177 dias,"Portugal, Porto, Amarante<BR/>Portugal, Porto, Penafiel","Artigo 20.º, n.º 1, alínea a) do Código dos Contratos Públicos","","",,,,Não aplicável.,Não aplicável.,FALSE
Contratação de Prestações de Serviços de Saúde (Ana Margarida Oliveira),Ajuste Direto Regime Geral,Aquisição de serviços,"85100000-0, Serviços de saúde","Centro Hospitalar do Tâmega e Sousa, E. P. E. (508318262)",Ana Margarida Ribeiro Correia de Oliveira (213878275),"14.400,00 €",26-07-2016,08-07-2016,177 dias,"Portugal, Porto, Amarante<BR/>Portugal, Porto, Penafiel","Artigo 20.º, n.º 1, alínea a) do Código dos Contratos Públicos","","",,,,Não aplicável.,Não aplicável.,FALSE
Contratação de Prestações de Serviços de Saúde (Marta Lopes),Ajuste Direto Regime Geral,Aquisição de serviços,"85100000-0, Serviços de saúde","Centro Hospitalar do Tâmega e Sousa, E. P. E. (508318262)",Marta Sofia Pinheiro Lopes (245826696),"14.400,00 €",26-07-2016,15-07-2016,170 dias,"Portugal, Porto, Amarante<BR/>Portugal, Porto, Penafiel","Artigo 20.º, n.º 1, alínea a) do Código dos Contratos Públicos","","",,,,Não aplicável.,Não aplicável.,FALSE
Contratação de Prestações de Serviços de Saúde (André Graça),Ajuste Direto Regime Geral,Aquisição de serviços,"85100000-0, Serviços de saúde","Centro Hospitalar do Tâmega e Sousa, E. P. E. (508318262)",André Batista Graça (241732883),"14.400,00 €",26-07-2016,15-07-2016,170 dias,"Portugal, Porto, Penafiel<BR/>Portugal, Porto, Amarante","Artigo 20.º, n.º 1, alínea a) do Código dos Contratos Públicos","","",,,,Não aplicável.,Não aplicável.,FALSE
Contratação de Prestação de Serviços de Saúde (Gustavo Meireles Martins),Ajuste Direto Regime Geral,Aquisição de serviços,"85100000-0, Serviços de saúde","Centro Hospitalar do Tâmega e Sousa, E. P. E. (508318262)",Gustavo Montanha Meireles Martins (213247755),"17.280,00 €",26-07-2016,15-07-2016,170 dias,"Portugal, Porto, Amarante<BR/>Portugal, Porto, Penafiel","Artigo 20.º, n.º 1, alínea a) do Código dos Contratos Públicos","","",,,,Não aplicável.,Não aplicável.,FALSE
Procedimento 08/AD.16.138 - Contratação de Prestação de Serviços de Saúde (Carlos Galvão Braga),Ajuste Direto Regime Geral,Aquisição de serviços,"85100000-0, Serviços de saúde","Centro Hospitalar do Tâmega e Sousa, E. P. E. (508318262)",Carlos Galvão de Oliveira Braga (240604342),"17.280,00 €",26-07-2016,15-07-2016,170 dias,"Portugal, Porto, Penafiel<BR/>Portugal, Porto, Amarante","Artigo 20.º, n.º 1, alínea a) do Código dos Contratos Públicos","","",,,,Não aplicável.,Não aplicável.,FALSE
Upgrade Tecnológico da Solução de Backup (Gonksys),Ajuste Direto Regime Geral,Aquisição de bens móveis,"30200000-1, Equipamento e material informático","Centro Hospitalar do Tâmega e Sousa, E.P.E. (508318262)","GONKSYS, S.A. (510874169)","51.885,42 €",22-07-2016,22-07-2016,45 dias,"Portugal, Porto, Amarante<BR/>Portugal, Porto, Penafiel","Artigo 20.º, n.º 1, alínea a) do Código dos Contratos Públicos",19-09-2016,"51.885,42 €",,,,Não aplicável.,Não aplicável.,FALSE
Upgrade Tecnológico da Solução Firewall (Gonksys),Ajuste Direto Regime Geral,Aquisição de bens móveis,"30200000-1, Equipamento e material informático","Centro Hospitalar do Tâmega e Sousa, E.P.E. (508318262)","GONKSYS, S.A. (510874169)","18.407,87 €",22-07-2016,22-07-2016,35 dias,"Portugal, Porto, Penafiel<BR/>Portugal, Porto, Amarante","Artigo 20.º, n.º 1, alínea a) do Código dos Contratos Públicos",26-08-2016,"18.407,87 €",,,,Não aplicável.,Não aplicável.,FALSE
