Objeto do Contrato,Tipo de Procedimento,Tipo(s) de Contrato,CPVs,Entidade(s) Adjudicante(s),Entidade(s) Adjudicatária(s),Preço Contratual,Data de Publicação,Data de Celebração do Contrato,Prazo de Execução,Local de Execução,Fundamentação,Data de Fecho do Contrato,Preço Total Efetivo,Causas das Alterações ao Prazo,Causas das Alterações ao Preço,Estado,N.º registo do Acordo Quadro,Descrição do Acordo Quadro,Procedimento Centralizado
reparação de 2 LP12 s/n 30290031 e 32205006.,Ajuste Direto Regime Geral,Aquisição de serviços,"50000000-5, Serviços de reparação e manutenção","Instituto Nacional de Emergência Médica, IP (501356126)","MEDTRONIC, LDA. (504223933)","3.029,61 €",02-03-2012,24-02-2012,30 dias,"Portugal, Lisboa, Lisboa","Artigo 24.º, n.º 1, alínea e) do Código dos Contratos Públicos",,,,,,Não aplicável.,Não aplicável.,
REPARAÇÃO DE 1 LP12 s/n 13083110.,Ajuste Direto Regime Geral,Aquisição de serviços,"50000000-5, Serviços de reparação e manutenção","Instituto Nacional de Emergência Médica, IP (501356126)","MEDTRONIC, LDA. (504223933)","2.705,56 €",02-03-2012,24-02-2012,30 dias,"Portugal, Lisboa, Lisboa","Artigo 24.º, n.º 1, alínea e) do Código dos Contratos Públicos",,,,,,Não aplicável.,Não aplicável.,
FORNECIMENTO DE 50 ROLOS DE PAPEL P/IMPRESSORA P/LP12.,Ajuste Direto Regime Geral,Aquisição de bens móveis,"33698000-9, Produtos para fins clínicos","Instituto Nacional de Emergência Médica, IP (501356126)","MEDTRONIC, LDA. (504223933)","425,00 €",02-03-2012,10-02-2012,30 dias,"Portugal, Lisboa, Lisboa","Artigo 24.º, n.º 1, alínea e) do Código dos Contratos Públicos",,,,,,Não aplicável.,Não aplicável.,
REPARAÇÃO DE SERINGAS,Ajuste Direto Regime Geral,Aquisição de serviços,"50421000-2, Serviços de reparação e manutenção de equipamento médico","Instituto Nacional de Emergência Médica, IP (501356126)","B. BRAUN, LDA (501506543)","1.796,88 €",01-03-2012,17-02-2012,30 dias,"Portugal, Lisboa, Lisboa","Artigo 20.º, n.º 1, alínea a) do Código dos Contratos Públicos",,,,,,Não aplicável.,Não aplicável.,
Reparação de 4 monitores Nomim,Ajuste Direto Regime Geral,Aquisição de serviços,"50421000-2, Serviços de reparação e manutenção de equipamento médico","Instituto Nacional de Emergência Médica, IP (501356126)",SPACE (507662407),"1.723,33 €",29-02-2012,17-02-2012,30 dias,"Portugal, Lisboa, Lisboa","Artigo 24.º, n.º 1, alínea e) do Código dos Contratos Públicos",,,,,,Não aplicável.,Não aplicável.,
"REPARAÇÃO DE 4 LP12 s/n 35810137, 30290025, 13083108, 30290023.",Ajuste Direto Regime Geral,Aquisição de serviços,"50000000-5, Serviços de reparação e manutenção","Instituto Nacional de Emergência Médica, IP (501356126)","MEDTRONIC, LDA. (504223933)","3.195,04 €",29-02-2012,24-02-2012,30 dias,"Portugal, Lisboa, Lisboa","Artigo 24.º, n.º 1, alínea e) do Código dos Contratos Públicos",,,,,,Não aplicável.,Não aplicável.,
"ASSISTENCIA E MANUTENÇÃO A 3 ELEVADORES DO EDIFICIO DA RA ALMIRANTE BARROSSO. 36 EA 2 ELEVADORES DO EDIFICIO DA RUA INFANTE D. PEDRO, 8 , PARA O PEIRODO DE MARÇO A DEZEMBRO DE 2012.",Ajuste Direto Regime Geral,Aquisição de serviços,"50000000-5, Serviços de reparação e manutenção","Instituto Nacional de Emergência Médica, IP (501356126)","THYSSENKRUPP ELEVADORES,SA (501445226)","3.080,00 €",29-02-2012,24-02-2012,30 dias,"Portugal, Lisboa, Lisboa","Artigo 20.º, n.º 1, alínea a) do Código dos Contratos Públicos",,,,,,Não aplicável.,Não aplicável.,
"REPARAÇÃO DE 5 LP12 s/n 30290033, 35010151, 32205893, 32205014, 13083107.",Ajuste Direto Regime Geral,Aquisição de serviços,"50000000-5, Serviços de reparação e manutenção","Instituto Nacional de Emergência Médica, IP (501356126)","MEDTRONIC, LDA. (504223933)","4.408,92 €",29-02-2012,24-02-2012,30 dias,"Portugal, Lisboa, Lisboa","Artigo 24.º, n.º 1, alínea e) do Código dos Contratos Públicos",,,,,,Não aplicável.,Não aplicável.,
"REPARAÇÃO DE 4 LP12 s/n 33503441, 33503436, 32177065, 12897358.",Ajuste Direto Regime Geral,Aquisição de serviços,"50000000-5, Serviços de reparação e manutenção","Instituto Nacional de Emergência Médica, IP (501356126)","MEDTRONIC, LDA. (504223933)","624,96 €",29-02-2012,24-02-2012,30 dias,"Portugal, Lisboa, Lisboa","Artigo 24.º, n.º 1, alínea e) do Código dos Contratos Públicos",,,,,,Não aplicável.,Não aplicável.,
SERVIÇO DE MIGRAÇÃO DAS 1450 CONTAS EXISTENTES NO SERVIDORES EXCHANGE DO INEM PARA CONTAS DE CORREIO BASEADAS NA CLOUD.,Ajuste Direto Regime Geral,Aquisição de serviços,"72540000-2, Serviços de actualização informática","Instituto Nacional de Emergência Médica, IP (501356126)","CPCIS, SA (501267255)","5.000,00 €",29-02-2012,20-02-2012,30 dias,"Portugal, Lisboa, Lisboa","Artigo 20.º, n.º 1, alínea a) do Código dos Contratos Públicos",,,,,,Não aplicável.,Não aplicável.,
Passagens em barreiras  de portagens - ano 2012,Ajuste Direto Regime Geral,Aquisição de serviços,"63712210-8, Serviços de portagem em auto-estradas","Instituto Nacional de Emergência Médica, IP (501356126)","BRISA CONCESSÃO RODOVIÁRIA, SA (502790024)","27.642,28 €",28-02-2012,24-02-2012,365 dias,Portugal,"Artigo 24.º, n.º 1, alínea e) do Código dos Contratos Públicos",,,,,,Não aplicável.,Não aplicável.,
PORTAGENS,Ajuste Direto Regime Geral,Aquisição de serviços,"63712210-8, Serviços de portagem em auto-estradas","Instituto Nacional de Emergência Médica, IP (501356126)","AUTO-ESTRADAS SO ATLANTICO, SA (504290592)","1.505,00 €",28-02-2012,24-02-2012,365 dias,"Portugal, Lisboa, Lisboa","Artigo 24.º, n.º 1, alínea e) do Código dos Contratos Públicos",,,,,,Não aplicável.,Não aplicável.,
PORTAGENS,Ajuste Direto Regime Geral,Aquisição de serviços,"63712210-8, Serviços de portagem em auto-estradas","Instituto Nacional de Emergência Médica, IP (501356126)",ASCENDI NORTE (504488643),"325,20 €",28-02-2012,24-02-2012,365 dias,"Portugal, Lisboa, Lisboa","Artigo 24.º, n.º 1, alínea e) do Código dos Contratos Públicos",,,,,,Não aplicável.,Não aplicável.,
PORTAGENS,Ajuste Direto Regime Geral,Aquisição de serviços,"63712210-8, Serviços de portagem em auto-estradas","Instituto Nacional de Emergência Médica, IP (501356126)",ASCENDI O&M (508677688),"577,24 €",28-02-2012,24-02-2012,365 dias,"Portugal, Lisboa, Lisboa","Artigo 24.º, n.º 1, alínea e) do Código dos Contratos Públicos",,,,,,Não aplicável.,Não aplicável.,
PORTAGENS,Ajuste Direto Regime Geral,Aquisição de serviços,"63712210-8, Serviços de portagem em auto-estradas","Instituto Nacional de Emergência Médica, IP (501356126)","VIALIVRE, SA (509447058)","350,00 €",28-02-2012,24-02-2012,365 dias,"Portugal, Lisboa, Lisboa","Artigo 24.º, n.º 1, alínea e) do Código dos Contratos Públicos",,,,,,Não aplicável.,Não aplicável.,
PORTAGENS,Ajuste Direto Regime Geral,Aquisição de serviços,"63712311-6, Serviços de portagem em pontes","Instituto Nacional de Emergência Médica, IP (501356126)",LUSOPONTE (503174688),"1.230,00 €",28-02-2012,24-02-2012,365 dias,"Portugal, Lisboa, Lisboa","Artigo 24.º, n.º 1, alínea e) do Código dos Contratos Públicos",,,,,,Não aplicável.,Não aplicável.,
PORTAGENS,Ajuste Direto Regime Geral,Aquisição de serviços,"63712210-8, Serviços de portagem em auto-estradas","Instituto Nacional de Emergência Médica, IP (501356126)",ESTRADAS DE PORTUGAL (504598686),"100,00 €",28-02-2012,24-02-2012,365 dias,"Portugal, Lisboa, Lisboa","Artigo 24.º, n.º 1, alínea e) do Código dos Contratos Públicos",,,,,,Não aplicável.,Não aplicável.,
PORTAGENS,Ajuste Direto Regime Geral,Aquisição de serviços,"63712210-8, Serviços de portagem em auto-estradas","Instituto Nacional de Emergência Médica, IP (501356126)","AUTO ESTRADAS DOURO LITORAL, SA (507027140)","219,51 €",28-02-2012,24-02-2012,365 dias,"Portugal, Lisboa, Lisboa","Artigo 24.º, n.º 1, alínea e) do Código dos Contratos Públicos",,,,,,Não aplicável.,Não aplicável.,
PORTAGENS,Ajuste Direto Regime Geral,Aquisição de serviços,"63712210-8, Serviços de portagem em auto-estradas","Instituto Nacional de Emergência Médica, IP (501356126)",BRISAL (504778820),"650,00 €",28-02-2012,24-02-2012,365 dias,"Portugal, Lisboa, Lisboa","Artigo 24.º, n.º 1, alínea e) do Código dos Contratos Públicos",,,,,,Não aplicável.,Não aplicável.,
REPARAÇÃO DE SERINGA PERFUSORA,Ajuste Direto Regime Geral,Aquisição de serviços,"50421000-2, Serviços de reparação e manutenção de equipamento médico","Instituto Nacional de Emergência Médica, IP (501356126)",FRESENIUS KABI (504293753),"408,00 €",28-02-2012,17-02-2012,30 dias,"Portugal, Lisboa, Lisboa","Artigo 24.º, n.º 1, alínea e) do Código dos Contratos Públicos",,,,,,Não aplicável.,Não aplicável.,
REPARAÇÃO DE VENTILADORES,Ajuste Direto Regime Geral,Aquisição de serviços,"50421000-2, Serviços de reparação e manutenção de equipamento médico","Instituto Nacional de Emergência Médica, IP (501356126)","SMITHS MEDICAL, LDA (507445937)","2.400,00 €",28-02-2012,17-02-2012,30 dias,"Portugal, Lisboa, Lisboa","Artigo 24.º, n.º 1, alínea e) do Código dos Contratos Públicos",,,,,,Não aplicável.,Não aplicável.,
REPARAÇÃO DE ASPIRADORES,Ajuste Direto Regime Geral,Aquisição de serviços,"50421000-2, Serviços de reparação e manutenção de equipamento médico","Instituto Nacional de Emergência Médica, IP (501356126)","FUTURVIDA, LDA (504260510)","781,48 €",28-02-2012,17-02-2012,30 dias,"Portugal, Lisboa, Lisboa","Artigo 24.º, n.º 1, alínea e) do Código dos Contratos Públicos",,,,,,Não aplicável.,Não aplicável.,
REPARAÇÃO DE ASPIRADORES,Ajuste Direto Regime Geral,Aquisição de serviços,"50421000-2, Serviços de reparação e manutenção de equipamento médico","Instituto Nacional de Emergência Médica, IP (501356126)","FUTURVIDA, LDA (504260510)","936,04 €",28-02-2012,17-02-2012,30 dias,"Portugal, Lisboa, Lisboa","Artigo 24.º, n.º 1, alínea e) do Código dos Contratos Públicos",,,,,,Não aplicável.,Não aplicável.,
Reparaçaõ de Incubadora,Ajuste Direto Regime Geral,Aquisição de serviços,"50421000-2, Serviços de reparação e manutenção de equipamento médico","Instituto Nacional de Emergência Médica, IP (501356126)",SANO-TECNICA (500239819),"701,25 €",28-02-2012,22-02-2012,30 dias,"Portugal, Lisboa, Lisboa","Artigo 20.º, n.º 1, alínea a) do Código dos Contratos Públicos",,,,,,Não aplicável.,Não aplicável.,
FORNECIMENTO DE 40 ESFIGNOMAN. ANEROIDE S/ESTETOSC. ADULTO.,Ajuste Direto Regime Geral,Aquisição de bens móveis,"33140000-3, Material médico de consumo","Instituto Nacional de Emergência Médica, IP (501356126)","AMBEX, LDA. (507593111)","760,00 €",28-02-2012,20-02-2012,30 dias,"Portugal, Lisboa, Lisboa","Artigo 20.º, n.º 1, alínea a) do Código dos Contratos Públicos",,,,,,Não aplicável.,Não aplicável.,
"FORNECIMENTO DE 200 AMPOLAS DE SALBUTAMOL, AMP. 0,5MG/1ML (AMP)30",Ao abrigo de acordo-quadro (art.º 258.º),Aquisição de bens móveis,"33690000-3, Medicamentos vários","Instituto Nacional de Emergência Médica, IP (501356126)","GLAXOSMITHKLINE, LDA. (500139962)","77,20 €",28-02-2012,03-02-2012,30 dias,"Portugal, Lisboa, Lisboa","Artigo 26.º, n.º 1, alínea e) do Código dos Contratos Públicos",,,,,,Não definido.,Não definido.,
"FORNECIMENTO DE 40.000 LUVAS DE EXAME EM LATEX, N/ESTÉRIL, SEM PÓ, TAM. L.",Ao abrigo de acordo-quadro (art.º 258.º),Aquisição de bens móveis,"18424000-7, Luvas","Instituto Nacional de Emergência Médica, IP (501356126)","EZEQUIEL PANÃO JORGE, LDA. (501412727)","1.304,00 €",24-02-2012,02-02-2012,30 dias,"Portugal, Lisboa, Lisboa","Artigo 26.º, n.º 1, alínea e) do Código dos Contratos Públicos",,,,,,Não definido.,Não definido.,
"FORNECIMENTO DE 55 FITAS DE AVALIAÇÃO PEDIATRICA, DO TIPO BROSELOW, PARA APLICAÇÃO NOS MEIOS.",Ajuste Direto Regime Geral,Aquisição de bens móveis,"33698000-9, Produtos para fins clínicos","Instituto Nacional de Emergência Médica, IP (501356126)","FUTURVIDA, LDA. (504260510)","1.925,00 €",22-02-2012,28-01-2012,30 dias,"Portugal, Lisboa, Lisboa","Artigo 20.º, n.º 1, alínea a) do Código dos Contratos Públicos",,,,,,Não aplicável.,Não aplicável.,
"FORNECIMENTO DE 600 EMBALAGENS COMP. AMÓNIO+GUANIDINA+ N PROPANOL, SPRAY 750ML.",Ajuste Direto Regime Geral,Aquisição de bens móveis,"33690000-3, Medicamentos vários","Instituto Nacional de Emergência Médica, IP (501356126)","AIR LIQUIDE MEDICINAL, SA (501576436)","2.736,00 €",22-02-2012,10-02-2012,30 dias,"Portugal, Lisboa, Lisboa","Artigo 20.º, n.º 1, alínea a) do Código dos Contratos Públicos",,,,,,Não aplicável.,Não aplicável.,
"SERVIÇO CLIPPING - MONITORIZAÇÃO DE NOTICIAS - SERVIÇO REGULAR - NOTICIAS ESCRITAS, DE FEVEREIRO A DEZEMBRO DE 2012.",Ajuste Direto Regime Geral,Aquisição de serviços,"71356000-8, Serviços técnicos","Instituto Nacional de Emergência Médica, IP (501356126)","CISION, SA (501355383)","4.565,00 €",22-02-2012,17-02-2012,30 dias,"Portugal, Lisboa, Lisboa","Artigo 20.º, n.º 1, alínea a) do Código dos Contratos Públicos",,,,,,Não aplicável.,Não aplicável.,
