freguesia,acronym,validVotesPercentage,votes,dicofre
"União das freguesias de Gondomar (São Cosme), Valbom e Jovim",PS,33.92,4998,130415
"União das freguesias de Gondomar (São Cosme), Valbom e Jovim",PPD/PSD.CDS-PP,25.71,3789,130415
"União das freguesias de Gondomar (São Cosme), Valbom e Jovim",PCP-PEV,13.95,2056,130415
"União das freguesias de Gondomar (São Cosme), Valbom e Jovim",MPT,9.87,1454,130415
"União das freguesias de Gondomar (São Cosme), Valbom e Jovim",B.E.,6.57,968,130415
"União das freguesias de Gondomar (São Cosme), Valbom e Jovim",PCTP/MRPP,2.44,359,130415
"União das freguesias de Gondomar (São Cosme), Valbom e Jovim",L,2.16,318,130415
"União das freguesias de Gondomar (São Cosme), Valbom e Jovim",PAN,2.02,297,130415
"União das freguesias de Gondomar (São Cosme), Valbom e Jovim",PPM,0.64,94,130415
"União das freguesias de Gondomar (São Cosme), Valbom e Jovim",PTP,0.62,92,130415
"União das freguesias de Gondomar (São Cosme), Valbom e Jovim",PND,0.59,87,130415
"União das freguesias de Gondomar (São Cosme), Valbom e Jovim",PNR,0.44,65,130415
"União das freguesias de Gondomar (São Cosme), Valbom e Jovim",PPV,0.38,56,130415
"União das freguesias de Gondomar (São Cosme), Valbom e Jovim",MAS,0.36,53,130415
"União das freguesias de Gondomar (São Cosme), Valbom e Jovim",PDA,0.24,36,130415
"União das freguesias de Gondomar (São Cosme), Valbom e Jovim",POUS,0.09,13,130415
