freguesia,acronym,validVotesPercentage,votes,dicofre
"União das freguesias de Areias, Sequeiró, Lama e Palmeira",PS,49.3,1157,131433
"União das freguesias de Areias, Sequeiró, Lama e Palmeira",PPD/PSD.CDS-PP,31.19,732,131433
"União das freguesias de Areias, Sequeiró, Lama e Palmeira",MPT,6.09,143,131433
"União das freguesias de Areias, Sequeiró, Lama e Palmeira",PCP-PEV,3.79,89,131433
"União das freguesias de Areias, Sequeiró, Lama e Palmeira",B.E.,3.41,80,131433
"União das freguesias de Areias, Sequeiró, Lama e Palmeira",L,1.11,26,131433
"União das freguesias de Areias, Sequeiró, Lama e Palmeira",PCTP/MRPP,0.98,23,131433
"União das freguesias de Areias, Sequeiró, Lama e Palmeira",PAN,0.94,22,131433
"União das freguesias de Areias, Sequeiró, Lama e Palmeira",PND,0.94,22,131433
"União das freguesias de Areias, Sequeiró, Lama e Palmeira",PPM,0.6,14,131433
"União das freguesias de Areias, Sequeiró, Lama e Palmeira",PTP,0.43,10,131433
"União das freguesias de Areias, Sequeiró, Lama e Palmeira",PNR,0.38,9,131433
"União das freguesias de Areias, Sequeiró, Lama e Palmeira",MAS,0.3,7,131433
"União das freguesias de Areias, Sequeiró, Lama e Palmeira",POUS,0.26,6,131433
"União das freguesias de Areias, Sequeiró, Lama e Palmeira",PDA,0.17,4,131433
"União das freguesias de Areias, Sequeiró, Lama e Palmeira",PPV,0.13,3,131433
