freguesia,acronym,validVotesPercentage,votes,dicofre
"União das freguesias de Algoso, Campo de Víboras e Uva",PPD/PSD,70.03,243,041115
"União das freguesias de Algoso, Campo de Víboras e Uva",PS,21.61,75,041115
"União das freguesias de Algoso, Campo de Víboras e Uva",B.E.,2.31,8,041115
"União das freguesias de Algoso, Campo de Víboras e Uva",CDS-PP,1.73,6,041115
"União das freguesias de Algoso, Campo de Víboras e Uva",PCP-PEV,1.15,4,041115
"União das freguesias de Algoso, Campo de Víboras e Uva",R.I.R.,0.86,3,041115
"União das freguesias de Algoso, Campo de Víboras e Uva",PAN,0.58,2,041115
"União das freguesias de Algoso, Campo de Víboras e Uva",CH,0.29,1,041115
"União das freguesias de Algoso, Campo de Víboras e Uva",IL,0.29,1,041115
"União das freguesias de Algoso, Campo de Víboras e Uva",NC,0.29,1,041115
"União das freguesias de Algoso, Campo de Víboras e Uva",PCTP/MRPP,0.29,1,041115
"União das freguesias de Algoso, Campo de Víboras e Uva",PTP,0.29,1,041115
"União das freguesias de Algoso, Campo de Víboras e Uva",PURP,0.29,1,041115
"União das freguesias de Algoso, Campo de Víboras e Uva",A,0,0,041115
"União das freguesias de Algoso, Campo de Víboras e Uva",L,0,0,041115
"União das freguesias de Algoso, Campo de Víboras e Uva",PDR,0,0,041115
"União das freguesias de Algoso, Campo de Víboras e Uva",PNR,0,0,041115
"União das freguesias de Algoso, Campo de Víboras e Uva",PPM,0,0,041115
