Objeto do Contrato,Tipo de Procedimento,Tipo(s) de Contrato,CPVs,Entidade(s) Adjudicante(s),Entidade(s) Adjudicatária(s),Preço Contratual,Data de Publicação,Data de Celebração do Contrato,Prazo de Execução,Local de Execução,Fundamentação,Data de Fecho do Contrato,Preço Total Efetivo,Causas das Alterações ao Prazo,Causas das Alterações ao Preço,Estado,N.º registo do Acordo Quadro,Descrição do Acordo Quadro,Procedimento Centralizado
Reagentes p/ Lab. Análises Clínicas prorr 115001/2015,Ajuste Direto Regime Geral,Aquisição de bens móveis,"33696000-5, Reagentes e meios de contraste",Hospital do Arcebispo João Crisóstomo  Cantanhede (501626123),"Menarini Diagnósticos Material de Laboratório, Lda (502610069)","30.779,94 €",10-04-2017,28-01-2016,365 dias,"Portugal, Coimbra, Cantanhede","Artigo 26.º, n.º 1, alínea a) do Código dos Contratos Públicos",,,,,,Não aplicável.,Não aplicável.,FALSE
reagentes p/ Serologia e Microbiologia,Ajuste Direto Regime Geral,Aquisição de bens móveis,"33696000-5, Reagentes e meios de contraste",Hospital do Arcebispo João Crisóstomo  Cantanhede (501626123),"Know How (509884296), BIOMERIEUX PORTUGAL, LDA. (501524177), Normax, Ldª. (500203130), IBERLAB IMUNOREAGE (503406694)","6.370,55 €",10-04-2017,08-02-2016,365 dias,"Portugal, Coimbra, Cantanhede","Artigo 20.º, n.º 1, alínea a) do Código dos Contratos Públicos",,,,,,Não aplicável.,Não aplicável.,FALSE
Aquisição de Tiras Reagentes,Ajuste Direto Regime Geral,Aquisição de bens móveis,"33694000-1, Meios de diagnóstico",Hospital do Arcebispo João Crisóstomo  Cantanhede (501626123),"SIEMENS HEALTHCARE DIAGNOSTICS, UNIPESSOAL, LDA. (507925173), Quilaban - Química Laboratorial Analítica, S.A: (500399670)","2.003,25 €",07-04-2017,08-02-2016,365 dias,"Portugal, Coimbra, Cantanhede","Artigo 20.º, n.º 1, alínea a) do Código dos Contratos Públicos",,,,,,Não aplicável.,Não aplicável.,FALSE
Medicamentos s/ CHNM não constantes do AQ SPMS,Ajuste Direto Regime Geral,Aquisição de bens móveis,"33690000-3, Medicamentos vários",Hospital do Arcebispo João Crisóstomo  Cantanhede (501626123)," MEDICINALIA CORMEDICA, LDA (500684324), BAUSCH  LOMB                                       (980218764), Smith & Nephew (503552461), NESTLE PORTUGAL, SA (500201307), NUTRICIA ADVANCED MEDICAL NUTRITION UNP.LDA (507558286), FRESENIUS KABI PHARMA PORTUGAL,LDA (504293753), Franklab Portugal, Lda         (506058654), PROCLINICA - EQUIPAMENTOS E PRODUTOS CLINICOS, LDA. (500222665), INTERSURGICAL PORTUGAL-COMÉRCIO DE PRODUTOS HOSPITALARES LDA (503480045), VISIONAL - Unipessoal, Ldª (508798280)","6.524,49 €",07-04-2017,19-01-2016,365 dias,"Portugal, Coimbra, Cantanhede","Artigo 20.º, n.º 1, alínea a) do Código dos Contratos Públicos",,,,,,Não aplicável.,Não aplicável.,FALSE
Aquisição de medicamentos c/ CHNM não constantes dos AQ da SPMS,Ajuste Direto Regime Geral,Aquisição de bens móveis,"33690000-3, Medicamentos vários",Hospital do Arcebispo João Crisóstomo  Cantanhede (501626123),"SANDOZ FARMACEUTICA LDA          (506985261), SANOFI-PRODUTOS FARMACEUTICOS,LDA (500134960), PIERRE FABRE MEDIC.PORTUGAL,LD (500230366), RATIOPHARM          (502414910), U C B PHARMA - PROD FARMACEUTICOS                  (500291322), ROCHE Farmacêutica Quimica, Lda (500233810), Janssen Cilag Farmacêutica, Lda (500189412), GENERIS-FARMACEUTICA,SA (508107997), AUROBINDO PHARMA PORTUGAL, (UNIP.) LDA             (508527465), Aurovitas Unipessoal Lda. (513053239), BLUEMED Unipessoal, LDA. (509912060), Alcon Portugal (501251685)","5.221,37 €",07-04-2017,19-01-2016,365 dias,"Portugal, Coimbra, Cantanhede","Artigo 20.º, n.º 1, alínea a) do Código dos Contratos Públicos",,,,,,Não aplicável.,Não aplicável.,FALSE
