freguesia,acronym,validVotesPercentage,votes,dicofre
Refontoura,PS,43.72,411,130317
Refontoura,PPD/PSD,35.43,333,130317
Refontoura,B.E.,7.77,73,130317
Refontoura,CDS-PP,3.94,37,130317
Refontoura,PCP-PEV,2.34,22,130317
Refontoura,PAN,1.81,17,130317
Refontoura,PCTP/MRPP,0.96,9,130317
Refontoura,R.I.R.,0.85,8,130317
Refontoura,IL,0.64,6,130317
Refontoura,L,0.64,6,130317
Refontoura,PURP,0.43,4,130317
Refontoura,CH,0.32,3,130317
Refontoura,A,0.21,2,130317
Refontoura,NC,0.21,2,130317
Refontoura,PPM,0.21,2,130317
Refontoura,PTP,0.21,2,130317
Refontoura,JPP,0.11,1,130317
Refontoura,MAS,0.11,1,130317
Refontoura,MPT,0.11,1,130317
Refontoura,PDR,0,0,130317
Refontoura,PNR,0,0,130317
