Objeto do Contrato,Tipo de Procedimento,Tipo(s) de Contrato,CPVs,Entidade(s) Adjudicante(s),Entidade(s) Adjudicatária(s),Preço Contratual,Data de Publicação,Data de Celebração do Contrato,Prazo de Execução,Local de Execução,Fundamentação,Data de Fecho do Contrato,Preço Total Efetivo,Causas das Alterações ao Prazo,Causas das Alterações ao Preço,Estado,N.º registo do Acordo Quadro,Descrição do Acordo Quadro,Procedimento Centralizado
92/3536/2018 - Aquisição de folhas de Esterilização,Ajuste Direto Regime Geral,Aquisição de bens móveis,"33140000-3, Material médico de consumo","Centro Hospitalar Universitário do Algarve, E. P. E. (510745997)","Medline, Lda (510533515)","989,25 €",08-11-2018,29-10-2018,5 dias,"Portugal, Faro, Faro<BR/>Portugal, Faro, Portimão","Artigo 24.º, n.º 1, alínea e), subalínea ii) do Código dos Contratos Públicos",,,,,,Não aplicável.,Não aplicável.,FALSE
92/3556/2018 - Aquisição de Sistema Pacemakers 2 Câmaras,Ajuste Direto Regime Geral,Aquisição de bens móveis,"33182000-9, Material de assistência à função cardíaca","Centro Hospitalar Universitário do Algarve, E. P. E. (510745997)","Abbott Medical Portugal - Distribuição  de Produtos Médicos, Lda. (504180746)","8.040,00 €",07-11-2018,29-10-2018,5 dias,"Portugal, Faro, Faro","Artigo 24.º, n.º 1, alínea c) do Código dos Contratos Públicos",,,,,,Não aplicável.,Não aplicável.,FALSE
Explorador de Raiz 230mm,Ajuste Direto Regime Geral,Aquisição de bens móveis,"33100000-1, Equipamento médico","Centro Hospitalar Universitário do Algarve, E. P. E. (510745997)","B BRAUN MEDICAL, LDA. (501506543)","110,68 €",07-11-2018,06-11-2018,60 dias,"Portugal, Faro, Faro","Artigo 24.º, n.º 1, alínea b) do Código dos Contratos Públicos",,,,,,Não aplicável.,Não aplicável.,FALSE
92/3538/2018 - Aquisição de Fios de Sutura,Ajuste Direto Regime Geral,Aquisição de bens móveis,"33140000-3, Material médico de consumo","Centro Hospitalar Universitário do Algarve, E. P. E. (510745997)","MEDTRONIC PORTUGAL, LDA. (504223933)","2.266,92 €",06-11-2018,29-10-2018,5 dias,"Portugal, Faro, Faro<BR/>Portugal, Faro, Portimão","Artigo 24.º, n.º 1, alínea e), subalínea ii) do Código dos Contratos Públicos",,,,,,Não aplicável.,Não aplicável.,FALSE
82/3387/2018 - Aquisição de material de consumo clínico (vários),Consulta Prévia,Aquisição de bens móveis,"33140000-3, Material médico de consumo","Centro Hospitalar Universitário do Algarve, E. P. E. (510745997)","NORMAX,LDA. (500203130)","71,43 €",06-11-2018,22-10-2018,70 dias,"Portugal, Faro, Lagos<BR/>Portugal, Faro, Faro<BR/>Portugal, Faro, Portimão","Artigo 20.º, n.º 1, alínea c) do Código dos Contratos Públicos e artigo 4.º, nº 1 do DLR nº 34/2008/M, de 14.08 (DLR n.º 6/2018/M)",,,,,,Não aplicável.,Não aplicável.,FALSE
82/3387/2018 - Aquisição de material de consumo clínico (vários),Consulta Prévia,Aquisição de bens móveis,"33140000-3, Material médico de consumo","Centro Hospitalar Universitário do Algarve, E. P. E. (510745997)","MEDTRONIC PORTUGAL, LDA. (504223933)","227,50 €",06-11-2018,22-10-2018,70 dias,"Portugal, Faro, Lagos<BR/>Portugal, Faro, Portimão<BR/>Portugal, Faro, Faro","Artigo 20.º, n.º 1, alínea c) do Código dos Contratos Públicos e artigo 4.º, nº 1 do DLR nº 34/2008/M, de 14.08 (DLR n.º 6/2018/M)",,,,,,Não aplicável.,Não aplicável.,FALSE
82/3387/2018 - Aquisição de material de consumo clínico (vários),Consulta Prévia,Aquisição de bens móveis,"33140000-3, Material médico de consumo","Centro Hospitalar Universitário do Algarve, E. P. E. (510745997)","LINEAMEDICA-DISPOSITIVOS MEDICOS-CIRUGICOS, SA (505148676)","304,00 €",06-11-2018,22-10-2018,70 dias,"Portugal, Faro, Lagos<BR/>Portugal, Faro, Portimão<BR/>Portugal, Faro, Faro","Artigo 20.º, n.º 1, alínea c) do Código dos Contratos Públicos e artigo 4.º, nº 1 do DLR nº 34/2008/M, de 14.08 (DLR n.º 6/2018/M)",,,,,,Não aplicável.,Não aplicável.,FALSE
92/3474/2018 - Aquisição de Cardioversores,Ajuste Direto Regime Geral,Aquisição de bens móveis,"33182000-9, Material de assistência à função cardíaca","Centro Hospitalar Universitário do Algarve, E. P. E. (510745997)",BOSTON SCIENTIFIC PORTUGAL LDA (504988964),"26.600,00 €",02-11-2018,17-10-2018,5 dias,"Portugal, Faro, Faro","Artigo 24.º, n.º 1, alínea c) do Código dos Contratos Públicos",,,,,,Não aplicável.,Não aplicável.,FALSE
Próteses e acessórios para amputados,Concurso público,Aquisição de serviços,"85111400-4, Serviços hospitalares de reabilitação","Centro Hospitalar Universitário do Algarve, E.P.E. (510745997)","AMÉRICO QUINTINO E FILHOS, PRODUTOS ORT.LDA (508988390)","50.345,45 €",02-11-2018,29-06-2018,243 dias,"Portugal, Faro, Portimão<BR/>Portugal, Faro, Faro","Artigo 20.º, n.º 1, alínea b) do Código dos Contratos Públicos",,,,,,Não aplicável.,Não aplicável.,FALSE
Próteses e acessórios para amputados,Concurso público,Aquisição de serviços,"85111400-4, Serviços hospitalares de reabilitação","Centro Hospitalar Universitário do Algarve, E.P.E. (510745997)","AMÉRICO QUINTINO E FILHOS, PRODUTOS ORT.LDA (508988390)","2.820,00 €",02-11-2018,29-06-2018,243 dias,"Portugal, Faro, Faro","Artigo 20.º, n.º 1, alínea b) do Código dos Contratos Públicos",,,,,,Não aplicável.,Não aplicável.,FALSE
92/3511/2018 - Aquisição de Pacemakers 1 Câmara,Ajuste Direto Regime Geral,Aquisição de bens móveis,"33182000-9, Material de assistência à função cardíaca","Centro Hospitalar Universitário do Algarve, E. P. E. (510745997)","Livanova Portugal, Lda. (505514010)","5.900,00 €",02-11-2018,16-10-2018,5 dias,"Portugal, Faro, Faro","Artigo 24.º, n.º 1, alínea c) do Código dos Contratos Públicos",,,,,,Não aplicável.,Não aplicável.,FALSE
62/3252/2018 - Aquisição Cardioversor Desfibrilhador 1 Câmara (CDI-VR),Ajuste Direto Regime Geral,Aquisição de bens móveis,"33123210-3, Aparelhos para monitorização cardíaca","Centro Hospitalar Universitário do Algarve, E. P. E. (510745997)","Abbott Medical Portugal - Distribuição  de Produtos Médicos, Lda. (504180746)","8.500,00 €",02-11-2018,21-09-2018,5 dias,"Portugal, Faro, Faro","Artigo 24.º, n.º 1, alínea e), subalínea ii) do Código dos Contratos Públicos",,,,,,Não aplicável.,Não aplicável.,FALSE
92/3235/2018 - Aquisição de Pacemakers 2 Câmaras,Ajuste Direto Regime Geral,Aquisição de bens móveis,"33182000-9, Material de assistência à função cardíaca","Centro Hospitalar Universitário do Algarve, E. P. E. (510745997)",BOSTON SCIENTIFIC PORTUGAL LDA (504988964),"10.710,00 €",02-11-2018,26-09-2018,5 dias,"Portugal, Faro, Faro","Artigo 24.º, n.º 1, alínea c) do Código dos Contratos Públicos",,,,,,Não aplicável.,Não aplicável.,FALSE
92/3236/2018 - Aquisição Cardioversor Desfibrilhador 1 Câmara,Ajuste Direto Regime Geral,Aquisição de bens móveis,"33182000-9, Material de assistência à função cardíaca","Centro Hospitalar Universitário do Algarve, E. P. E. (510745997)",BOSTON SCIENTIFIC PORTUGAL LDA (504988964),"6.800,00 €",02-11-2018,18-09-2018,5 dias,"Portugal, Faro, Faro","Artigo 24.º, n.º 1, alínea c) do Código dos Contratos Públicos",,,,,,Não aplicável.,Não aplicável.,FALSE
92/3228/2018 - Aquisição de Pacemakers 1 Câmara s/adaptação Frequência,Ajuste Direto Regime Geral,Aquisição de bens móveis,"33182000-9, Material de assistência à função cardíaca","Centro Hospitalar Universitário do Algarve, E. P. E. (510745997)","Livanova Portugal, Lda. (505514010)","3.780,00 €",02-11-2018,14-09-2018,5 dias,"Portugal, Faro, Faro","Artigo 24.º, n.º 1, alínea c) do Código dos Contratos Públicos",,,,,,Não aplicável.,Não aplicável.,FALSE
61/3717/2017 Medicamento Azacitidina,Ajuste Direto Regime Geral,Aquisição de bens móveis,"33690000-3, Medicamentos vários","Centro Hospitalar Universitário do Algarve, E. P. E. (510745997)","CELGENE - SOCIEDADE UNIPESSOAL, LDA (507791690)","113.280,00 €",31-10-2018,15-09-2017,107 dias,"Portugal, Faro, Faro","Artigo 24.º, n.º 1, alínea e) do Código dos Contratos Públicos",,,,,,Não aplicável.,Não aplicável.,FALSE
Proc. 88/2933/2018-  Fornt.e montagem de compressor e acessórios- Chiller Urg.Ped-Faro,Consulta Prévia,Aquisição de serviços,"50730000-1, Serviços de reparação e manutenção de grupos de refrigeração","Centro Hospitalar Universitário do Algarve, E. P. E. (510745997)","CISEC, SA (500205698)","5.977,35 €",31-10-2018,31-10-2018,8 dias,"Portugal, Faro, Faro","Artigo 20.º, n.º 1, alínea c) do Código dos Contratos Públicos",,,,,,Não aplicável.,Não aplicável.,FALSE
