Objeto do Contrato,Tipo de Procedimento,Tipo(s) de Contrato,CPVs,Entidade(s) Adjudicante(s),Entidade(s) Adjudicatária(s),Preço Contratual,Data de Publicação,Data de Celebração do Contrato,Prazo de Execução,Local de Execução,Fundamentação,Data de Fecho do Contrato,Preço Total Efetivo,Causas das Alterações ao Prazo,Causas das Alterações ao Preço,Estado,N.º registo do Acordo Quadro,Descrição do Acordo Quadro,Procedimento Centralizado
Aquisição de Marquesas,Ajuste Direto Regime Geral,Aquisição de bens móveis,"33192000-2, Mobiliário para fins médicos","Centro Hospitalar do Baixo Vouga, E.P.E. (510123210)",speculum (502996323),"38.475,80 €",21-09-2017,12-09-2017,15 dias,"Portugal, Aveiro, Aveiro","Artigo 20.º, n.º 1, alínea a) do Código dos Contratos Públicos",17-11-2017,"38.475,80 €",,,,Não aplicável.,Não aplicável.,FALSE
"AQUISIÇÃO ÓPTICA 30º, DIÂM.2,9MM, 30CM P/ B.O. GINEC.-REPARAÇÃO POR SUBSTITUIÇÃO INV:44626",Ajuste Direto Regime Geral,Aquisição de bens móveis,"33162200-5, Instrumentos para blocos operatórios","Centro Hospitalar do Baixo Vouga, E. P. E. (510123210)",TEPREL (502262184),"1.195,00 €",18-09-2017,14-09-2017,5 dias,"Portugal, Aveiro, Aveiro","Artigo 24.º, n.º 1, alínea e) do Código dos Contratos Públicos",04-12-2017,"1.195,00 €",,,,Não aplicável.,Não aplicável.,FALSE
AQUISIÇÃO DE BATERIA PARA MOTOR TRS SYNTHES,Ajuste Direto Regime Geral,Aquisição de bens móveis,"33100000-1, Equipamento médico","Centro Hospitalar do Baixo Vouga, E. P. E. (510123210)","JOHNSON & JOHNSON, LDA (500153370)","1.870,00 €",18-09-2017,14-09-2017,5 dias,"Portugal, Aveiro, Aveiro","Artigo 24.º, n.º 1, alínea e) do Código dos Contratos Públicos",19-09-2017,"1.870,00 €",,,,Não aplicável.,Não aplicável.,FALSE
GRANDE REPARAÇÃO DO MODULO BASE PHILIPS C/Nº INV: 26725,Ajuste Direto Regime Geral,Aquisição de bens móveis,"33100000-1, Equipamento médico","Centro Hospitalar do Baixo Vouga, E. P. E. (510123210)","PHILIPS PORTUGUESA, SA (500216843)","2.337,00 €",18-09-2017,14-09-2017,45 dias,"Portugal, Aveiro, Aveiro","Artigo 24.º, n.º 1, alínea e) do Código dos Contratos Públicos",20-11-2017,"2.337,00 €",,,,Não aplicável.,Não aplicável.,FALSE
GRANDE REPARAÇÃO DO MODULO BASE PHILIPS C/Nº INV: 26718,Ajuste Direto Regime Geral,Aquisição de bens móveis,"33100000-1, Equipamento médico","Centro Hospitalar do Baixo Vouga, E. P. E. (510123210)","PHILIPS PORTUGUESA, SA (500216843)","2.033,00 €",18-09-2017,14-09-2017,45 dias,"Portugal, Aveiro, Aveiro","Artigo 24.º, n.º 1, alínea e) do Código dos Contratos Públicos",15-11-2017,"2.033,00 €",,,,Não aplicável.,Não aplicável.,FALSE
GRANDE REPARAÇÃO DO MODULO BASE PHILIPS C/Nº INV: 27308,Ajuste Direto Regime Geral,Aquisição de bens móveis,"33100000-1, Equipamento médico","Centro Hospitalar do Baixo Vouga, E. P. E. (510123210)","PHILIPS PORTUGUESA, SA (500216843)","2.033,00 €",18-09-2017,14-09-2017,45 dias,"Portugal, Aveiro, Aveiro","Artigo 24.º, n.º 1, alínea e) do Código dos Contratos Públicos",15-11-2017,"2.033,00 €",,,,Não aplicável.,Não aplicável.,FALSE
GRANDE REPARAÇÃO (SUBST. DO PUNHO) DO PLETISMÓGRAFO Nº INV.38175,Ajuste Direto Regime Geral,Aquisição de bens móveis,"33100000-1, Equipamento médico","Centro Hospitalar do Baixo Vouga, E. P. E. (510123210)","Pulmocor - Equipamento Médico, SA (501402578)","2.050,00 €",18-09-2017,14-09-2017,45 dias,"Portugal, Aveiro, Aveiro","Artigo 24.º, n.º 1, alínea e) do Código dos Contratos Públicos",26-10-2017,"2.050,00 €",,,,Não aplicável.,Não aplicável.,FALSE
