freguesia,acronym,validVotesPercentage,votes,dicofre
União das freguesias de Alvarelhos e Guidões,PS,37.25,552,131809
União das freguesias de Alvarelhos e Guidões,PPD/PSD,34.41,510,131809
União das freguesias de Alvarelhos e Guidões,B.E.,6.61,98,131809
União das freguesias de Alvarelhos e Guidões,CDS-PP,6.48,96,131809
União das freguesias de Alvarelhos e Guidões,PCP-PEV,4.18,62,131809
União das freguesias de Alvarelhos e Guidões,PAN,3.51,52,131809
União das freguesias de Alvarelhos e Guidões,NC,1.21,18,131809
União das freguesias de Alvarelhos e Guidões,PPM.PPV/CDC,1.21,18,131809
União das freguesias de Alvarelhos e Guidões,L,1.15,17,131809
União das freguesias de Alvarelhos e Guidões,A,1.01,15,131809
União das freguesias de Alvarelhos e Guidões,PCTP/MRPP,0.88,13,131809
União das freguesias de Alvarelhos e Guidões,PTP,0.74,11,131809
União das freguesias de Alvarelhos e Guidões,IL,0.47,7,131809
União das freguesias de Alvarelhos e Guidões,MAS,0.34,5,131809
União das freguesias de Alvarelhos e Guidões,PNR,0.2,3,131809
União das freguesias de Alvarelhos e Guidões,PURP,0.2,3,131809
União das freguesias de Alvarelhos e Guidões,PDR,0.13,2,131809
