Objeto do Contrato,Tipo de Procedimento,Tipo(s) de Contrato,CPVs,Entidade(s) Adjudicante(s),Entidade(s) Adjudicatária(s),Preço Contratual,Data de Publicação,Data de Celebração do Contrato,Prazo de Execução,Local de Execução,Fundamentação,Data de Fecho do Contrato,Preço Total Efetivo,Causas das Alterações ao Prazo,Causas das Alterações ao Preço,Estado,N.º registo do Acordo Quadro,Descrição do Acordo Quadro,Procedimento Centralizado
Manutenção Evolutiva SGIP - Bolsa de 330 horas,Ajuste Direto Regime Geral,Aquisição de serviços,"72600000-6, Serviços de consultoria e assistência informáticas",Serviço de Intervenção nos Comportamentos Aditivos e nas Dependências (600084884),"Ablewise Consulting, SA (513609687)","9.900,00 €",20-12-2016,10-11-2016,365 dias,"Portugal, Lisboa, Lisboa","Artigo 20.º, n.º 1, alínea a) do Código dos Contratos Públicos",,,,,,Não aplicável.,Não aplicável.,FALSE
Aquisição de serviços de manutenção da plataforma Outsystems para 12 meses,Ajuste Direto Regime Geral,Aquisição de serviços,"72500000-0, Serviços relacionados com a informática",Serviço de Intervenção nos Comportamentos Aditivos e nas Dependências (600084884),"Outsystems - Software em rede, SA (504995634)","17.917,20 €",20-12-2016,12-12-2016,365 dias,"Portugal, Lisboa, Lisboa","Artigo 20.º, n.º 1, alínea a) do Código dos Contratos Públicos",,,,,,Não aplicável.,Não aplicável.,FALSE
"Aquisição de 80.000  revistas """"Dependências"""" - ano 2016",Ajuste Direto Regime Geral,Aquisição de bens móveis,"22200000-2, Jornais, revistas especializadas, publicações periódicas e revistas",Serviço de Intervenção nos Comportamentos Aditivos e nas Dependências (600084884),"News-Coop - Informação e Comunicação, CRL (507932161)","35.000,00 €",20-12-2016,21-01-2016,365 dias,"Portugal, Lisboa, Lisboa","Artigo 20.º, n.º 1, alínea a) do Código dos Contratos Públicos",,,,,,Não aplicável.,Não aplicável.,FALSE
Aquisição de Serviços de licenciamento de software - Balanced Scorecard - SPMS 2015UMC115,Ao abrigo de acordo-quadro (art.º 259.º),Aquisição de bens móveis,"48000000-8, Pacotes de software e sistemas de informação",Serviço de Intervenção nos Comportamentos Aditivos e nas Dependências (600084884),"Quidgest - Consultores de Gestão, SA (501989978)","25.800,00 €",20-12-2016,21-03-2016,365 dias,"Portugal, Lisboa, Lisboa",Artigo 259.º do Código dos Contratos Públicos,,,,,,610968,Acordo quadro de licenciamento de software e serviços conexos,TRUE
requalificação das instalações da CDT de Coimbra,Ajuste Direto Regime Geral,Aquisição de serviços,"50000000-5, Serviços de reparação e manutenção",Serviço de Intervenção nos Comportamentos Aditivos e nas Dependências (600084884),"Popicel, Lda (504010735)","13.580,00 €",20-12-2016,12-07-2016,60 dias,"Portugal, Coimbra, Coimbra","Artigo 20.º, n.º 1, alínea a) do Código dos Contratos Públicos",,,,,,Não aplicável.,Não aplicável.,FALSE
Requalificação das Instalações da CDT de Lisboa,Ajuste Direto Regime Geral,Aquisição de serviços,"50000000-5, Serviços de reparação e manutenção",Serviço de Intervenção nos Comportamentos Aditivos e nas Dependências (600084884),"Loviril - Construção Civil, Unipessoal, LDA (500924139)","8.056,00 €",20-12-2016,14-03-2016,30 dias,"Portugal, Lisboa, Lisboa","Artigo 20.º, n.º 1, alínea a) do Código dos Contratos Públicos",,,,,,Não aplicável.,Não aplicável.,FALSE
Aquisição de Serviços para a Organização da 2ª Conferencia Lisbon Addictions 2017,Concurso público,Aquisição de serviços,"79950000-8, Serviços de organização de exposições, feiras e congressos",Serviço de Intervenção nos Comportamentos Aditivos e nas Dependências (600084884),"Viagens Abreu, SA (500297177)","143.443,62 €",20-12-2016,21-11-2016,365 dias,"Portugal, Lisboa, Lisboa","Artigo 20.º, n.º 1, alínea b) do Código dos Contratos Públicos",,,,,,Não aplicável.,Não aplicável.,FALSE
Manutenção evolutiva do Sistema Integrado de Programas de Apoio Financeiro em Saúde (SIPAFS),Ajuste Direto Regime Geral,Aquisição de serviços,"72600000-6, Serviços de consultoria e assistência informáticas",Serviço de Intervenção nos Comportamentos Aditivos e nas Dependências (600084884),"Ablewin It Consulting, SA (513020390)","9.900,00 €",20-12-2016,06-12-2016,10 dias,"Portugal, Lisboa, Lisboa","Artigo 20.º, n.º 1, alínea a) do Código dos Contratos Públicos",,,,,,Não aplicável.,Não aplicável.,FALSE
Manutenção evolutiva do Sistema de Informação Multidisciplinar (SIM),Ajuste Direto Regime Geral,Aquisição de serviços,"72600000-6, Serviços de consultoria e assistência informáticas",Serviço de Intervenção nos Comportamentos Aditivos e nas Dependências (600084884),"Sapient - Consultadoria em Sistemas de Informação, Lda (505626640)","9.900,00 €",20-12-2016,06-12-2016,10 dias,"Portugal, Lisboa, Lisboa","Artigo 20.º, n.º 1, alínea a) do Código dos Contratos Públicos",,,,,,Não aplicável.,Não aplicável.,FALSE
"Projeto RARHA - Deslocação de 8 profissionais á Eslovénia, 20 a 24/11, para participação em reuniões diversas no âmbito do projeto.",Ajuste Direto Regime Geral,Aquisição de serviços,"63515000-2, Serviços de viagens<BR/>55110000-4, Serviços de alojamento em hotéis",Serviço de Intervenção nos Comportamentos Aditivos e nas Dependências (600084884),"Viagens Abreu, SA (500297177)","9.799,81 €",19-12-2016,31-10-2016,7 dias,"Portugal, Lisboa, Lisboa","Artigo 20.º, n.º 1, alínea a) do Código dos Contratos Públicos",,,,,,Não aplicável.,Não aplicável.,FALSE
