Objeto do Contrato,Tipo de Procedimento,Tipo(s) de Contrato,CPVs,Entidade(s) Adjudicante(s),Entidade(s) Adjudicatária(s),Preço Contratual,Data de Publicação,Data de Celebração do Contrato,Prazo de Execução,Local de Execução,Fundamentação,Data de Fecho do Contrato,Preço Total Efetivo,Causas das Alterações ao Prazo,Causas das Alterações ao Preço,Estado,N.º registo do Acordo Quadro,Descrição do Acordo Quadro,Procedimento Centralizado
MATERIAL DE CONSUMO CLÍNICO,Ajuste Direto Regime Geral,Aquisição de bens móveis,"33100000-1, Equipamento médico","Instituto Português de Oncologia de Coimbra Francisco Gentil, E. P. E. (506361438)",JOHNSON & JOHNSON (500153370),"12.312,00 €",05-11-2015,12-09-2014,16 dias,"Portugal, Coimbra, Coimbra","Artigo 20.º, n.º 1, alínea a) do Código dos Contratos Públicos","","","","",,Não aplicável.,Não aplicável.,FALSE
SISTEMAS DE ADMINISTRAÇÃO DE FLUÍDOS,Ajuste Direto Regime Geral,Aquisição de bens móveis,"33100000-1, Equipamento médico","Instituto Português de Oncologia de Coimbra Francisco Gentil, E. P. E. (506361438)",NUTRICIA ADVANC. MEDICAL NUTRIC.UNIP.LDA (507558286),"96,00 €",05-11-2015,16-05-2014,230 dias,"Portugal, Coimbra, Coimbra","Artigo 20.º, n.º 1, alínea a) do Código dos Contratos Públicos",31-12-2014,"","",DIMINUIÇÃO DAS NECESSIDADES PREVISTAS,,Não aplicável.,Não aplicável.,FALSE
SISTEMAS DE ADMINISTRAÇÃO DE FLUÍDOS,Ajuste Direto Regime Geral,Aquisição de bens móveis,"33100000-1, Equipamento médico","Instituto Português de Oncologia de Coimbra Francisco Gentil, E. P. E. (506361438)",FRESENIUS KABI PHARMA PORTUGAL LDA (504293753),"20,75 €",05-11-2015,16-05-2014,230 dias,"Portugal, Coimbra, Coimbra","Artigo 20.º, n.º 1, alínea a) do Código dos Contratos Públicos",31-12-2014,"","",DIMINUIÇÃO DAS NECESSIDADES PREVISTAS,,Não aplicável.,Não aplicável.,FALSE
SISTEMAS DE ADMINISTRAÇÃO DE FLUÍDOS,Ajuste Direto Regime Geral,Aquisição de bens móveis,"33100000-1, Equipamento médico","Instituto Português de Oncologia de Coimbra Francisco Gentil, E. P. E. (506361438)","CAREFUSION PORTUGAL 332-PRODUTOS MÉDICOS, LDA (503898554)","12.864,70 €",05-11-2015,09-06-2014,206 dias,"Portugal, Coimbra, Coimbra","Artigo 20.º, n.º 1, alínea a) do Código dos Contratos Públicos",31-12-2014,"12.083,30 €","",DIMINUIÇÃO DAS NECESSIDADES PREVISTAS,,Não aplicável.,Não aplicável.,FALSE
SISTEMAS DE ADMINISTRAÇÃO DE FLUÍDOS,Ajuste Direto Regime Geral,Aquisição de bens móveis,"33100000-1, Equipamento médico","Instituto Português de Oncologia de Coimbra Francisco Gentil, E. P. E. (506361438)","BAXTER MEDICO-FARMACEUTICA, LDA (503347345)","280,00 €",05-11-2015,16-05-2014,230 dias,"Portugal, Coimbra, Coimbra","Artigo 20.º, n.º 1, alínea a) do Código dos Contratos Públicos",16-12-2014,"140,00 €","",DIMINUIÇÃO DAS NECESSIDADES PREVISTAS,,Não aplicável.,Não aplicável.,FALSE
SISTEMAS DE ADMINISTRAÇÃO DE FLUÍDOS,Ajuste Direto Regime Geral,Aquisição de bens móveis,"33100000-1, Equipamento médico","Instituto Português de Oncologia de Coimbra Francisco Gentil, E. P. E. (506361438)","B.BRAUN MEDICAL,LDA (501506543)","1.400,00 €",05-11-2015,16-05-2014,230 dias,"Portugal, Coimbra, Coimbra","Artigo 20.º, n.º 1, alínea a) do Código dos Contratos Públicos",19-12-2014,"8.960,00 €","",AUMENTO DAS NECESSIDADES PREVISTAS,,Não aplicável.,Não aplicável.,FALSE
MATERIAL CITOLOGIA,Ajuste Direto Regime Geral,Aquisição de bens móveis,"33100000-1, Equipamento médico","Instituto Português de Oncologia de Coimbra Francisco Gentil, E. P. E. (506361438)",SPECULUM - ARTIGOS MEDICOS (502996323),"416,00 €",03-11-2015,16-05-2014,230 dias,"Portugal, Coimbra, Coimbra","Artigo 20.º, n.º 1, alínea a) do Código dos Contratos Públicos",15-12-2014,"416,00 €","","",,Não aplicável.,Não aplicável.,FALSE
MATERIAL CITOLOGIA,Ajuste Direto Regime Geral,Aquisição de bens móveis,"33100000-1, Equipamento médico","Instituto Português de Oncologia de Coimbra Francisco Gentil, E. P. E. (506361438)",HOLOGIC IBERIA (980277230),"25.604,60 €",03-11-2015,09-06-2014,206 dias,"Portugal, Coimbra, Coimbra","Artigo 20.º, n.º 1, alínea a) do Código dos Contratos Públicos",24-11-2014,"25.604,60 €","",DIMINUIÇÃO DAS NECESSIDADES PREVISTAS,,Não aplicável.,Não aplicável.,FALSE
MATERIAL DE CONSUMO CLÍNICO,Ajuste Direto Regime Geral,Aquisição de bens móveis,"33100000-1, Equipamento médico","Instituto Português de Oncologia de Coimbra Francisco Gentil, E. P. E. (506361438)",VYGON (PORTUGAL) LDA (503232785),"5.460,00 €",03-11-2015,11-11-2014,3 dias,"Portugal, Coimbra, Coimbra","Artigo 20.º, n.º 1, alínea a) do Código dos Contratos Públicos",13-11-2014,"5.460,00 €","","",,Não aplicável.,Não aplicável.,FALSE
MATERIAL DE CONSUMO CLÍNICO,Ajuste Direto Regime Geral,Aquisição de bens móveis,"33100000-1, Equipamento médico","Instituto Português de Oncologia de Coimbra Francisco Gentil, E. P. E. (506361438)",Elekta Medical S.A. (A81886731),"7.675,00 €",03-11-2015,21-11-2014,27 dias,"Portugal, Coimbra, Coimbra","Artigo 20.º, n.º 1, alínea a) do Código dos Contratos Públicos",17-12-2014,"7.675,00 €","","",,Não aplicável.,Não aplicável.,FALSE
MATERIAL DE CONSUMO CLÍNICO,Ajuste Direto Regime Geral,Aquisição de bens móveis,"33100000-1, Equipamento médico","Instituto Português de Oncologia de Coimbra Francisco Gentil, E. P. E. (506361438)","BAXTER MEDICO-FARMACEUTICA, LDA (503347345)","6.638,28 €",03-11-2015,27-10-2014,9 dias,"Portugal, Coimbra, Coimbra","Artigo 20.º, n.º 1, alínea a) do Código dos Contratos Públicos",04-11-2014,"6.638,28 €","","",,Não aplicável.,Não aplicável.,FALSE
MATERIAL DE CONSUMO CLÍNICO,Ajuste Direto Regime Geral,Aquisição de bens móveis,"33100000-1, Equipamento médico","Instituto Português de Oncologia de Coimbra Francisco Gentil, E. P. E. (506361438)",JOHNSON & JOHNSON (500153370),"9.690,00 €",03-11-2015,14-10-2014,3 dias,"Portugal, Coimbra, Coimbra","Artigo 20.º, n.º 1, alínea a) do Código dos Contratos Públicos",16-10-2014,"9.690,00 €","","",,Não aplicável.,Não aplicável.,FALSE
MATERIAL DE CONSUMO CLÍNICO,Ajuste Direto Regime Geral,Aquisição de bens móveis,"33100000-1, Equipamento médico","Instituto Português de Oncologia de Coimbra Francisco Gentil, E. P. E. (506361438)",VYGON (PORTUGAL) LDA (503232785),"5.091,70 €",03-11-2015,23-09-2014,25 dias,"Portugal, Coimbra, Coimbra","Artigo 20.º, n.º 1, alínea a) do Código dos Contratos Públicos",17-10-2014,"5.091,70 €","","",,Não aplicável.,Não aplicável.,FALSE
MATERIAL DE CONSUMO CLÍNICO,Ajuste Direto Regime Geral,Aquisição de bens móveis,"33100000-1, Equipamento médico","Instituto Português de Oncologia de Coimbra Francisco Gentil, E. P. E. (506361438)",Elekta Medical S.A. (A81886731),"7.675,00 €",03-11-2015,01-09-2014,57 dias,"Portugal, Coimbra, Coimbra","Artigo 20.º, n.º 1, alínea a) do Código dos Contratos Públicos",27-10-2014,"7.675,00 €","","",,Não aplicável.,Não aplicável.,FALSE
MATERIAL DE CONSUMO CLÍNICO,Ajuste Direto Regime Geral,Aquisição de bens móveis,"33100000-1, Equipamento médico","Instituto Português de Oncologia de Coimbra Francisco Gentil, E. P. E. (506361438)",ATOS -  SUCURSAL EM PORTUGAL (980435978),"8.000,00 €",03-11-2015,17-07-2014,7 dias,"Portugal, Coimbra, Coimbra","Artigo 20.º, n.º 1, alínea a) do Código dos Contratos Públicos",23-07-2014,"8.000,00 €","","",,Não aplicável.,Não aplicável.,FALSE
MATERIAL DE CONSUMO CLÍNICO,Ajuste Direto Regime Geral,Aquisição de bens móveis,"33100000-1, Equipamento médico","Instituto Português de Oncologia de Coimbra Francisco Gentil, E. P. E. (506361438)","BAXTER MEDICO-FARMACEUTICA, LDA (503347345)","5.583,60 €",03-11-2015,07-07-2014,9 dias,"Portugal, Coimbra, Coimbra","Artigo 20.º, n.º 1, alínea a) do Código dos Contratos Públicos",15-07-2014,"5.583,60 €","","",,Não aplicável.,Não aplicável.,FALSE
ALUGUER DE FOTOCOPIADOR,Ajuste Direto Regime Geral,Aquisição de serviços,"79000000-4, Serviços a empresas: direito, comercialização, consultoria, recrutamento, impressão e segurança","Instituto Português de Oncologia de Coimbra Francisco Gentil, E. P. E. (506361438)","EDICOPIA, SOC. EQUIPAMENTOS DE ESCRITÓRIO, LDA (501991220)","3.075,00 €",02-11-2015,13-01-2014,365 dias,"Portugal, Coimbra, Coimbra","Artigo 20.º, n.º 1, alínea a) do Código dos Contratos Públicos",04-12-2014,"3.015,31 €","",REDUÇÃO DAS NECESSIDADES,,Não aplicável.,Não aplicável.,FALSE
Renovação de plataforma eletronica,Ajuste Direto Regime Geral,Aquisição de bens móveis,"48000000-8, Pacotes de software e sistemas de informação","Instituto Português de Oncologia de Coimbra Francisco Gentil, E. P. E. (506361438)","ANO - Sist. de Informatica e serv., Lda (503182710)","2.000,00 €",02-11-2015,23-12-2014,20 dias,"Portugal, Coimbra, Coimbra","Artigo 24.º, n.º 1, alínea e) do Código dos Contratos Públicos",29-12-2014,"2.000,00 €","","",,Não aplicável.,Não aplicável.,FALSE
Aquisição de certificado para plataforma eletronica,Ajuste Direto Regime Geral,Aquisição de bens móveis,"30000000-9, Máquinas, equipamento e material de escritório e de informática, excepto mobiliário e pacotes de programas (software)","Instituto Português de Oncologia de Coimbra Francisco Gentil, E. P. E. (506361438)","ANO - SIST. DE INFORMATICA E SERV, LDA (503182710)","125,00 €",02-11-2015,24-02-2014,20 dias,"Portugal, Coimbra, Coimbra","Artigo 24.º, n.º 1, alínea e) do Código dos Contratos Públicos",14-03-2014,"125,00 €","","",,Não aplicável.,Não aplicável.,FALSE
Aquisição de certificado para plataforma eletronica,Ajuste Direto Regime Geral,Aquisição de bens móveis,"30000000-9, Máquinas, equipamento e material de escritório e de informática, excepto mobiliário e pacotes de programas (software)","Instituto Português de Oncologia de Coimbra Francisco Gentil, E. P. E. (506361438)","ANO - SISTEMA DE INFORMAÇÃO E SERV., lDA (503182710)","1.000,00 €",02-11-2015,30-01-2014,20 dias,"Portugal, Coimbra, Coimbra","Artigo 24.º, n.º 1, alínea e) do Código dos Contratos Públicos",14-03-2014,"1.000,00 €","","",,Não aplicável.,Não aplicável.,FALSE
ARRENDAMENTO ARMAZEM ALCARRAQUES,Ajuste Direto Regime Geral,Aquisição de serviços,"70200000-3, Serviços de arrendamento ou locação de bens imóveis próprios","Instituto Português de Oncologia de Coimbra Francisco Gentil, E. P. E. (506361438)","HIDRAX - EQUIP. E TRATAMENTO AGUA, LDA (502674202)","12.525,96 €",02-11-2015,02-01-2014,365 dias,"Portugal, Coimbra, Coimbra","Artigo 20.º, n.º 1, alínea a) do Código dos Contratos Públicos",05-12-2014,"12.525,96 €","","",,Não aplicável.,Não aplicável.,FALSE
TRABALHOS DIVERSOS NO SECTOR DA COZINHA DO IPO,Ajuste Direto Regime Geral,Empreitadas de obras públicas,"45000000-7, Construção","Instituto Português de Oncologia de Coimbra Francisco Gentil, E. P. E. (506361438)","Ambitermo - Eng. e Equip. termicos, Lda (502790326)","8.807,00 €",02-11-2015,25-11-2014,30 dias,"Portugal, Coimbra, Coimbra","Artigo 19.º, alínea a) do Código dos Contratos Públicos","","8.807,00 €",Por conveniência da Intituição,"",,Não aplicável.,Não aplicável.,FALSE
COLOCAÇÃO DE DIVISÓRIA NO CORREDOR DA DIREÇÃO DA IMAGIOLOGIA,Ajuste Direto Regime Geral,Empreitadas de obras públicas,"45000000-7, Construção","Instituto Português de Oncologia de Coimbra Francisco Gentil, E. P. E. (506361438)","BH, Construção e obras Publicas, Lda (503989576)","1.027,00 €",02-11-2015,29-10-2014,20 dias,"Portugal, Coimbra, Coimbra","Artigo 19.º, alínea a) do Código dos Contratos Públicos","","1.027,00 €",Por conveniência da Instituição,"",,Não aplicável.,Não aplicável.,FALSE
TRABALHOS DE REPARAÇÃO NA ZONA ENVOLVENTE DO EDIFICIO PRINCIPAL,Ajuste Direto Regime Geral,Empreitadas de obras públicas,"45000000-7, Construção","Instituto Português de Oncologia de Coimbra Francisco Gentil, E. P. E. (506361438)",Isomarca - Engenharia Lda (504817183),"10.540,00 €",02-11-2015,03-10-2014,20 dias,"Portugal, Coimbra, Coimbra","Artigo 19.º, alínea a) do Código dos Contratos Públicos","","10.540,00 €",Por conveniência da Instituição,"",,Não aplicável.,Não aplicável.,FALSE
OCTREOTIDO,Ajuste Direto Regime Geral,Aquisição de bens móveis,"33000000-0, Equipamento médico, medicamentos e produtos para cuidados pessoais","Instituto Português de Oncologia de Coimbra Francisco Gentil, E. P. E. (506361438)","NOVARTIS FARMA - PROD.FARMACEUTICOS, SA (500063524)","11.633,85 €",02-11-2015,07-02-2014,7 dias,"Portugal, Coimbra, Coimbra","Artigo 24.º, n.º 1, alínea e) do Código dos Contratos Públicos",13-02-2014,"11.633,85 €","","",,Não aplicável.,Não aplicável.,FALSE
SUBSTITUIÇÃO DE PAVIMENTO 2 SALAS DE ARRUMOS DO BLOCO OPERATORIO,Ajuste Direto Regime Geral,Empreitadas de obras públicas,"45000000-7, Construção","Instituto Português de Oncologia de Coimbra Francisco Gentil, E. P. E. (506361438)","Revipav - Revestim. Inter. Unipessoal, Lda (507218353)","1.566,00 €",02-11-2015,29-07-2014,20 dias,"Portugal, Coimbra, Coimbra","Artigo 19.º, alínea a) do Código dos Contratos Públicos","","1.566,00 €",Por conveniência da Instituição,"",,Não aplicável.,Não aplicável.,FALSE
SUBSTITUIÇÃO DO PAVIMENTO DA SALA 4 E 5 DO BLOCO OPERATORIO,Ajuste Direto Regime Geral,Empreitadas de obras públicas,"45000000-7, Construção","Instituto Português de Oncologia de Coimbra Francisco Gentil, E. P. E. (506361438)","Revipav - Revestim. Inter. Unipessoal, Lda (507218353)","3.360,00 €",02-11-2015,27-06-2014,20 dias,"Portugal, Coimbra, Coimbra","Artigo 19.º, alínea a) do Código dos Contratos Públicos","","3.360,00 €",Por conveniência da Instituição,"",,Não aplicável.,Não aplicável.,FALSE
OBRAS NA COZINHA,Ajuste Direto Regime Geral,Empreitadas de obras públicas,"45000000-7, Construção","Instituto Português de Oncologia de Coimbra Francisco Gentil, E. P. E. (506361438)","Manuel Costa Sacramento, Lda (503834890)","2.242,00 €",02-11-2015,13-06-2014,20 dias,"Portugal, Coimbra, Coimbra","Artigo 19.º, alínea a) do Código dos Contratos Públicos","","2.242,00 €",Por conveniência da Instituição,"",,Não aplicável.,Não aplicável.,FALSE
COLOCAÇÃO DE PAVIMENTO EM VINÍLICO NO BLOCO OPERATÓRIO,Ajuste Direto Regime Geral,Empreitadas de obras públicas,"45000000-7, Construção","Instituto Português de Oncologia de Coimbra Francisco Gentil, E. P. E. (506361438)","Revipav - Revestim. Inter. Unipessoal, Lda (507218353)","4.484,00 €",02-11-2015,20-05-2014,20 dias,"Portugal, Coimbra, Coimbra","Artigo 19.º, alínea a) do Código dos Contratos Públicos","","4.484,00 €",Por conveniência da Instituição,"",,Não aplicável.,Não aplicável.,FALSE
SUBSTITUIÇÃO DA COBERTURA DO EDIFICIO DA CIRURGIA,Ajuste Direto Regime Geral,Empreitadas de obras públicas,"45000000-7, Construção","Instituto Português de Oncologia de Coimbra Francisco Gentil, E. P. E. (506361438)",Isomarca - Engenharia Lda (504817183),"22.075,00 €",02-11-2015,26-05-2014,20 dias,"Portugal, Coimbra, Coimbra","Artigo 19.º, alínea a) do Código dos Contratos Públicos","","22.075,00 €",Por conveniência da Instituição,"",,Não aplicável.,Não aplicável.,FALSE
