freguesia,acronym,validVotesPercentage,votes,dicofre
Arões,PPD/PSD,37.75,265,011901
Arões,PS,26.5,186,011901
Arões,CDS-PP,26.07,183,011901
Arões,B.E.,4.84,34,011901
Arões,PCP-PEV,1.42,10,011901
Arões,R.I.R.,0.85,6,011901
Arões,CH,0.43,3,011901
Arões,PAN,0.43,3,011901
Arões,A,0.28,2,011901
Arões,JPP,0.28,2,011901
Arões,NC,0.28,2,011901
Arões,PCTP/MRPP,0.28,2,011901
Arões,L,0.14,1,011901
Arões,PDR,0.14,1,011901
Arões,PNR,0.14,1,011901
Arões,PURP,0.14,1,011901
Arões,IL,0,0,011901
Arões,MPT,0,0,011901
Arões,PPM,0,0,011901
Arões,PTP,0,0,011901
