freguesia,acronym,validVotesPercentage,votes,dicofre
Lara,PPD/PSD,40.48,34,160410
Lara,PS,32.14,27,160410
Lara,CDS-PP,13.1,11,160410
Lara,B.E.,3.57,3,160410
Lara,PTP,2.38,2,160410
Lara,IL,1.19,1,160410
Lara,L,1.19,1,160410
Lara,PAN,1.19,1,160410
Lara,PCP-PEV,1.19,1,160410
Lara,PDR,1.19,1,160410
Lara,PNR,1.19,1,160410
Lara,PURP,1.19,1,160410
Lara,A,0,0,160410
Lara,MAS,0,0,160410
Lara,NC,0,0,160410
Lara,PCTP/MRPP,0,0,160410
Lara,PPM.PPV/CDC,0,0,160410
