Objeto do Contrato,Tipo de Procedimento,Tipo(s) de Contrato,CPVs,Entidade(s) Adjudicante(s),Entidade(s) Adjudicatária(s),Preço Contratual,Data de Publicação,Data de Celebração do Contrato,Prazo de Execução,Local de Execução,Fundamentação,Data de Fecho do Contrato,Preço Total Efetivo,Causas das Alterações ao Prazo,Causas das Alterações ao Preço,Estado,N.º registo do Acordo Quadro,Descrição do Acordo Quadro,Procedimento Centralizado
Material de Ligamentoplastia,Ajuste Direto Regime Geral,Aquisição de bens móveis,"33140000-3, Material médico de consumo","Centro Hospitalar do Tâmega e Sousa, E.P.E. (508318262)","MEDICINÁLIA CORMÉDICA, LDA.                        (500684324)","41.100,00 €",10-07-2017,01-03-2017,1096 dias,"Portugal, Porto, Penafiel","Artigo 20.º, n.º 1, alínea a) do Código dos Contratos Públicos",,,,,,Não aplicável.,Não aplicável.,FALSE
Aquisição de Medicamentos do Foro Oncológico,Ao abrigo de acordo-quadro (art.º 259.º),Aquisição de bens móveis,"33600000-6, Produtos farmacêuticos","Centro Hospitalar do Tâmega e Sousa, E. P. E. (508318262)","TEVA PHARMA - PRODUTOS FARMACEUTICOS,LDA           (507045491)","175,50 €",07-07-2017,22-02-2017,60 dias,"Portugal, Porto, Penafiel",Artigo 259.º do Código dos Contratos Públicos,,,,,,1771819,CP 2015/6 - Acordo quadro para o fornecimento de Medicamentos do Foro Oncológico,FALSE
Aquisição de Medicamentos do Foro Oncológico,Ao abrigo de acordo-quadro (art.º 259.º),Aquisição de bens móveis,"33600000-6, Produtos farmacêuticos","Centro Hospitalar do Tâmega e Sousa, E. P. E. (508318262)",MSD (500191360),"10.131,84 €",07-07-2017,22-02-2017,60 dias,"Portugal, Porto, Penafiel",Artigo 259.º do Código dos Contratos Públicos,,,,,,1771819,CP 2015/6 - Acordo quadro para o fornecimento de Medicamentos do Foro Oncológico,FALSE
Aquisição de Medicamentos do Foro Oncológico,Ao abrigo de acordo-quadro (art.º 259.º),Aquisição de bens móveis,"33600000-6, Produtos farmacêuticos","Centro Hospitalar do Tâmega e Sousa, E. P. E. (508318262)",MEDAC SUCURSAL EM PORTUGAL (980369959),"719,67 €",07-07-2017,22-02-2017,60 dias,"Portugal, Porto, Penafiel",Artigo 259.º do Código dos Contratos Públicos,,,,,,1771819,CP 2015/6 - Acordo quadro para o fornecimento de Medicamentos do Foro Oncológico,FALSE
Aquisição de Medicamentos do Foro Oncológico,Ao abrigo de acordo-quadro (art.º 259.º),Aquisição de bens móveis,"33600000-6, Produtos farmacêuticos","Centro Hospitalar do Tâmega e Sousa, E. P. E. (508318262)","Janssen Cilag Farmacêutica, Lda (500189412)","110.847,79 €",07-07-2017,22-02-2017,60 dias,"Portugal, Porto, Penafiel",Artigo 259.º do Código dos Contratos Públicos,,,,,,1771819,CP 2015/6 - Acordo quadro para o fornecimento de Medicamentos do Foro Oncológico,FALSE
Aquisição de Medicamentos do Foro Oncológico,Ao abrigo de acordo-quadro (art.º 259.º),Aquisição de bens móveis,"33600000-6, Produtos farmacêuticos","Centro Hospitalar do Tâmega e Sousa, E. P. E. (508318262)",IPSEN PORTUGAL-PRODUTOS FARMACÊUTICOS SA.          (502609800),"49.448,00 €",07-07-2017,22-02-2017,60 dias,"Portugal, Porto, Penafiel",Artigo 259.º do Código dos Contratos Públicos,,,,,,1771819,CP 2015/6 - Acordo quadro para o fornecimento de Medicamentos do Foro Oncológico,FALSE
Aquisição de Medicamentos do Foro Oncológico,Ao abrigo de acordo-quadro (art.º 259.º),Aquisição de bens móveis,"33600000-6, Produtos farmacêuticos","Centro Hospitalar do Tâmega e Sousa, E. P. E. (508318262)","GENERIS FARMACEUTICA, SA (508107997)","342,00 €",07-07-2017,22-02-2017,60 dias,"Portugal, Porto, Penafiel",Artigo 259.º do Código dos Contratos Públicos,,,,,,1771819,CP 2015/6 - Acordo quadro para o fornecimento de Medicamentos do Foro Oncológico,FALSE
Aquisição de Medicamentos do Foro Oncológico,Ao abrigo de acordo-quadro (art.º 259.º),Aquisição de bens móveis,"33600000-6, Produtos farmacêuticos","Centro Hospitalar do Tâmega e Sousa, E. P. E. (508318262)","FERRER HOSPITALAR, S.A. (504507680)","2.521,38 €",07-07-2017,22-02-2017,60 dias,"Portugal, Porto, Penafiel",Artigo 259.º do Código dos Contratos Públicos,,,,,,1771819,CP 2015/6 - Acordo quadro para o fornecimento de Medicamentos do Foro Oncológico,FALSE
Aquisição de Medicamentos do Foro Oncológico,Ao abrigo de acordo-quadro (art.º 259.º),Aquisição de bens móveis,"33600000-6, Produtos farmacêuticos","Centro Hospitalar do Tâmega e Sousa, E. P. E. (508318262)","BIOGEN IDEC PORTUGAL-SOC FARM UNIP,LDA (506415740)","118.058,18 €",07-07-2017,22-02-2017,60 dias,"Portugal, Porto, Penafiel",Artigo 259.º do Código dos Contratos Públicos,,,,,,1771819,CP 2015/6 - Acordo quadro para o fornecimento de Medicamentos do Foro Oncológico,FALSE
Aquisição de Medicamentos do Foro Oncológico,Ao abrigo de acordo-quadro (art.º 259.º),Aquisição de bens móveis,"33600000-6, Produtos farmacêuticos","Centro Hospitalar do Tâmega e Sousa, E. P. E. (508318262)",AstraZeneca (502942240),"1.897,30 €",07-07-2017,22-02-2017,60 dias,"Portugal, Porto, Penafiel",Artigo 259.º do Código dos Contratos Públicos,,,,,,1771819,CP 2015/6 - Acordo quadro para o fornecimento de Medicamentos do Foro Oncológico,FALSE
Aquisição de Medicamentos do Foro Oncológico,Ao abrigo de acordo-quadro (art.º 259.º),Aquisição de bens móveis,"33600000-6, Produtos farmacêuticos","Centro Hospitalar do Tâmega e Sousa, E. P. E. (508318262)","Accord Healthcare, Unipessoal, Lda. (508622263)","253,26 €",07-07-2017,22-02-2017,60 dias,"Portugal, Porto, Penafiel",Artigo 259.º do Código dos Contratos Públicos,,,,,,1771819,CP 2015/6 - Acordo quadro para o fornecimento de Medicamentos do Foro Oncológico,FALSE
Aquisição Lacosamida,Ao abrigo de acordo-quadro (art.º 258.º),Aquisição de bens móveis,"33661000-1, Medicamentos para o sistema nervoso","Centro Hospitalar do Tâmega e Sousa, E. P. E. (508318262)",U C B PHARMA - PROD FARMACEUTICOS                  (500291322),"1.331,50 €",07-07-2017,08-06-2017,207 dias,"Portugal, Porto, Penafiel",Artigo 258.º do Código dos Contratos Públicos,,,,,,2528670,"CP 2017/2 - Acordo Quadro para fornecimento de Medicamentos do Sistema Nervoso Cerebrospinal, exceto: anestésicos, relaxantes musculares, analgésicos, antipiréticos, antidepressivos e antipsicóticos  às Instituições e Serviços do Serviço Nacional de Saúde",FALSE
Fornecimento de contracetivos,Ao abrigo de acordo-quadro (art.º 259.º),Aquisição de bens móveis,"33641400-9, Contraceptivos","Centro Hospitalar do Tâmega e Sousa, E. P. E. (508318262)",MSD (500191360),"11.674,00 €",06-07-2017,25-01-2017,341 dias,"Portugal, Porto, Penafiel",Artigo 259.º do Código dos Contratos Públicos,,,,,,1459323,CP 2015/20,FALSE
Fornecimento de contracetivos,Ao abrigo de acordo-quadro (art.º 259.º),Aquisição de bens móveis,"33641400-9, Contraceptivos","Centro Hospitalar do Tâmega e Sousa, E. P. E. (508318262)",LOGIFARMA LOGISTICA FARMACEUTICA S.A. (503934640),"44,50 €",06-07-2017,25-01-2017,341 dias,"Portugal, Porto, Penafiel",Artigo 259.º do Código dos Contratos Públicos,,,,,,1459323,CP 2015/20,FALSE
Fornecimento de contracetivos,Ao abrigo de acordo-quadro (art.º 259.º),Aquisição de bens móveis,"33641400-9, Contraceptivos","Centro Hospitalar do Tâmega e Sousa, E. P. E. (508318262)",CLINIFAR SA                                        (503281115),"1.116,00 €",06-07-2017,25-01-2017,341 dias,"Portugal, Porto, Penafiel",Artigo 259.º do Código dos Contratos Públicos,,,,,,1459323,CP 2015/20,FALSE
Fornecimento de contracetivos,Ao abrigo de acordo-quadro (art.º 259.º),Aquisição de bens móveis,"33641400-9, Contraceptivos","Centro Hospitalar do Tâmega e Sousa, E. P. E. (508318262)","BAYER PORTUGAL, LDA (500043256)","33.241,10 €",06-07-2017,25-01-2017,341 dias,"Portugal, Porto, Penafiel",Artigo 259.º do Código dos Contratos Públicos,,,,,,1459323,CP 2015/20,FALSE
Aquisição de medicamentos do foro oncológico,Ao abrigo de acordo-quadro (art.º 259.º),Aquisição de bens móveis,"33600000-6, Produtos farmacêuticos","Centro Hospitalar do Tâmega e Sousa, E. P. E. (508318262)",MEDAC SUCURSAL EM PORTUGAL (980369959),"1.033,02 €",06-07-2017,19-04-2017,174 dias,"Portugal, Porto, Penafiel",Artigo 259.º do Código dos Contratos Públicos,,,,,,1771819,CP 2015/6 - Acordo quadro para o fornecimento de Medicamentos do Foro Oncológico,FALSE
Aquisição de Teriflunomida 14mg comp,Ao abrigo de acordo-quadro (art.º 258.º),Aquisição de bens móveis,"33600000-6, Produtos farmacêuticos","Centro Hospitalar do Tâmega e Sousa, E. P. E. (508318262)",Sanofi - Produtos Farmacêuticos Lda. (500134960),"5.142,48 €",06-07-2017,07-06-2017,208 dias,"Portugal, Porto, Penafiel",Artigo 258.º do Código dos Contratos Públicos,,,,,,1771819,CP 2015/6 - Acordo quadro para o fornecimento de Medicamentos do Foro Oncológico,FALSE
Fios Guia e Outros,Ajuste Direto Regime Geral,Aquisição de bens móveis,"33140000-3, Material médico de consumo","Centro Hospitalar do Tâmega e Sousa, E.P.E. (508318262)",Terumo Europe España S.L. (980472024),"5.650,00 €",06-07-2017,05-04-2017,271 dias,"Portugal, Porto, Penafiel","Artigo 20.º, n.º 1, alínea a) do Código dos Contratos Públicos",,,,,,Não aplicável.,Não aplicável.,FALSE
Fios Guia e Outros,Ajuste Direto Regime Geral,Aquisição de bens móveis,"33140000-3, Material médico de consumo","Centro Hospitalar do Tâmega e Sousa, E.P.E. (508318262)","ABBOTT LABORATÓRIOS, LDA.                          (500006148)","25.000,00 €",06-07-2017,07-04-2017,269 dias,"Portugal, Porto, Penafiel","Artigo 20.º, n.º 1, alínea a) do Código dos Contratos Públicos",,,,,,Não aplicável.,Não aplicável.,FALSE
"Material de incontinência, Proteção cutânea e Alívio de pressão",Ao abrigo de acordo-quadro (art.º 259.º),Aquisição de bens móveis,"33140000-3, Material médico de consumo","Centro Hospitalar do Tâmega e Sousa, E. P. E. (508318262)",EZEQUIEL PANÄO JORGE (501412727),"86,50 €",06-07-2017,29-03-2017,278 dias,"Portugal, Porto, Penafiel",Artigo 259.º do Código dos Contratos Públicos,,,,,,2771026,"CP 2017/25 - Acordo Quadro para Fornecimento de Material de Incontinência, Proteção Cutânea e Alívio de Pressão às Instituições e Serviços do Serviço Nacional de Saúde",FALSE
"Material de incontinência, Proteção cutânea e Alívio de pressão",Ao abrigo de acordo-quadro (art.º 259.º),Aquisição de bens móveis,"33140000-3, Material médico de consumo","Centro Hospitalar do Tâmega e Sousa, E. P. E. (508318262)","BASTOS VIEGAS, SA (500042772)","3.685,00 €",06-07-2017,29-03-2017,278 dias,"Portugal, Porto, Penafiel",Artigo 259.º do Código dos Contratos Públicos,,,,,,2771026,"CP 2017/25 - Acordo Quadro para Fornecimento de Material de Incontinência, Proteção Cutânea e Alívio de Pressão às Instituições e Serviços do Serviço Nacional de Saúde",FALSE
"Material de incontinência, Proteção cutânea e Alívio de pressão",Ao abrigo de acordo-quadro (art.º 259.º),Aquisição de bens móveis,"33140000-3, Material médico de consumo","Centro Hospitalar do Tâmega e Sousa, E. P. E. (508318262)","AVIQUIMICA-IMPORTACAO MANUFACTURAS, LDA (500039720)","1.968,00 €",06-07-2017,29-03-2017,278 dias,"Portugal, Porto, Penafiel",Artigo 259.º do Código dos Contratos Públicos,,,,,,2771026,"CP 2017/25 - Acordo Quadro para Fornecimento de Material de Incontinência, Proteção Cutânea e Alívio de Pressão às Instituições e Serviços do Serviço Nacional de Saúde",FALSE
"Material de incontinência, Proteção cutânea e Alívio de pressão",Ao abrigo de acordo-quadro (art.º 259.º),Aquisição de bens móveis,"33140000-3, Material médico de consumo","Centro Hospitalar do Tâmega e Sousa, E. P. E. (508318262)",ALBINO DIAS ANDRADE LDA - BESLEASING E FACTORING. (500013810),"69.516,28 €",06-07-2017,29-03-2017,278 dias,"Portugal, Porto, Penafiel",Artigo 259.º do Código dos Contratos Públicos,,,,,,2771026,"CP 2017/25 - Acordo Quadro para Fornecimento de Material de Incontinência, Proteção Cutânea e Alívio de Pressão às Instituições e Serviços do Serviço Nacional de Saúde",FALSE
Melhoramento dos acessos à consulta externa da Unidade Hospitalar Padre Américo.,Ajuste Direto Regime Geral,Empreitadas de obras públicas,"45200000-9, Obras de construção total ou parcial e de engenharia civil","Centro Hospitalar do Tâmega e Sousa, E. P. E. (508318262)","CONSTRUÇÕES CIDADE NOVA DO MARCO, SA (503363812)","37.906,47 €",05-07-2017,21-06-2017,60 dias,"Portugal, Porto, Penafiel","Artigo 19.º, alínea a) do Código dos Contratos Públicos",,,,,,Não aplicável.,Não aplicável.,FALSE
Prestação de Serviços para a realização de Meios Complementares de Diagnóstico e Terapêutica na área de Medicina Nuclear,Concurso público,Aquisição de serviços,"85100000-0, Serviços de saúde","Centro Hospitalar do Tâmega e Sousa, E. P. E. (508318262)","HPP-Medicina Molecular, SA (506055787)","114.344,00 €",05-07-2017,12-05-2017,234 dias,"Portugal, Porto, Penafiel",Artigo 28.º do Código dos Contratos Públicos,,,,,,Não aplicável.,Não aplicável.,FALSE
"Consumíveis de energia avançada, com colocação de equipamento",Concurso público,Aquisição de bens móveis,"33140000-3, Material médico de consumo","Centro Hospitalar do Tâmega e Sousa, E. P. E. (508318262)",JOHNSON & JOHNSON PROD.PROF. (500153370),"47.900,00 €",05-07-2017,01-02-2017,334 dias,"Portugal, Porto, Penafiel",Artigo 28.º do Código dos Contratos Públicos,,,,,,Não aplicável.,Não aplicável.,FALSE
"Consumíveis de energia avançada, com colocação de equipamento",Concurso público,Aquisição de bens móveis,"33140000-3, Material médico de consumo","Centro Hospitalar do Tâmega e Sousa, E. P. E. (508318262)","Medtronic Portugal, Lda. (504223933)","125.395,00 €",05-07-2017,01-02-2017,334 dias,"Portugal, Porto, Penafiel",Artigo 28.º do Código dos Contratos Públicos,,,,,,Não aplicável.,Não aplicável.,FALSE
"Consumíveis de energia avançada, com colocação de equipamento",Concurso público,Aquisição de bens móveis,"33140000-3, Material médico de consumo","Centro Hospitalar do Tâmega e Sousa, E. P. E. (508318262)",Endotécnica (503818348),"17.875,00 €",05-07-2017,01-02-2017,334 dias,"Portugal, Porto, Penafiel",Artigo 28.º do Código dos Contratos Públicos,,,,,,Não aplicável.,Não aplicável.,FALSE
Dinitrato de Isossorbido 10Mg/10Ml AMP INJ,Ajuste Direto Regime Geral,Aquisição de bens móveis,"33600000-6, Produtos farmacêuticos","Centro Hospitalar do Tâmega e Sousa, E.P.E. (508318262)","SPCARE ESPECIALIDADES FARMACÊUTICAS, LDA. (508284872)","22.769,60 €",05-07-2017,27-04-2017,249 dias,"Portugal, Porto, Penafiel","Artigo 20.º, n.º 1, alínea a) do Código dos Contratos Públicos",,,,,,Não aplicável.,Não aplicável.,FALSE
Diverso Material Hemodinâmica - Cateteres,Ajuste Direto Regime Geral,Aquisição de bens móveis,"33140000-3, Material médico de consumo","Centro Hospitalar do Tâmega e Sousa, E.P.E. (508318262)",BIOTRONIK Portugal (Unipessoal Lda. (510726941),"36.075,00 €",05-07-2017,12-06-2017,203 dias,"Portugal, Porto, Penafiel","Artigo 20.º, n.º 1, alínea a) do Código dos Contratos Públicos",,,,,,Não aplicável.,Não aplicável.,FALSE
Fornecimento de Ustecinumab 90mg + Ustecinumab 130mg,Ajuste Direto Regime Geral,Aquisição de bens móveis,"33600000-6, Produtos farmacêuticos","Centro Hospitalar do Tâmega e Sousa, E.P.E. (508318262)","Janssen Cilag Farmacêutica, Lda (500189412)","24.154,20 €",05-07-2017,05-06-2017,210 dias,"Portugal, Porto, Penafiel","Artigo 24.º, n.º 1, alínea e) do Código dos Contratos Públicos",,,,,,Não aplicável.,Não aplicável.,FALSE
Aquisição de Linezolide,Concurso público,Aquisição de bens móveis,"33600000-6, Produtos farmacêuticos","Centro Hospitalar do Tâmega e Sousa, E. P. E. (508318262)","FRESENIUS KABI PHARMA PORTUGAL, LDA (504293753)","8.250,00 €",04-07-2017,15-02-2017,320 dias,"Portugal, Porto, Penafiel",Artigo 28.º do Código dos Contratos Públicos,,,,,,Não aplicável.,Não aplicável.,FALSE
Aquisição de Linezolide,Concurso público,Aquisição de bens móveis,"33600000-6, Produtos farmacêuticos","Centro Hospitalar do Tâmega e Sousa, E. P. E. (508318262)","Laboratórios Pfizer, Lda. (500162166)","33.735,26 €",04-07-2017,01-03-2017,306 dias,"Portugal, Porto, Penafiel",Artigo 28.º do Código dos Contratos Públicos,,,,,,Não aplicável.,Não aplicável.,FALSE
Trouxas Cirúrgicas,Concurso público,Aquisição de bens móveis,"33140000-3, Material médico de consumo","Centro Hospitalar do Tâmega e Sousa, E. P. E. (508318262)","SFERAMED-MEDICAL SUPPLIER,LDA. (509762344)","10.303,42 €",04-07-2017,01-03-2017,306 dias,"Portugal, Porto, Penafiel",Artigo 28.º do Código dos Contratos Públicos,,,,,,Não aplicável.,Não aplicável.,FALSE
Trouxas Cirúrgicas,Concurso público,Aquisição de bens móveis,"33140000-3, Material médico de consumo","Centro Hospitalar do Tâmega e Sousa, E. P. E. (508318262)","OASIPOR - IMPORT. E EXPORT., SA (502260750)","33.500,00 €",04-07-2017,01-03-2017,306 dias,"Portugal, Porto, Penafiel",Artigo 28.º do Código dos Contratos Públicos,,,,,,Não aplicável.,Não aplicável.,FALSE
Trouxas Cirúrgicas,Concurso público,Aquisição de bens móveis,"33140000-3, Material médico de consumo","Centro Hospitalar do Tâmega e Sousa, E. P. E. (508318262)",Medline (510533515),"11.265,00 €",04-07-2017,01-03-2017,306 dias,"Portugal, Porto, Penafiel",Artigo 28.º do Código dos Contratos Públicos,,,,,,Não aplicável.,Não aplicável.,FALSE
Trouxas Cirúrgicas,Concurso público,Aquisição de bens móveis,"33140000-3, Material médico de consumo","Centro Hospitalar do Tâmega e Sousa, E. P. E. (508318262)",LINEAMEDICA - (505148676),"65.562,00 €",04-07-2017,01-03-2017,306 dias,"Portugal, Porto, Penafiel",Artigo 28.º do Código dos Contratos Públicos,,,,,,Não aplicável.,Não aplicável.,FALSE
Trouxas Cirúrgicas,Concurso público,Aquisição de bens móveis,"33141000-0, Material médico não químico descartável e produtos hematológicos","Centro Hospitalar do Tâmega e Sousa, E. P. E. (508318262)",Filsat - Equipamentos Médico-Científicos Lda (506708616),"4.015,00 €",04-07-2017,01-03-2017,306 dias,"Portugal, Porto, Penafiel",Artigo 28.º do Código dos Contratos Públicos,,,,,,Não aplicável.,Não aplicável.,FALSE
Trouxas Cirúrgicas,Concurso público,Aquisição de bens móveis,"33140000-3, Material médico de consumo","Centro Hospitalar do Tâmega e Sousa, E. P. E. (508318262)","Bastos Viegas, S.A. (500042772)","55.525,00 €",04-07-2017,01-03-2017,306 dias,"Portugal, Porto, Penafiel",Artigo 28.º do Código dos Contratos Públicos,,,,,,Não aplicável.,Não aplicável.,FALSE
"Medicamentos Analgésicos, Antipiréticos e Antidepressores",Ao abrigo de acordo-quadro (art.º 259.º),Aquisição de bens móveis,"33600000-6, Produtos farmacêuticos","Centro Hospitalar do Tâmega e Sousa, E. P. E. (508318262)",UNILFARMA       (500293023),"2.940,00 €",04-07-2017,18-01-2017,348 dias,"Portugal, Porto, Penafiel",Artigo 259.º do Código dos Contratos Públicos,,,,,,1974985,"Medicamentos Analgésicos, Antipiréticos e Antidepressivos",FALSE
"Medicamentos Analgésicos, Antipiréticos e Antidepressores",Ao abrigo de acordo-quadro (art.º 259.º),Aquisição de bens móveis,"33600000-6, Produtos farmacêuticos","Centro Hospitalar do Tâmega e Sousa, E. P. E. (508318262)",SIDEFARMA-SOC.IND.EXPANSAO FARMACEUTICA (500717419),"364,00 €",04-07-2017,18-01-2017,348 dias,"Portugal, Porto, Penafiel",Artigo 259.º do Código dos Contratos Públicos,,,,,,1974985,"Medicamentos Analgésicos, Antipiréticos e Antidepressivos",FALSE
"Medicamentos Analgésicos, Antipiréticos e Antidepressores",Ao abrigo de acordo-quadro (art.º 259.º),Aquisição de bens móveis,"33600000-6, Produtos farmacêuticos","Centro Hospitalar do Tâmega e Sousa, E. P. E. (508318262)","SANDOZ FARMACEUTICA, LDA (506985261)","14,93 €",04-07-2017,18-01-2017,348 dias,"Portugal, Porto, Penafiel",Artigo 259.º do Código dos Contratos Públicos,,,,,,1974985,"Medicamentos Analgésicos, Antipiréticos e Antidepressivos",FALSE
"Medicamentos Analgésicos, Antipiréticos e Antidepressores",Ao abrigo de acordo-quadro (art.º 259.º),Aquisição de bens móveis,"33600000-6, Produtos farmacêuticos","Centro Hospitalar do Tâmega e Sousa, E. P. E. (508318262)","OVERPHARMA, PROD. MED. FARMAC., LDA. (505792362)","37.825,88 €",04-07-2017,18-01-2017,348 dias,"Portugal, Porto, Penafiel",Artigo 259.º do Código dos Contratos Públicos,,,,,,1974985,"Medicamentos Analgésicos, Antipiréticos e Antidepressivos",FALSE
"Medicamentos Analgésicos, Antipiréticos e Antidepressores",Ao abrigo de acordo-quadro (art.º 259.º),Aquisição de bens móveis,"33600000-6, Produtos farmacêuticos","Centro Hospitalar do Tâmega e Sousa, E. P. E. (508318262)","Merck Sharp & Dohme, Lda (500191360)","68,95 €",04-07-2017,18-01-2017,348 dias,"Portugal, Porto, Penafiel",Artigo 259.º do Código dos Contratos Públicos,,,,,,1974985,"Medicamentos Analgésicos, Antipiréticos e Antidepressivos",FALSE
"Medicamentos Analgésicos, Antipiréticos e Antidepressores",Ao abrigo de acordo-quadro (art.º 259.º),Aquisição de bens móveis,"33600000-6, Produtos farmacêuticos","Centro Hospitalar do Tâmega e Sousa, E. P. E. (508318262)","MEDA PHARMA - PRODUTOS FARMACÊUTICOS, S.A. (500082090)","8,82 €",04-07-2017,18-01-2017,348 dias,"Portugal, Porto, Penafiel",Artigo 259.º do Código dos Contratos Públicos,,,,,,1974985,"Medicamentos Analgésicos, Antipiréticos e Antidepressivos",FALSE
"Medicamentos Analgésicos, Antipiréticos e Antidepressores",Ao abrigo de acordo-quadro (art.º 259.º),Aquisição de bens móveis,"33600000-6, Produtos farmacêuticos","Centro Hospitalar do Tâmega e Sousa, E. P. E. (508318262)","LUSOMEDICAMENTA, SA (507150473)","1.216,44 €",04-07-2017,18-01-2017,348 dias,"Portugal, Porto, Penafiel",Artigo 259.º do Código dos Contratos Públicos,,,,,,1974985,"Medicamentos Analgésicos, Antipiréticos e Antidepressivos",FALSE
"Medicamentos Analgésicos, Antipiréticos e Antidepressores",Ao abrigo de acordo-quadro (art.º 259.º),Aquisição de bens móveis,"33600000-6, Produtos farmacêuticos","Centro Hospitalar do Tâmega e Sousa, E. P. E. (508318262)","Labesfal - Laboratórios Almiro, S.A. (501169580)","11.275,13 €",04-07-2017,18-01-2017,348 dias,"Portugal, Porto, Penafiel",Artigo 259.º do Código dos Contratos Públicos,,,,,,1974985,"Medicamentos Analgésicos, Antipiréticos e Antidepressivos",FALSE
"Medicamentos Analgésicos, Antipiréticos e Antidepressores",Ao abrigo de acordo-quadro (art.º 259.º),Aquisição de bens móveis,"33600000-6, Produtos farmacêuticos","Centro Hospitalar do Tâmega e Sousa, E. P. E. (508318262)","JANSSEN-CILAG FARMACEUTICA, LDA (500189412)","539,28 €",04-07-2017,18-01-2017,348 dias,"Portugal, Porto, Penafiel",Artigo 259.º do Código dos Contratos Públicos,,,,,,1974985,"Medicamentos Analgésicos, Antipiréticos e Antidepressivos",FALSE
"Medicamentos Analgésicos, Antipiréticos e Antidepressores",Ao abrigo de acordo-quadro (art.º 259.º),Aquisição de bens móveis,"33600000-6, Produtos farmacêuticos","Centro Hospitalar do Tâmega e Sousa, E. P. E. (508318262)",Hikma Farmacêutica ( Portugal) S.A (502266791),"5.965,80 €",04-07-2017,18-01-2017,348 dias,"Portugal, Porto, Penafiel",Artigo 259.º do Código dos Contratos Públicos,,,,,,1974985,"Medicamentos Analgésicos, Antipiréticos e Antidepressivos",FALSE
"Medicamentos Analgésicos, Antipiréticos e Antidepressores",Ao abrigo de acordo-quadro (art.º 259.º),Aquisição de bens móveis,"33600000-6, Produtos farmacêuticos","Centro Hospitalar do Tâmega e Sousa, E. P. E. (508318262)",GlaxoSmithKline - Produtos Farmacêuticos Lda. (500139962),"912,89 €",04-07-2017,18-01-2017,348 dias,"Portugal, Porto, Penafiel",Artigo 259.º do Código dos Contratos Públicos,,,,,,1974985,"Medicamentos Analgésicos, Antipiréticos e Antidepressivos",FALSE
"Medicamentos Analgésicos, Antipiréticos e Antidepressores",Ao abrigo de acordo-quadro (art.º 259.º),Aquisição de bens móveis,"33600000-6, Produtos farmacêuticos","Centro Hospitalar do Tâmega e Sousa, E. P. E. (508318262)","GRUNENTHAL,SA (500101965)","4.796,00 €",04-07-2017,18-01-2017,348 dias,"Portugal, Porto, Penafiel",Artigo 259.º do Código dos Contratos Públicos,,,,,,1974985,"Medicamentos Analgésicos, Antipiréticos e Antidepressivos",FALSE
"Medicamentos Analgésicos, Antipiréticos e Antidepressores",Ao abrigo de acordo-quadro (art.º 259.º),Aquisição de bens móveis,"33600000-6, Produtos farmacêuticos","Centro Hospitalar do Tâmega e Sousa, E. P. E. (508318262)","Generis - Farmacêutica, S.A. (508107997)","152,10 €",04-07-2017,18-01-2017,348 dias,"Portugal, Porto, Penafiel",Artigo 259.º do Código dos Contratos Públicos,,,,,,1974985,"Medicamentos Analgésicos, Antipiréticos e Antidepressivos",FALSE
"Medicamentos Analgésicos, Antipiréticos e Antidepressores",Ao abrigo de acordo-quadro (art.º 259.º),Aquisição de bens móveis,"33600000-6, Produtos farmacêuticos","Centro Hospitalar do Tâmega e Sousa, E. P. E. (508318262)","FERRER HOSPITALAR, S.A. (504507680)","148,18 €",04-07-2017,18-01-2017,348 dias,"Portugal, Porto, Penafiel",Artigo 259.º do Código dos Contratos Públicos,,,,,,1974985,"Medicamentos Analgésicos, Antipiréticos e Antidepressivos",FALSE
"Medicamentos Analgésicos, Antipiréticos e Antidepressores",Ao abrigo de acordo-quadro (art.º 259.º),Aquisição de bens móveis,"33600000-6, Produtos farmacêuticos","Centro Hospitalar do Tâmega e Sousa, E. P. E. (508318262)",B BRAUN MEDICAL LDA (501506543),"648,00 €",04-07-2017,18-01-2017,348 dias,"Portugal, Porto, Penafiel",Artigo 259.º do Código dos Contratos Públicos,,,,,,1974985,"Medicamentos Analgésicos, Antipiréticos e Antidepressivos",FALSE
"Medicamentos Analgésicos, Antipiréticos e Antidepressores",Ao abrigo de acordo-quadro (art.º 259.º),Aquisição de bens móveis,"33600000-6, Produtos farmacêuticos","Centro Hospitalar do Tâmega e Sousa, E. P. E. (508318262)","ANGELINI FARMACÊUTICA,LDA. (500583650)","534,44 €",04-07-2017,18-01-2017,348 dias,"Portugal, Porto, Penafiel",Artigo 259.º do Código dos Contratos Públicos,,,,,,1974985,"Medicamentos Analgésicos, Antipiréticos e Antidepressivos",FALSE
"Medicamentos Analgésicos, Antipiréticos e Antidepressores",Ao abrigo de acordo-quadro (art.º 259.º),Aquisição de bens móveis,"33600000-6, Produtos farmacêuticos","Centro Hospitalar do Tâmega e Sousa, E. P. E. (508318262)","Accord Healthcare, Unipessoal, Lda. (508622263)","48.804,00 €",04-07-2017,18-01-2017,348 dias,"Portugal, Porto, Penafiel",Artigo 259.º do Código dos Contratos Públicos,,,,,,1974985,"Medicamentos Analgésicos, Antipiréticos e Antidepressivos",FALSE
01/AQ.16.254 - Medicamentos do Sistema Nervoso Cerebrospinal (SNC),Ao abrigo de acordo-quadro (art.º 259.º),Aquisição de bens móveis,"33600000-6, Produtos farmacêuticos","Centro Hospitalar do Tâmega e Sousa, E. P. E. (508318262)",U C B PHARMA - PROD FARMACEUTICOS                  (500291322),"131,90 €",03-07-2017,15-02-2017,320 dias,"Portugal, Porto, Penafiel",Artigo 259.º do Código dos Contratos Públicos,,,,,,2528670,"CP 2017/2 - Acordo Quadro para fornecimento de Medicamentos do Sistema Nervoso Cerebrospinal, exceto: anestésicos, relaxantes musculares, analgésicos, antipiréticos, antidepressivos e antipsicóticos  às Instituições e Serviços do Serviço Nacional de Saúde",FALSE
01/AQ.16.254 - Medicamentos do Sistema Nervoso Cerebrospinal (SNC),Ao abrigo de acordo-quadro (art.º 259.º),Aquisição de bens móveis,"33600000-6, Produtos farmacêuticos","Centro Hospitalar do Tâmega e Sousa, E. P. E. (508318262)","TEVA PHARMA-PRODUTOS FARMACEUTICOS, LDA (507045491)","164,28 €",03-07-2017,15-02-2017,320 dias,"Portugal, Porto, Penafiel",Artigo 259.º do Código dos Contratos Públicos,,,,,,2528670,"CP 2017/2 - Acordo Quadro para fornecimento de Medicamentos do Sistema Nervoso Cerebrospinal, exceto: anestésicos, relaxantes musculares, analgésicos, antipiréticos, antidepressivos e antipsicóticos  às Instituições e Serviços do Serviço Nacional de Saúde",FALSE
01/AQ.16.254 - Medicamentos do Sistema Nervoso Cerebrospinal (SNC),Ao abrigo de acordo-quadro (art.º 259.º),Aquisição de bens móveis,"33600000-6, Produtos farmacêuticos","Centro Hospitalar do Tâmega e Sousa, E. P. E. (508318262)",TECNIFAR IND TECNICA FARM SAR        (500280436),"975,51 €",03-07-2017,15-02-2017,320 dias,"Portugal, Porto, Penafiel",Artigo 259.º do Código dos Contratos Públicos,,,,,,2528670,"CP 2017/2 - Acordo Quadro para fornecimento de Medicamentos do Sistema Nervoso Cerebrospinal, exceto: anestésicos, relaxantes musculares, analgésicos, antipiréticos, antidepressivos e antipsicóticos  às Instituições e Serviços do Serviço Nacional de Saúde",FALSE
01/AQ.16.254 - Medicamentos do Sistema Nervoso Cerebrospinal (SNC),Ao abrigo de acordo-quadro (art.º 259.º),Aquisição de bens móveis,"33600000-6, Produtos farmacêuticos","Centro Hospitalar do Tâmega e Sousa, E. P. E. (508318262)","SANOFI - PRODUTOS FARMACÊUTICOS, LDA. (500134960)","12.318,36 €",03-07-2017,15-02-2017,320 dias,"Portugal, Porto, Penafiel",Artigo 259.º do Código dos Contratos Públicos,,,,,,2528670,"CP 2017/2 - Acordo Quadro para fornecimento de Medicamentos do Sistema Nervoso Cerebrospinal, exceto: anestésicos, relaxantes musculares, analgésicos, antipiréticos, antidepressivos e antipsicóticos  às Instituições e Serviços do Serviço Nacional de Saúde",FALSE
01/AQ.16.254 - Medicamentos do Sistema Nervoso Cerebrospinal (SNC),Ao abrigo de acordo-quadro (art.º 259.º),Aquisição de bens móveis,"33600000-6, Produtos farmacêuticos","Centro Hospitalar do Tâmega e Sousa, E. P. E. (508318262)","SANDOZ FARMACEUTICA, LDA (506985261)","7.842,97 €",03-07-2017,15-02-2017,320 dias,"Portugal, Porto, Penafiel",Artigo 259.º do Código dos Contratos Públicos,,,,,,2528670,"CP 2017/2 - Acordo Quadro para fornecimento de Medicamentos do Sistema Nervoso Cerebrospinal, exceto: anestésicos, relaxantes musculares, analgésicos, antipiréticos, antidepressivos e antipsicóticos  às Instituições e Serviços do Serviço Nacional de Saúde",FALSE
01/AQ.16.254 - Medicamentos do Sistema Nervoso Cerebrospinal (SNC),Ao abrigo de acordo-quadro (art.º 259.º),Aquisição de bens móveis,"33600000-6, Produtos farmacêuticos","Centro Hospitalar do Tâmega e Sousa, E. P. E. (508318262)","OVERPHARMA, PROD. MED. FARMAC., LDA. (505792362)","68,24 €",03-07-2017,15-02-2017,320 dias,"Portugal, Porto, Penafiel",Artigo 259.º do Código dos Contratos Públicos,,,,,,2528670,"CP 2017/2 - Acordo Quadro para fornecimento de Medicamentos do Sistema Nervoso Cerebrospinal, exceto: anestésicos, relaxantes musculares, analgésicos, antipiréticos, antidepressivos e antipsicóticos  às Instituições e Serviços do Serviço Nacional de Saúde",FALSE
01/AQ.16.254 - Medicamentos do Sistema Nervoso Cerebrospinal (SNC),Ao abrigo de acordo-quadro (art.º 259.º),Aquisição de bens móveis,"33600000-6, Produtos farmacêuticos","Centro Hospitalar do Tâmega e Sousa, E. P. E. (508318262)","NOVARTIS FARMA, S.A. (500063524)","358,45 €",03-07-2017,15-02-2017,320 dias,"Portugal, Porto, Penafiel",Artigo 259.º do Código dos Contratos Públicos,,,,,,2528670,"CP 2017/2 - Acordo Quadro para fornecimento de Medicamentos do Sistema Nervoso Cerebrospinal, exceto: anestésicos, relaxantes musculares, analgésicos, antipiréticos, antidepressivos e antipsicóticos  às Instituições e Serviços do Serviço Nacional de Saúde",FALSE
01/AQ.16.254 - Medicamentos do Sistema Nervoso Cerebrospinal (SNC),Ao abrigo de acordo-quadro (art.º 259.º),Aquisição de bens móveis,"33600000-6, Produtos farmacêuticos","Centro Hospitalar do Tâmega e Sousa, E. P. E. (508318262)","MERCK SHARP DOHME, LDA. (500191360)","475,53 €",03-07-2017,15-02-2017,320 dias,"Portugal, Porto, Penafiel",Artigo 259.º do Código dos Contratos Públicos,,,,,,2528670,"CP 2017/2 - Acordo Quadro para fornecimento de Medicamentos do Sistema Nervoso Cerebrospinal, exceto: anestésicos, relaxantes musculares, analgésicos, antipiréticos, antidepressivos e antipsicóticos  às Instituições e Serviços do Serviço Nacional de Saúde",FALSE
01/AQ.16.254 - Medicamentos do Sistema Nervoso Cerebrospinal (SNC),Ao abrigo de acordo-quadro (art.º 259.º),Aquisição de bens móveis,"33600000-6, Produtos farmacêuticos","Centro Hospitalar do Tâmega e Sousa, E. P. E. (508318262)","LABORATORIOS MEDINFAR, S.A.     (500384045)","313,92 €",03-07-2017,15-02-2017,320 dias,"Portugal, Porto, Penafiel",Artigo 259.º do Código dos Contratos Públicos,,,,,,2528670,"CP 2017/2 - Acordo Quadro para fornecimento de Medicamentos do Sistema Nervoso Cerebrospinal, exceto: anestésicos, relaxantes musculares, analgésicos, antipiréticos, antidepressivos e antipsicóticos  às Instituições e Serviços do Serviço Nacional de Saúde",FALSE
Medicamentos do Sistema Nervoso Cerebrospinal (SNC),Ao abrigo de acordo-quadro (art.º 259.º),Aquisição de bens móveis,"33600000-6, Produtos farmacêuticos","Centro Hospitalar do Tâmega e Sousa, E. P. E. (508318262)","MEDA PHARMA - PRODUTOS FARMACÊUTICOS, S.A. (500082090)","546,48 €",03-07-2017,15-02-2017,320 dias,"Portugal, Porto, Penafiel",Artigo 259.º do Código dos Contratos Públicos,,,,,,2528670,"CP 2017/2 - Acordo Quadro para fornecimento de Medicamentos do Sistema Nervoso Cerebrospinal, exceto: anestésicos, relaxantes musculares, analgésicos, antipiréticos, antidepressivos e antipsicóticos  às Instituições e Serviços do Serviço Nacional de Saúde",FALSE
Medicamentos do Sistema Nervoso Cerebrospinal (SNC),Ao abrigo de acordo-quadro (art.º 259.º),Aquisição de bens móveis,"33600000-6, Produtos farmacêuticos","Centro Hospitalar do Tâmega e Sousa, E. P. E. (508318262)","LABESFAL - LABORATÓRIOS ALMIRO, S.A.     (501169580)","3.286,18 €",03-07-2017,15-02-2017,320 dias,"Portugal, Porto, Penafiel",Artigo 259.º do Código dos Contratos Públicos,,,,,,2528670,"CP 2017/2 - Acordo Quadro para fornecimento de Medicamentos do Sistema Nervoso Cerebrospinal, exceto: anestésicos, relaxantes musculares, analgésicos, antipiréticos, antidepressivos e antipsicóticos  às Instituições e Serviços do Serviço Nacional de Saúde",FALSE
Medicamentos do Sistema Nervoso Cerebrospinal (SNC),Ao abrigo de acordo-quadro (art.º 259.º),Aquisição de bens móveis,"33600000-6, Produtos farmacêuticos","Centro Hospitalar do Tâmega e Sousa, E. P. E. (508318262)",Hikma Farmacêutica ( Portugal) S.A (502266791),"4.140,11 €",03-07-2017,15-02-2017,320 dias,"Portugal, Porto, Penafiel",Artigo 259.º do Código dos Contratos Públicos,,,,,,2528670,"CP 2017/2 - Acordo Quadro para fornecimento de Medicamentos do Sistema Nervoso Cerebrospinal, exceto: anestésicos, relaxantes musculares, analgésicos, antipiréticos, antidepressivos e antipsicóticos  às Instituições e Serviços do Serviço Nacional de Saúde",FALSE
Medicamentos do Sistema Nervoso Cerebrospinal (SNC),Ao abrigo de acordo-quadro (art.º 259.º),Aquisição de bens móveis,"33600000-6, Produtos farmacêuticos","Centro Hospitalar do Tâmega e Sousa, E. P. E. (508318262)",GlaxoSmithKline - Produtos Farmacêuticos Lda. (500139962),"16,74 €",03-07-2017,15-02-2017,320 dias,"Portugal, Porto, Penafiel",Artigo 259.º do Código dos Contratos Públicos,,,,,,2528670,"CP 2017/2 - Acordo Quadro para fornecimento de Medicamentos do Sistema Nervoso Cerebrospinal, exceto: anestésicos, relaxantes musculares, analgésicos, antipiréticos, antidepressivos e antipsicóticos  às Instituições e Serviços do Serviço Nacional de Saúde",FALSE
Medicamentos do Sistema Nervoso Cerebrospinal (SNC),Ao abrigo de acordo-quadro (art.º 259.º),Aquisição de bens móveis,"33600000-6, Produtos farmacêuticos","Centro Hospitalar do Tâmega e Sousa, E. P. E. (508318262)","GENERIS-FARMACEUTICA,SA (508107997)","2.783,49 €",03-07-2017,15-02-2017,320 dias,"Portugal, Porto, Penafiel",Artigo 259.º do Código dos Contratos Públicos,,,,,,2528670,"CP 2017/2 - Acordo Quadro para fornecimento de Medicamentos do Sistema Nervoso Cerebrospinal, exceto: anestésicos, relaxantes musculares, analgésicos, antipiréticos, antidepressivos e antipsicóticos  às Instituições e Serviços do Serviço Nacional de Saúde",FALSE
Medicamentos do Sistema Nervoso Cerebrospinal (SNC),Ao abrigo de acordo-quadro (art.º 259.º),Aquisição de bens móveis,"33600000-6, Produtos farmacêuticos","Centro Hospitalar do Tâmega e Sousa, E. P. E. (508318262)",DLA FARMACEUTICA SA                                (503894427),"9,09 €",03-07-2017,15-02-2017,320 dias,"Portugal, Porto, Penafiel",Artigo 259.º do Código dos Contratos Públicos,,,,,,2528670,"CP 2017/2 - Acordo Quadro para fornecimento de Medicamentos do Sistema Nervoso Cerebrospinal, exceto: anestésicos, relaxantes musculares, analgésicos, antipiréticos, antidepressivos e antipsicóticos  às Instituições e Serviços do Serviço Nacional de Saúde",FALSE
Medicamentos do Sistema Nervoso Cerebrospinal (SNC),Ao abrigo de acordo-quadro (art.º 259.º),Aquisição de bens móveis,"33600000-6, Produtos farmacêuticos","Centro Hospitalar do Tâmega e Sousa, E. P. E. (508318262)","AUROVITAS UNIPESSOAL, LDA (513053239)","1.636,56 €",03-07-2017,15-02-2017,320 dias,"Portugal, Porto, Penafiel",Artigo 259.º do Código dos Contratos Públicos,,,,,,2528670,"CP 2017/2 - Acordo Quadro para fornecimento de Medicamentos do Sistema Nervoso Cerebrospinal, exceto: anestésicos, relaxantes musculares, analgésicos, antipiréticos, antidepressivos e antipsicóticos  às Instituições e Serviços do Serviço Nacional de Saúde",FALSE
Medicamentos Anestésicos Relaxantes Musculares,Ao abrigo de acordo-quadro (art.º 259.º),Aquisição de bens móveis,"33600000-6, Produtos farmacêuticos","Centro Hospitalar do Tâmega e Sousa, E. P. E. (508318262)","LABESFAL - LABORATÓRIOS ALMIRO, S.A.     (501169580)","9.667,00 €",03-07-2017,22-03-2017,285 dias,"Portugal, Porto, Penafiel",Artigo 259.º do Código dos Contratos Públicos,,,,,,461372,CP 2012/45 - MEDICAMENTOS ANESTÉSICOS E RELAXANTES MUSCULARES,FALSE
Medicamentos Anestésicos Relaxantes Musculares,Ao abrigo de acordo-quadro (art.º 259.º),Aquisição de bens móveis,"33600000-6, Produtos farmacêuticos","Centro Hospitalar do Tâmega e Sousa, E. P. E. (508318262)",KORANGI (505322307),"3.352,00 €",03-07-2017,22-03-2017,285 dias,"Portugal, Porto, Penafiel",Artigo 259.º do Código dos Contratos Públicos,,,,,,461372,CP 2012/45 - MEDICAMENTOS ANESTÉSICOS E RELAXANTES MUSCULARES,FALSE
Medicamentos Anestésicos Relaxantes Musculares,Ao abrigo de acordo-quadro (art.º 259.º),Aquisição de bens móveis,"33600000-6, Produtos farmacêuticos","Centro Hospitalar do Tâmega e Sousa, E. P. E. (508318262)",IPSEN (502609800),"8.847,00 €",03-07-2017,22-03-2017,285 dias,"Portugal, Porto, Penafiel",Artigo 259.º do Código dos Contratos Públicos,,,,,,461372,CP 2012/45 - MEDICAMENTOS ANESTÉSICOS E RELAXANTES MUSCULARES,FALSE
Medicamentos Anestésicos Relaxantes Musculares,Ao abrigo de acordo-quadro (art.º 259.º),Aquisição de bens móveis,"33600000-6, Produtos farmacêuticos","Centro Hospitalar do Tâmega e Sousa, E. P. E. (508318262)",Hikma Farmacêutica ( Portugal) S.A (502266791),"3.120,00 €",03-07-2017,22-03-2017,285 dias,"Portugal, Porto, Penafiel",Artigo 259.º do Código dos Contratos Públicos,,,,,,461372,CP 2012/45 - MEDICAMENTOS ANESTÉSICOS E RELAXANTES MUSCULARES,FALSE
Medicamentos Anestésicos Relaxantes Musculares,Ao abrigo de acordo-quadro (art.º 259.º),Aquisição de bens móveis,"33600000-6, Produtos farmacêuticos","Centro Hospitalar do Tâmega e Sousa, E. P. E. (508318262)","GENERIS-FARMACEUTICA,SA (508107997)","131,60 €",03-07-2017,22-03-2017,285 dias,"Portugal, Porto, Penafiel",Artigo 259.º do Código dos Contratos Públicos,,,,,,461372,CP 2012/45 - MEDICAMENTOS ANESTÉSICOS E RELAXANTES MUSCULARES,FALSE
Medicamentos Anestésicos Relaxantes Musculares,Ao abrigo de acordo-quadro (art.º 259.º),Aquisição de bens móveis,"33600000-6, Produtos farmacêuticos","Centro Hospitalar do Tâmega e Sousa, E. P. E. (508318262)","FRESENIUS KABI PHARMA PORTUGAL, LDA (504293753)","29.245,70 €",03-07-2017,22-03-2017,285 dias,"Portugal, Porto, Penafiel",Artigo 259.º do Código dos Contratos Públicos,,,,,,461372,CP 2012/45 - MEDICAMENTOS ANESTÉSICOS E RELAXANTES MUSCULARES,FALSE
Medicamentos Anestésicos Relaxantes Musculares,Ao abrigo de acordo-quadro (art.º 259.º),Aquisição de bens móveis,"33600000-6, Produtos farmacêuticos","Centro Hospitalar do Tâmega e Sousa, E. P. E. (508318262)","BLUEMED Unipessoal, Lda (509912060)","5.746,00 €",03-07-2017,22-03-2017,285 dias,"Portugal, Porto, Penafiel",Artigo 259.º do Código dos Contratos Públicos,,,,,,461372,CP 2012/45 - MEDICAMENTOS ANESTÉSICOS E RELAXANTES MUSCULARES,FALSE
Medicamentos Anestésicos Relaxantes Musculares,Ao abrigo de acordo-quadro (art.º 259.º),Aquisição de bens móveis,"33600000-6, Produtos farmacêuticos","Centro Hospitalar do Tâmega e Sousa, E. P. E. (508318262)",BAXTER MEDICO FARMACEUTICA LDA (503347345),"57.092,80 €",03-07-2017,22-03-2017,285 dias,"Portugal, Porto, Penafiel",Artigo 259.º do Código dos Contratos Públicos,,,,,,461372,CP 2012/45 - MEDICAMENTOS ANESTÉSICOS E RELAXANTES MUSCULARES,FALSE
Medicamentos Anestésicos Relaxantes Musculares,Ao abrigo de acordo-quadro (art.º 259.º),Aquisição de bens móveis,"33600000-6, Produtos farmacêuticos","Centro Hospitalar do Tâmega e Sousa, E. P. E. (508318262)",B BRAUN MEDICAL LDA (501506543),"2.441,80 €",03-07-2017,22-03-2017,285 dias,"Portugal, Porto, Penafiel",Artigo 259.º do Código dos Contratos Públicos,,,,,,461372,CP 2012/45 - MEDICAMENTOS ANESTÉSICOS E RELAXANTES MUSCULARES,FALSE
Medicamentos Anestésicos Relaxantes Musculares,Ao abrigo de acordo-quadro (art.º 259.º),Aquisição de bens móveis,"33600000-6, Produtos farmacêuticos","Centro Hospitalar do Tâmega e Sousa, E. P. E. (508318262)","ASTELLAS FARMA, LDA. (502540249)","2.047,70 €",03-07-2017,22-03-2017,285 dias,"Portugal, Porto, Penafiel",Artigo 259.º do Código dos Contratos Públicos,,,,,,461372,CP 2012/45 - MEDICAMENTOS ANESTÉSICOS E RELAXANTES MUSCULARES,FALSE
Medicamentos Anestésicos Relaxantes Musculares,Ao abrigo de acordo-quadro (art.º 259.º),Aquisição de bens móveis,"33600000-6, Produtos farmacêuticos","Centro Hospitalar do Tâmega e Sousa, E. P. E. (508318262)","Abbvie, Lda (510229050)","26.481,00 €",03-07-2017,22-03-2017,285 dias,"Portugal, Porto, Penafiel",Artigo 259.º do Código dos Contratos Públicos,,,,,,461372,CP 2012/45 - MEDICAMENTOS ANESTÉSICOS E RELAXANTES MUSCULARES,FALSE
