freguesia,acronym,validVotesPercentage,votes,dicofre
"União das freguesias de Sandim, Olival, Lever e Crestuma",PS,38.88,3441,131729
"União das freguesias de Sandim, Olival, Lever e Crestuma",PPD/PSD,35.33,3127,131729
"União das freguesias de Sandim, Olival, Lever e Crestuma",B.E.,8.64,765,131729
"União das freguesias de Sandim, Olival, Lever e Crestuma",CDS-PP,6.1,540,131729
"União das freguesias de Sandim, Olival, Lever e Crestuma",PCP-PEV,3.17,281,131729
"União das freguesias de Sandim, Olival, Lever e Crestuma",PAN,2.77,245,131729
"União das freguesias de Sandim, Olival, Lever e Crestuma",IL,1.05,93,131729
"União das freguesias de Sandim, Olival, Lever e Crestuma",R.I.R.,0.73,65,131729
"União das freguesias de Sandim, Olival, Lever e Crestuma",PCTP/MRPP,0.63,56,131729
"União das freguesias de Sandim, Olival, Lever e Crestuma",A,0.46,41,131729
"União das freguesias de Sandim, Olival, Lever e Crestuma",L,0.46,41,131729
"União das freguesias de Sandim, Olival, Lever e Crestuma",CH,0.43,38,131729
"União das freguesias de Sandim, Olival, Lever e Crestuma",PTP,0.25,22,131729
"União das freguesias de Sandim, Olival, Lever e Crestuma",MPT,0.21,19,131729
"União das freguesias de Sandim, Olival, Lever e Crestuma",PNR,0.21,19,131729
"União das freguesias de Sandim, Olival, Lever e Crestuma",PURP,0.2,18,131729
"União das freguesias de Sandim, Olival, Lever e Crestuma",NC,0.12,11,131729
"União das freguesias de Sandim, Olival, Lever e Crestuma",PDR,0.11,10,131729
"União das freguesias de Sandim, Olival, Lever e Crestuma",JPP,0.1,9,131729
"União das freguesias de Sandim, Olival, Lever e Crestuma",PPM,0.09,8,131729
"União das freguesias de Sandim, Olival, Lever e Crestuma",MAS,0.02,2,131729
