freguesia,acronym,validVotesPercentage,votes,dicofre
Vila de Rei,PPD/PSD,49.73,469,051003
Vila de Rei,PS,23.12,218,051003
Vila de Rei,CDS-PP,7.1,67,051003
Vila de Rei,B.E.,5.2,49,051003
Vila de Rei,PAN,4.98,47,051003
Vila de Rei,PCP-PEV,1.8,17,051003
Vila de Rei,PPM.PPV/CDC,1.48,14,051003
Vila de Rei,A,1.17,11,051003
Vila de Rei,NC,1.17,11,051003
Vila de Rei,L,0.95,9,051003
Vila de Rei,PURP,0.95,9,051003
Vila de Rei,IL,0.64,6,051003
Vila de Rei,PCTP/MRPP,0.64,6,051003
Vila de Rei,PDR,0.42,4,051003
Vila de Rei,PTP,0.42,4,051003
Vila de Rei,MAS,0.11,1,051003
Vila de Rei,PNR,0.11,1,051003
