Objeto do Contrato,Tipo de Procedimento,Tipo(s) de Contrato,CPVs,Entidade(s) Adjudicante(s),Entidade(s) Adjudicatária(s),Preço Contratual,Data de Publicação,Data de Celebração do Contrato,Prazo de Execução,Local de Execução,Fundamentação,Data de Fecho do Contrato,Preço Total Efetivo,Causas das Alterações ao Prazo,Causas das Alterações ao Preço,Estado,N.º registo do Acordo Quadro,Descrição do Acordo Quadro,Procedimento Centralizado
"Aquisição de caixas de arquivo com tampa, clichés e os cortantes, para a área de Gestão Logística e Arquivo",Ajuste Direto Regime Geral,Aquisição de bens móveis,"34000000-7, Equipamento e produtos auxiliares de transporte",Serviço de Utilização Comum dos Hospitais (500900469),SAICA PACK PORTUGAL S.A. (500293546),"9.290,00 €",17-04-2018,17-04-2018,20 dias,"Portugal, Lisboa, Sintra<BR/>Portugal, Castelo Branco, Fundão","Artigo 20.º, n.º 1, alínea d) do Código dos Contratos Públicos",,,,,,Não aplicável.,Não aplicável.,FALSE
Substituição Do Meio Filtrante Do Filtro Multimédia Da Rede De Água Dos Furos Da Lavandaria Central De Lisboa E Substituição Do Descalcificador Especifico Das Caldeiras,Ajuste Direto Regime Geral,Aquisição de serviços,"50000000-5, Serviços de reparação e manutenção",Serviço de Utilização Comum dos Hospitais (500900469),Enkrott Gestão e Tratamento de Águas S.A. (500103461),"12.650,00 €",17-04-2018,26-03-2018,42 dias,"Portugal, Lisboa, Vila Franca de Xira","Artigo 20.º, n.º 1, alínea d) do Código dos Contratos Públicos",,,,,,Não aplicável.,Não aplicável.,FALSE
Elaboração de projecto de arquitectura,Ajuste Direto Regime Geral,Aquisição de serviços,"71242000-6, Preparação de projecto e concepção, estimativa de custos",Serviço de Utilização Comum dos Hospitais (500900469),"João Rodrigues e Costa Pereira, Arquitetos, Lda. (508870151)","15.500,00 €",16-04-2018,02-04-2018,45 dias,"Portugal, Porto, Penafiel","Artigo 20.º, n.º 1, alínea d) do Código dos Contratos Públicos",,,,,,Não aplicável.,Não aplicável.,FALSE
Aquisição de combustível,Ajuste Direto Regime Geral,Aquisição de bens móveis,"09000000-3, Produtos petrolíferos, combustíveis, electricidade e outras fontes de energia",Serviço de Utilização Comum dos Hospitais (500900469),"Petróleos de Portugal Ptrogal,SA (500697370)","84.866,52 €",12-04-2018,02-04-2018,61 dias,"Portugal, Lisboa","Artigo 24.º, n.º 1, alínea c) do Código dos Contratos Públicos",,,,,,Não aplicável.,Não aplicável.,FALSE
prestação de serviços de manutenção no hospital,Ajuste Direto Regime Geral,Aquisição de serviços,"50000000-5, Serviços de reparação e manutenção",Serviço de Utilização Comum dos Hospitais (500900469),Tunemedix Lda (509653979),"117.000,00 €",12-04-2018,15-03-2018,365 dias,"Portugal, Lisboa, Lisboa","Artigo 24.º, n.º 1, alínea e), subalínea ii) do Código dos Contratos Públicos",,,,,,Não aplicável.,Não aplicável.,FALSE
aquisição de equipamento para a hospital,Ajuste Direto Regime Geral,Aquisição de bens móveis,"30000000-9, Máquinas, equipamento e material de escritório e de informática, excepto mobiliário e pacotes de programas (software)",Serviço de Utilização Comum dos Hospitais (500900469),INFOCONTROL ELECTRONICA E AUTOMATISMO SA (501395784),"8.166,88 €",12-04-2018,06-04-2018,60 dias,"Portugal, Região Autónoma da Madeira, Funchal","Artigo 20.º, n.º 1, alínea d) do Código dos Contratos Públicos",,,,,,Não aplicável.,Não aplicável.,FALSE
