freguesia,acronym,validVotesPercentage,votes,dicofre
Ribeira,PPD/PSD.CDS-PP,46.99,39,031012
Ribeira,PS,25.3,21,031012
Ribeira,MPT,13.25,11,031012
Ribeira,PCP-PEV,7.23,6,031012
Ribeira,B.E.,4.82,4,031012
Ribeira,MAS,1.2,1,031012
Ribeira,PND,1.2,1,031012
Ribeira,L,0,0,031012
Ribeira,PAN,0,0,031012
Ribeira,PCTP/MRPP,0,0,031012
Ribeira,PDA,0,0,031012
Ribeira,PNR,0,0,031012
Ribeira,POUS,0,0,031012
Ribeira,PPM,0,0,031012
Ribeira,PPV,0,0,031012
Ribeira,PTP,0,0,031012
