freguesia,acronym,validVotesPercentage,votes,dicofre
"União das freguesias de Provesende, Gouvães do Douro e São Cristóvão do Douro",PS,50.83,123,171016
"União das freguesias de Provesende, Gouvães do Douro e São Cristóvão do Douro",PPD/PSD,30.17,73,171016
"União das freguesias de Provesende, Gouvães do Douro e São Cristóvão do Douro",B.E.,6.61,16,171016
"União das freguesias de Provesende, Gouvães do Douro e São Cristóvão do Douro",CDS-PP,4.96,12,171016
"União das freguesias de Provesende, Gouvães do Douro e São Cristóvão do Douro",R.I.R.,3.72,9,171016
"União das freguesias de Provesende, Gouvães do Douro e São Cristóvão do Douro",PAN,1.65,4,171016
"União das freguesias de Provesende, Gouvães do Douro e São Cristóvão do Douro",IL,0.41,1,171016
"União das freguesias de Provesende, Gouvães do Douro e São Cristóvão do Douro",L,0.41,1,171016
"União das freguesias de Provesende, Gouvães do Douro e São Cristóvão do Douro",PCP-PEV,0.41,1,171016
"União das freguesias de Provesende, Gouvães do Douro e São Cristóvão do Douro",PCTP/MRPP,0.41,1,171016
"União das freguesias de Provesende, Gouvães do Douro e São Cristóvão do Douro",PDR,0.41,1,171016
"União das freguesias de Provesende, Gouvães do Douro e São Cristóvão do Douro",A,0,0,171016
"União das freguesias de Provesende, Gouvães do Douro e São Cristóvão do Douro",CH,0,0,171016
"União das freguesias de Provesende, Gouvães do Douro e São Cristóvão do Douro",NC,0,0,171016
"União das freguesias de Provesende, Gouvães do Douro e São Cristóvão do Douro",PNR,0,0,171016
"União das freguesias de Provesende, Gouvães do Douro e São Cristóvão do Douro",PPM,0,0,171016
