Objeto do Contrato,Tipo de Procedimento,Tipo(s) de Contrato,CPVs,Entidade(s) Adjudicante(s),Entidade(s) Adjudicatária(s),Preço Contratual,Data de Publicação,Data de Celebração do Contrato,Prazo de Execução,Local de Execução,Fundamentação,Data de Fecho do Contrato,Preço Total Efetivo,Causas das Alterações ao Prazo,Causas das Alterações ao Preço,Estado,N.º registo do Acordo Quadro,Descrição do Acordo Quadro,Procedimento Centralizado
Aquisição de equipamento informatico,Ajuste Direto Regime Geral,Aquisição de bens móveis,"30000000-9, Máquinas, equipamento e material de escritório e de informática, excepto mobiliário e pacotes de programas (software)","Hospital da Senhora da Oliveira Guimarães, E. P. E. (508080827)","Inforlandia, Sistemas e Serviços de Informática, S.A (506708616)","0,00 €",07-08-2017,01-06-2017,120 dias,"Portugal, Braga, Guimarães",Artigo 258.º do Código dos Contratos Públicos,"","",,,,2864780,"Aquisição de equipam,ento informatico ",FALSE
Fornecimento de Equipamento de Ecografia para o serviço de Ginecologia/Obstetrícia (Procriação Medicamente Assistida),Ajuste Direto Regime Geral,Aquisição de bens móveis,"33000000-0, Equipamento médico, medicamentos e produtos para cuidados pessoais","Hospital da Senhora da Oliveira Guimarães, E. P. E. (508080827)","MEDINVIV, LDA. (509815359)","35.600,00 €",01-08-2017,11-07-2017,60 dias,"Portugal, Braga, Guimarães","Artigo 20.º, n.º 1, alínea a) do Código dos Contratos Públicos",08-09-2017,"35.600,00 €",,,,Não aplicável.,Não aplicável.,FALSE
