freguesia,acronym,validVotesPercentage,votes,dicofre
Bodiosa,PPD/PSD.CDS-PP,63.46,554,182304
Bodiosa,PS,18.56,162,182304
Bodiosa,B.E.,4.12,36,182304
Bodiosa,MPT,4.01,35,182304
Bodiosa,PCP-PEV,3.67,32,182304
Bodiosa,PCTP/MRPP,1.49,13,182304
Bodiosa,PND,0.92,8,182304
Bodiosa,L,0.8,7,182304
Bodiosa,PPM,0.69,6,182304
Bodiosa,MAS,0.46,4,182304
Bodiosa,PAN,0.46,4,182304
Bodiosa,PNR,0.34,3,182304
Bodiosa,PPV,0.34,3,182304
Bodiosa,PTP,0.34,3,182304
Bodiosa,PDA,0.23,2,182304
Bodiosa,POUS,0.11,1,182304
