freguesia,acronym,validVotesPercentage,votes,dicofre
Santa Cruz das Flores,PS,42.53,111,480204
Santa Cruz das Flores,PPD/PSD,15.71,41,480204
Santa Cruz das Flores,CDS-PP,11.49,30,480204
Santa Cruz das Flores,PCP-PEV,8.81,23,480204
Santa Cruz das Flores,B.E.,6.51,17,480204
Santa Cruz das Flores,PAN,4.21,11,480204
Santa Cruz das Flores,L,3.07,8,480204
Santa Cruz das Flores,PPM.PPV/CDC,2.3,6,480204
Santa Cruz das Flores,A,1.92,5,480204
Santa Cruz das Flores,PCTP/MRPP,1.15,3,480204
Santa Cruz das Flores,NC,0.77,2,480204
Santa Cruz das Flores,IL,0.38,1,480204
Santa Cruz das Flores,PDR,0.38,1,480204
Santa Cruz das Flores,PNR,0.38,1,480204
Santa Cruz das Flores,PURP,0.38,1,480204
Santa Cruz das Flores,MAS,0,0,480204
Santa Cruz das Flores,PTP,0,0,480204
