freguesia,acronym,validVotesPercentage,votes,dicofre
Cabril,PS,46.67,28,061201
Cabril,PPD/PSD,38.33,23,061201
Cabril,B.E.,3.33,2,061201
Cabril,CDS-PP,3.33,2,061201
Cabril,PPM.PPV/CDC,3.33,2,061201
Cabril,A,1.67,1,061201
Cabril,PCP-PEV,1.67,1,061201
Cabril,PNR,1.67,1,061201
Cabril,IL,0,0,061201
Cabril,L,0,0,061201
Cabril,MAS,0,0,061201
Cabril,NC,0,0,061201
Cabril,PAN,0,0,061201
Cabril,PCTP/MRPP,0,0,061201
Cabril,PDR,0,0,061201
Cabril,PTP,0,0,061201
Cabril,PURP,0,0,061201
