freguesia,acronym,validVotesPercentage,votes,dicofre
Borba (Matriz),PS,46.75,770,070301
Borba (Matriz),PPD/PSD,19.13,315,070301
Borba (Matriz),PCP-PEV,12.33,203,070301
Borba (Matriz),B.E.,11.29,186,070301
Borba (Matriz),CDS-PP,2.43,40,070301
Borba (Matriz),CH,2.25,37,070301
Borba (Matriz),PAN,1.4,23,070301
Borba (Matriz),PCTP/MRPP,1.15,19,070301
Borba (Matriz),L,0.79,13,070301
Borba (Matriz),IL,0.55,9,070301
Borba (Matriz),A,0.49,8,070301
Borba (Matriz),PNR,0.49,8,070301
Borba (Matriz),R.I.R.,0.36,6,070301
Borba (Matriz),MPT,0.12,2,070301
Borba (Matriz),NC,0.12,2,070301
Borba (Matriz),PPM,0.12,2,070301
Borba (Matriz),PURP,0.12,2,070301
Borba (Matriz),PDR,0.06,1,070301
Borba (Matriz),PTP,0.06,1,070301
