freguesia,acronym,validVotesPercentage,votes,dicofre
Odivelas,PS,35.39,6094,111603
Odivelas,PPD/PSD.CDS-PP,22.64,3899,111603
Odivelas,PCP-PEV,16.56,2851,111603
Odivelas,MPT,7.46,1285,111603
Odivelas,B.E.,6.32,1089,111603
Odivelas,L,3.3,568,111603
Odivelas,PAN,2.93,504,111603
Odivelas,PCTP/MRPP,1.76,303,111603
Odivelas,PNR,0.87,149,111603
Odivelas,PND,0.64,111,111603
Odivelas,PPM,0.53,91,111603
Odivelas,PTP,0.53,91,111603
Odivelas,MAS,0.41,70,111603
Odivelas,PPV,0.4,69,111603
Odivelas,PDA,0.15,26,111603
Odivelas,POUS,0.12,20,111603
