freguesia,acronym,validVotesPercentage,votes,dicofre
União das freguesias de Ribeira de Nisa e Carreiras,PPD/PSD.CDS-PP,34.5,158,121413
União das freguesias de Ribeira de Nisa e Carreiras,PS,33.84,155,121413
União das freguesias de Ribeira de Nisa e Carreiras,PCP-PEV,10.7,49,121413
União das freguesias de Ribeira de Nisa e Carreiras,MPT,8.08,37,121413
União das freguesias de Ribeira de Nisa e Carreiras,B.E.,3.28,15,121413
União das freguesias de Ribeira de Nisa e Carreiras,L,3.06,14,121413
União das freguesias de Ribeira de Nisa e Carreiras,PAN,2.4,11,121413
União das freguesias de Ribeira de Nisa e Carreiras,PCTP/MRPP,2.18,10,121413
União das freguesias de Ribeira de Nisa e Carreiras,PTP,1.09,5,121413
União das freguesias de Ribeira de Nisa e Carreiras,PND,0.44,2,121413
União das freguesias de Ribeira de Nisa e Carreiras,PNR,0.22,1,121413
União das freguesias de Ribeira de Nisa e Carreiras,POUS,0.22,1,121413
União das freguesias de Ribeira de Nisa e Carreiras,MAS,0,0,121413
União das freguesias de Ribeira de Nisa e Carreiras,PDA,0,0,121413
União das freguesias de Ribeira de Nisa e Carreiras,PPM,0,0,121413
União das freguesias de Ribeira de Nisa e Carreiras,PPV,0,0,121413
