freguesia,acronym,validVotesPercentage,votes,dicofre
Amoreira,PPD/PSD.CDS-PP,36,90,101202
Amoreira,PS,32.8,82,101202
Amoreira,MPT,10,25,101202
Amoreira,B.E.,6.8,17,101202
Amoreira,PCP-PEV,6,15,101202
Amoreira,L,1.6,4,101202
Amoreira,PPV,1.6,4,101202
Amoreira,PAN,1.2,3,101202
Amoreira,PCTP/MRPP,1.2,3,101202
Amoreira,PND,0.8,2,101202
Amoreira,POUS,0.8,2,101202
Amoreira,PPM,0.8,2,101202
Amoreira,PTP,0.4,1,101202
Amoreira,MAS,0,0,101202
Amoreira,PDA,0,0,101202
Amoreira,PNR,0,0,101202
