freguesia,acronym,validVotesPercentage,votes,dicofre
Nevogilde,PPD/PSD.CDS-PP,49.37,273,130515
Nevogilde,PS,36.89,204,130515
Nevogilde,MPT,5.79,32,130515
Nevogilde,PCP-PEV,3.98,22,130515
Nevogilde,B.E.,1.45,8,130515
Nevogilde,PCTP/MRPP,0.72,4,130515
Nevogilde,PAN,0.36,2,130515
Nevogilde,PND,0.36,2,130515
Nevogilde,PTP,0.36,2,130515
Nevogilde,L,0.18,1,130515
Nevogilde,PNR,0.18,1,130515
Nevogilde,POUS,0.18,1,130515
Nevogilde,PPV,0.18,1,130515
Nevogilde,MAS,0,0,130515
Nevogilde,PDA,0,0,130515
Nevogilde,PPM,0,0,130515
