freguesia,acronym,validVotesPercentage,votes,dicofre
Duas Igrejas,PPD/PSD,49.65,499,131010
Duas Igrejas,PS,20.6,207,131010
Duas Igrejas,CDS-PP,11.74,118,131010
Duas Igrejas,B.E.,5.47,55,131010
Duas Igrejas,PAN,3.88,39,131010
Duas Igrejas,PCP-PEV,1.19,12,131010
Duas Igrejas,A,1,10,131010
Duas Igrejas,IL,0.9,9,131010
Duas Igrejas,NC,0.9,9,131010
Duas Igrejas,PDR,0.9,9,131010
Duas Igrejas,PNR,0.9,9,131010
Duas Igrejas,L,0.8,8,131010
Duas Igrejas,PCTP/MRPP,0.5,5,131010
Duas Igrejas,PPM.PPV/CDC,0.5,5,131010
Duas Igrejas,PURP,0.5,5,131010
Duas Igrejas,PTP,0.4,4,131010
Duas Igrejas,MAS,0.2,2,131010
