Objeto do Contrato,Tipo de Procedimento,Tipo(s) de Contrato,CPVs,Entidade(s) Adjudicante(s),Entidade(s) Adjudicatária(s),Preço Contratual,Data de Publicação,Data de Celebração do Contrato,Prazo de Execução,Local de Execução,Fundamentação,Data de Fecho do Contrato,Preço Total Efetivo,Causas das Alterações ao Prazo,Causas das Alterações ao Preço,Estado,N.º registo do Acordo Quadro,Descrição do Acordo Quadro,Procedimento Centralizado
Aquisição de serviços para apoio à elaboração do Plano Estratégico (2017-2019) da DGS,Ajuste Direto Regime Geral,Aquisição de serviços,"79900000-3, Serviços empresariais diversos e afins",Direção-Geral da Saúde (600037100),Direção-Geral da Qualificação dos Trabalhadores em Funções Públicas (INA) (600084876),"18.900,00 €",14-02-2017,29-12-2016,150 dias,"Portugal, Lisboa","Artigo 20.º, n.º 1, alínea a) do Código dos Contratos Públicos","","",,,,Não aplicável.,Não aplicável.,FALSE
"Realização de um conjunto de ações ao nível da atividade física, no âmbito da Estratégia Nacional para a Promoção da Atividade Física da Saúde e do Bem-Estar (ENPAF)",Ajuste Direto Regime Geral,Aquisição de serviços,"79900000-3, Serviços empresariais diversos e afins",Direcção Geral de Saúde (600037100),"EDAC - Empresa de Desporto, Animação e Cultura, Lda. (503789771)","14.400,00 €",13-02-2017,29-07-2016,365 dias,"Portugal, Lisboa","Artigo 20.º, n.º 1, alínea a) do Código dos Contratos Públicos",30-12-2016,"14.400,00 €",,,,Não aplicável.,Não aplicável.,FALSE
