freguesia,acronym,validVotesPercentage,votes,dicofre
União das freguesias de Macieira da Lixa e Caramos,PS,43.53,844,130334
União das freguesias de Macieira da Lixa e Caramos,PPD/PSD,35.64,691,130334
União das freguesias de Macieira da Lixa e Caramos,B.E.,6.81,132,130334
União das freguesias de Macieira da Lixa e Caramos,CDS-PP,3.82,74,130334
União das freguesias de Macieira da Lixa e Caramos,PCP-PEV,2.99,58,130334
União das freguesias de Macieira da Lixa e Caramos,PAN,1.65,32,130334
União das freguesias de Macieira da Lixa e Caramos,L,1.13,22,130334
União das freguesias de Macieira da Lixa e Caramos,R.I.R.,1.08,21,130334
União das freguesias de Macieira da Lixa e Caramos,IL,0.57,11,130334
União das freguesias de Macieira da Lixa e Caramos,CH,0.41,8,130334
União das freguesias de Macieira da Lixa e Caramos,PNR,0.41,8,130334
União das freguesias de Macieira da Lixa e Caramos,JPP,0.36,7,130334
União das freguesias de Macieira da Lixa e Caramos,PCTP/MRPP,0.36,7,130334
União das freguesias de Macieira da Lixa e Caramos,PDR,0.31,6,130334
União das freguesias de Macieira da Lixa e Caramos,PTP,0.26,5,130334
União das freguesias de Macieira da Lixa e Caramos,PURP,0.21,4,130334
União das freguesias de Macieira da Lixa e Caramos,MAS,0.15,3,130334
União das freguesias de Macieira da Lixa e Caramos,A,0.1,2,130334
União das freguesias de Macieira da Lixa e Caramos,MPT,0.1,2,130334
União das freguesias de Macieira da Lixa e Caramos,NC,0.05,1,130334
União das freguesias de Macieira da Lixa e Caramos,PPM,0.05,1,130334
