freguesia,acronym,validVotesPercentage,votes,dicofre
São Cosmado,PPD/PSD,38.3,90,180114
São Cosmado,PS,37.02,87,180114
São Cosmado,CDS-PP,11.49,27,180114
São Cosmado,B.E.,6.38,15,180114
São Cosmado,PCP-PEV,3.4,8,180114
São Cosmado,PCTP/MRPP,0.85,2,180114
São Cosmado,A,0.43,1,180114
São Cosmado,L,0.43,1,180114
São Cosmado,PAN,0.43,1,180114
São Cosmado,PNR,0.43,1,180114
São Cosmado,PURP,0.43,1,180114
São Cosmado,R.I.R.,0.43,1,180114
São Cosmado,CH,0,0,180114
São Cosmado,IL,0,0,180114
São Cosmado,JPP,0,0,180114
São Cosmado,MPT,0,0,180114
São Cosmado,NC,0,0,180114
São Cosmado,PDR,0,0,180114
São Cosmado,PPM,0,0,180114
São Cosmado,PTP,0,0,180114
