freguesia,acronym,validVotesPercentage,votes,dicofre
Loures,PS,29.57,2501,110707
Loures,PCP-PEV,24.49,2071,110707
Loures,PPD/PSD.CDS-PP,22.9,1937,110707
Loures,MPT,6.62,560,110707
Loures,B.E.,5.49,464,110707
Loures,L,3.03,256,110707
Loures,PAN,2.53,214,110707
Loures,PCTP/MRPP,2.07,175,110707
Loures,PNR,0.9,76,110707
Loures,PTP,0.61,52,110707
Loures,PND,0.52,44,110707
Loures,PPM,0.41,35,110707
Loures,MAS,0.4,34,110707
Loures,PPV,0.3,25,110707
Loures,PDA,0.13,11,110707
Loures,POUS,0.04,3,110707
