freguesia,acronym,validVotesPercentage,votes,dicofre
Ucha,PS,41.76,185,030282
Ucha,PPD/PSD,38.83,172,030282
Ucha,CDS-PP,6.09,27,030282
Ucha,B.E.,4.29,19,030282
Ucha,PCP-PEV,2.71,12,030282
Ucha,PAN,2.48,11,030282
Ucha,PPM.PPV/CDC,1.13,5,030282
Ucha,A,0.45,2,030282
Ucha,IL,0.45,2,030282
Ucha,NC,0.45,2,030282
Ucha,PDR,0.45,2,030282
Ucha,L,0.23,1,030282
Ucha,MAS,0.23,1,030282
Ucha,PNR,0.23,1,030282
Ucha,PURP,0.23,1,030282
Ucha,PCTP/MRPP,0,0,030282
Ucha,PTP,0,0,030282
