Objeto do Contrato,Tipo de Procedimento,Tipo(s) de Contrato,CPVs,Entidade(s) Adjudicante(s),Entidade(s) Adjudicatária(s),Preço Contratual,Data de Publicação,Data de Celebração do Contrato,Prazo de Execução,Local de Execução,Fundamentação,Data de Fecho do Contrato,Preço Total Efetivo,Causas das Alterações ao Prazo,Causas das Alterações ao Preço,Estado,N.º registo do Acordo Quadro,Descrição do Acordo Quadro,Procedimento Centralizado
"Aquisição do medicamento F669 - Fumarato de dimetilo [240MG; Cáps GR] desencadeada pela SPMS, EPE., no âmbito do despacho 1571/B de 2016",Ajuste Direto Regime Geral,Aquisição de bens móveis,"33600000-6, Produtos farmacêuticos","Unidade Local de Saúde de Matosinhos, E. P. E. (506361390)",BIOGEN IDEC (506415740),"59.966,12 €",29-06-2017,26-04-2017,245 dias,"Portugal, Porto, Matosinhos","Artigo 24.º, n.º 1, alínea e) do Código dos Contratos Públicos",,,,,,Não aplicável.,Não aplicável.,FALSE
"Aquisição de medicamentos desencadeada pela SPMS, EPE. no âmbito do despacho 1571/B, ao abrigo do acordo quadro 2015/6 – Medicamentos do foro oncológico",Ao abrigo de acordo-quadro (art.º 259.º),Aquisição de bens móveis,"33600000-6, Produtos farmacêuticos","Unidade Local de Saúde de Matosinhos, E. P. E. (506361390)","Merck, S.A. (500650870)","304.701,57 €",29-06-2017,04-05-2017,237 dias,"Portugal, Porto, Matosinhos",Artigo 259.º do Código dos Contratos Públicos,,,,,,1771819,CP 2015/6 - Acordo quadro para o fornecimento de Medicamentos do Foro Oncológico,FALSE
"Aquisição de medicamentos desencadeada pela SPMS, EPE. no âmbito do despacho 1571/B, ao abrigo do acordo quadro 2015/6 – Medicamentos do foro oncológico",Ao abrigo de acordo-quadro (art.º 259.º),Aquisição de bens móveis,"33600000-6, Produtos farmacêuticos","Unidade Local de Saúde de Matosinhos, E. P. E. (506361390)","NOVARTIS FARMA, S.A. (500063524)","80.834,32 €",29-06-2017,03-04-2017,268 dias,"Portugal, Porto, Matosinhos",Artigo 259.º do Código dos Contratos Públicos,,,,,,1771819,CP 2015/6 - Acordo quadro para o fornecimento de Medicamentos do Foro Oncológico,FALSE
"Aquisição de medicamentos desencadeada pela SPMS, EPE. no âmbito do despacho 1571/B, ao abrigo do acordo quadro 2015/41 – Medicamentos antivíricos e antifúngicos",Ao abrigo de acordo-quadro (art.º 259.º),Aquisição de bens móveis,"33600000-6, Produtos farmacêuticos","Unidade Local de Saúde de Matosinhos, E. P. E. (506361390)","Bristol_Myers Squibb Far. Portuguesa, S.A. (500048193)","174.465,90 €",29-06-2017,14-03-2017,287 dias,"Portugal, Porto, Matosinhos",Artigo 259.º do Código dos Contratos Públicos,,,,,,1422736,CP 2015/41 - ACORDO QUADRO PARA FORNECIMENTO DE MEDICAMENTOS ANTI-INFECIOSOS: ANTIVÍRICOS E ANTIFÚNGICOS ÀS INSTITUIÇÕES E SERVIÇOS DO SERVIÇO NACIONAL DE SAÚDE,FALSE
"Aquisição de medicamentos desencadeada pela SPMS, EPE. no âmbito do despacho 1571/B, ao abrigo do acordo quadro 2015/6 – Medicamentos do foro oncológico",Ao abrigo de acordo-quadro (art.º 259.º),Aquisição de bens móveis,"33600000-6, Produtos farmacêuticos","Unidade Local de Saúde de Matosinhos, E. P. E. (506361390)","LILLY PORTUGAL-PROD.FARMACEUTICOS, LDA (500165602)","26.386,80 €",29-06-2017,31-05-2017,210 dias,"Portugal, Porto, Matosinhos",Artigo 259.º do Código dos Contratos Públicos,,,,,,1771819,CP 2015/6 - Acordo quadro para o fornecimento de Medicamentos do Foro Oncológico,FALSE
Vedolizumab 300mg,Ajuste Direto Regime Geral,Aquisição de bens móveis,"33600000-6, Produtos farmacêuticos","Unidade Local de Saúde de Matosinhos, E. P. E. (506361390)","TAKEDA-FARMACEUTICOS PORTUGAL,LDA. (502801204)","45.000,00 €",29-06-2017,02-05-2017,185 dias,"Portugal, Porto, Matosinhos","Artigo 24.º, n.º 1, alínea e) do Código dos Contratos Públicos",,,,,,Não aplicável.,Não aplicável.,FALSE
"Aquisição de medicamentos desencadeada pela SPMS, EPE. no âmbito do despacho 1571/B, ao abrigo do acordo quadro 2014/50 – Medicação antialérgica, medicamentos usados no tratamento de intoxicações, vitaminas e sais minerais e grupo 20.9 – Outros produtos",Ao abrigo de acordo-quadro (art.º 259.º),Aquisição de bens móveis,"33600000-6, Produtos farmacêuticos","Unidade Local de Saúde de Matosinhos, E. P. E. (506361390)","MERCK SHARP DOHME, LDA. (500191360)","267,92 €",29-06-2017,20-04-2017,251 dias,"Portugal, Porto, Matosinhos",Artigo 259.º do Código dos Contratos Públicos,,,,,,1338581,"Acordo quadro para fornecimento de Medicação antialérgica, medicamentos usados no tratamento de intoxicações, vitaminas e sais minerais e grupo 20.9 - outros produtos às instituições e serviços do serviço nacional de saúde",FALSE
