Objeto do Contrato,Tipo de Procedimento,Tipo(s) de Contrato,CPVs,Entidade(s) Adjudicante(s),Entidade(s) Adjudicatária(s),Preço Contratual,Data de Publicação,Data de Celebração do Contrato,Prazo de Execução,Local de Execução,Fundamentação,Data de Fecho do Contrato,Preço Total Efetivo,Causas das Alterações ao Prazo,Causas das Alterações ao Preço,Estado,N.º registo do Acordo Quadro,Descrição do Acordo Quadro,Procedimento Centralizado
Serviços Médicos Pediatria,Ajuste Direto Regime Geral,Aquisição de serviços,"85121291-9, Serviços de pediatria","Centro Hospitalar do Algarve, E. P. E. (510745997)","JPP - Pediatria, Unipessoal, Lda (513908455)","35.100,00 €",14-03-2017,08-03-2017,90 dias,"Portugal, Faro, Portimão","Artigo 24.º, n.º 1, alínea e) do Código dos Contratos Públicos",31-03-2017,"18.600,00 €",,"O valor inicial teve por base o estimado para o período de 1 Janeiro a 31 de Março de 2017, o valor final reflecte o valor efetivo",,Não aplicável.,Não aplicável.,FALSE
Serviços médicos Urgência Pediatrica,Ajuste Direto Regime Geral,Aquisição de serviços,"85121291-9, Serviços de pediatria","Centro Hospitalar do Algarve, E. P. E. (510745997)","JPP - Pediatria, Unipessoal, Lda (513908455)","81.240,00 €",11-05-2016,10-05-2016,365 dias,"Portugal, Faro, Faro<BR/>Portugal, Faro, Portimão","Artigo 24.º, n.º 1, alínea c) do Código dos Contratos Públicos",31-12-2016,"50.720,00 €",,"O valor inicial do Contrato teve por base as necessidades estimadas para o período de 18 Abril de 2016 a 31 Dezembro de 2016, o valor final reflecte as necessidades efectivas.",,Não aplicável.,Não aplicável.,FALSE
