freguesia,acronym,validVotesPercentage,votes,dicofre
União das freguesias de Foz de Arouce e Casal de Ermio,PS,42.36,241,060707
União das freguesias de Foz de Arouce e Casal de Ermio,PPD/PSD,30.58,174,060707
União das freguesias de Foz de Arouce e Casal de Ermio,B.E.,7.73,44,060707
União das freguesias de Foz de Arouce e Casal de Ermio,PAN,4.92,28,060707
União das freguesias de Foz de Arouce e Casal de Ermio,PCP-PEV,4.22,24,060707
União das freguesias de Foz de Arouce e Casal de Ermio,CDS-PP,2.99,17,060707
União das freguesias de Foz de Arouce e Casal de Ermio,PDR,1.23,7,060707
União das freguesias de Foz de Arouce e Casal de Ermio,IL,1.05,6,060707
União das freguesias de Foz de Arouce e Casal de Ermio,R.I.R.,1.05,6,060707
União das freguesias de Foz de Arouce e Casal de Ermio,L,0.88,5,060707
União das freguesias de Foz de Arouce e Casal de Ermio,A,0.7,4,060707
União das freguesias de Foz de Arouce e Casal de Ermio,CH,0.7,4,060707
União das freguesias de Foz de Arouce e Casal de Ermio,NC,0.35,2,060707
União das freguesias de Foz de Arouce e Casal de Ermio,PCTP/MRPP,0.35,2,060707
União das freguesias de Foz de Arouce e Casal de Ermio,PNR,0.35,2,060707
União das freguesias de Foz de Arouce e Casal de Ermio,JPP,0.18,1,060707
União das freguesias de Foz de Arouce e Casal de Ermio,MPT,0.18,1,060707
União das freguesias de Foz de Arouce e Casal de Ermio,PPM,0.18,1,060707
União das freguesias de Foz de Arouce e Casal de Ermio,MAS,0,0,060707
União das freguesias de Foz de Arouce e Casal de Ermio,PURP,0,0,060707
