Objeto do Contrato,Tipo de Procedimento,Tipo(s) de Contrato,CPVs,Entidade(s) Adjudicante(s),Entidade(s) Adjudicatária(s),Preço Contratual,Data de Publicação,Data de Celebração do Contrato,Prazo de Execução,Local de Execução,Fundamentação,Data de Fecho do Contrato,Preço Total Efetivo,Causas das Alterações ao Prazo,Causas das Alterações ao Preço,Estado,N.º registo do Acordo Quadro,Descrição do Acordo Quadro,Procedimento Centralizado
"Aquisição de Videocolonoscopio e Processador para a ULSNA, EPE",Ajuste Direto Regime Geral,Aquisição de bens móveis,"33000000-0, Equipamento médico, medicamentos e produtos para cuidados pessoais","Unidade Local de Saúde do Norte Alentejano, E. P. E. (508094461)",Olympus Portugal (980474710),"37.500,00 €",03-03-2014,22-01-2014,30 dias,"Portugal, Portalegre, Portalegre","Artigo 20.º, n.º 1, alínea a) do Código dos Contratos Públicos",22-02-2014,"37.500,00 €",,,,Não aplicável.,Não aplicável.,FALSE
Monitores,Ajuste Direto Regime Geral,Aquisição de bens móveis,"30200000-1, Equipamento e material informático","Unidade Local de Saúde do Norte Alentejano, E. P. E. (508094461)",CPCis (501267255),"18.425,90 €",28-02-2014,13-05-2013,10 dias,"Portugal, Portalegre, Portalegre","Artigo 20.º, n.º 1, alínea a) do Código dos Contratos Públicos",13-05-2013,"18.425,90 €",,,,Não aplicável.,Não aplicável.,FALSE
"Prestação de Serviços Médicos, na Especialidade de Oftalmologia, na ULSNA, EPE (1 de Janeiro a 30 de Junho de 2014)",Ajuste Direto Regime Geral,Aquisição de serviços,"85100000-0, Serviços de saúde","Unidade Local de Saúde do Norte Alentejano, E. P. E. (508094461)","Martin e Sabugal, Lda (507720547)","52.837,68 €",21-02-2014,05-02-2014,181 dias,"Portugal, Portalegre, Portalegre","Artigo 24.º, n.º 1, alínea c) do Código dos Contratos Públicos",30-06-2014,"52.837,68 €",,,,Não aplicável.,Não aplicável.,FALSE
"Prestação de Serviços Médicos, na Especialidade de Anestesiologia, na ULSNA, EPE (1 de Janeiro a 30 de Junho de 2014)",Ajuste Direto Regime Geral,Aquisição de serviços,"85100000-0, Serviços de saúde","Unidade Local de Saúde do Norte Alentejano, E. P. E. (508094461)","Isabel Oliveira Eusébio, Unipessoal, Lda (508498520)","60.984,00 €",21-02-2014,06-02-2014,181 dias,"Portugal, Portalegre, Portalegre","Artigo 24.º, n.º 1, alínea c) do Código dos Contratos Públicos",30-06-2014,"60.984,00 €",,,,Não aplicável.,Não aplicável.,FALSE
