Objeto do Contrato,Tipo de Procedimento,Tipo(s) de Contrato,CPVs,Entidade(s) Adjudicante(s),Entidade(s) Adjudicatária(s),Preço Contratual,Data de Publicação,Data de Celebração do Contrato,Prazo de Execução,Local de Execução,Fundamentação,Data de Fecho do Contrato,Preço Total Efetivo,Causas das Alterações ao Prazo,Causas das Alterações ao Preço,Estado,N.º registo do Acordo Quadro,Descrição do Acordo Quadro,Procedimento Centralizado
Aquisição de 174000 Isoniazida 300mg.,Ajuste Direto Regime Geral,Aquisição de bens móveis,"33651000-8, Anti-infecciosos gerais de uso sistémico","Administração Regional de Saúde do Norte, I.P. (503135593)",Laboratório Militar P Quimico (600019675),"10.440,00 €",01-03-2013,07-02-2013,8 dias,"Portugal, Porto, Porto","Artigo 20.º, n.º 1, alínea a) do Código dos Contratos Públicos","","",,,,Não aplicável.,Não aplicável.,
36 unidades de SD TB Ag MP T64 Rapid,Ajuste Direto Regime Geral,Aquisição de bens móveis,"33694000-1, Meios de diagnóstico","Administração Regional de Saúde do Norte, I.P. (503135593)","ALERE, Lda (502518863)","3.600,00 €",25-02-2013,21-02-2013,365 dias,"Portugal, Vila Real, Vila Real","Artigo 21.º, n.º 2 do Código dos Contratos Públicos",20-04-2013,"3.600,00 €",,,,Não aplicável.,Não aplicável.,
Aquisição de 8000 unidades de pipetas pasteur estérieis 1 ml e 1000 sacos para autoclave (600x780mm),Ajuste Direto Regime Geral,Aquisição de bens móveis,"33696000-5, Reagentes e meios de contraste","Administração Regional de Saúde do Norte, I.P. (503135593)","FRILABO, LDA (507958861)","664,96 €",25-02-2013,11-02-2013,365 dias,"Portugal, Vila Real, Vila Real","Artigo 20.º, n.º 1, alínea a) do Código dos Contratos Públicos",20-04-2013,"664,96 €",,,,Não aplicável.,Não aplicável.,
aquisição de 15000 unidades de tubo pp 50 ml F/C esterilizado; 9600 unidades de pontas filtro est. 1000 uL (rack) e 57.600 unidades de pontas filtro est. 100 Ul (rack),Ajuste Direto Regime Geral,Aquisição de bens móveis,"33696500-0, Reagentes de laboratório","Administração Regional de Saúde do Norte, I.P. (503135593)",Vidrolab 2 (501450629),"5.370,00 €",25-02-2013,11-02-2013,365 dias,"Portugal, Vila Real, Vila Real","Artigo 20.º, n.º 1, alínea a) do Código dos Contratos Públicos",20-10-2013,"5.370,00 €",,,,Não aplicável.,Não aplicável.,
Aquisição de 8200 Mod. INCM 1884; 30 livros do Mod.432; 22000 livros doMod. 1388; 14000 livros do Mod. 1389;  1000 livros do Mod. 1396; 2000 livros do Mod. 1397; 400 blocos do Mod. 1407; 23000 livros do Mod. 1553;  1400 folhas do Mod. 1725; 2000 jogos do Mod. 1536; 15 livros do Mod. 1426; 250 livros do Mod. 432 e 5.500 do Mod. 683,Ajuste Direto Regime Geral,Aquisição de bens móveis,"22300000-3, Postais ilustrados, cartões impressos com votos ou mensagens pessoais e outro material impresso","Administração Regional de Saúde do Norte, I.P. (503135593)","Imprensa Nacional Casa da Moeda, S.A. (500792887)","51.461,80 €",25-02-2013,22-01-2013,365 dias,"Portugal, Vila Real, Vila Real","Artigo 24.º, n.º 1, alínea e) do Código dos Contratos Públicos",22-10-2013,"51.461,80 €",,,,Não aplicável.,Não aplicável.,
Aquisição de 300 garrafões de limpa vidros,Ajuste Direto Regime Geral,Aquisição de bens móveis,"39831200-8, Detergentes","Administração Regional de Saúde do Norte, I.P. (503135593)","HIGITOTAL - Sist. e Prod. de Higiene, Lda (504297040)","1.284,00 €",25-02-2013,21-02-2013,365 dias,"Portugal, Vila Real, Vila Real","Artigo 20.º, n.º 1, alínea a) do Código dos Contratos Públicos",27-02-2013,"1.284,00 €",,,,Não aplicável.,Não aplicável.,
"Aquisição de 2000 ml de glicerina; 5000ml de ácido clrídico 37%; 200ml de óleo de imersão; 500gramas de hidrogenofosfato de sódio;  1000gramas de hidróxido de sódio em pastilhas; 1 caixa de solução tampão pH 10; 10 g de cloridrato de 1,10 fenantrolina (100g); 1000g de dihidrogenofosfato de potássio; 500g de iodeto de potássio; 4 unidades de permandanato de potássio 0,01N 0,002 M; 2500 ml de ácido acético glacial; 500ml de solução padrão cloreto 1000mg/l, 30 frascos de solução tampãp pH 7; 2000gramas de acetato de amónio; 500 g de citrato trissódio e 250 gramas de cloridrato de hidroxilamina",Ajuste Direto Regime Geral,Aquisição de bens móveis,"33696500-0, Reagentes de laboratório","Administração Regional de Saúde do Norte, I.P. (503135593)","VWR - Internacional, Material Laboratório, Lda (503842770)","1.212,04 €",25-02-2013,11-02-2013,365 dias,"Portugal, Vila Real","Artigo 24.º, n.º 1, alínea e) do Código dos Contratos Públicos",07-11-2013,"1.212,04 €",,,,Não aplicável.,Não aplicável.,
Aquisição de 1.100 caixas de  reagente determinação INR no sangue; 420 tiras de reagente determinação amílase no sangue e 260 tiras Roche Cobas h232 Myoglobin 20,Ajuste Direto Regime Geral,Aquisição de bens móveis,"33696000-5, Reagentes e meios de contraste","Administração Regional de Saúde do Norte, I.P. (503135593)","Roche Sistemas de diagnósticos, Lda (504282921)","189.766,85 €",25-02-2013,22-02-2013,365 dias,"Portugal, Vila Real, Vila Real","Artigo 24.º, n.º 1, alínea e) do Código dos Contratos Públicos",22-05-2013,"189.766,85 €",,,,Não aplicável.,Não aplicável.,
