Objeto do Contrato,Tipo de Procedimento,Tipo(s) de Contrato,CPVs,Entidade(s) Adjudicante(s),Entidade(s) Adjudicatária(s),Preço Contratual,Data de Publicação,Data de Celebração do Contrato,Prazo de Execução,Local de Execução,Fundamentação,Data de Fecho do Contrato,Preço Total Efetivo,Causas das Alterações ao Prazo,Causas das Alterações ao Preço,Estado,N.º registo do Acordo Quadro,Descrição do Acordo Quadro,Procedimento Centralizado
Sulfato de Bario Ez-Cat - contraste oral - frasco,Ajuste Direto Regime Geral,Aquisição de bens móveis,"33694000-1, Meios de diagnóstico","Hospital Distrital da Figueira da Foz, E. P. E. (506361527)","MED XRAY - SISTEMAS MEDICOS, LDA (506187071)","2.246,40 €",04-06-2018,24-05-2018,365 dias,"Portugal, Coimbra, Figueira da Foz","Artigo 20.º, n.º 1, alínea a) do Código dos Contratos Públicos",,,,,,Não aplicável.,Não aplicável.,FALSE
Software-Imagiologia,Ajuste Direto Regime Geral,Aquisição de bens móveis,"48000000-8, Pacotes de software e sistemas de informação","Hospital Distrital da Figueira da Foz, E. P. E. (506361527)","Byme - Information technology, Lda (507790960)","2.850,00 €",01-06-2018,09-05-2018,15 dias,"Portugal, Coimbra, Figueira da Foz","Artigo 21.º, n.º 1, alínea c) do Código dos Contratos Públicos",,,,,,Não aplicável.,Não aplicável.,FALSE
Carro de Higiene-Urgência e Esp. Cirúrgicas,Ajuste Direto Regime Geral,Aquisição de bens móveis,"33192300-5, Mobiliário para fins médicos, excepto camas e mesas","Hospital Distrital da Figueira da Foz, E. P. E. (506361527)",Laborial (504296310),"2.086,11 €",01-06-2018,02-05-2018,15 dias,"Portugal, Coimbra, Figueira da Foz","Artigo 21.º, n.º 1, alínea c) do Código dos Contratos Públicos",,,,,,Não aplicável.,Não aplicável.,FALSE
Sistemas de Gravação de Voz- Imagiologia,Ajuste Direto Regime Geral,Aquisição de bens móveis,"33100000-1, Equipamento médico","Hospital Distrital da Figueira da Foz, E. P. E. (506361527)","PAULO TRINDADE, UNIPESSOAL LDA (EX.POLILECTRONICA) (514223669)","1.171,00 €",01-06-2018,04-04-2018,30 dias,"Portugal, Coimbra, Figueira da Foz","Artigo 21.º, n.º 1, alínea c) do Código dos Contratos Públicos",,,,,,Não aplicável.,Não aplicável.,FALSE
Artigos Publicidade-Análises e Urgência,Ajuste Direto Regime Geral,Aquisição de bens móveis,"31523000-8, Placas sinaléticas e sinais luminosos","Hospital Distrital da Figueira da Foz, E. P. E. (506361527)","Smilefacilitys, Lda. (508908434)","2.280,00 €",01-06-2018,19-03-2018,8 dias,"Portugal, Coimbra, Figueira da Foz","Artigo 21.º, n.º 1, alínea c) do Código dos Contratos Públicos",,,,,,Não aplicável.,Não aplicável.,FALSE
Artigos Publicidade-VMER,Ajuste Direto Regime Geral,Aquisição de bens móveis,"31523000-8, Placas sinaléticas e sinais luminosos","Hospital Distrital da Figueira da Foz, E. P. E. (506361527)","ESFERA DE FANTASIA - DESIGN, LDA (509838316)","190,00 €",01-06-2018,15-03-2018,8 dias,"Portugal, Coimbra, Figueira da Foz","Artigo 21.º, n.º 1, alínea c) do Código dos Contratos Públicos",,,,,,Não aplicável.,Não aplicável.,FALSE
