Objeto do Contrato,Tipo de Procedimento,Tipo(s) de Contrato,CPVs,Entidade(s) Adjudicante(s),Entidade(s) Adjudicatária(s),Preço Contratual,Data de Publicação,Data de Celebração do Contrato,Prazo de Execução,Local de Execução,Fundamentação,Data de Fecho do Contrato,Preço Total Efetivo,Causas das Alterações ao Prazo,Causas das Alterações ao Preço,Estado,N.º registo do Acordo Quadro,Descrição do Acordo Quadro,Procedimento Centralizado
PU/12/2018 Fornecimento de produtos alimentares para o ano de 2018,Ajuste Direto Regime Geral,Aquisição de bens móveis,"15000000-8, Produtos alimentares, bebidas, tabaco e produtos afins","Hospital de Magalhães Lemos, E. P. E. (502828790)","Deltagel - Produtos Alimentares, SA (505477882)","611,58 €",26-02-2018,02-01-2018,8 dias,"Portugal, Porto, Porto","Artigo 21.º, n.º 1, alínea c) do Código dos Contratos Públicos",,,,,,Não aplicável.,Não aplicável.,FALSE
PU/12/2018 Fornecimento de produtos alimentares para o ano de 2018,Ajuste Direto Regime Geral,Aquisição de bens móveis,"15300000-1, Fruta, produtos hortícolas e produtos afins","Hospital de Magalhães Lemos, E. P. E. (502828790)","Deltagel - Produtos Alimentares, SA (505477882)","17,20 €",26-02-2018,02-01-2018,8 dias,"Portugal, Porto, Porto","Artigo 21.º, n.º 1, alínea c) do Código dos Contratos Públicos",,,,,,Não aplicável.,Não aplicável.,FALSE
PU/12/2018 Fornecimento de produtos alimentares para o ano de 2018,Ajuste Direto Regime Geral,Aquisição de bens móveis,"15300000-1, Fruta, produtos hortícolas e produtos afins","Hospital de Magalhães Lemos, E. P. E. (502828790)",FreshSabor (508879760),"68,40 €",26-02-2018,02-01-2018,8 dias,"Portugal, Porto, Porto","Artigo 21.º, n.º 1, alínea c) do Código dos Contratos Públicos",,,,,,Não aplicável.,Não aplicável.,FALSE
PU/12/2018 Fornecimento de produtos alimentares para o ano de 2018,Ajuste Direto Regime Geral,Aquisição de bens móveis,"15110000-2, Carne","Hospital de Magalhães Lemos, E. P. E. (502828790)","Futuro em Relevo - Comércio de Carnes, Unip (509485693)","363,90 €",23-02-2018,02-01-2018,8 dias,"Portugal, Porto, Porto","Artigo 21.º, n.º 1, alínea c) do Código dos Contratos Públicos",,,,,,Não aplicável.,Não aplicável.,FALSE
PU/12/2018 Fornecimento de produtos alimentares para o ano de 2018,Ajuste Direto Regime Geral,Aquisição de bens móveis,"15300000-1, Fruta, produtos hortícolas e produtos afins","Hospital de Magalhães Lemos, E. P. E. (502828790)","Madiguima - Comércio de Frutas, Lda (503301205)","564,15 €",23-02-2018,02-01-2018,8 dias,"Portugal, Porto, Porto","Artigo 21.º, n.º 1, alínea c) do Código dos Contratos Públicos",,,,,,Não aplicável.,Não aplicável.,FALSE
PU/12/2018 Fornecimento de produtos alimentares para o ano de 2018,Ajuste Direto Regime Geral,Aquisição de bens móveis,"15000000-8, Produtos alimentares, bebidas, tabaco e produtos afins","Hospital de Magalhães Lemos, E. P. E. (502828790)","FERNAROCA DISTRIBUIÇÃO ,LDA (508404339)","773,74 €",23-02-2018,02-01-2018,8 dias,"Portugal, Porto, Porto","Artigo 21.º, n.º 1, alínea c) do Código dos Contratos Públicos",,,,,,Não aplicável.,Não aplicável.,FALSE
PU/12/2018 Fornecimento de produtos alimentares para o ano de 2018,Ajuste Direto Regime Geral,Aquisição de bens móveis,"15300000-1, Fruta, produtos hortícolas e produtos afins","Hospital de Magalhães Lemos, E. P. E. (502828790)",FreshSabor (508879760),"70,25 €",23-02-2018,02-01-2018,8 dias,"Portugal, Porto, Porto","Artigo 21.º, n.º 1, alínea c) do Código dos Contratos Públicos",,,,,,Não aplicável.,Não aplicável.,FALSE
PU/12/2018 Fornecimento de produtos alimentares para o ano de 2018,Ajuste Direto Regime Geral,Aquisição de bens móveis,"15300000-1, Fruta, produtos hortícolas e produtos afins","Hospital de Magalhães Lemos, E. P. E. (502828790)",FreshSabor (508879760),"594,80 €",23-02-2018,02-01-2018,8 dias,"Portugal, Porto, Porto","Artigo 21.º, n.º 1, alínea c) do Código dos Contratos Públicos",,,,,,Não aplicável.,Não aplicável.,FALSE
PU/12/2018 Fornecimento de produtos alimentares para o ano de 2018,Ajuste Direto Regime Geral,Aquisição de bens móveis,"15110000-2, Carne","Hospital de Magalhães Lemos, E. P. E. (502828790)","Carnes São José - Comércio e Industria de Carnes, Lda (501235574)","196,42 €",23-02-2018,02-01-2018,8 dias,"Portugal, Porto, Porto","Artigo 21.º, n.º 1, alínea c) do Código dos Contratos Públicos",,,,,,Não aplicável.,Não aplicável.,FALSE
AJ/68/2017 Comparticipação de Duodécimo aos Serviços Sociais da Administração Pública para 2017,Ajuste Direto Regime Geral,Aquisição de serviços,"85000000-9, Serviços de saúde e acção social","Hospital de Magalhães Lemos, E. P. E. (502828790)",SERVIÇOS SOCIAIS DA ADMINISTRAÇÃO PÚBLICA (600082628),"813,44 €",21-02-2018,02-01-2017,30 dias,"Portugal, Porto, Porto","Artigo 21.º, n.º 1, alínea c) do Código dos Contratos Públicos",,,,,,Não aplicável.,Não aplicável.,FALSE
