freguesia,acronym,validVotesPercentage,votes,dicofre
Linhares,PPD/PSD.CDS-PP,46.81,66,040308
Linhares,PS,27.66,39,040308
Linhares,PCP-PEV,6.38,9,040308
Linhares,MPT,5.67,8,040308
Linhares,B.E.,3.55,5,040308
Linhares,PND,3.55,5,040308
Linhares,PCTP/MRPP,2.84,4,040308
Linhares,PAN,1.42,2,040308
Linhares,L,0.71,1,040308
Linhares,MAS,0.71,1,040308
Linhares,PTP,0.71,1,040308
Linhares,PDA,0,0,040308
Linhares,PNR,0,0,040308
Linhares,POUS,0,0,040308
Linhares,PPM,0,0,040308
Linhares,PPV,0,0,040308
