Objeto do Contrato,Tipo de Procedimento,Tipo(s) de Contrato,CPVs,Entidade(s) Adjudicante(s),Entidade(s) Adjudicatária(s),Preço Contratual,Data de Publicação,Data de Celebração do Contrato,Prazo de Execução,Local de Execução,Fundamentação,Data de Fecho do Contrato,Preço Total Efetivo,Causas das Alterações ao Prazo,Causas das Alterações ao Preço,Estado,N.º registo do Acordo Quadro,Descrição do Acordo Quadro,Procedimento Centralizado
COBERTURA DESC. P/ TERMOMETRO TRANSTIMPANICO - Ajuste Directo Nº 2412497,Ajuste Direto Regime Geral,Aquisição de bens móveis,"33000000-0, Equipamento médico, medicamentos e produtos para cuidados pessoais","Hospital Garcia de Orta, E. P. E. (506361470)","MEDTRONIC PORTUGAL, LDA (504223933)","8.131,20 €",31-03-2017,28-03-2017,180 dias,"Portugal, Setúbal, Almada","Artigo 20.º, n.º 1, alínea a) do Código dos Contratos Públicos",,,,,,Não aplicável.,Não aplicável.,FALSE
COBERTURA ABSORVENTE P/ MESA OPERATORIA C/ LENCOL - Ajuste Directo Nº 2411997,Ajuste Direto Regime Geral,Aquisição de bens móveis,"33000000-0, Equipamento médico, medicamentos e produtos para cuidados pessoais","Hospital Garcia de Orta, E. P. E. (506361470)","LINEAMÉDICA-DISPOSITIVOS MÉDICOS-CIRUGICOS, SA (505148676)","7.650,00 €",31-03-2017,28-03-2017,180 dias,"Portugal, Setúbal, Almada","Artigo 20.º, n.º 1, alínea a) do Código dos Contratos Públicos",,,,,,Não aplicável.,Não aplicável.,FALSE
MANÁPULAS E RESGUARDOS - Ajuste Directo Nº 2600567,Ajuste Direto Regime Geral,Aquisição de bens móveis,"33000000-0, Equipamento médico, medicamentos e produtos para cuidados pessoais","Hospital Garcia de Orta, E. P. E. (506361470)","PAUL HARTMANN, LDA (502271728)","0,00 €",30-03-2017,14-03-2017,365 dias,"Portugal, Setúbal, Almada",Artigo 258.º do Código dos Contratos Públicos,,,,,,2678905,MANÁPULAS E RESGUARDOS DO CPA 2014025 DA SPMS.,FALSE
MANÁPULAS E RESGUARDOS - Ajuste Directo Nº 2600567,Ajuste Direto Regime Geral,Aquisição de bens móveis,"33000000-0, Equipamento médico, medicamentos e produtos para cuidados pessoais","Hospital Garcia de Orta, E. P. E. (506361470)",Albino Dias de Andrade (500013810),"0,00 €",30-03-2017,14-03-2017,365 dias,"Portugal, Setúbal, Almada",Artigo 258.º do Código dos Contratos Públicos,,,,,,2678905,MANÁPULAS E RESGUARDOS DO CPA 2014025 DA SPMS.,FALSE
FILGRASTIM 30 M.U.I./0.5 ML SOL INJ SER 0.5 ML IV SC - Ajuste Directo Nº 14063117,Ajuste Direto Regime Geral,Aquisição de bens móveis,"33000000-0, Equipamento médico, medicamentos e produtos para cuidados pessoais","Hospital Garcia de Orta, E. P. E. (506361470)","ACCORD HEALTHCARE, UNIPESSOAL Lda.     (508622263)","6.138,00 €",30-03-2017,24-03-2017,90 dias,"Portugal, Setúbal, Almada","Artigo 24.º, n.º 1, alínea c) do Código dos Contratos Públicos",,,,,,Não aplicável.,Não aplicável.,FALSE
GLATIRÂMERO (ACETATO) 20 MG PÓ SOL INJ FR SC - Ajuste Directo Nº 11072017,Ao abrigo de acordo-quadro (art.º 259.º),Aquisição de bens móveis,"33000000-0, Equipamento médico, medicamentos e produtos para cuidados pessoais","Hospital Garcia de Orta, E. P. E. (506361470)","TEVA PHARMA - PRODUTOS FARMACEUTICOS,LDA           (507045491)","6.938,09 €",30-03-2017,21-03-2017,30 dias,"Portugal, Setúbal, Almada",Artigo 259.º do Código dos Contratos Públicos,,,,,,1771819,CP 2015/6 - Acordo quadro para o fornecimento de Medicamentos do Foro Oncológico,FALSE
VEMURAFENIB 240 MG COMP - Aj. directo Nº 11071417,Ao abrigo de acordo-quadro (art.º 259.º),Aquisição de bens móveis,"33000000-0, Equipamento médico, medicamentos e produtos para cuidados pessoais","Hospital Garcia de Orta, E. P. E. (506361470)","Roche Farmacêutica Quimica, Lda (500233810)","12.511,52 €",30-03-2017,24-03-2017,365 dias,"Portugal, Setúbal, Almada",Artigo 259.º do Código dos Contratos Públicos,,,,,,1771819,CP 2015/6 - Acordo quadro para o fornecimento de Medicamentos do Foro Oncológico,FALSE
IPRATRÓPIO (BROMETO) 20 ΜG/DOSE SOL PRESSU INAL RECIP PRESSU 200 DOSE(S) - Aj. Directo Nº 11068917,Ao abrigo de acordo-quadro (art.º 259.º),Aquisição de bens móveis,"33000000-0, Equipamento médico, medicamentos e produtos para cuidados pessoais","Hospital Garcia de Orta, E. P. E. (506361470)",UNILFARMA - UNIAO INTERN. LAB. S FARMACEUTICOS     (500293023),"5.340,00 €",30-03-2017,21-03-2017,365 dias,"Portugal, Setúbal, Almada",Artigo 259.º do Código dos Contratos Públicos,,,,,,1638654,CP 2015/12 - Acordo quadro para fornecimento de Medicamentos do Aparelho Respiratório às Instituições e Serviços do Serviço Nacional de Saúde,FALSE
"CONCENTRADO PROTROMBÍNICO II, VII, IX, X 500UI FR/AMP - Aj. Directo Nº 11074717",Ao abrigo de acordo-quadro (art.º 259.º),Aquisição de bens móveis,"33000000-0, Equipamento médico, medicamentos e produtos para cuidados pessoais","Hospital Garcia de Orta, E. P. E. (506361470)",OCTAPHARMA - PRODUTOS FARMACEUTICOS                (502820780),"5.271,00 €",30-03-2017,21-03-2017,90 dias,"Portugal, Setúbal, Almada",Artigo 259.º do Código dos Contratos Públicos,,,,,,1423488,ACORDO QUADRO PARA FORNECIMENTO DE DERIVADOS DO PLASMA HUMANO ÀS INSTITUIÇÕES E SERVIÇOS DO SERVIÇO NACIONAL DE SAÚDE CP 2015/9,FALSE
"CONCENTRADO PROTROMBÍNICO II, VII, IX, X 500UI FR/AMP - Aj. Directo Nº 11074717",Ao abrigo de acordo-quadro (art.º 259.º),Aquisição de bens móveis,"33000000-0, Equipamento médico, medicamentos e produtos para cuidados pessoais","Hospital Garcia de Orta, E. P. E. (506361470)","CSL Behring, SA (503047201)","5.271,00 €",30-03-2017,21-03-2017,90 dias,"Portugal, Setúbal, Almada",Artigo 259.º do Código dos Contratos Públicos,,,,,,1423488,ACORDO QUADRO PARA FORNECIMENTO DE DERIVADOS DO PLASMA HUMANO ÀS INSTITUIÇÕES E SERVIÇOS DO SERVIÇO NACIONAL DE SAÚDE CP 2015/9,FALSE
PERTUZUMAB 420 MG/14 ML SOL INJ FR 14 ML IV - Aj. Directo Nº 11076817,Ao abrigo de acordo-quadro (art.º 259.º),Aquisição de bens móveis,"33000000-0, Equipamento médico, medicamentos e produtos para cuidados pessoais","Hospital Garcia de Orta, E. P. E. (506361470)","Roche Farmacêutica Quimica, Lda (500233810)","77.326,20 €",30-03-2017,13-03-2017,60 dias,"Portugal, Setúbal, Almada",Artigo 259.º do Código dos Contratos Públicos,,,,,,1771819,CP 2015/6 - Acordo quadro para o fornecimento de Medicamentos do Foro Oncológico,FALSE
AQUISIÇÃO DE LUVAS DE NITRILO PARA 2017 - Ajuste Directo Nº 2100177,Ajuste Direto Regime Geral,Aquisição de bens móveis,"33000000-0, Equipamento médico, medicamentos e produtos para cuidados pessoais","Hospital Garcia de Orta, E. P. E. (506361470)","MEDICINÁLIA CORMÉDICA, LDA.                        (500684324)","178.642,32 €",29-03-2017,07-02-2017,365 dias,"Portugal, Setúbal, Almada","Artigo 20.º, n.º 1, alínea a) do Código dos Contratos Públicos",,,,,,Não aplicável.,Não aplicável.,FALSE
MATERIAL OSTEOSINTESE - Aj. Directo Nº 2438706,Ajuste Direto Regime Geral,Aquisição de bens móveis,"33000000-0, Equipamento médico, medicamentos e produtos para cuidados pessoais","Hospital Garcia de Orta, E. P. E. (506361470)",MEDTRONIC PORTUGAL LDA (504223933),"5.590,00 €",29-03-2017,19-10-2016,180 dias,"Portugal, Setúbal, Almada","Artigo 20.º, n.º 1, alínea a) do Código dos Contratos Públicos",,,,,,Não aplicável.,Não aplicável.,FALSE
ABACAVIR 600 MG + LAMIVUDINA 300 MG COMP - Ajuste Directo Nº 11071117,Ajuste Direto Regime Geral,Aquisição de bens móveis,"33000000-0, Equipamento médico, medicamentos e produtos para cuidados pessoais","Hospital Garcia de Orta, E. P. E. (506361470)","TEVA PHARMA - PRODUTOS FARMACEUTICOS,LDA           (507045491)","105.600,00 €",29-03-2017,23-03-2017,365 dias,"Portugal, Setúbal, Almada","Artigo 24.º, n.º 1, alínea c) do Código dos Contratos Públicos",,,,,,Não aplicável.,Não aplicável.,FALSE
KIT TROCAR 10/12MM - Ajuste Directo Nº 2411817,Ajuste Direto Regime Geral,Aquisição de bens móveis,"33000000-0, Equipamento médico, medicamentos e produtos para cuidados pessoais","Hospital Garcia de Orta, E. P. E. (506361470)","MEDTRONIC PORTUGAL, LDA. (504223933)","5.850,00 €",28-03-2017,16-03-2017,365 dias,"Portugal, Setúbal, Almada","Artigo 20.º, n.º 1, alínea a) do Código dos Contratos Públicos",,,,,,Não aplicável.,Não aplicável.,FALSE
STENT INTRACRANEANO / MICRO COILS - Ajuste directo Nº 2438306,Ajuste Direto Regime Geral,Aquisição de bens móveis,"33000000-0, Equipamento médico, medicamentos e produtos para cuidados pessoais","Hospital Garcia de Orta, E. P. E. (506361470)","Medicinália - Cormédica, Lda (500684324)","7.425,00 €",28-03-2017,26-09-2016,365 dias,"Portugal, Setúbal, Almada","Artigo 20.º, n.º 1, alínea a) do Código dos Contratos Públicos",,,,,,Não aplicável.,Não aplicável.,FALSE
MEDICAMENTOS VÁRIOS - PROCESSO P259-AC-2016-67- ROCHE FARMACEUTICA - Ajuste Directo Nº 11199116,Ajuste Direto Regime Geral,Aquisição de bens móveis,"33000000-0, Equipamento médico, medicamentos e produtos para cuidados pessoais","Hospital Garcia de Orta, E. P. E. (506361470)",Roche Farmacêutica (500233810),"0,00 €",28-03-2017,18-08-2016,365 dias,"Portugal, Setúbal, Almada",Artigo 258.º do Código dos Contratos Públicos,,,,,,2672517,MEDICAMENTOS VÁRIOS - PROCESSO P259-AC-2016-67- ROCHE FARMACEUTICA,FALSE
MEDICAMENTOS VÁRIOS -P259- AC-2016-33 - JANSSEN - Ajuste Directo Nº 11199216,Ajuste Direto Regime Geral,Aquisição de bens móveis,"33000000-0, Equipamento médico, medicamentos e produtos para cuidados pessoais","Hospital Garcia de Orta, E. P. E. (506361470)","JANSSEN CILAG FARMACÊUTICA, LDA. (500189412)","0,00 €",28-03-2017,12-08-2016,365 dias,"Portugal, Setúbal, Almada",Artigo 258.º do Código dos Contratos Públicos,,,,,,2672018,MEDICAMENTOS VÁRIOS -P259- AC-2016-33 - JANSSEN,FALSE
SACOS DE SANGUE - Ajuste Directo Nº 2102057,Ajuste Direto Regime Geral,Aquisição de bens móveis,"33000000-0, Equipamento médico, medicamentos e produtos para cuidados pessoais","Hospital Garcia de Orta, E. P. E. (506361470)","WERFEN PORTUGAL, LDA (501086110)","123.000,00 €",27-03-2017,29-12-2016,365 dias,"Portugal, Setúbal, Almada","Artigo 20.º, n.º 1, alínea a) do Código dos Contratos Públicos",,,,,,Não aplicável.,Não aplicável.,FALSE
SACOS DE SANGUE - Ajuste Directo Nº 2102057,Ajuste Direto Regime Geral,Aquisição de bens móveis,"33000000-0, Equipamento médico, medicamentos e produtos para cuidados pessoais","Hospital Garcia de Orta, E. P. E. (506361470)",FRESENIUS KABI PHARMA PORTUGAL LDA (504293753),"8.523,00 €",27-03-2017,29-12-2016,365 dias,"Portugal, Setúbal, Almada","Artigo 20.º, n.º 1, alínea a) do Código dos Contratos Públicos",,,,,,Não aplicável.,Não aplicável.,FALSE
MAT. CLINICO DIVERSO - Ajuste Directo Nº 2402827,Ajuste Direto Regime Geral,Aquisição de bens móveis,"33000000-0, Equipamento médico, medicamentos e produtos para cuidados pessoais","Hospital Garcia de Orta, E. P. E. (506361470)","MOLNLYCKE HEALTH CARE COM PROD HOSPITALARES, LDA (511101066)","52.272,02 €",23-03-2017,02-02-2017,90 dias,"Portugal, Setúbal, Almada","Artigo 20.º, n.º 1, alínea a) do Código dos Contratos Públicos",,,,,,Não aplicável.,Não aplicável.,FALSE
PACK CATARATA C/ KIT PHACO - Ajuste Directo Nº 2403047,Ajuste Direto Regime Geral,Aquisição de bens móveis,"33000000-0, Equipamento médico, medicamentos e produtos para cuidados pessoais","Hospital Garcia de Orta, E. P. E. (506361470)",Bausch & Lomb (980218764),"8.496,00 €",23-03-2017,02-02-2017,90 dias,"Portugal, Setúbal, Almada","Artigo 20.º, n.º 1, alínea a) do Código dos Contratos Públicos",,,,,,Não aplicável.,Não aplicável.,FALSE
LIGADURAS / MALHAS / TALA / TUBO - Ajuste Directo Nº 2403277,Ajuste Direto Regime Geral,Aquisição de bens móveis,"33000000-0, Equipamento médico, medicamentos e produtos para cuidados pessoais","Hospital Garcia de Orta, E. P. E. (506361470)",Expomédica (501886621),"8.566,80 €",23-03-2017,26-01-2017,90 dias,"Portugal, Setúbal, Almada","Artigo 20.º, n.º 1, alínea a) do Código dos Contratos Públicos",,,,,,Não aplicável.,Não aplicável.,FALSE
MAT. DIVERSO  - Ajuste Directo Nº 2403387,Ajuste Direto Regime Geral,Aquisição de bens móveis,"33000000-0, Equipamento médico, medicamentos e produtos para cuidados pessoais","Hospital Garcia de Orta, E. P. E. (506361470)","LINEAMÉDICA-DISPOSITIVOS MÉDICOS-CIRUGICOS, SA (505148676)","29.418,52 €",23-03-2017,26-01-2017,180 dias,"Portugal, Setúbal, Almada","Artigo 20.º, n.º 1, alínea a) do Código dos Contratos Públicos",,,,,,Não aplicável.,Não aplicável.,FALSE
COMPRESSAS / LIGADURAS - Ajuste Directo Nº 2406327,Ajuste Direto Regime Geral,Aquisição de bens móveis,"33000000-0, Equipamento médico, medicamentos e produtos para cuidados pessoais","Hospital Garcia de Orta, E. P. E. (506361470)",Albino Dias de Andrade (500013810),"18.485,55 €",23-03-2017,06-02-2017,180 dias,"Portugal, Setúbal, Almada","Artigo 20.º, n.º 1, alínea a) do Código dos Contratos Públicos",,,,,,Não aplicável.,Não aplicável.,FALSE
PACK CATARATA  - Ajuste Directo Nº 2407407,Ajuste Direto Regime Geral,Aquisição de bens móveis,"33000000-0, Equipamento médico, medicamentos e produtos para cuidados pessoais","Hospital Garcia de Orta, E. P. E. (506361470)",ABBOTT MEDICAL OPTICS SPAIN S.L. (980262364),"15.360,00 €",23-03-2017,15-02-2017,120 dias,"Portugal, Setúbal, Almada","Artigo 24.º, n.º 1, alínea c) do Código dos Contratos Públicos",,,,,,Não aplicável.,Não aplicável.,FALSE
KIT PHACO OPO71 - Ajuste Directo Nº 2400247,Ajuste Direto Regime Geral,Aquisição de bens móveis,"33000000-0, Equipamento médico, medicamentos e produtos para cuidados pessoais","Hospital Garcia de Orta, E. P. E. (506361470)",ABBOTT MEDICAL OPTICS SPAIN S.L. (980262364),"16.800,00 €",23-03-2017,09-02-2017,120 dias,"Portugal, Setúbal, Almada","Artigo 24.º, n.º 1, alínea e) do Código dos Contratos Públicos",,,,,,Não aplicável.,Não aplicável.,FALSE
MAT. CLINICO DIVERSO  - Ajuste Directo Nº 2400337,Ajuste Direto Regime Geral,Aquisição de bens móveis,"33000000-0, Equipamento médico, medicamentos e produtos para cuidados pessoais","Hospital Garcia de Orta, E. P. E. (506361470)","SCA HYGIENE PRODUCTS, LDA. (503237612)","13.606,38 €",23-03-2017,26-01-2017,365 dias,"Portugal, Setúbal, Almada","Artigo 20.º, n.º 1, alínea a) do Código dos Contratos Públicos",,,,,,Não aplicável.,Não aplicável.,FALSE
CAMARAS EXP. C/MASCARA OPTICHAMBER AZUL - Ajuste Directo Nº 2410237,Ajuste Direto Regime Geral,Aquisição de bens móveis,"33000000-0, Equipamento médico, medicamentos e produtos para cuidados pessoais","Hospital Garcia de Orta, E. P. E. (506361470)","TEPREL- Equipamentos Médicos, ldª. (502262184)","10.680,00 €",23-03-2017,13-03-2017,180 dias,"Portugal, Setúbal, Almada","Artigo 20.º, n.º 1, alínea a) do Código dos Contratos Públicos",,,,,,Não aplicável.,Não aplicável.,FALSE
COMPRESSAS / LIGADURAS - Ajuste Directo Nº 2410037,Ajuste Direto Regime Geral,Aquisição de bens móveis,"33000000-0, Equipamento médico, medicamentos e produtos para cuidados pessoais","Hospital Garcia de Orta, E. P. E. (506361470)",Albino Dias de Andrade (500013810),"25.099,60 €",23-03-2017,13-03-2017,180 dias,"Portugal, Setúbal, Almada","Artigo 20.º, n.º 1, alínea a) do Código dos Contratos Públicos",,,,,,Não aplicável.,Não aplicável.,FALSE
SOLUÇÕES DIÁLISE PERITONEAL ( DPCA - BAXTER - FEVEREIRO 2017 ) - Ajuste Directo Nº 14079617,Ajuste Direto Regime Geral,Aquisição de bens móveis,"33000000-0, Equipamento médico, medicamentos e produtos para cuidados pessoais","Hospital Garcia de Orta, E. P. E. (506361470)","BAXTER MEDICO - FARMACEUTICO, LDA (503347345)","35.680,40 €",23-03-2017,17-03-2017,365 dias,"Portugal, Setúbal, Almada","Artigo 24.º, n.º 1, alínea e) do Código dos Contratos Públicos",,,,,,Não aplicável.,Não aplicável.,FALSE
IMATINIB's. P259-AC-2017-24 - Ajuste Directo Nº 11053517,Ao abrigo de acordo-quadro (art.º 259.º),Aquisição de bens móveis,"33000000-0, Equipamento médico, medicamentos e produtos para cuidados pessoais","Hospital Garcia de Orta, E. P. E. (506361470)","NOVARTIS FARMA-PROD.FARMACÊUTICOS,SA.              (500063524)","13.839,06 €",23-03-2017,17-02-2017,365 dias,"Portugal, Setúbal, Almada",Artigo 259.º do Código dos Contratos Públicos,,,,,,1771819,CP 2015/6 - Acordo quadro para o fornecimento de Medicamentos do Foro Oncológico,FALSE
AQUISIÇÃO DE MATERIAL ELÉCTRICO PARA INSTALAÇÃO DA UCA - PISO 0 - Aj. Directo Nº 79100257,Ajuste Direto Regime Geral,Aquisição de bens móveis,"31220000-4, Componentes de circuitos eléctricos","Hospital Garcia de Orta, E. P. E. (506361470)","Henvi - Equipamentos Industriais, Ldª. (500918503)","22.888,82 €",22-03-2017,15-03-2017,180 dias,"Portugal, Setúbal, Almada","Artigo 20.º, n.º 1, alínea a) do Código dos Contratos Públicos",,,,,,Não aplicável.,Não aplicável.,FALSE
FORNECIMENTO E MONTAGEM DE 2 DISJUNTORES DE 4.000A E SUBSTITUIÇÃO - Aj. Directo Nº 7400417,Ajuste Direto Regime Geral,Aquisição de bens móveis,"31220000-4, Componentes de circuitos eléctricos","Hospital Garcia de Orta, E. P. E. (506361470)","ATM - ASSIST. TOTAL EM MANUTENÇÃO, S.A. (502700823)","66.230,00 €",22-03-2017,30-01-2017,30 dias,"Portugal, Setúbal, Almada","Artigo 24.º, n.º 1, alínea c) do Código dos Contratos Públicos",,,,,,Não aplicável.,Não aplicável.,FALSE
AQUISIÇÃO DE  VENTILOCONVECTORES PARA GABINETES / SALA DA NOVA UCA - Aj. Directo Nº 7400457,Ajuste Direto Regime Geral,Aquisição de bens móveis,"39714100-1, Ventiladores","Hospital Garcia de Orta, E. P. E. (506361470)","ATM - Assistência Total em Manutenção, S.A. (502700823)","5.930,00 €",22-03-2017,03-03-2017,90 dias,"Portugal, Setúbal, Almada","Artigo 20.º, n.º 1, alínea a) do Código dos Contratos Públicos",,,,,,Não aplicável.,Não aplicável.,FALSE
AQUISIÇÃO DE 2 MONITORES CARDIO-RESPIRATÓRIOS PHILIPS EFFICIA CM120 - Aj. Directo Nº 7400337,Ajuste Direto Regime Geral,Aquisição de bens móveis,"33100000-1, Equipamento médico","Hospital Garcia de Orta, E. P. E. (506361470)","PHILIPS PORTUGUESA, SA (500216843)","10.000,00 €",22-03-2017,08-02-2017,90 dias,"Portugal, Setúbal, Almada","Artigo 20.º, n.º 1, alínea a) do Código dos Contratos Públicos",,,,,,Não aplicável.,Não aplicável.,FALSE
AQUISIÇÂO DE NASOLARINGOVIDEOSCÓPIO FLEXÍVEL  DE ALTA DEFINIÇÃO CMOS COM LUZ LED PENTAX -  Aj. Directo Nº 7400047,Ajuste Direto Regime Geral,Aquisição de bens móveis,"33100000-1, Equipamento médico","Hospital Garcia de Orta, E. P. E. (506361470)",SIMMEDICA SISTEMAS INTEGRALES (980488842),"7.550,00 €",22-03-2017,27-02-2017,90 dias,"Portugal, Setúbal, Almada","Artigo 20.º, n.º 1, alínea a) do Código dos Contratos Públicos",,,,,,Não aplicável.,Não aplicável.,FALSE
AQUISIÇÂO ACESSO A PLATAFORMA CLINICALKEY - Aj. Directo Nº 7500017,Ajuste Direto Regime Geral,Aquisição de bens móveis,"48000000-8, Pacotes de software e sistemas de informação","Hospital Garcia de Orta, E. P. E. (506361470)","Lusodoc - Documentação Técnico-Cientifica, Lda. (502609982)","38.568,96 €",22-03-2017,29-12-2016,365 dias,"Portugal, Setúbal, Almada","Artigo 24.º, n.º 1, alínea e) do Código dos Contratos Públicos",,,,,,Não aplicável.,Não aplicável.,FALSE
AMBRISENTANO 10 MG COMP - Ajuste Directo Nº 11060417,Ajuste Direto Regime Geral,Aquisição de bens móveis,"33000000-0, Equipamento médico, medicamentos e produtos para cuidados pessoais","Hospital Garcia de Orta, E. P. E. (506361470)",Glaxosmithkline - Produtos Farmacêuticos (500139962),"0,00 €",22-03-2017,06-03-2017,90 dias,"Portugal, Setúbal, Almada",Artigo 258.º do Código dos Contratos Públicos,,,,,,2661880,AMBRISENTANO 10 MG COMP,FALSE
DOLUTEGRAVIR 50 MG + ABACAVIR 600 MG + LAMIVUDINA 300 MG COMP - Ajuste Directo Nº 14070817,Ajuste Direto Regime Geral,Aquisição de bens móveis,"33000000-0, Equipamento médico, medicamentos e produtos para cuidados pessoais","Hospital Garcia de Orta, E. P. E. (506361470)","VIIVHIV HEALTHCARE, UNIPESSOAL. LDA                (509117961)","67.200,12 €",22-03-2017,16-03-2017,90 dias,"Portugal, Setúbal, Almada","Artigo 24.º, n.º 1, alínea e) do Código dos Contratos Públicos",,,,,,Não aplicável.,Não aplicável.,FALSE
DARUNAVIR 800 MG COMP - Ajuste Directo Nº 11070917,Ao abrigo de acordo-quadro (art.º 259.º),Aquisição de bens móveis,"33000000-0, Equipamento médico, medicamentos e produtos para cuidados pessoais","Hospital Garcia de Orta, E. P. E. (506361470)","JANSSEN-CILAG FARMACEUTICA, LDA (500189412)","112.732,80 €",22-03-2017,16-03-2017,180 dias,"Portugal, Setúbal, Almada",Artigo 259.º do Código dos Contratos Públicos,,,,,,2183729,Medicamentos antirretrovíricos para o tratamento da infeção por VIH,FALSE
SISTEMA P/ ADMINISTRACAO MULTIPLA DE FARMACOS (CITOSTATICOS) - Ajuste Directo Nº 2410347,Ajuste Direto Regime Geral,Aquisição de bens móveis,"33000000-0, Equipamento médico, medicamentos e produtos para cuidados pessoais","Hospital Garcia de Orta, E. P. E. (506361470)","Codan 11, S.A (504923471)","6.216,00 €",22-03-2017,17-03-2017,365 dias,"Portugal, Setúbal, Almada","Artigo 20.º, n.º 1, alínea a) do Código dos Contratos Públicos",,,,,,Não aplicável.,Não aplicável.,FALSE
AQUISIÇÃO DE ELECTRODOS - Ajuste Directo 2400957,Ajuste Direto Regime Geral,Aquisição de bens móveis,"33000000-0, Equipamento médico, medicamentos e produtos para cuidados pessoais","Hospital Garcia de Orta, E. P. E. (506361470)",MEDTRONIC PORTUGAL LDA (504223933),"39.416,75 €",22-03-2017,13-01-2017,365 dias,"Portugal, Setúbal, Almada","Artigo 20.º, n.º 1, alínea a) do Código dos Contratos Públicos",,,,,,Não aplicável.,Não aplicável.,FALSE
KIT DETECCAO DE HPV - Ajuste Directo Nº 1302037,Ajuste Direto Regime Geral,Aquisição de bens móveis,"33000000-0, Equipamento médico, medicamentos e produtos para cuidados pessoais","Hospital Garcia de Orta, E. P. E. (506361470)",ROCHE SISTEMA DE DIAGNOSTICOS                      (504282921),"7.560,00 €",22-03-2017,13-03-2017,90 dias,"Portugal, Setúbal, Almada","Artigo 24.º, n.º 1, alínea e) do Código dos Contratos Públicos",,,,,,Não aplicável.,Não aplicável.,FALSE
REAGENTES ( OSNA LYNORHAG ) - Ajuste Directo Nº 1302377,Ajuste Direto Regime Geral,Aquisição de bens móveis,"33000000-0, Equipamento médico, medicamentos e produtos para cuidados pessoais","Hospital Garcia de Orta, E. P. E. (506361470)",SYSMEX ESPANÃ S.L. (B64928948e),"7.001,70 €",22-03-2017,13-03-2017,365 dias,"Portugal, Setúbal, Almada","Artigo 24.º, n.º 1, alínea e) do Código dos Contratos Públicos",,,,,,Não aplicável.,Não aplicável.,FALSE
GASES MEDICINAIS - Ajuste Directo Nº 1502557,Ajuste Direto Regime Geral,Aquisição de bens móveis,"33000000-0, Equipamento médico, medicamentos e produtos para cuidados pessoais","Hospital Garcia de Orta, E. P. E. (506361470)","Praxair Portugal Gases, S.A. (501738916)","36.235,35 €",21-03-2017,10-03-2017,365 dias,"Portugal, Setúbal, Almada<BR/>Portugal","Artigo 24.º, n.º 1, alínea e) do Código dos Contratos Públicos",,,,,,Não aplicável.,Não aplicável.,FALSE
REAGENTES - Ajuste Directo Nº 1501837,Ajuste Direto Regime Geral,Aquisição de bens móveis,"33000000-0, Equipamento médico, medicamentos e produtos para cuidados pessoais","Hospital Garcia de Orta, E. P. E. (506361470)",ROCHE SISTEMA DE DIAGNOSTICOS                      (504282921),"5.089,40 €",21-03-2017,15-02-2017,90 dias,"Portugal, Setúbal, Almada","Artigo 24.º, n.º 1, alínea e) do Código dos Contratos Públicos",,,,,,Não aplicável.,Não aplicável.,FALSE
REAGENTES - Ajuste Directo Nº 1501517,Ajuste Direto Regime Geral,Aquisição de bens móveis,"33000000-0, Equipamento médico, medicamentos e produtos para cuidados pessoais","Hospital Garcia de Orta, E. P. E. (506361470)",Bio-Rad Laboratories (501301321),"6.369,00 €",21-03-2017,10-02-2017,365 dias,"Portugal, Setúbal, Almada","Artigo 24.º, n.º 1, alínea e) do Código dos Contratos Públicos",,,,,,Não aplicável.,Não aplicável.,FALSE
GASES MECICINAIS - JANEIRO 2017 - Ajuste Directo Nº 1501407,Ajuste Direto Regime Geral,Aquisição de bens móveis,"33000000-0, Equipamento médico, medicamentos e produtos para cuidados pessoais","Hospital Garcia de Orta, E. P. E. (506361470)","Praxair Portugal Gases, S.A. (501738916)","41.106,68 €",21-03-2017,03-02-2017,365 dias,"Portugal, Setúbal, Almada","Artigo 24.º, n.º 1, alínea e) do Código dos Contratos Públicos",,,,,,Não aplicável.,Não aplicável.,FALSE
REAGENTES - Ajuste Directo Nº 1301377,Ajuste Direto Regime Geral,Aquisição de bens móveis,"33000000-0, Equipamento médico, medicamentos e produtos para cuidados pessoais","Hospital Garcia de Orta, E. P. E. (506361470)","Roche Sistemas de Diagnóstico, Lda (504282921)","6.529,00 €",21-03-2017,06-02-2017,90 dias,"Portugal, Setúbal, Almada","Artigo 24.º, n.º 1, alínea e) do Código dos Contratos Públicos",,,,,,Não aplicável.,Não aplicável.,FALSE
REAGENTES - Ajuste Directo Nº 1500567,Ajuste Direto Regime Geral,Aquisição de bens móveis,"33000000-0, Equipamento médico, medicamentos e produtos para cuidados pessoais","Hospital Garcia de Orta, E. P. E. (506361470)","Roche Sistemas de Diagnóstico, Lda (504282921)","6.005,00 €",21-03-2017,11-01-2017,90 dias,"Portugal, Setúbal, Almada","Artigo 24.º, n.º 1, alínea e) do Código dos Contratos Públicos",,,,,,Não aplicável.,Não aplicável.,FALSE
REAGENTES PARA INFLUENZA E RSV ( KIT FLU/RSV/10 ) - Ajuste Directo Nº 1500377,Ajuste Direto Regime Geral,Aquisição de bens móveis,"33000000-0, Equipamento médico, medicamentos e produtos para cuidados pessoais","Hospital Garcia de Orta, E. P. E. (506361470)","WERFEN PORTUGAL, LDA (501086110)","50.000,00 €",21-03-2017,12-01-2017,90 dias,"Portugal, Setúbal, Almada","Artigo 24.º, n.º 1, alínea e) do Código dos Contratos Públicos",,,,,,Não aplicável.,Não aplicável.,FALSE
REAGENTES - Ajuste Directo Nº 1500227,Ajuste Direto Regime Geral,Aquisição de bens móveis,"33000000-0, Equipamento médico, medicamentos e produtos para cuidados pessoais","Hospital Garcia de Orta, E. P. E. (506361470)","Bio-Rad Laboratories, Lda (501301321)","6.682,70 €",21-03-2017,05-01-2017,365 dias,"Portugal, Setúbal, Almada","Artigo 24.º, n.º 1, alínea e) do Código dos Contratos Públicos",,,,,,Não aplicável.,Não aplicável.,FALSE
