Objeto do Contrato,Tipo de Procedimento,Tipo(s) de Contrato,CPVs,Entidade(s) Adjudicante(s),Entidade(s) Adjudicatária(s),Preço Contratual,Data de Publicação,Data de Celebração do Contrato,Prazo de Execução,Local de Execução,Fundamentação,Data de Fecho do Contrato,Preço Total Efetivo,Causas das Alterações ao Prazo,Causas das Alterações ao Preço,Estado,N.º registo do Acordo Quadro,Descrição do Acordo Quadro,Procedimento Centralizado
Aquisição de Salbutamol 100 mcg/dose Susp. Pressu. Inal.,Ao abrigo de acordo-quadro (art.º 259.º),Aquisição de bens móveis,"33690000-3, Medicamentos vários","Administração Regional de Saúde de Lisboa e Vale do Tejo, I. P. (503148776)","Glaxo SmithKline - Produtos Farmacêuticos, Lda (500139962)","1.768,50 €",26-04-2018,14-02-2018,320 dias,"Portugal, Lisboa, Lisboa",Artigo 259.º do Código dos Contratos Públicos,,,,,,1638654,CP 2015/12 - Acordo quadro para fornecimento de Medicamentos do Aparelho Respiratório às Instituições e Serviços do Serviço Nacional de Saúde,FALSE
Aquisição de metoclopramida 10mg/2ml,Ao abrigo de acordo-quadro (art.º 259.º),Aquisição de bens móveis,"33690000-3, Medicamentos vários","Administração Regional de Saúde de Lisboa e Vale do Tejo, I. P. (503148776)","Labesfal - Laboratórios Almiro, S.A. (501169580)","2.190,00 €",26-04-2018,16-02-2018,318 dias,"Portugal, Lisboa, Lisboa",Artigo 259.º do Código dos Contratos Públicos,,,,,,2528670,"CP 2017/2 - Acordo Quadro para fornecimento de Medicamentos do Sistema Nervoso Cerebrospinal, exceto: anestésicos, relaxantes musculares, analgésicos, antipiréticos, antidepressivos e antipsicóticos  às Instituições e Serviços do Serviço Nacional de Saúde",FALSE
Aquisição de paracetamol 40mg/ml xarope,Ao abrigo de acordo-quadro (art.º 259.º),Aquisição de bens móveis,"33690000-3, Medicamentos vários","Administração Regional de Saúde de Lisboa e Vale do Tejo, I. P. (503148776)",OverPharma (505792362),"635,00 €",26-04-2018,23-01-2018,342 dias,"Portugal, Lisboa, Lisboa",Artigo 259.º do Código dos Contratos Públicos,,,,,,1974985,"Medicamentos Analgésicos, Antipiréticos e Antidepressivos",FALSE
Aquisição de comprimidos claritromicina 500mg,Ao abrigo de acordo-quadro (art.º 259.º),Aquisição de bens móveis,"33690000-3, Medicamentos vários","Administração Regional de Saúde de Lisboa e Vale do Tejo, I. P. (503148776)","GENERIS-FARMACEUTICA, S.A. (508107997)","5.702,40 €",26-04-2018,23-01-2018,342 dias,"Portugal, Lisboa, Lisboa",Artigo 259.º do Código dos Contratos Públicos,,,,,,1326195,ACORDO QUADRO PARA FORNECIMENTO DE MEDICAMENTOS ANTI-INFECIOSOS: EXCETO ANTIVÍRICOS E ANTIFÚNGICOS ÀS INSTITUIÇÕES E SERVIÇOS DO SERVIÇO NACIONAL DE SAÚDE,FALSE
Aquisição de metamizol magnésio 2g/5ml sol. inj. IM,Ao abrigo de acordo-quadro (art.º 259.º),Aquisição de bens móveis,"33690000-3, Medicamentos vários","Administração Regional de Saúde de Lisboa e Vale do Tejo, I. P. (503148776)","UNILFARMA, LDA (500293023)","4.480,00 €",26-04-2018,29-01-2018,336 dias,"Portugal, Lisboa, Lisboa",Artigo 259.º do Código dos Contratos Públicos,,,,,,1974985,"Medicamentos Analgésicos, Antipiréticos e Antidepressivos",FALSE
"Aquisição de serviços médicos sem especialidade para a ARSLVT, IP",Ajuste Direto Regime Geral,Aquisição de serviços,"90910000-9, Serviços de limpeza","Administração Regional de Saúde de Lisboa e Vale do Tejo, I. P. (503148776)",Galina Munteanu (240023102),"17.600,00 €",26-04-2018,12-04-2018,306 dias,"Portugal, Santarém","Artigo 20.º, n.º 1, alínea a) do Código dos Contratos Públicos",,,,,,Não aplicável.,Não aplicável.,FALSE
Aquisição de comprimidos paracetamol 500mg,Ao abrigo de acordo-quadro (art.º 259.º),Aquisição de bens móveis,"33690000-3, Medicamentos vários","Administração Regional de Saúde de Lisboa e Vale do Tejo, I. P. (503148776)",OverPharma (505792362),"630,00 €",26-04-2018,23-01-2018,342 dias,"Portugal, Lisboa, Lisboa",Artigo 259.º do Código dos Contratos Públicos,,,,,,1974985,"Medicamentos Analgésicos, Antipiréticos e Antidepressivos",FALSE
"Aquisição de mepivacaina 36 mg + adrenalina 18mcg 1,8 inj.",Ao abrigo de acordo-quadro (art.º 259.º),Aquisição de bens móveis,"33690000-3, Medicamentos vários","Administração Regional de Saúde de Lisboa e Vale do Tejo, I. P. (503148776)","INIBSA PORTUGUESA QUIM. FAR.,L (500139571)","4.312,00 €",26-04-2018,31-01-2018,334 dias,"Portugal, Lisboa, Lisboa",Artigo 259.º do Código dos Contratos Públicos,,,,,,3053200,"CP 2017/64 - Acordo Quadro para fornecimento de Medicamentos Diversos, às Instituições e Serviços do Serviço Nacional de Saúde",FALSE
"Aquisição de serviços médicos sem especialidade para a ARSLVT, IP",Ajuste Direto Regime Geral,Aquisição de serviços,"90910000-9, Serviços de limpeza","Administração Regional de Saúde de Lisboa e Vale do Tejo, I. P. (503148776)",Yudyd Jorge Dominguez (278157475),"41.600,00 €",26-04-2018,10-04-2018,365 dias,"Portugal, Santarém","Artigo 20.º, n.º 1, alínea a) do Código dos Contratos Públicos",,,,,,Não aplicável.,Não aplicável.,FALSE
Aquisição de tramadol 100mg/2ml,Ao abrigo de acordo-quadro (art.º 259.º),Aquisição de bens móveis,"33690000-3, Medicamentos vários","Administração Regional de Saúde de Lisboa e Vale do Tejo, I. P. (503148776)","Labesfal - Laboratórios Almiro, S.A. (501169580)","408,00 €",26-04-2018,30-01-2018,335 dias,"Portugal, Lisboa, Lisboa",Artigo 259.º do Código dos Contratos Públicos,,,,,,1974985,"Medicamentos Analgésicos, Antipiréticos e Antidepressivos",FALSE
"Aquisição de serviços médicos sem especialidade para a ARSLVT, IP",Ajuste Direto Regime Geral,Aquisição de serviços,"90910000-9, Serviços de limpeza","Administração Regional de Saúde de Lisboa e Vale do Tejo, I. P. (503148776)",Yusimi Suarez del Villar Sanchez (284040231),"17.600,00 €",26-04-2018,11-04-2018,306 dias,"Portugal, Santarém","Artigo 20.º, n.º 1, alínea a) do Código dos Contratos Públicos",,,,,,Não aplicável.,Não aplicável.,FALSE
Aquisição de vacina contra o tétano e difteria,Ao abrigo de acordo-quadro (art.º 259.º),Aquisição de bens móveis,"33651600-4, Vacinas","Administração Regional de Saúde de Lisboa e Vale do Tejo, I. P. (503148776)","Sanofi Produtos Farmaceuticos, Lda (500134960)","437.000,00 €",23-04-2018,05-04-2018,365 dias,"Portugal, Lisboa",Artigo 259.º do Código dos Contratos Públicos,,,,,,2327827,CP 2016/13-A - Acordo Quadro para fornecimento de Vacinas e Tuberculinas - Parte II,FALSE
Aquisição de vacina contra sarampo parotidite e rubéola,Ao abrigo de acordo-quadro (art.º 259.º),Aquisição de bens móveis,"33651600-4, Vacinas","Administração Regional de Saúde de Lisboa e Vale do Tejo, I. P. (503148776)","Merck Sharp & Dohme, Lda (500191360)","1.134.000,00 €",23-04-2018,04-04-2018,365 dias,"Portugal, Lisboa",Artigo 259.º do Código dos Contratos Públicos,,,,,,2327827,CP 2016/13-A - Acordo Quadro para fornecimento de Vacinas e Tuberculinas - Parte II,FALSE
"Aquisição de vacina hexavalente contra difteria, tétano, pert. HIB, VIP e VHB (UDOSE) - V133",Ao abrigo de acordo-quadro (art.º 259.º),Aquisição de bens móveis,"33651600-4, Vacinas","Administração Regional de Saúde de Lisboa e Vale do Tejo, I. P. (503148776)","GLAXOSMITHKLINE PRODUTOS FARMACEUTICOS, LDA (500139962)","1.516.710,00 €",23-04-2018,05-04-2018,365 dias,"Portugal, Lisboa",Artigo 259.º do Código dos Contratos Públicos,,,,,,2327827,CP 2016/13-A - Acordo Quadro para fornecimento de Vacinas e Tuberculinas - Parte II,FALSE
"Aquisição de vacina tetravalente contra Difteria, Tetano, Pert. e VIP (UDOSE) - V127",Ao abrigo de acordo-quadro (art.º 259.º),Aquisição de bens móveis,"33651600-4, Vacinas","Administração Regional de Saúde de Lisboa e Vale do Tejo, I. P. (503148776)","Sanofi Produtos Farmaceuticos, Lda (500134960)","675.000,00 €",23-04-2018,05-04-2018,365 dias,"Portugal, Lisboa",Artigo 259.º do Código dos Contratos Públicos,,,,,,2327827,CP 2016/13-A - Acordo Quadro para fornecimento de Vacinas e Tuberculinas - Parte II,FALSE
Fornecimento de comunicações móveis,Ajuste Direto Regime Geral,Aquisição de serviços,"64200000-8, Serviços de telecomunicações","Administração Regional de Saúde de Lisboa e Vale do Tejo, I. P. (503148776)","MEO - Serviços de Comunicações, SA (504615947)","9.971,80 €",23-04-2018,19-03-2018,31 dias,"Portugal, Lisboa","Artigo 21.º, n.º 1, alínea c) do Código dos Contratos Públicos",,,,,,Não aplicável.,Não aplicável.,FALSE
