freguesia,acronym,validVotesPercentage,votes,dicofre
Ribas,PPD/PSD,50.75,236,030518
Ribas,PS,31.4,146,030518
Ribas,CDS-PP,4.3,20,030518
Ribas,B.E.,3.66,17,030518
Ribas,PCP-PEV,2.58,12,030518
Ribas,CH,2.15,10,030518
Ribas,R.I.R.,1.94,9,030518
Ribas,PAN,0.86,4,030518
Ribas,IL,0.65,3,030518
Ribas,L,0.43,2,030518
Ribas,MAS,0.43,2,030518
Ribas,NC,0.43,2,030518
Ribas,MPT,0.22,1,030518
Ribas,PTP,0.22,1,030518
Ribas,A,0,0,030518
Ribas,JPP,0,0,030518
Ribas,PCTP/MRPP,0,0,030518
Ribas,PDR,0,0,030518
Ribas,PNR,0,0,030518
Ribas,PPM,0,0,030518
Ribas,PURP,0,0,030518
