Objeto do Contrato,Tipo de Procedimento,Tipo(s) de Contrato,CPVs,Entidade(s) Adjudicante(s),Entidade(s) Adjudicatária(s),Preço Contratual,Data de Publicação,Data de Celebração do Contrato,Prazo de Execução,Local de Execução,Fundamentação,Data de Fecho do Contrato,Preço Total Efetivo,Causas das Alterações ao Prazo,Causas das Alterações ao Preço,Estado,N.º registo do Acordo Quadro,Descrição do Acordo Quadro,Procedimento Centralizado
Aquisição de Serviços Médicos de Clinica Geral - Março 2014,Ajuste Direto Regime Geral,Aquisição de serviços,"85000000-9, Serviços de saúde e acção social",Centro Hospitalar Psiquiátrico de Lisboa (508338476),"Cruz Cunha Ramos, Unipessoal, Lda. (509777520)","1.472,09 €",08-08-2014,27-02-2014,31 dias,"Portugal, Lisboa, Lisboa","Artigo 24.º, n.º 1, alínea c) do Código dos Contratos Públicos",28-03-2014,"1.472,09 €",,,,Não aplicável.,Não aplicável.,FALSE
Aquisição de Serviços Médicos de Clinica Geral - Fevereiro 2014,Ajuste Direto Regime Geral,Aquisição de serviços,"85000000-9, Serviços de saúde e acção social",Centro Hospitalar Psiquiátrico de Lisboa (508338476),"Cruz Cunha Ramos, Unipessoal, Lda. (509777520)","1.472,09 €",08-08-2014,07-02-2014,28 dias,"Portugal, Lisboa, Lisboa","Artigo 24.º, n.º 1, alínea c) do Código dos Contratos Públicos",28-02-2014,"1.472,09 €",,,,Não aplicável.,Não aplicável.,FALSE
Aquisição de Serviços Médicos de Clinica Geral - Janeiro 2014,Ajuste Direto Regime Geral,Aquisição de serviços,"85000000-9, Serviços de saúde e acção social",Centro Hospitalar Psiquiátrico de Lisboa (508338476),"Cruz Cunha Ramos, Unipessoal, Lda. (509777520)","1.472,09 €",08-08-2014,31-01-2014,31 dias,"Portugal, Lisboa, Lisboa","Artigo 24.º, n.º 1, alínea c) do Código dos Contratos Públicos",31-01-2014,"1.472,09 €",,,,Não aplicável.,Não aplicável.,FALSE
Aquisição de Serviços Medicos de Clínica Geral - Ano 2013,Ajuste Direto Regime Geral,Aquisição de serviços,"85000000-9, Serviços de saúde e acção social",Centro Hospitalar Psiquiátrico de Lisboa (508338476),"Cruz Cunha Ramos, Unipessoal, Lda (509777520)","4.871,25 €",13-03-2014,28-10-2013,91 dias,"Portugal, Lisboa, Lisboa",Artigo 258.º do Código dos Contratos Públicos,31-12-2013,"4.871,25 €",,,,1179369,680008/2013 - Aquisição de Serviços Medicos de Clínica Geral - Ano 2013,FALSE
Serviços de Médica de Clínica Geral - Setembro 2013,Ajuste Direto Regime Geral,Aquisição de serviços,"85000000-9, Serviços de saúde e acção social",Centro Hospitalar Psiquiatrico de Lisboa (508338476),"Cruz Cunha Ramos, Unipessoal, Lda (509777520)","1.623,75 €",14-10-2013,06-09-2013,22 dias,"Portugal, Lisboa, Lisboa","Artigo 24.º, n.º 1, alínea c) do Código dos Contratos Públicos",06-09-2013,"1.623,75 €",,,,Não aplicável.,Não aplicável.,
Aquisição de Serviços de Médico de Clinica Geral - Agosto 2013,Ajuste Direto Regime Geral,Aquisição de serviços,"85000000-9, Serviços de saúde e acção social",Centro Hospitalar Psiquiatrico de Lisboa (508338476),"Cruz Cunha Ramos, Unipessoal, Lda (509777520)","1.623,75 €",06-09-2013,01-08-2013,31 dias,"Portugal, Lisboa, Lisboa","Artigo 24.º, n.º 1, alínea c) do Código dos Contratos Públicos",30-08-2013,"1.623,75 €",,,,Não aplicável.,Não aplicável.,
Serviços Médicos de Clinica Geral (Irene Prayce) - Julho 2013,Ajuste Direto Regime Geral,Aquisição de serviços,"85000000-9, Serviços de saúde e acção social",Centro Hospitalar Psiquiatrico de Lisboa (508338476),"Cruz Cunha Ramos - Unipessoal, Lda (509777520)","1.623,75 €",27-08-2013,05-07-2013,31 dias,"Portugal, Lisboa, Lisboa","Artigo 24.º, n.º 1, alínea c) do Código dos Contratos Públicos",31-07-2013,"1.623,75 €",,,,Não aplicável.,Não aplicável.,
48034613-Aquisição de serviços médicos de clinica geral - Mês de Maio/2013,Ajuste Direto Regime Geral,Aquisição de serviços,"85000000-9, Serviços de saúde e acção social",Centro Hospitalar Psiquiatrico de Lisboa (508338476),"Cruz Cunha Ramos, Unipessoal, LDA (509777520)","1.500,00 €",25-06-2013,28-05-2013,31 dias,"Portugal, Lisboa, Lisboa","Artigo 20.º, n.º 1, alínea a) do Código dos Contratos Públicos",31-05-2013,"1.500,00 €",,,,Não aplicável.,Não aplicável.,
