freguesia,acronym,validVotesPercentage,votes,dicofre
Paçô,PPD/PSD,40.83,178,160124
Paçô,PS,40.37,176,160124
Paçô,B.E.,6.19,27,160124
Paçô,CDS-PP,5.73,25,160124
Paçô,PCP-PEV,2.29,10,160124
Paçô,PAN,1.83,8,160124
Paçô,R.I.R.,0.69,3,160124
Paçô,CH,0.46,2,160124
Paçô,IL,0.46,2,160124
Paçô,A,0.23,1,160124
Paçô,L,0.23,1,160124
Paçô,NC,0.23,1,160124
Paçô,PDR,0.23,1,160124
Paçô,PPM,0.23,1,160124
Paçô,JPP,0,0,160124
Paçô,MPT,0,0,160124
Paçô,PCTP/MRPP,0,0,160124
Paçô,PNR,0,0,160124
Paçô,PTP,0,0,160124
Paçô,PURP,0,0,160124
