Objeto do Contrato,Tipo de Procedimento,Tipo(s) de Contrato,CPVs,Entidade(s) Adjudicante(s),Entidade(s) Adjudicatária(s),Preço Contratual,Data de Publicação,Data de Celebração do Contrato,Prazo de Execução,Local de Execução,Fundamentação,Data de Fecho do Contrato,Preço Total Efetivo,Causas das Alterações ao Prazo,Causas das Alterações ao Preço,Estado,N.º registo do Acordo Quadro,Descrição do Acordo Quadro,Procedimento Centralizado
Processo N.º 13800005. Obras de conservação na sede do ACES Cova da Beira,Ajuste Direto Regime Geral,Empreitadas de obras públicas,"45000000-7, Construção","Administração Regional de Saúde do Centro, I.P. (503122165)",Construções Pais dos Santos (503880817),"24.479,40 €",29-07-2013,16-05-2013,30 dias,"Portugal, Castelo Branco, Castelo Branco","Artigo 19.º, alínea a) do Código dos Contratos Públicos",,,,,,Não aplicável.,Não aplicável.,
Processo N.º 13800003. ACES Baixo Vouga. USF João Semana em Ovar. Obras de conservação,Ajuste Direto Regime Geral,Empreitadas de obras públicas,"45000000-7, Construção","Administração Regional de Saúde do Centro, I.P. (503122165)",Irmãos Vieira Azevedo (504534203),"11.645,00 €",23-07-2013,21-03-2013,30 dias,"Portugal, Porto, Vila Nova de Gaia","Artigo 19.º, alínea a) do Código dos Contratos Públicos",,,,,,Não aplicável.,Não aplicável.,
Aquisição de reagentes p/ o CDP Coimbra,Ajuste Direto Regime Geral,Aquisição de bens móveis,"33696500-0, Reagentes de laboratório","Administração Regional de Saúde do Centro, I.P. (503122165)","Quilaban - Quimica Laboratorial Analítica, Lda (500399670)","24.305,52 €",22-07-2013,08-07-2013,180 dias,"Portugal, Coimbra, Coimbra","Artigo 20.º, n.º 1, alínea a) do Código dos Contratos Públicos",,,,,,Não aplicável.,Não aplicável.,
