freguesia,acronym,validVotesPercentage,votes,dicofre
Rio de Loba,PPD/PSD,38.3,1598,182323
Rio de Loba,PS,30.47,1271,182323
Rio de Loba,B.E.,11.55,482,182323
Rio de Loba,CDS-PP,6.57,274,182323
Rio de Loba,PAN,3.24,135,182323
Rio de Loba,PCP-PEV,2.61,109,182323
Rio de Loba,CH,1.53,64,182323
Rio de Loba,A,1.39,58,182323
Rio de Loba,IL,1.2,50,182323
Rio de Loba,L,0.84,35,182323
Rio de Loba,R.I.R.,0.58,24,182323
Rio de Loba,NC,0.36,15,182323
Rio de Loba,MPT,0.29,12,182323
Rio de Loba,PCTP/MRPP,0.26,11,182323
Rio de Loba,PURP,0.24,10,182323
Rio de Loba,PDR,0.22,9,182323
Rio de Loba,JPP,0.12,5,182323
Rio de Loba,PNR,0.1,4,182323
Rio de Loba,PTP,0.1,4,182323
Rio de Loba,PPM,0.05,2,182323
