Objeto do Contrato,Tipo de Procedimento,Tipo(s) de Contrato,CPVs,Entidade(s) Adjudicante(s),Entidade(s) Adjudicatária(s),Preço Contratual,Data de Publicação,Data de Celebração do Contrato,Prazo de Execução,Local de Execução,Fundamentação,Data de Fecho do Contrato,Preço Total Efetivo,Causas das Alterações ao Prazo,Causas das Alterações ao Preço,Estado,N.º registo do Acordo Quadro,Descrição do Acordo Quadro,Procedimento Centralizado
Aquisição de serviços de outsourcing na área de apoio,Ajuste Direto Regime Geral,Aquisição de serviços,"79500000-9, Serviços auxiliares de escritório","Serviços Partilhados do Ministério da Saúde, E. P. E. (509540716)","RH Portugal Consultores em Investimentos Humanos, Lda. (503461245)","26.416,00 €",21-10-2014,11-09-2014,365 dias,"Portugal, Lisboa, Lisboa","Artigo 20.º, n.º 1, alínea a) do Código dos Contratos Públicos",31-08-2015,"26.416,00 €",,,,Não aplicável.,Não aplicável.,FALSE
"Convite para apresentação de proposta ao abrigo do Acordo Quadro n.º 20120117, de Serviços de Consultoria, Desenvolvimento e Manutenção de Software e Gestão Operacional dos Sistemas e Bases de Dados, celebrado pela SPMS, EPE, para aquisição de Serviços de Desenvolvimento e Manutenção Aplicacional SICA - Sistema de Informação de Contratualização",Ao abrigo de acordo-quadro (art.º 259.º),Aquisição de serviços,"72500000-0, Serviços relacionados com a informática","Serviços Partilhados do Ministério da Saúde, E. P. E. (509540716)","Novabase Business Solutions - Soluções de Consultoria, Desenvolviemnto, Integração, Outsourcing, Manutenção e Operação de Sistemas de Informação, S. A. (504857312)","84.374,40 €",21-10-2014,07-10-2014,365 dias,Portugal,Artigo 259.º do Código dos Contratos Públicos,31-10-2015,"84.374,40 €",,,,425776,CONCURSO PÚBLICO n.º 20120117 -,FALSE
