Objeto do Contrato,Tipo de Procedimento,Tipo(s) de Contrato,CPVs,Entidade(s) Adjudicante(s),Entidade(s) Adjudicatária(s),Preço Contratual,Data de Publicação,Data de Celebração do Contrato,Prazo de Execução,Local de Execução,Fundamentação,Data de Fecho do Contrato,Preço Total Efetivo,Causas das Alterações ao Prazo,Causas das Alterações ao Preço,Estado,N.º registo do Acordo Quadro,Descrição do Acordo Quadro,Procedimento Centralizado
SECUCINUMAB 150MG/1ML SOL.INJ.CANETA PRE CHEIA,Ajuste Direto Regime Geral,Aquisição de bens móveis,"33652300-8, Imunossupressores","Centro Hospitalar do Baixo Vouga, E.P.E. (510123210)","NOVARTIS FARMA-PROD.FARMAC,LDA (500063524)","15.567,00 €",07-11-2016,19-10-2016,365 dias,"Portugal, Aveiro, Aveiro","Artigo 24.º, n.º 1, alínea e) do Código dos Contratos Públicos",,,,,,Não aplicável.,Não aplicável.,FALSE
Medicamentos Exclusivos Unilfarma,Ajuste Direto Regime Geral,Aquisição de bens móveis,"33652300-8, Imunossupressores","Centro Hospitalar do Baixo Vouga, E.P.E. (510123210)","UNILFARMA, LDA. (500293023)","43.141,44 €",07-11-2016,07-06-2016,365 dias,"Portugal, Aveiro, Aveiro","Artigo 24.º, n.º 1, alínea e) do Código dos Contratos Públicos",,,,,,Não aplicável.,Não aplicável.,FALSE
