freguesia,acronym,validVotesPercentage,votes,dicofre
União das freguesias de Vilar de Perdizes e Meixide,PS,46.6,89,170643
União das freguesias de Vilar de Perdizes e Meixide,PPD/PSD.CDS-PP,43.46,83,170643
União das freguesias de Vilar de Perdizes e Meixide,MPT,4.19,8,170643
União das freguesias de Vilar de Perdizes e Meixide,B.E.,1.57,3,170643
União das freguesias de Vilar de Perdizes e Meixide,PCP-PEV,1.05,2,170643
União das freguesias de Vilar de Perdizes e Meixide,POUS,1.05,2,170643
União das freguesias de Vilar de Perdizes e Meixide,L,0.52,1,170643
União das freguesias de Vilar de Perdizes e Meixide,PND,0.52,1,170643
União das freguesias de Vilar de Perdizes e Meixide,PNR,0.52,1,170643
União das freguesias de Vilar de Perdizes e Meixide,PPV,0.52,1,170643
União das freguesias de Vilar de Perdizes e Meixide,MAS,0,0,170643
União das freguesias de Vilar de Perdizes e Meixide,PAN,0,0,170643
União das freguesias de Vilar de Perdizes e Meixide,PCTP/MRPP,0,0,170643
União das freguesias de Vilar de Perdizes e Meixide,PDA,0,0,170643
União das freguesias de Vilar de Perdizes e Meixide,PPM,0,0,170643
União das freguesias de Vilar de Perdizes e Meixide,PTP,0,0,170643
