freguesia,acronym,validVotesPercentage,votes,dicofre
Videmonte,PPD/PSD,41.15,79,090749
Videmonte,PS,36.98,71,090749
Videmonte,B.E.,8.33,16,090749
Videmonte,CDS-PP,5.73,11,090749
Videmonte,A,2.08,4,090749
Videmonte,PCP-PEV,1.56,3,090749
Videmonte,PPM.PPV/CDC,1.56,3,090749
Videmonte,PAN,1.04,2,090749
Videmonte,L,0.52,1,090749
Videmonte,PCTP/MRPP,0.52,1,090749
Videmonte,PNR,0.52,1,090749
Videmonte,IL,0,0,090749
Videmonte,MAS,0,0,090749
Videmonte,NC,0,0,090749
Videmonte,PDR,0,0,090749
Videmonte,PTP,0,0,090749
Videmonte,PURP,0,0,090749
