freguesia,acronym,validVotesPercentage,votes,dicofre
Sonim e Barreiros,PPD/PSD.CDS-PP,60.85,115,171234
Sonim e Barreiros,PS,20.63,39,171234
Sonim e Barreiros,PCP-PEV,3.7,7,171234
Sonim e Barreiros,MPT,3.17,6,171234
Sonim e Barreiros,B.E.,2.12,4,171234
Sonim e Barreiros,PPV,2.12,4,171234
Sonim e Barreiros,PAN,1.59,3,171234
Sonim e Barreiros,PND,1.59,3,171234
Sonim e Barreiros,L,1.06,2,171234
Sonim e Barreiros,PPM,1.06,2,171234
Sonim e Barreiros,PTP,1.06,2,171234
Sonim e Barreiros,PCTP/MRPP,0.53,1,171234
Sonim e Barreiros,PNR,0.53,1,171234
Sonim e Barreiros,MAS,0,0,171234
Sonim e Barreiros,PDA,0,0,171234
Sonim e Barreiros,POUS,0,0,171234
