freguesia,acronym,validVotesPercentage,votes,dicofre
Bico,PS,37.9,141,030104
Bico,PPD/PSD,31.45,117,030104
Bico,CDS-PP,9.68,36,030104
Bico,B.E.,7.53,28,030104
Bico,PAN,2.96,11,030104
Bico,CH,2.15,8,030104
Bico,PCP-PEV,2.15,8,030104
Bico,IL,1.34,5,030104
Bico,R.I.R.,1.08,4,030104
Bico,A,0.81,3,030104
Bico,L,0.81,3,030104
Bico,PDR,0.81,3,030104
Bico,PCTP/MRPP,0.54,2,030104
Bico,JPP,0.27,1,030104
Bico,NC,0.27,1,030104
Bico,PNR,0.27,1,030104
Bico,MAS,0,0,030104
Bico,MPT,0,0,030104
Bico,PPM,0,0,030104
Bico,PTP,0,0,030104
Bico,PURP,0,0,030104
