freguesia,acronym,validVotesPercentage,votes,dicofre
São Francisco,PS,37.75,439,150203
São Francisco,PPD/PSD,19.78,230,150203
São Francisco,PCP-PEV,10.58,123,150203
São Francisco,B.E.,10.49,122,150203
São Francisco,PAN,5.76,67,150203
São Francisco,CDS-PP,4.21,49,150203
São Francisco,CH,2.84,33,150203
São Francisco,IL,2.67,31,150203
São Francisco,L,1.46,17,150203
São Francisco,A,1.38,16,150203
São Francisco,PDR,0.86,10,150203
São Francisco,PNR,0.6,7,150203
São Francisco,R.I.R.,0.43,5,150203
São Francisco,NC,0.34,4,150203
São Francisco,MPT,0.26,3,150203
São Francisco,MAS,0.17,2,150203
São Francisco,PCTP/MRPP,0.17,2,150203
São Francisco,PPM,0.17,2,150203
São Francisco,PURP,0.09,1,150203
São Francisco,PTP,0,0,150203
