freguesia,acronym,validVotesPercentage,votes,dicofre
Louredo,PPD/PSD,52.33,101,031109
Louredo,PS,34.2,66,031109
Louredo,B.E.,3.63,7,031109
Louredo,PNR,2.07,4,031109
Louredo,CDS-PP,1.55,3,031109
Louredo,PAN,1.55,3,031109
Louredo,IL,1.04,2,031109
Louredo,PCP-PEV,1.04,2,031109
Louredo,A,0.52,1,031109
Louredo,CH,0.52,1,031109
Louredo,NC,0.52,1,031109
Louredo,PCTP/MRPP,0.52,1,031109
Louredo,R.I.R.,0.52,1,031109
Louredo,JPP,0,0,031109
Louredo,L,0,0,031109
Louredo,MAS,0,0,031109
Louredo,MPT,0,0,031109
Louredo,PDR,0,0,031109
Louredo,PPM,0,0,031109
Louredo,PTP,0,0,031109
Louredo,PURP,0,0,031109
