freguesia,acronym,validVotesPercentage,votes,dicofre
São Roque do Faial,PPD/PSD.CDS-PP,44.1,127,310905
São Roque do Faial,PS,24.65,71,310905
São Roque do Faial,PTP,7.64,22,310905
São Roque do Faial,MPT,5.21,15,310905
São Roque do Faial,PCP-PEV,5.21,15,310905
São Roque do Faial,PND,2.43,7,310905
São Roque do Faial,L,1.74,5,310905
São Roque do Faial,MAS,1.74,5,310905
São Roque do Faial,PCTP/MRPP,1.74,5,310905
São Roque do Faial,PAN,1.39,4,310905
São Roque do Faial,B.E.,1.04,3,310905
São Roque do Faial,PDA,0.69,2,310905
São Roque do Faial,POUS,0.69,2,310905
São Roque do Faial,PPM,0.69,2,310905
São Roque do Faial,PPV,0.69,2,310905
São Roque do Faial,PNR,0.35,1,310905
