Objeto do Contrato,Tipo de Procedimento,Tipo(s) de Contrato,CPVs,Entidade(s) Adjudicante(s),Entidade(s) Adjudicatária(s),Preço Contratual,Data de Publicação,Data de Celebração do Contrato,Prazo de Execução,Local de Execução,Fundamentação,Data de Fecho do Contrato,Preço Total Efetivo,Causas das Alterações ao Prazo,Causas das Alterações ao Preço,Estado,N.º registo do Acordo Quadro,Descrição do Acordo Quadro,Procedimento Centralizado
48.000 Kg Gás Propano a granel,Ajuste Direto Regime Geral,Aquisição de bens móveis,"09122100-1, Gás propano","Centro Hospitalar e Universitário de Coimbra, E. P. E. (510103448)","Petróleos de Portugal-Petrogal, SA (500697370)","53.273,76 €",21-01-2014,03-01-2014,360 dias,"Portugal, Coimbra, Coimbra","Artigo 24.º, n.º 1, alínea a) do Código dos Contratos Públicos",,,,,,Não aplicável.,Não aplicável.,FALSE
18.000Kg Gás Propano,Ajuste Direto Regime Geral,Aquisição de bens móveis,"09120000-6, Combustíveis gasosos","Centro Hospitalar e Universitário de Coimbra, E. P. E. (510103448)","Repsol Gás Portugal, SA (507039440)","20.124,00 €",21-01-2014,03-01-2014,360 dias,"Portugal, Coimbra, Coimbra","Artigo 24.º, n.º 1, alínea a) do Código dos Contratos Públicos",,,,,,Não aplicável.,Não aplicável.,FALSE
Aquisição de diverso material de Laparoscopia e Histeroscopia para o Bloco Operatório da Maternidade Bissaya Barreto,Ajuste Direto Regime Geral,Aquisição de bens móveis,"33000000-0, Equipamento médico, medicamentos e produtos para cuidados pessoais","Centro Hospitalar e Universitário de Coimbra, E. P. E. (510103448)","Euroscamédica - Produtos Hospitalares, S.A. (503322105)","12.250,00 €",21-01-2014,22-11-2013,60 dias,"Portugal, Coimbra, Coimbra","Artigo 20.º, n.º 1, alínea a) do Código dos Contratos Públicos",,,,,,Não aplicável.,Não aplicável.,FALSE
"aquisição de:  Lentes toricas para correcção de miopia e astigmatismo, 30 unidades",Ajuste Direto Regime Geral,Aquisição de bens móveis,"33000000-0, Equipamento médico, medicamentos e produtos para cuidados pessoais","Centro Hospitalar e Universitário de Coimbra, E. P. E. (510103448)","OPHTEC Portugal, Excelentetitulo - Unipessoal, Lda. (510255086), Optifar, Importação e Exportação, Lda. (501609377)","29.100,00 €",21-01-2014,11-11-2013,90 dias,"Portugal, Coimbra, Coimbra","Artigo 20.º, n.º 1, alínea a) do Código dos Contratos Públicos",,,,,,Não aplicável.,Não aplicável.,FALSE
CANULA(GUEDEL) IRREC. N.2  65CM C/BOCAL P/BRONCOSCOPIO - 10 UNIDADES  CANULA(GUEDEL) IRREC. N.4  85CM C/BOCAL P/BRONCOSCOPIO - 10 UNIDADES  LINHA DE CAPNOGRAFIA - 25 UNIDADES  INTERMEDIARIO PARA PRESSOES 120CM - 50 UNIDADES,Ajuste Direto Regime Geral,Aquisição de bens móveis,"33000000-0, Equipamento médico, medicamentos e produtos para cuidados pessoais","Centro Hospitalar e Universitário de Coimbra, E. P. E. (510103448)","B BRAUN MEDICAL, LDA (501506543), ROCHA NEVES, LDA (500233691), IBERDATA EQUIPAMENTOS, LDA (501904921)","416,50 €",21-01-2014,28-10-2013,365 dias,"Portugal, Coimbra, Coimbra","Artigo 20.º, n.º 1, alínea a) do Código dos Contratos Públicos",,,,,,Não aplicável.,Não aplicável.,FALSE
SONDA VESICAL EM SILICONE COM SENSOR DE TEMPERATURA CENTRAL 16CH - 324 UNIDADES  SONDA VESICAL EM SILICONE COM SENSOR DE TEMPERATURA CENTRAL 18CH - 264 UNIDADES,Ajuste Direto Regime Geral,Aquisição de bens móveis,"33000000-0, Equipamento médico, medicamentos e produtos para cuidados pessoais","Centro Hospitalar e Universitário de Coimbra, E. P. E. (510103448)","COVIDIEN PORTUGAL - PRODUTOS SAUDE, UNIPESSOAL LDA (503413410)","5.880,00 €",20-01-2014,16-01-2014,365 dias,"Portugal, Coimbra, Coimbra","Artigo 20.º, n.º 1, alínea a) do Código dos Contratos Públicos",,,,,,Não aplicável.,Não aplicável.,FALSE
MASCARA LARINGEA Nº 3 - 20 UNIDADES  MASCARA LARINGEA Nº 5 - 20 UNIDADES  MASCARA LARINGEA Nº 4 - 30 UNIDADES,Ajuste Direto Regime Geral,Aquisição de bens móveis,"33000000-0, Equipamento médico, medicamentos e produtos para cuidados pessoais","Centro Hospitalar e Universitário de Coimbra, E. P. E. (510103448)","EUROCASMEDICA - PRODUTOS HOSPITALARES,SA (503322105)","2.975,00 €",15-01-2014,15-01-2014,365 dias,"Portugal, Coimbra, Coimbra","Artigo 20.º, n.º 1, alínea a) do Código dos Contratos Públicos",,,,,,Não aplicável.,Não aplicável.,FALSE
"Aquisição de serviços de Gestão Integrada de Resíduos necessária ao HG, HP e MBB, do CHUC, EPE, 1º trimestre 2014.",Ajuste Direto Regime Geral,Aquisição de serviços,"90500000-2, Serviços relativos a resíduos e lixos","Centro Hospitalar e Universitário de Coimbra, E. P. E. (510103448)",AMBIMED (503593427),"96.705,61 €",14-01-2014,08-01-2014,90 dias,"Portugal, Coimbra, Coimbra","Artigo 20.º, n.º 1, alínea a) do Código dos Contratos Públicos",,,,,,Não aplicável.,Não aplicável.,FALSE
