freguesia,acronym,validVotesPercentage,votes,dicofre
São João da Corveira,PPD/PSD,47.67,123,171222
São João da Corveira,PS,44.57,115,171222
São João da Corveira,B.E.,2.33,6,171222
São João da Corveira,CDS-PP,2.33,6,171222
São João da Corveira,A,0.78,2,171222
São João da Corveira,PAN,0.78,2,171222
São João da Corveira,PCTP/MRPP,0.39,1,171222
São João da Corveira,PDR,0.39,1,171222
São João da Corveira,PNR,0.39,1,171222
São João da Corveira,R.I.R.,0.39,1,171222
São João da Corveira,CH,0,0,171222
São João da Corveira,IL,0,0,171222
São João da Corveira,L,0,0,171222
São João da Corveira,NC,0,0,171222
São João da Corveira,PCP-PEV,0,0,171222
São João da Corveira,PPM,0,0,171222
