Objeto do Contrato,Tipo de Procedimento,Tipo(s) de Contrato,CPVs,Entidade(s) Adjudicante(s),Entidade(s) Adjudicatária(s),Preço Contratual,Data de Publicação,Data de Celebração do Contrato,Prazo de Execução,Local de Execução,Fundamentação,Data de Fecho do Contrato,Preço Total Efetivo,Causas das Alterações ao Prazo,Causas das Alterações ao Preço,Estado,N.º registo do Acordo Quadro,Descrição do Acordo Quadro,Procedimento Centralizado
Empreitada de obras públicas para revestimento interior das janelas do 1.º andar do Pav. 24_NPD_5493002231.,Ajuste Direto Regime Geral,Empreitadas de obras públicas,"45453000-7, Obras de revisão e recuperação","INFARMED - Autoridade Nacional do Medicamento e Produtos de Saúde, I. P. (600037002)",SNT- CONSTRUÇÕES E REMODELAÇÕES INIPESSOAL (510519300),"10.875,00 €",17-10-2017,10-10-2017,64 dias,Portugal,"Artigo 19.º, alínea a) do Código dos Contratos Públicos",,,,,,Não aplicável.,Não aplicável.,FALSE
"Contratação de serviços de manutenção e assistência técnica aos sistemas de deteção de incêndios, C.C.T.V., deteção de monóxido de carbono; controlo de acessos; alarme/intrusão, para os quatro edifícios do INFARMED, I.P._NPD5493001477.",Ajuste Direto Regime Geral,Locação de bens móveis,"31625000-3, Alarmes contra roubo e incêndios","INFARMED - Autoridade Nacional do Medicamento e Produtos de Saúde, I. P. (600037002)","SIEMENS, S.A. (500247480)","17.650,00 €",13-10-2017,03-10-2017,365 dias,Portugal,"Artigo 20.º, n.º 1, alínea a) do Código dos Contratos Públicos",,,,,,Não aplicável.,Não aplicável.,FALSE
