freguesia,acronym,validVotesPercentage,votes,dicofre
Povoação,PS,66.12,324,420405
Povoação,PPD/PSD.CDS-PP,19.59,96,420405
Povoação,MPT,4.08,20,420405
Povoação,PCP-PEV,2.86,14,420405
Povoação,B.E.,2.45,12,420405
Povoação,PAN,1.02,5,420405
Povoação,PDA,1.02,5,420405
Povoação,L,0.61,3,420405
Povoação,PND,0.61,3,420405
Povoação,PTP,0.61,3,420405
Povoação,PNR,0.41,2,420405
Povoação,PPM,0.41,2,420405
Povoação,PCTP/MRPP,0.2,1,420405
Povoação,MAS,0,0,420405
Povoação,POUS,0,0,420405
Povoação,PPV,0,0,420405
