Objeto do Contrato,Tipo de Procedimento,Tipo(s) de Contrato,CPVs,Entidade(s) Adjudicante(s),Entidade(s) Adjudicatária(s),Preço Contratual,Data de Publicação,Data de Celebração do Contrato,Prazo de Execução,Local de Execução,Fundamentação,Data de Fecho do Contrato,Preço Total Efetivo,Causas das Alterações ao Prazo,Causas das Alterações ao Preço,Estado,N.º registo do Acordo Quadro,Descrição do Acordo Quadro,Procedimento Centralizado
Aquisição de serviços médicos s/especialidade - ACES Douro I Marão e Douro Norte - Processo 18000138,Ajuste Direto Regime Geral,Aquisição de serviços,"85121000-3, Serviços de prática médica","Administração Regional de Saúde do Norte, I. P. (503135593)",Justino José Sami (257404970),"34.320,00 €",03-09-2018,31-01-2018,365 dias,"Portugal, Vila Real, Peso da Régua","Artigo 20.º, n.º 1, alínea a) do Código dos Contratos Públicos","","",,"",,Não aplicável.,Não aplicável.,FALSE
Aquisição de serviços médicos para o ACES Douro II/Douro Sul – Processo 18000138,Ajuste Direto Regime Geral,Aquisição de serviços,"85121000-3, Serviços de prática médica","Administração Regional de Saúde do Norte,IP (ARSN) (503135593)",Justino José Sami (257404970),"22.880,00 €",08-03-2018,21-12-2017,365 dias,"Portugal, Viseu, Lamego","Artigo 20.º, n.º 1, alínea a) do Código dos Contratos Públicos","","",,"",,Não aplicável.,Não aplicável.,FALSE
Aquisição de serviços na área da Medicina - ACES Douro Sul,Ajuste Direto Regime Geral,Aquisição de serviços,"85121000-3, Serviços de prática médica","Administração Regional de Saúde do Norte, I. P. (503135593)",Justino José Sami (257404970),"35.880,00 €",13-03-2017,20-01-2017,365 dias,"Portugal, Viseu, Lamego","Artigo 20.º, n.º 1, alínea a) do Código dos Contratos Públicos",21-12-2017,"32.959,00 €",,Não foram executadas a totalidade das horas contratualizadas,,Não aplicável.,Não aplicável.,FALSE
Prestação serviços médicos/ACES Marão e Douro Norte,Ajuste Direto Regime Geral,Aquisição de serviços,"85121000-3, Serviços de prática médica","Administração Regional de Saúde do Norte, I. P. (503135593)",Justino José Sami (257404970),"14.352,00 €",09-03-2017,20-01-2017,365 dias,"Portugal, Vila Real, Vila Real","Artigo 20.º, n.º 1, alínea a) do Código dos Contratos Públicos",29-12-2017,"17.659,50 €",,Não foram executadas a totalidade das horas contratualizadas,,Não aplicável.,Não aplicável.,FALSE
