Objeto do Contrato,Tipo de Procedimento,Tipo(s) de Contrato,CPVs,Entidade(s) Adjudicante(s),Entidade(s) Adjudicatária(s),Preço Contratual,Data de Publicação,Data de Celebração do Contrato,Prazo de Execução,Local de Execução,Fundamentação,Data de Fecho do Contrato,Preço Total Efetivo,Causas das Alterações ao Prazo,Causas das Alterações ao Preço,Estado,N.º registo do Acordo Quadro,Descrição do Acordo Quadro,Procedimento Centralizado
Aquisição de material de clínico - AjD 42146916,Ajuste Direto Regime Geral,Aquisição de bens móveis,"33140000-3, Material médico de consumo",Centro Hospitalar do Oeste (510412009),Moonsurge (506657035),"317,64 €",11-05-2016,04-04-2016,1 dias,"Portugal, Leiria, Caldas da Rainha","Artigo 20.º, n.º 1, alínea a) do Código dos Contratos Públicos",04-04-2016,"317,64 €",,,,Não aplicável.,Não aplicável.,FALSE
Aquisição de material de clínico - AjD 42146916,Ajuste Direto Regime Geral,Aquisição de bens móveis,"33140000-3, Material médico de consumo",Centro Hospitalar do Oeste (510412009),Covidien (503413410),"681,00 €",11-05-2016,04-04-2016,1 dias,"Portugal, Leiria, Caldas da Rainha","Artigo 20.º, n.º 1, alínea a) do Código dos Contratos Públicos",04-04-2016,"681,00 €",,,,Não aplicável.,Não aplicável.,FALSE
Aquisição de material de clínico - AjD 42146916,Ajuste Direto Regime Geral,Aquisição de bens móveis,"33140000-3, Material médico de consumo",Centro Hospitalar do Oeste (510412009),C.R.Bard (502438274),"244,00 €",11-05-2016,04-04-2016,1 dias,"Portugal, Leiria, Caldas da Rainha","Artigo 20.º, n.º 1, alínea a) do Código dos Contratos Públicos",04-04-2016,"244,00 €",,,,Não aplicável.,Não aplicável.,FALSE
Aquisição de material de clínico - AjD 42146916,Ajuste Direto Regime Geral,Aquisição de bens móveis,"33140000-3, Material médico de consumo",Centro Hospitalar do Oeste (510412009),Coloplast Portugal (503989037),"95,00 €",11-05-2016,04-04-2016,1 dias,"Portugal, Leiria, Caldas da Rainha","Artigo 20.º, n.º 1, alínea a) do Código dos Contratos Públicos",04-04-2016,"95,00 €",,,,Não aplicável.,Não aplicável.,FALSE
Toners,Ajuste Direto Regime Geral,Aquisição de bens móveis,"30125100-2, Cartuchos de tinta (toner)",Centro Hospitalar do Oeste (510412009),Ecofloat (506628051),"35,38 €",10-05-2016,04-02-2016,1 dias,"Portugal, Leiria, Caldas da Rainha","Artigo 20.º, n.º 1, alínea a) do Código dos Contratos Públicos",04-02-2016,"35,38 €",,,,Não aplicável.,Não aplicável.,FALSE
Toners,Ajuste Direto Regime Geral,Aquisição de bens móveis,"30125100-2, Cartuchos de tinta (toner)",Centro Hospitalar do Oeste (510412009),Novabit (503411302),"125,68 €",10-05-2016,04-02-2016,1 dias,"Portugal, Leiria, Caldas da Rainha","Artigo 20.º, n.º 1, alínea a) do Código dos Contratos Públicos",04-02-2016,"125,68 €",,,,Não aplicável.,Não aplicável.,FALSE
Toners,Ajuste Direto Regime Geral,Aquisição de bens móveis,"30125100-2, Cartuchos de tinta (toner)",Centro Hospitalar do Oeste (510412009),Rebelo Santos Inf. (509707203),"186,60 €",10-05-2016,04-02-2016,1 dias,"Portugal, Leiria, Caldas da Rainha","Artigo 20.º, n.º 1, alínea a) do Código dos Contratos Públicos",04-02-2016,"186,60 €",,,,Não aplicável.,Não aplicável.,FALSE
Toners,Ajuste Direto Regime Geral,Aquisição de bens móveis,"30125100-2, Cartuchos de tinta (toner)",Centro Hospitalar do Oeste (510412009),Recivedras (505514788),"41,70 €",10-05-2016,04-02-2016,1 dias,"Portugal, Leiria, Caldas da Rainha","Artigo 20.º, n.º 1, alínea a) do Código dos Contratos Públicos",04-02-2016,"41,70 €",,,,Não aplicável.,Não aplicável.,FALSE
DIETA SEMI-SOLIDA PARA DIABETICOS EMB 125G,Ajuste Direto Regime Geral,Aquisição de bens móveis,"33600000-6, Produtos farmacêuticos",Centro Hospitalar do Oeste (510412009),"FRESENIUS KABI PHARMA PORTUGAL, L                  (504293753)","90,00 €",05-05-2016,29-01-2016,1 dias,"Portugal, Leiria, Caldas da Rainha","Artigo 20.º, n.º 1, alínea a) do Código dos Contratos Públicos",29-01-2016,"90,00 €",,,,Não aplicável.,Não aplicável.,FALSE
DIETA MODIFICADA DIABETICA SONDA 500ML,Ajuste Direto Regime Geral,Aquisição de bens móveis,"33600000-6, Produtos farmacêuticos",Centro Hospitalar do Oeste (510412009),"FRESENIUS KABI PHARMA PORTUGAL, L                  (504293753)","178,50 €",05-05-2016,29-01-2016,1 dias,"Portugal, Leiria, Caldas da Rainha","Artigo 20.º, n.º 1, alínea a) do Código dos Contratos Públicos",29-01-2016,"178,50 €",,,,Não aplicável.,Não aplicável.,FALSE
IMUNOGLOBULINA HUMANA 20G/200ML IV INJ,Ajuste Direto Regime Geral,Aquisição de bens móveis,"33690000-3, Medicamentos vários",Centro Hospitalar do Oeste (510412009),"CSL BEHRING, LDA                                   (503047201)","3.615,42 €",05-05-2016,29-01-2016,1 dias,"Portugal, Leiria, Caldas da Rainha","Artigo 20.º, n.º 1, alínea a) do Código dos Contratos Públicos",29-01-2016,"3.615,42 €",,,,Não aplicável.,Não aplicável.,FALSE
IMUNOGLOBULINA HUMANA 10G/100ML IV INJ,Ajuste Direto Regime Geral,Aquisição de bens móveis,"33690000-3, Medicamentos vários",Centro Hospitalar do Oeste (510412009),"CSL BEHRING, LDA                                   (503047201)","1.582,25 €",05-05-2016,29-01-2016,1 dias,"Portugal, Leiria, Caldas da Rainha","Artigo 20.º, n.º 1, alínea a) do Código dos Contratos Públicos",29-01-2016,"1.582,25 €",,,,Não aplicável.,Não aplicável.,FALSE
"MISTURA Pª PLESTIMOGRAFO CO (0,28%) + HE (9,7 ",Ajuste Direto Regime Geral,Aquisição de bens móveis,"33600000-6, Produtos farmacêuticos",Centro Hospitalar do Oeste (510412009),"AIR LIQUIDE MEDICINAL, SA.                         (501576436)","220,00 €",05-05-2016,28-01-2016,1 dias,"Portugal, Leiria, Caldas da Rainha","Artigo 20.º, n.º 1, alínea a) do Código dos Contratos Públicos",29-01-2016,"220,00 €",,,,Não aplicável.,Não aplicável.,FALSE
ANIDRIDO CARBONICO B5 (LAPAROSCOPIA),Ajuste Direto Regime Geral,Aquisição de bens móveis,"33600000-6, Produtos farmacêuticos",Centro Hospitalar do Oeste (510412009),"AIR LIQUIDE MEDICINAL, SA.                         (501576436)","81,57 €",05-05-2016,28-01-2016,1 dias,"Portugal, Leiria, Caldas da Rainha","Artigo 20.º, n.º 1, alínea a) do Código dos Contratos Públicos",29-01-2016,"81,57 €",,,,Não aplicável.,Não aplicável.,FALSE
PROCAINA 2% (100MG/5ML) SC INJ,Ajuste Direto Regime Geral,Aquisição de bens móveis,"33690000-3, Medicamentos vários",Centro Hospitalar do Oeste (510412009),"LABESFAL,LABORATORIOS ALMIRO S.A                   (501169580)","104,50 €",05-05-2016,22-01-2016,3 dias,"Portugal, Leiria, Caldas da Rainha","Artigo 20.º, n.º 1, alínea a) do Código dos Contratos Públicos",25-01-2016,"104,50 €",,,,Não aplicável.,Não aplicável.,FALSE
CAPTOPRIL 25MG COMP,Ajuste Direto Regime Geral,Aquisição de bens móveis,"33690000-3, Medicamentos vários",Centro Hospitalar do Oeste (510412009),"LABESFAL,LABORATORIOS ALMIRO S.A                   (501169580)","63,00 €",05-05-2016,22-01-2016,3 dias,"Portugal, Leiria, Caldas da Rainha","Artigo 20.º, n.º 1, alínea a) do Código dos Contratos Públicos",25-02-2016,"63,00 €",,,,Não aplicável.,Não aplicável.,FALSE
"DEXAMETASONA 0,1% COLIRIO 5ML                 ",Ajuste Direto Regime Geral,Aquisição de bens móveis,"33690000-3, Medicamentos vários",Centro Hospitalar do Oeste (510412009),"LAB. EDOL, LDA.                                    (507072642)","105,70 €",05-05-2016,22-01-2016,1 dias,"Portugal, Leiria, Caldas da Rainha","Artigo 20.º, n.º 1, alínea a) do Código dos Contratos Públicos",25-01-2016,"105,70 €",,,,Não aplicável.,Não aplicável.,FALSE
"CLORANFENICOL / PREDNISOLONA (2,5;10)MG/G POM ",Ajuste Direto Regime Geral,Aquisição de bens móveis,"33690000-3, Medicamentos vários",Centro Hospitalar do Oeste (510412009),"DAVI II-FARMACEUTICA,S.A.                          (508309450)","102,00 €",05-05-2016,22-01-2016,1 dias,"Portugal, Leiria, Caldas da Rainha","Artigo 20.º, n.º 1, alínea a) do Código dos Contratos Públicos",22-01-2016,"102,00 €",,,,Não aplicável.,Não aplicável.,FALSE
"DROPERIDOL 2,5 MG/1ML IV INJ                  ",Ajuste Direto Regime Geral,Aquisição de bens móveis,"33690000-3, Medicamentos vários",Centro Hospitalar do Oeste (510412009),"LAB. VITORIA, SA.                                  (500162220)","96,00 €",05-05-2016,25-01-2016,1 dias,"Portugal, Leiria, Caldas da Rainha","Artigo 24.º, n.º 1, alínea e) do Código dos Contratos Públicos",25-01-2016,"96,00 €",,,,Não aplicável.,Não aplicável.,FALSE
PROMETAZINA 50MG/2ML IM INJ,Ajuste Direto Regime Geral,Aquisição de bens móveis,"33690000-3, Medicamentos vários",Centro Hospitalar do Oeste (510412009),"LAB. VITORIA, SA.                                  (500162220)","11,40 €",05-05-2016,25-01-2016,1 dias,"Portugal, Leiria, Caldas da Rainha","Artigo 24.º, n.º 1, alínea e) do Código dos Contratos Públicos",25-01-2016,"11,40 €",,,,Não aplicável.,Não aplicável.,FALSE
METRONIDAZOL 250MG COMP,Ajuste Direto Regime Geral,Aquisição de bens móveis,"33690000-3, Medicamentos vários",Centro Hospitalar do Oeste (510412009),"LAB. VITORIA, SA.                                  (500162220)","99,84 €",05-05-2016,20-01-2016,1 dias,"Portugal, Leiria, Caldas da Rainha","Artigo 24.º, n.º 1, alínea e) do Código dos Contratos Públicos",21-01-2016,"99,84 €",,,,Não aplicável.,Não aplicável.,FALSE
INDOMETACINA 100MG SUP,Ajuste Direto Regime Geral,Aquisição de bens móveis,"33690000-3, Medicamentos vários",Centro Hospitalar do Oeste (510412009),"LAB. VITORIA, SA.                                  (500162220)","16,20 €",05-05-2016,20-01-2016,1 dias,"Portugal, Leiria, Caldas da Rainha","Artigo 24.º, n.º 1, alínea e) do Código dos Contratos Públicos",21-01-2016,"16,20 €",,,,Não aplicável.,Não aplicável.,FALSE
ARGON B5,Ajuste Direto Regime Geral,Aquisição de bens móveis,"33600000-6, Produtos farmacêuticos",Centro Hospitalar do Oeste (510412009),"AIR LIQUIDE MEDICINAL, SA.                         (501576436)","49,42 €",05-05-2016,20-01-2016,1 dias,"Portugal, Leiria, Caldas da Rainha","Artigo 20.º, n.º 1, alínea a) do Código dos Contratos Públicos",25-02-2016,"49,42 €",,,,Não aplicável.,Não aplicável.,FALSE
DETERGENTE TRI- ENZIMATICO PRE-DESINFECTANTE,Ajuste Direto Regime Geral,Aquisição de bens móveis,"33600000-6, Produtos farmacêuticos",Centro Hospitalar do Oeste (510412009),"AIR LIQUIDE MEDICINAL, SA.                         (501576436)","164,44 €",05-05-2016,20-01-2016,1 dias,"Portugal, Leiria, Caldas da Rainha","Artigo 20.º, n.º 1, alínea a) do Código dos Contratos Públicos",21-01-2016,"164,44 €",,,,Não aplicável.,Não aplicável.,FALSE
