freguesia,acronym,validVotesPercentage,votes,dicofre
"União das freguesias de Chorente, Góios, Courel, Pedra Furada e Gueral",PPD/PSD.CDS-PP,61.49,570,030296
"União das freguesias de Chorente, Góios, Courel, Pedra Furada e Gueral",PS,19.53,181,030296
"União das freguesias de Chorente, Góios, Courel, Pedra Furada e Gueral",MPT,8.41,78,030296
"União das freguesias de Chorente, Góios, Courel, Pedra Furada e Gueral",PCP-PEV,1.62,15,030296
"União das freguesias de Chorente, Góios, Courel, Pedra Furada e Gueral",PAN,1.51,14,030296
"União das freguesias de Chorente, Góios, Courel, Pedra Furada e Gueral",PTP,1.4,13,030296
"União das freguesias de Chorente, Góios, Courel, Pedra Furada e Gueral",B.E.,1.29,12,030296
"União das freguesias de Chorente, Góios, Courel, Pedra Furada e Gueral",PND,0.97,9,030296
"União das freguesias de Chorente, Góios, Courel, Pedra Furada e Gueral",L,0.86,8,030296
"União das freguesias de Chorente, Góios, Courel, Pedra Furada e Gueral",PPV,0.76,7,030296
"União das freguesias de Chorente, Góios, Courel, Pedra Furada e Gueral",MAS,0.65,6,030296
"União das freguesias de Chorente, Góios, Courel, Pedra Furada e Gueral",PCTP/MRPP,0.65,6,030296
"União das freguesias de Chorente, Góios, Courel, Pedra Furada e Gueral",PNR,0.43,4,030296
"União das freguesias de Chorente, Góios, Courel, Pedra Furada e Gueral",PPM,0.22,2,030296
"União das freguesias de Chorente, Góios, Courel, Pedra Furada e Gueral",PDA,0.11,1,030296
"União das freguesias de Chorente, Góios, Courel, Pedra Furada e Gueral",POUS,0.11,1,030296
