freguesia,acronym,validVotesPercentage,votes,dicofre
Valado dos Frades,PS,37.52,469,101103
Valado dos Frades,PPD/PSD,22.32,279,101103
Valado dos Frades,B.E.,15.52,194,101103
Valado dos Frades,PCP-PEV,11.2,140,101103
Valado dos Frades,CDS-PP,4,50,101103
Valado dos Frades,PAN,2.16,27,101103
Valado dos Frades,PCTP/MRPP,1.2,15,101103
Valado dos Frades,L,1.04,13,101103
Valado dos Frades,CH,0.72,9,101103
Valado dos Frades,R.I.R.,0.72,9,101103
Valado dos Frades,A,0.56,7,101103
Valado dos Frades,IL,0.56,7,101103
Valado dos Frades,PURP,0.56,7,101103
Valado dos Frades,PNR,0.48,6,101103
Valado dos Frades,JPP,0.32,4,101103
Valado dos Frades,PDR,0.32,4,101103
Valado dos Frades,NC,0.24,3,101103
Valado dos Frades,PPM,0.24,3,101103
Valado dos Frades,MAS,0.16,2,101103
Valado dos Frades,MPT,0.08,1,101103
Valado dos Frades,PTP,0.08,1,101103
