Objeto do Contrato,Tipo de Procedimento,Tipo(s) de Contrato,CPVs,Entidade(s) Adjudicante(s),Entidade(s) Adjudicatária(s),Preço Contratual,Data de Publicação,Data de Celebração do Contrato,Prazo de Execução,Local de Execução,Fundamentação,Data de Fecho do Contrato,Preço Total Efetivo,Causas das Alterações ao Prazo,Causas das Alterações ao Preço,Estado,N.º registo do Acordo Quadro,Descrição do Acordo Quadro,Procedimento Centralizado
"Aquisição de Material de Higiene, Alimentação e Conforto",Ajuste Direto Regime Geral,Aquisição de bens móveis,"33700000-7, Produtos para cuidados pessoais","Hospital Distrital de Santarém, EPE (506361462)","EXACLEAN - SISTEMA DE HIGIÉNE, LDA (508758190)","328,50 €",07-02-2018,29-01-2018,360 dias,"Portugal, Santarém, Santarém","Artigo 20.º, n.º 1, alínea a) do Código dos Contratos Públicos",,,,,,Não aplicável.,Não aplicável.,FALSE
"Aquisição de Material de Higiene, Alimentação e Conforto",Ajuste Direto Regime Geral,Aquisição de bens móveis,"33700000-7, Produtos para cuidados pessoais","Hospital Distrital de Santarém, EPE (506361462)","H.R. - HOSPITALAR, LDA (501895558)","1.423,69 €",07-02-2018,29-01-2018,360 dias,"Portugal, Santarém, Santarém","Artigo 20.º, n.º 1, alínea a) do Código dos Contratos Públicos",,,,,,Não aplicável.,Não aplicável.,FALSE
"Aquisição de Material de Higiene, Alimentação e Conforto",Ajuste Direto Regime Geral,Aquisição de bens móveis,"33700000-7, Produtos para cuidados pessoais","Hospital Distrital de Santarém, EPE (506361462)","ANASTACIO SALDANHA, UNIPESSOAL (505804441)","30,58 €",07-02-2018,29-01-2018,360 dias,"Portugal, Santarém, Santarém","Artigo 20.º, n.º 1, alínea a) do Código dos Contratos Públicos",,,,,,Não aplicável.,Não aplicável.,FALSE
Aquisição de Reagentes para Coagulação para o Ano de 2018 (3Meses),Ajuste Direto Regime Geral,Aquisição de bens móveis,"33696000-5, Reagentes e meios de contraste","Hospital Distrital de Santarém, EPE (506361462)","WERFEN PORTUGAL, LDA (501086110)","22.027,05 €",07-02-2018,26-01-2018,365 dias,"Portugal, Santarém, Santarém","Artigo 20.º, n.º 1, alínea a) do Código dos Contratos Públicos",,,,,,Não aplicável.,Não aplicável.,FALSE
Aquisição de Artigos de Papel para Higiene e Limpeza,Concurso público,Aquisição de bens móveis,"33760000-5, Papel higiénico, lenços, toalhas de mão e guardanapos","Hospital Distrital de Santarém, EPE (506361462)","José Carreira da Silva Costa, Lda (506008487)","588,22 €",05-02-2018,18-01-2018,360 dias,"Portugal, Santarém, Santarém","Artigo 20.º, n.º 1, alínea b) do Código dos Contratos Públicos",,,,,,Não aplicável.,Não aplicável.,FALSE
Aquisição de Artigos de Papel para Higiene e Limpeza,Concurso público,Aquisição de bens móveis,"33760000-5, Papel higiénico, lenços, toalhas de mão e guardanapos","Hospital Distrital de Santarém, EPE (506361462)","Higiene Plus, Lda (503637530)","6.948,98 €",05-02-2018,18-01-2018,360 dias,"Portugal, Santarém, Santarém","Artigo 20.º, n.º 1, alínea b) do Código dos Contratos Públicos",,,,,,Não aplicável.,Não aplicável.,FALSE
Aquisição de Artigos de Papel para Higiene e Limpeza,Concurso público,Aquisição de bens móveis,"33760000-5, Papel higiénico, lenços, toalhas de mão e guardanapos","Hospital Distrital de Santarém, EPE (506361462)","Visipapel, Lda (502020733)","8.917,25 €",05-02-2018,18-01-2018,360 dias,"Portugal, Santarém, Santarém","Artigo 20.º, n.º 1, alínea b) do Código dos Contratos Públicos",,,,,,Não aplicável.,Não aplicável.,FALSE
Aquisição de Artigos de Papel para Higiene e Limpeza,Concurso público,Aquisição de bens móveis,"33760000-5, Papel higiénico, lenços, toalhas de mão e guardanapos","Hospital Distrital de Santarém, EPE (506361462)","Rei & Rei, Lda (502897970)","50.680,03 €",05-02-2018,22-01-2018,360 dias,"Portugal, Santarém, Santarém","Artigo 20.º, n.º 1, alínea b) do Código dos Contratos Públicos",,,,,,Não aplicável.,Não aplicável.,FALSE
Aquisição de Kit Tracção Cutânea N/ Adesivado,Ajuste Direto Regime Geral,Aquisição de bens móveis,"33140000-3, Material médico de consumo","Hospital Distrital de Santarém, E. P. E. (506361462)","AVIQUIMICA- IMPORTAÇÃO E MANUFACTURAS, LDA (500039720)","681,60 €",02-02-2018,05-01-2018,40 dias,"Portugal, Santarém, Santarém","Artigo 20.º, n.º 1, alínea a) do Código dos Contratos Públicos",,,,,,Não aplicável.,Não aplicável.,FALSE
Aquisição Pensos para Queimados,Ajuste Direto Regime Geral,Aquisição de bens móveis,"33140000-3, Material médico de consumo","Hospital Distrital de Santarém, E. P. E. (506361462)","Docworl, Lda (508592909)","1.600,00 €",02-02-2018,31-01-2018,90 dias,"Portugal, Santarém, Santarém","Artigo 20.º, n.º 1, alínea d) do Código dos Contratos Públicos",,,,,,Não aplicável.,Não aplicável.,FALSE
Aquisição Macas Hospitalares,Ajuste Direto Regime Geral,Aquisição de bens móveis,"33192000-2, Mobiliário para fins médicos","Hospital Distrital de Santarém, E. P. E. (506361462)","Paramedica, Lda (501393005)","4.400,00 €",02-02-2018,09-01-2018,30 dias,"Portugal, Santarém, Santarém","Artigo 20.º, n.º 1, alínea d) do Código dos Contratos Públicos",,,,,,Não aplicável.,Não aplicável.,FALSE
Aquisição e Instalação Elevador de Cadáveres,Ajuste Direto Regime Geral,Aquisição de bens móveis,"33940000-1, Equipamento e material para transporte e armazenamento de cadáveres","Hospital Distrital de Santarém, EPE (506361462)","Frisinde-Equipamentos Industriais, Lda (502365889)","13.676,00 €",02-02-2018,22-01-2018,30 dias,"Portugal, Santarém, Santarém","Artigo 20.º, n.º 1, alínea a) do Código dos Contratos Públicos",,,,,,Não aplicável.,Não aplicável.,FALSE
170028/2017 Aquisição equipamento de proteção de RX,Concurso público,Aquisição de bens móveis,"33111300-4, Aparelhos para revelação de exames radiológicos","Hospital Distrital de Santarém, E. P. E. (506361462)","Med X Ray, Lda (506187071)","11.599,80 €",02-02-2018,29-01-2018,30 dias,"Portugal, Santarém, Santarém","Artigo 20.º, n.º 1, alínea b) do Código dos Contratos Públicos",,,,,,Não aplicável.,Não aplicável.,FALSE
Aquisição de Material de Higiene e Limpeza,Concurso público,Aquisição de bens móveis,"39800000-0, Produtos de limpeza e polimento","Hospital Distrital de Santarém, EPE (506361462)","HIGIGUIMA-Representações, Soc. Unipessoal, Lda (505786516)","3.600,00 €",01-02-2018,31-01-2018,360 dias,"Portugal, Santarém, Santarém","Artigo 20.º, n.º 1, alínea b) do Código dos Contratos Públicos",,,,,,Não aplicável.,Não aplicável.,FALSE
Aquisição de Material de Higiene e Limpeza,Concurso público,Aquisição de bens móveis,"39800000-0, Produtos de limpeza e polimento","Hospital Distrital de Santarém, EPE (506361462)","JOÃO ANTUNES AMARO, LDA (500149003)","607,37 €",01-02-2018,31-01-2018,360 dias,"Portugal, Santarém, Santarém","Artigo 20.º, n.º 1, alínea b) do Código dos Contratos Públicos",,,,,,Não aplicável.,Não aplicável.,FALSE
Aquisição de Material de Higiene e Limpeza,Concurso público,Aquisição de bens móveis,"39800000-0, Produtos de limpeza e polimento","Hospital Distrital de Santarém, EPE (506361462)","PRODYALCA - COMERCIO DE PRODUTOS QUIMICOS, LDA (506565165)","218,58 €",01-02-2018,31-01-2018,360 dias,"Portugal, Santarém, Santarém","Artigo 20.º, n.º 1, alínea b) do Código dos Contratos Públicos",,,,,,Não aplicável.,Não aplicável.,FALSE
Aquisição de Material de Higiene e Limpeza,Concurso público,Aquisição de bens móveis,"39800000-0, Produtos de limpeza e polimento","Hospital Distrital de Santarém, EPE (506361462)","IGNISSOL, Lda (508613248)","1.592,81 €",01-02-2018,31-01-2018,360 dias,"Portugal, Santarém, Santarém","Artigo 20.º, n.º 1, alínea b) do Código dos Contratos Públicos",,,,,,Não aplicável.,Não aplicável.,FALSE
Aquisição de Material de Higiene e Limpeza,Concurso público,Aquisição de bens móveis,"39800000-0, Produtos de limpeza e polimento","Hospital Distrital de Santarém, EPE (506361462)","ALVARO HENRIQUES & FILHOS, LDA (502031875)","1.170,56 €",01-02-2018,31-01-2018,360 dias,"Portugal, Santarém, Santarém","Artigo 20.º, n.º 1, alínea b) do Código dos Contratos Públicos",,,,,,Não aplicável.,Não aplicável.,FALSE
