freguesia,acronym,validVotesPercentage,votes,dicofre
União das freguesias de Atalaia e Alto-Estanqueiro-Jardia,PS,38.36,468,150709
União das freguesias de Atalaia e Alto-Estanqueiro-Jardia,PCP-PEV,20.66,252,150709
União das freguesias de Atalaia e Alto-Estanqueiro-Jardia,PPD/PSD.CDS-PP,17.46,213,150709
União das freguesias de Atalaia e Alto-Estanqueiro-Jardia,MPT,8.44,103,150709
União das freguesias de Atalaia e Alto-Estanqueiro-Jardia,B.E.,5,61,150709
União das freguesias de Atalaia e Alto-Estanqueiro-Jardia,PAN,2.38,29,150709
União das freguesias de Atalaia e Alto-Estanqueiro-Jardia,PCTP/MRPP,2.3,28,150709
União das freguesias de Atalaia e Alto-Estanqueiro-Jardia,L,1.72,21,150709
União das freguesias de Atalaia e Alto-Estanqueiro-Jardia,PNR,0.98,12,150709
União das freguesias de Atalaia e Alto-Estanqueiro-Jardia,PTP,0.9,11,150709
União das freguesias de Atalaia e Alto-Estanqueiro-Jardia,MAS,0.57,7,150709
União das freguesias de Atalaia e Alto-Estanqueiro-Jardia,PPM,0.41,5,150709
União das freguesias de Atalaia e Alto-Estanqueiro-Jardia,PPV,0.41,5,150709
União das freguesias de Atalaia e Alto-Estanqueiro-Jardia,PND,0.33,4,150709
União das freguesias de Atalaia e Alto-Estanqueiro-Jardia,PDA,0.08,1,150709
União das freguesias de Atalaia e Alto-Estanqueiro-Jardia,POUS,0,0,150709
