freguesia,acronym,validVotesPercentage,votes,dicofre
Cabanas de Viriato,PS,44.66,163,180202
Cabanas de Viriato,PPD/PSD,31.23,114,180202
Cabanas de Viriato,B.E.,8.77,32,180202
Cabanas de Viriato,CDS-PP,5.75,21,180202
Cabanas de Viriato,A,1.92,7,180202
Cabanas de Viriato,PCP-PEV,1.92,7,180202
Cabanas de Viriato,PAN,1.64,6,180202
Cabanas de Viriato,PPM.PPV/CDC,1.37,5,180202
Cabanas de Viriato,PURP,0.82,3,180202
Cabanas de Viriato,L,0.55,2,180202
Cabanas de Viriato,NC,0.55,2,180202
Cabanas de Viriato,IL,0.27,1,180202
Cabanas de Viriato,PDR,0.27,1,180202
Cabanas de Viriato,PTP,0.27,1,180202
Cabanas de Viriato,MAS,0,0,180202
Cabanas de Viriato,PCTP/MRPP,0,0,180202
Cabanas de Viriato,PNR,0,0,180202
