freguesia,acronym,validVotesPercentage,votes,dicofre
Costa,PPD/PSD,43.84,1206,030812
Costa,PS,28.28,778,030812
Costa,B.E.,10.07,277,030812
Costa,PCP-PEV,4.25,117,030812
Costa,CDS-PP,3.78,104,030812
Costa,PAN,2.73,75,030812
Costa,IL,2.65,73,030812
Costa,L,1.42,39,030812
Costa,A,0.84,23,030812
Costa,R.I.R.,0.65,18,030812
Costa,CH,0.44,12,030812
Costa,NC,0.22,6,030812
Costa,PCTP/MRPP,0.22,6,030812
Costa,PDR,0.18,5,030812
Costa,MPT,0.15,4,030812
Costa,PNR,0.15,4,030812
Costa,JPP,0.07,2,030812
Costa,PTP,0.04,1,030812
Costa,PURP,0.04,1,030812
Costa,MAS,0,0,030812
Costa,PPM,0,0,030812
