Objeto do Contrato,Tipo de Procedimento,Tipo(s) de Contrato,CPVs,Entidade(s) Adjudicante(s),Entidade(s) Adjudicatária(s),Preço Contratual,Data de Publicação,Data de Celebração do Contrato,Prazo de Execução,Local de Execução,Fundamentação,Data de Fecho do Contrato,Preço Total Efetivo,Causas das Alterações ao Prazo,Causas das Alterações ao Preço,Estado,N.º registo do Acordo Quadro,Descrição do Acordo Quadro,Procedimento Centralizado
"Fornecimento de Prestação de Serviços de Limpeza ao Centro Hospitalar de S. João, E.P.E.",Ajuste Direto Regime Geral,Aquisição de serviços,"90911200-8, Serviços de limpeza de edifícios","Centro Hospitalar de São João, E. P. E. (509821197)","CLECE, S.A. (980359759)","417.722,20 €",18-07-2014,09-05-2014,120 dias,"Portugal, Porto, Porto","Artigo 24.º, n.º 1, alínea a) do Código dos Contratos Públicos",,,,,,Não aplicável.,Não aplicável.,FALSE
Aquisição de Efavirenz 600mg,Ajuste Direto Regime Geral,Aquisição de bens móveis,"33670000-7, Medicamentos para o aparelho respiratório","Centro Hospitalar de São João, E. P. E. (509821197)","Merck Sharp & Dohme, Lda (500191360)","43.000,00 €",17-07-2014,23-06-2014,66 dias,"Portugal, Porto, Porto","Artigo 20.º, n.º 1, alínea a) do Código dos Contratos Públicos",,,,,,Não aplicável.,Não aplicável.,FALSE
"Aquisição de Bosentano 62,5mg e Bosentano 125mg",Ajuste Direto Regime Geral,Aquisição de bens móveis,"33650000-1, Anti-infecciosos gerais de uso sistémico, vacinas, antineoplásicos e imunomoduladores","Centro Hospitalar de São João, E. P. E. (509821197)","Sanofi - Produtos Farmacêuticos, Lda (500134960)","65.900,00 €",17-07-2014,15-04-2014,60 dias,"Portugal, Porto, Porto","Artigo 20.º, n.º 1, alínea a) do Código dos Contratos Públicos",,,,,,Não aplicável.,Não aplicável.,FALSE
Aquisição de Serviços para Desenvolvimento de Plataforma de Modelo de Custeio para Apoio à Gestão do Orçamento,Ajuste Direto Regime Geral,Aquisição de serviços,"72212482-1, Serviços de desenvolvimento de software para apoio a decisões empresariais (business intelligence)","Centro Hospitalar São João, EPE (509821197)","Winprovit - Soluções Inteligentes, S.A. (507478045)","73.430,00 €",17-07-2014,09-06-2014,30 dias,"Portugal, Porto, Porto","Artigo 20.º, n.º 1, alínea a) do Código dos Contratos Públicos",,,,,,Não aplicável.,Não aplicável.,FALSE
"Substituição da ampola do equipamento de Fluoroscopia Ziehm Vision Endo das Técnicas de Gastro do CHSJ, EPE",Ajuste Direto Regime Geral,Aquisição de bens móveis,"33111400-5, Aparelhos de fluoroscopia","Centro Hospitalar de São João, E. P. E. (509821197)",Iberdata Equipamentos SA (501904921),"17.066,23 €",16-07-2014,14-07-2014,15 dias,"Portugal, Porto, Porto","Artigo 24.º, n.º 1, alínea c) do Código dos Contratos Públicos",,,,,,Não aplicável.,Não aplicável.,FALSE
