freguesia,acronym,validVotesPercentage,votes,dicofre
Lamego (Almacave e Sé),PS,36.33,1272,180525
Lamego (Almacave e Sé),PPD/PSD.CDS-PP,33.96,1189,180525
Lamego (Almacave e Sé),MPT,9.57,335,180525
Lamego (Almacave e Sé),PCP-PEV,8.88,311,180525
Lamego (Almacave e Sé),B.E.,3.8,133,180525
Lamego (Almacave e Sé),PCTP/MRPP,1.54,54,180525
Lamego (Almacave e Sé),PAN,1.46,51,180525
Lamego (Almacave e Sé),L,1.43,50,180525
Lamego (Almacave e Sé),PPV,0.71,25,180525
Lamego (Almacave e Sé),PTP,0.71,25,180525
Lamego (Almacave e Sé),PND,0.43,15,180525
Lamego (Almacave e Sé),PNR,0.4,14,180525
Lamego (Almacave e Sé),PPM,0.37,13,180525
Lamego (Almacave e Sé),MAS,0.26,9,180525
Lamego (Almacave e Sé),PDA,0.11,4,180525
Lamego (Almacave e Sé),POUS,0.03,1,180525
