freguesia,acronym,validVotesPercentage,votes,dicofre
Fornos de Algodres,PS,57.89,286,090505
Fornos de Algodres,PPD/PSD.CDS-PP,25.91,128,090505
Fornos de Algodres,MPT,6.48,32,090505
Fornos de Algodres,PCP-PEV,4.45,22,090505
Fornos de Algodres,B.E.,2.02,10,090505
Fornos de Algodres,L,0.61,3,090505
Fornos de Algodres,MAS,0.61,3,090505
Fornos de Algodres,PND,0.61,3,090505
Fornos de Algodres,PPM,0.61,3,090505
Fornos de Algodres,PAN,0.4,2,090505
Fornos de Algodres,PTP,0.4,2,090505
Fornos de Algodres,PCTP/MRPP,0,0,090505
Fornos de Algodres,PDA,0,0,090505
Fornos de Algodres,PNR,0,0,090505
Fornos de Algodres,POUS,0,0,090505
Fornos de Algodres,PPV,0,0,090505
