freguesia,acronym,validVotesPercentage,votes,dicofre
Santa Maria da Devesa,PS,41.42,321,120502
Santa Maria da Devesa,PPD/PSD,35.61,276,120502
Santa Maria da Devesa,B.E.,7.61,59,120502
Santa Maria da Devesa,PCP-PEV,5.03,39,120502
Santa Maria da Devesa,CDS-PP,3.61,28,120502
Santa Maria da Devesa,PAN,2.06,16,120502
Santa Maria da Devesa,CH,1.55,12,120502
Santa Maria da Devesa,PCTP/MRPP,1.03,8,120502
Santa Maria da Devesa,L,0.77,6,120502
Santa Maria da Devesa,IL,0.52,4,120502
Santa Maria da Devesa,R.I.R.,0.39,3,120502
Santa Maria da Devesa,PDR,0.13,1,120502
Santa Maria da Devesa,PTP,0.13,1,120502
Santa Maria da Devesa,PURP,0.13,1,120502
Santa Maria da Devesa,A,0,0,120502
Santa Maria da Devesa,MPT,0,0,120502
Santa Maria da Devesa,PNR,0,0,120502
