Objeto do Contrato,Tipo de Procedimento,Tipo(s) de Contrato,CPVs,Entidade(s) Adjudicante(s),Entidade(s) Adjudicatária(s),Preço Contratual,Data de Publicação,Data de Celebração do Contrato,Prazo de Execução,Local de Execução,Fundamentação,Data de Fecho do Contrato,Preço Total Efetivo,Causas das Alterações ao Prazo,Causas das Alterações ao Preço,Estado,N.º registo do Acordo Quadro,Descrição do Acordo Quadro,Procedimento Centralizado
AD 2699-2016 Aquisição de Videolaringoscópio,Ajuste Direto Regime Geral,Aquisição de bens móveis,"33100000-1, Equipamento médico","Centro Hospitalar de Trás-os-Montes e Alto Douro, E. P. E. (508100496)","TEPREL-EQUIPAMENTOS MEDICOS, LDA (502262184)","9.934,63 €",30-12-2016,14-06-2016,365 dias,"Portugal, Vila Real, Vila Real","Artigo 20.º, n.º 1, alínea a) do Código dos Contratos Públicos",23-08-2016,"9.934,63 €","","",,Não aplicável.,Não aplicável.,FALSE
"AD 2554-2016 Aquisição de Ecógrafo Portátil para o serviço de Imagiologia do CHTMAD, EPE",Ajuste Direto Regime Geral,Aquisição de bens móveis,"33100000-1, Equipamento médico","Centro Hospitalar de Trás-os-Montes e Alto Douro, EPE (508100496)","PHILIPS PORTUGUESA S A, (500216843)","39.000,00 €",30-12-2016,22-09-2016,365 dias,"Portugal, Vila Real, Vila Real","Artigo 20.º, n.º 1, alínea a) do Código dos Contratos Públicos",25-10-2016,"39.000,00 €","","",,Não aplicável.,Não aplicável.,FALSE
"lote 1,2,3,4,5,6,7,8",Ao abrigo de acordo-quadro (art.º 259.º),Aquisição de bens móveis,"33140000-3, Material médico de consumo","Centro Hospitalar de Trás-os-Montes e Alto Douro, E. P. E. (508100496)",HELDER GONÇALVES (503855421),"4.577,88 €",30-12-2016,16-02-2016,365 dias,"Portugal, Vila Real, Vila Real",Artigo 259.º do Código dos Contratos Públicos,"","","","",,540623,"CONCURSO PÚBLICO PARA A CELEBRAÇÃO DE CONTRATOS PÚBLICOS DE APROVISIONAMENTO PARA A ÁREA DA SAÚDE, COM VISTA AO FORNECIMENTO DE MATERIAL DISPOSABLE DE BLOCO OPERATÓRIO - PARTE 3, ÀS INSTITUIÇÕES E SERVIÇOS DO SERVIÇO NACIONAL DE SAÚDE",FALSE
Lote 6,Concurso público,Aquisição de bens móveis,"33141323-0, Agulhas de biópsia","Centro Hospitalar de Trás-os-Montes e Alto Douro, EPE (508100496)","COVIDIEN PORTUGAL, LDA. (503413410)","2.760,00 €",30-12-2016,04-03-2016,365 dias,"Portugal, Vila Real, Vila Real","Artigo 20.º, n.º 1, alínea b) do Código dos Contratos Públicos","","","","",,Não aplicável.,Não aplicável.,FALSE
"Lote 9,10,11,12",Ao abrigo de acordo-quadro (art.º 259.º),Aquisição de bens móveis,"33140000-3, Material médico de consumo","Centro Hospitalar de Trás-os-Montes e Alto Douro, E. P. E. (508100496)",Bastos Viegas (500042772),"3.813,10 €",30-12-2016,17-02-2016,365 dias,"Portugal, Vila Real, Vila Real",Artigo 259.º do Código dos Contratos Públicos,"","","","",,540623,"CONCURSO PÚBLICO PARA A CELEBRAÇÃO DE CONTRATOS PÚBLICOS DE APROVISIONAMENTO PARA A ÁREA DA SAÚDE, COM VISTA AO FORNECIMENTO DE MATERIAL DISPOSABLE DE BLOCO OPERATÓRIO - PARTE 3, ÀS INSTITUIÇÕES E SERVIÇOS DO SERVIÇO NACIONAL DE SAÚDE",FALSE
"Lotes 1,2,3 e 4",Ajuste Direto Regime Geral,Aquisição de bens móveis,"33140000-3, Material médico de consumo","Centro Hospitalar de Trás-os-Montes e Alto Douro, EPE (508100496)","ALVES & CIA (IRMAOS), LDA (500310068)","6.206,80 €",30-12-2016,21-04-2016,365 dias,"Portugal, Vila Real, Vila Real","Artigo 20.º, n.º 1, alínea a) do Código dos Contratos Públicos",30-12-2016,"6.206,80 €",Não aplicável,Não aplicável,,Não aplicável.,Não aplicável.,FALSE
"Lotes 5,7",Concurso público,Aquisição de bens móveis,"33141323-0, Agulhas de biópsia","Centro Hospitalar de Trás-os-Montes e Alto Douro, EPE (508100496)",Clinifar (503281115),"6.266,00 €",30-12-2016,07-03-2016,365 dias,"Portugal, Vila Real, Vila Real","Artigo 20.º, n.º 1, alínea b) do Código dos Contratos Públicos","","","","",,Não aplicável.,Não aplicável.,FALSE
"Lotes 1,2,3,4,5,6, e 7",Ajuste Direto Regime Geral,Aquisição de bens móveis,"33000000-0, Equipamento médico, medicamentos e produtos para cuidados pessoais","Centro Hospitalar de Trás-os-Montes e Alto Douro, EPE (508100496)","BSC PORTUGAL, LDA. (504988964)","84.317,50 €",30-12-2016,23-03-2016,365 dias,"Portugal, Vila Real, Vila Real","Artigo 20.º, n.º 1, alínea a) do Código dos Contratos Públicos",29-12-2016,"84.317,50 €","","",,Não aplicável.,Não aplicável.,FALSE
Lote 1,Concurso público,Aquisição de bens móveis,"33141323-0, Agulhas de biópsia","Centro Hospitalar de Trás-os-Montes e Alto Douro, EPE (508100496)","Medicinália Cormédica, Lda. (500684324)","11.745,00 €",30-12-2016,04-03-2016,365 dias,"Portugal, Vila Real, Vila Real","Artigo 20.º, n.º 1, alínea b) do Código dos Contratos Públicos","","","","",,Não aplicável.,Não aplicável.,FALSE
Lotes,Concurso público,Aquisição de bens móveis,"33140000-3, Material médico de consumo<BR/>33141323-0, Agulhas de biópsia","Centro Hospitalar de Trás-os-Montes e Alto Douro, EPE (508100496)",CRBARD PORTUGAL (502438274),"34.480,00 €",30-12-2016,21-03-2016,365 dias,"Portugal, Vila Real, Vila Real","Artigo 20.º, n.º 1, alínea b) do Código dos Contratos Públicos","","","","",,Não aplicável.,Não aplicável.,FALSE
"Lotes 1,2,3,4,5,6,7,8 e 9",Ajuste Direto Regime Geral,Aquisição de bens móveis,"33140000-3, Material médico de consumo","Centro Hospitalar de Trás-os-Montes e Alto Douro, E. P. E. (508100496)",BIOSONDA (501463313),"64.343,00 €",30-12-2016,22-02-2016,365 dias,"Portugal, Vila Real, Vila Real","Artigo 20.º, n.º 1, alínea a) do Código dos Contratos Públicos",30-12-2016,"64.343,00 €",Não aplicável,Não aplicável,,Não aplicável.,Não aplicável.,FALSE
AD 2364-2016 Equipamento Diverso para a Nova Unidade de Diálise,Ajuste Direto Regime Geral,Aquisição de bens móveis,"33192000-2, Mobiliário para fins médicos","Centro Hospitalar de Trás-os-Montes e Alto Douro, E. P. E. (508100496)","Industrial Laborum Ibérica, S.A. (506692027)","5.386,76 €",30-12-2016,19-05-2016,365 dias,"Portugal, Vila Real, Vila Real","Artigo 20.º, n.º 1, alínea a) do Código dos Contratos Públicos",03-06-2016,"5.386,76 €","","",,Não aplicável.,Não aplicável.,FALSE
"Lotes 1,2,3 e 4",Ajuste Direto Regime Geral,Aquisição de bens móveis,"33000000-0, Equipamento médico, medicamentos e produtos para cuidados pessoais","Centro Hospitalar de Trás-os-Montes e Alto Douro, E. P. E. (508100496)","STRYKER PORTUGAL PRODUTOS MEDICOS, LDA (504594214)","6.800,00 €",30-12-2016,03-06-2016,365 dias,"Portugal, Vila Real, Vila Real","Artigo 20.º, n.º 1, alínea a) do Código dos Contratos Públicos",30-12-2016,"6.800,00 €",Não aplicável,Não aplicável,,Não aplicável.,Não aplicável.,FALSE
Lote 1,Ajuste Direto Regime Geral,Aquisição de bens móveis,"33140000-3, Material médico de consumo","Centro Hospitalar de Trás-os-Montes e Alto Douro, EPE (508100496)",Grifols Portugal (502041285),"9.120,00 €",30-12-2016,17-02-2016,365 dias,"Portugal, Vila Real, Vila Real","Artigo 20.º, n.º 1, alínea a) do Código dos Contratos Públicos",20-10-2016,"7.614,00 €",não aplicável,não aplicável,,Não aplicável.,Não aplicável.,FALSE
"AD 2276-2016 Aquisição de Angiógrafo  para o Serviço de Oftalmologia do CHTMAD, EPE.",Ajuste Direto Regime Geral,Aquisição de bens móveis,"33122000-1, Equipamento oftalmológico","Centro Hospitalar de Trás-os-Montes e Alto Douro, E. P. E. (508100496)","GRUPO TAPER - EQUIPAMENTOS DE PRECISÃO CIENTÍFICA, LDA (506886336)","41.899,90 €",30-12-2016,05-12-2016,365 dias,"Portugal, Vila Real, Vila Real","Artigo 20.º, n.º 1, alínea a) do Código dos Contratos Públicos",30-12-2016,"41.899,90 €",Não aplicável,Não aplicável,,Não aplicável.,Não aplicável.,FALSE
"Material Gastrenterologia - Lotes 1, 2 e 3",Ajuste Direto Regime Geral,Aquisição de bens móveis,"33140000-3, Material médico de consumo","Centro Hospitalar de Trás-os-Montes e Alto Douro, EPE (508100496)",Endotécnica (503818348),"37.983,00 €",30-12-2016,10-03-2016,365 dias,"Portugal, Vila Real, Vila Real","Artigo 20.º, n.º 1, alínea a) do Código dos Contratos Públicos",29-12-2016,"19.447,00 €",não aplicável,não aplicável,,Não aplicável.,Não aplicável.,FALSE
AZUL PATENTE,Ajuste Direto Regime Geral,Aquisição de bens móveis,"33600000-6, Produtos farmacêuticos","Centro Hospitalar de Trás-os-Montes e Alto Douro, E. P. E. (508100496)",A.MARTINS E FERNANDES S.A (501172114),"10.000,00 €",30-12-2016,04-03-2016,365 dias,"Portugal, Vila Real, Vila Real","Artigo 24.º, n.º 1, alínea e) do Código dos Contratos Públicos",30-12-2016,"10.000,00 €",Não aplicável,Não aplicável,,Não aplicável.,Não aplicável.,FALSE
"Lotes 3, 6,9 10",Concurso público,Aquisição de bens móveis,"33140000-3, Material médico de consumo","Centro Hospitalar de Trás-os-Montes e Alto Douro, EPE (508100496)",KVTech Portugal (508671531),"867,40 €",30-12-2016,15-03-2016,365 dias,"Portugal, Vila Real, Vila Real","Artigo 20.º, n.º 1, alínea b) do Código dos Contratos Públicos","","","","",,Não aplicável.,Não aplicável.,FALSE
Lote 13,Concurso público,Aquisição de bens móveis,"33141615-4, Sacos para urina","Centro Hospitalar de Trás-os-Montes e Alto Douro, EPE (508100496)","ANASTACIO SALDANHA UNIPESSOAL, LDA. (505804441)","787,50 €",30-12-2016,07-03-2016,365 dias,"Portugal, Vila Real, Vila Real","Artigo 20.º, n.º 1, alínea b) do Código dos Contratos Públicos","","","","",,Não aplicável.,Não aplicável.,FALSE
Lote 26,Concurso público,Aquisição de bens móveis,"33141640-8, Drenos","Centro Hospitalar de Trás-os-Montes e Alto Douro, EPE (508100496)","COVIDIEN PORTUGAL, LDA. (503413410)","110,00 €",30-12-2016,04-03-2016,365 dias,"Portugal, Vila Real, Vila Real","Artigo 20.º, n.º 1, alínea b) do Código dos Contratos Públicos","","","","",,Não aplicável.,Não aplicável.,FALSE
"Lotes 15, 16, 18, 19, 20, 21, 22, 25, 27",Concurso público,Aquisição de bens móveis,"33192320-1, Suportes para sacos de urina<BR/>33140000-3, Material médico de consumo<BR/>33141640-8, Drenos","Centro Hospitalar de Trás-os-Montes e Alto Douro, EPE (508100496)","Medicinália Cormédica, Lda. (500684324)","27.274,40 €",30-12-2016,09-03-2016,365 dias,"Portugal, Vila Real, Vila Real","Artigo 20.º, n.º 1, alínea b) do Código dos Contratos Públicos","","","","",,Não aplicável.,Não aplicável.,FALSE
Lote 1,Ajuste Direto Regime Geral,Aquisição de bens móveis,"33190000-8, Dispositivos e produtos médicos variados","Centro Hospitalar de Trás-os-Montes e Alto Douro, EPE (508100496)",OLYMPUS IBERIA (980474710),"9.812,40 €",30-12-2016,08-01-2016,365 dias,"Portugal, Vila Real, Vila Real","Artigo 20.º, n.º 1, alínea a) do Código dos Contratos Públicos",30-12-2016,"9.812,40 €",Não aplicável,Não aplicável,,Não aplicável.,Não aplicável.,FALSE
"Lotes 2, 17",Concurso público,Aquisição de bens móveis,"33141640-8, Drenos<BR/>33140000-3, Material médico de consumo","Centro Hospitalar de Trás-os-Montes e Alto Douro, EPE (508100496)",HR HOSPITALAR (501895558),"2.960,00 €",30-12-2016,04-03-2016,365 dias,"Portugal, Vila Real, Vila Real","Artigo 20.º, n.º 1, alínea b) do Código dos Contratos Públicos","","","","",,Não aplicável.,Não aplicável.,FALSE
"Lotes 4, 5, 7",Concurso público,Aquisição de bens móveis,"33141610-9, Sacos de drenagem<BR/>33140000-3, Material médico de consumo","Centro Hospitalar de Trás-os-Montes e Alto Douro, EPE (508100496)","B.BRAUN MEDICAL, LDA. (501506543)","7.877,20 €",30-12-2016,04-03-2016,365 dias,"Portugal, Vila Real, Vila Real","Artigo 20.º, n.º 1, alínea b) do Código dos Contratos Públicos","","","","",,Não aplicável.,Não aplicável.,FALSE
"Lote 4,5,6,7,8,16,17",Ajuste Direto Regime Geral,Aquisição de bens móveis,"33000000-0, Equipamento médico, medicamentos e produtos para cuidados pessoais<BR/>33190000-8, Dispositivos e produtos médicos variados","Centro Hospitalar de Trás-os-Montes e Alto Douro, EPE (508100496)","TITO & FIDALGOS, LDA (502629703)","6.246,49 €",30-12-2016,11-01-2016,365 dias,"Portugal, Vila Real, Vila Real","Artigo 20.º, n.º 1, alínea a) do Código dos Contratos Públicos",30-12-2016,"6.246,49 €",Não aplicável,Não aplicável,,Não aplicável.,Não aplicável.,FALSE
Cateteres de balão,Ajuste Direto Regime Geral,Aquisição de bens móveis,"33141210-5, Cateteres de balão","CENTRO HOSP. DE TRÁS-OS-MONTES E ALTO DOURO, EPE (508100496)",ST. JUDE MEDICAL PORTUGAL (504180746),"10.200,00 €",30-12-2016,23-06-2016,365 dias,"Portugal, Vila Real, Vila Real","Artigo 20.º, n.º 1, alínea a) do Código dos Contratos Públicos",22-12-2016,"10.200,00 €",Não aplicável,Não aplicável,,Não aplicável.,Não aplicável.,FALSE
"Lotes 14, 23",Concurso público,Aquisição de bens móveis,"33140000-3, Material médico de consumo","Centro Hospitalar de Trás-os-Montes e Alto Douro, EPE (508100496)",AVIQUIMICA (500039720),"34.868,00 €",30-12-2016,09-03-2016,365 dias,"Portugal, Vila Real, Vila Real","Artigo 20.º, n.º 1, alínea b) do Código dos Contratos Públicos","","","","",,Não aplicável.,Não aplicável.,FALSE
"Lotes 1,2,3,4,5,6,7",Ao abrigo de acordo-quadro (art.º 259.º),Aquisição de bens móveis,"33140000-3, Material médico de consumo","Centro Hospitalar de Trás-os-Montes e Alto Douro, E. P. E. (508100496)",OVERPHARMA PROD. MEDICOS FARM. (505792362),"1.867,26 €",30-12-2016,05-02-2016,365 dias,"Portugal, Vila Real, Vila Real","Artigo 20.º, n.º 1, alínea b) do Código dos Contratos Públicos",20-12-2016,"920,86 €",não aplicável,não aplicável,,1415642,CP 2015/36,FALSE
"LOTES: 3,6,14,15,18.",Ajuste Direto Regime Geral,Aquisição de bens móveis,"33600000-6, Produtos farmacêuticos","Centro Hospitalar de Trás-os-Montes e Alto Douro, E. P. E. (508100496)","DUX PHARMA, UNIPESSOAL LDA (510803679)","30.044,49 €",30-12-2016,15-01-2016,365 dias,"Portugal, Vila Real, Vila Real","Artigo 20.º, n.º 1, alínea a) do Código dos Contratos Públicos",26-12-2016,"29.567,11 €",não aplicável,não aplicável,,Não aplicável.,Não aplicável.,FALSE
Lote 3,Ao abrigo de acordo-quadro (art.º 259.º),Aquisição de bens móveis,"33140000-3, Material médico de consumo","Centro Hospitalar de Trás-os-Montes e Alto Douro, E. P. E. (508100496)",OVERPHARMA PROD. MEDICOS FARM. (505792362),"768,00 €",30-12-2016,23-04-2016,365 dias,"Portugal, Vila Real, Vila Real","Artigo 20.º, n.º 1, alínea b) do Código dos Contratos Públicos",30-12-2016,"768,00 €",Não aplicável,Não aplicável,,1212278,"CONCURSO PÚBLICO PARA A CELEBRAÇÃO DE CONTRATOS PÚBLICOS DE APROVISIONAMENTO PARA A ÁREA DA SAÚDE, COM VISTA AO FORNECIMENTO DE CATETERES, ÀS INSTITUIÇÕES E SERVIÇOS DO SERVIÇO NACIONAL DE SAÚDE",FALSE
"LOTES: 4,9,11,13.",Ajuste Direto Regime Geral,Aquisição de bens móveis,"33600000-6, Produtos farmacêuticos","Centro Hospitalar de Trás-os-Montes e Alto Douro, E. P. E. (508100496)","IDIS THE WORLD MEDICINES, LMTD (700513982)","4.864,67 €",30-12-2016,19-01-2016,365 dias,"Portugal, Vila Real, Vila Real","Artigo 20.º, n.º 1, alínea a) do Código dos Contratos Públicos",22-09-2016,"3.770,00 €",não aplicável,não aplicável,,Não aplicável.,Não aplicável.,FALSE
Lote 1,Ao abrigo de acordo-quadro (art.º 259.º),Aquisição de bens móveis,"33140000-3, Material médico de consumo","Centro Hospitalar de Trás-os-Montes e Alto Douro, E. P. E. (508100496)",Socime II (504453939),"8.056,00 €",30-12-2016,18-03-2016,365 dias,"Portugal, Vila Real, Vila Real","Artigo 20.º, n.º 1, alínea b) do Código dos Contratos Públicos",30-12-2016,"8.056,00 €",Não aplicável,Não aplicável,,1212278,"CONCURSO PÚBLICO PARA A CELEBRAÇÃO DE CONTRATOS PÚBLICOS DE APROVISIONAMENTO PARA A ÁREA DA SAÚDE, COM VISTA AO FORNECIMENTO DE CATETERES, ÀS INSTITUIÇÕES E SERVIÇOS DO SERVIÇO NACIONAL DE SAÚDE",FALSE
Lote 30,Ao abrigo de acordo-quadro (art.º 259.º),Aquisição de bens móveis,"33140000-3, Material médico de consumo","Centro Hospitalar de Trás-os-Montes e Alto Douro, E. P. E. (508100496)",VYGON (PORTUGAL) LDA. (503232785),"62.820,00 €",30-12-2016,16-03-2016,365 dias,"Portugal, Vila Real, Vila Real","Artigo 20.º, n.º 1, alínea b) do Código dos Contratos Públicos",30-12-2016,"62.820,00 €",Não aplicável,Não aplicável,,1212278,"CONCURSO PÚBLICO PARA A CELEBRAÇÃO DE CONTRATOS PÚBLICOS DE APROVISIONAMENTO PARA A ÁREA DA SAÚDE, COM VISTA AO FORNECIMENTO DE CATETERES, ÀS INSTITUIÇÕES E SERVIÇOS DO SERVIÇO NACIONAL DE SAÚDE",FALSE
"Lotes 5, 7",Ao abrigo de acordo-quadro (art.º 259.º),Aquisição de bens móveis,"33140000-3, Material médico de consumo","Centro Hospitalar de Trás-os-Montes e Alto Douro, E. P. E. (508100496)","PMH - Produtos Médicos -Hospitalares, SA (502376899)","7.000,00 €",30-12-2016,18-03-2016,365 dias,"Portugal, Vila Real, Vila Real","Artigo 20.º, n.º 1, alínea b) do Código dos Contratos Públicos",30-12-2016,"7.000,00 €",Não aplicável,Não aplicável,,1212278,"CONCURSO PÚBLICO PARA A CELEBRAÇÃO DE CONTRATOS PÚBLICOS DE APROVISIONAMENTO PARA A ÁREA DA SAÚDE, COM VISTA AO FORNECIMENTO DE CATETERES, ÀS INSTITUIÇÕES E SERVIÇOS DO SERVIÇO NACIONAL DE SAÚDE",FALSE
"Lotes 9,10,11,16,17,18,19,20,21,23,24,25,26,27,28",Ao abrigo de acordo-quadro (art.º 259.º),Aquisição de bens móveis,"33140000-3, Material médico de consumo","Centro Hospitalar de Trás-os-Montes e Alto Douro, E. P. E. (508100496)",B BRAUN MEDICAL LDA (501506543),"48.207,09 €",30-12-2016,16-03-2016,365 dias,"Portugal, Vila Real, Vila Real","Artigo 20.º, n.º 1, alínea b) do Código dos Contratos Públicos",30-12-2016,"48.207,09 €",Não aplicável,Não aplicável,,1212278,"CONCURSO PÚBLICO PARA A CELEBRAÇÃO DE CONTRATOS PÚBLICOS DE APROVISIONAMENTO PARA A ÁREA DA SAÚDE, COM VISTA AO FORNECIMENTO DE CATETERES, ÀS INSTITUIÇÕES E SERVIÇOS DO SERVIÇO NACIONAL DE SAÚDE",FALSE
"Material Imobilização - Lotes 1,2,3 e 26",Ajuste Direto Regime Geral,Aquisição de bens móveis,"33140000-3, Material médico de consumo","Centro Hospitalar de Trás-os-Montes e Alto Douro, EPE (508100496)","BSN MEDICAL, S.A. (505385058)","75,50 €",30-12-2016,30-08-2016,365 dias,"Portugal, Vila Real, Vila Real","Artigo 20.º, n.º 1, alínea a) do Código dos Contratos Públicos",30-12-2016,"75,50 €",Não aplicável,Não aplicável,,Não aplicável.,Não aplicável.,FALSE
"Lote 7,8,24,25,26,27,30",Concurso público,Aquisição de bens móveis,"33140000-3, Material médico de consumo<BR/>33141126-9, Ligaduras","Centro Hospitalar de Trás-os-Montes e Alto Douro, E. P. E. (508100496)","BSN MEDICAL, S.A. (505385058)","8.232,80 €",30-12-2016,26-02-2016,365 dias,"Portugal, Vila Real, Vila Real","Artigo 20.º, n.º 1, alínea b) do Código dos Contratos Públicos","","","","",,Não aplicável.,Não aplicável.,FALSE
"Material Imobilização - Lotes 7,8,9 e 32",Ajuste Direto Regime Geral,Aquisição de bens móveis,"33000000-0, Equipamento médico, medicamentos e produtos para cuidados pessoais","Centro Hospitalar de Trás-os-Montes e Alto Douro, EPE (508100496)",EPJ (506820513),"591,36 €",30-12-2016,25-02-2016,365 dias,"Portugal, Vila Real, Vila Real","Artigo 20.º, n.º 1, alínea a) do Código dos Contratos Públicos",30-12-2016,"591,36 €",Não aplicável,Não aplicável,,Não aplicável.,Não aplicável.,FALSE
Material de Imobilização - Lotes 10 e 34,Ajuste Direto Regime Geral,Aquisição de bens móveis,"33000000-0, Equipamento médico, medicamentos e produtos para cuidados pessoais","Centro Hospitalar de Trás-os-Montes e Alto Douro, EPE (508100496)",EXPOMEDICA (501886621),"594,40 €",30-12-2016,25-02-2016,365 dias,"Portugal, Vila Real, Vila Real","Artigo 20.º, n.º 1, alínea a) do Código dos Contratos Públicos",30-12-2016,"594,40 €",Não aplicável,Não aplicável,,Não aplicável.,Não aplicável.,FALSE
"Lotes 2, 6, 31, 32, 33 e 34",Ao abrigo de acordo-quadro (art.º 259.º),Aquisição de bens móveis,"33140000-3, Material médico de consumo","Centro Hospitalar de Trás-os-Montes e Alto Douro, E. P. E. (508100496)","CAREFUSION PORTUGAL 332 - PRODUTOS MEDICOS, LDA (503898554)","45.836,40 €",30-12-2016,16-03-2016,365 dias,"Portugal, Vila Real, Vila Real","Artigo 20.º, n.º 1, alínea b) do Código dos Contratos Públicos",30-12-2016,"45.836,40 €",Não aplicável,Não aplicável,,1212278,"CONCURSO PÚBLICO PARA A CELEBRAÇÃO DE CONTRATOS PÚBLICOS DE APROVISIONAMENTO PARA A ÁREA DA SAÚDE, COM VISTA AO FORNECIMENTO DE CATETERES, ÀS INSTITUIÇÕES E SERVIÇOS DO SERVIÇO NACIONAL DE SAÚDE",FALSE
Material Consumo Pediatria/Neonatologia - Lotes 22 e 23,Ajuste Direto Regime Geral,Aquisição de bens móveis,"33140000-3, Material médico de consumo","Centro Hospitalar de Trás-os-Montes e Alto Douro, EPE (508100496)",DRAEGER PORTUGAL (508771323),"2.806,00 €",30-12-2016,18-04-2016,365 dias,"Portugal, Vila Real, Vila Real","Artigo 20.º, n.º 1, alínea a) do Código dos Contratos Públicos",29-12-2016,"2.344,61 €",não aplicável,não aplicável,,Não aplicável.,Não aplicável.,FALSE
"Material Consumo Pediatria/Neonatologia - Lotes 20,24,25,26 e 27",Ajuste Direto Regime Geral,Aquisição de bens móveis,"33140000-3, Material médico de consumo","Centro Hospitalar de Trás-os-Montes e Alto Douro, EPE (508100496)",INTERSURGICAL (503480045),"1.410,00 €",30-12-2016,25-10-2016,365 dias,"Portugal, Vila Real, Vila Real","Artigo 20.º, n.º 1, alínea a) do Código dos Contratos Públicos",29-12-2016,"840,00 €",não aplicável,não aplicável,,Não aplicável.,Não aplicável.,FALSE
"AD 1875-2016 Aquisição de cortinas hospitalares para o CHTMAD, EPE",Ajuste Direto Regime Geral,Aquisição de bens móveis,"39515100-6, Cortinados","Centro Hospitalar de Trás-os-Montes e Alto Douro, E. P. E. (508100496)","MEILEX, LDA (501759441)","6.788,27 €",30-12-2016,11-07-2016,365 dias,"Portugal, Vila Real, Vila Real","Artigo 20.º, n.º 1, alínea a) do Código dos Contratos Públicos",29-09-2016,"6.788,27 €","","",,Não aplicável.,Não aplicável.,FALSE
"Lote 2,3,4,17,20,21,28,31,32,",Concurso público,Aquisição de bens móveis,"33140000-3, Material médico de consumo<BR/>33141126-9, Ligaduras","Centro Hospitalar de Trás-os-Montes e Alto Douro, E. P. E. (508100496)",BASTOS & VIEGAS (500042772),"4.192,93 €",30-12-2016,26-02-2016,365 dias,"Portugal, Vila Real, Vila Real","Artigo 20.º, n.º 1, alínea b) do Código dos Contratos Públicos","","","","",,Não aplicável.,Não aplicável.,FALSE
"Material de Consumo para Peditaria/Neonatologia - Lotes 1,9 e 19",Ajuste Direto Regime Geral,Aquisição de bens móveis,"33140000-3, Material médico de consumo","Centro Hospitalar de Trás-os-Montes e Alto Douro, EPE (508100496)",Covidien portugal (503413410),"290,00 €",30-12-2016,31-03-2016,365 dias,"Portugal, Vila Real, Vila Real","Artigo 20.º, n.º 1, alínea a) do Código dos Contratos Públicos",28-12-2016,"126,00 €",não aplicável,não aplicável,,Não aplicável.,Não aplicável.,FALSE
"Lote 9,12,13",Concurso público,Aquisição de bens móveis,"33141115-9, Algodão para fins médicos<BR/>33141126-9, Ligaduras","Centro Hospitalar de Trás-os-Montes e Alto Douro, E. P. E. (508100496)",EZEQUIEL PANAO JORGE (501412727),"4.287,85 €",30-12-2016,26-02-2016,365 dias,"Portugal, Vila Real, Vila Real","Artigo 20.º, n.º 1, alínea b) do Código dos Contratos Públicos","","","","",,Não aplicável.,Não aplicável.,FALSE
"AD 1304-2016 -Obras de Readaptação nos Exames Especiais de Cardiologia do CHTMAD, EPE.",Ajuste Direto Regime Geral,Empreitadas de obras públicas,"45215100-8, Obras de construção de edifícios relacionados com serviços de saúde","Centro Hospitalar de Trás-os-Montes e Alto Douro, EPE (508100496)","TOGAMIL – CONSTRUÇÕES, LIMITADA (502293934)","12.812,98 €",30-12-2016,16-06-2016,365 dias,"Portugal, Vila Real, Vila Real","Artigo 19.º, alínea a) do Código dos Contratos Públicos","","12.812,98 €",Não houve alterações ao prazo,"",,Não aplicável.,Não aplicável.,FALSE
Lote 1,Concurso público,Aquisição de bens móveis,"33141111-1, Pensos adesivos","Centro Hospitalar de Trás-os-Montes e Alto Douro, E. P. E. (508100496)","Quilaban, S.A (500399670)","50,93 €",30-12-2016,29-02-2016,365 dias,"Portugal, Vila Real, Vila Real","Artigo 20.º, n.º 1, alínea b) do Código dos Contratos Públicos","","","","",,Não aplicável.,Não aplicável.,FALSE
"Lote 22,23,29",Concurso público,Aquisição de bens móveis,"33141126-9, Ligaduras<BR/>33141111-1, Pensos adesivos","Centro Hospitalar de Trás-os-Montes e Alto Douro, E. P. E. (508100496)",PAUL HARTAMNN (502271728),"529,00 €",30-12-2016,26-02-2016,365 dias,"Portugal, Vila Real, Vila Real","Artigo 20.º, n.º 1, alínea b) do Código dos Contratos Públicos","","","","",,Não aplicável.,Não aplicável.,FALSE
Lote 5,Concurso público,Aquisição de bens móveis,"33141111-1, Pensos adesivos","Centro Hospitalar de Trás-os-Montes e Alto Douro, E. P. E. (508100496)",Molnlycke Health Care Lda (511101066),"1.488,00 €",30-12-2016,15-03-2016,365 dias,"Portugal, Vila Real, Vila Real","Artigo 20.º, n.º 1, alínea b) do Código dos Contratos Públicos","","","","",,Não aplicável.,Não aplicável.,FALSE
"AD 1190-2016 Aquisição de uma Central de Monitorização e Monitores Multiparâmetros para o CHTMAD, EPE.",Ajuste Direto Regime Geral,Aquisição de bens móveis,"33195200-5, Unidade central de monitorização","Centro Hospitalar de Trás-os-Montes e Alto Douro, EPE (508100496)","GERANSWERS UNIPESSOAL, LDA(507683528) (507683528)","27.500,00 €",29-12-2016,19-05-2016,365 dias,"Portugal, Vila Real, Vila Real","Artigo 20.º, n.º 1, alínea a) do Código dos Contratos Públicos",24-06-2016,"27.500,00 €","","",,Não aplicável.,Não aplicável.,FALSE
"Lote 2,4, 55",Concurso público,Aquisição de bens móveis,"33140000-3, Material médico de consumo","Centro Hospitalar de Trás-os-Montes e Alto Douro, EPE (508100496)","Sarstedt - Tecnologia de Laboratório, S.A. (503019461)","2.820,75 €",29-12-2016,30-03-2016,365 dias,"Portugal, Vila Real, Vila Real","Artigo 20.º, n.º 1, alínea b) do Código dos Contratos Públicos","","","","",,Não aplicável.,Não aplicável.,FALSE
Lote 13,Ajuste Direto Regime Geral,Aquisição de bens móveis,"33140000-3, Material médico de consumo","Centro Hospitalar de Trás-os-Montes e Alto Douro, E. P. E. (508100496)",Bastos Viegas S.A. (500042772),"336,00 €",29-12-2016,12-02-2016,365 dias,"Portugal, Vila Real, Vila Real","Artigo 20.º, n.º 1, alínea a) do Código dos Contratos Públicos",30-12-2016,"336,00 €",Não aplicável,Não aplicável,,Não aplicável.,Não aplicável.,FALSE
Lotes 6 e 7,Ajuste Direto Regime Geral,Aquisição de bens móveis,"33140000-3, Material médico de consumo","Centro Hospitalar de Trás-os-Montes e Alto Douro, E. P. E. (508100496)","ANASTACIO SALDANHA UNIPESSOAL, LDA. (505804441)","96,80 €",29-12-2016,10-02-2016,365 dias,"Portugal, Vila Real, Vila Real","Artigo 20.º, n.º 1, alínea a) do Código dos Contratos Públicos",30-12-2016,"96,80 €",Não aplicável,Não aplicável,,Não aplicável.,Não aplicável.,FALSE
Lotes 15 e 25,Ajuste Direto Regime Geral,Aquisição de bens móveis,"33140000-3, Material médico de consumo","Centro Hospitalar de Trás-os-Montes e Alto Douro, E. P. E. (508100496)",Speculum (502996323),"7.006,00 €",29-12-2016,10-02-2016,365 dias,"Portugal, Vila Real, Vila Real","Artigo 20.º, n.º 1, alínea a) do Código dos Contratos Públicos",30-12-2016,"7.006,00 €",Não aplicável,Não aplicável,,Não aplicável.,Não aplicável.,FALSE
"Lotes 1,3,4,5 e 9",Ajuste Direto Regime Geral,Aquisição de bens móveis,"33140000-3, Material médico de consumo","Centro Hospitalar de Trás-os-Montes e Alto Douro, E. P. E. (508100496)",Eurocasmedica (503322105),"1.784,85 €",29-12-2016,10-02-2016,365 dias,"Portugal, Vila Real, Vila Real","Artigo 20.º, n.º 1, alínea a) do Código dos Contratos Públicos",30-12-2016,"1.784,85 €",Não aplicável,Não aplicável,,Não aplicável.,Não aplicável.,FALSE
"Lotes 3, 7, 8,9",Ao abrigo de acordo-quadro (art.º 259.º),Aquisição de bens móveis,"33140000-3, Material médico de consumo","Centro Hospitalar de Trás-os-Montes e Alto Douro, E. P. E. (508100496)","BECTON DISKINSON, S.A. - SUCURSAL EM PORTUGAL (980245214)","26.206,50 €",29-12-2016,10-02-2016,365 dias,"Portugal, Vila Real, Vila Real","Artigo 20.º, n.º 1, alínea b) do Código dos Contratos Públicos",19-12-2016,"24.104,40 €",não aplicável,não aplicável,,1350003,Acordo Quadro para fornecimento de sistemas fechados e material diverso de recolha de sangue às instituições do SNS,FALSE
Sistema de Aquisição de Imagem Endoscópica,Ajuste Direto Regime Geral,Aquisição de bens móveis,"33168000-5, Aparelhos para endoscopia e endocirurgia","Centro Hospitalar de Trás-os-Montes e Alto Douro, EPE (508100496)",Teprel (502262184),"18.450,00 €",29-12-2016,08-06-2016,365 dias,"Portugal, Vila Real, Vila Real","Artigo 20.º, n.º 1, alínea a) do Código dos Contratos Públicos",11-07-2016,"18.450,00 €","","",,Não aplicável.,Não aplicável.,FALSE
"Lotes 1, 2, 6, 10 e 11",Ao abrigo de acordo-quadro (art.º 259.º),Aquisição de bens móveis,"33140000-3, Material médico de consumo","Centro Hospitalar de Trás-os-Montes e Alto Douro, E. P. E. (508100496)","VACUETTE PORTUGAL, S.A. (505348470)","1.829,71 €",29-12-2016,10-02-2016,365 dias,"Portugal, Vila Real, Vila Real","Artigo 20.º, n.º 1, alínea b) do Código dos Contratos Públicos",28-11-2016,"1.128,60 €",não aplicável,não aplicável,,1350003,Acordo Quadro para fornecimento de sistemas fechados e material diverso de recolha de sangue às instituições do SNS,FALSE
"Lote 21,22,23,24,25",Concurso público,Aquisição de bens móveis,"33140000-3, Material médico de consumo","Centro Hospitalar de Trás-os-Montes e Alto Douro, EPE (508100496)","FISHER SCIENTIFIC, UNIPESSOAL, LDA. (506429210)","673,06 €",29-12-2016,01-04-2016,365 dias,"Portugal, Vila Real, Vila Real","Artigo 20.º, n.º 1, alínea b) do Código dos Contratos Públicos","","","","",,Não aplicável.,Não aplicável.,FALSE
"Lotes 8,10,11,12,14,16,18,19,20,21,22,23,24,25 e 27",Ajuste Direto Regime Geral,Aquisição de bens móveis,"33140000-3, Material médico de consumo","Centro Hospitalar de Trás-os-Montes e Alto Douro, E. P. E. (508100496)",Filsat (506708616),"3.844,70 €",29-12-2016,10-02-2016,365 dias,"Portugal, Vila Real, Vila Real","Artigo 20.º, n.º 1, alínea a) do Código dos Contratos Públicos",30-12-2016,"3.844,70 €",Não aplicável,Não aplicável,,Não aplicável.,Não aplicável.,FALSE
Lotes 4 e 5,Ao abrigo de acordo-quadro (art.º 259.º),Aquisição de bens móveis,"33140000-3, Material médico de consumo","Centro Hospitalar de Trás-os-Montes e Alto Douro, E. P. E. (508100496)","Normax, Ldª. (500203130)","15.414,00 €",29-12-2016,10-02-2016,365 dias,"Portugal, Vila Real, Vila Real","Artigo 20.º, n.º 1, alínea b) do Código dos Contratos Públicos",16-12-2016,"14.057,00 €",não aplicável,não aplicável,,1350003,Acordo Quadro para fornecimento de sistemas fechados e material diverso de recolha de sangue às instituições do SNS,FALSE
Lote 48 e 56,Concurso público,Aquisição de bens móveis,"33140000-3, Material médico de consumo","Centro Hospitalar de Trás-os-Montes e Alto Douro, EPE (508100496)","FRILABO II, LDA (507958861)","591,00 €",29-12-2016,30-03-2016,365 dias,"Portugal, Vila Real, Vila Real","Artigo 20.º, n.º 1, alínea b) do Código dos Contratos Públicos","","","","",,Não aplicável.,Não aplicável.,FALSE
"Aquisição de um Audiómetro Clínico de dois Canais para ORL do CHTMAD, EPE.",Ajuste Direto Regime Geral,Aquisição de bens móveis,"33121400-8, Audiómetros","Centro Hospitalar de Trás-os-Montes e Alto Douro, EPE (508100496)","Amplifon Portugal, SA (503325872)","6.850,00 €",29-12-2016,27-05-2016,365 dias,"Portugal, Vila Real, Vila Real","Artigo 20.º, n.º 1, alínea a) do Código dos Contratos Públicos",30-06-2016,"6.850,00 €","","",,Não aplicável.,Não aplicável.,FALSE
"Lotes 1, 2, 4, 5, 6, 7, 8, 9, 10, 11",Ajuste Direto Regime Geral,Aquisição de bens móveis,"33140000-3, Material médico de consumo","Centro Hospitalar de Trás-os-Montes e Alto Douro, E. P. E. (508100496)",DRAEGER PORTUGAL (508771323),"13.690,75 €",29-12-2016,01-02-2016,365 dias,"Portugal, Vila Real, Vila Real","Artigo 20.º, n.º 1, alínea a) do Código dos Contratos Públicos",04-12-2016,"8.936,40 €",não aplicável,não aplicável,,Não aplicável.,Não aplicável.,FALSE
BROMETO DE IPRATROPIO 0.25MG/ML SOLUÇAO PARA INALAÇAO POR NEBULIZAÇAO,Ao abrigo de acordo-quadro (art.º 259.º),Aquisição de bens móveis,"33600000-6, Produtos farmacêuticos","Centro Hospitalar de Trás-os-Montes e Alto Douro, E. P. E. (508100496)","Teva Pharma - Produtos Farmacêuticos, Lda (507045491)","18.000,00 €",29-12-2016,15-01-2016,365 dias,"Portugal, Vila Real, Vila Real",Artigo 259.º do Código dos Contratos Públicos,27-12-2016,"16.742,40 €",não aplicável,não aplicável,,469931,CP 2012/12 - Medicamentos do Aparelho Respiratório,FALSE
"Lote 6,7,8,27,31,32,36,37,40,41,42,53,57,58,65,74",Concurso público,Aquisição de bens móveis,"33140000-3, Material médico de consumo","Centro Hospitalar de Trás-os-Montes e Alto Douro, EPE (508100496)"," VWR INTERNATIONAL- MATERIAL DE LABORATORIO, LDA (503842770)","5.022,40 €",29-12-2016,30-03-2016,365 dias,"Portugal, Vila Real, Vila Real","Artigo 20.º, n.º 1, alínea b) do Código dos Contratos Públicos","","","","",,Não aplicável.,Não aplicável.,FALSE
lotes 1 e 2,Ajuste Direto Regime Geral,Aquisição de bens móveis,"33100000-1, Equipamento médico","Centro Hospitalar de Trás-os-Montes e Alto Douro, EPE (508100496)",Covidienv portugal (503413410),"23.630,00 €",29-12-2016,23-02-2016,365 dias,"Portugal, Vila Real, Vila Real","Artigo 20.º, n.º 1, alínea a) do Código dos Contratos Públicos",30-12-2016,"23.630,00 €",Não aplicável,Não aplicável,,Não aplicável.,Não aplicável.,FALSE
"Remodelação da Central de Transportes e  Gabinetes da Consulta Externa do CHTMAD, EPE.",Ajuste Direto Regime Geral,Empreitadas de obras públicas,"45215100-8, Obras de construção de edifícios relacionados com serviços de saúde","Centro Hospitalar de Trás-os-Montes e Alto Douro, EPE (508100496)","TOGAMIL – CONSTRUÇÕES, LIMITADA (502293934)","35.854,50 €",29-12-2016,16-03-2016,365 dias,"Portugal, Vila Real, Vila Real","Artigo 19.º, alínea a) do Código dos Contratos Públicos","","35.854,50 €",Não houve alterações ao prazo,"",,Não aplicável.,Não aplicável.,FALSE
Lote 72,Concurso público,Aquisição de bens móveis,"33140000-3, Material médico de consumo","Centro Hospitalar de Trás-os-Montes e Alto Douro, EPE (508100496)","Bio-Rad Laboratórios, lda. (501301321)","1.590,00 €",29-12-2016,22-04-2016,365 dias,"Portugal, Vila Real, Vila Real","Artigo 20.º, n.º 1, alínea b) do Código dos Contratos Públicos","","","","",,Não aplicável.,Não aplicável.,FALSE
Lote 2,Ajuste Direto Regime Geral,Aquisição de bens móveis,"33000000-0, Equipamento médico, medicamentos e produtos para cuidados pessoais","Centro Hospitalar de Trás-os-Montes e Alto Douro, E. P. E. (508100496)","A. J. OLIVEIRA, LDA (502293748)","2.852,00 €",29-12-2016,19-01-2016,365 dias,"Portugal, Vila Real, Vila Real","Artigo 20.º, n.º 1, alínea a) do Código dos Contratos Públicos",15-12-2016,"2.645,00 €",não aplicável,não aplicável,,Não aplicável.,Não aplicável.,FALSE
Lote 1,Ajuste Direto Regime Geral,Aquisição de bens móveis,"33000000-0, Equipamento médico, medicamentos e produtos para cuidados pessoais","Centro Hospitalar de Trás-os-Montes e Alto Douro, E. P. E. (508100496)",epjmedica (506820513),"13.413,60 €",29-12-2016,19-01-2016,365 dias,"Portugal, Vila Real, Vila Real","Artigo 20.º, n.º 1, alínea a) do Código dos Contratos Públicos",20-06-2016,"12.061,20 €",não aplicável,não aplicável,,Não aplicável.,Não aplicável.,FALSE
"Aquisição de Próteses Auditivas para o CHTMAD,EPE.",Ajuste Direto Regime Geral,Aquisição de bens móveis,"33185000-0, Próteses auditivas","Centro Hospitalar de Trás-os-Montes e Alto Douro, E. P. E. (508100496)","Amplifon Portugal, SA (503325872)","25.200,00 €",29-12-2016,27-01-2016,365 dias,"Portugal, Vila Real, Vila Real","Artigo 20.º, n.º 1, alínea a) do Código dos Contratos Públicos",30-12-2016,"24.065,80 €",Não aplicável,Não aplicável,,Não aplicável.,Não aplicável.,FALSE
Lote 1,Ajuste Direto Regime Geral,Aquisição de bens móveis,"33140000-3, Material médico de consumo","Centro Hospitalar de Trás-os-Montes e Alto Douro, EPE (508100496)",Smiths Medical (507445937),"1.575,00 €",29-12-2016,23-05-2016,365 dias,"Portugal, Vila Real, Vila Real","Artigo 20.º, n.º 1, alínea a) do Código dos Contratos Públicos",30-12-2016,"1.575,00 €",Não aplicável,Não aplicável,,Não aplicável.,Não aplicável.,FALSE
Lote 2,Ajuste Direto Regime Geral,Aquisição de bens móveis,"33140000-3, Material médico de consumo","Centro Hospitalar de Trás-os-Montes e Alto Douro, EPE (508100496)","COVIDIEN PORTUGAL - PRODUTOS DE SAUDE, UNIPESSOAL (503413410)","11.800,00 €",29-12-2016,26-01-2016,365 dias,"Portugal, Vila Real, Vila Real","Artigo 20.º, n.º 1, alínea a) do Código dos Contratos Públicos",30-12-2016,"11.800,00 €",Não aplicável,Não aplicável,,Não aplicável.,Não aplicável.,FALSE
"Lote 13,16,17, 19, 20, 21, 23, 24 e 26",Ajuste Direto Regime Geral,Aquisição de bens móveis,"33000000-0, Equipamento médico, medicamentos e produtos para cuidados pessoais","Centro Hospitalar de Trás-os-Montes e Alto Douro, EPE (508100496)","GERANSWERS UNIPESSOAL, LDA(507683528) (507683528)","5.872,00 €",29-12-2016,26-01-2016,365 dias,"Portugal, Vila Real, Vila Real","Artigo 20.º, n.º 1, alínea a) do Código dos Contratos Públicos",30-12-2016,"5.872,00 €",Não aplicável,Não aplicável,,Não aplicável.,Não aplicável.,FALSE
"Fornecimento de Próteses para Amputados de Membros Inferiores e Superiores do CHTMAD, EPE.",Ajuste Direto Regime Geral,Aquisição de serviços,"85000000-9, Serviços de saúde e acção social","Centro Hospitalar de Trás-os-Montes e Alto Douro, E. P. E. (508100496)",CRPG - Centro de Reabilitação Profissional de Gaia (504791834),"53.425,00 €",29-12-2016,15-03-2016,365 dias,"Portugal, Vila Real, Vila Real","Artigo 20.º, n.º 1, alínea a) do Código dos Contratos Públicos",21-11-2016,"53.425,00 €","","",,Não aplicável.,Não aplicável.,FALSE
Aquisição de Pacemakers,Ajuste Direto Regime Geral,Aquisição de bens móveis,"33182200-1, Aparelhos para estimulação cardíaca","Centro Hospitalar de Trás-os-Montes e Alto Douro, E. P. E. (508100496)",BIOTRONIK Portugal Unipessoal Lda. (510726941),"18.000,00 €",29-12-2016,29-02-2016,365 dias,"Portugal, Vila Real, Vila Real","Artigo 20.º, n.º 1, alínea a) do Código dos Contratos Públicos",30-12-2016,"18.000,00 €",Não aplicável,Não aplicável,,Não aplicável.,Não aplicável.,FALSE
Aquisição de Pacemakers,Ajuste Direto Regime Geral,Aquisição de bens móveis,"33182200-1, Aparelhos para estimulação cardíaca","Centro Hospitalar de Trás-os-Montes e Alto Douro, E. P. E. (508100496)",BOSTON SCIENTIFIC PORTUGAL LDA (504988964),"299.990,00 €",29-12-2016,29-02-2016,365 dias,"Portugal, Vila Real, Vila Real","Artigo 20.º, n.º 1, alínea a) do Código dos Contratos Públicos",30-12-2016,"299.990,00 €",Não aplicável,Não aplicável,,Não aplicável.,Não aplicável.,FALSE
"LOTE 1, 2, 3 E 4",Ajuste Direto Regime Geral,Aquisição de bens móveis,"33600000-6, Produtos farmacêuticos","Centro Hospitalar de Trás-os-Montes e Alto Douro, E. P. E. (508100496)","TEVA PHARMA-PRODUTOS FARMACEUTICOS, LDA (507045491)","24.436,26 €",29-12-2016,07-01-2016,365 dias,"Portugal, Vila Real, Vila Real","Artigo 20.º, n.º 1, alínea a) do Código dos Contratos Públicos",30-12-2016,"24.436,26 €",Não aplicável,Não aplicável,,Não aplicável.,Não aplicável.,FALSE
Lote 1,Ajuste Direto Regime Geral,Aquisição de bens móveis,"33140000-3, Material médico de consumo","Centro Hospitalar de Trás-os-Montes e Alto Douro, E. P. E. (508100496)","VACUETTE PORTUGAL, S.A. (505348470)","26.609,00 €",29-12-2016,12-01-2016,365 dias,"Portugal, Vila Real, Vila Real","Artigo 20.º, n.º 1, alínea a) do Código dos Contratos Públicos",30-12-2016,"26.609,00 €",Não aplicável,Não aplicável,,Não aplicável.,Não aplicável.,FALSE
"Lotes 1, 2, 3, 4, 6, 10 e 11",Ajuste Direto Regime Geral,Aquisição de bens móveis,"33182200-1, Aparelhos para estimulação cardíaca","Centro Hospitalar de Trás-os-Montes e Alto Douro, E. P. E. (508100496)",ST. JUDE MEDICAL PORTUGAL (504180746),"253.500,00 €",29-12-2016,29-02-2016,365 dias,"Portugal, Vila Real, Vila Real","Artigo 20.º, n.º 1, alínea a) do Código dos Contratos Públicos",30-12-2016,"253.500,00 €",Não aplicável,Não aplicável,,Não aplicável.,Não aplicável.,FALSE
"Lotes 1, 2, 3, 6, 7, 8.11",Concurso público,Aquisição de bens móveis,"33140000-3, Material médico de consumo","Centro Hospitalar de Trás-os-Montes e Alto Douro, EPE (508100496)","COVIDIEN PORTUGAL - PRODUTOS SAUDE, UNIPESSOAL LDA (503413410)","5.579,00 €",29-12-2016,05-02-2016,365 dias,"Portugal, Vila Real, Vila Real","Artigo 20.º, n.º 1, alínea b) do Código dos Contratos Públicos","","","","",,Não aplicável.,Não aplicável.,FALSE
Lote 13,Concurso público,Aquisição de bens móveis,"33140000-3, Material médico de consumo","Centro Hospitalar de Trás-os-Montes e Alto Douro, EPE (508100496)","3M PORTUGAL, LDA (500193940)","467,16 €",29-12-2016,09-06-2016,365 dias,"Portugal, Vila Real, Vila Real","Artigo 20.º, n.º 1, alínea b) do Código dos Contratos Públicos","","","","",,Não aplicável.,Não aplicável.,FALSE
"Lotes 4, 5, 9 e 10",Concurso público,Aquisição de bens móveis,"33140000-3, Material médico de consumo","Centro Hospitalar de Trás-os-Montes e Alto Douro, EPE (508100496)","MEDINFAR - SOROLÓGICO - PROD. E EQUIPAMENTOS, S. A (501197052)","7.284,60 €",29-12-2016,05-02-2016,365 dias,"Portugal, Vila Real, Vila Real","Artigo 20.º, n.º 1, alínea b) do Código dos Contratos Públicos","","","","",,Não aplicável.,Não aplicável.,FALSE
Aquisição de Consumíveis de Energia Avançada c/ Colocação de Equipamentos,Concurso público,Aquisição de bens móveis,"33000000-0, Equipamento médico, medicamentos e produtos para cuidados pessoais","Centro Hospitalar de Trás-os-Montes e Alto Douro, EPE (508100496)",JOHNSON JOHNSON MEDICAL (500153370),"124.830,00 €",29-12-2016,27-04-2016,365 dias,"Portugal, Vila Real, Vila Real","Artigo 20.º, n.º 1, alínea b) do Código dos Contratos Públicos","","","","",,Não aplicável.,Não aplicável.,FALSE
"Lotes 1,61,76",Concurso público,Aquisição de bens móveis,"33140000-3, Material médico de consumo","Centro Hospitalar de Trás-os-Montes e Alto Douro, EPE (508100496)",Bioportugal (502380543),"18.008,00 €",29-12-2016,01-04-2016,365 dias,"Portugal, Vila Real, Vila Real","Artigo 20.º, n.º 1, alínea b) do Código dos Contratos Públicos","","","","",,Não aplicável.,Não aplicável.,FALSE
"Lotes 11,12,18,26,28,39,44,52,60,63,",Concurso público,Aquisição de bens móveis,"33140000-3, Material médico de consumo","Centro Hospitalar de Trás-os-Montes e Alto Douro, EPE (508100496)","Ezequiel Panão Jorge, Lda (501412727)","3.154,45 €",29-12-2016,30-03-2016,365 dias,"Portugal, Vila Real, Vila Real","Artigo 20.º, n.º 1, alínea b) do Código dos Contratos Públicos","","","","",,Não aplicável.,Não aplicável.,FALSE
Marcador Ouro (AU) Intensidade Modulada radioterapia da Prostata,Ajuste Direto Regime Geral,Aquisição de bens móveis,"33000000-0, Equipamento médico, medicamentos e produtos para cuidados pessoais","Centro Hospitalar de Trás-os-Montes e Alto Douro, E. P. E. (508100496)","ABGT, Unipessoal (510517536)","5.613,30 €",29-12-2016,12-08-2016,365 dias,"Portugal, Vila Real, Vila Real","Artigo 20.º, n.º 1, alínea a) do Código dos Contratos Públicos",15-08-2016,"5.613,30 €","","",,Não aplicável.,Não aplicável.,FALSE
Aquisição de luvas de exame em nitrilo não esterilizada,Concurso público,Aquisição de bens móveis,"33141420-0, Luvas para cirurgia","Centro Hospitalar de Trás-os-Montes e Alto Douro, EPE (508100496)","VWR International - Material de Laboratório, Lda. (503842770)","130.149,45 €",28-12-2016,08-02-2016,365 dias,"Portugal, Vila Real, Vila Real","Artigo 20.º, n.º 1, alínea b) do Código dos Contratos Públicos","","","","",,Não aplicável.,Não aplicável.,FALSE
CQE Rastreio Pré-natal e Electroforese CQE Carga viral por PCR,Ajuste Direto Regime Geral,Aquisição de serviços,"85145000-7, Serviços prestados por laboratórios médicos","Centro Hospitalar de Trás-os-Montes e Alto Douro, EPE (508100496)","BIOGNOSTICA-DIST.PROD.EQUIP.TECNICOS,LDA (504441256)","4.260,00 €",28-12-2016,04-02-2016,365 dias,"Portugal, Vila Real, Vila Real","Artigo 20.º, n.º 1, alínea a) do Código dos Contratos Públicos",01-07-2016,"4.260,00 €","","",,Não aplicável.,Não aplicável.,FALSE
Aquisição de Cápsula Endoscópica para Intestino Delgado,Concurso público,Aquisição de bens móveis,"33000000-0, Equipamento médico, medicamentos e produtos para cuidados pessoais","Centro Hospitalar de Trás-os-Montes e Alto Douro, E. P. E. (508100496)","ALVES & COMPANHIA (IRMÃOS), LDA (500310068)","38.000,00 €",28-12-2016,19-02-2016,365 dias,"Portugal, Vila Real, Vila Real","Artigo 20.º, n.º 1, alínea b) do Código dos Contratos Públicos","","","","",,Não aplicável.,Não aplicável.,FALSE
"Drogas de Abuso, Sumaria de urina e Gases no Sangue",Ajuste Direto Regime Geral,Aquisição de serviços,"85145000-7, Serviços prestados por laboratórios médicos","Centro Hospitalar de Trás-os-Montes e Alto Douro, EPE (508100496)",Bioportugal (502380543),"16.846,00 €",28-12-2016,04-02-2016,365 dias,"Portugal, Vila Real, Vila Real","Artigo 20.º, n.º 1, alínea a) do Código dos Contratos Públicos",21-06-2016,"16.846,00 €","","",,Não aplicável.,Não aplicável.,FALSE
