freguesia,acronym,validVotesPercentage,votes,dicofre
Santa Bárbara de Nexe,PS,36.82,507,080503
Santa Bárbara de Nexe,PPD/PSD,21.42,295,080503
Santa Bárbara de Nexe,PCP-PEV,13.29,183,080503
Santa Bárbara de Nexe,B.E.,12.85,177,080503
Santa Bárbara de Nexe,PAN,4.5,62,080503
Santa Bárbara de Nexe,CDS-PP,3.63,50,080503
Santa Bárbara de Nexe,CH,1.67,23,080503
Santa Bárbara de Nexe,PCTP/MRPP,1.38,19,080503
Santa Bárbara de Nexe,L,0.73,10,080503
Santa Bárbara de Nexe,A,0.65,9,080503
Santa Bárbara de Nexe,R.I.R.,0.65,9,080503
Santa Bárbara de Nexe,PPM,0.58,8,080503
Santa Bárbara de Nexe,PURP,0.44,6,080503
Santa Bárbara de Nexe,IL,0.29,4,080503
Santa Bárbara de Nexe,PNR,0.29,4,080503
Santa Bárbara de Nexe,PTP,0.29,4,080503
Santa Bárbara de Nexe,PDR,0.22,3,080503
Santa Bárbara de Nexe,MPT,0.15,2,080503
Santa Bárbara de Nexe,NC,0.15,2,080503
