Objeto do Contrato,Tipo de Procedimento,Tipo(s) de Contrato,CPVs,Entidade(s) Adjudicante(s),Entidade(s) Adjudicatária(s),Preço Contratual,Data de Publicação,Data de Celebração do Contrato,Prazo de Execução,Local de Execução,Fundamentação,Data de Fecho do Contrato,Preço Total Efetivo,Causas das Alterações ao Prazo,Causas das Alterações ao Preço,Estado,N.º registo do Acordo Quadro,Descrição do Acordo Quadro,Procedimento Centralizado
Aquisição de Rx Portátil,Ajuste Direto Regime Geral,Aquisição de bens móveis,"33111000-1, Aparelhos para radiologia","Centro Hospitalar Médio Ave, E.P.E.. (508093937)","MICROMIL - SISTEMAS MÉDICOS E INDUSTRIAIS, S.A (501605770)","18.973,00 €",23-09-2017,04-04-2017,20 dias,"Portugal, Braga, Vila Nova de Famalicão","Artigo 20.º, n.º 1, alínea a) do Código dos Contratos Públicos",,,,,,Não aplicável.,Não aplicável.,FALSE
Aquisição de serviços de assistência técnica aos equipamentos de imagiologia “Readers”,Ajuste Direto Regime Geral,Aquisição de serviços,"50421000-2, Serviços de reparação e manutenção de equipamento médico","Centro Hospitalar Médio Ave, E.P.E.. (508093937)",FUJIFILM EUROPE GMBH - SUCURSAL EM PORTUGAL (980456517),"11.188,14 €",23-09-2017,18-04-2017,365 dias,"Portugal, Porto, Santo Tirso<BR/>Portugal, Braga, Vila Nova de Famalicão","Artigo 20.º, n.º 1, alínea a) do Código dos Contratos Públicos",,,,,,Não aplicável.,Não aplicável.,FALSE
Aquisição de motor de Otorrino,Ajuste Direto Regime Geral,Aquisição de bens móveis,"33100000-1, Equipamento médico","Centro Hospitalar Médio Ave, E.P.E.. (508093937)",B BRAUN MEDICAL LDA (501506543),"17.547,90 €",22-09-2017,04-04-2017,20 dias,"Portugal, Braga, Vila Nova de Famalicão<BR/>Portugal, Porto, Santo Tirso","Artigo 20.º, n.º 1, alínea a) do Código dos Contratos Públicos",,,,,,Não aplicável.,Não aplicável.,FALSE
Fornecimento de material de empacotamento em esterilização,Ao abrigo de acordo-quadro (art.º 259.º),Aquisição de bens móveis,"33180000-5, Apoio funcional","Centro Hospitalar do Médio Ave, E. P. E. (508093937)",DIMOR LUSITANA COMERCIO DE PRODUTOS DE SAUDE E HIGIENE LDA (500730741),"243,11 €",22-09-2017,30-05-2017,365 dias,"Portugal, Porto, Santo Tirso<BR/>Portugal, Braga, Vila Nova de Famalicão",Artigo 259.º do Código dos Contratos Públicos,,,,,,1974943,CP 2016/43 - Acordo quadro para fornecimento de Material para Empacotamento em Esterilização às Instituições e Serviços do Serviço Nacional de Saúde.,FALSE
Fornecimento de material de empacotamento em esterilização,Ao abrigo de acordo-quadro (art.º 259.º),Aquisição de bens móveis,"33180000-5, Apoio funcional","Centro Hospitalar do Médio Ave, E. P. E. (508093937)",HTMD - HIGH TECHNOLOGY MEDICAL DEVICES LDA (507654919),"1.829,20 €",22-09-2017,30-05-2017,365 dias,"Portugal, Porto, Santo Tirso<BR/>Portugal, Braga, Vila Nova de Famalicão",Artigo 259.º do Código dos Contratos Públicos,,,,,,1974943,CP 2016/43 - Acordo quadro para fornecimento de Material para Empacotamento em Esterilização às Instituições e Serviços do Serviço Nacional de Saúde.,FALSE
Fornecimento de material de empacotamento em esterilização,Ao abrigo de acordo-quadro (art.º 259.º),Aquisição de bens móveis,"33180000-5, Apoio funcional","Centro Hospitalar do Médio Ave, E. P. E. (508093937)","Bastos Viegas, SA (500042772)","174,37 €",22-09-2017,30-05-2017,365 dias,"Portugal, Braga, Vila Nova de Famalicão<BR/>Portugal, Porto, Santo Tirso",Artigo 259.º do Código dos Contratos Públicos,,,,,,1974943,CP 2016/43 - Acordo quadro para fornecimento de Material para Empacotamento em Esterilização às Instituições e Serviços do Serviço Nacional de Saúde.,FALSE
Contrato para aquisição de Serviços de Manutenção e Assistência Técnica para o Equipamento SOMATOM Emotion 16,Ajuste Direto Regime Geral,Aquisição de serviços,"50421000-2, Serviços de reparação e manutenção de equipamento médico","Centro Hospitalar Médio Ave, E.P.E.. (508093937)",SIEMENS HEALTHCARE LDA (507925173),"22.682,00 €",22-09-2017,28-03-2017,365 dias,"Portugal, Braga, Vila Nova de Famalicão","Artigo 20.º, n.º 1, alínea a) do Código dos Contratos Públicos",,,,,,Não aplicável.,Não aplicável.,FALSE
