freguesia,acronym,validVotesPercentage,votes,dicofre
Oliveira do Bairro,PPD/PSD,36.79,476,011404
Oliveira do Bairro,PS,23.42,303,011404
Oliveira do Bairro,CDS-PP,14.53,188,011404
Oliveira do Bairro,B.E.,8.5,110,011404
Oliveira do Bairro,PAN,3.63,47,011404
Oliveira do Bairro,PCP-PEV,2.01,26,011404
Oliveira do Bairro,A,1.7,22,011404
Oliveira do Bairro,PPM.PPV/CDC,1.7,22,011404
Oliveira do Bairro,NC,1.62,21,011404
Oliveira do Bairro,PDR,1.31,17,011404
Oliveira do Bairro,L,1.24,16,011404
Oliveira do Bairro,IL,0.77,10,011404
Oliveira do Bairro,PCTP/MRPP,0.77,10,011404
Oliveira do Bairro,PNR,0.7,9,011404
Oliveira do Bairro,PURP,0.62,8,011404
Oliveira do Bairro,PTP,0.46,6,011404
Oliveira do Bairro,MAS,0.23,3,011404
