freguesia,acronym,validVotesPercentage,votes,dicofre
"União das freguesias das Caldas da Rainha - Nossa Senhora do Pópulo, Coto e São Gregório",PPD/PSD.CDS-PP,36.06,1726,100617
"União das freguesias das Caldas da Rainha - Nossa Senhora do Pópulo, Coto e São Gregório",PS,29.96,1434,100617
"União das freguesias das Caldas da Rainha - Nossa Senhora do Pópulo, Coto e São Gregório",PCP-PEV,9.82,470,100617
"União das freguesias das Caldas da Rainha - Nossa Senhora do Pópulo, Coto e São Gregório",MPT,8.44,404,100617
"União das freguesias das Caldas da Rainha - Nossa Senhora do Pópulo, Coto e São Gregório",B.E.,5.29,253,100617
"União das freguesias das Caldas da Rainha - Nossa Senhora do Pópulo, Coto e São Gregório",L,3.76,180,100617
"União das freguesias das Caldas da Rainha - Nossa Senhora do Pópulo, Coto e São Gregório",PAN,2.05,98,100617
"União das freguesias das Caldas da Rainha - Nossa Senhora do Pópulo, Coto e São Gregório",PCTP/MRPP,1.3,62,100617
"União das freguesias das Caldas da Rainha - Nossa Senhora do Pópulo, Coto e São Gregório",PND,0.75,36,100617
"União das freguesias das Caldas da Rainha - Nossa Senhora do Pópulo, Coto e São Gregório",PPV,0.56,27,100617
"União das freguesias das Caldas da Rainha - Nossa Senhora do Pópulo, Coto e São Gregório",PPM,0.54,26,100617
"União das freguesias das Caldas da Rainha - Nossa Senhora do Pópulo, Coto e São Gregório",PNR,0.44,21,100617
"União das freguesias das Caldas da Rainha - Nossa Senhora do Pópulo, Coto e São Gregório",MAS,0.42,20,100617
"União das freguesias das Caldas da Rainha - Nossa Senhora do Pópulo, Coto e São Gregório",PTP,0.42,20,100617
"União das freguesias das Caldas da Rainha - Nossa Senhora do Pópulo, Coto e São Gregório",PDA,0.13,6,100617
"União das freguesias das Caldas da Rainha - Nossa Senhora do Pópulo, Coto e São Gregório",POUS,0.08,4,100617
