Objeto do Contrato,Tipo de Procedimento,Tipo(s) de Contrato,CPVs,Entidade(s) Adjudicante(s),Entidade(s) Adjudicatária(s),Preço Contratual,Data de Publicação,Data de Celebração do Contrato,Prazo de Execução,Local de Execução,Fundamentação,Data de Fecho do Contrato,Preço Total Efetivo,Causas das Alterações ao Prazo,Causas das Alterações ao Preço,Estado,N.º registo do Acordo Quadro,Descrição do Acordo Quadro,Procedimento Centralizado
"Aquisição de 3 Frigoríficos e uma Arca, para o Serviço de Patologia",Ajuste Direto Regime Geral,Aquisição de bens móveis,"39711100-0, Frigoríficos e congeladores","Hospital Professor Doutor Fernando Fonseca, E. P. E. (503035416)",bluestream (513196781),"15.683,00 €",11-06-2018,12-10-2017,48 dias,"Portugal, Lisboa, Amadora","Artigo 20.º, n.º 1, alínea a) do Código dos Contratos Públicos",,,,,,Não aplicável.,Não aplicável.,FALSE
Aquisição Terminais Biométricos,Ajuste Direto Regime Geral,Aquisição de bens móveis,"31224500-7, Terminais","Hospital Professor Doutor Fernando Fonseca, E. P. E. (503035416)",Strike (509253903),"10.586,00 €",11-06-2018,10-03-2017,20 dias,"Portugal, Lisboa, Amadora","Artigo 20.º, n.º 1, alínea a) do Código dos Contratos Públicos",,,,,,Não aplicável.,Não aplicável.,FALSE
Fornecimento de Ceias para o Pessoal do HFF 2018,Concurso público,Aquisição de serviços,"55520000-1, Serviços de fornecimento de refeições (catering)",Hospital Prof. Doutor Fernando Fonseca E.P.E. (503035416),Eurest Portugal Lda (500347506),"107.419,50 €",08-06-2018,30-01-2018,365 dias,"Portugal, Lisboa, Amadora","Artigo 20.º, n.º 1, alínea b) do Código dos Contratos Públicos",,,,,,Não aplicável.,Não aplicável.,FALSE
Aquisição de Serviços de Acreditação CHKS - Caspe Healthcare Knowledge System,Ajuste Direto Regime Geral,Aquisição de serviços,"79000000-4, Serviços a empresas: direito, comercialização, consultoria, recrutamento, impressão e segurança","Hospital Professor Doutor Fernando Fonseca, E. P. E. (503035416)",CHKS (834852705),"13.548,83 €",07-06-2018,28-04-2017,275 dias,"Portugal, Lisboa, Amadora","Artigo 20.º, n.º 1, alínea a) do Código dos Contratos Públicos",,,,,,Não aplicável.,Não aplicável.,FALSE
Aluguer de Mascaras e Ventiladores para a Pneumologia,Ajuste Direto Regime Geral,Aquisição de serviços,"51410000-9, Serviços de instalação de equipamento médico",Hospital Prof. Doutor Fernando Fonseca E.P.E. (503035416),"Praxair Portugal Gases, S.A. (501738916)","39.583,60 €",07-06-2018,20-01-2018,365 dias,"Portugal, Lisboa, Amadora","Artigo 20.º, n.º 1, alínea a) do Código dos Contratos Públicos",,,,,,Não aplicável.,Não aplicável.,FALSE
"Aquisição de Serviços de reparação dos elevadores 1, 2, 3, 4, 5, 6, 7, 8 E 9",Ajuste Direto Regime Geral,Aquisição de serviços,"50000000-5, Serviços de reparação e manutenção","Hospital Professor Doutor Fernando Fonseca, E. P. E. (503035416)","CLEFTA - Instalações e Reparações Elétricas, Lda. (501324046)","16.560,00 €",07-06-2018,03-02-2017,20 dias,"Portugal, Lisboa, Amadora","Artigo 20.º, n.º 1, alínea a) do Código dos Contratos Públicos",,,,,,Não aplicável.,Não aplicável.,FALSE
Cobertura dos Contentores do Hospital de Dia de Medicina,Ajuste Direto Regime Geral,Empreitadas de obras públicas,"45000000-7, Construção","Hospital Professor Doutor Fernando Fonseca, E. P. E. (503035416)","Jesus Events - Unipessoal, Lda. (508131138)","14.670,00 €",07-06-2018,27-03-2018,20 dias,"Portugal, Lisboa, Amadora","Artigo 19.º, alínea d) do Código dos Contratos Públicos",,,,,,Não aplicável.,Não aplicável.,FALSE
Aquisição de DARUNAVIR+COBICISTATE ORAL800+15MG CMP para 2018,Ajuste Direto Regime Geral,Aquisição de bens móveis,"33600000-6, Produtos farmacêuticos",Hospital Prof. Doutor Fernando Fonseca E.P.E. (503035416),"JANSSEN-CILAG FARMACEUTICA, LDA (500189412)","1.599.240,00 €",04-06-2018,26-01-2018,339 dias,"Portugal, Lisboa, Amadora","Artigo 24.º, n.º 1, alínea e) do Código dos Contratos Públicos",,,,,,Não aplicável.,Não aplicável.,FALSE
"Aquisição de ATEZOLIZUMAB, IV,60MG/ML, 20 ML; SOL INJ ",Ajuste Direto Regime Geral,Aquisição de bens móveis,"33600000-6, Produtos farmacêuticos","Hospital Professor Doutor Fernando Fonseca, E. P. E. (503035416)","ROCHE FARMACEUTICA QUIMICA, LDA (500233810)","41.575,60 €",04-06-2018,28-05-2018,217 dias,"Portugal, Lisboa, Amadora","Artigo 24.º, n.º 1, alínea e), subalínea ii) do Código dos Contratos Públicos",,,,,,Não aplicável.,Não aplicável.,FALSE
