freguesia,acronym,validVotesPercentage,votes,dicofre
Orjais,PS,57.14,228,050312
Orjais,B.E.,13.78,55,050312
Orjais,PPD/PSD,13.53,54,050312
Orjais,CDS-PP,5.76,23,050312
Orjais,PAN,3.01,12,050312
Orjais,PCP-PEV,2.51,10,050312
Orjais,PURP,1,4,050312
Orjais,R.I.R.,1,4,050312
Orjais,IL,0.75,3,050312
Orjais,L,0.5,2,050312
Orjais,PCTP/MRPP,0.5,2,050312
Orjais,CH,0.25,1,050312
Orjais,PTP,0.25,1,050312
Orjais,A,0,0,050312
Orjais,MPT,0,0,050312
Orjais,PDR,0,0,050312
Orjais,PNR,0,0,050312
Orjais,PPM,0,0,050312
