freguesia,acronym,validVotesPercentage,votes,dicofre
Vila Verde,PPD/PSD.CDS-PP,41.51,22,041230
Vila Verde,PS,39.62,21,041230
Vila Verde,MPT,5.66,3,041230
Vila Verde,PCTP/MRPP,5.66,3,041230
Vila Verde,L,1.89,1,041230
Vila Verde,MAS,1.89,1,041230
Vila Verde,PAN,1.89,1,041230
Vila Verde,PPM,1.89,1,041230
Vila Verde,B.E.,0,0,041230
Vila Verde,PCP-PEV,0,0,041230
Vila Verde,PDA,0,0,041230
Vila Verde,PND,0,0,041230
Vila Verde,PNR,0,0,041230
Vila Verde,POUS,0,0,041230
Vila Verde,PPV,0,0,041230
Vila Verde,PTP,0,0,041230
