Objeto do Contrato,Tipo de Procedimento,Tipo(s) de Contrato,CPVs,Entidade(s) Adjudicante(s),Entidade(s) Adjudicatária(s),Preço Contratual,Data de Publicação,Data de Celebração do Contrato,Prazo de Execução,Local de Execução,Fundamentação,Data de Fecho do Contrato,Preço Total Efetivo,Causas das Alterações ao Prazo,Causas das Alterações ao Preço,Estado,N.º registo do Acordo Quadro,Descrição do Acordo Quadro,Procedimento Centralizado
MEDICAMENTO,Ajuste Direto Regime Geral,Aquisição de bens móveis,"33600000-6, Produtos farmacêuticos","Hospital Distrital de Santarém, EPE (506361462)",MERCK SHARP E DOHME (500191360),"21.072,00 €",09-01-2017,07-12-2016,21 dias,"Portugal, Santarém, Santarém","Artigo 24.º, n.º 1, alínea e) do Código dos Contratos Públicos",,,,,,Não aplicável.,Não aplicável.,FALSE
MEDICAMENTOS,Ajuste Direto Regime Geral,Aquisição de bens móveis,"33600000-6, Produtos farmacêuticos","Hospital Distrital de Santarém, EPE (506361462)","ROCHE SISTEMAS DE DIAGNOSTICOS , SOCIEDADE UNIPESSOAL, LDA (504282921)","23.470,00 €",09-01-2017,10-11-2016,50 dias,"Portugal, Santarém, Santarém","Artigo 24.º, n.º 1, alínea e) do Código dos Contratos Públicos",,,,,,Não aplicável.,Não aplicável.,FALSE
MEDICAMENTOS,Ajuste Direto Regime Geral,Aquisição de bens móveis,"33600000-6, Produtos farmacêuticos","Hospital Distrital de Santarém, EPE (506361462)",KNOW- HOW (509884296),"654,00 €",09-01-2017,10-11-2016,50 dias,"Portugal, Santarém, Santarém","Artigo 24.º, n.º 1, alínea e) do Código dos Contratos Públicos",,,,,,Não aplicável.,Não aplicável.,FALSE
MEDICAMENTOS,Ajuste Direto Regime Geral,Aquisição de bens móveis,"33600000-6, Produtos farmacêuticos","Hospital Distrital de Santarém, EPE (506361462)",ABBOTT LABORATORIOS LDA (500006148),"1.950,00 €",09-01-2017,10-11-2016,50 dias,"Portugal, Santarém, Santarém","Artigo 24.º, n.º 1, alínea e) do Código dos Contratos Públicos",,,,,,Não aplicável.,Não aplicável.,FALSE
PREST SERV ASSIST TECNICA ELETROBISTURIS ANO 2017,Ajuste Direto Regime Geral,Aquisição de serviços,"50400000-9, Serviços de reparação e manutenção de equipamento médico e de precisão","Hospital Distrital de Santarém, E. P. E. (506361462)","CLINIFAR, S.A.. (503281115)","2.030,00 €",04-01-2017,30-12-2016,365 dias,"Portugal, Santarém, Santarém","Artigo 20.º, n.º 1, alínea a) do Código dos Contratos Públicos",,,,,,Não aplicável.,Não aplicável.,FALSE
SERVIÇOS ASSISTÊNCIA TÉCNICA EQUIPAMENTOS DE ESTERILIZAÇÃO,Ajuste Direto Regime Geral,Aquisição de serviços,"50400000-9, Serviços de reparação e manutenção de equipamento médico e de precisão","Hospital Distrital de Santarém, E. P. E. (506361462)","A.J.Costa (Irmãos), Lda (500002576)","4.080,00 €",04-01-2017,30-12-2016,365 dias,"Portugal, Santarém, Santarém","Artigo 20.º, n.º 1, alínea a) do Código dos Contratos Públicos",,,,,,Não aplicável.,Não aplicável.,FALSE
PRESTAÇÃO SERVIÇOS MÉDICOS MCDT - MEDICINA NUCLEAR ano 2017,Concurso público,Aquisição de serviços,"85100000-0, Serviços de saúde","Hospital Distrital de Santarém, E. P. E. (506361462)",DIATON - CENTRO DE TOMOGRAFIA COMPUTORIZADA S.A. (500972974),"31.160,00 €",04-01-2017,23-12-2016,365 dias,"Portugal, Santarém, Santarém","Artigo 20.º, n.º 1, alínea b) do Código dos Contratos Públicos",,,,,,Não aplicável.,Não aplicável.,FALSE
Aquisição Colchão para Cama UCI Totalcare,Ajuste Direto Regime Geral,Aquisição de bens móveis,"33100000-1, Equipamento médico","Hospital Distrital de Santarém, EPE (506361462)","Medicinalia Cormedica-Comercialização de Produtos Medicos Hospitalares, Lda (500684324)","4.617,00 €",04-01-2017,03-01-2017,30 dias,"Portugal, Santarém, Santarém","Artigo 26.º, n.º 1, alínea a) do Código dos Contratos Públicos",,,,,,Não aplicável.,Não aplicável.,FALSE
