Objeto do Contrato,Tipo de Procedimento,Tipo(s) de Contrato,CPVs,Entidade(s) Adjudicante(s),Entidade(s) Adjudicatária(s),Preço Contratual,Data de Publicação,Data de Celebração do Contrato,Prazo de Execução,Local de Execução,Fundamentação,Data de Fecho do Contrato,Preço Total Efetivo,Causas das Alterações ao Prazo,Causas das Alterações ao Preço,Estado,N.º registo do Acordo Quadro,Descrição do Acordo Quadro,Procedimento Centralizado
Aquisição de dispositivo médico: CRT -D,Ajuste Direto Regime Geral,Aquisição de bens móveis,"33182000-9, Material de assistência à função cardíaca","Hospital do Espírito Santo de Évora, E. P. E. (508085888)","Livanova Portugal, Lda (505514010)","17.250,00 €",30-06-2017,28-03-2017,8 dias,"Portugal, Évora, Évora","Artigo 24.º, n.º 1, alínea e) do Código dos Contratos Públicos",,,,,,Não aplicável.,Não aplicável.,FALSE
Aquisição de dispositivo médico: CRT-D,Ajuste Direto Regime Geral,Aquisição de bens móveis,"33182000-9, Material de assistência à função cardíaca","Hospital do Espírito Santo de Évora, E. P. E. (508085888)","MEDTRONIC PORTUGAL, LDA. (504223933)","16.600,00 €",30-06-2017,24-01-2017,8 dias,"Portugal, Évora, Évora","Artigo 24.º, n.º 1, alínea e) do Código dos Contratos Públicos",,,,,,Não aplicável.,Não aplicável.,FALSE
Aquisição de dispositivo médico - CRT-D,Ajuste Direto Regime Geral,Aquisição de bens móveis,"33182000-9, Material de assistência à função cardíaca","Hospital do Espírito Santo de Évora, E. P. E. (508085888)","Livanova Portugal, Lda (505514010)","17.250,00 €",30-06-2017,24-01-2017,8 dias,"Portugal, Évora, Évora","Artigo 24.º, n.º 1, alínea e) do Código dos Contratos Públicos",,,,,,Não aplicável.,Não aplicável.,FALSE
Aquisição de DM - CRT-D,Ajuste Direto Regime Geral,Aquisição de bens móveis,"33182000-9, Material de assistência à função cardíaca","Hospital do Espírito Santo de Évora, E. P. E. (508085888)","ST. JUDE MEDICAL PORTUGAL,LDA. (504180746)","18.000,00 €",30-06-2017,24-01-2017,8 dias,"Portugal, Évora, Évora","Artigo 24.º, n.º 1, alínea e) do Código dos Contratos Públicos",,,,,,Não aplicável.,Não aplicável.,FALSE
Prestação de serviços médicos em Ortopedia,Ajuste Direto Regime Geral,Aquisição de serviços,"85121300-6, Serviços de cirurgia especializada","Hospital do Espírito Santo de Évora, E. P. E. (508085888)",MARCELO ALVES (246153997),"21.735,00 €",28-06-2017,29-03-2017,60 dias,"Portugal, Évora, Évora","Artigo 24.º, n.º 1, alínea c) do Código dos Contratos Públicos",,,,,,Não aplicável.,Não aplicável.,FALSE
Prestação de serviços médicos em Ortopedia,Ajuste Direto Regime Geral,Aquisição de serviços,"85121300-6, Serviços de cirurgia especializada","Hospital do Espírito Santo de Évora, E. P. E. (508085888)",Carlos Gustavo Lacoste (229774679),"15.120,00 €",27-06-2017,29-03-2017,60 dias,"Portugal, Évora, Évora","Artigo 24.º, n.º 1, alínea c) do Código dos Contratos Públicos",,,,,,Não aplicável.,Não aplicável.,FALSE
Prestação de serviços médicos,Ajuste Direto Regime Geral,Aquisição de serviços,"85120000-6, Serviços de prática médica e serviços conexos","Hospital do Espírito Santo de Évora, E. P. E. (508085888)","Rationablek, Lda. (513876456)","26.400,00 €",27-06-2017,08-03-2017,330 dias,"Portugal, Évora, Évora","Artigo 20.º, n.º 1, alínea a) do Código dos Contratos Públicos",,,,,,Não aplicável.,Não aplicável.,FALSE
Prestação de serviços médicos - 1º atendimento,Ajuste Direto Regime Geral,Aquisição de serviços,"85120000-6, Serviços de prática médica e serviços conexos","Hospital do Espírito Santo de Évora, E. P. E. (508085888)","RANDSTAD II - PRESTAÇÃO DE SERVIÇOS, LDA (503298999)","98.974,44 €",23-06-2017,05-05-2017,60 dias,"Portugal, Évora, Évora","Artigo 24.º, n.º 1, alínea c) do Código dos Contratos Públicos",,,,,,Não aplicável.,Não aplicável.,FALSE
Prestação de serviços de anestesiologia,Ajuste Direto Regime Geral,Aquisição de serviços,"85121000-3, Serviços de prática médica","Hospital do Espírito Santo de Évora, E. P. E. (508085888)",Corevalue (513654577),"38.095,92 €",23-06-2017,05-05-2017,60 dias,"Portugal, Évora, Évora","Artigo 24.º, n.º 1, alínea c) do Código dos Contratos Públicos",,,,,,Não aplicável.,Não aplicável.,FALSE
Aquisição de material de esterilização,Ajuste Direto Regime Geral,Aquisição de bens móveis,"33140000-3, Material médico de consumo","Hospital do Espírito Santo de Évora, E. P. E. (508085888)","A. Mendes da Silva, Lda. (502064080), PERGUT PORTUGAL,LDA. (501799729), ANASTACIO SALDANHA UNIPESSOAL, LDA. (505804441), DIMORASEPT - Higiene Médica-Hospitalar, Lda (510258786), B.braun Medical Lda  (501506543)","34.942,36 €",23-06-2017,26-04-2017,320 dias,"Portugal, Évora, Évora","Artigo 20.º, n.º 1, alínea a) do Código dos Contratos Públicos",,,,,,Não aplicável.,Não aplicável.,FALSE
Aquisição de medicamentos do foro oncológico,Ao abrigo de acordo-quadro (art.º 259.º),Aquisição de bens móveis,"33652000-5, Antineoplásicos e imunomoduladores","Hospital do Espírito Santo de Évora, E. P. E. (508085888)","PHARNAKERN-PRODUTOS FARMACEUTICOS SOCIEDADE UNIPESSOAL, LDA (507002571)","74.289,64 €",23-06-2017,02-05-2017,240 dias,"Portugal, Évora, Évora",Artigo 259.º do Código dos Contratos Públicos,,,,,,1771819,CP 2015/6 - Acordo quadro para o fornecimento de Medicamentos do Foro Oncológico,FALSE
Aquisição de medicamentos antirretrovíricos,Ao abrigo de acordo-quadro (art.º 259.º),Aquisição de bens móveis,"33690000-3, Medicamentos vários","Hospital do Espírito Santo de Évora, E. P. E. (508085888)","GILEAD SCIENCES, LDA. (503604704)","4.705,92 €",23-06-2017,06-06-2017,180 dias,"Portugal, Évora, Évora",Artigo 259.º do Código dos Contratos Públicos,,,,,,2183729,Medicamentos antirretrovíricos para o tratamento da infeção por VIH,FALSE
Substituição de chão na Sala de Observações da Urgência Geral,Ajuste Direto Regime Geral,Empreitadas de obras públicas,"71500000-3, Serviços relacionados com a construção","Hospital do Espírito Santo de Évora, E. P. E. (508085888)",Rosado & Filhos (505429217),"6.880,00 €",22-06-2017,03-05-2017,10 dias,"Portugal, Évora, Évora","Artigo 19.º, alínea a) do Código dos Contratos Públicos",,,,,,Não aplicável.,Não aplicável.,FALSE
Aquisição de DM : Material disposable para bloco,Ajuste Direto Regime Geral,Aquisição de bens móveis,"33140000-3, Material médico de consumo","Hospital do Espírito Santo de Évora, E. P. E. (508085888)","ANASTACIO SALDANHA UNIPESSOAL, LDA. (505804441)","1.627,20 €",22-06-2017,13-06-2017,200 dias,"Portugal, Évora, Évora","Artigo 20.º, n.º 1, alínea a) do Código dos Contratos Públicos",,,,,,Não aplicável.,Não aplicável.,FALSE
Aquisição de medicamentos antirretrovíricos,Ao abrigo de acordo-quadro (art.º 259.º),Aquisição de bens móveis,"33690000-3, Medicamentos vários","Hospital do Espírito Santo de Évora, E. P. E. (508085888)",PIERRE FABRE MEDICAMENT PORTUG (500230366),"798,40 €",22-06-2017,02-06-2017,180 dias,"Portugal, Évora, Évora",Artigo 259.º do Código dos Contratos Públicos,,,,,,2183729,Medicamentos antirretrovíricos para o tratamento da infeção por VIH,FALSE
Aquisição de suturas cirurgicas,Ao abrigo de acordo-quadro (art.º 259.º),Aquisição de bens móveis,"33141121-4, Suturas cirúrgicas","Hospital do Espírito Santo de Évora, E. P. E. (508085888)","B BRAUN MEDICAL,LDA (501506543)","6.499,08 €",21-06-2017,13-06-2017,180 dias,"Portugal, Évora, Évora",Artigo 259.º do Código dos Contratos Públicos,,,,,,1830807,Acordo quadro para fornecimento de Suturas Cirúrgicas - Parte I   às Instituições e Serviços do Serviço Nacional de Saúde,FALSE
Aquisição de medicamentos do foro oncológico,Ao abrigo de acordo-quadro (art.º 259.º),Aquisição de bens móveis,"33652000-5, Antineoplásicos e imunomoduladores","Hospital do Espírito Santo de Évora, E. P. E. (508085888)","ASTRAZENECA PRODUTOS FARMACEUTICOS, LDA (502942240)","165.108,90 €",21-06-2017,04-05-2017,270 dias,"Portugal, Évora, Évora",Artigo 259.º do Código dos Contratos Públicos,,,,,,1771819,CP 2015/6 - Acordo quadro para o fornecimento de Medicamentos do Foro Oncológico,FALSE
Prestação de serviços médicos em Hematologia,Ajuste Direto Regime Geral,Aquisição de serviços,"85121000-3, Serviços de prática médica","Hospital do Espírito Santo de Évora, E. P. E. (508085888)",Maria Fátima Costa Alves (209536071),"2.880,00 €",21-06-2017,07-06-2017,30 dias,"Portugal, Évora, Évora","Artigo 20.º, n.º 1, alínea a) do Código dos Contratos Públicos",,,,,,Não aplicável.,Não aplicável.,FALSE
Equipamento médico: Desfibrilhadores,Ajuste Direto Regime Geral,Aquisição de bens móveis,"33100000-1, Equipamento médico","Hospital do Espírito Santo de Évora, E. P. E. (508085888)","MEDICINÁLIA CORMÉDICA, LDA.                        (500684324)","14.790,00 €",21-06-2017,03-05-2017,8 dias,"Portugal, Évora, Évora","Artigo 20.º, n.º 1, alínea a) do Código dos Contratos Públicos",,,,,,Não aplicável.,Não aplicável.,FALSE
Aquisição de equipamento de gastroenterologia,Ajuste Direto Regime Geral,Aquisição de bens móveis,"33100000-1, Equipamento médico","Hospital do Espírito Santo de Évora, E. P. E. (508085888)","OLYMPUS IBERIA, S.A.U. (980474710)","78.103,55 €",21-06-2017,02-06-2017,8 dias,"Portugal, Évora, Évora","Artigo 24.º, n.º 1, alínea e) do Código dos Contratos Públicos",,,,,,Não aplicável.,Não aplicável.,FALSE
Prestação de serviços médicos em ginecologia,Concurso público,Aquisição de serviços,"85121210-8, Serviços de ginecologia ou obstetrícia","Hospital do Espírito Santo de Évora, E. P. E. (508085888)","Medipeople - Soluções de Saúde e Educação, Lda (508543436)","183.870,00 €",21-06-2017,02-06-2017,150 dias,"Portugal, Évora, Évora",Artigo 155.º do Código dos Contratos Públicos,,,,,,Não aplicável.,Não aplicável.,FALSE
Aquisição de medicamentos foro oncológico,Ao abrigo de acordo-quadro (art.º 259.º),Aquisição de bens móveis,"33652000-5, Antineoplásicos e imunomoduladores","Hospital do Espírito Santo de Évora, E. P. E. (508085888)","SANOFI- PRODUTOS FARMACÊUTICOS,LDA.                (500134960)","171.664,80 €",21-06-2017,03-05-2017,240 dias,"Portugal, Évora, Évora",Artigo 259.º do Código dos Contratos Públicos,,,,,,1771819,CP 2015/6 - Acordo quadro para o fornecimento de Medicamentos do Foro Oncológico,FALSE
