freguesia,acronym,validVotesPercentage,votes,dicofre
Balança,PPD/PSD.CDS-PP,46.62,69,031001
Balança,PS,26.35,39,031001
Balança,MPT,14.19,21,031001
Balança,PCP-PEV,6.08,9,031001
Balança,PAN,2.03,3,031001
Balança,PCTP/MRPP,2.03,3,031001
Balança,L,1.35,2,031001
Balança,PND,0.68,1,031001
Balança,PNR,0.68,1,031001
Balança,B.E.,0,0,031001
Balança,MAS,0,0,031001
Balança,PDA,0,0,031001
Balança,POUS,0,0,031001
Balança,PPM,0,0,031001
Balança,PPV,0,0,031001
Balança,PTP,0,0,031001
