Objeto do Contrato,Tipo de Procedimento,Tipo(s) de Contrato,CPVs,Entidade(s) Adjudicante(s),Entidade(s) Adjudicatária(s),Preço Contratual,Data de Publicação,Data de Celebração do Contrato,Prazo de Execução,Local de Execução,Fundamentação,Data de Fecho do Contrato,Preço Total Efetivo,Causas das Alterações ao Prazo,Causas das Alterações ao Preço,Estado,N.º registo do Acordo Quadro,Descrição do Acordo Quadro,Procedimento Centralizado
"Aquisição de filtros paa SIE do CHSJ,EPE",Ajuste Direto Regime Geral,Aquisição de bens móveis,"31000000-6, Maquinaria, aparelhagem, equipamento e consumíveis eléctricos; iluminação","Centro Hospitalar de São João, E. P. E. (509821197)",Allows (505915251),"5.552,65 €",09-10-2013,05-09-2013,60 dias,"Portugal, Porto, Porto","Artigo 20.º, n.º 1, alínea a) do Código dos Contratos Públicos",,,,,,Não aplicável.,Não aplicável.,
"Aquisição de filtros para SIE do CHSJ, EPE",Ajuste Direto Regime Geral,Aquisição de bens móveis,"31000000-6, Maquinaria, aparelhagem, equipamento e consumíveis eléctricos; iluminação","Centro Hospitalar de São João, E. P. E. (509821197)",AAF (980246083),"6.745,31 €",09-10-2013,05-09-2013,60 dias,"Portugal, Porto, Porto","Artigo 20.º, n.º 1, alínea a) do Código dos Contratos Públicos",,,,,,Não aplicável.,Não aplicável.,
"Aquisição de filtros para SIE do CHSJ, EPE",Ajuste Direto Regime Geral,Aquisição de bens móveis,"31000000-6, Maquinaria, aparelhagem, equipamento e consumíveis eléctricos; iluminação","Centro Hospitalar de São João, E. P. E. (509821197)",DICO FILTRO Lda. (504647377),"2.253,30 €",09-10-2013,30-07-2013,30 dias,"Portugal, Porto, Porto","Artigo 20.º, n.º 1, alínea a) do Código dos Contratos Públicos",,,,,,Não aplicável.,Não aplicável.,
"Aquisição de filtros para Serviço Instalações e Equipamentos do CHSJ, EPE",Ajuste Direto Regime Geral,Aquisição de bens móveis,"31000000-6, Maquinaria, aparelhagem, equipamento e consumíveis eléctricos; iluminação","Centro Hospitalar de São João, E. P. E. (509821197)",Allows Lda. (505915251),"5.946,00 €",09-10-2013,30-07-2013,30 dias,"Portugal, Porto, Porto","Artigo 20.º, n.º 1, alínea a) do Código dos Contratos Públicos",,,,,,Não aplicável.,Não aplicável.,
"Aquisição de filtros para Serviço Instalações Equipamentos do CHSJ, EPE ",Ajuste Direto Regime Geral,Aquisição de bens móveis,"31000000-6, Maquinaria, aparelhagem, equipamento e consumíveis eléctricos; iluminação","Centro Hospitalar de São João, E. P. E. (509821197)",AAF (980246083),"6.985,42 €",09-10-2013,30-07-2013,30 dias,"Portugal, Porto, Porto","Artigo 20.º, n.º 1, alínea a) do Código dos Contratos Públicos",,,,,,Não aplicável.,Não aplicável.,
"Fornecimento e Montagem das Instalações Mecânicas de AVAC no Centro de Procriação do CHSJ, EPE",Ajuste Direto Regime Geral,Empreitadas de obras públicas,"45331000-6, Instalação de aquecimento, ventilação e ar condicionado","Centro Hospitalar de São João, E. P. E. (509821197)","Ecofluído Serviços Engenharia, Lda. (503707406)","62.520,96 €",04-10-2013,03-09-2013,60 dias,"Portugal, Porto, Porto","Artigo 19.º, alínea a) do Código dos Contratos Públicos",,,,,,Não aplicável.,Não aplicável.,
"Aquisição de vários materiais para o Serviço de Instalações e Equipamentos referentes aos Pedidos de Compra 275, 286 e 329 do ano de 2013.",Ajuste Direto Regime Geral,Aquisição de bens móveis,"31000000-6, Maquinaria, aparelhagem, equipamento e consumíveis eléctricos; iluminação","Centro Hospitalar de São João, E. P. E. (509821197)","Seniormed, Lda (506078310)","6.746,52 €",04-10-2013,01-10-2013,18 dias,"Portugal, Porto, Porto","Artigo 24.º, n.º 1, alínea e) do Código dos Contratos Públicos",,,,,,Não aplicável.,Não aplicável.,
Esterilizador de Turbinas para o Serviço de Estomatologia,Ajuste Direto Regime Geral,Aquisição de bens móveis,"33191100-6, Esterilizador","Centro Hospitalar de São João, E. P. E. (509821197)",Sirona Dental (510469582),"6.500,00 €",03-10-2013,01-10-2013,30 dias,"Portugal, Porto, Porto","Artigo 20.º, n.º 1, alínea a) do Código dos Contratos Públicos",,,,,,Não aplicável.,Não aplicável.,
"Integração dos equipamentos que suportam o Projeto ePatientCentric na Plataforma de Monitorização de Equipamentos, no âmbito do Projeto ePatientCentric",Ajuste Direto Regime Geral,Aquisição de serviços,"72590000-7, Serviços de informática prestados por profissionais","Centro Hospitalar de São João, E. P. E. (509821197)","Hewlett Pacckard Portugal, Lda. (502407697)","6.120,00 €",02-10-2013,27-09-2013,60 dias,"Portugal, Porto, Porto","Artigo 24.º, n.º 1, alínea e) do Código dos Contratos Públicos",,,,,,Não aplicável.,Não aplicável.,
"Módulo Reporting da Firewall CheckPoint, no âmbito do Projeto ePatientCentric",Ajuste Direto Regime Geral,Aquisição de bens móveis,"48211000-0, Pacote de software para interconectividade de plataformas","Centro Hospitalar de São João, E. P. E. (509821197)",Hewlett Packard Portugal Lda. (502407697),"8.368,06 €",01-10-2013,13-09-2013,60 dias,"Portugal, Porto, Porto","Artigo 20.º, n.º 1, alínea a) do Código dos Contratos Públicos",,,,,,Não aplicável.,Não aplicável.,
"Integração do sistema SGCIM com os Portais e Balcão Único, através da Plataforma Única de Integração, no âmbito do Projeto ePatientCentric",Ajuste Direto Regime Geral,Aquisição de bens móveis,"48211000-0, Pacote de software para interconectividade de plataformas","Centro Hospitalar de São João, E. P. E. (509821197)",Glintt Healthcare Solutions SA (502479418),"9.425,00 €",01-10-2013,30-09-2013,60 dias,"Portugal, Porto, Porto","Artigo 24.º, n.º 1, alínea e) do Código dos Contratos Públicos",,,,,,Não aplicável.,Não aplicável.,
Implementação de um interface Agendamento Cardiologia com Portais e Balcão Único no âmbito do Projeto ePatientCentric,Ajuste Direto Regime Geral,Aquisição de serviços,"72590000-7, Serviços de informática prestados por profissionais","Centro Hospitalar de São João, E. P. E. (509821197)",Glintt Healthcare Solutions SA (502479418),"6.270,00 €",01-10-2013,30-09-2013,60 dias,"Portugal, Porto, Porto","Artigo 24.º, n.º 1, alínea e) do Código dos Contratos Públicos",,,,,,Não aplicável.,Não aplicável.,
"Componentes Adicionais SAN Switches Módulos de Fibra e Cabos para o CHSJ, EPE",Ajuste Direto Regime Geral,Aquisição de bens móveis,"30200000-1, Equipamento e material informático","Centro Hospitalar São João, EPE (509821197)","CPCSI Comp.Port.Comp.Sistemas Informação, SA (501162100)","8.325,36 €",01-10-2013,26-09-2013,30 dias,"Portugal, Porto, Porto","Artigo 20.º, n.º 1, alínea a) do Código dos Contratos Públicos",,,,,,Não aplicável.,Não aplicável.,
"Componentes Adicionais SAN Switches Licenças para o CHSJ, EPE",Ajuste Direto Regime Geral,Aquisição de bens móveis,"30200000-1, Equipamento e material informático","Centro Hospitalar São João, EPE (509821197)","CPCSI Comp.Port.Sistemas Informação, SA (501162100)","7.916,44 €",01-10-2013,26-09-2013,30 dias,"Portugal, Porto, Porto","Artigo 20.º, n.º 1, alínea a) do Código dos Contratos Públicos",,,,,,Não aplicável.,Não aplicável.,
"Equipamento de Raio X Portátil Digital para Serviço de Radiologia do CHSJ, EPE",Ajuste Direto Regime Geral,Aquisição de bens móveis,"33111600-7, Aparelhos de radiografia","Centro Hospitalar de São João, E. P. E. (509821197)",Carestream Health  (508054320),"75.000,00 €",01-10-2013,02-09-2013,30 dias,"Portugal, Porto, Porto","Artigo 20.º, n.º 1, alínea a) do Código dos Contratos Públicos",,,,,,Não aplicável.,Não aplicável.,
