Objeto do Contrato,Tipo de Procedimento,Tipo(s) de Contrato,CPVs,Entidade(s) Adjudicante(s),Entidade(s) Adjudicatária(s),Preço Contratual,Data de Publicação,Data de Celebração do Contrato,Prazo de Execução,Local de Execução,Fundamentação,Data de Fecho do Contrato,Preço Total Efetivo,Causas das Alterações ao Prazo,Causas das Alterações ao Preço,Estado,N.º registo do Acordo Quadro,Descrição do Acordo Quadro,Procedimento Centralizado
MEDICAMENTOS,Ajuste Direto Regime Geral,Aquisição de bens móveis,"33000000-0, Equipamento médico, medicamentos e produtos para cuidados pessoais","Unidade Local de Saúde do Norte Alentejano, E. P. E. (508094461)",OM PHARMA S.A                                      (500207410),"5.436,60 €",21-06-2017,28-03-2017,30 dias,"Portugal, Portalegre, Portalegre<BR/>Portugal, Portalegre, Elvas","Artigo 24.º, n.º 1, alínea e) do Código dos Contratos Públicos","","",,"",,Não aplicável.,Não aplicável.,FALSE
51008817 - MEDICAMENTOS DO CAPS,Ajuste Direto Regime Geral,Aquisição de bens móveis,"33000000-0, Equipamento médico, medicamentos e produtos para cuidados pessoais","Unidade Local de Saúde do Norte Alentejano, E. P. E. (508094461)","Unilfarma - União Internacional de Laboratórios Farmacêuticos, Lda. (500293023)","59,01 €",20-06-2017,04-05-2017,1 dias,"Portugal, Portalegre, Elvas","Artigo 24.º, n.º 1, alínea e) do Código dos Contratos Públicos",20-06-2017,"59,01 €",,"",,Não aplicável.,Não aplicável.,FALSE
51008817 - MEDICAMENTOS DO CAPS,Ajuste Direto Regime Geral,Aquisição de bens móveis,"33000000-0, Equipamento médico, medicamentos e produtos para cuidados pessoais","Unidade Local de Saúde do Norte Alentejano, E. P. E. (508094461)",TEVA Pharma - Produtos Farmacêuticos (507045491),"48,00 €",20-06-2017,04-05-2017,1 dias,"Portugal, Portalegre, Elvas","Artigo 24.º, n.º 1, alínea e) do Código dos Contratos Públicos",20-06-2017,"48,00 €",,"",,Não aplicável.,Não aplicável.,FALSE
51008817 - MEDICAMENTOS DO CAPS,Ajuste Direto Regime Geral,Aquisição de bens móveis,"33000000-0, Equipamento médico, medicamentos e produtos para cuidados pessoais","Unidade Local de Saúde do Norte Alentejano, E. P. E. (508094461)","SANOFI- PRODUTOS FARMACÊUTICOS,LDA.                (500134960)","4.109,58 €",20-06-2017,04-05-2017,1 dias,"Portugal, Portalegre, Elvas","Artigo 24.º, n.º 1, alínea e) do Código dos Contratos Públicos",20-06-2017,"4.109,58 €",,"",,Não aplicável.,Não aplicável.,FALSE
REAGENTES,Ajuste Direto Regime Geral,Aquisição de bens móveis,"33000000-0, Equipamento médico, medicamentos e produtos para cuidados pessoais","Unidade Local de Saúde do Norte Alentejano, E. P. E. (508094461)",THERMO FISHER DIAGNOSTICS (506916243),"6.652,74 €",20-06-2017,21-03-2017,30 dias,"Portugal, Portalegre, Elvas<BR/>Portugal, Portalegre, Portalegre","Artigo 24.º, n.º 1, alínea e) do Código dos Contratos Públicos","","",,"",,Não aplicável.,Não aplicável.,FALSE
MEDICAMENTOS,Ajuste Direto Regime Geral,Aquisição de bens móveis,"33000000-0, Equipamento médico, medicamentos e produtos para cuidados pessoais","Unidade Local de Saúde do Norte Alentejano, E. P. E. (508094461)","PFIZER BIOFARMACEUTICA, SOCIEDADE UNIPESSOAL, LDA (513300376)","9.263,63 €",20-06-2017,21-03-2017,30 dias,"Portugal, Portalegre, Portalegre<BR/>Portugal, Portalegre, Elvas","Artigo 24.º, n.º 1, alínea e) do Código dos Contratos Públicos","","",,"",,Não aplicável.,Não aplicável.,FALSE
MEDICAMENTOS,Ajuste Direto Regime Geral,Aquisição de bens móveis,"33000000-0, Equipamento médico, medicamentos e produtos para cuidados pessoais","Unidade Local de Saúde do Norte Alentejano, E. P. E. (508094461)","ACTELION PHARMACEUTICALS PORTUGAL, LDA             (507336488)","9.128,00 €",20-06-2017,21-03-2017,30 dias,"Portugal, Portalegre, Elvas<BR/>Portugal, Portalegre, Portalegre","Artigo 24.º, n.º 1, alínea e) do Código dos Contratos Públicos","","",,"",,Não aplicável.,Não aplicável.,FALSE
MEDICAMENTOS,Ajuste Direto Regime Geral,Aquisição de bens móveis,"33000000-0, Equipamento médico, medicamentos e produtos para cuidados pessoais","Unidade Local de Saúde do Norte Alentejano, E. P. E. (508094461)","ACTELION PHARMACEUTICALS PORTUGAL, LDA             (507336488)","9.210,00 €",20-06-2017,21-03-2017,30 dias,"Portugal, Portalegre, Elvas<BR/>Portugal, Portalegre, Portalegre","Artigo 24.º, n.º 1, alínea e) do Código dos Contratos Públicos","","",,"",,Não aplicável.,Não aplicável.,FALSE
MEDICAMENTOS,Ajuste Direto Regime Geral,Aquisição de bens móveis,"33000000-0, Equipamento médico, medicamentos e produtos para cuidados pessoais","Unidade Local de Saúde do Norte Alentejano, E. P. E. (508094461)","SANOFI- PRODUTOS FARMACÊUTICOS,LDA.                (500134960)","7.942,00 €",20-06-2017,21-03-2017,30 dias,"Portugal, Portalegre, Elvas<BR/>Portugal, Portalegre, Portalegre","Artigo 24.º, n.º 1, alínea e) do Código dos Contratos Públicos","","",,"",,Não aplicável.,Não aplicável.,FALSE
51008817 - medicamentos do caps,Ajuste Direto Regime Geral,Aquisição de bens móveis,"33000000-0, Equipamento médico, medicamentos e produtos para cuidados pessoais","Unidade Local de Saúde do Norte Alentejano, E. P. E. (508094461)","P.M.H. - PROD. MEDICOS HOSPITALARES, LDA. (502376899)","110,88 €",20-06-2017,04-05-2017,1 dias,"Portugal, Portalegre, Elvas","Artigo 24.º, n.º 1, alínea e) do Código dos Contratos Públicos",20-06-2017,"110,88 €",,"",,Não aplicável.,Não aplicável.,FALSE
51008817 - MEDICAMENTOS DO CAPS,Ajuste Direto Regime Geral,Aquisição de bens móveis,"33000000-0, Equipamento médico, medicamentos e produtos para cuidados pessoais","Unidade Local de Saúde do Norte Alentejano, E. P. E. (508094461)",PAUL HARTMANN                                      (502271728),"96,00 €",20-06-2017,04-05-2017,1 dias,"Portugal, Portalegre, Elvas","Artigo 24.º, n.º 1, alínea e) do Código dos Contratos Públicos",20-06-2017,"96,00 €",,"",,Não aplicável.,Não aplicável.,FALSE
51008817 - medicamentos do caps,Ajuste Direto Regime Geral,Aquisição de bens móveis,"33000000-0, Equipamento médico, medicamentos e produtos para cuidados pessoais","Unidade Local de Saúde do Norte Alentejano, E. P. E. (508094461)","Overpharma, Lda. (505792362)","275,57 €",20-06-2017,04-05-2017,1 dias,"Portugal, Portalegre, Elvas","Artigo 24.º, n.º 1, alínea e) do Código dos Contratos Públicos",20-06-2017,"275,57 €",,"",,Não aplicável.,Não aplicável.,FALSE
51008817 - medicamentos do caps,Ajuste Direto Regime Geral,Aquisição de bens móveis,"33000000-0, Equipamento médico, medicamentos e produtos para cuidados pessoais","Unidade Local de Saúde do Norte Alentejano, E. P. E. (508094461)","NOVARTIS FARMA-PROD.FARMACÊUTICOS,SA.              (500063524)","25,03 €",20-06-2017,04-05-2017,1 dias,"Portugal, Portalegre, Elvas","Artigo 24.º, n.º 1, alínea e) do Código dos Contratos Públicos",20-06-2017,"25,03 €",,"",,Não aplicável.,Não aplicável.,FALSE
51008817 - medicamentos do caps,Ajuste Direto Regime Geral,Aquisição de bens móveis,"33000000-0, Equipamento médico, medicamentos e produtos para cuidados pessoais","Unidade Local de Saúde do Norte Alentejano, E. P. E. (508094461)","MEDA PHARMA - PRODUTOS FARMACÊUTICOS, SA.          (500082090)","50,00 €",20-06-2017,04-05-2017,1 dias,"Portugal, Portalegre, Elvas","Artigo 24.º, n.º 1, alínea e) do Código dos Contratos Públicos",20-06-2017,"50,00 €",,"",,Não aplicável.,Não aplicável.,FALSE
51008817 - medicamentos do caps,Ajuste Direto Regime Geral,Aquisição de bens móveis,"33000000-0, Equipamento médico, medicamentos e produtos para cuidados pessoais","Unidade Local de Saúde do Norte Alentejano, E. P. E. (508094461)",LUNDBECK PORTUGAL - PROD FARMACEUTICOS UNIPESSOAL  (503573922),"51,36 €",20-06-2017,04-05-2017,1 dias,"Portugal, Portalegre, Elvas","Artigo 24.º, n.º 1, alínea e) do Código dos Contratos Públicos",20-06-2017,"51,36 €",,"",,Não aplicável.,Não aplicável.,FALSE
51008817 - medicamentos do caps,Ajuste Direto Regime Geral,Aquisição de bens móveis,"33000000-0, Equipamento médico, medicamentos e produtos para cuidados pessoais","Unidade Local de Saúde do Norte Alentejano, E. P. E. (508094461)",Labesfal - Laboratórios Almiro S.A (501169580),"322,15 €",20-06-2017,04-05-2017,1 dias,"Portugal, Portalegre, Elvas","Artigo 24.º, n.º 1, alínea e) do Código dos Contratos Públicos",20-06-2017,"322,15 €",,"",,Não aplicável.,Não aplicável.,FALSE
51008817 - Medicamentos do caps,Ajuste Direto Regime Geral,Aquisição de bens móveis,"33000000-0, Equipamento médico, medicamentos e produtos para cuidados pessoais","Unidade Local de Saúde do Norte Alentejano, E. P. E. (508094461)","JANSSEN CILAG FARMACEUTICA, LDA (500189412)","12,72 €",20-06-2017,04-05-2017,1 dias,"Portugal, Portalegre, Portalegre","Artigo 24.º, n.º 1, alínea e) do Código dos Contratos Públicos",20-06-2017,"12,72 €",,"",,Não aplicável.,Não aplicável.,FALSE
51008817 - Medicamentos do caps,Ajuste Direto Regime Geral,Aquisição de bens móveis,"33000000-0, Equipamento médico, medicamentos e produtos para cuidados pessoais","Unidade Local de Saúde do Norte Alentejano, E. P. E. (508094461)",HIKMA FARMACÊUTICA (PORTUGAL) SA.                  (502266791),"1.047,00 €",20-06-2017,04-05-2017,1 dias,"Portugal, Portalegre, Elvas","Artigo 24.º, n.º 1, alínea e) do Código dos Contratos Públicos",20-06-2017,"1.047,00 €",,"",,Não aplicável.,Não aplicável.,FALSE
51008817 - AQUISIÇÃO DE MEDICAMENTOS DO CAPS,Ajuste Direto Regime Geral,Aquisição de bens móveis,"33000000-0, Equipamento médico, medicamentos e produtos para cuidados pessoais","Unidade Local de Saúde do Norte Alentejano, E. P. E. (508094461)","Generis - Farmacêutica, SA (508107997)","82,15 €",20-06-2017,04-05-2017,1 dias,"Portugal, Portalegre, Elvas","Artigo 24.º, n.º 1, alínea e) do Código dos Contratos Públicos",20-06-2017,"82,15 €",,"",,Não aplicável.,Não aplicável.,FALSE
51008817 - medicamentos do caps,Ajuste Direto Regime Geral,Aquisição de bens móveis,"33000000-0, Equipamento médico, medicamentos e produtos para cuidados pessoais","Unidade Local de Saúde do Norte Alentejano, E. P. E. (508094461)",GRIFOLS PORTUGAL                                   (502041285),"3.804,00 €",20-06-2017,04-05-2017,1 dias,"Portugal, Portalegre, Elvas","Artigo 24.º, n.º 1, alínea e) do Código dos Contratos Públicos",20-06-2017,"3.804,00 €",,"",,Não aplicável.,Não aplicável.,FALSE
MEDICAMENTOS,Ajuste Direto Regime Geral,Aquisição de bens móveis,"33000000-0, Equipamento médico, medicamentos e produtos para cuidados pessoais","Unidade Local de Saúde do Norte Alentejano, E. P. E. (508094461)","SANOFI- PRODUTOS FARMACÊUTICOS,LDA.                (500134960)","7.942,00 €",20-06-2017,21-03-2017,30 dias,"Portugal, Portalegre, Portalegre<BR/>Portugal, Portalegre, Elvas","Artigo 24.º, n.º 1, alínea e) do Código dos Contratos Públicos","","",,"",,Não aplicável.,Não aplicável.,FALSE
MEDICAMENTOS,Ajuste Direto Regime Geral,Aquisição de bens móveis,"33000000-0, Equipamento médico, medicamentos e produtos para cuidados pessoais","Unidade Local de Saúde do Norte Alentejano, E. P. E. (508094461)","ACTELION PHARMACEUTICALS PORTUGAL, LDA             (507336488)","9.210,00 €",20-06-2017,21-03-2017,30 dias,"Portugal, Portalegre, Portalegre<BR/>Portugal, Portalegre, Elvas","Artigo 24.º, n.º 1, alínea e) do Código dos Contratos Públicos","","",,"",,Não aplicável.,Não aplicável.,FALSE
51008817 - medicamentos do caps,Ajuste Direto Regime Geral,Aquisição de bens móveis,"33000000-0, Equipamento médico, medicamentos e produtos para cuidados pessoais","Unidade Local de Saúde do Norte Alentejano, E. P. E. (508094461)",GLAXOSMITHKLINE - PROD.FARMAC. (500139962),"57,60 €",20-06-2017,04-05-2017,1 dias,"Portugal, Portalegre, Elvas","Artigo 24.º, n.º 1, alínea e) do Código dos Contratos Públicos",20-06-2017,"57,60 €",,"",,Não aplicável.,Não aplicável.,FALSE
51008817 - Medicamentos do caps,Ajuste Direto Regime Geral,Aquisição de bens móveis,"33000000-0, Equipamento médico, medicamentos e produtos para cuidados pessoais","Unidade Local de Saúde do Norte Alentejano, E. P. E. (508094461)","FERRING PORTUGUESA - PROD. FARM. SOC. UNIP., LDA. (502034831)","113,40 €",20-06-2017,04-05-2017,1 dias,"Portugal, Portalegre, Elvas","Artigo 24.º, n.º 1, alínea e) do Código dos Contratos Públicos",20-06-2017,"113,40 €",,"",,Não aplicável.,Não aplicável.,FALSE
51008817 - medicamentos do caps,Ajuste Direto Regime Geral,Aquisição de bens móveis,"33000000-0, Equipamento médico, medicamentos e produtos para cuidados pessoais","Unidade Local de Saúde do Norte Alentejano, E. P. E. (508094461)",CLINIFAR SA                                        (503281115),"105,00 €",20-06-2017,04-05-2017,1 dias,"Portugal, Portalegre, Elvas","Artigo 24.º, n.º 1, alínea e) do Código dos Contratos Públicos",20-06-2017,"105,00 €",,"",,Não aplicável.,Não aplicável.,FALSE
51008817 - Medicamentos do CAPS,Ajuste Direto Regime Geral,Aquisição de bens móveis,"33000000-0, Equipamento médico, medicamentos e produtos para cuidados pessoais","Unidade Local de Saúde do Norte Alentejano, E. P. E. (508094461)","B. BRAUN MEDICAL, LDA (501506543)","146,42 €",20-06-2017,04-05-2017,1 dias,"Portugal, Portalegre, Elvas","Artigo 24.º, n.º 1, alínea e) do Código dos Contratos Públicos",20-06-2017,"146,42 €",,"",,Não aplicável.,Não aplicável.,FALSE
51008817 - MEDICAMENTOS DO CAPS,Ajuste Direto Regime Geral,Aquisição de bens móveis,"33000000-0, Equipamento médico, medicamentos e produtos para cuidados pessoais","Unidade Local de Saúde do Norte Alentejano, E. P. E. (508094461)",ALCON PORTUGAL - PRODUTOS  EQUIP OFTALMOLOGICOS LDA (501251685),"604,50 €",20-06-2017,20-06-2017,1 dias,"Portugal, Portalegre, Elvas","Artigo 24.º, n.º 1, alínea e) do Código dos Contratos Públicos",20-06-2017,"604,50 €",,"",,Não aplicável.,Não aplicável.,FALSE
MEDICAMENTOS,Ajuste Direto Regime Geral,Aquisição de bens móveis,"33000000-0, Equipamento médico, medicamentos e produtos para cuidados pessoais","Unidade Local de Saúde do Norte Alentejano, E. P. E. (508094461)","SANOFI- PRODUTOS FARMACÊUTICOS,LDA.                (500134960)","7.942,00 €",20-06-2017,21-03-2017,30 dias,"Portugal, Portalegre, Portalegre<BR/>Portugal, Portalegre, Elvas","Artigo 24.º, n.º 1, alínea e) do Código dos Contratos Públicos","","",,"",,Não aplicável.,Não aplicável.,FALSE
MEDICAMENTOS,Ajuste Direto Regime Geral,Aquisição de bens móveis,"33000000-0, Equipamento médico, medicamentos e produtos para cuidados pessoais","Unidade Local de Saúde do Norte Alentejano, E. P. E. (508094461)","SANOFI- PRODUTOS FARMACÊUTICOS,LDA.                (500134960)","7.942,00 €",20-06-2017,21-03-2017,30 dias,"Portugal, Portalegre, Portalegre<BR/>Portugal, Portalegre, Elvas","Artigo 24.º, n.º 1, alínea e) do Código dos Contratos Públicos","","",,"",,Não aplicável.,Não aplicável.,FALSE
61006517 - Aquisição de reagentes para Cobas H232 da Ponte de Sôr,Ajuste Direto Regime Geral,Aquisição de bens móveis,"33000000-0, Equipamento médico, medicamentos e produtos para cuidados pessoais","Unidade Local de Saúde do Norte Alentejano, E. P. E. (508094461)",ROCHE SISTEMA DE DIAGNOSTICOS                      (504282921),"7.856,86 €",20-06-2017,20-06-2017,210 dias,"Portugal, Portalegre, Ponte de Sor","Artigo 24.º, n.º 1, alínea e) do Código dos Contratos Públicos","","",,"",,Não aplicável.,Não aplicável.,FALSE
51008817 - MEDICAMENTOS DO CAPS,Ajuste Direto Regime Geral,Aquisição de bens móveis,"33000000-0, Equipamento médico, medicamentos e produtos para cuidados pessoais","Unidade Local de Saúde do Norte Alentejano, E. P. E. (508094461)",AGA - ALCOOL E GENEROS ALIMENTARES SA              (500727457),"374,40 €",19-06-2017,04-05-2017,1 dias,"Portugal, Portalegre, Elvas","Artigo 24.º, n.º 1, alínea e) do Código dos Contratos Públicos",19-06-2017,"374,40 €",,"",,Não aplicável.,Não aplicável.,FALSE
"Fornecimento de pensos especiais à ULSNA, EPE (2017) - AQ 81/2016 da SPMS",Ao abrigo de acordo-quadro (art.º 259.º),Aquisição de bens móveis,"33140000-3, Material médico de consumo","Unidade Local de Saúde do Norte Alentejano, E. P. E. (508094461)",Overpharma - Produtos Médicos e Farmacêuticos Lda  (505792362),"2.105,00 €",19-06-2017,01-06-2017,214 dias,"Portugal, Portalegre",Artigo 259.º do Código dos Contratos Públicos,31-12-2017,"1.733,00 €",,Não foram adquiridas todas as quantidades estimadas.,,2183748,Pensos especiais,FALSE
"Fornecimento de Pensos Especiais  à ULSNA, EPE (2017) - AQ 81/2016 da SPMS",Ao abrigo de acordo-quadro (art.º 259.º),Aquisição de bens móveis,"33140000-3, Material médico de consumo","Unidade Local de Saúde do Norte Alentejano, E. P. E. (508094461)","MEDICINÁLIA CORMÉDICA, LDA.                        (500684324)","6.833,40 €",19-06-2017,01-06-2017,214 dias,"Portugal, Portalegre",Artigo 259.º do Código dos Contratos Públicos,31-12-2017,"5.682,00 €",,Não foram adquiridas todas as quantidades estimadas.,,2183748,Pensos especiais,FALSE
"Fornecimento de Nastros e Fitas Cirúrgicas (Adesivos), à ULSNA, EPE (2017) - AQ 02003017",Ao abrigo de acordo-quadro (art.º 259.º),Aquisição de bens móveis,"33600000-6, Produtos farmacêuticos","Unidade Local de Saúde do N. Alentejano,EPE(ULSNA) (508094461)",Overpharma - Produtos Médicos e Farmacêuticos Lda  (505792362),"1.642,02 €",19-06-2017,01-06-2017,214 dias,"Portugal, Portalegre",Artigo 259.º do Código dos Contratos Públicos,31-12-2017,"1.213,56 €",,Não foram adquiridas todas as quantidades estimadas.,,2183753,CP 2016/82 - Acordo quadro para fornecimento de Nastros e Fitas Cirúrgicas às Instituições e Serviços do Serviço Nacional de Saúde,FALSE
Fornecimento de Nastros e Fitas Cirúrgicas (Adesivos) - AQ 82/2016,Ao abrigo de acordo-quadro (art.º 259.º),Aquisição de bens móveis,"33600000-6, Produtos farmacêuticos","Unidade Local de Saúde do N. Alentejano,EPE(ULSNA) (508094461)","MEDICINÁLIA CORMÉDICA, LDA.                        (500684324)","3.712,50 €",19-06-2017,01-06-2017,214 dias,"Portugal, Portalegre",Artigo 259.º do Código dos Contratos Públicos,19-06-2017,"3.762,00 €",,Acerto de multiplos de encomenda,,2183753,CP 2016/82 - Acordo quadro para fornecimento de Nastros e Fitas Cirúrgicas às Instituições e Serviços do Serviço Nacional de Saúde,FALSE
"Fornecimento de Nastros e Fitas Cirúrgicas (Adesivos), para a ULSNA, EPE, (2017) - AQ 82/2016",Ao abrigo de acordo-quadro (art.º 259.º),Aquisição de bens móveis,"33600000-6, Produtos farmacêuticos","Unidade Local de Saúde do N. Alentejano,EPE(ULSNA) (508094461)","Bastos Viegas, S.A. (500042772)","396,00 €",19-06-2017,01-06-2017,214 dias,"Portugal, Portalegre",Artigo 259.º do Código dos Contratos Públicos,19-06-2017,"396,00 €",,"",,2183753,CP 2016/82 - Acordo quadro para fornecimento de Nastros e Fitas Cirúrgicas às Instituições e Serviços do Serviço Nacional de Saúde,FALSE
"Prestação de Serviços de Manutenção Preventiva e Corretiva de UPS`S da ULSNA, EPE, Ano 2017",Ajuste Direto Regime Geral,Aquisição de serviços,"50000000-5, Serviços de reparação e manutenção","Unidade Local de Saúde do Norte Alentejano, E. P. E. (508094461)","VERTIV PORTUGAL, LDA (503322520)","9.930,01 €",16-06-2017,21-03-2017,365 dias,"Portugal, Portalegre, Portalegre","Artigo 24.º, n.º 1, alínea e) do Código dos Contratos Públicos",21-03-2017,"9.930,01 €",,"",,Não aplicável.,Não aplicável.,FALSE
PRESTAÇÃO DE SERVIÇOS DE AUDITORIA EXTERNA DE CODIFICAÇÃO CLINICA ANO 2016,Ajuste Direto Regime Geral,Aquisição de serviços,"85100000-0, Serviços de saúde","Unidade Local de Saúde do Norte Alentejano, E. P. E. (508094461)","Codimensagem, Lda. (507600908)","10.947,50 €",12-06-2017,08-05-2017,365 dias,"Portugal, Portalegre, Portalegre","Artigo 20.º, n.º 1, alínea a) do Código dos Contratos Públicos",08-05-2017,"10.947,50 €",,"",,Não aplicável.,Não aplicável.,FALSE
