Objeto do Contrato,Tipo de Procedimento,Tipo(s) de Contrato,CPVs,Entidade(s) Adjudicante(s),Entidade(s) Adjudicatária(s),Preço Contratual,Data de Publicação,Data de Celebração do Contrato,Prazo de Execução,Local de Execução,Fundamentação,Data de Fecho do Contrato,Preço Total Efetivo,Causas das Alterações ao Prazo,Causas das Alterações ao Preço,Estado,N.º registo do Acordo Quadro,Descrição do Acordo Quadro,Procedimento Centralizado
Inscrição no IV Curso Avançado em Coordenação de Transplantação,Ajuste Direto Regime Geral,Aquisição de serviços,"79632000-3, Serviços de formação de pessoal","Centro Hospitalar Vila Nova de Gaia - Espinho, E. P. E. (508142156)","Inst. Portugês Sangue e da Transplantação, I.P. (502423943)","800,00 €",29-03-2019,27-03-2019,3 dias,"Portugal, Porto, Vila Nova de Gaia","Artigo 24.º, n.º 1, alínea c) do Código dos Contratos Públicos","","",,"",,Não aplicável.,Não aplicável.,FALSE
MEDICAMENTOS CAPS,Ajuste Direto Regime Geral,Aquisição de bens móveis,"33000000-0, Equipamento médico, medicamentos e produtos para cuidados pessoais","Unidade Local de Saúde do Norte Alentejano, E. P. E. (508094461)","Instituto Português do Sangue e da Transplantação, (502423943)","692,00 €",22-01-2019,14-12-2018,365 dias,"Portugal, Portalegre, Elvas<BR/>Portugal, Portalegre, Portalegre","Artigo 24.º, n.º 1, alínea c) do Código dos Contratos Públicos","","",,"",,Não aplicável.,Não aplicável.,FALSE
PLASMA HUMANO,Ajuste Direto Regime Geral,Aquisição de bens móveis,"33000000-0, Equipamento médico, medicamentos e produtos para cuidados pessoais","Hospital Garcia de Orta, E. P. E. (506361470)","Instituto Português do Sangue e da Transplantação, I. P. (502423943)","16.608,00 €",21-12-2018,13-12-2018,30 dias,"Portugal, Setúbal, Almada","Artigo 20.º, n.º 1, alínea d) do Código dos Contratos Públicos","","",,"",,Não aplicável.,Não aplicável.,FALSE
PLASMA HUMANO,Ajuste Direto Regime Geral,Aquisição de bens móveis,"33000000-0, Equipamento médico, medicamentos e produtos para cuidados pessoais","Hospital Garcia de Orta, E. P. E. (506361470)","Instituto Português do Sangue e da Transplantação, I. P. (502423943)","15.224,00 €",19-12-2018,05-12-2018,30 dias,"Portugal, Setúbal, Almada","Artigo 20.º, n.º 1, alínea d) do Código dos Contratos Públicos","","",,"",,Não aplicável.,Não aplicável.,FALSE
Unidades terapêuticas de sangue - Abril de 2018,Ajuste Direto Regime Geral,Aquisição de bens móveis,"33600000-6, Produtos farmacêuticos","Instituto Português de Oncologia do Porto Francisco Gentil, E. P. E. (506362299)","INST.PORT.SANGUE E TRANSPLANTACAO, IP (502423943)","23.188,50 €",19-10-2018,19-06-2018,20 dias,"Portugal, Porto, Porto","Artigo 24.º, n.º 1, alínea e), subalínea ii) do Código dos Contratos Públicos","","",,"",,Não aplicável.,Não aplicável.,FALSE
Análises a Medula Óssea,Ajuste Direto Regime Geral,Aquisição de serviços,"85100000-0, Serviços de saúde","Instituto Português de Oncologia do Porto Francisco Gentil, E. P. E. (506362299)","Instituto Português do Sangue e da Transplantação, I. P. (502423943)","133.708,85 €",08-10-2018,17-05-2018,20 dias,"Portugal, Porto, Porto","Artigo 24.º, n.º 1, alínea e), subalínea ii) do Código dos Contratos Públicos","","",,"",,Não aplicável.,Não aplicável.,FALSE
51013618 - Plasma,Ajuste Direto Regime Geral,Aquisição de bens móveis,"33000000-0, Equipamento médico, medicamentos e produtos para cuidados pessoais","Unidade Local de Saúde do Norte Alentejano, E. P. E. (508094461)","Instituto Português do Sangue e da Transplantação, I. P. (502423943)","2.076,00 €",31-08-2018,19-04-2018,1 dias,"Portugal, Portalegre, Elvas","Artigo 24.º, n.º 1, alínea c) do Código dos Contratos Públicos","","",,"",,Não aplicável.,Não aplicável.,FALSE
Unidades terapêuticas de sangue - Fevereiro de 2018,Ajuste Direto Regime Geral,Aquisição de bens móveis,"33600000-6, Produtos farmacêuticos","Instituto Português de Oncologia do Porto Francisco Gentil, E. P. E. (506362299)","Instituto Português do Sangue e da Transplantação, I. P. (502423943)","24.252,50 €",23-07-2018,28-02-2018,20 dias,"Portugal, Porto, Porto","Artigo 24.º, n.º 1, alínea e), subalínea iii) do Código dos Contratos Públicos","","",,"",,Não aplicável.,Não aplicável.,FALSE
Aquisição de medicamentos - Plasma humano do Grupo A e O,Ajuste Direto Regime Geral,Aquisição de bens móveis,"33600000-6, Produtos farmacêuticos","Instituto Português de Oncologia do Porto Francisco Gentil, E. P. E. (506362299)","Instituto Português do Sangue e da Transplantação, I. P. (502423943)","8.304,00 €",30-06-2018,26-06-2018,20 dias,"Portugal, Porto, Porto","Artigo 24.º, n.º 1, alínea e), subalínea iii) do Código dos Contratos Públicos","","",,"",,Não aplicável.,Não aplicável.,FALSE
Aquisição de PLASMA HUMANO DO GRUPO A SOL INJ FR 200ML IV,Ajuste Direto Regime Geral,Aquisição de bens móveis,"33141520-1, Derivados do plasma","Hospital Garcia de Orta, E. P. E. (506361470)","Instituto Português do Sangue e da Transplantação, I. P. (502423943)","13.840,00 €",26-06-2018,20-10-2017,365 dias,"Portugal, Setúbal, Almada","Artigo 24.º, n.º 1, alínea c) do Código dos Contratos Públicos","","",,"",,Não aplicável.,Não aplicável.,FALSE
Plasma Humano Vírus Inactivado,Ajuste Direto Regime Geral,Aquisição de bens móveis,"33600000-6, Produtos farmacêuticos","Centro Hospitalar de Leiria, E. P. E. (509822932)","Instituto Português do Sangue e da Transplantação, I. P. (502423943)","8.996,00 €",12-06-2018,21-03-2018,20 dias,"Portugal, Leiria, Leiria","Artigo 5.º, n.º 2 do Regulamento (CE) nº1370/2007, de 23.10","","",,"",,Não aplicável.,Não aplicável.,FALSE
Actos médicos realizados no exterior,Ajuste Direto Regime Geral,Aquisição de serviços,"85100000-0, Serviços de saúde","Instituto Português de Oncologia do Porto Francisco Gentil, E. P. E. (506362299)","Instituto Português do Sangue e da Transplantação, I. P. (502423943)","187.095,29 €",05-06-2018,18-04-2018,20 dias,"Portugal, Porto, Porto","Artigo 24.º, n.º 1, alínea e) do Código dos Contratos Públicos","","",,"",,Não aplicável.,Não aplicável.,FALSE
"Aquisição medicamentos - Plasma humano A, O e AB  ",Ajuste Direto Regime Geral,Aquisição de bens móveis,"33600000-6, Produtos farmacêuticos","Instituto Português de Oncologia do Porto Francisco Gentil, E. P. E. (506362299)","Instituto Português do Sangue e da Transplantação, I. P. (502423943)","9.688,00 €",29-05-2018,23-04-2018,20 dias,"Portugal, Porto, Porto","Artigo 24.º, n.º 1, alínea e), subalínea iii) do Código dos Contratos Públicos","","",,"",,Não aplicável.,Não aplicável.,FALSE
Actos médicos diversos.,Ajuste Direto Regime Geral,Aquisição de serviços,"85100000-0, Serviços de saúde","Instituto Português de Oncologia do Porto Francisco Gentil, E. P. E. (506362299)","Instituto Português do Sangue e da Transplantação, I. P. (502423943)","14.512,55 €",24-05-2018,31-01-2018,20 dias,"Portugal, Porto, Porto","Artigo 24.º, n.º 1, alínea e), subalínea ii) do Código dos Contratos Públicos","","",,"",,Não aplicável.,Não aplicável.,FALSE
Unidades terapêuticas de sangue - Janeiro de 2018,Ajuste Direto Regime Geral,Aquisição de bens móveis,"33600000-6, Produtos farmacêuticos","Instituto Português de Oncologia do Porto Francisco Gentil, E. P. E. (506362299)","Instituto Português do Sangue e da Transplantação, I. P. (502423943)","30.556,40 €",24-05-2018,31-01-2018,20 dias,"Portugal, Porto, Porto","Artigo 24.º, n.º 1, alínea e), subalínea iii) do Código dos Contratos Públicos","","",,"",,Não aplicável.,Não aplicável.,FALSE
Aquisição medicamento exclusivo - Plasma humano - nov e dez 2017,Ajuste Direto Regime Geral,Aquisição de bens móveis,"33600000-6, Produtos farmacêuticos","Instituto Português de Oncologia do Porto Francisco Gentil, E. P. E. (506362299)","Instituto Português do Sangue e da Transplantação, I. P. (502423943)","8.304,00 €",23-05-2018,10-10-2017,20 dias,"Portugal, Porto, Porto","Artigo 24.º, n.º 1, alínea e) do Código dos Contratos Públicos","","",,"",,Não aplicável.,Não aplicável.,FALSE
Unidades terapêuticas de sangue - Novembro de 2017,Ajuste Direto Regime Geral,Aquisição de bens móveis,"33000000-0, Equipamento médico, medicamentos e produtos para cuidados pessoais","Instituto Português de Oncologia do Porto Francisco Gentil, E. P. E. (506362299)","Instituto Português do Sangue e da Transplantação, I. P. (502423943)","45.253,40 €",22-05-2018,30-11-2017,1 dias,"Portugal, Porto, Porto","Artigo 24.º, n.º 1, alínea e) do Código dos Contratos Públicos","","",,"",,Não aplicável.,Não aplicável.,FALSE
MCDTs - Transplantes,Ajuste Direto Regime Geral,Aquisição de serviços,"85111000-0, Serviços hospitalares","Instituto Português de Oncologia do Porto Francisco Gentil, E. P. E. (506362299)","Instituto Português do Sangue e da Transplantação, I. P. (502423943)","43.038,63 €",22-05-2018,21-11-2017,1 dias,"Portugal, Porto, Porto","Artigo 24.º, n.º 1, alínea e) do Código dos Contratos Públicos","","",,"",,Não aplicável.,Não aplicável.,FALSE
Unidades terapêuticas de sangue - Outubro de 2017,Ajuste Direto Regime Geral,Aquisição de bens móveis,"33000000-0, Equipamento médico, medicamentos e produtos para cuidados pessoais","Instituto Português de Oncologia do Porto Francisco Gentil, E. P. E. (506362299)","Instituto Português do Sangue e da Transplantação, I. P. (502423943)","35.704,90 €",22-05-2018,31-10-2017,1 dias,"Portugal, Porto, Porto","Artigo 24.º, n.º 1, alínea e) do Código dos Contratos Públicos","","",,"",,Não aplicável.,Não aplicável.,FALSE
Protocolo para fornecimento de componentes de sangue durante o ano de 2018,Ajuste Direto Regime Geral,Aquisição de bens móveis,"33000000-0, Equipamento médico, medicamentos e produtos para cuidados pessoais","Instituto Português de Oncologia de Coimbra Francisco Gentil, E. P. E. (506361438)",Instituto Português do Sangue e da Transplantação (502423943),"300.000,00 €",13-03-2018,14-12-2017,365 dias,"Portugal, Coimbra, Coimbra","Artigo 24.º, n.º 1, alínea e) do Código dos Contratos Públicos",31-12-2018,"221.286,00 €",,fornecimento abaixo do previsto,,Não aplicável.,Não aplicável.,FALSE
Plasma Humano do grupo O sol  inj frs 200ml IV,Ajuste Direto Regime Geral,Aquisição de bens móveis,"33698000-9, Produtos para fins clínicos","Centro Hospitalar e Universitário de Coimbra, E.P. (510103448)",Instituto Portugues de Sangue (502423943),"138.400,00 €",28-02-2018,24-08-2016,180 dias,"Portugal, Coimbra, Coimbra","Artigo 24.º, n.º 1, alínea e) do Código dos Contratos Públicos",30-12-2016,"138.400,00 €",,"",,Não aplicável.,Não aplicável.,FALSE
Plasma Humano Vírus Inativado,Ajuste Direto Regime Geral,Aquisição de bens móveis,"33600000-6, Produtos farmacêuticos","Centro Hospitalar de Leiria, E. P. E. (509822932)","Instituto Português do Sangue e da Transplantação, I. P. (502423943)","692,00 €",27-12-2017,22-12-2017,8 dias,"Portugal, Leiria, Leiria","Artigo 24.º, n.º 1, alínea e) do Código dos Contratos Públicos",27-12-2017,"692,00 €",,"",,Não aplicável.,Não aplicável.,FALSE
1136E17 Plasma Humano Grupos A e O,Ajuste Direto Regime Geral,Aquisição de bens móveis,"33600000-6, Produtos farmacêuticos","Centro Hospitalar de Leiria, E. P. E. (509822932)","INST.PORT.SANGUE E TRANSPLANTACAO, IP (502423943)","18.684,00 €",21-09-2017,14-09-2017,120 dias,"Portugal, Leiria, Leiria","Artigo 24.º, n.º 1, alínea e) do Código dos Contratos Públicos","","",,"",,Não aplicável.,Não aplicável.,FALSE
AD100187 AQUISIÇÃO URGENTE DE PLASMA HUMANO 2017,Ajuste Direto Regime Geral,Aquisição de bens móveis,"33620000-2, Medicamentos para o sangue, para os órgãos hematopoiéticos e para o aparelho cardiovascular","Centro Hospitalar de Lisboa Ocidental, E. P. E. (507618319)",INSTITUTO PORTUGUES DO SANGUE (502423943),"43.840,00 €",09-08-2017,17-01-2017,365 dias,"Portugal, Lisboa, Lisboa",Artigo 258.º do Código dos Contratos Públicos,"","",,"",,Não aplicável.,Não aplicável.,FALSE
10/00054.11/2017 – Aquisição do medicamento Plasma Humano (Grupo A e O),Ajuste Direto Regime Geral,Aquisição de bens móveis,"33600000-6, Produtos farmacêuticos","Centro Hospitalar de Entre o Douro e Vouga, E.P.E. (508878462)",INSTITUTO PORTUGUES DE SANGUE (502423943),"13.840,00 €",10-05-2017,19-01-2017,365 dias,"Portugal, Aveiro, Santa Maria da Feira","Artigo 20.º, n.º 1, alínea a) do Código dos Contratos Públicos","","",,"",,Não aplicável.,Não aplicável.,FALSE
AD para Aquisição de Osso Liofilizado p/ Enxerto,Ajuste Direto Regime Geral,Aquisição de bens móveis,"33140000-3, Material médico de consumo","Centro Hospitalar Vila Nova de Gaia - Espinho, E. P. E. (508142156)","Inst. Portugês Sangue e da Transplantação, I.P. (502423943)","602,05 €",06-04-2017,03-04-2017,1 dias,"Portugal, Porto, Vila Nova de Gaia","Artigo 24.º, n.º 1, alínea e) do Código dos Contratos Públicos","","",,"",,Não aplicável.,Não aplicável.,FALSE
AD para Aquisição de Material Para Oftalmologia,Ajuste Direto Regime Geral,Aquisição de bens móveis,"33140000-3, Material médico de consumo","Centro Hospitalar Vila Nova de Gaia - Espinho, E. P. E. (508142156)","Inst. Portugês Sangue e da Transplantação, I.P. (502423943)","1.648,20 €",03-03-2017,23-02-2017,1 dias,"Portugal, Porto, Vila Nova de Gaia","Artigo 24.º, n.º 1, alínea e) do Código dos Contratos Públicos","","",,"",,Não aplicável.,Não aplicável.,FALSE
PLASMA HUMANO DO GRUPO 0 SOL INJ FR 200 ML IV - Aj.Directo  Nº 14054117,Ajuste Direto Regime Geral,Aquisição de bens móveis,"33000000-0, Equipamento médico, medicamentos e produtos para cuidados pessoais","Hospital Garcia de Orta, E. P. E. (506361470)","Instituto Português do Sangue e da Transplantação, I. P. (502423943)","6.920,00 €",01-03-2017,17-02-2017,30 dias,"Portugal, Setúbal, Almada","Artigo 24.º, n.º 1, alínea e) do Código dos Contratos Públicos","","",,"",,Não aplicável.,Não aplicável.,FALSE
Protocolo para fornecimento de componentes de sangue - 2017,Ajuste Direto Regime Geral,Aquisição de bens móveis,"33000000-0, Equipamento médico, medicamentos e produtos para cuidados pessoais","Instituto Português de Oncologia de Coimbra Francisco Gentil, E. P. E. (506361438)",Instituto Português do Sangue e da Transplantação (502423943),"309.381,80 €",07-02-2017,14-12-2016,365 dias,"Portugal, Coimbra, Coimbra","Artigo 24.º, n.º 1, alínea e) do Código dos Contratos Públicos",31-12-2017,"272.917,70 €",,diminuição das quantidades previstas,,Não aplicável.,Não aplicável.,FALSE
AD para Aquisição de embrana Amniotica p/ Transplante 9 cm2,Ajuste Direto Regime Geral,Aquisição de bens móveis,"33140000-3, Material médico de consumo","Centro Hospitalar Vila Nova de Gaia - Espinho, E. P. E. (508142156)","Inst. Portugês Sangue e da Transplantação, I.P. (502423943)","252,05 €",24-01-2017,17-01-2017,1 dias,"Portugal, Porto, Vila Nova de Gaia","Artigo 20.º, n.º 1, alínea a) do Código dos Contratos Públicos","","",,"",,Não aplicável.,Não aplicável.,FALSE
Diverso Material - IPST,Ajuste Direto Regime Geral,Aquisição de bens móveis,"33140000-3, Material médico de consumo","Centro Hospitalar Vila Nova de Gaia - Espinho, E. P. E. (508142156)","Inst. Portugês Sangue e da Transplantação, I.P. (502423943)","9.161,18 €",05-12-2016,29-11-2016,1 dias,"Portugal, Porto, Vila Nova de Gaia","Artigo 24.º, n.º 1, alínea c) do Código dos Contratos Públicos","","",,"",,Não aplicável.,Não aplicável.,FALSE
PLASMA HUMANO DO GRUPO 0 SOL INJ FR 200 ML IV - Aj. Directo nº 14219116,Ajuste Direto Regime Geral,Aquisição de bens móveis,"33000000-0, Equipamento médico, medicamentos e produtos para cuidados pessoais","Hospital Garcia de Orta, E. P. E. (506361470)","Instituto Português do Sangue e da Transplantação, I. P. (502423943)","6.920,00 €",11-11-2016,08-08-2016,90 dias,"Portugal, Setúbal, Almada","Artigo 24.º, n.º 1, alínea e) do Código dos Contratos Públicos","","",,"",,Não aplicável.,Não aplicável.,FALSE
PLASMA HUMANO DO GRUPO A SOL INJ FR 200 ML IV - Aj. Directo nº 14218316,Ajuste Direto Regime Geral,Aquisição de bens móveis,"33000000-0, Equipamento médico, medicamentos e produtos para cuidados pessoais","Hospital Garcia de Orta, E. P. E. (506361470)","Instituto Português do Sangue e da Transplantação, I. P. (502423943)","20.760,00 €",11-11-2016,05-08-2016,90 dias,"Portugal, Setúbal, Almada","Artigo 24.º, n.º 1, alínea e) do Código dos Contratos Públicos","","",,"",,Não aplicável.,Não aplicável.,FALSE
PLASMA HUMANO DO GRUPO 0 SOL INJ FR 200 ML IV - Aj. Directo nº 14202316,Ajuste Direto Regime Geral,Aquisição de bens móveis,"33000000-0, Equipamento médico, medicamentos e produtos para cuidados pessoais","Hospital Garcia de Orta, E. P. E. (506361470)","Instituto Português do Sangue e da Transplantação, I. P. (502423943)","6.920,00 €",11-11-2016,26-07-2016,120 dias,"Portugal, Setúbal, Almada","Artigo 20.º, n.º 1, alínea a) do Código dos Contratos Públicos","","",,"",,Não aplicável.,Não aplicável.,FALSE
PLASMA HUMANO DO GRUPO 0 SOL INJ FR 200 ML IV - Aj. Directo nº 14205316,Ajuste Direto Regime Geral,Aquisição de bens móveis,"33000000-0, Equipamento médico, medicamentos e produtos para cuidados pessoais","Hospital Garcia de Orta, E. P. E. (506361470)","Instituto Português do Sangue e da Transplantação, I. P. (502423943)","6.920,00 €",11-11-2016,28-07-2016,120 dias,"Portugal, Setúbal, Almada","Artigo 24.º, n.º 1, alínea e) do Código dos Contratos Públicos","","",,"",,Não aplicável.,Não aplicável.,FALSE
PLASMA HUMANO DO GRUPO 0 SOL INJ FR 200 ML IV- Aj. Directo nº 14227216,Ajuste Direto Regime Geral,Aquisição de bens móveis,"33000000-0, Equipamento médico, medicamentos e produtos para cuidados pessoais","Hospital Garcia de Orta, E. P. E. (506361470)","Instituto Português do Sangue e da Transplantação, I. P. (502423943)","13.840,00 €",03-11-2016,19-08-2016,90 dias,"Portugal, Setúbal, Almada","Artigo 24.º, n.º 1, alínea e) do Código dos Contratos Públicos","","",,"",,Não aplicável.,Não aplicável.,FALSE
PLASMA HUMANO DO GRUPO A SOL INJ FR 200 ML IV - Aj. Directo nº 14137816,Ajuste Direto Regime Geral,Aquisição de bens móveis,"33000000-0, Equipamento médico, medicamentos e produtos para cuidados pessoais","Hospital Garcia de Orta, E. P. E. (506361470)","Instituto Português do Sangue e da Transplantação, I. P. (502423943)","20.760,00 €",02-11-2016,10-05-2016,60 dias,"Portugal, Setúbal, Almada","Artigo 24.º, n.º 1, alínea e) do Código dos Contratos Públicos","","",,"",,Não aplicável.,Não aplicável.,FALSE
PLASMA HUMANO DO GRUPO 0 SOL INJ FR 200 ML IV - Ajuste Directo nº 14155216,Ajuste Direto Regime Geral,Aquisição de bens móveis,"33000000-0, Equipamento médico, medicamentos e produtos para cuidados pessoais","Hospital Garcia de Orta, E. P. E. (506361470)","Instituto Português do Sangue e da Transplantação, I. P. (502423943)","6.228,00 €",02-11-2016,27-05-2016,90 dias,"Portugal, Setúbal, Almada","Artigo 24.º, n.º 1, alínea e) do Código dos Contratos Públicos","","",,"",,Não aplicável.,Não aplicável.,FALSE
PLASMA HUMANO - IPST - Aj. Directo nº 14095016,Ajuste Direto Regime Geral,Aquisição de bens móveis,"33000000-0, Equipamento médico, medicamentos e produtos para cuidados pessoais","Hospital Garcia de Orta, E. P. E. (506361470)","Instituto Português do Sangue e da Transplantação, I. P. (502423943)","24.912,00 €",26-10-2016,17-03-2016,90 dias,"Portugal, Setúbal, Almada","Artigo 24.º, n.º 1, alínea e) do Código dos Contratos Públicos","","",,"",,Não aplicável.,Não aplicável.,FALSE
Plasma Humano Grupo A,Ajuste Direto Regime Geral,Aquisição de bens móveis,"33000000-0, Equipamento médico, medicamentos e produtos para cuidados pessoais","Hospital Garcia de Orta, E. P. E. (506361470)",INSTITUTO PORTUGUÊS SANGUE E DA TRANSPLANTAÇÃO (502423943),"13.840,00 €",09-08-2016,27-01-2016,365 dias,"Portugal, Setúbal, Almada","Artigo 20.º, n.º 1, alínea a) do Código dos Contratos Públicos","","",,"",,Não aplicável.,Não aplicável.,FALSE
Membrana amniótica e osso liofilizado,Ajuste Direto Regime Geral,Aquisição de bens móveis,"33140000-3, Material médico de consumo","Centro Hospitalar Vila Nova de Gaia - Espinho, E. P. E. (508142156)","Inst. Portugês Sangue e da Transplantação, I.P. (502423943)","829,98 €",19-07-2016,18-07-2016,5 dias,"Portugal, Porto, Vila Nova de Gaia","Artigo 24.º, n.º 1, alínea e) do Código dos Contratos Públicos","","",,"",,Não aplicável.,Não aplicável.,FALSE
Material de Derivado Humano,Ajuste Direto Regime Geral,Aquisição de bens móveis,"33141000-0, Material médico não químico descartável e produtos hematológicos","Centro Hospitalar Vila Nova de Gaia - Espinho, E. P. E. (508142156)","Inst. Portugês Sangue e da Transplantação, I.P. (502423943)","1.315,45 €",02-06-2016,02-06-2016,10 dias,"Portugal, Porto, Vila Nova de Gaia","Artigo 24.º, n.º 1, alínea e) do Código dos Contratos Públicos","","",,"",,Não aplicável.,Não aplicável.,FALSE
20361016 - AD para Aquisição de Membrana Amniotica e Cabeça de Femur para Transplante,Ajuste Direto Regime Geral,Aquisição de bens móveis,"33180000-5, Apoio funcional","Centro Hospitalar Vila Nova de Gaia - Espinho, E. P. E. (508142156)","Inst. Portugês Sangue e da Transplantação, I.P. (502423943)","992,33 €",21-04-2016,21-04-2016,3 dias,"Portugal, Porto, Vila Nova de Gaia","Artigo 24.º, n.º 1, alínea e) do Código dos Contratos Públicos","","",,"",,Não aplicável.,Não aplicável.,FALSE
Plasma Humano,Ajuste Direto Regime Geral,Aquisição de bens móveis,"33000000-0, Equipamento médico, medicamentos e produtos para cuidados pessoais","Hospital Garcia de Orta, E. P. E. (506361470)",INSTITUTO PORTUGUÊS SANGUE E DA TRANSPLANTAÇÃO (502423943),"12.456,00 €",15-03-2016,04-01-2016,90 dias,"Portugal, Setúbal, Almada","Artigo 24.º, n.º 1, alínea e) do Código dos Contratos Públicos","","",,"",,Não aplicável.,Não aplicável.,FALSE
Homoenxerto e Membrana Amniotica - Banco de Tecidos,Ajuste Direto Regime Geral,Aquisição de bens móveis,"33100000-1, Equipamento médico","Centro Hospitalar Vila Nova de Gaia - Espinho, E. P. E. (508142156)","Inst. Portugês Sangue e da Transplantação, I.P. (502423943)","1.508,32 €",10-03-2016,10-03-2016,10 dias,"Portugal, Porto, Vila Nova de Gaia","Artigo 24.º, n.º 1, alínea e) do Código dos Contratos Públicos","","",,"",,Não aplicável.,Não aplicável.,FALSE
Protocolo para fornecimento de componentes sanguineos,Ajuste Direto Regime Geral,Aquisição de bens móveis,"33000000-0, Equipamento médico, medicamentos e produtos para cuidados pessoais","Instituto Português de Oncologia de Coimbra Francisco Gentil, E. P. E. (506361438)",INSTITUTO PORTUGUÊS DO SANGUE (502423943),"300.050,20 €",25-01-2016,22-12-2015,365 dias,"Portugal, Coimbra, Coimbra","Artigo 24.º, n.º 1, alínea e) do Código dos Contratos Públicos",31-12-2016,"291.703,70 €",,Fornecimento abaixo do valor previsto,,Não aplicável.,Não aplicável.,FALSE
Protocolo para fornecimento de unidades de sangue,Ajuste Direto Regime Geral,Aquisição de bens móveis,"33000000-0, Equipamento médico, medicamentos e produtos para cuidados pessoais","Instituto Português de Oncologia de Coimbra Francisco Gentil, E. P. E. (506361438)",INSTITUTO PORTUGUÊS DO SANGUE (502423943),"450.280,00 €",11-01-2016,11-12-2014,365 dias,"Portugal, Coimbra, Coimbra","Artigo 24.º, n.º 1, alínea e) do Código dos Contratos Públicos",31-12-2015,"402.514,70 €",,"valor ajustado face as necessidades reais, de acordo com o número de utentes",,Não aplicável.,Não aplicável.,FALSE
21014715 - AD para Aquisição de Homoenxerto e Membrana Amniotica - Banco de Tecidos,Ajuste Direto Regime Geral,Aquisição de bens móveis,"33183100-7, Implantes ortopédicos","Centro Hospitalar Vila Nova de Gaia - Espinho, E. P. E. (508142156)","Inst. Portugês Sangue e da Transplantação, I.P. (502423943)","2.430,35 €",11-12-2015,11-12-2015,3 dias,"Portugal, Porto, Vila Nova de Gaia","Artigo 24.º, n.º 1, alínea e) do Código dos Contratos Públicos","","",,"",,Não aplicável.,Não aplicável.,FALSE
Aquisição Material de Derivado Humano,Ajuste Direto Regime Geral,Aquisição de bens móveis,"33141000-0, Material médico não químico descartável e produtos hematológicos","Centro Hospitalar Vila Nova de Gaia - Espinho, E. P. E. (508142156)","Inst. Portugês Sangue e da Transplantação, I.P. (502423943)","256,79 €",11-11-2015,28-01-2015,20 dias,"Portugal, Porto, Vila Nova de Gaia","Artigo 24.º, n.º 1, alínea c) do Código dos Contratos Públicos","","",,"",,Não aplicável.,Não aplicável.,FALSE
20908015 - AD para Aquisição de Homoenxerto Femur,Ajuste Direto Regime Geral,Aquisição de bens móveis,"33183100-7, Implantes ortopédicos","Centro Hospitalar Vila Nova de Gaia - Espinho, E. P. E. (508142156)","Inst. Portugês Sangue e da Transplantação, I.P. (502423943)","704,19 €",06-11-2015,06-11-2015,3 dias,"Portugal, Porto, Vila Nova de Gaia","Artigo 24.º, n.º 1, alínea e) do Código dos Contratos Públicos","","",,"",,Não aplicável.,Não aplicável.,FALSE
Condilo Femoral,Ajuste Direto Regime Geral,Aquisição de bens móveis,"33160000-9, Técnicas cirúrgicas","Centro Hospitalar Vila Nova de Gaia - Espinho, E. P. E. (508142156)","Inst. Portugês Sangue e da Transplantação, I.P. (502423943)","2.809,04 €",23-10-2015,07-07-2015,2 dias,"Portugal, Porto, Vila Nova de Gaia","Artigo 24.º, n.º 1, alínea e) do Código dos Contratos Públicos","","",,"",,Não aplicável.,Não aplicável.,FALSE
20331615 - AD para Aquisição de Membrana Aniótica p/ Transplante 3CM2,Ajuste Direto Regime Geral,Aquisição de bens móveis,"33140000-3, Material médico de consumo","Centro Hospitalar Vila Nova de Gaia - Espinho, E. P. E. (508142156)","Inst. Portugês Sangue e da Transplantação, I.P. (502423943)","265,77 €",28-09-2015,02-04-2015,3 dias,"Portugal, Porto, Vila Nova de Gaia","Artigo 24.º, n.º 1, alínea e) do Código dos Contratos Públicos","","",,"",,Não aplicável.,Não aplicável.,FALSE
AD para Aquisição Material de Derivado Humano,Ajuste Direto Regime Geral,Aquisição de bens móveis,"33141560-3, Órgãos humanos","Centro Hospitalar Vila Nova de Gaia - Espinho, E. P. E. (508142156)","Inst. Portugês Sangue e da Transplantação, I.P. (502423943)","1.710,77 €",18-09-2015,21-04-2015,1 dias,"Portugal, Porto, Vila Nova de Gaia","Artigo 24.º, n.º 1, alínea e) do Código dos Contratos Públicos","","",,"",,Não aplicável.,Não aplicável.,FALSE
20750415 - AD para Aquisição de Enxerto Osseo Humano,Ajuste Direto Regime Geral,Aquisição de bens móveis,"33183100-7, Implantes ortopédicos","Centro Hospitalar Vila Nova de Gaia - Espinho, E. P. E. (508142156)","Inst. Portugês Sangue e da Transplantação, I.P. (502423943)","261,87 €",11-09-2015,11-09-2015,3 dias,"Portugal, Porto, Vila Nova de Gaia","Artigo 24.º, n.º 1, alínea e) do Código dos Contratos Públicos","","",,"",,Não aplicável.,Não aplicável.,FALSE
Material de Derivado Humano,Ajuste Direto Regime Geral,Aquisição de bens móveis,"33160000-9, Técnicas cirúrgicas","Centro Hospitalar Vila Nova de Gaia - Espinho, E. P. E. (508142156)","Inst. Portugês Sangue e da Transplantação, I.P. (502423943)","256,79 €",19-06-2015,28-01-2015,5 dias,"Portugal, Porto, Vila Nova de Gaia","Artigo 24.º, n.º 1, alínea c) do Código dos Contratos Públicos","","",,"",,Não aplicável.,Não aplicável.,FALSE
Fornecimento de unidades de sangue,Ajuste Direto Regime Geral,Aquisição de bens móveis,"33600000-6, Produtos farmacêuticos","Instituto Português de Oncologia de Coimbra Francisco Gentil, E. P. E. (506361438)",INSTITUTO PORTUGUÊS DO SANGUE (502423943),"457.208,00 €",12-06-2015,14-01-2014,365 dias,"Portugal, Coimbra, Coimbra","Artigo 24.º, n.º 1, alínea e) do Código dos Contratos Públicos",31-12-2014,"457.208,00 €",,"",,Não aplicável.,Não aplicável.,FALSE
Concentrado Eritrocitário,Ajuste Direto Regime Geral,Aquisição de serviços,"85146000-4, Serviços prestados por bancos de sangue","Hospital do Espírito Santo de Évora, E. P. E. (508085888)",Instituto Português do Sangue e Transpantação (502423943),"6.560,00 €",17-09-2014,10-07-2014,8 dias,"Portugal, Évora, Évora","Artigo 20.º, n.º 1, alínea a) do Código dos Contratos Públicos","","",,"",,Não aplicável.,Não aplicável.,FALSE
Concentrado de eritrocitários,Ajuste Direto Regime Geral,Aquisição de serviços,"85146000-4, Serviços prestados por bancos de sangue","Hospital do Espírito Santo de Évora, E. P. E. (508085888)",Instituto Português do sangue (502423943),"7.300,00 €",08-04-2014,03-01-2014,8 dias,"Portugal, Évora, Évora","Artigo 20.º, n.º 1, alínea a) do Código dos Contratos Públicos","","",,"",,Não aplicável.,Não aplicável.,FALSE
Aquisição de Lente de Câmara Anterior,Ajuste Direto Regime Geral,Aquisição de bens móveis,"33140000-3, Material médico de consumo","Centro Hospitalar Vila Nova de Gaia - Espinho, E. P. E. (508142156)","Inst. Portugês Sangue e da Transplantação, I.P. (502423943)","75,00 €",03-02-2014,31-12-2013,10 dias,"Portugal, Porto, Vila Nova de Gaia","Artigo 24.º, n.º 1, alínea c) do Código dos Contratos Públicos","","",,"",,Não aplicável.,Não aplicável.,FALSE
Exames Medicos ( Proc 68150813 ),Ajuste Direto Regime Geral,Aquisição de serviços,"85120000-6, Serviços de prática médica e serviços conexos","Centro Hospitalar do Algarve, E. P. E. (510745997)",Instituto Portugues do Sangue  (502423943),"1.300,00 €",07-11-2013,01-07-2013,180 dias,"Portugal, Faro, Portimão","Artigo 24.º, n.º 1, alínea e) do Código dos Contratos Públicos","","",,"",,Não aplicável.,Não aplicável.,
Exames Médicos ( 68064813),Ajuste Direto Regime Geral,Aquisição de serviços,"85120000-6, Serviços de prática médica e serviços conexos","Centro Hospitalar do Barlavento Algarvio, E.P.E. (507062540)",Instituto Portugues Sangue Transplantação (502423943),"11.000,00 €",22-05-2013,02-01-2013,365 dias,"Portugal, Faro, Portimão","Artigo 24.º, n.º 1, alínea e) do Código dos Contratos Públicos",30-06-2013,"15.012,00 €",,valor ajustado face às necessidades reais de acordo com os exames solicitdos conforme produção/consultas no 1º semestre 2013,,Não aplicável.,Não aplicável.,
Aquisição de unidades de sangue para uso neste Hospital durante o ano de 2012.,Ajuste Direto Regime Geral,Aquisição de serviços,"85146000-4, Serviços prestados por bancos de sangue",HOSPITAL DR FRANCISCO ZAGALO (501510150),"Instituto Português do Sangue, IP (502423943)","40.920,00 €",07-02-2012,01-01-2012,365 dias,"Portugal, Aveiro, Ovar","Artigo 24.º, n.º 1, alínea e) do Código dos Contratos Públicos",31-12-2012,"47.512,00 €",,Fornecimento acima do valor previsto,,Não aplicável.,Não aplicável.,
UNIDADES DE SANGUE,Ajuste Direto Regime Geral,Aquisição de serviços,"85146000-4, Serviços prestados por bancos de sangue",HOSPITAL DR FRANCISCO ZAGALO (501510150),INSTITUTO PORTUGUES SANGUE (502423943),"55.000,00 €",23-03-2011,23-02-2011,365 dias,"Portugal, Aveiro, Ovar","Artigo 24.º, n.º 1, alínea e) do Código dos Contratos Públicos",31-12-2011,"40.844,00 €",,Fornecimento de unidades de sangue abaixo do previsto,,Não aplicável.,Não aplicável.,
Concentração eritrocitos desl.+pool conc.plaq.desleuc._Nov./09_NE08155309,Ajuste Direto Regime Geral,Aquisição de serviços,"85146000-4, Serviços prestados por bancos de sangue",Hospital Amato Lusitano - Castelo Branco (501496327),Instituto Português do Sangue (502423943),"49.856,00 €",29-12-2009,04-12-2009,31 dias,"Portugal, Castelo Branco, Castelo Branco","Artigo 24.º, n.º 1, alínea e) do Código dos Contratos Públicos","","",,"",,Não aplicável.,Não aplicável.,
Concentração eritrocitos desl.+pool conc.plaq.desleuc._Out./09_NE-08141009,Ajuste Direto Regime Geral,Aquisição de serviços,"85146000-4, Serviços prestados por bancos de sangue",Hospital Amato Lusitano - Castelo Branco (501496327),Instituto Português do Sangue (502423943),"56.932,00 €",18-11-2009,01-11-2009,31 dias,"Portugal, Castelo Branco, Castelo Branco","Artigo 24.º, n.º 1, alínea e) do Código dos Contratos Públicos","","",,"",,Não aplicável.,Não aplicável.,
Concentração eritrocitos desl.+pool conc.plaq.desleuc._Set./09_NE-08128409,Ajuste Direto Regime Geral,Aquisição de serviços,"85146000-4, Serviços prestados por bancos de sangue",Hospital Amato Lusitano - Castelo Branco (501496327),Instituto Português do Sangue (502423943),"50.898,00 €",17-11-2009,09-10-2009,30 dias,"Portugal, Castelo Branco, Castelo Branco","Artigo 24.º, n.º 1, alínea e) do Código dos Contratos Públicos","","",,"",,Não aplicável.,Não aplicável.,
Concentração eritrocitos descl.+pool conc.plaq.desleuc.-Agosto/2009,Ajuste Direto Regime Geral,Aquisição de serviços,"85146000-4, Serviços prestados por bancos de sangue",Hospital Amato Lusitano - Castelo Branco (501496327),Instituto Português do Sangue (502423943),"50.258,00 €",19-10-2009,08-09-2009,31 dias,"Portugal, Castelo Branco, Castelo Branco","Artigo 24.º, n.º 1, alínea e) do Código dos Contratos Públicos","","",,"",,Não aplicável.,Não aplicável.,
Concentração eritrocitos desl.+pool conc.plaq.desleic.-Maio/2009,Ajuste Direto Regime Geral,Aquisição de serviços,"85146000-4, Serviços prestados por bancos de sangue",Hospital Amato Lusitano - Castelo Branco (501496327),Instituto Português do Sangue (502423943),"37.944,00 €",14-09-2009,02-06-2009,31 dias,"Portugal, Castelo Branco, Castelo Branco","Artigo 24.º, n.º 1, alínea e) do Código dos Contratos Públicos","","",,"",,Não aplicável.,Não aplicável.,
Concentração eritrocitos desl.+pool conc.plaq.desleic.-Julho/2009,Ajuste Direto Regime Geral,Aquisição de serviços,"85146000-4, Serviços prestados por bancos de sangue",Hospital Amato Lusitano - Castelo Branco (501496327),Instituto Português do Sangue (502423943),"60.986,00 €",14-09-2009,07-08-2009,31 dias,"Portugal, Castelo Branco, Castelo Branco","Artigo 24.º, n.º 1, alínea e) do Código dos Contratos Públicos","","",,"",,Não aplicável.,Não aplicável.,
Concentração Eritrocitos Desl.+Pool Conc.Plaq.Desleuc. referente ao mês de Março,Ajuste Direto Regime Geral,"","",Hospital Amato Lusitano (501496327),Instituto Português do Sangue (502423943),"94.720,00 €",09-06-2009,"",31 dias,"Portugal, Castelo Branco, Castelo Branco",Não Preenchido,"","",,"",,Não aplicável.,Não aplicável.,
09/400221 Diversas formações,Ajuste Direto Regime Geral,"","",Maternidade Dr. Alfredo da Costa (501216324),Instituto Português de Sangue (502423943),"5.140,00 €",01-06-2009,"",6 dias,"",Alínea a) do nº.1 do artigo 20º. do CCP,"","",,"",,Não aplicável.,Não aplicável.,
Concentração Eritrocitos Desl.+Pool Conc.Plaq.Desleuc. referente ao mês de Abril,Ajuste Direto Regime Geral,"","",Hospital Amato Lusitano (501496327),Instituto Português do Sangue (502423943),"48.116,00 €",29-05-2009,"",30 dias,"",Não Preenchido,"","",,"",,Não aplicável.,Não aplicável.,
Concentração Eritrocitos Desl.+Pool Conc.Plaq.Desleuc.,Ajuste Direto Regime Geral,"","",Hospital Amato Lusitano (501496327),Instituto Português do Sangue (502423943),"67.180,00 €",31-03-2009,"",31 dias,"",Não Preenchido,"","",,"",,Não aplicável.,Não aplicável.,
AQUISIÇÃO DE UNIDADES TERAPEUTICAS DE SANGUE,Ajuste Direto Regime Geral,"","",HOSPITAL DR.FRANCISCO ZAGALO-OVAR (501510150),INSTITUTO PORTUGUÊS DO SANGUE (502423943),"50.000,00 €",16-03-2009,"",365 dias,"",Não Preenchido,"","",,"",,Não aplicável.,Não aplicável.,
Concentração Eritrocitos Desl.+Pool Conc.Plaq.Desleuc.,Ajuste Direto Regime Geral,"","",Hospital Amato Lusitano (501496327),Instituto Português do Sangue (502423943),"22.355,90 €",13-03-2009,"",31 dias,"",Não Preenchido,"","",,"",,Não aplicável.,Não aplicável.,
Concentração Eritrocitos Desl.+Pool Conc.Plaq.Desleuc.,Ajuste Direto Regime Geral,"","",Hospital Amato Lusitano (501496327),Instituto Português do Sangue (502423943),"47.280,00 €",13-03-2009,"",28 dias,"",Não Preenchido,"","",,"",,Não aplicável.,Não aplicável.,
