Objeto do Contrato,Tipo de Procedimento,Tipo(s) de Contrato,CPVs,Entidade(s) Adjudicante(s),Entidade(s) Adjudicatária(s),Preço Contratual,Data de Publicação,Data de Celebração do Contrato,Prazo de Execução,Local de Execução,Fundamentação,Data de Fecho do Contrato,Preço Total Efetivo,Causas das Alterações ao Prazo,Causas das Alterações ao Preço,Estado,N.º registo do Acordo Quadro,Descrição do Acordo Quadro,Procedimento Centralizado
Aquisição de  Material de apoio à Formação Profissional,Ajuste Direto Regime Geral,Aquisição de serviços,"79340000-9, Serviços de publicidade e marketing",Administração Regional de Saúde do Alentejo (ARSA) (503148768),"Publiplanicie Produções Publicitárias, Lda. (503616460)","3.850,00 €",08-01-2016,15-12-2015,20 dias,"Portugal, Évora","Artigo 20.º, n.º 1, alínea a) do Código dos Contratos Públicos",28-12-2015,"3.850,00 €",,,,Não aplicável.,Não aplicável.,FALSE
"Aquisição de Equipamento informático, ao abrigo do lote 2 do AQ """"Equipamento Informático"""", celebrado pela ESPAP - 6 portáteis",Ao abrigo de acordo-quadro (art.º 259.º),Aquisição de bens móveis,"30213100-6, Computadores portáteis","Administração Regional de Saúde do Alentejo, I. P. (503148768)",Informática El Corte Inglês (980079659),"2.852,58 €",07-01-2016,26-08-2015,180 dias,"Portugal, Évora, Évora",Artigo 259.º do Código dos Contratos Públicos,28-12-2015,"2.852,58 €",,,,181482,Concurso limitado por prévia qualificação para a celebração de acordo quadro de equipamento informático.,FALSE
"Aquisição de 200 Blocos A5, com o logótipo da Administração Regional de Saúde do Alentejo, I.P., para o 2.º encontro dos médicos internos",Ajuste Direto Regime Geral,Aquisição de serviços,"79340000-9, Serviços de publicidade e marketing","Administração Regional de Saúde do Alentejo, I. P. (503148768)","Hangar Criativo - Soluções de Publicidade, Lda. (509667040)","600,00 €",07-01-2016,28-09-2015,20 dias,"Portugal, Évora","Artigo 20.º, n.º 1, alínea a) do Código dos Contratos Públicos",29-12-2015,"600,00 €",,,,Não aplicável.,Não aplicável.,FALSE
"AD 123.6/2015 Aquisição de Serviços de Formação para a ação """"Registo Sclinico""""",Ajuste Direto Regime Geral,Aquisição de serviços,"80000000-4, Serviços de ensino e formação","Administração Regional de Saúde do Alentejo, I. P. (503148768)",Maria Barbara  Vilhena Catanho de Menezes (135411556),"360,55 €",07-01-2016,21-09-2015,30 dias,"Portugal, Évora","Artigo 20.º, n.º 1, alínea a) do Código dos Contratos Públicos",30-12-2015,"360,55 €",,,,Não aplicável.,Não aplicável.,FALSE
Aquisição do Material de Apoio à Feira de São João,Ajuste Direto Regime Geral,Aquisição de serviços,"79340000-9, Serviços de publicidade e marketing","Administração Regional de Saúde do Alentejo, I. P. (503148768)","Hangar Criativo - Soluções de Publicidade, Lda. (509667040)","710,00 €",06-01-2016,17-06-2015,30 dias,"Portugal, Évora, Évora","Artigo 20.º, n.º 1, alínea a) do Código dos Contratos Públicos",22-07-2015,"710,00 €",,,,Não aplicável.,Não aplicável.,FALSE
"Aquisição de Serviços de Formação para a ação """" Violência Vicariante""""",Ajuste Direto Regime Geral,Aquisição de serviços,"80000000-4, Serviços de ensino e formação","Administração Regional de Saúde do Alentejo, I. P. (503148768)",Associação de Amigos da Criança e da Família Chão dos Meninos (503017329),"210,00 €",06-01-2016,23-06-2015,15 dias,"Portugal, Évora","Artigo 20.º, n.º 1, alínea a) do Código dos Contratos Públicos",31-12-2015,"210,00 €",,,,Não aplicável.,Não aplicável.,FALSE
