freguesia,acronym,validVotesPercentage,votes,dicofre
Tramagal,PS,47.64,484,140115
Tramagal,B.E.,15.45,157,140115
Tramagal,PCP-PEV,11.32,115,140115
Tramagal,PPD/PSD,9.55,97,140115
Tramagal,PAN,4.63,47,140115
Tramagal,CDS-PP,2.46,25,140115
Tramagal,L,2.17,22,140115
Tramagal,A,1.67,17,140115
Tramagal,NC,1.28,13,140115
Tramagal,PCTP/MRPP,0.98,10,140115
Tramagal,PPM.PPV/CDC,0.98,10,140115
Tramagal,PURP,0.79,8,140115
Tramagal,IL,0.49,5,140115
Tramagal,PDR,0.3,3,140115
Tramagal,PTP,0.2,2,140115
Tramagal,PNR,0.1,1,140115
Tramagal,MAS,0,0,140115
