Objeto do Contrato,Tipo de Procedimento,Tipo(s) de Contrato,CPVs,Entidade(s) Adjudicante(s),Entidade(s) Adjudicatária(s),Preço Contratual,Data de Publicação,Data de Celebração do Contrato,Prazo de Execução,Local de Execução,Fundamentação,Data de Fecho do Contrato,Preço Total Efetivo,Causas das Alterações ao Prazo,Causas das Alterações ao Preço,Estado,N.º registo do Acordo Quadro,Descrição do Acordo Quadro,Procedimento Centralizado
"AQUISIÇÃO DE LUVAS EXAME NITRILO NÃO ESTÉRIL SEM PÓ TAMANHOS S, M E L",Ajuste Direto Regime Geral,Aquisição de bens móveis,"33000000-0, Equipamento médico, medicamentos e produtos para cuidados pessoais","Instituto Nacional de Emergência Médica, I. P. (501356126)","Docworld, Lda (508592909)","11.950,00 €",20-11-2017,09-11-2017,2 dias,"Portugal, Lisboa, Lisboa","Artigo 20.º, n.º 1, alínea a) do Código dos Contratos Públicos",,,,,,Não aplicável.,Não aplicável.,FALSE
"AQUISIÇÃO DE SERINGAS IRRECUPERÁVEIS 3 PEÇAS, BICO LARGO DE 100ML ",Ajuste Direto Regime Geral,Aquisição de bens móveis,"33000000-0, Equipamento médico, medicamentos e produtos para cuidados pessoais","Instituto Nacional de Emergência Médica, I. P. (501356126)",QUILIBAN (500399670),"0,00 €",20-11-2017,09-11-2017,1 dias,"Portugal, Lisboa, Lisboa","Artigo 26.º, n.º 1, alínea e) do Código dos Contratos Públicos",,,,,,3025622,"AQUISIÇÃO DE SERINGAS IRRECUPERÁVEIS 3 PEÇAS, BICO LARGO DE 100ML  ",FALSE
AQUISIÇÃO DE CATETERES ENDOVENOSOS PERIFÉRICOS 14G,Ajuste Direto Regime Geral,Aquisição de bens móveis,"33000000-0, Equipamento médico, medicamentos e produtos para cuidados pessoais","Instituto Nacional de Emergência Médica, I. P. (501356126)",SMITHS MEDICAL (507445937),"0,00 €",20-11-2017,15-11-2017,3 dias,"Portugal, Lisboa, Lisboa","Artigo 26.º, n.º 1, alínea e) do Código dos Contratos Públicos",,,,,,3025549,AQUISIÇÃO DE CATETERES ENDOVENOSOS PERIFÉRICOS 14G,FALSE
"Aquisição de morfina, lactato de ringer e cloreto de sódio 0,9% fr. 100ml para irrigação",Ajuste Direto Regime Geral,Aquisição de bens móveis,"33600000-6, Produtos farmacêuticos","Instituto Nacional de Emergência Médica, I. P. (501356126)",OVERPHARMA (505792362),"0,00 €",20-11-2017,08-11-2017,2 dias,"Portugal, Lisboa, Lisboa","Artigo 26.º, n.º 1, alínea e) do Código dos Contratos Públicos",,,,,,3025429,"Aquisição de morfina, lactato de ringer e cloreto de sódio 0,9% fr. 100ml para irrigação",FALSE
"Aquisição de amiodarona, midazolam, naloxona, cetamina, fenitoína, ondansetron",Ajuste Direto Regime Geral,Aquisição de bens móveis,"33600000-6, Produtos farmacêuticos","Instituto Nacional de Emergência Médica, I. P. (501356126)",HIKMA FARMACÊUTICA (502266791),"0,00 €",20-11-2017,08-11-2017,1 dias,"Portugal, Lisboa, Lisboa","Artigo 26.º, n.º 1, alínea e) do Código dos Contratos Públicos",,,,,,3025354,"Aquisição de amiodarona, midazolam, naloxona, cetamina, fenitoína, ondansetron",FALSE
"Aquisição de lâminas de laringoscópio, conectores para controlo digital de aspiração, algálias, máscaras de inalação o2, filtros para doente entubado e eléctrodos ",Ajuste Direto Regime Geral,Aquisição de bens móveis,"33000000-0, Equipamento médico, medicamentos e produtos para cuidados pessoais","Instituto Nacional de Emergência Médica, I. P. (501356126)","HR HOSPITALAR, LDA. (501895558)","4.667,49 €",20-11-2017,16-11-2017,1 dias,"Portugal, Lisboa, Lisboa","Artigo 20.º, n.º 1, alínea a) do Código dos Contratos Públicos",,,,,,Não aplicável.,Não aplicável.,FALSE
AQUISIÇÃO DE BATERIAS PARA LP1000,Ajuste Direto Regime Geral,Aquisição de bens móveis,"33000000-0, Equipamento médico, medicamentos e produtos para cuidados pessoais","Instituto Nacional de Emergência Médica, I. P. (501356126)",PHYSIO PORTUGAL SALES (510137946),"17.700,00 €",17-11-2017,22-09-2017,10 dias,"Portugal, Lisboa, Lisboa","Artigo 24.º, n.º 1, alínea e) do Código dos Contratos Públicos",,,,,,Não aplicável.,Não aplicável.,FALSE
"AQUISIÇÃO DE GLUCOSE 5% 100ML E 500ML E CLORETO DE SÓDIO 0,9% ",Ajuste Direto Regime Geral,Aquisição de bens móveis,"33600000-6, Produtos farmacêuticos","Instituto Nacional de Emergência Médica, I. P. (501356126)",GRIFOLS PORTUGAL (502041285),"0,00 €",16-11-2017,08-11-2017,1 dias,"Portugal, Lisboa, Lisboa","Artigo 26.º, n.º 1, alínea e) do Código dos Contratos Públicos",,,,,,3019334,"AQUISIÇÃO DE GLUCOSE 5% 100ML E 500ML E CLORETO DE SÓDIO 0,9% ",FALSE
AQUISIÇÃO DE COMPRESSAS,Ajuste Direto Regime Geral,Aquisição de bens móveis,"33000000-0, Equipamento médico, medicamentos e produtos para cuidados pessoais","Instituto Nacional de Emergência Médica, I. P. (501356126)",ALBINO DIAS DE ANDRADE (500013810),"0,00 €",16-11-2017,09-11-2017,1 dias,"Portugal, Lisboa, Lisboa","Artigo 26.º, n.º 1, alínea e) do Código dos Contratos Públicos",,,,,,3019268,AQUISIÇÃO DE COMPRESSAS,FALSE
AQUISIÇÃO DE ADENOSINA,Ajuste Direto Regime Geral,Aquisição de bens móveis,"33600000-6, Produtos farmacêuticos","Instituto Nacional de Emergência Médica, I. P. (501356126)",BLUEMED (509912060),"0,00 €",16-11-2017,13-11-2017,2 dias,"Portugal, Lisboa, Lisboa","Artigo 26.º, n.º 1, alínea e) do Código dos Contratos Públicos",,,,,,3019192,AQUISIÇÃO DE ADENOSINA,FALSE
"AQUISIÇÃO DE PARACETAMOL COMP. 500MG, CARVÃO ATIVADO E IBUPROFENO",Ajuste Direto Regime Geral,Aquisição de bens móveis,"33600000-6, Produtos farmacêuticos","Instituto Nacional de Emergência Médica, I. P. (501356126)",LABORATÓRIO MEDINFAR (500384045),"0,00 €",16-11-2017,08-11-2017,3 dias,"Portugal, Lisboa, Lisboa","Artigo 26.º, n.º 1, alínea e) do Código dos Contratos Públicos",,,,,,3019145,"AQUISIÇÃO DE PARACETAMOL COMP. 500MG, CARVÃO ATIVADO E IBUPROFENO",FALSE
"AQUISIÇÃO DE HALOPERIDOL, CAPTOPRIL E CETIRIZINA",Ajuste Direto Regime Geral,Aquisição de bens móveis,"33600000-6, Produtos farmacêuticos","Instituto Nacional de Emergência Médica, I. P. (501356126)",RATIOPHARM (502414910),"0,00 €",16-11-2017,08-11-2017,1 dias,"Portugal, Lisboa, Lisboa","Artigo 26.º, n.º 1, alínea e) do Código dos Contratos Públicos",,,,,,3019088,"AQUISIÇÃO DE HALOPERIDOL, CAPTOPRIL E CETIRIZINA",FALSE
AQUISIÇÃO DE DINITRATO DE ISOSSORBIDA,Ajuste Direto Regime Geral,Aquisição de bens móveis,"33600000-6, Produtos farmacêuticos","Instituto Nacional de Emergência Médica, I. P. (501356126)",SPCARE LDA (508284872),"299,60 €",16-11-2017,07-11-2017,1 dias,"Portugal, Lisboa, Lisboa","Artigo 24.º, n.º 1, alínea e) do Código dos Contratos Públicos",,,,,,Não aplicável.,Não aplicável.,FALSE
Aquisição de metamizol magnésico.,Ajuste Direto Regime Geral,Aquisição de bens móveis,"33600000-6, Produtos farmacêuticos","Instituto Nacional de Emergência Médica, I. P. (501356126)",UNILFARMA (500293023),"0,00 €",16-11-2017,17-10-2017,2 dias,"Portugal, Lisboa, Lisboa","Artigo 26.º, n.º 1, alínea e) do Código dos Contratos Públicos",,,,,,3018965,Aquisição de metamizol magnésico.,FALSE
