Objeto do Contrato,Tipo de Procedimento,Tipo(s) de Contrato,CPVs,Entidade(s) Adjudicante(s),Entidade(s) Adjudicatária(s),Preço Contratual,Data de Publicação,Data de Celebração do Contrato,Prazo de Execução,Local de Execução,Fundamentação,Data de Fecho do Contrato,Preço Total Efetivo,Causas das Alterações ao Prazo,Causas das Alterações ao Preço,Estado,N.º registo do Acordo Quadro,Descrição do Acordo Quadro,Procedimento Centralizado
AD57-2016IMUNOGLOB CAVALO ANTI-TIMOC,Ajuste Direto Regime Geral,Aquisição de bens móveis,"33600000-6, Produtos farmacêuticos","Instituto Português de Oncologia de Lisboa Francisco Gentil, E. P. E. (506361616)","LABORATÓRIOS PFIZER, LDA (500162166)","27.000,00 €",11-10-2016,24-05-2016,365 dias,"Portugal, Lisboa, Lisboa","Artigo 20.º, n.º 1, alínea a) do Código dos Contratos Públicos",,,,,,Não aplicável.,Não aplicável.,FALSE
AD143-2015-PEDIDO DE AUTORIZAÇÃO PARA 2 ª RENOVAÇÃO DO AD61-2014-PARA 2016,Ajuste Direto Regime Geral,Aquisição de bens móveis,"33600000-6, Produtos farmacêuticos","Instituto Português de Oncologia de Lisboa Francisco Gentil, E. P. E. (506361616)","NOVO NORDISK, LDA (501485210)","9.457,04 €",11-10-2016,28-10-2015,365 dias,"Portugal, Lisboa, Lisboa","Artigo 20.º, n.º 1, alínea a) do Código dos Contratos Públicos",,,,,,Não aplicável.,Não aplicável.,FALSE
AD80-2015-PEDIDO DE AUTORIZAÇÃO PARA A 2 ª RENOVAÇÃO DO AD69-2014 PARA 2016,Ajuste Direto Regime Geral,Aquisição de bens móveis,"33600000-6, Produtos farmacêuticos","Instituto Português de Oncologia de Lisboa Francisco Gentil, E. P. E. (506361616)","CELGENE SOCIEDADE UNIPESSOAL, LDA (507791690)","1.137.599,19 €",11-10-2016,19-11-2015,365 dias,"Portugal, Lisboa, Lisboa","Artigo 24.º, n.º 1, alínea e) do Código dos Contratos Públicos",,,,,,Não aplicável.,Não aplicável.,FALSE
AD82-2015 PEDIDO DE AUTORIZAÇÃO PARA 2ª RENOVAÇÃO DO AD67-2014 PARA 2016,Ajuste Direto Regime Geral,Aquisição de bens móveis,"33600000-6, Produtos farmacêuticos","Instituto Português de Oncologia de Lisboa Francisco Gentil, E. P. E. (506361616)",CELGENE SOCIEDADE UNIPESSOAL LDA (507791690),"562.476,10 €",11-10-2016,07-01-2016,365 dias,"Portugal, Lisboa, Lisboa","Artigo 24.º, n.º 1, alínea e) do Código dos Contratos Públicos",,,,,,Não aplicável.,Não aplicável.,FALSE
AD84-2016RENOVAÇÃO DOS CONTRATOS AD66--2014PARA 2016,Ajuste Direto Regime Geral,Aquisição de bens móveis,"33600000-6, Produtos farmacêuticos","Instituto Português de Oncologia de Lisboa Francisco Gentil, E. P. E. (506361616)",CELGENE SOCIEDADE UNIPESSOAL LDA (507791690),"1.416.000,00 €",11-10-2016,15-01-2016,365 dias,"Portugal, Lisboa, Lisboa","Artigo 24.º, n.º 1, alínea e) do Código dos Contratos Públicos",,,,,,Não aplicável.,Não aplicável.,FALSE
AD143-2015 PEDIDO DE AUTORIZAÇÃO PARA 2ª RENOVAÇÃOAO AD61-2014 PARA 2016,Ajuste Direto Regime Geral,Aquisição de bens móveis,"33600000-6, Produtos farmacêuticos","Instituto Português de Oncologia de Lisboa Francisco Gentil, E. P. E. (506361616)","NOVO NORDISK, LDA (501485210)","9.487,04 €",11-10-2016,28-10-2015,365 dias,"Portugal, Lisboa, Lisboa","Artigo 24.º, n.º 1, alínea e) do Código dos Contratos Públicos",,,,,,Não aplicável.,Não aplicável.,FALSE
AD2375-2016REESTRUTURAÇÃO DE REDE WIRELESS AO IPO LISBOS F.F. EPE,Ajuste Direto Regime Geral,Aquisição de bens móveis,"30200000-1, Equipamento e material informático","Instituto Português de Oncologia de Lisboa Francisco Gentil, E. P. E. (506361616)","RAMPAGE-TECNOLOGIAS DE INFORMAÇÃO, SA (503481980)","74.897,71 €",10-10-2016,01-09-2016,30 dias,"Portugal, Lisboa, Lisboa","Artigo 20.º, n.º 1, alínea a) do Código dos Contratos Públicos",,,,,,Não aplicável.,Não aplicável.,FALSE
CP2143-2016 SOLUÇÃO BLADE SYSTEM PARA RESTRUTURAÇÃO DOS SERVIDORES DE VIRTUALIZAÇÃO,Concurso público,Aquisição de bens móveis,"30000000-9, Máquinas, equipamento e material de escritório e de informática, excepto mobiliário e pacotes de programas (software)","Instituto Português de Oncologia de Lisboa Francisco Gentil, E. P. E. (506361616)","INFORMATEM--INFORMÁTICA E MANUTENÇÃO, SA (503670693)","179.998,01 €",07-10-2016,29-08-2016,25 dias,"Portugal, Lisboa, Lisboa","Artigo 20.º, n.º 1, alínea b) do Código dos Contratos Públicos",,,,,,Não aplicável.,Não aplicável.,FALSE
AD376-2015-RENOVAÇÃO DO CONTRATO DO AD376-2014 PARA 2016,Ajuste Direto Regime Geral,Aquisição de bens móveis,"33600000-6, Produtos farmacêuticos","Instituto Português de Oncologia de Lisboa Francisco Gentil, E. P. E. (506361616)","ASTELLAS FARMA, LDA (502540249)","74.994,00 €",07-10-2016,11-01-2016,365 dias,"Portugal, Lisboa, Lisboa","Artigo 24.º, n.º 1, alínea e) do Código dos Contratos Públicos",,,,,,Não aplicável.,Não aplicável.,FALSE
AD418-15PEDIDO DE AUTORIZAÇÃO PARA A 2ª RENOVAÇÃO DO AD365-2014,Ajuste Direto Regime Geral,Aquisição de bens móveis,"33600000-6, Produtos farmacêuticos","Instituto Português de Oncologia de Lisboa Francisco Gentil, E. P. E. (506361616)",PHARMAKERN PRODUTOS FARMACEUTICOS (507002571),"33.050,40 €",07-10-2016,02-12-2015,365 dias,"Portugal, Lisboa, Lisboa","Artigo 20.º, n.º 1, alínea a) do Código dos Contratos Públicos",,,,,,Não aplicável.,Não aplicável.,FALSE
AD474-2015pedido de autorização para 2ª RENOVAÇÃO DP AD 59-2014-2016,Ajuste Direto Regime Geral,Aquisição de bens móveis,"33600000-6, Produtos farmacêuticos","Instituto Português de Oncologia de Lisboa Francisco Gentil, E. P. E. (506361616)","GILEAD SCIENCES, LDA (503604704)","30.214,80 €",07-10-2016,14-12-2015,365 dias,"Portugal, Lisboa, Lisboa","Artigo 20.º, n.º 1, alínea a) do Código dos Contratos Públicos",,,,,,Não aplicável.,Não aplicável.,FALSE
AD473-2015-PEDIDO DE  AUTORIZAÇÃO PARA 2 ª RENOVAÇÃO DO AD620-2014-2016,Ajuste Direto Regime Geral,Aquisição de bens móveis,"33600000-6, Produtos farmacêuticos","Instituto Português de Oncologia de Lisboa Francisco Gentil, E. P. E. (506361616)","BIOGEN IDEC PORTUGAL, LDA (506415740)","21.672,00 €",07-10-2016,02-12-2015,365 dias,"Portugal, Lisboa, Lisboa","Artigo 20.º, n.º 1, alínea a) do Código dos Contratos Públicos",,,,,,Não aplicável.,Não aplicável.,FALSE
AD592-15-PEDIDO DE AUTORIZAÇÃO PARA A 2 ª RENOVAÇÃO DO AD418-2014-2016,Ajuste Direto Regime Geral,Aquisição de bens móveis,"33600000-6, Produtos farmacêuticos","Instituto Português de Oncologia de Lisboa Francisco Gentil, E. P. E. (506361616)","LABORATÓRIOS FARMACEUTICOS  ROVI, S.A. (980166705)","44.800,00 €",07-10-2016,14-10-2015,365 dias,"Portugal, Lisboa, Lisboa","Artigo 20.º, n.º 1, alínea a) do Código dos Contratos Públicos",,,,,,Não aplicável.,Não aplicável.,FALSE
AD592-1015PEDIDO DE AUTORIZAÇÃO PARA RENOVAÇÃO DO AD 418-2014-2016,Ajuste Direto Regime Geral,Aquisição de bens móveis,"33600000-6, Produtos farmacêuticos","Instituto Português de Oncologia de Lisboa Francisco Gentil, E. P. E. (506361616)",BAYER PORTUGAL S.A. (500043256),"26.000,00 €",07-10-2016,14-10-2015,365 dias,"Portugal, Lisboa, Lisboa","Artigo 20.º, n.º 1, alínea a) do Código dos Contratos Públicos",,,,,,Não aplicável.,Não aplicável.,FALSE
AD601-2015PEDIDO DE AUTORIZAÇÃO PARA 2ª RENOVAÇÃO DO AD 46-2014-2016,Ajuste Direto Regime Geral,Aquisição de bens móveis,"33600000-6, Produtos farmacêuticos","Instituto Português de Oncologia de Lisboa Francisco Gentil, E. P. E. (506361616)",FRESENIUS KABI PHARMA (504293753),"33.686,00 €",07-10-2016,29-10-2015,365 dias,"Portugal, Lisboa, Lisboa","Artigo 20.º, n.º 1, alínea a) do Código dos Contratos Públicos",,,,,,Não aplicável.,Não aplicável.,FALSE
AD661-15-PEDIDO DE AUTORIZAÇÃO PARA 2ªRENOVAÇÃO DO AD62-2014-2016,Ajuste Direto Regime Geral,Aquisição de bens móveis,"33600000-6, Produtos farmacêuticos","Instituto Português de Oncologia de Lisboa Francisco Gentil, E. P. E. (506361616)",VYGON PORTUGAL LDA (503232785),"17.625,00 €",06-10-2016,14-12-2015,365 dias,"Portugal, Lisboa, Lisboa","Artigo 20.º, n.º 1, alínea a) do Código dos Contratos Públicos",,,,,,Não aplicável.,Não aplicável.,FALSE
AD661-15PEDIDO DE AUTORIZAÇÃO PARA 2ª RENOVAÇÃO  DO AD62-2014-2016,Ajuste Direto Regime Geral,Aquisição de bens móveis,"33600000-6, Produtos farmacêuticos","Instituto Português de Oncologia de Lisboa Francisco Gentil, E. P. E. (506361616)","LABORATÓRIOS MEDINFAR, SA (500384045)","1.312,50 €",06-10-2016,14-12-2015,365 dias,"Portugal, Lisboa, Lisboa","Artigo 20.º, n.º 1, alínea a) do Código dos Contratos Públicos",,,,,,Não aplicável.,Não aplicável.,FALSE
AD616-16PEDIDO DE AUTORIZAÇAÕ PARA 2ª RENOVAÇÃO DO AD62-2014-2016,Ajuste Direto Regime Geral,Aquisição de bens móveis,"33600000-6, Produtos farmacêuticos","Instituto Português de Oncologia de Lisboa Francisco Gentil, E. P. E. (506361616)","BAXTER MEDICO-FARMACEUTICA, LDA (503347345)","8.901,00 €",06-10-2016,14-12-2015,365 dias,"Portugal, Lisboa, Lisboa","Artigo 20.º, n.º 1, alínea a) do Código dos Contratos Públicos",,,,,,Não aplicável.,Não aplicável.,FALSE
AD661-2015-PEDIDO DE AUTORIZAÇÃO PARA 2ª RENOVAÇÃO DO  AD62-2014-2016,Ajuste Direto Regime Geral,Aquisição de bens móveis,"33600000-6, Produtos farmacêuticos","Instituto Português de Oncologia de Lisboa Francisco Gentil, E. P. E. (506361616)","LABESFAL-LAB.ESP. FARMACEUT.ALMIRO, SA (501169580)","8.957,92 €",06-10-2016,14-12-2015,365 dias,"Portugal, Lisboa, Lisboa","Artigo 20.º, n.º 1, alínea a) do Código dos Contratos Públicos",,,,,,Não aplicável.,Não aplicável.,FALSE
AD652-16-LIDOCAINA+MANITOL CIANOCOBALAMINA,Ajuste Direto Regime Geral,Aquisição de bens móveis,"33600000-6, Produtos farmacêuticos","Instituto Português de Oncologia de Lisboa Francisco Gentil, E. P. E. (506361616)","LABESFAL-LAB ESP.FARMACEUTICA ALMIRO, SA (501169580)","12.066,24 €",04-10-2016,06-01-2016,365 dias,"Portugal, Lisboa, Lisboa","Artigo 20.º, n.º 1, alínea a) do Código dos Contratos Públicos",,,,,,Não aplicável.,Não aplicável.,FALSE
AD2788-16SISTEMA MICROGOTA COM BURETA,Ajuste Direto Regime Geral,Aquisição de bens móveis,"33140000-3, Material médico de consumo","Instituto Português de Oncologia de Lisboa Francisco Gentil, E. P. E. (506361616)","B.BRAUN MEDICAL, LDA (501506543)","8.715,00 €",04-10-2016,22-09-2016,5 dias,"Portugal, Lisboa, Lisboa","Artigo 20.º, n.º 1, alínea a) do Código dos Contratos Públicos",,,,,,Não aplicável.,Não aplicável.,FALSE
AD2791-16-MASCARAS DE IMOBILIZAÇÃO,Ajuste Direto Regime Geral,Aquisição de bens móveis,"33140000-3, Material médico de consumo","Instituto Português de Oncologia de Lisboa Francisco Gentil, E. P. E. (506361616)",Ibervoxel-Equipamentos  médicos e de Laboratório unipessoal lda (506716899),"13.405,00 €",04-10-2016,22-09-2016,5 dias,"Portugal, Lisboa, Lisboa","Artigo 20.º, n.º 1, alínea a) do Código dos Contratos Públicos",,,,,,Não aplicável.,Não aplicável.,FALSE
AD1496-16-AQUISIÇÃO DE CLIPS PARA ENDOSCOPIA,Ajuste Direto Regime Geral,Aquisição de bens móveis,"33140000-3, Material médico de consumo","Instituto Português de Oncologia de Lisboa Francisco Gentil, E. P. E. (506361616)","Boston- Scientific Portugal-Dispositivos Médicos, lda  (504988964)","50.400,00 €",04-10-2016,08-09-2016,15040000 dias,"Portugal, Lisboa, Lisboa","Artigo 20.º, n.º 1, alínea a) do Código dos Contratos Públicos",,,,,,Não aplicável.,Não aplicável.,FALSE
AQUISIÇÃO DE AGULHAS PROGUIDE,Ajuste Direto Regime Geral,Aquisição de bens móveis,"33141320-9, Agulhas para fins médicos","Instituto Português de Oncologia de Lisboa Francisco Gentil, E. P. E. (506361616)",ELEKTA MEDICAL (A81886731),"16.500,00 €",04-10-2016,14-09-2016,5 dias,"Portugal, Lisboa, Lisboa","Artigo 20.º, n.º 1, alínea a) do Código dos Contratos Públicos",,,,,,Não aplicável.,Não aplicável.,FALSE
AD2551-16 PRESTAÇÃO DE SERVIÇOS F.. DE REAGENTES PARA ANÁLISES NO LAB. VIROLOGIA,Ajuste Direto Regime Geral,Aquisição de bens móveis<br/>Aquisição de serviços,"33696500-0, Reagentes de laboratório","Instituto Português de Oncologia de Lisboa Francisco Gentil, E. P. E. (506361616)","DIASORIN IBERIA, SA -SUCURSAL EM PORTUGAL (980379563)","14.130,00 €",04-10-2016,07-09-2016,3 dias,"Portugal, Lisboa, Lisboa","Artigo 26.º, n.º 1, alínea a) do Código dos Contratos Públicos",,,,,,Não aplicável.,Não aplicável.,FALSE
AD2875-16 REAGENTES,Ajuste Direto Regime Geral,Aquisição de bens móveis,"33696500-0, Reagentes de laboratório","Instituto Português de Oncologia de Lisboa Francisco Gentil, E. P. E. (506361616)","WERFEN PORTUGAL, LDA (501086110)","9.926,00 €",03-10-2016,29-09-2016,3 dias,"Portugal, Lisboa, Lisboa","Artigo 24.º, n.º 1, alínea e) do Código dos Contratos Públicos",,,,,,Não aplicável.,Não aplicável.,FALSE
AD2770-16 BRENTUXIMAB VEDOTIN 50 MG INJ,Ajuste Direto Regime Geral,Aquisição de bens móveis,"33600000-6, Produtos farmacêuticos","Instituto Português de Oncologia de Lisboa Francisco Gentil, E. P. E. (506361616)",IDIS LIMITED (504030298787),"66.780,00 €",03-10-2016,28-09-2016,5 dias,"Portugal, Lisboa, Lisboa","Artigo 24.º, n.º 1, alínea e) do Código dos Contratos Públicos",,,,,,Não aplicável.,Não aplicável.,FALSE
