freguesia,acronym,validVotesPercentage,votes,dicofre
"União das freguesias de Trofa, Segadães e Lamas do Vouga",PPD/PSD.CDS-PP,35.1,450,010126
"União das freguesias de Trofa, Segadães e Lamas do Vouga",PS,33.46,429,010126
"União das freguesias de Trofa, Segadães e Lamas do Vouga",MPT,9.91,127,010126
"União das freguesias de Trofa, Segadães e Lamas do Vouga",PCP-PEV,9.75,125,010126
"União das freguesias de Trofa, Segadães e Lamas do Vouga",B.E.,3.98,51,010126
"União das freguesias de Trofa, Segadães e Lamas do Vouga",L,1.79,23,010126
"União das freguesias de Trofa, Segadães e Lamas do Vouga",PCTP/MRPP,1.64,21,010126
"União das freguesias de Trofa, Segadães e Lamas do Vouga",PAN,1.09,14,010126
"União das freguesias de Trofa, Segadães e Lamas do Vouga",PPM,0.86,11,010126
"União das freguesias de Trofa, Segadães e Lamas do Vouga",MAS,0.55,7,010126
"União das freguesias de Trofa, Segadães e Lamas do Vouga",PND,0.55,7,010126
"União das freguesias de Trofa, Segadães e Lamas do Vouga",PNR,0.55,7,010126
"União das freguesias de Trofa, Segadães e Lamas do Vouga",PPV,0.23,3,010126
"União das freguesias de Trofa, Segadães e Lamas do Vouga",PTP,0.23,3,010126
"União das freguesias de Trofa, Segadães e Lamas do Vouga",PDA,0.16,2,010126
"União das freguesias de Trofa, Segadães e Lamas do Vouga",POUS,0.16,2,010126
