Objeto do Contrato,Tipo de Procedimento,Tipo(s) de Contrato,CPVs,Entidade(s) Adjudicante(s),Entidade(s) Adjudicatária(s),Preço Contratual,Data de Publicação,Data de Celebração do Contrato,Prazo de Execução,Local de Execução,Fundamentação,Data de Fecho do Contrato,Preço Total Efetivo,Causas das Alterações ao Prazo,Causas das Alterações ao Preço,Estado,N.º registo do Acordo Quadro,Descrição do Acordo Quadro,Procedimento Centralizado
"Prestação de Serviços de comunicações de serviços móveis para a ULSCB, EPE",Ajuste Direto Regime Geral,Aquisição de serviços,"64210000-1, Serviços telefónicos e de transmissão de dados","Unidade Local de Saúde de Castelo Branco, E. P. E. (509309844)","NOS - COMUNICACOES, SA (502604751)","8.687,52 €",21-12-2015,12-11-2015,365 dias,"Portugal, Castelo Branco, Castelo Branco","Artigo 20.º, n.º 1, alínea a) do Código dos Contratos Públicos",31-12-2016,"7.755,12 €",,Comunicações em menor quantidade do que a prevista inicialmente,,Não aplicável.,Não aplicável.,FALSE
Fornecimento e Montagem de Sinalética para as Instalações do Hospital Amato Lusitano,Ajuste Direto Regime Geral,Aquisição de bens móveis,"44423450-0, Placas sinaléticas","Unidade Local de Saúde de Castelo Branco, E. P. E. (509309844)","AMBIENTI D'INTERNI, UNIPESSOAL LDA (508369444)","17.000,00 €",21-12-2015,09-11-2015,21 dias,"Portugal, Castelo Branco, Castelo Branco","Artigo 20.º, n.º 1, alínea a) do Código dos Contratos Públicos",20-10-2016,"17.000,00 €",,"",,Não aplicável.,Não aplicável.,FALSE
