Objeto do Contrato,Tipo de Procedimento,Tipo(s) de Contrato,CPVs,Entidade(s) Adjudicante(s),Entidade(s) Adjudicatária(s),Preço Contratual,Data de Publicação,Data de Celebração do Contrato,Prazo de Execução,Local de Execução,Fundamentação,Data de Fecho do Contrato,Preço Total Efetivo,Causas das Alterações ao Prazo,Causas das Alterações ao Preço,Estado,N.º registo do Acordo Quadro,Descrição do Acordo Quadro,Procedimento Centralizado
"AQUISIÇÃO DE SERVIÇOS DE DESNVOLVIMENTO DA SOLUÇÃO RESPEITANTE AO SISTEMA DE PRODUÇÃO DE ÁGUA QUENTE E ÁGUA GELADA DO IPOLFG, EPE.",Ajuste Direto Regime Geral,Aquisição de serviços,"71314000-2, Serviços relacionados com a energia e afins","Instituto Português de Oncologia de Lisboa FG, E.P.E. (506361616)",ACET (503157694),"38.000,00 €",10-11-2017,06-11-2017,120 dias,"Portugal, Lisboa, Lisboa","Artigo 20.º, n.º 1, alínea a) do Código dos Contratos Públicos",,,,,,Não aplicável.,Não aplicável.,FALSE
EQUIPAMENTO DE ENDOSCOPIA,Concurso público,Aquisição de bens móveis,"33100000-1, Equipamento médico","Instituto Português de Oncologia de Lisboa Francisco Gentil, E. P. E. (506361616)","OLYMPUS IBERIA,S.A.U. (980474710)","69.212,48 €",10-11-2017,27-10-2017,30 dias,"Portugal, Lisboa, Lisboa","Artigo 20.º, n.º 1, alínea b) do Código dos Contratos Públicos",,,,,,Não aplicável.,Não aplicável.,FALSE
AQUISIÇÃO E INSTALAÇÃO DE EQUIPAMENTO DE DIGITALIZAÇÃO  DO CIRCUITO DAS IMAGENS NÃO DICOM  AQUISIÇÃO E INSTALAÇÃO DE EQUIPAMENTO DE DIGITALIZAÇÃO DO CIRCUITO DAS IMAGENS NÃO DICOM,Concurso público,Aquisição de bens móveis,"30000000-9, Máquinas, equipamento e material de escritório e de informática, excepto mobiliário e pacotes de programas (software)","Instituto Português de Oncologia de Lisboa FG, E.P.E. (506361616)","Ozona Consulting, S.L., Sucursal em Portugal (980315921)","148.995,74 €",09-11-2017,02-11-2017,30 dias,"Portugal, Lisboa, Lisboa","Artigo 20.º, n.º 1, alínea b) do Código dos Contratos Públicos",,,,,,Não aplicável.,Não aplicável.,FALSE
AD2873-2017BRENTUXIMAB,Ajuste Direto Regime Geral,Aquisição de bens móveis,"33600000-6, Produtos farmacêuticos","Instituto Português de Oncologia de Lisboa Francisco Gentil, E. P. E. (506361616)","TAKEDA-FARMACEUTICOS PORTUGAL, LDA (502801204)","189.756,00 €",09-11-2017,30-10-2017,61 dias,"Portugal, Lisboa, Lisboa","Artigo 24.º, n.º 1, alínea e) do Código dos Contratos Públicos",,,,,,Não aplicável.,Não aplicável.,FALSE
AD2938-2017 MEDICAMENTOS EXCLUSIVOS,Ajuste Direto Regime Geral,Aquisição de bens móveis,"33600000-6, Produtos farmacêuticos","Instituto Português de Oncologia de Lisboa FG, E.P.E. (506361616)",JANSSEN-CILAG FARMACEUTICA LDA. (500189412),"22.290,40 €",08-11-2017,25-10-2017,66 dias,"Portugal, Lisboa, Lisboa","Artigo 24.º, n.º 1, alínea e) do Código dos Contratos Públicos",,,,,,Não aplicável.,Não aplicável.,FALSE
CP1224-2017FORNECIMENTO DE SISTEMA DE VIDEOLAPAROSCOPIA,Concurso público,Aquisição de bens móveis,"33162100-4, Aparelhos para blocos operatórios","Instituto Português de Oncologia de Lisboa Francisco Gentil, E. P. E. (506361616)","B. Braun Medical, Lda. (501506543)","90.397,00 €",07-11-2017,25-10-2017,30 dias,"Portugal, Lisboa, Lisboa","Artigo 20.º, n.º 1, alínea b) do Código dos Contratos Públicos",,,,,,Não aplicável.,Não aplicável.,FALSE
CP2784-2017 FORNECIMENTO DE LASER DE CO2,Concurso público,Aquisição de bens móveis,"33100000-1, Equipamento médico","Instituto Português de Oncologia de Lisboa Francisco Gentil, E. P. E. (506361616)","MEDICINÁLIA CORMÉDICA-COMERCIALIZAÇÃO DE PRODUTOS MÉDICOS HOSPITALARES,LDA (500684324)","84.500,00 €",07-11-2017,31-10-2017,30 dias,"Portugal, Lisboa, Lisboa","Artigo 20.º, n.º 1, alínea b) do Código dos Contratos Públicos",,,,,,Não aplicável.,Não aplicável.,FALSE
AD2586-2017 CRIZOTINIB 200 MG CP,Ajuste Direto Regime Geral,Aquisição de bens móveis,"33600000-6, Produtos farmacêuticos","Instituto Português de Oncologia de Lisboa Francisco Gentil, E. P. E. (506361616)","PFIZER BIOFARMACEUTICA, SOCIEDADE UNIPESSOAL LDA (513300376)","21.004,49 €",03-11-2017,24-10-2017,66 dias,"Portugal, Lisboa, Lisboa","Artigo 24.º, n.º 1, alínea e) do Código dos Contratos Públicos",,,,,,Não aplicável.,Não aplicável.,FALSE
AD2370-2017MEDICAMENTOS EXCLUSIVOS,Ajuste Direto Regime Geral,Aquisição de bens móveis,"33600000-6, Produtos farmacêuticos","Instituto Português de Oncologia de Lisboa Francisco Gentil, E. P. E. (506361616)","PFIZER BIOFARMACEUTICA, SOCIEDADE UNIPESSOAL LDA (513300376)","17.500,00 €",03-11-2017,24-10-2017,67 dias,"Portugal, Lisboa, Lisboa","Artigo 24.º, n.º 1, alínea e) do Código dos Contratos Públicos",,,,,,Não aplicável.,Não aplicável.,FALSE
AD2125-2017 FORNECIMENTO DE TELESCOPIOS RIGIDOS DE ENDOSCOPIA,Ajuste Direto Regime Geral,Aquisição de bens móveis,"33100000-1, Equipamento médico","Instituto Português de Oncologia de Lisboa Francisco Gentil, E. P. E. (506361616)","FILSAT-EQUIPAMENTOS MEDICO-CIENTIFICOS, LDA (506708616)","10.110,00 €",03-11-2017,27-10-2017,30 dias,"Portugal, Lisboa, Lisboa","Artigo 20.º, n.º 1, alínea a) do Código dos Contratos Públicos",,,,,,Não aplicável.,Não aplicável.,FALSE
AD2507-2017MEDICAMENTOS EXCLUSIVOS,Ajuste Direto Regime Geral,Aquisição de bens móveis,"33600000-6, Produtos farmacêuticos","Instituto Português de Oncologia de Lisboa Francisco Gentil, E. P. E. (506361616)","ROCHE FARMACEUTICA QUIMICA, LDA (500233810)","31.438,26 €",03-11-2017,26-09-2017,96 dias,"Portugal, Lisboa, Lisboa","Artigo 24.º, n.º 1, alínea e) do Código dos Contratos Públicos",,,,,,Não aplicável.,Não aplicável.,FALSE
AD2479-2017-PEMBROLIZUMAB 100 MG INJ,Ajuste Direto Regime Geral,Aquisição de bens móveis,"33600000-6, Produtos farmacêuticos","Instituto Português de Oncologia de Lisboa Francisco Gentil, E. P. E. (506361616)",MERCK SHARP & DOHME LDA (500191360),"8.400,00 €",03-11-2017,04-10-2017,30 dias,"Portugal, Lisboa, Lisboa","Artigo 24.º, n.º 1, alínea e) do Código dos Contratos Públicos",,,,,,Não aplicável.,Não aplicável.,FALSE
AQUISIÇÃO DE DOIS ECÓGRAFOS COM SONDAS,Ajuste Direto Regime Geral,Aquisição de bens móveis,"33100000-1, Equipamento médico","Instituto Português de Oncologia de Lisboa FG, E.P.E. (506361616)","Siemens Healthcare, Lda (507925173)","35.360,00 €",03-11-2017,23-10-2017,30 dias,"Portugal, Lisboa, Lisboa","Artigo 20.º, n.º 1, alínea a) do Código dos Contratos Públicos",,,,,,Não aplicável.,Não aplicável.,FALSE
AD1223-2017 FORNECIMENTO DE 4 FIBROBRONCOSCÓPIOS,Ajuste Direto Regime Geral,Aquisição de bens móveis,"33100000-1, Equipamento médico","Instituto Português de Oncologia de Lisboa Francisco Gentil, E. P. E. (506361616)","OLYMPUS IBÉRICA, SAU- SUCURSAL EM PORTUGAL (980474710)","50.400,00 €",02-11-2017,28-09-2017,30 dias,"Portugal, Lisboa, Lisboa","Artigo 20.º, n.º 1, alínea a) do Código dos Contratos Públicos",,,,,,Não aplicável.,Não aplicável.,FALSE
