freguesia,acronym,validVotesPercentage,votes,dicofre
"União das freguesias de Coruche, Fajarda e Erra",PS,39.9,1226,140909
"União das freguesias de Coruche, Fajarda e Erra",PCP-PEV,23.1,710,140909
"União das freguesias de Coruche, Fajarda e Erra",PPD/PSD.CDS-PP,18.68,574,140909
"União das freguesias de Coruche, Fajarda e Erra",MPT,6.51,200,140909
"União das freguesias de Coruche, Fajarda e Erra",B.E.,4.36,134,140909
"União das freguesias de Coruche, Fajarda e Erra",PCTP/MRPP,2.08,64,140909
"União das freguesias de Coruche, Fajarda e Erra",L,1.72,53,140909
"União das freguesias de Coruche, Fajarda e Erra",PAN,0.98,30,140909
"União das freguesias de Coruche, Fajarda e Erra",PPM,0.52,16,140909
"União das freguesias de Coruche, Fajarda e Erra",PTP,0.46,14,140909
"União das freguesias de Coruche, Fajarda e Erra",MAS,0.42,13,140909
"União das freguesias de Coruche, Fajarda e Erra",PND,0.39,12,140909
"União das freguesias de Coruche, Fajarda e Erra",PNR,0.39,12,140909
"União das freguesias de Coruche, Fajarda e Erra",PPV,0.2,6,140909
"União das freguesias de Coruche, Fajarda e Erra",PDA,0.16,5,140909
"União das freguesias de Coruche, Fajarda e Erra",POUS,0.13,4,140909
