freguesia,acronym,validVotesPercentage,votes,dicofre
Santo António,PPD/PSD.CDS-PP,34.75,1651,110666
Santo António,PS,26.48,1258,110666
Santo António,PCP-PEV,12.21,580,110666
Santo António,L,8.48,403,110666
Santo António,B.E.,5.62,267,110666
Santo António,MPT,5.56,264,110666
Santo António,PAN,2.93,139,110666
Santo António,PCTP/MRPP,1.03,49,110666
Santo António,PPV,0.8,38,110666
Santo António,PNR,0.57,27,110666
Santo António,PPM,0.44,21,110666
Santo António,PND,0.4,19,110666
Santo António,MAS,0.29,14,110666
Santo António,PTP,0.19,9,110666
Santo António,POUS,0.17,8,110666
Santo António,PDA,0.08,4,110666
