freguesia,acronym,validVotesPercentage,votes,dicofre
União das freguesias de Destriz e Reigoso,PPD/PSD.CDS-PP,45.26,86,181014
União das freguesias de Destriz e Reigoso,PS,31.58,60,181014
União das freguesias de Destriz e Reigoso,MPT,6.84,13,181014
União das freguesias de Destriz e Reigoso,PCP-PEV,6.32,12,181014
União das freguesias de Destriz e Reigoso,B.E.,2.11,4,181014
União das freguesias de Destriz e Reigoso,PND,2.11,4,181014
União das freguesias de Destriz e Reigoso,L,1.58,3,181014
União das freguesias de Destriz e Reigoso,PCTP/MRPP,1.05,2,181014
União das freguesias de Destriz e Reigoso,PPM,1.05,2,181014
União das freguesias de Destriz e Reigoso,PPV,1.05,2,181014
União das freguesias de Destriz e Reigoso,MAS,0.53,1,181014
União das freguesias de Destriz e Reigoso,PNR,0.53,1,181014
União das freguesias de Destriz e Reigoso,PAN,0,0,181014
União das freguesias de Destriz e Reigoso,PDA,0,0,181014
União das freguesias de Destriz e Reigoso,POUS,0,0,181014
União das freguesias de Destriz e Reigoso,PTP,0,0,181014
