freguesia,acronym,validVotesPercentage,votes,dicofre
Tentúgal,PS,44.8,194,061011
Tentúgal,PPD/PSD.CDS-PP,27.02,117,061011
Tentúgal,PCP-PEV,8.55,37,061011
Tentúgal,MPT,6.7,29,061011
Tentúgal,B.E.,5.31,23,061011
Tentúgal,PND,1.85,8,061011
Tentúgal,PCTP/MRPP,1.62,7,061011
Tentúgal,PAN,1.15,5,061011
Tentúgal,PPM,0.92,4,061011
Tentúgal,L,0.69,3,061011
Tentúgal,MAS,0.69,3,061011
Tentúgal,PPV,0.46,2,061011
Tentúgal,PNR,0.23,1,061011
Tentúgal,PDA,0,0,061011
Tentúgal,POUS,0,0,061011
Tentúgal,PTP,0,0,061011
