freguesia,acronym,validVotesPercentage,votes,dicofre
"União das Freguesias de Avidagos, Navalho e Pereira",PPD/PSD.CDS-PP,50.79,97,040739
"União das Freguesias de Avidagos, Navalho e Pereira",PS,28.27,54,040739
"União das Freguesias de Avidagos, Navalho e Pereira",B.E.,6.28,12,040739
"União das Freguesias de Avidagos, Navalho e Pereira",MPT,4.19,8,040739
"União das Freguesias de Avidagos, Navalho e Pereira",PCP-PEV,3.66,7,040739
"União das Freguesias de Avidagos, Navalho e Pereira",PAN,2.09,4,040739
"União das Freguesias de Avidagos, Navalho e Pereira",PCTP/MRPP,1.57,3,040739
"União das Freguesias de Avidagos, Navalho e Pereira",PND,1.05,2,040739
"União das Freguesias de Avidagos, Navalho e Pereira",PNR,1.05,2,040739
"União das Freguesias de Avidagos, Navalho e Pereira",L,0.52,1,040739
"União das Freguesias de Avidagos, Navalho e Pereira",PDA,0.52,1,040739
"União das Freguesias de Avidagos, Navalho e Pereira",MAS,0,0,040739
"União das Freguesias de Avidagos, Navalho e Pereira",POUS,0,0,040739
"União das Freguesias de Avidagos, Navalho e Pereira",PPM,0,0,040739
"União das Freguesias de Avidagos, Navalho e Pereira",PPV,0,0,040739
"União das Freguesias de Avidagos, Navalho e Pereira",PTP,0,0,040739
