freguesia,acronym,validVotesPercentage,votes,dicofre
Monsaraz,PS,62.28,142,071103
Monsaraz,PCP-PEV,12.72,29,071103
Monsaraz,PPD/PSD,7.89,18,071103
Monsaraz,B.E.,4.39,10,071103
Monsaraz,PPM.PPV/CDC,4.39,10,071103
Monsaraz,CDS-PP,3.51,8,071103
Monsaraz,PCTP/MRPP,1.75,4,071103
Monsaraz,PAN,1.32,3,071103
Monsaraz,A,0.88,2,071103
Monsaraz,L,0.44,1,071103
Monsaraz,PNR,0.44,1,071103
Monsaraz,IL,0,0,071103
Monsaraz,MAS,0,0,071103
Monsaraz,NC,0,0,071103
Monsaraz,PDR,0,0,071103
Monsaraz,PTP,0,0,071103
Monsaraz,PURP,0,0,071103
