freguesia,acronym,validVotesPercentage,votes,dicofre
Souto,PPD/PSD,61.47,67,181209
Souto,PS,16.51,18,181209
Souto,CDS-PP,8.26,9,181209
Souto,B.E.,4.59,5,181209
Souto,PCP-PEV,2.75,3,181209
Souto,PAN,1.83,2,181209
Souto,PCTP/MRPP,1.83,2,181209
Souto,PPM.PPV/CDC,1.83,2,181209
Souto,PTP,0.92,1,181209
Souto,A,0,0,181209
Souto,IL,0,0,181209
Souto,L,0,0,181209
Souto,MAS,0,0,181209
Souto,NC,0,0,181209
Souto,PDR,0,0,181209
Souto,PNR,0,0,181209
Souto,PURP,0,0,181209
