Objeto do Contrato,Tipo de Procedimento,Tipo(s) de Contrato,CPVs,Entidade(s) Adjudicante(s),Entidade(s) Adjudicatária(s),Preço Contratual,Data de Publicação,Data de Celebração do Contrato,Prazo de Execução,Local de Execução,Fundamentação,Data de Fecho do Contrato,Preço Total Efetivo,Causas das Alterações ao Prazo,Causas das Alterações ao Preço,Estado,N.º registo do Acordo Quadro,Descrição do Acordo Quadro,Procedimento Centralizado
31/3832/2016 - Medicamento Tizanidina 6mg,Ao abrigo de acordo-quadro (art.º 258.º),Aquisição de bens móveis,"33690000-3, Medicamentos vários","Centro Hospitalar do Algarve, E. P. E. (510745997)","Sandoz Farmacêutica, Lda (506985261)","80,98 €",19-12-2016,14-11-2016,47 dias,"Portugal, Faro, Faro","Artigo 26.º, n.º 1, alínea e) do Código dos Contratos Públicos","","",,"",,611371,"CONCURSO PÚBLICO PARA A CELEBRAÇÃO DE CONTRATOS PÚBLICOS DE APROVISIONAMENTO PARA A ÁREA DA SAÚDE, COM VISTA AO FORNECIMENTO DE MEDICAMENTOS ANESTÉSICOS E RELAXANTES MUSCULARES, ÀS INSTITUIÇÕES E SERVIÇOS DO SERVIÇO NACIONAL DE SAÚDE    ",FALSE
31/3839/2016 - Multivitaminas Lipossolúveis adulto emul inj Fr 10ml IV,Ao abrigo de acordo-quadro (art.º 258.º),Aquisição de bens móveis,"33690000-3, Medicamentos vários","Centro Hospitalar do Algarve, E. P. E. (510745997)","Fresenius Kabi Pharma Portugal, Lda. (504293753)","1.094,00 €",19-12-2016,14-11-2016,47 dias,"Portugal, Faro, Faro","Artigo 26.º, n.º 1, alínea e) do Código dos Contratos Públicos","","",,"",,1377429,Acordo Quadro para fornecimento de medicamentos para Nutrição Parentérica às Instituições e Serviços do Serviço Nacional de Saúde,FALSE
31/3841/2016 - Medicamento Bromelaina 40 mg,Ao abrigo de acordo-quadro (art.º 258.º),Aquisição de bens móveis,"33690000-3, Medicamentos vários","Centro Hospitalar do Algarve, E. P. E. (510745997)","OVERPHARMA,LDA. (505792362)","1.200,00 €",19-12-2016,09-11-2016,52 dias,"Portugal, Faro, Faro","Artigo 26.º, n.º 1, alínea e) do Código dos Contratos Públicos","","",,"",,1410779,CP 2015/47 - Acordo quadro para fornecimento de medicamentos do aparelho locomotor às instituições e serviços do serviço nacional de saúde,FALSE
31/3843/2016 - Medicamento Gelatina + Glicerol,Ao abrigo de acordo-quadro (art.º 258.º),Aquisição de bens móveis,"33690000-3, Medicamentos vários","Centro Hospitalar do Algarve, E. P. E. (510745997)",MEDA PHARMA - PROD.FARMAC. SA (500082090),"3.420,00 €",19-12-2016,09-11-2016,52 dias,"Portugal, Faro, Faro","Artigo 26.º, n.º 1, alínea e) do Código dos Contratos Públicos","","",,"",,1194708,"CONCURSO PÚBLICO PARA A CELEBRAÇÃO DE CONTRATOS PÚBLICOS DE APROVISIONAMENTO PARA A ÁREA DA SAÚDE, MEDICAMENTOS DO APARELHO DIGESTIVO, ÀS INSTITUIÇÕES E SERVIÇOS DO SERVIÇO NACIONAL DE SAÚDE",FALSE
31/3844/2016 - Medicamento Gabapentina 100mg,Ao abrigo de acordo-quadro (art.º 258.º),Aquisição de bens móveis,"33690000-3, Medicamentos vários","Centro Hospitalar do Algarve, E. P. E. (510745997)","Generis Farmacêutica, S.A. (508107997)","53,04 €",19-12-2016,09-11-2016,52 dias,"Portugal, Faro, Faro","Artigo 26.º, n.º 1, alínea e) do Código dos Contratos Públicos","","",,"",,1179911,"CONCURSO PÚBLICO PARA A CELEBRAÇÃO DE CONTRATOS PÚBLICOS DE APROVISIONAMENTO PARA A ÁREA DA SAÚDE, MEDICAMENTOS DO SISTEMA NERVOSO CEREBROSPINAL, EXCETO: ANESTÉSICOS, RELAXANTES MUSCULARES, ANALGÉSICOS, ANTIPIRÉTICOS, ANTIDEPRESSORES E ANTIPSICÓTICOS, ÀS INSTITUIÇÕES E SERVIÇOS DO SERVIÇO NACIONAL DE SAÚDE",FALSE
31/3846/2016 - Medicamento Fosaprepitant 150 mg,Ao abrigo de acordo-quadro (art.º 258.º),Aquisição de bens móveis,"33690000-3, Medicamentos vários","Centro Hospitalar do Algarve, E. P. E. (510745997)","Merck Sharp & Dohme, Lda. (500191360)","4.092,20 €",19-12-2016,14-11-2016,47 dias,"Portugal, Faro, Faro","Artigo 26.º, n.º 1, alínea e) do Código dos Contratos Públicos","","",,"",,1179911,"CONCURSO PÚBLICO PARA A CELEBRAÇÃO DE CONTRATOS PÚBLICOS DE APROVISIONAMENTO PARA A ÁREA DA SAÚDE, MEDICAMENTOS DO SISTEMA NERVOSO CEREBROSPINAL, EXCETO: ANESTÉSICOS, RELAXANTES MUSCULARES, ANALGÉSICOS, ANTIPIRÉTICOS, ANTIDEPRESSORES E ANTIPSICÓTICOS, ÀS INSTITUIÇÕES E SERVIÇOS DO SERVIÇO NACIONAL DE SAÚDE",FALSE
31/3847/2016 - Medicamento Dalteparina sódica 2500 U.I./.02ml,Ao abrigo de acordo-quadro (art.º 258.º),Aquisição de bens móveis,"33690000-3, Medicamentos vários","Centro Hospitalar do Algarve, E. P. E. (510745997)","LABORATÓRIOS PFIZER, LDA. (500162166)","1.120,00 €",19-12-2016,14-11-2016,47 dias,"Portugal, Faro, Faro","Artigo 26.º, n.º 1, alínea e) do Código dos Contratos Públicos","","",,"",,1210107,"CONCURSO PÚBLICO PARA A CELEBRAÇÃO DE CONTRATOS PÚBLICOS DE APROVISIONAMENTO PARA A ÁREA DA SAÚDE, COM VISTA AO FORNECIMENTO DE MEDICAMENTOS DO GRUPO 4: SANGUE, ÀS INSTITUIÇÕES E SERVIÇOS DO SERVIÇO NACIONAL DE SAÚDE",FALSE
31/3849/2016 - Medicamento Cefotaxima 1000 mg,Ao abrigo de acordo-quadro (art.º 258.º),Aquisição de bens móveis,"33690000-3, Medicamentos vários","Centro Hospitalar do Algarve, E. P. E. (510745997)","LABESFAL, Laboratório Almiro S.A. (501169580)","2.300,00 €",19-12-2016,08-11-2016,53 dias,"Portugal, Faro, Faro","Artigo 26.º, n.º 1, alínea e) do Código dos Contratos Públicos","","",,"",,1326195,ACORDO QUADRO PARA FORNECIMENTO DE MEDICAMENTOS ANTI-INFECIOSOS: EXCETO ANTIVÍRICOS E ANTIFÚNGICOS ÀS INSTITUIÇÕES E SERVIÇOS DO SERVIÇO NACIONAL DE SAÚDE,FALSE
31/3853/2016 - Medicamento Levosopa 250mg + Carbidopa 25mg,Ao abrigo de acordo-quadro (art.º 258.º),Aquisição de bens móveis,"33690000-3, Medicamentos vários","Centro Hospitalar do Algarve, E. P. E. (510745997)","Merck Sharp & Dohme, Lda. (500191360)","105,79 €",19-12-2016,14-11-2016,47 dias,"Portugal, Faro, Faro","Artigo 26.º, n.º 1, alínea e) do Código dos Contratos Públicos","","",,"",,1179911,"CONCURSO PÚBLICO PARA A CELEBRAÇÃO DE CONTRATOS PÚBLICOS DE APROVISIONAMENTO PARA A ÁREA DA SAÚDE, MEDICAMENTOS DO SISTEMA NERVOSO CEREBROSPINAL, EXCETO: ANESTÉSICOS, RELAXANTES MUSCULARES, ANALGÉSICOS, ANTIPIRÉTICOS, ANTIDEPRESSORES E ANTIPSICÓTICOS, ÀS INSTITUIÇÕES E SERVIÇOS DO SERVIÇO NACIONAL DE SAÚDE",FALSE
31/3855/2016 - Medicamentos Degarrelix 80 mg,Ao abrigo de acordo-quadro (art.º 258.º),Aquisição de bens móveis,"33690000-3, Medicamentos vários","Centro Hospitalar do Algarve, E. P. E. (510745997)",FERRING PORTUG.-PROD.FARMAC. (502034831),"486,96 €",19-12-2016,09-11-2016,52 dias,"Portugal, Faro, Faro","Artigo 26.º, n.º 1, alínea e) do Código dos Contratos Públicos","","",,"",,1771819,CP 2015/6 - Acordo quadro para o fornecimento de Medicamentos do Foro Oncológico,FALSE
31/3892/2016 -vacina contrat hepatite B 20pg/1ml,Ao abrigo de acordo-quadro (art.º 258.º),Aquisição de bens móveis,"33690000-3, Medicamentos vários","Centro Hospitalar do Algarve, E. P. E. (510745997)","Glaxo SmithKline - Produtos Farmacêutico, Lda.  (500139962)","642,00 €",19-12-2016,08-11-2016,53 dias,"Portugal, Faro, Faro","Artigo 26.º, n.º 1, alínea e) do Código dos Contratos Públicos","","",,"",,1923518,CP 2016/13 - Acordo Quadro para fornecimento de Vacinas e Tuberculinas   às Instituições e Serviços do Serviço Nacional de Saúde,FALSE
Proc. 68/4358/2016- Substituição de Baterias em UPS-Bloco Operatório,Ajuste Direto Regime Geral,Aquisição de bens móveis,"31440000-2, Baterias","Centro Hospitalar do Algarve, E. P. E. (510745997)","Emerson Network Power,Lda (503322520)","619,46 €",19-12-2016,09-12-2016,30 dias,"Portugal, Faro, Faro","Artigo 24.º, n.º 1, alínea e) do Código dos Contratos Públicos",30-12-2016,"619,46 €",,"",,Não aplicável.,Não aplicável.,FALSE
Serviços Médicos Urgência Geral e Básica,Ajuste Direto Regime Geral,Aquisição de serviços,"85121100-4, Serviços de médicos de clínica geral","Centro Hospitalar do Algarve, E. P. E. (510745997)","Clínica do Rei, Lda (505354934)","13.500,00 €",16-12-2016,17-11-2016,61 dias,"Portugal, Faro, Lagos<BR/>Portugal, Faro, Portimão","Artigo 24.º, n.º 1, alínea c) do Código dos Contratos Públicos",31-12-2016,"5.450,00 €",,"O valor inicial do Contrato teve por base as necessidades estimadas para o período de 1 Novembro de 2016 a 31 Dezembro de 2016, o valor final reflecte as necessidades efectivas.",,Não aplicável.,Não aplicável.,FALSE
31/2969/2016 - Medicamentos Goserrelina 3.6mg,Ao abrigo de acordo-quadro (art.º 258.º),Aquisição de bens móveis,"33690000-3, Medicamentos vários","Centro Hospitalar do Algarve, E. P. E. (510745997)","Astra - Zeneca - Produtos Farmacêuticos, Lda. (502942240)","6.196,74 €",16-12-2016,17-08-2016,136 dias,"Portugal, Faro, Faro","Artigo 26.º, n.º 1, alínea e) do Código dos Contratos Públicos","","",,"",,1771819,CP 2015/6 - Acordo quadro para o fornecimento de Medicamentos do Foro Oncológico,FALSE
"Proc. 78/4337/2016- Despesas- """"Annual Meeting em Cuidados Paliativos""""",Ajuste Direto Regime Geral,Aquisição de serviços,"80561000-4, Serviços de formação em matéria de saúde","Centro Hospitalar do Algarve, E. P. E. (510745997)","Steven Martin Unipessoal,Lda (509725660)","17,70 €",16-12-2016,09-12-2016,8 dias,"Portugal, Faro, Faro","Artigo 20.º, n.º 1, alínea a) do Código dos Contratos Públicos","","",,"",,Não aplicável.,Não aplicável.,FALSE
"Proc.78/4337/2016- Despesas - """"Annual Meeting em Cuidados Paliativos""""",Ajuste Direto Regime Geral,Aquisição de serviços,"80561000-4, Serviços de formação em matéria de saúde","Centro Hospitalar do Algarve, E. P. E. (510745997)","Cassiano e Carmo-Artigos para o Lar,Lda (505816962)","61,18 €",16-12-2016,09-12-2016,10 dias,"Portugal, Faro, Faro","Artigo 20.º, n.º 1, alínea a) do Código dos Contratos Públicos","","",,"",,Não aplicável.,Não aplicável.,FALSE
"Proc.78/4337/2016- Despesas - """"Annual Meeting em Cuidados Paliativos""""",Ajuste Direto Regime Geral,Aquisição de serviços,"80561000-4, Serviços de formação em matéria de saúde","Centro Hospitalar do Algarve, E. P. E. (510745997)",PINGO DOCE - Distribuição Alimentar S.A (500829993),"28,05 €",16-12-2016,09-12-2016,10 dias,"Portugal, Faro, Faro","Artigo 20.º, n.º 1, alínea a) do Código dos Contratos Públicos","","",,"",,Não aplicável.,Não aplicável.,FALSE
"Proc.78/4337/2016- Despesas - """"Annual Meeting em Cuidados Paliativos""""",Ajuste Direto Regime Geral,Aquisição de serviços,"80561000-4, Serviços de formação em matéria de saúde","Centro Hospitalar do Algarve, E. P. E. (510745997)",PINGO DOCE - Distribuição Alimentar S.A (500829993),"36,53 €",16-12-2016,09-12-2016,10 dias,"Portugal, Faro, Faro","Artigo 20.º, n.º 1, alínea a) do Código dos Contratos Públicos","","",,"",,Não aplicável.,Não aplicável.,FALSE
"Proc.78/4337/2016- Despesas - """"Annual Meeting em Cuidados Paliativos""""",Ajuste Direto Regime Geral,Aquisição de serviços,"80561000-4, Serviços de formação em matéria de saúde","Centro Hospitalar do Algarve, E. P. E. (510745997)",Lidl & Companhia (503340855),"29,33 €",16-12-2016,09-12-2016,10 dias,"Portugal, Faro, Faro","Artigo 20.º, n.º 1, alínea a) do Código dos Contratos Públicos","","",,"",,Não aplicável.,Não aplicável.,FALSE
"Proc.78/4337/2016- Despesas - """"Annual Meeting em Cuidados Paliativos""""",Ajuste Direto Regime Geral,Aquisição de serviços,"80561000-4, Serviços de formação em matéria de saúde","Centro Hospitalar do Algarve, E. P. E. (510745997)",Lidl & Companhia (503340855),"3,65 €",16-12-2016,09-12-2016,10 dias,"Portugal, Faro, Faro","Artigo 20.º, n.º 1, alínea a) do Código dos Contratos Públicos","","",,"",,Não aplicável.,Não aplicável.,FALSE
61/3997/2016 Reagentes para Gasimetrias,Ajuste Direto Regime Geral,Aquisição de bens móveis,"33696500-0, Reagentes de laboratório","Centro Hospitalar do Algarve, E. P. E. (510745997)","RADIOMETER IBERICA,S.A. (980201667)","8.002,18 €",16-12-2016,28-11-2016,34 dias,"Portugal, Faro, Faro","Artigo 24.º, n.º 1, alínea e) do Código dos Contratos Públicos","","",,"",,Não aplicável.,Não aplicável.,FALSE
61/3862/2016 Reagentes marcadores virais (hepatites e HIV),Ajuste Direto Regime Geral,Aquisição de bens móveis,"33696500-0, Reagentes de laboratório","Centro Hospitalar do Algarve, E. P. E. (510745997)","Abbott Laboratórios, Lda. (500006148)","20.815,00 €",16-12-2016,08-11-2016,54 dias,"Portugal, Faro, Faro","Artigo 24.º, n.º 1, alínea e) do Código dos Contratos Públicos","","",,"",,Não aplicável.,Não aplicável.,FALSE
61/3780/2016 Medicamento Colistimetato de sódio 2000000 UI,Ajuste Direto Regime Geral,Aquisição de bens móveis,"33690000-3, Medicamentos vários","Centro Hospitalar do Algarve, E. P. E. (510745997)",PHARMIS BIOFARMACEUTICA (502595442),"13.734,78 €",16-12-2016,25-10-2016,68 dias,"Portugal, Faro, Faro","Artigo 24.º, n.º 1, alínea e) do Código dos Contratos Públicos","","",,"",,Não aplicável.,Não aplicável.,FALSE
61/3858/2016 Reagentes para Imunologia - Serologia de doenças congénitas,Ajuste Direto Regime Geral,Aquisição de bens móveis,"33696500-0, Reagentes de laboratório","Centro Hospitalar do Algarve, E. P. E. (510745997)","BIOMERIEUX PORTUGAL,LDA. (501524177)","5.616,08 €",16-12-2016,04-11-2016,58 dias,"Portugal, Faro, Faro","Artigo 24.º, n.º 1, alínea e) do Código dos Contratos Públicos","","",,"",,Não aplicável.,Não aplicável.,FALSE
61/3641/2016 Medicamento Nivolumab 100 mg/10 ml sol inj Fr 10ml IV,Ajuste Direto Regime Geral,Aquisição de bens móveis,"33690000-3, Medicamentos vários","Centro Hospitalar do Algarve, E. P. E. (510745997)","BRISTOL-MYERS SQUIBB FARMACÊUTICA PORTUGUESA, S.A. (500048193)","105.600,00 €",15-12-2016,10-11-2016,52 dias,"Portugal, Faro, Faro","Artigo 24.º, n.º 1, alínea e) do Código dos Contratos Públicos","","",,"",,Não aplicável.,Não aplicável.,FALSE
61/4369/2016 Diversos Reagentes,Ajuste Direto Regime Geral,Aquisição de bens móveis,"33696500-0, Reagentes de laboratório","Centro Hospitalar do Algarve, E. P. E. (510745997)","Abbott Laboratórios, Lda. (500006148)","7.021,80 €",15-12-2016,15-12-2016,18 dias,"Portugal, Faro, Faro","Artigo 24.º, n.º 1, alínea e) do Código dos Contratos Públicos","","",,"",,Não aplicável.,Não aplicável.,FALSE
"Proc. 78/4337/2016- Despesas- """"Annual Meeting em Cuidados Paliativos""""",Ajuste Direto Regime Geral,Aquisição de serviços,"80561000-4, Serviços de formação em matéria de saúde","Centro Hospitalar do Algarve, E. P. E. (510745997)",Lidl & Companhia (503340855),"3,52 €",15-12-2016,09-12-2016,8 dias,"Portugal, Faro, Faro","Artigo 20.º, n.º 1, alínea a) do Código dos Contratos Públicos","","",,"",,Não aplicável.,Não aplicável.,FALSE
61/4366/2016 Medicamento Toxina botulinica A 100 U Pó sol inj Fr ID IM,Ajuste Direto Regime Geral,Aquisição de bens móveis,"33690000-3, Medicamentos vários","Centro Hospitalar do Algarve, E. P. E. (510745997)","PROFARIN-DIST.FARMAC.IND.,LDA. (500223238)","9.760,00 €",15-12-2016,13-12-2016,20 dias,"Portugal, Faro, Faro","Artigo 24.º, n.º 1, alínea e) do Código dos Contratos Públicos","","",,"",,Não aplicável.,Não aplicável.,FALSE
"Proc. 78/4337/2016- Despesas- """"Annual Meeting em Cuidados Paliativos""""",Ajuste Direto Regime Geral,Aquisição de serviços,"80561000-4, Serviços de formação em matéria de saúde","Centro Hospitalar do Algarve, E. P. E. (510745997)",Florista Papoika (502831006),"100,00 €",15-12-2016,09-12-2016,8 dias,"Portugal, Faro, Faro","Artigo 20.º, n.º 1, alínea a) do Código dos Contratos Públicos","","",,"",,Não aplicável.,Não aplicável.,FALSE
"Proc. 78/4337/2016- Despesas- """"Annual Meeting em Cuidados Paliativos""""",Ajuste Direto Regime Geral,Aquisição de serviços,"80561000-4, Serviços de formação em matéria de saúde","Centro Hospitalar do Algarve, E. P. E. (510745997)","MAREC - ESPAÇO CASA, SA (507854551)","11,18 €",15-12-2016,09-12-2016,8 dias,"Portugal, Faro, Faro","Artigo 20.º, n.º 1, alínea a) do Código dos Contratos Públicos","","",,"",,Não aplicável.,Não aplicável.,FALSE
61/4189/2016 Trifluridina+tipiracilo de 15mg/6.14mg e 20mg/8.19mg,Ajuste Direto Regime Geral,Aquisição de bens móveis,"33690000-3, Medicamentos vários","Centro Hospitalar do Algarve, E. P. E. (510745997)","SERVIER PORTUGAL-ESP.FARM.,LDA (502177420)","6.262,04 €",15-12-2016,30-11-2016,32 dias,"Portugal, Faro, Faro","Artigo 24.º, n.º 1, alínea e) do Código dos Contratos Públicos","","",,"",,Não aplicável.,Não aplicável.,FALSE
"Proc. 78/4337/2016- Despesas- """"Annual Meeting em Cuidados Paliativos""""",Ajuste Direto Regime Geral,Aquisição de serviços,"80561000-4, Serviços de formação em matéria de saúde","Centro Hospitalar do Algarve, E. P. E. (510745997)","MAREC - ESPAÇO CASA, SA (507854551)","32,24 €",15-12-2016,09-12-2016,10 dias,"Portugal, Faro, Faro","Artigo 20.º, n.º 1, alínea a) do Código dos Contratos Públicos","","",,"",,Não aplicável.,Não aplicável.,FALSE
61/4182/2016 Medicamentos Levonorgestrel 20 pg e Regorafenib 40 mg,Ajuste Direto Regime Geral,Aquisição de bens móveis,"33690000-3, Medicamentos vários","Centro Hospitalar do Algarve, E. P. E. (510745997)",Bayer Portugal S.A. (500043256),"9.904,68 €",15-12-2016,28-11-2016,34 dias,"Portugal, Faro, Faro","Artigo 24.º, n.º 1, alínea e) do Código dos Contratos Públicos","","",,"",,Não aplicável.,Não aplicável.,FALSE
61/4180/2016 Medicamento Dexmedetomidina 100 pg,Ajuste Direto Regime Geral,Aquisição de bens móveis,"33690000-3, Medicamentos vários","Centro Hospitalar do Algarve, E. P. E. (510745997)","Orionfin Unipessoal, Lda. (508907365)","9.000,00 €",15-12-2016,28-11-2016,34 dias,"Portugal, Faro, Faro","Artigo 24.º, n.º 1, alínea e) do Código dos Contratos Públicos","","",,"",,Não aplicável.,Não aplicável.,FALSE
Proc.67/3797/2016- Substituição de Ampola de TAC- Unid.Faro,Ajuste Direto Regime Geral,Aquisição de serviços,"50421000-2, Serviços de reparação e manutenção de equipamento médico","Centro Hospitalar do Algarve, E. P. E. (510745997)","Siemens Healthcare, Lda € (507925173)","60.000,00 €",15-12-2016,17-11-2016,30 dias,"Portugal, Faro, Faro","Artigo 24.º, n.º 1, alínea e) do Código dos Contratos Públicos","","",,"",,Não aplicável.,Não aplicável.,FALSE
Proc. 68/4289/2016- Renovação de Documento de Identificação de Utente,Ajuste Direto Regime Geral,Aquisição de serviços,"79131000-1, Serviços de documentação","Centro Hospitalar do Algarve, E. P. E. (510745997)",CRCiv.Faro (600004422),"15,00 €",15-12-2016,09-12-2016,8 dias,"Portugal, Faro, Faro","Artigo 24.º, n.º 1, alínea e) do Código dos Contratos Públicos","","",,"",,Não aplicável.,Não aplicável.,FALSE
72/ 4195 / 2016 - Material de Neurocirurgia,Ajuste Direto Regime Geral,Aquisição de bens móveis,"33130000-0, Instrumentos e dispositivos dentários e de subespecialidade","Centro Hospitalar do Algarve, E. P. E. (510745997)","NEUROWAVE, LDA (508537150)","15.575,70 €",15-12-2016,15-12-2016,15 dias,"Portugal, Faro, Faro<BR/>Portugal, Faro, Portimão<BR/>Portugal, Faro, Lagos","Artigo 20.º, n.º 1, alínea a) do Código dos Contratos Públicos","","",,"",,Não aplicável.,Não aplicável.,FALSE
72/4425/2016 - Material de Encavilhamento,Ajuste Direto Regime Geral,Aquisição de bens móveis,"33130000-0, Instrumentos e dispositivos dentários e de subespecialidade","Centro Hospitalar do Algarve, E. P. E. (510745997)","STRYKER PORTUGAL PRODUTOS MEDICOS, LDA (504594214)","8.375,00 €",15-12-2016,15-12-2016,15 dias,"Portugal, Faro, Lagos<BR/>Portugal, Faro, Portimão<BR/>Portugal, Faro, Faro","Artigo 20.º, n.º 1, alínea a) do Código dos Contratos Públicos","","",,"",,Não aplicável.,Não aplicável.,FALSE
Aquisição de Trouxas,Ajuste Direto Regime Geral,Aquisição de bens móveis,"33140000-3, Material médico de consumo","Centro Hospitalar do Algarve, E. P. E. (510745997)","MOLNLYCKE HEALTH CARE, LDA. (511101066), LINEAMEDICA,S.A. (505148676)","5.932,48 €",13-12-2016,02-11-2016,29 dias,"Portugal, Faro, Portimão<BR/>Portugal, Faro, Faro","Artigo 20.º, n.º 1, alínea a) do Código dos Contratos Públicos","","",,"",,Não aplicável.,Não aplicável.,FALSE
Aquisição de material de  Gastro,Ajuste Direto Regime Geral,Aquisição de bens móveis,"33140000-3, Material médico de consumo","Centro Hospitalar do Algarve, E. P. E. (510745997)","OLYMPUS IBERIA, s.a.u. (980474710)","99,00 €",13-12-2016,10-11-2016,51 dias,"Portugal, Faro, Faro<BR/>Portugal, Faro, Portimão","Artigo 20.º, n.º 1, alínea a) do Código dos Contratos Públicos","","",,"",,Não aplicável.,Não aplicável.,FALSE
Aquisição de material de  Gastro,Ajuste Direto Regime Geral,Aquisição de bens móveis,"33140000-3, Material médico de consumo","Centro Hospitalar do Algarve, E. P. E. (510745997)","HR  HOSPITALAR,Unipessoal, LDA (501895558)","420,00 €",13-12-2016,10-12-2016,51 dias,"Portugal, Faro, Faro<BR/>Portugal, Faro, Portimão","Artigo 20.º, n.º 1, alínea a) do Código dos Contratos Públicos","","",,"",,Não aplicável.,Não aplicável.,FALSE
"Aquisição de Cateteres, Obturador e Torneira",Ao abrigo de acordo-quadro (art.º 259.º),Aquisição de bens móveis,"33140000-3, Material médico de consumo","Centro Hospitalar do Algarve, E. P. E. (510745997)","SOCIME II - Produtos Medicos Lda (504453939), SMITHS MEDICAL(PORTUGAL),LDA. (507445937), PMH-PROD.MEDICO-HOSPITALARES (502376899), OVERPHARMA,LDA. (505792362)","15.664,00 €",12-12-2016,07-12-2016,25 dias,"Portugal, Faro, Lagos<BR/>Portugal, Faro, Faro<BR/>Portugal, Faro, Portimão","Artigo 20.º, n.º 1, alínea b) do Código dos Contratos Públicos","","",,"",,2349386,Acordo Quadro para o fornecimento de Cateteres às Instituições e Serviços do Serviço Nacional de Saúde,FALSE
Proc. 68/3920/2016- Substituição de Bateria,Ajuste Direto Regime Geral,Aquisição de bens móveis,"31440000-2, Baterias","Centro Hospitalar do Algarve, E. P. E. (510745997)","Stanley Security Portugal, Unipessoal, Lda (506313131)","14,40 €",12-12-2016,08-11-2016,30 dias,"Portugal, Faro, Portimão","Artigo 24.º, n.º 1, alínea e) do Código dos Contratos Públicos","","",,"",,Não aplicável.,Não aplicável.,FALSE
Proc. 58/4245/2016- Elástico para Bobine,Ajuste Direto Regime Geral,Aquisição de bens móveis,"19440000-2, Fios ou linhas sintéticas","Centro Hospitalar do Algarve, E. P. E. (510745997)",Jacinto Jose Viegas Mascarenhas (804689660),"1,71 €",12-12-2016,28-11-2016,15 dias,"Portugal, Faro, Faro","Artigo 20.º, n.º 1, alínea a) do Código dos Contratos Públicos","","",,"",,Não aplicável.,Não aplicável.,FALSE
Proc. 68/4248/2016- Fornecimento de 50 mts. tubo PEAD 110,Ajuste Direto Regime Geral,Aquisição de serviços,"50800000-3, Serviços de reparação e manutenção diversos","Centro Hospitalar do Algarve, E. P. E. (510745997)","ACCIONA Facility Services, SA (503431397)","454,25 €",12-12-2016,02-12-2016,30 dias,"Portugal, Faro, Faro","Artigo 24.º, n.º 1, alínea e) do Código dos Contratos Públicos","","",,"",,Não aplicável.,Não aplicável.,FALSE
Proc. 67/4213/2016- Reparação de Duodenoscopio,Ajuste Direto Regime Geral,Aquisição de serviços,"50421000-2, Serviços de reparação e manutenção de equipamento médico","Centro Hospitalar do Algarve, E. P. E. (510745997)",SUCH (500900469),"3.151,00 €",12-12-2016,02-12-2016,30 dias,"Portugal, Faro, Portimão","Artigo 24.º, n.º 1, alínea e) do Código dos Contratos Públicos","","",,"",,Não aplicável.,Não aplicável.,FALSE
Proc. 68/4127/2016- Substituição de baterias em UPS,Ajuste Direto Regime Geral,Aquisição de bens móveis,"31440000-2, Baterias","Centro Hospitalar do Algarve, E. P. E. (510745997)","Emerson Network Power,Lda (503322520)","2.413,30 €",12-12-2016,21-11-2016,30 dias,"Portugal, Faro, Portimão","Artigo 24.º, n.º 1, alínea e) do Código dos Contratos Públicos","","",,"",,Não aplicável.,Não aplicável.,FALSE
Proc. 68/4126/2016- Materiais p/ reparação de tubagem de Gases Medicinais,Ajuste Direto Regime Geral,Aquisição de serviços,"50531200-8, Serviços de manutenção de aparelhos a gás","Centro Hospitalar do Algarve, E. P. E. (510745997)",AIR LIQUIDE MEDICINAL SA                           (501576436),"356,18 €",12-12-2016,21-11-2016,30 dias,"Portugal, Faro, Portimão","Artigo 24.º, n.º 1, alínea e) do Código dos Contratos Públicos","","",,"",,Não aplicável.,Não aplicável.,FALSE
Proc. 67/4025/2016- Reparação motores-Bloco Operatório Ortopedia,Ajuste Direto Regime Geral,Aquisição de serviços,"50422000-9, Serviços de reparação e manutenção de equipamento cirúrgico","Centro Hospitalar do Algarve, E. P. E. (510745997)",SUCH (500900469),"1.373,65 €",12-12-2016,21-11-2016,60 dias,"Portugal, Faro, Faro","Artigo 24.º, n.º 1, alínea e) do Código dos Contratos Públicos","","",,"",,Não aplicável.,Não aplicável.,FALSE
Proc. 67/4025/2016- Reparação pinça de suspensão intestinal,Ajuste Direto Regime Geral,Aquisição de serviços,"50422000-9, Serviços de reparação e manutenção de equipamento cirúrgico","Centro Hospitalar do Algarve, E. P. E. (510745997)","B BRAUN MEDICAL, LDA.                              (501506543)","223,50 €",12-12-2016,15-11-2016,60 dias,"Portugal, Faro, Faro","Artigo 24.º, n.º 1, alínea e) do Código dos Contratos Públicos","","",,"",,Não aplicável.,Não aplicável.,FALSE
Proc. 67/4006/2016- Reparação de fotocopiadora,Ajuste Direto Regime Geral,Aquisição de serviços,"50313100-3, Serviços de reparação de fotocopiadoras","Centro Hospitalar do Algarve, E. P. E. (510745997)","Farcópia – Equipamentos de Escritório, Lda. (501077227)","57,06 €",12-12-2016,10-11-2016,60 dias,"Portugal, Faro, Faro","Artigo 24.º, n.º 1, alínea e) do Código dos Contratos Públicos","","",,"",,Não aplicável.,Não aplicável.,FALSE
