freguesia,acronym,validVotesPercentage,votes,dicofre
Barbeita,PPD/PSD.CDS-PP,38.53,84,160404
Barbeita,PS,31.19,68,160404
Barbeita,MPT,10.09,22,160404
Barbeita,B.E.,6.88,15,160404
Barbeita,PCP-PEV,4.13,9,160404
Barbeita,L,1.83,4,160404
Barbeita,PCTP/MRPP,1.83,4,160404
Barbeita,PAN,1.38,3,160404
Barbeita,PND,1.38,3,160404
Barbeita,MAS,0.46,1,160404
Barbeita,PDA,0.46,1,160404
Barbeita,PNR,0.46,1,160404
Barbeita,POUS,0.46,1,160404
Barbeita,PPM,0.46,1,160404
Barbeita,PTP,0.46,1,160404
Barbeita,PPV,0,0,160404
