Objeto do Contrato,Tipo de Procedimento,Tipo(s) de Contrato,CPVs,Entidade(s) Adjudicante(s),Entidade(s) Adjudicatária(s),Preço Contratual,Data de Publicação,Data de Celebração do Contrato,Prazo de Execução,Local de Execução,Fundamentação,Data de Fecho do Contrato,Preço Total Efetivo,Causas das Alterações ao Prazo,Causas das Alterações ao Preço,Estado,N.º registo do Acordo Quadro,Descrição do Acordo Quadro,Procedimento Centralizado
AQUISIÇÃO DE PROTESES PARA AMPUTADOS,Ajuste Direto Regime Geral,Aquisição de bens móveis,"33184000-3, Próteses","Centro Hospitalar Tondela-Viseu, E. P. E. (509822940)","MEDICAL PLUS-PROD.MED.HOSP.,LD (506658066)","31.021,07 €",20-05-2015,29-04-2015,1 dias,"Portugal, Viseu, Viseu","Artigo 20.º, n.º 1, alínea a) do Código dos Contratos Públicos",,,,,,Não aplicável.,Não aplicável.,FALSE
AQUISIÇÃO DE CABEÇA CUPULA7FEMURAL PARA PROTESE DA ANCA,Ajuste Direto Regime Geral,Aquisição de bens móveis,"33183200-8, Próteses ortopédicas","Centro Hospitalar Tondela-Viseu, E. P. E. (509822940)",P.H.O.-PROD.HOSPIT.P/ORTOPEDIA (504980580),"9.883,41 €",20-05-2015,14-01-2015,1 dias,"Portugal, Viseu, Viseu","Artigo 24.º, n.º 1, alínea c) do Código dos Contratos Públicos",,,,,,Não aplicável.,Não aplicável.,FALSE
AQUISIÇÃO DE LENTE MONOBLOCO ACRILICA HIDROFOBICA C/FILTRO,Ajuste Direto Regime Geral,Aquisição de bens móveis,"33731110-7, Lentes intraoculares","Centro Hospitalar Tondela-Viseu, E. P. E. (509822940)","ALCON PORTUGAL-PROD.EQUIP.OFTL,LDA (501251685)","45.760,00 €",20-05-2015,07-01-2015,1 dias,"Portugal, Viseu, Viseu","Artigo 24.º, n.º 1, alínea c) do Código dos Contratos Públicos",,,,,,Não aplicável.,Não aplicável.,FALSE
AQUISIÇÃO DE CLAMP TITANIO PARA CRANIO ESTERILIZADO DIAMETRO,Ajuste Direto Regime Geral,Aquisição de bens móveis,"33169000-2, Material cirúrgico","Centro Hospitalar Tondela-Viseu, E. P. E. (509822940)","B.BRAUN MEDICAL, LDA (501506543)","6.120,00 €",20-05-2015,03-02-2015,1 dias,"Portugal, Viseu, Viseu","Artigo 20.º, n.º 1, alínea a) do Código dos Contratos Públicos",,,,,,Não aplicável.,Não aplicável.,FALSE
AQUISIÇÃO DE TAMPONAMENTO NASAL BIODEGRADAVEL STANDART 8X,Ajuste Direto Regime Geral,Aquisição de bens móveis,"33169000-2, Material cirúrgico","Centro Hospitalar Tondela-Viseu, E. P. E. (509822940)",ATOS MEDICAL (980435978),"5.520,00 €",20-05-2015,29-12-2014,1 dias,"Portugal, Viseu, Viseu","Artigo 20.º, n.º 1, alínea a) do Código dos Contratos Públicos",,,,,,Não aplicável.,Não aplicável.,FALSE
AQUISIÇÃO DE KIT CATETER FEMURAL MONITORIZAÇÃO PICCO,Ajuste Direto Regime Geral,Aquisição de bens móveis,"33141200-2, Cateteres","Centro Hospitalar Tondela-Viseu, E. P. E. (509822940)",CLINIFAR-P.CLINICOS FARMAC (503281115),"7.650,00 €",20-05-2015,23-12-2014,1 dias,"Portugal, Viseu, Viseu","Artigo 20.º, n.º 1, alínea a) do Código dos Contratos Públicos",,,,,,Não aplicável.,Não aplicável.,FALSE
AQUISIÇÃO DE REDE D.FACE POLIPROP./HIDROGEL,Ajuste Direto Regime Geral,Aquisição de bens móveis,"33184100-4, Implantes cirúrgicos","Centro Hospitalar Tondela-Viseu, E. P. E. (509822940)","C.R. BARD PORTUGAL, LDA. (502438274)","6.320,00 €",20-05-2015,21-01-2015,1 dias,"Portugal, Viseu, Viseu","Artigo 20.º, n.º 1, alínea a) do Código dos Contratos Públicos",,,,,,Não aplicável.,Não aplicável.,FALSE
"AQUISIÇÃO DE SACO URINA ESVAZIAMENTO NÃO ESTERIL. """"P/ACOPLAR""""",Ajuste Direto Regime Geral,Aquisição de bens móveis,"33141615-4, Sacos para urina","Centro Hospitalar Tondela-Viseu, E. P. E. (509822940)","EZEQUIEL PANAO JORGE, LDA (501412727)","5.304,00 €",20-05-2015,10-12-2014,1 dias,"Portugal, Viseu, Viseu","Artigo 24.º, n.º 1, alínea c) do Código dos Contratos Públicos",,,,,,Não aplicável.,Não aplicável.,FALSE
AQUISIÇÃO DE MINI NEBULIZADOR (INSPIRON) COMPLETO ADULTO,Ajuste Direto Regime Geral,Aquisição de bens móveis,"33169000-2, Material cirúrgico","Centro Hospitalar Tondela-Viseu, E. P. E. (509822940)","INTERSURGICAL PORTUGAL, LDA (503480045)","8.888,10 €",20-05-2015,17-12-2014,1 dias,"Portugal, Viseu, Viseu","Artigo 24.º, n.º 1, alínea c) do Código dos Contratos Públicos",,,,,,Não aplicável.,Não aplicável.,FALSE
AQUISIÇÃO DE DIVERSO MATERIAL DE CONSUMO CLINICO,Ajuste Direto Regime Geral,Aquisição de bens móveis,"33169000-2, Material cirúrgico","Centro Hospitalar Tondela-Viseu, E. P. E. (509822940)","COVIDIEN PORTUGAL-PRODUTOS DE SAÚDE UNIPESSOAL,LDA (503413410)","11.430,00 €",20-05-2015,23-02-2015,1 dias,"Portugal, Viseu, Viseu","Artigo 24.º, n.º 1, alínea e) do Código dos Contratos Públicos",,,,,,Não aplicável.,Não aplicável.,FALSE
CAMARAS DE VIDEOVIGILÂNCIA  E EQUIPAMENTOS CONEXOS,Ajuste Direto Regime Geral,Aquisição de bens móveis,"35125000-6, Sistema de vigilância","Centro Hospitalar Tondela-Viseu, E. P. E. (509822940)","ANTICHAMA, LDA (502567635)","14.600,00 €",20-05-2015,02-04-2015,1 dias,"Portugal, Viseu, Viseu","Artigo 20.º, n.º 1, alínea a) do Código dos Contratos Públicos",,,,,,Não aplicável.,Não aplicável.,FALSE
DISCOS PARA INFORMATICA,Ajuste Direto Regime Geral,Aquisição de bens móveis,"30230000-0, Equipamento informático","Centro Hospitalar Tondela-Viseu, E. P. E. (509822940)","SIEMENS HEALTHCARE DIAGNOSTICS , LDA (507925173)","9.978,60 €",20-05-2015,08-05-2015,1 dias,"Portugal, Viseu, Viseu","Artigo 20.º, n.º 1, alínea a) do Código dos Contratos Públicos",,,,,,Não aplicável.,Não aplicável.,FALSE
AQUISIÇÃO DE PINÇA LIGASURE,Ajuste Direto Regime Geral,Aquisição de bens móveis,"33162200-5, Instrumentos para blocos operatórios","Centro Hospitalar Tondela-Viseu, E. P. E. (509822940)","COVIDIEN PORTUGAL-PRODUTOS DE SAÚDE UNIPESSOAL,LDA (503413410)","8.688,60 €",19-05-2015,06-01-2015,1 dias,"Portugal, Viseu, Viseu","Artigo 24.º, n.º 1, alínea c) do Código dos Contratos Públicos",,,,,,Não aplicável.,Não aplicável.,FALSE
AQUISIÇÃO DE PROTESE DA ANCA NÃO CIMENTADA,Ajuste Direto Regime Geral,Aquisição de bens móveis,"33184000-3, Próteses","Centro Hospitalar Tondela-Viseu, E. P. E. (509822940)","ARTUR SALGADO, LDA (503612600)","29.250,00 €",19-05-2015,12-01-2015,1 dias,"Portugal, Viseu, Viseu","Artigo 24.º, n.º 1, alínea c) do Código dos Contratos Públicos",,,,,,Não aplicável.,Não aplicável.,FALSE
AQUISIÇÃO DE BIOMATRIZ COLOGENIO P/REGENERAÇÃO,Ajuste Direto Regime Geral,Aquisição de bens móveis,"33140000-3, Material médico de consumo","Centro Hospitalar Tondela-Viseu, E. P. E. (509822940)","BAXTER MEDICO FARMACEUTICA,LD (503347345)","5.200,00 €",19-05-2015,15-12-2014,1 dias,"Portugal, Viseu, Viseu","Artigo 20.º, n.º 1, alínea a) do Código dos Contratos Públicos",,,,,,Não aplicável.,Não aplicável.,FALSE
AQUISIÇÃO DE SACO COLETOR SISTEMA RECOLHA FLUIDO ASPIRADO,Ajuste Direto Regime Geral,Aquisição de bens móveis,"33000000-0, Equipamento médico, medicamentos e produtos para cuidados pessoais","Centro Hospitalar Tondela-Viseu, E. P. E. (509822940)","MEDLINE INTERNATIONAL PORTUGAL, UNIPESSOAL, LDA. (510533515)","21.933,00 €",19-05-2015,17-02-2015,1 dias,"Portugal, Viseu, Viseu","Artigo 24.º, n.º 1, alínea e) do Código dos Contratos Públicos",,,,,,Não aplicável.,Não aplicável.,FALSE
AQUISIÇÃO DE PROTESE PARA JOELHO (ADVANCE),Ajuste Direto Regime Geral,Aquisição de bens móveis,"33183200-8, Próteses ortopédicas","Centro Hospitalar Tondela-Viseu, E. P. E. (509822940)","ARTUR SALGADO, LDA (503612600)","28.170,00 €",19-05-2015,30-12-2014,1 dias,"Portugal, Viseu, Viseu","Artigo 24.º, n.º 1, alínea c) do Código dos Contratos Públicos",,,,,,Não aplicável.,Não aplicável.,FALSE
AQUISIÇÃO DE PROTESE PARA JOELHO (ANAKINE),Ajuste Direto Regime Geral,Aquisição de bens móveis,"33183200-8, Próteses ortopédicas","Centro Hospitalar Tondela-Viseu, E. P. E. (509822940)","ARTUR SALGADO, LDA (503612600)","28.200,00 €",19-05-2015,30-12-2014,1 dias,"Portugal, Viseu, Viseu","Artigo 24.º, n.º 1, alínea c) do Código dos Contratos Públicos",,,,,,Não aplicável.,Não aplicável.,FALSE
AQUISIÇÃO DE DIVERSO MATERIAL CLINICO PARA IMAGIOLOGIA,Ajuste Direto Regime Geral,Aquisição de bens móveis,"33140000-3, Material médico de consumo","Centro Hospitalar Tondela-Viseu, E. P. E. (509822940)","BIOSONDA-COM.MAT.HOSPITALAR, (501463313)","15.499,00 €",19-05-2015,10-02-2015,1 dias,"Portugal, Viseu, Viseu","Artigo 20.º, n.º 1, alínea a) do Código dos Contratos Públicos",,,,,,Não aplicável.,Não aplicável.,FALSE
AQUISIÇÃO DE PULSEIRAS P/IDENTIFICAÇÃO ELETRÓNICA,Ajuste Direto Regime Geral,Aquisição de bens móveis,"33140000-3, Material médico de consumo","Centro Hospitalar Tondela-Viseu, E. P. E. (509822940)","JOAO LAGO-ENG.SIST.SEGURANCA,LDA (506240711)","39.356,25 €",19-05-2015,12-03-2015,1 dias,"Portugal, Viseu, Viseu","Artigo 24.º, n.º 1, alínea e) do Código dos Contratos Públicos",,,,,,Não aplicável.,Não aplicável.,FALSE
AQUISIÇÃO DE ENDOPROTESE BILIAR AUTOEXPANSIVA,Ajuste Direto Regime Geral,Aquisição de bens móveis,"33184000-3, Próteses","Centro Hospitalar Tondela-Viseu, E. P. E. (509822940)","MEDICINÁLIA CORMEDICA, LDA (500684324)","6.780,00 €",19-05-2015,15-12-2014,1 dias,"Portugal, Viseu, Viseu","Artigo 20.º, n.º 1, alínea a) do Código dos Contratos Públicos",,,,,,Não aplicável.,Não aplicável.,FALSE
AQUISIÇÃO DE DIVERSO MATERIAL P/ESTERILIZAÇÃO (PD),Ajuste Direto Regime Geral,Aquisição de bens móveis,"33198200-6, Saquetas e invólucros de papel para esterilização","Centro Hospitalar Tondela-Viseu, E. P. E. (509822940)","FACTOR PLUS,SA-PROD.MED.HOSP (502810645)","8.572,80 €",19-05-2015,24-11-2014,1 dias,"Portugal, Viseu, Viseu","Artigo 20.º, n.º 1, alínea a) do Código dos Contratos Públicos",,,,,,Não aplicável.,Não aplicável.,FALSE
"AQUISIÇÃO DE PINÇA LAPAROSCOPICA 5MM, EIXO 37CM ROTIVO 180º",Ajuste Direto Regime Geral,Aquisição de bens móveis,"33169000-2, Material cirúrgico","Centro Hospitalar Tondela-Viseu, E. P. E. (509822940)","COVIDIEN PORTUGAL-PRODUTOS DE SAÚDE UNIPESSOAL,LDA (503413410)","8.376,00 €",19-05-2015,26-01-2015,1 dias,"Portugal, Viseu, Viseu","Artigo 20.º, n.º 1, alínea a) do Código dos Contratos Públicos",,,,,,Não aplicável.,Não aplicável.,FALSE
AQUISIÇÃO DE KIT (PACK) P/CIRURGIA DA CATARATA C/CASSETE,Ajuste Direto Regime Geral,Aquisição de bens móveis,"33141620-2, Kits médicos","Centro Hospitalar Tondela-Viseu, E. P. E. (509822940)","ALCON PORTUGAL-PROD.EQUIP.OFTL,LDA (501251685)","9.690,00 €",19-05-2015,20-01-2015,1 dias,"Portugal, Viseu, Viseu","Artigo 24.º, n.º 1, alínea c) do Código dos Contratos Públicos",,,,,,Não aplicável.,Não aplicável.,FALSE
AQUISIÇÃO DE PROTESE P7TRATAMENTO ANEURISMA DA AORTA,Ajuste Direto Regime Geral,Aquisição de bens móveis,"33184000-3, Próteses","Centro Hospitalar Tondela-Viseu, E. P. E. (509822940)","MEDTRONIC PORTUGAL, LDA (504223933)","7.650,00 €",19-05-2015,20-01-2015,1 dias,"Portugal, Viseu, Viseu","Artigo 20.º, n.º 1, alínea a) do Código dos Contratos Públicos",,,,,,Não aplicável.,Não aplicável.,FALSE
AQUISIÇÃO DE SISTEMA ADMINISTRAÇÃO SORO C/AREJADOR,Ajuste Direto Regime Geral,Aquisição de bens móveis,"33169000-2, Material cirúrgico","Centro Hospitalar Tondela-Viseu, E. P. E. (509822940)","CareFusion Portugal 332 - Prod. Médicos, Lda (503898554)","9.984,00 €",19-05-2015,05-12-2014,1 dias,"Portugal, Viseu, Viseu","Artigo 24.º, n.º 1, alínea c) do Código dos Contratos Públicos",,,,,,Não aplicável.,Não aplicável.,FALSE
AQUISIÇÃO DE AGRAFADOR LINEAR,Ajuste Direto Regime Geral,Aquisição de bens móveis,"33140000-3, Material médico de consumo","Centro Hospitalar Tondela-Viseu, E. P. E. (509822940)","JOHNSON & JOHNSON, MEDICAL (500153370)","9.720,00 €",19-05-2015,09-12-2014,1 dias,"Portugal, Viseu, Viseu","Artigo 24.º, n.º 1, alínea c) do Código dos Contratos Públicos",,,,,,Não aplicável.,Não aplicável.,FALSE
AQUISIÇÃO DE BATA IRRECUPERAVEL ESTERIL C/PUNHO,Ajuste Direto Regime Geral,Aquisição de bens móveis,"33140000-3, Material médico de consumo","Centro Hospitalar Tondela-Viseu, E. P. E. (509822940)",MOLNLYCKE HEALTH CARE (511101066),"9.609,60 €",19-05-2015,11-12-2014,1 dias,"Portugal, Viseu, Viseu","Artigo 24.º, n.º 1, alínea c) do Código dos Contratos Públicos",,,,,,Não aplicável.,Não aplicável.,FALSE
AQUISIÇÃO DE KIT (PACK) P/CIRURGIA DA CATARATA,Ajuste Direto Regime Geral,Aquisição de bens móveis,"33141620-2, Kits médicos","Centro Hospitalar Tondela-Viseu, E. P. E. (509822940)","ALCON PORTUGAL-PROD.EQUIP.OFTL,LDA (501251685)","9.690,00 €",19-05-2015,10-12-2014,1 dias,"Portugal, Viseu, Viseu","Artigo 24.º, n.º 1, alínea c) do Código dos Contratos Públicos",,,,,,Não aplicável.,Não aplicável.,FALSE
AQUISIÇÃO DE KIT (PACK) P/CIRURGIA DA CATARATA C/CASSETE INCLUIDA,Ajuste Direto Regime Geral,Aquisição de bens móveis,"33141620-2, Kits médicos","Centro Hospitalar Tondela-Viseu, E. P. E. (509822940)","ALCON PORTUGAL-PROD.EQUIP.OFTL,LDA (501251685)","9.690,00 €",19-05-2015,19-02-2015,1 dias,"Portugal, Viseu, Viseu","Artigo 24.º, n.º 1, alínea c) do Código dos Contratos Públicos",,,,,,Não aplicável.,Não aplicável.,FALSE
AQUISIÇÃO DE KI (PACK) P/CIRURGIA DA CATARATA C7CASSETE INCLUIDA,Ajuste Direto Regime Geral,Aquisição de bens móveis,"33141620-2, Kits médicos","Centro Hospitalar Tondela-Viseu, E. P. E. (509822940)","ALCON PORTUGAL-PROD.EQUIP.OFTL,LDA (501251685)","9.690,00 €",19-05-2015,26-02-2015,1 dias,"Portugal, Viseu, Viseu","Artigo 24.º, n.º 1, alínea c) do Código dos Contratos Públicos",,,,,,Não aplicável.,Não aplicável.,FALSE
AQUISIÇÃO DE OXISENSOR DE OXIGÉNIO DESCART. NEONATAL,Ajuste Direto Regime Geral,Aquisição de bens móveis,"33140000-3, Material médico de consumo","Centro Hospitalar Tondela-Viseu, E. P. E. (509822940)","COVIDIEN PORTUGAL-PRODUTOS DE SAÚDE UNIPESSOAL,LDA (503413410)","9.936,00 €",19-05-2015,15-12-2014,1 dias,"Portugal, Viseu, Viseu","Artigo 24.º, n.º 1, alínea e) do Código dos Contratos Públicos",,,,,,Não aplicável.,Não aplicável.,FALSE
AQUISIÇÃO DE KIT TROCAR P/LAPAROSCOPIA,Ajuste Direto Regime Geral,Aquisição de bens móveis,"33141620-2, Kits médicos","Centro Hospitalar Tondela-Viseu, E. P. E. (509822940)",ENDOTECNICA-MATERIAL CIRURGICO (503818348),"9.996,00 €",19-05-2015,15-12-2014,1 dias,"Portugal, Viseu, Viseu","Artigo 24.º, n.º 1, alínea c) do Código dos Contratos Públicos",,,,,,Não aplicável.,Não aplicável.,FALSE
AQUISIÇÃO DE ENDOPROTESE VASCULAR AUTO EXPANSIVA 80-120CMX,Ajuste Direto Regime Geral,Aquisição de bens móveis,"33184000-3, Próteses","Centro Hospitalar Tondela-Viseu, E. P. E. (509822940)","MEDTRONIC PORTUGAL, LDA (504223933)","9.000,00 €",19-05-2015,17-02-2015,1 dias,"Portugal, Viseu, Viseu","Artigo 24.º, n.º 1, alínea c) do Código dos Contratos Públicos",,,,,,Não aplicável.,Não aplicável.,FALSE
AQUISIÇÃO DE AGRAFADOR CIRCULAR E PINÇA LAPAROSCOPICA,Ajuste Direto Regime Geral,Aquisição de bens móveis,"33141121-4, Suturas cirúrgicas","Centro Hospitalar Tondela-Viseu, E. P. E. (509822940)","COVIDIEN PORTUGAL-PRODUTOS DE SAÚDE UNIPESSOAL,LDA (503413410)","9.987,00 €",19-05-2015,17-02-2015,1 dias,"Portugal, Viseu, Viseu","Artigo 24.º, n.º 1, alínea c) do Código dos Contratos Públicos",,,,,,Não aplicável.,Não aplicável.,FALSE
"AQUISIÇÃO DE PINÇA LAPAROSCOPIA 5MM, EIXO 37CM ROTATIVO 180º",Ajuste Direto Regime Geral,Aquisição de bens móveis,"33169000-2, Material cirúrgico","Centro Hospitalar Tondela-Viseu, E. P. E. (509822940)","COVIDIEN PORTUGAL-PRODUTOS DE SAÚDE UNIPESSOAL,LDA (503413410)","8.376,00 €",19-05-2015,13-02-2015,1 dias,"Portugal, Viseu, Viseu","Artigo 24.º, n.º 1, alínea c) do Código dos Contratos Públicos",,,,,,Não aplicável.,Não aplicável.,FALSE
Aquisição de :Testes Determin.Grupos Método Microplacas e T.Manuais- IMMUCOR P/2015,Ajuste Direto Regime Geral,Aquisição de bens móveis,"33696100-6, Reagentes para determinação do grupo sanguíneo","Centro Hospitalar Tondela-Viseu, E. P. E. (509822940)",IMMUCOR (PORTUGAL) LDA. (503007358),"63.571,18 €",19-05-2015,15-01-2015,1 dias,"Portugal, Viseu, Viseu","Artigo 20.º, n.º 1, alínea a) do Código dos Contratos Públicos",,,,,,Não aplicável.,Não aplicável.,FALSE
Aquisição de: VIROLOGIA A DADORES SANGUE P/ANO 2015,Ajuste Direto Regime Geral,Aquisição de bens móveis,"33696500-0, Reagentes de laboratório","Centro Hospitalar Tondela-Viseu, E. P. E. (509822940)","ABBOTT LABORATORIOS, LDA (500006148)","103.874,87 €",19-05-2015,28-01-2015,1 dias,"Portugal, Viseu, Viseu","Artigo 24.º, n.º 1, alínea e) do Código dos Contratos Públicos",,,,,,Não aplicável.,Não aplicável.,FALSE
Aquisição de: Meios p/ Realização Análises Clínicas de Imunologia,Ajuste Direto Regime Geral,Aquisição de bens móveis,"33696500-0, Reagentes de laboratório","Centro Hospitalar Tondela-Viseu, E. P. E. (509822940)","QUILABAN-QUÍMICA LABORATORIAL ANALÍTICA, S.A. (500399670)","91.708,56 €",19-05-2015,18-03-2015,1 dias,"Portugal, Viseu, Viseu","Artigo 24.º, n.º 1, alínea b) do Código dos Contratos Públicos",,,,,,Não aplicável.,Não aplicável.,FALSE
Aquisição de Reagentes Não Depend. Equipamento,Ajuste Direto Regime Geral,Aquisição de bens móveis,"33696500-0, Reagentes de laboratório","Centro Hospitalar Tondela-Viseu, E. P. E. (509822940)","Biomerieux Portugal, Lda (501524177)","10.755,86 €",18-05-2015,19-11-2014,1 dias,"Portugal, Viseu, Viseu","Artigo 20.º, n.º 1, alínea a) do Código dos Contratos Públicos",,,,,,Não aplicável.,Não aplicável.,FALSE
Aquisição de: Reagentes p/ Microbiologia (Antibiogramas G.Negat. Vitek (Cartas Urina),Ajuste Direto Regime Geral,Aquisição de bens móveis,"33696500-0, Reagentes de laboratório","Centro Hospitalar Tondela-Viseu, E. P. E. (509822940)","Biomerieux Portugal, Lda (501524177)","16.245,00 €",18-05-2015,10-11-2014,1 dias,"Portugal, Viseu, Viseu","Artigo 24.º, n.º 1, alínea e) do Código dos Contratos Públicos",,,,,,Não aplicável.,Não aplicável.,FALSE
Aquisição de Reagentes Não Dependentes de Equipamento,Ajuste Direto Regime Geral,Aquisição de bens móveis,"33696500-0, Reagentes de laboratório","Centro Hospitalar Tondela-Viseu, E. P. E. (509822940)",Vidrolab2 (501450629),"11.374,76 €",18-05-2015,10-11-2014,1 dias,"Portugal, Viseu, Viseu","Artigo 20.º, n.º 1, alínea a) do Código dos Contratos Públicos",,,,,,Não aplicável.,Não aplicável.,FALSE
BATERIAS PARA UPS,Ajuste Direto Regime Geral,Aquisição de bens móveis,"31440000-2, Baterias","Centro Hospitalar Tondela-Viseu, E. P. E. (509822940)","SCHNEIDER ELECTRIC PORTUGAL, LDA (500281858)","15.750,00 €",15-05-2015,23-04-2015,13 dias,"Portugal, Viseu, Viseu","Artigo 20.º, n.º 1, alínea a) do Código dos Contratos Públicos",,,,,,Não aplicável.,Não aplicável.,FALSE
ERTAPENEM 1G IV INJ AMP,Ajuste Direto Regime Geral,Aquisição de bens móveis,"33600000-6, Produtos farmacêuticos","Centro Hospitalar Tondela-Viseu, E. P. E. (509822940)","MERCK,SHARP & DOHME, LDA (500191360)","198.896,96 €",13-05-2015,13-05-2015,1 dias,"Portugal, Viseu, Viseu","Artigo 26.º, n.º 1, alínea e) do Código dos Contratos Públicos",,,,,,Não aplicável.,Não aplicável.,FALSE
PRODUTOS DE IMPORTAÇÃO (ETIOPHARMA),Ajuste Direto Regime Geral,Aquisição de bens móveis,"33600000-6, Produtos farmacêuticos","Centro Hospitalar Tondela-Viseu, E. P. E. (509822940)",ETIOPHARMA S.A. (509393357),"74.677,90 €",12-05-2015,17-03-2015,1 dias,"Portugal, Viseu, Viseu","Artigo 24.º, n.º 1, alínea c) do Código dos Contratos Públicos",,,,,,Não aplicável.,Não aplicável.,FALSE
PRODUTOS DE IMPORTAÇÃO (WEPHARMA),Ajuste Direto Regime Geral,Aquisição de bens móveis,"33600000-6, Produtos farmacêuticos","Centro Hospitalar Tondela-Viseu, E. P. E. (509822940)",WE PHARMA LIMITED (944893866),"17.320,00 €",12-05-2015,06-02-2015,1 dias,"Portugal, Viseu, Viseu","Artigo 24.º, n.º 1, alínea c) do Código dos Contratos Públicos",,,,,,Não aplicável.,Não aplicável.,FALSE
"PRODUTO DE IMPORTAÇÃO (BLUEMED UNIPESSOAL,LDA)",Ajuste Direto Regime Geral,Aquisição de bens móveis,"33600000-6, Produtos farmacêuticos","Centro Hospitalar Tondela-Viseu, E. P. E. (509822940)","BLUEMED UNIPESSOAL, LDA. (509912060)","6.145,00 €",12-05-2015,10-02-2015,1 dias,"Portugal, Viseu, Viseu","Artigo 24.º, n.º 1, alínea c) do Código dos Contratos Públicos",,,,,,Não aplicável.,Não aplicável.,FALSE
BENDAMUSTINA 25MG AMP,Ajuste Direto Regime Geral,Aquisição de bens móveis,"33600000-6, Produtos farmacêuticos","Centro Hospitalar Tondela-Viseu, E. P. E. (509822940)",CPH-COMPANHIA PORTUGESA DE HIGIENE PHARMA (500069190),"6.766,65 €",12-05-2015,30-04-2015,1 dias,"Portugal, Viseu, Viseu","Artigo 24.º, n.º 1, alínea e) do Código dos Contratos Públicos",,,,,,Não aplicável.,Não aplicável.,FALSE
NEOMICINA PREDNISOLONA SULFACETAMIDA POM.OFT BISN / OXITETRACICLINA 1% POM.OFT BISN,Ajuste Direto Regime Geral,Aquisição de bens móveis,"33600000-6, Produtos farmacêuticos","Centro Hospitalar Tondela-Viseu, E. P. E. (509822940)","LABORATORIO EDOL, LDA (507072642)","20.306,08 €",12-05-2015,28-04-2015,1 dias,"Portugal, Viseu, Viseu","Artigo 26.º, n.º 1, alínea e) do Código dos Contratos Públicos",,,,,,Não aplicável.,Não aplicável.,FALSE
IPRATROPIO 500MCG E SALBUTAMOL 2.5MG SOL.NEBUL AMP,Ajuste Direto Regime Geral,Aquisição de bens móveis,"33600000-6, Produtos farmacêuticos","Centro Hospitalar Tondela-Viseu, E. P. E. (509822940)","TEVA PHARMA, LDA (507045491)","33.682,26 €",12-05-2015,27-04-2015,1 dias,"Portugal, Viseu, Viseu","Artigo 26.º, n.º 1, alínea e) do Código dos Contratos Públicos",,,,,,Não aplicável.,Não aplicável.,FALSE
TAMOXIFENO 20MG COMP,Ajuste Direto Regime Geral,Aquisição de bens móveis,"33600000-6, Produtos farmacêuticos","Centro Hospitalar Tondela-Viseu, E. P. E. (509822940)","FARMOZ, S.A. - DIVISÃO HOSPITALAR (501505334)","5.656,56 €",12-05-2015,27-04-2015,1 dias,"Portugal, Viseu, Viseu","Artigo 26.º, n.º 1, alínea e) do Código dos Contratos Públicos",,,,,,Não aplicável.,Não aplicável.,FALSE
"BICARBONATO SODIO 1,4% 500ML FR",Ajuste Direto Regime Geral,Aquisição de bens móveis,"33600000-6, Produtos farmacêuticos","Centro Hospitalar Tondela-Viseu, E. P. E. (509822940)","B.BRAUN MEDICAL, LDA (501506543)","15.004,00 €",12-05-2015,24-04-2015,1 dias,"Portugal, Viseu, Viseu","Artigo 26.º, n.º 1, alínea e) do Código dos Contratos Públicos",,,,,,Não aplicável.,Não aplicável.,FALSE
CAPSAICINA 179MG ADESIVO CUTANEO,Ajuste Direto Regime Geral,Aquisição de bens móveis,"33600000-6, Produtos farmacêuticos","Centro Hospitalar Tondela-Viseu, E. P. E. (509822940)","ASTELLAS FARMA, LDA (502540249)","19.437,44 €",12-05-2015,05-05-2015,1 dias,"Portugal, Viseu, Viseu","Artigo 26.º, n.º 1, alínea e) do Código dos Contratos Públicos",,,,,,Não aplicável.,Não aplicável.,FALSE
VITAMINAS HIDROSSOLUVEIS E LIPOSSOLUVEIS INJ AMP,Ajuste Direto Regime Geral,Aquisição de bens móveis,"33600000-6, Produtos farmacêuticos","Centro Hospitalar Tondela-Viseu, E. P. E. (509822940)","BAXTER MEDICO FARMACEUTICA,LD (503347345)","18.640,00 €",12-05-2015,24-04-2015,1 dias,"Portugal, Viseu, Viseu","Artigo 26.º, n.º 1, alínea e) do Código dos Contratos Públicos",,,,,,Não aplicável.,Não aplicável.,FALSE
IFOSFAMIDA 2G/(50ML) INJ AMP,Ajuste Direto Regime Geral,Aquisição de bens móveis,"33600000-6, Produtos farmacêuticos","Centro Hospitalar Tondela-Viseu, E. P. E. (509822940)","BAXTER MEDICO FARMACEUTICA,LD (503347345)","10.655,74 €",12-05-2015,30-04-2015,1 dias,"Portugal, Viseu, Viseu","Artigo 26.º, n.º 1, alínea e) do Código dos Contratos Públicos",,,,,,Não aplicável.,Não aplicável.,FALSE
METOTREXATO 50MG/2ML INJ AMP / VINCRISTINA 2MG/(2ML) INJ AMP,Ajuste Direto Regime Geral,Aquisição de bens móveis,"33600000-6, Produtos farmacêuticos","Centro Hospitalar Tondela-Viseu, E. P. E. (509822940)","TEVA PHARMA, LDA (507045491)","14.012,00 €",12-05-2015,24-04-2015,1 dias,"Portugal, Viseu, Viseu","Artigo 26.º, n.º 1, alínea e) do Código dos Contratos Públicos",,,,,,Não aplicável.,Não aplicável.,FALSE
CEFOTAXIMA 1G INJ AMP,Ajuste Direto Regime Geral,Aquisição de bens móveis,"33600000-6, Produtos farmacêuticos","Centro Hospitalar Tondela-Viseu, E. P. E. (509822940)",LABESFAL-LAB.ESP.FARM.ALMIRO (501169580),"6.288,20 €",12-05-2015,24-04-2015,1 dias,"Portugal, Viseu, Viseu","Artigo 26.º, n.º 1, alínea e) do Código dos Contratos Públicos",,,,,,Não aplicável.,Não aplicável.,FALSE
ETOPOSIDO 100MG/5ML INJ AMP,Ajuste Direto Regime Geral,Aquisição de bens móveis,"33600000-6, Produtos farmacêuticos","Centro Hospitalar Tondela-Viseu, E. P. E. (509822940)","SANDOZ FARMACÊUTICA,LDA (506985261)","6.960,00 €",12-05-2015,24-04-2015,1 dias,"Portugal, Viseu, Viseu","Artigo 26.º, n.º 1, alínea e) do Código dos Contratos Públicos",,,,,,Não aplicável.,Não aplicável.,FALSE
FOSAMPRENAVIR 700MG COMP,Ajuste Direto Regime Geral,Aquisição de bens móveis,"33600000-6, Produtos farmacêuticos","Centro Hospitalar Tondela-Viseu, E. P. E. (509822940)","VIIVHIV HEALTHCARE, UNIP, LDA (509117961)","75.115,91 €",12-05-2015,26-03-2015,1 dias,"Portugal, Viseu, Viseu","Artigo 26.º, n.º 1, alínea e) do Código dos Contratos Públicos",,,,,,Não aplicável.,Não aplicável.,FALSE
"ANFOTERICINA B 50MG/12,5ML LIPOSOMICA INJ AMP",Ajuste Direto Regime Geral,Aquisição de bens móveis,"33600000-6, Produtos farmacêuticos","Centro Hospitalar Tondela-Viseu, E. P. E. (509822940)","GILEAD SCIENCES, LDA (503604704)","52.024,40 €",12-05-2015,25-03-2015,1 dias,"Portugal, Viseu, Viseu","Artigo 26.º, n.º 1, alínea e) do Código dos Contratos Públicos",,,,,,Não aplicável.,Não aplicável.,FALSE
LINEZOLIDE 600MG COMP,Ajuste Direto Regime Geral,Aquisição de bens móveis,"33600000-6, Produtos farmacêuticos","Centro Hospitalar Tondela-Viseu, E. P. E. (509822940)","LABORATORIOS PFIZER,LDA (500162166)","34.772,48 €",12-05-2015,19-03-2015,1 dias,"Portugal, Viseu, Viseu","Artigo 26.º, n.º 1, alínea e) do Código dos Contratos Públicos",,,,,,Não aplicável.,Não aplicável.,FALSE
RALTEGRAVIR 400MG COMP,Ajuste Direto Regime Geral,Aquisição de bens móveis,"33600000-6, Produtos farmacêuticos","Centro Hospitalar Tondela-Viseu, E. P. E. (509822940)","MERCK,SHARP & DOHME, LDA (500191360)","42.000,00 €",12-05-2015,10-04-2015,1 dias,"Portugal, Viseu, Viseu","Artigo 26.º, n.º 1, alínea e) do Código dos Contratos Públicos",,,,,,Não aplicável.,Não aplicável.,FALSE
CEFTAZIDIMA 1G INJ AMP,Ajuste Direto Regime Geral,Aquisição de bens móveis,"33600000-6, Produtos farmacêuticos","Centro Hospitalar Tondela-Viseu, E. P. E. (509822940)",LABESFAL-LAB.ESP.FARM.ALMIRO (501169580),"6.960,00 €",12-05-2015,07-04-2015,1 dias,"Portugal, Viseu, Viseu","Artigo 26.º, n.º 1, alínea e) do Código dos Contratos Públicos",,,,,,Não aplicável.,Não aplicável.,FALSE
LAPATINIB 250 MG COMP,Ajuste Direto Regime Geral,Aquisição de bens móveis,"33600000-6, Produtos farmacêuticos","Centro Hospitalar Tondela-Viseu, E. P. E. (509822940)",GLAXO SMITH KLINE-PROD.FARMAC. (500139962),"5.620,36 €",12-05-2015,07-04-2015,1 dias,"Portugal, Viseu, Viseu","Artigo 26.º, n.º 1, alínea e) do Código dos Contratos Públicos",,,,,,Não aplicável.,Não aplicável.,FALSE
CETOROLAC 30MG/1ML IM/IV INJ AMP,Ajuste Direto Regime Geral,Aquisição de bens móveis,"33600000-6, Produtos farmacêuticos","Centro Hospitalar Tondela-Viseu, E. P. E. (509822940)","GENERIS - FARMACEUTICA, S.A. (508107997)","5.397,00 €",12-05-2015,07-04-2015,1 dias,"Portugal, Viseu, Viseu","Artigo 26.º, n.º 1, alínea e) do Código dos Contratos Públicos",,,,,,Não aplicável.,Não aplicável.,FALSE
OCTEOTRIDE 100MCG/1ML INJ AMP,Ajuste Direto Regime Geral,Aquisição de bens móveis,"33600000-6, Produtos farmacêuticos","Centro Hospitalar Tondela-Viseu, E. P. E. (509822940)",HOSPIRA PORTUGAL LDA (502918098),"11.120,00 €",12-05-2015,31-03-2015,1 dias,"Portugal, Viseu, Viseu","Artigo 24.º, n.º 1, alínea c) do Código dos Contratos Públicos",,,,,,Não aplicável.,Não aplicável.,FALSE
IMIGLUCERASE 400UI AMP,Ajuste Direto Regime Geral,Aquisição de bens móveis,"33600000-6, Produtos farmacêuticos","Centro Hospitalar Tondela-Viseu, E. P. E. (509822940)","Sanofi-Produtos Farmaceuticos,Lda (500134960)","506.682,56 €",12-05-2015,02-04-2015,1 dias,"Portugal, Viseu, Viseu","Artigo 24.º, n.º 1, alínea e) do Código dos Contratos Públicos",,,,,,Não aplicável.,Não aplicável.,FALSE
P.CONTR.P/ RESSONANCIA MAGNETICA 15ML SERINGA,Ajuste Direto Regime Geral,Aquisição de bens móveis,"33600000-6, Produtos farmacêuticos","Centro Hospitalar Tondela-Viseu, E. P. E. (509822940)","BAYER PORTUGAL, SA (500043256)","17.600,00 €",12-05-2015,26-03-2015,1 dias,"Portugal, Viseu, Viseu","Artigo 24.º, n.º 1, alínea c) do Código dos Contratos Públicos",,,,,,Não aplicável.,Não aplicável.,FALSE
INTERFERON BETA  1B 8.000.000U INJ AMP,Ajuste Direto Regime Geral,Aquisição de bens móveis,"33600000-6, Produtos farmacêuticos","Centro Hospitalar Tondela-Viseu, E. P. E. (509822940)","BAYER PORTUGAL, SA (500043256)","256.500,00 €",12-05-2015,15-04-2015,1 dias,"Portugal, Viseu, Viseu","Artigo 26.º, n.º 1, alínea e) do Código dos Contratos Públicos",,,,,,Não aplicável.,Não aplicável.,FALSE
SUGAMADEX 100MG/ML SOL INJ FRS 2ML IV AMP - Previsão anual,Ajuste Direto Regime Geral,Aquisição de bens móveis,"33600000-6, Produtos farmacêuticos","Centro Hospitalar Tondela-Viseu, E. P. E. (509822940)","MERCK,SHARP & DOHME, LDA (500191360)","233.400,00 €",12-05-2015,22-04-2015,1 dias,"Portugal, Viseu, Viseu","Artigo 26.º, n.º 1, alínea e) do Código dos Contratos Públicos",,,,,,Não aplicável.,Não aplicável.,FALSE
"INTERFERON PEGUILADO ALFA 2B - 80, 100 E 120MCG SERINGA",Ajuste Direto Regime Geral,Aquisição de bens móveis,"33600000-6, Produtos farmacêuticos","Centro Hospitalar Tondela-Viseu, E. P. E. (509822940)","MERCK,SHARP & DOHME, LDA (500191360)","38.865,20 €",12-05-2015,27-04-2015,1 dias,"Portugal, Viseu, Viseu","Artigo 26.º, n.º 1, alínea e) do Código dos Contratos Públicos",,,,,,Não aplicável.,Não aplicável.,FALSE
