Objeto do Contrato,Tipo de Procedimento,Tipo(s) de Contrato,CPVs,Entidade(s) Adjudicante(s),Entidade(s) Adjudicatária(s),Preço Contratual,Data de Publicação,Data de Celebração do Contrato,Prazo de Execução,Local de Execução,Fundamentação,Data de Fecho do Contrato,Preço Total Efetivo,Causas das Alterações ao Prazo,Causas das Alterações ao Preço,Estado,N.º registo do Acordo Quadro,Descrição do Acordo Quadro,Procedimento Centralizado
FI0088/2016- ANTIVIRICOS E ANTIFUNGICOS,Ao abrigo de acordo-quadro (art.º 259.º),Aquisição de bens móveis,"33600000-6, Produtos farmacêuticos","CHBM - Centro Hospital Barreiro Montijo, EPE (509186998)","FRESENIUS KABI PHARMA PORTUGAL, LDA (504293753)","1.486,00 €",06-04-2017,01-03-2016,365 dias,"Portugal, Setúbal, Barreiro",Artigo 259.º do Código dos Contratos Públicos,30-12-2016,"780,16 €",,Alteração de quantidades,,1422736,CP 2015/41 - ACORDO QUADRO PARA FORNECIMENTO DE MEDICAMENTOS ANTI-INFECIOSOS: ANTIVÍRICOS E ANTIFÚNGICOS ÀS INSTITUIÇÕES E SERVIÇOS DO SERVIÇO NACIONAL DE SAÚDE,FALSE
FI0088/2016- ANTIVIRICOS E ANTIFUNGICOS,Ao abrigo de acordo-quadro (art.º 259.º),Aquisição de bens móveis,"33600000-6, Produtos farmacêuticos","CHBM - Centro Hospital Barreiro Montijo, EPE (509186998)","GILEAD SCIENCES, LDA (503604704)","20.809,76 €",06-04-2017,01-03-2016,365 dias,"Portugal, Setúbal, Barreiro",Artigo 259.º do Código dos Contratos Públicos,30-12-2016,"6.503,05 €",,Alteração de quantidades,,1422736,CP 2015/41 - ACORDO QUADRO PARA FORNECIMENTO DE MEDICAMENTOS ANTI-INFECIOSOS: ANTIVÍRICOS E ANTIFÚNGICOS ÀS INSTITUIÇÕES E SERVIÇOS DO SERVIÇO NACIONAL DE SAÚDE,FALSE
FI0088/2016- ANTIVIRICOS E ANTIFUNGICOS,Ao abrigo de acordo-quadro (art.º 259.º),Aquisição de bens móveis,"33600000-6, Produtos farmacêuticos","CHBM - Centro Hospital Barreiro Montijo, EPE (509186998)",BRISTOL-MYERS SQUIBB FARM PORTUGUESA SA. (500048193),"4.342,00 €",06-04-2017,01-03-2016,365 dias,"Portugal, Setúbal, Barreiro",Artigo 259.º do Código dos Contratos Públicos,30-12-2016,"3.250,00 €",,Alteração de quantidades,,1422736,CP 2015/41 - ACORDO QUADRO PARA FORNECIMENTO DE MEDICAMENTOS ANTI-INFECIOSOS: ANTIVÍRICOS E ANTIFÚNGICOS ÀS INSTITUIÇÕES E SERVIÇOS DO SERVIÇO NACIONAL DE SAÚDE,FALSE
FI0088/2016- ANTIVIRICOS E ANTIFUNGICOS,Ao abrigo de acordo-quadro (art.º 259.º),Aquisição de bens móveis,"33600000-6, Produtos farmacêuticos","CHBM - Centro Hospital Barreiro Montijo, EPE (509186998)",Aurovitas Unipessoal Lda. (513053239),"1.250,51 €",06-04-2017,01-03-2016,365 dias,"Portugal, Setúbal, Barreiro",Artigo 259.º do Código dos Contratos Públicos,30-12-2016,"717,36 €",,Alteração de quantidades,,1422736,CP 2015/41 - ACORDO QUADRO PARA FORNECIMENTO DE MEDICAMENTOS ANTI-INFECIOSOS: ANTIVÍRICOS E ANTIFÚNGICOS ÀS INSTITUIÇÕES E SERVIÇOS DO SERVIÇO NACIONAL DE SAÚDE,FALSE
FI0088/2016- ANTIVIRICOS E ANTIFUNGICOS,Ao abrigo de acordo-quadro (art.º 259.º),Aquisição de bens móveis,"33600000-6, Produtos farmacêuticos","CHBM - Centro Hospital Barreiro Montijo, EPE (509186998)","ROCHE Farmacêutica Quimica, Lda (500233810)","8.693,48 €",06-04-2017,01-03-2016,365 dias,"Portugal, Setúbal, Barreiro",Artigo 259.º do Código dos Contratos Públicos,30-12-2016,"2.099,20 €",,Alteração de quantidades,,1422736,CP 2015/41 - ACORDO QUADRO PARA FORNECIMENTO DE MEDICAMENTOS ANTI-INFECIOSOS: ANTIVÍRICOS E ANTIFÚNGICOS ÀS INSTITUIÇÕES E SERVIÇOS DO SERVIÇO NACIONAL DE SAÚDE,FALSE
FI0088/2016- ANTIVIRICOS E ANTIFUNGICOS,Ao abrigo de acordo-quadro (art.º 259.º),Aquisição de bens móveis,"33600000-6, Produtos farmacêuticos","CHBM - Centro Hospital Barreiro Montijo, EPE (509186998)","LABORATORIOS PFIZER, LDA. (500162166)","18.072,00 €",06-04-2017,01-03-2016,365 dias,"Portugal, Setúbal, Barreiro",Artigo 259.º do Código dos Contratos Públicos,30-12-2016,"14.457,59 €",,Alteração de quantidades,,1422736,CP 2015/41 - ACORDO QUADRO PARA FORNECIMENTO DE MEDICAMENTOS ANTI-INFECIOSOS: ANTIVÍRICOS E ANTIFÚNGICOS ÀS INSTITUIÇÕES E SERVIÇOS DO SERVIÇO NACIONAL DE SAÚDE,FALSE
FI0088/2016- ANTIVIRICOS E ANTIFUNGICOS,Ao abrigo de acordo-quadro (art.º 259.º),Aquisição de bens móveis,"33600000-6, Produtos farmacêuticos","CHBM - Centro Hospital Barreiro Montijo, EPE (509186998)","HIKMA FARMACEUTICA (PORTUGAL), SA (502266791)","1.034,00 €",06-04-2017,01-03-2016,365 dias,"Portugal, Setúbal, Barreiro",Artigo 259.º do Código dos Contratos Públicos,30-12-2016,"611,00 €",,Alteração de quantidades,,1422736,CP 2015/41 - ACORDO QUADRO PARA FORNECIMENTO DE MEDICAMENTOS ANTI-INFECIOSOS: ANTIVÍRICOS E ANTIFÚNGICOS ÀS INSTITUIÇÕES E SERVIÇOS DO SERVIÇO NACIONAL DE SAÚDE,FALSE
FI0088/2016- ANTIVIRICOS E ANTIFUNGICOS,Ao abrigo de acordo-quadro (art.º 259.º),Aquisição de bens móveis,"33600000-6, Produtos farmacêuticos","CHBM - Centro Hospital Barreiro Montijo, EPE (509186998)",Glaxosmithkline (500139962),"166,06 €",06-04-2017,01-03-2016,365 dias,"Portugal, Setúbal, Barreiro",Artigo 259.º do Código dos Contratos Públicos,30-12-2016,"59,48 €",,Alteração de quantidades,,1422736,CP 2015/41 - ACORDO QUADRO PARA FORNECIMENTO DE MEDICAMENTOS ANTI-INFECIOSOS: ANTIVÍRICOS E ANTIFÚNGICOS ÀS INSTITUIÇÕES E SERVIÇOS DO SERVIÇO NACIONAL DE SAÚDE,FALSE
FI0057/2016- MEDICAMENTOS DO FORO ONCOLÓGICO II,Ao abrigo de acordo-quadro (art.º 259.º),Aquisição de bens móveis,"33600000-6, Produtos farmacêuticos","CHBM - Centro Hospital Barreiro Montijo, EPE (509186998)","TEVA PHARMA - PRODUTOS FARMACEUTICOS,LDA           (507045491)","4.740,00 €",06-04-2017,18-02-2016,365 dias,"Portugal, Setúbal, Barreiro",Artigo 259.º do Código dos Contratos Públicos,30-12-2016,"1.208,00 €",,Alteração de quantidades,,1224054,"CONCURSO PÚBLICO PARA A CELEBRAÇÃO DE CONTRATOS PÚBLICOS DE APROVISIONAMENTO PARA A ÁREA DA SAÚDE, COM VISTA AO FORNECIMENTO DE MEDICAMENTOS DO FORO ONCOLÓGICO II, ÀS INSTITUIÇÕES E SERVIÇOS DO SERVIÇO NACIONAL DE SAÚDE  ",FALSE
FI0057/2016- MEDICAMENTOS DO FORO ONCOLÓGICO II,Ao abrigo de acordo-quadro (art.º 259.º),Aquisição de bens móveis,"33600000-6, Produtos farmacêuticos","CHBM - Centro Hospital Barreiro Montijo, EPE (509186998)",BAXTER MEDICO FARMACEUTICA LDA (503347345),"14.664,91 €",06-04-2017,18-02-2016,365 dias,"Portugal, Setúbal, Barreiro",Artigo 259.º do Código dos Contratos Públicos,30-12-2016,"5.287,88 €",,Alteração de quantidades,,1224054,"CONCURSO PÚBLICO PARA A CELEBRAÇÃO DE CONTRATOS PÚBLICOS DE APROVISIONAMENTO PARA A ÁREA DA SAÚDE, COM VISTA AO FORNECIMENTO DE MEDICAMENTOS DO FORO ONCOLÓGICO II, ÀS INSTITUIÇÕES E SERVIÇOS DO SERVIÇO NACIONAL DE SAÚDE  ",FALSE
FI0056/2016- MEDICAMENTOS ANESTÉSICOS E RELAXANTES MUSCULARES,Ao abrigo de acordo-quadro (art.º 259.º),Aquisição de bens móveis,"33600000-6, Produtos farmacêuticos","CHBM - Centro Hospital Barreiro Montijo, EPE (509186998)","ABBVIE, LDA (510229050)","42.816,00 €",06-04-2017,18-02-2016,365 dias,"Portugal, Setúbal, Barreiro",Artigo 259.º do Código dos Contratos Públicos,30-12-2016,"32.112,00 €",,Alteração de quantidades,,611371,"CONCURSO PÚBLICO PARA A CELEBRAÇÃO DE CONTRATOS PÚBLICOS DE APROVISIONAMENTO PARA A ÁREA DA SAÚDE, COM VISTA AO FORNECIMENTO DE MEDICAMENTOS ANESTÉSICOS E RELAXANTES MUSCULARES, ÀS INSTITUIÇÕES E SERVIÇOS DO SERVIÇO NACIONAL DE SAÚDE    ",FALSE
FI0056/2016- MEDICAMENTOS ANESTÉSICOS E RELAXANTES MUSCULARES,Ao abrigo de acordo-quadro (art.º 259.º),Aquisição de bens móveis,"33600000-6, Produtos farmacêuticos","CHBM - Centro Hospital Barreiro Montijo, EPE (509186998)","ASTRAZENECA PRODUTOS FARMACÊUTICOS, LDA  (502942240)","7.184,00 €",06-04-2017,18-02-2016,365 dias,"Portugal, Setúbal, Barreiro",Artigo 259.º do Código dos Contratos Públicos,30-12-2016,"4.166,73 €",,Alteração de quantidades,,611371,"CONCURSO PÚBLICO PARA A CELEBRAÇÃO DE CONTRATOS PÚBLICOS DE APROVISIONAMENTO PARA A ÁREA DA SAÚDE, COM VISTA AO FORNECIMENTO DE MEDICAMENTOS ANESTÉSICOS E RELAXANTES MUSCULARES, ÀS INSTITUIÇÕES E SERVIÇOS DO SERVIÇO NACIONAL DE SAÚDE    ",FALSE
FI0056/2016- MEDICAMENTOS ANESTÉSICOS E RELAXANTES MUSCULARES,Ao abrigo de acordo-quadro (art.º 259.º),Aquisição de bens móveis,"33600000-6, Produtos farmacêuticos","CHBM - Centro Hospital Barreiro Montijo, EPE (509186998)","MERCK SHARP & DOHME, LDA   (500191360)","910,00 €",06-04-2017,18-02-2016,365 dias,"Portugal, Setúbal, Barreiro",Artigo 259.º do Código dos Contratos Públicos,30-12-2016,"2.561,00 €",,Alteração de quantidades,,611371,"CONCURSO PÚBLICO PARA A CELEBRAÇÃO DE CONTRATOS PÚBLICOS DE APROVISIONAMENTO PARA A ÁREA DA SAÚDE, COM VISTA AO FORNECIMENTO DE MEDICAMENTOS ANESTÉSICOS E RELAXANTES MUSCULARES, ÀS INSTITUIÇÕES E SERVIÇOS DO SERVIÇO NACIONAL DE SAÚDE    ",FALSE
FI0056/2016- MEDICAMENTOS ANESTÉSICOS E RELAXANTES MUSCULARES,Ao abrigo de acordo-quadro (art.º 259.º),Aquisição de bens móveis,"33600000-6, Produtos farmacêuticos","CHBM - Centro Hospital Barreiro Montijo, EPE (509186998)","Novartis Farma - Produtos Farmacêuticos, SA (500063524)","174,50 €",06-04-2017,18-02-2016,365 dias,"Portugal, Setúbal, Barreiro",Artigo 259.º do Código dos Contratos Públicos,30-12-2016,"104,75 €",,Alteração de quantidades,,611371,"CONCURSO PÚBLICO PARA A CELEBRAÇÃO DE CONTRATOS PÚBLICOS DE APROVISIONAMENTO PARA A ÁREA DA SAÚDE, COM VISTA AO FORNECIMENTO DE MEDICAMENTOS ANESTÉSICOS E RELAXANTES MUSCULARES, ÀS INSTITUIÇÕES E SERVIÇOS DO SERVIÇO NACIONAL DE SAÚDE    ",FALSE
FI0056/2016- MEDICAMENTOS ANESTÉSICOS E RELAXANTES MUSCULARES,Ao abrigo de acordo-quadro (art.º 259.º),Aquisição de bens móveis,"33600000-6, Produtos farmacêuticos","CHBM - Centro Hospital Barreiro Montijo, EPE (509186998)",INIBSA (500139571),"453,00 €",06-04-2017,18-02-2016,365 dias,"Portugal, Setúbal, Barreiro",Artigo 259.º do Código dos Contratos Públicos,30-12-2016,"362,40 €",,Alteração de quantidades,,611371,"CONCURSO PÚBLICO PARA A CELEBRAÇÃO DE CONTRATOS PÚBLICOS DE APROVISIONAMENTO PARA A ÁREA DA SAÚDE, COM VISTA AO FORNECIMENTO DE MEDICAMENTOS ANESTÉSICOS E RELAXANTES MUSCULARES, ÀS INSTITUIÇÕES E SERVIÇOS DO SERVIÇO NACIONAL DE SAÚDE    ",FALSE
FI0056/2016- MEDICAMENTOS ANESTÉSICOS E RELAXANTES MUSCULARES,Ao abrigo de acordo-quadro (art.º 259.º),Aquisição de bens móveis,"33600000-6, Produtos farmacêuticos","CHBM - Centro Hospital Barreiro Montijo, EPE (509186998)",Labesfal (501169580),"14.553,90 €",06-04-2017,18-02-2016,365 dias,"Portugal, Setúbal, Barreiro",Artigo 259.º do Código dos Contratos Públicos,30-12-2016,"10.968,00 €",,Alteração de quantidades,,611371,"CONCURSO PÚBLICO PARA A CELEBRAÇÃO DE CONTRATOS PÚBLICOS DE APROVISIONAMENTO PARA A ÁREA DA SAÚDE, COM VISTA AO FORNECIMENTO DE MEDICAMENTOS ANESTÉSICOS E RELAXANTES MUSCULARES, ÀS INSTITUIÇÕES E SERVIÇOS DO SERVIÇO NACIONAL DE SAÚDE    ",FALSE
FEXC0069/2016 - LAB. TAKEDA,Ajuste Direto Regime Geral,Aquisição de bens móveis,"33600000-6, Produtos farmacêuticos","Centro Hospitalar Barreiro Montijo, E. P. E. (509186998)","TAKEDA - FARMACÊUTICOS PORTUGAL, LDA (502801204)","13.019,52 €",06-04-2017,21-01-2016,365 dias,"Portugal, Setúbal, Barreiro","Artigo 24.º, n.º 1, alínea e) do Código dos Contratos Públicos",31-12-2016,"14.078,00 €",,ALTERAÇÃO QUANTIDADES,,Não aplicável.,Não aplicável.,FALSE
FI0056/2016- MEDICAMENTOS ANESTÉSICOS E RELAXANTES MUSCULARES,Ao abrigo de acordo-quadro (art.º 259.º),Aquisição de bens móveis,"33600000-6, Produtos farmacêuticos","CHBM - Centro Hospital Barreiro Montijo, EPE (509186998)","HIKMA FARMACEUTICA, LDA. (502266791)","312,00 €",06-04-2017,18-02-2016,365 dias,"Portugal, Setúbal, Barreiro",Artigo 259.º do Código dos Contratos Públicos,30-12-2016,"780,00 €",,Alteração de quantidades,,611371,"CONCURSO PÚBLICO PARA A CELEBRAÇÃO DE CONTRATOS PÚBLICOS DE APROVISIONAMENTO PARA A ÁREA DA SAÚDE, COM VISTA AO FORNECIMENTO DE MEDICAMENTOS ANESTÉSICOS E RELAXANTES MUSCULARES, ÀS INSTITUIÇÕES E SERVIÇOS DO SERVIÇO NACIONAL DE SAÚDE    ",FALSE
FI0056/2016- MEDICAMENTOS ANESTÉSICOS E RELAXANTES MUSCULARES,Ao abrigo de acordo-quadro (art.º 259.º),Aquisição de bens móveis,"33600000-6, Produtos farmacêuticos","CHBM - Centro Hospital Barreiro Montijo, EPE (509186998)","GRUNENTHAL, SA (500101965)","3.328,50 €",06-04-2017,18-02-2016,365 dias,"Portugal, Setúbal, Barreiro",Artigo 259.º do Código dos Contratos Públicos,30-12-2016,"798,85 €",,Alteração de quantidades,,611371,"CONCURSO PÚBLICO PARA A CELEBRAÇÃO DE CONTRATOS PÚBLICOS DE APROVISIONAMENTO PARA A ÁREA DA SAÚDE, COM VISTA AO FORNECIMENTO DE MEDICAMENTOS ANESTÉSICOS E RELAXANTES MUSCULARES, ÀS INSTITUIÇÕES E SERVIÇOS DO SERVIÇO NACIONAL DE SAÚDE    ",FALSE
FI0056/2016- MEDICAMENTOS ANESTÉSICOS E RELAXANTES MUSCULARES,Ao abrigo de acordo-quadro (art.º 259.º),Aquisição de bens móveis,"33600000-6, Produtos farmacêuticos","CHBM - Centro Hospital Barreiro Montijo, EPE (509186998)","GENERIS FARMACÊUTICA,SA (508107997)","90,00 €",06-04-2017,18-02-2016,365 dias,"Portugal, Setúbal, Barreiro",Artigo 259.º do Código dos Contratos Públicos,30-12-2016,"",,Não existiu  necessidade de aquisição.,,611371,"CONCURSO PÚBLICO PARA A CELEBRAÇÃO DE CONTRATOS PÚBLICOS DE APROVISIONAMENTO PARA A ÁREA DA SAÚDE, COM VISTA AO FORNECIMENTO DE MEDICAMENTOS ANESTÉSICOS E RELAXANTES MUSCULARES, ÀS INSTITUIÇÕES E SERVIÇOS DO SERVIÇO NACIONAL DE SAÚDE    ",FALSE
FI0056/2016- MEDICAMENTOS ANESTÉSICOS E RELAXANTES MUSCULARES,Ao abrigo de acordo-quadro (art.º 259.º),Aquisição de bens móveis,"33600000-6, Produtos farmacêuticos","CHBM - Centro Hospital Barreiro Montijo, EPE (509186998)","FRESENIUS KABI PHARMA PORTUGAL, LDA (504293753)","15.609,00 €",06-04-2017,18-02-2016,365 dias,"Portugal, Setúbal, Barreiro",Artigo 259.º do Código dos Contratos Públicos,30-12-2016,"11.960,93 €",,Alteração de quantidades,,611371,"CONCURSO PÚBLICO PARA A CELEBRAÇÃO DE CONTRATOS PÚBLICOS DE APROVISIONAMENTO PARA A ÁREA DA SAÚDE, COM VISTA AO FORNECIMENTO DE MEDICAMENTOS ANESTÉSICOS E RELAXANTES MUSCULARES, ÀS INSTITUIÇÕES E SERVIÇOS DO SERVIÇO NACIONAL DE SAÚDE    ",FALSE
FI0056/2016- MEDICAMENTOS ANESTÉSICOS E RELAXANTES MUSCULARES,Ao abrigo de acordo-quadro (art.º 259.º),Aquisição de bens móveis,"33600000-6, Produtos farmacêuticos","CHBM - Centro Hospital Barreiro Montijo, EPE (509186998)","SANOFI - PRODUTOS FARMACÊUTICOS, LDA. (500134960)","4.120,20 €",06-04-2017,18-02-2016,365 dias,"Portugal, Setúbal, Barreiro",Artigo 259.º do Código dos Contratos Públicos,30-12-2016,"4.117,68 €",,Alteração de quantidades,,611371,"CONCURSO PÚBLICO PARA A CELEBRAÇÃO DE CONTRATOS PÚBLICOS DE APROVISIONAMENTO PARA A ÁREA DA SAÚDE, COM VISTA AO FORNECIMENTO DE MEDICAMENTOS ANESTÉSICOS E RELAXANTES MUSCULARES, ÀS INSTITUIÇÕES E SERVIÇOS DO SERVIÇO NACIONAL DE SAÚDE    ",FALSE
FI0056/2016- MEDICAMENTOS ANESTÉSICOS E RELAXANTES MUSCULARES,Ao abrigo de acordo-quadro (art.º 259.º),Aquisição de bens móveis,"33600000-6, Produtos farmacêuticos","CHBM - Centro Hospital Barreiro Montijo, EPE (509186998)",OVERPHARMA (505792362),"6.975,00 €",06-04-2017,18-02-2016,365 dias,"Portugal, Setúbal, Barreiro",Artigo 259.º do Código dos Contratos Públicos,30-12-2016,"3.565,00 €",,Alteração de quantidades,,611371,"CONCURSO PÚBLICO PARA A CELEBRAÇÃO DE CONTRATOS PÚBLICOS DE APROVISIONAMENTO PARA A ÁREA DA SAÚDE, COM VISTA AO FORNECIMENTO DE MEDICAMENTOS ANESTÉSICOS E RELAXANTES MUSCULARES, ÀS INSTITUIÇÕES E SERVIÇOS DO SERVIÇO NACIONAL DE SAÚDE    ",FALSE
FI0056/2016- MEDICAMENTOS ANESTÉSICOS E RELAXANTES MUSCULARES,Ao abrigo de acordo-quadro (art.º 259.º),Aquisição de bens móveis,"33600000-6, Produtos farmacêuticos","CHBM - Centro Hospital Barreiro Montijo, EPE (509186998)","B. BRAUN MEDICAL, LDA (501506543)","784,50 €",06-04-2017,18-02-2016,365 dias,"Portugal, Setúbal, Barreiro",Artigo 259.º do Código dos Contratos Públicos,30-12-2016,"657,50 €",,Alteração de quantidades,,611371,"CONCURSO PÚBLICO PARA A CELEBRAÇÃO DE CONTRATOS PÚBLICOS DE APROVISIONAMENTO PARA A ÁREA DA SAÚDE, COM VISTA AO FORNECIMENTO DE MEDICAMENTOS ANESTÉSICOS E RELAXANTES MUSCULARES, ÀS INSTITUIÇÕES E SERVIÇOS DO SERVIÇO NACIONAL DE SAÚDE    ",FALSE
FI0024/2016- MEDICAMENTOS DISPOSITIVOS MÉDICOS DIVERSOS,Ao abrigo de acordo-quadro (art.º 259.º),Aquisição de bens móveis,"33600000-6, Produtos farmacêuticos","CHBM - Centro Hospital Barreiro Montijo, EPE (509186998)",Alcon Portugal (501251685),"1.571,70 €",06-04-2017,14-03-2016,365 dias,"Portugal, Setúbal, Barreiro",Artigo 259.º do Código dos Contratos Públicos,30-12-2016,"1.450,79 €",,Alteração de quantidades,,1415642,CP 2015/36,FALSE
FI0024/2016- MEDICAMENTOS DISPOSITIVOS MÉDICOS DIVERSOS,Ao abrigo de acordo-quadro (art.º 259.º),Aquisição de bens móveis,"33600000-6, Produtos farmacêuticos","CHBM - Centro Hospital Barreiro Montijo, EPE (509186998)","CLINIFAR-PRODUTOS CLINICOS E FARMACEUTICOS, SA (503281115)","9.210,00 €",06-04-2017,14-03-2016,365 dias,"Portugal, Setúbal, Barreiro",Artigo 259.º do Código dos Contratos Públicos,30-12-2016,"10.770,00 €",,Alteração de quantidades,,1415642,CP 2015/36,FALSE
FI0023/2016- MED. CONTRACETIVOS ORAIS PROFILÁTICOS E MECÂNICOS,Ao abrigo de acordo-quadro (art.º 259.º),Aquisição de bens móveis,"33600000-6, Produtos farmacêuticos","CHBM - Centro Hospital Barreiro Montijo, EPE (509186998)","MERCK SHARP & DOHME, LDA   (500191360)","8.980,00 €",06-04-2017,26-02-2016,365 dias,"Portugal, Setúbal, Barreiro",Artigo 259.º do Código dos Contratos Públicos,30-12-2016,"8.471,70 €",,Alteração de quiantidades,,1459323,CP 2015/20,FALSE
FI0023/2016- MED. CONTRACETIVOS ORAIS PROFILÁTICOS E MECÂNICOS,Ao abrigo de acordo-quadro (art.º 259.º),Aquisição de bens móveis,"33600000-6, Produtos farmacêuticos","CHBM - Centro Hospital Barreiro Montijo, EPE (509186998)","BAYER PORTUGAL, LDA (500043256)","4.594,50 €",06-04-2017,26-02-2016,365 dias,"Portugal, Setúbal, Barreiro",Artigo 259.º do Código dos Contratos Públicos,30-12-2016,"1.837,79 €",,Alteração de quantidades,,1459323,CP 2015/20,FALSE
FI0023/2016- MED. CONTRACETIVOS ORAIS PROFILÁTICOS E MECÂNICOS,Ao abrigo de acordo-quadro (art.º 259.º),Aquisição de bens móveis,"33600000-6, Produtos farmacêuticos","CHBM - Centro Hospital Barreiro Montijo, EPE (509186998)","CLINIFAR-PRODUTOS CLINICOS E FARMACEUTICOS, SA (503281115)","307,50 €",06-04-2017,26-02-2016,365 dias,"Portugal, Setúbal, Barreiro",Artigo 259.º do Código dos Contratos Públicos,30-12-2016,"153,75 €",,Alteração de quantidades,,1459323,CP 2015/20,FALSE
FI0023/2016- MED. CONTRACETIVOS ORAIS PROFILÁTICOS E MECÂNICOS,Ao abrigo de acordo-quadro (art.º 259.º),Aquisição de bens móveis,"33600000-6, Produtos farmacêuticos","CHBM - Centro Hospital Barreiro Montijo, EPE (509186998)","LABORATORIOS PFIZER, LDA. (500162166)","15,90 €",06-04-2017,26-02-2016,365 dias,"Portugal, Setúbal, Barreiro",Artigo 259.º do Código dos Contratos Públicos,30-12-2016,"",,Não existiu necessidade de aquisição.,,1459323,CP 2015/20,FALSE
FI0023/2016- MED. CONTRACETIVOS ORAIS PROFILÁTICOS E MECÂNICOS,Ao abrigo de acordo-quadro (art.º 259.º),Aquisição de bens móveis,"33600000-6, Produtos farmacêuticos","CHBM - Centro Hospital Barreiro Montijo, EPE (509186998)",LOGIFARMA (503934640),"89,00 €",06-04-2017,26-02-2016,365 dias,"Portugal, Setúbal, Barreiro",Artigo 259.º do Código dos Contratos Públicos,30-12-2016,"",,Não existiu necessidade de aquisição.,,1459323,CP 2015/20,FALSE
110019/2016 - Reagentes para Microbiologia com colocação de equipamentos para o ano 2016,Concurso público,Aquisição de bens móveis,"33696500-0, Reagentes de laboratório","Centro Hospitalar Barreiro Montijo, E. P. E. (509186998)","BIO-RAD LABORATORIES, LDA. (501301321)","10.088,16 €",06-04-2017,24-02-2016,365 dias,"Portugal, Setúbal, Barreiro","Artigo 20.º, n.º 1, alínea b) do Código dos Contratos Públicos",31-12-2016,"7.865,50 €",,Necessidade inferior à previsão,,Não aplicável.,Não aplicável.,FALSE
FEXC0042/2016 - SOL SUPERSATURADA DE FOSFATO DE CÁLCIO,Ajuste Direto Regime Geral,Aquisição de bens móveis,"33600000-6, Produtos farmacêuticos","CHBM - Centro Hospital Barreiro Montijo, EPE (509186998)","EUSA PHARMA, UK LIMITED (980532981)","16.250,00 €",06-04-2017,01-02-2016,365 dias,"Portugal, Setúbal, Barreiro","Artigo 24.º, n.º 1, alínea e) do Código dos Contratos Públicos",31-12-2016,"15.750,00 €",,ALTERAÇÃO QUANTIDADES,,Não aplicável.,Não aplicável.,FALSE
"C.P. 110023/2016 - Aquisição de Reagentes para Bioquímica/Imunoquímica, com colocação de equipamentos para o período de 2016 a 2018",Concurso público,Aquisição de bens móveis,"33696500-0, Reagentes de laboratório","Centro Hospitalar Barreiro Montijo, E. P. E. (509186998)","Abbott Laboratórios, Lda. (500006148)","238.343,49 €",06-04-2017,23-03-2016,365 dias,"Portugal, Setúbal, Barreiro","Artigo 22.º, n.º 1, alínea a) do Código dos Contratos Públicos","","",,"",,Não aplicável.,Não aplicável.,FALSE
FI0019/2017- MEDICAMENTOS ANTIPSICÓTICOS,Ao abrigo de acordo-quadro (art.º 259.º),Aquisição de bens móveis,"33600000-6, Produtos farmacêuticos","CHBM - Centro Hospital Barreiro Montijo, EPE (509186998)",PROFARIN (500223238),"164,77 €",05-04-2017,26-02-2016,365 dias,"Portugal, Setúbal, Barreiro",Artigo 259.º do Código dos Contratos Públicos,30-12-2016,"214,91 €",,Alteração de quantidades,,1153380,"CONCURSO PÚBLICO PARA A CELEBRAÇÃO DE CONTRATOS PÚBLICOS DE APROVISIONAMENTO PARA A ÁREA DA SAÚDE, COM VISTA AO FORNECIMENTO DE MEDICAMENTOS ANTIPSICÓTICOS, ÀS INSTITUIÇÕES E SERVIÇOS DO SERVIÇO NACIONAL DE SAÚDE",FALSE
FI0019/2017- MEDICAMENTOS ANTIPSICÓTICOS,Ao abrigo de acordo-quadro (art.º 259.º),Aquisição de bens móveis,"33600000-6, Produtos farmacêuticos","CHBM - Centro Hospital Barreiro Montijo, EPE (509186998)","TEVA PHARMA - PRODUTOS FARMACEUTICOS,LDA           (507045491)","133,38 €",05-04-2017,26-02-2016,365 dias,"Portugal, Setúbal, Barreiro",Artigo 259.º do Código dos Contratos Públicos,30-12-2016,"133,38 €",,"",,1153380,"CONCURSO PÚBLICO PARA A CELEBRAÇÃO DE CONTRATOS PÚBLICOS DE APROVISIONAMENTO PARA A ÁREA DA SAÚDE, COM VISTA AO FORNECIMENTO DE MEDICAMENTOS ANTIPSICÓTICOS, ÀS INSTITUIÇÕES E SERVIÇOS DO SERVIÇO NACIONAL DE SAÚDE",FALSE
FI0019/2017- MEDICAMENTOS ANTIPSICÓTICOS,Ao abrigo de acordo-quadro (art.º 259.º),Aquisição de bens móveis,"33600000-6, Produtos farmacêuticos","CHBM - Centro Hospital Barreiro Montijo, EPE (509186998)","PHARMAKERN PORTUGAL, PROD. FARM. SOC. UNIP.LDA (507002571)","253,50 €",05-04-2017,26-02-2016,365 dias,"Portugal, Setúbal, Barreiro",Artigo 259.º do Código dos Contratos Públicos,30-12-2016,"194,35 €",,Alteração de quantidades,,1153380,"CONCURSO PÚBLICO PARA A CELEBRAÇÃO DE CONTRATOS PÚBLICOS DE APROVISIONAMENTO PARA A ÁREA DA SAÚDE, COM VISTA AO FORNECIMENTO DE MEDICAMENTOS ANTIPSICÓTICOS, ÀS INSTITUIÇÕES E SERVIÇOS DO SERVIÇO NACIONAL DE SAÚDE",FALSE
FI0019/2017- MEDICAMENTOS ANTIPSICÓTICOS,Ao abrigo de acordo-quadro (art.º 259.º),Aquisição de bens móveis,"33600000-6, Produtos farmacêuticos","CHBM - Centro Hospital Barreiro Montijo, EPE (509186998)","PHARMIS BIOFARMACEUTICA, LDA. (502595442)","31.203,20 €",05-04-2017,26-02-2016,365 dias,"Portugal, Setúbal, Barreiro",Artigo 259.º do Código dos Contratos Públicos,30-12-2016,"14.487,22 €",,Alteração de quantidades,,1153380,"CONCURSO PÚBLICO PARA A CELEBRAÇÃO DE CONTRATOS PÚBLICOS DE APROVISIONAMENTO PARA A ÁREA DA SAÚDE, COM VISTA AO FORNECIMENTO DE MEDICAMENTOS ANTIPSICÓTICOS, ÀS INSTITUIÇÕES E SERVIÇOS DO SERVIÇO NACIONAL DE SAÚDE",FALSE
FI0019/2017- MEDICAMENTOS ANTIPSICÓTICOS,Ao abrigo de acordo-quadro (art.º 259.º),Aquisição de bens móveis,"33600000-6, Produtos farmacêuticos","CHBM - Centro Hospital Barreiro Montijo, EPE (509186998)","LABESFAL-LABORATORIOS ALMIRO, SA (501169580)","1.095,45 €",05-04-2017,26-02-2016,365 dias,"Portugal, Setúbal, Barreiro",Artigo 259.º do Código dos Contratos Públicos,30-12-2016,"560,86 €",,Alteração de quantidades,,1153380,"CONCURSO PÚBLICO PARA A CELEBRAÇÃO DE CONTRATOS PÚBLICOS DE APROVISIONAMENTO PARA A ÁREA DA SAÚDE, COM VISTA AO FORNECIMENTO DE MEDICAMENTOS ANTIPSICÓTICOS, ÀS INSTITUIÇÕES E SERVIÇOS DO SERVIÇO NACIONAL DE SAÚDE",FALSE
FI0019/2017- MEDICAMENTOS ANTIPSICÓTICOS,Ao abrigo de acordo-quadro (art.º 259.º),Aquisição de bens móveis,"33600000-6, Produtos farmacêuticos","CHBM - Centro Hospital Barreiro Montijo, EPE (509186998)",LUNDBECK PORTUGAL (503573922),"3.629,50 €",05-04-2017,26-02-2016,365 dias,"Portugal, Setúbal, Barreiro",Artigo 259.º do Código dos Contratos Públicos,30-12-2016,"4.163,25 €",,Alteração de quantidades,,1153380,"CONCURSO PÚBLICO PARA A CELEBRAÇÃO DE CONTRATOS PÚBLICOS DE APROVISIONAMENTO PARA A ÁREA DA SAÚDE, COM VISTA AO FORNECIMENTO DE MEDICAMENTOS ANTIPSICÓTICOS, ÀS INSTITUIÇÕES E SERVIÇOS DO SERVIÇO NACIONAL DE SAÚDE",FALSE
FI0019/2017- MEDICAMENTOS ANTIPSICÓTICOS,Ao abrigo de acordo-quadro (art.º 259.º),Aquisição de bens móveis,"33600000-6, Produtos farmacêuticos","CHBM - Centro Hospital Barreiro Montijo, EPE (509186998)","JANSSEN-CILAG Farmacêutica, Lda. (500189412)","67.278,26 €",05-04-2017,26-02-2016,365 dias,"Portugal, Setúbal, Barreiro",Artigo 259.º do Código dos Contratos Públicos,30-12-2016,"26.208,39 €",,Alteração de quantidades,,1153380,"CONCURSO PÚBLICO PARA A CELEBRAÇÃO DE CONTRATOS PÚBLICOS DE APROVISIONAMENTO PARA A ÁREA DA SAÚDE, COM VISTA AO FORNECIMENTO DE MEDICAMENTOS ANTIPSICÓTICOS, ÀS INSTITUIÇÕES E SERVIÇOS DO SERVIÇO NACIONAL DE SAÚDE",FALSE
FI0019/2017- MEDICAMENTOS ANTIPSICÓTICOS,Ao abrigo de acordo-quadro (art.º 259.º),Aquisição de bens móveis,"33600000-6, Produtos farmacêuticos","CHBM - Centro Hospital Barreiro Montijo, EPE (509186998)",Generis Farmacêutica S.A. (508107997),"3.269,20 €",05-04-2017,26-02-2016,365 dias,"Portugal, Setúbal, Barreiro",Artigo 259.º do Código dos Contratos Públicos,30-12-2016,"772,92 €",,Alteração de quantidades,,1153380,"CONCURSO PÚBLICO PARA A CELEBRAÇÃO DE CONTRATOS PÚBLICOS DE APROVISIONAMENTO PARA A ÁREA DA SAÚDE, COM VISTA AO FORNECIMENTO DE MEDICAMENTOS ANTIPSICÓTICOS, ÀS INSTITUIÇÕES E SERVIÇOS DO SERVIÇO NACIONAL DE SAÚDE",FALSE
FI0019/2017- MEDICAMENTOS ANTIPSICÓTICOS,Ao abrigo de acordo-quadro (art.º 259.º),Aquisição de bens móveis,"33600000-6, Produtos farmacêuticos","CHBM - Centro Hospital Barreiro Montijo, EPE (509186998)",Aurovitas Unipessoal Lda. (513053239),"2.960,45 €",05-04-2017,26-02-2016,365 dias,"Portugal, Setúbal, Barreiro",Artigo 259.º do Código dos Contratos Públicos,30-12-2016,"1.502,80 €",,Alteração de quantidades,,1153380,"CONCURSO PÚBLICO PARA A CELEBRAÇÃO DE CONTRATOS PÚBLICOS DE APROVISIONAMENTO PARA A ÁREA DA SAÚDE, COM VISTA AO FORNECIMENTO DE MEDICAMENTOS ANTIPSICÓTICOS, ÀS INSTITUIÇÕES E SERVIÇOS DO SERVIÇO NACIONAL DE SAÚDE",FALSE
FI0019/2017- MEDICAMENTOS ANTIPSICÓTICOS,Ao abrigo de acordo-quadro (art.º 259.º),Aquisição de bens móveis,"33600000-6, Produtos farmacêuticos","CHBM - Centro Hospital Barreiro Montijo, EPE (509186998)",BRISTOL-MYERS SQUIB FARMAC PORTUGUESA SA (500048193),"5.805,00 €",05-04-2017,26-02-2016,365 dias,"Portugal, Setúbal, Barreiro",Artigo 259.º do Código dos Contratos Públicos,30-12-2016,"2.580,00 €",,Alteração de quantidades,,1153380,"CONCURSO PÚBLICO PARA A CELEBRAÇÃO DE CONTRATOS PÚBLICOS DE APROVISIONAMENTO PARA A ÁREA DA SAÚDE, COM VISTA AO FORNECIMENTO DE MEDICAMENTOS ANTIPSICÓTICOS, ÀS INSTITUIÇÕES E SERVIÇOS DO SERVIÇO NACIONAL DE SAÚDE",FALSE
"FI0014/2016- MED. ANTI-INFECIOSOS, EXCETO ANTIVIRICOS E ANTIFUNGICOS",Ao abrigo de acordo-quadro (art.º 259.º),Aquisição de bens móveis,"33600000-6, Produtos farmacêuticos","CHBM - Centro Hospital Barreiro Montijo, EPE (509186998)","FARMOZ-SOC.TECNICO MEDICINAL, SA (501505334)","3.325,00 €",05-04-2017,17-03-2016,365 dias,"Portugal, Setúbal, Barreiro",Artigo 259.º do Código dos Contratos Públicos,30-12-2016,"4.750,00 €",,Alteração de quantidades,,1326195,ACORDO QUADRO PARA FORNECIMENTO DE MEDICAMENTOS ANTI-INFECIOSOS: EXCETO ANTIVÍRICOS E ANTIFÚNGICOS ÀS INSTITUIÇÕES E SERVIÇOS DO SERVIÇO NACIONAL DE SAÚDE,FALSE
"FI0014/2016- MED. ANTI-INFECIOSOS, EXCETO ANTIVIRICOS E ANTIFUNGICOS ",Ao abrigo de acordo-quadro (art.º 259.º),Aquisição de bens móveis,"33600000-6, Produtos farmacêuticos","CHBM - Centro Hospital Barreiro Montijo, EPE (509186998)",BRISTOL-MYERS SQUIB FARMAC PORTUGUESA SA (500048193),"200,20 €",05-04-2017,17-03-2016,365 dias,"Portugal, Setúbal, Barreiro",Artigo 259.º do Código dos Contratos Públicos,30-12-2016,"",,Não existiu necessidade de aquisição,,1326195,ACORDO QUADRO PARA FORNECIMENTO DE MEDICAMENTOS ANTI-INFECIOSOS: EXCETO ANTIVÍRICOS E ANTIFÚNGICOS ÀS INSTITUIÇÕES E SERVIÇOS DO SERVIÇO NACIONAL DE SAÚDE,FALSE
"FI0014/2016- MED. ANTI-INFECIOSOS, EXCETO ANTIVIRICOS E ANTIFUNGICOS ",Ao abrigo de acordo-quadro (art.º 259.º),Aquisição de bens móveis,"33600000-6, Produtos farmacêuticos","CHBM - Centro Hospital Barreiro Montijo, EPE (509186998)",Aurovitas Unipessoal Lda. (513053239),"971,00 €",05-04-2017,17-03-2016,365 dias,"Portugal, Setúbal, Barreiro",Artigo 259.º do Código dos Contratos Públicos,30-12-2016,"2.676,40 €",,Alteração de quantidades,,1326195,ACORDO QUADRO PARA FORNECIMENTO DE MEDICAMENTOS ANTI-INFECIOSOS: EXCETO ANTIVÍRICOS E ANTIFÚNGICOS ÀS INSTITUIÇÕES E SERVIÇOS DO SERVIÇO NACIONAL DE SAÚDE,FALSE
"FI0014/2016- MED. ANTI-INFECIOSOS, EXCETO ANTIVIRICOS E ANTIFÚNGICOS",Ao abrigo de acordo-quadro (art.º 259.º),Aquisição de bens móveis,"33600000-6, Produtos farmacêuticos","CHBM - Centro Hospital Barreiro Montijo, EPE (509186998)",Fresenius Kabi Pharma Portugal (504293753),"55.774,50 €",05-04-2017,17-03-2016,365 dias,"Portugal, Setúbal, Barreiro",Artigo 259.º do Código dos Contratos Públicos,30-12-2016,"45.256,90 €",,Alteração de quantidades,,1326195,ACORDO QUADRO PARA FORNECIMENTO DE MEDICAMENTOS ANTI-INFECIOSOS: EXCETO ANTIVÍRICOS E ANTIFÚNGICOS ÀS INSTITUIÇÕES E SERVIÇOS DO SERVIÇO NACIONAL DE SAÚDE,FALSE
"FI0014/2016- MED. ANTI-INFECIOSOS, EXCETO ANTIVIRICOS E ANTIFÚNGICOS",Ao abrigo de acordo-quadro (art.º 259.º),Aquisição de bens móveis,"33600000-6, Produtos farmacêuticos","CHBM - Centro Hospital Barreiro Montijo, EPE (509186998)",Generis Farmacêutica S.A. (508107997),"59.255,15 €",05-04-2017,17-03-2016,365 dias,"Portugal, Setúbal, Barreiro",Artigo 259.º do Código dos Contratos Públicos,30-12-2016,"24.822,24 €",,Alteração de quantidades,,1326195,ACORDO QUADRO PARA FORNECIMENTO DE MEDICAMENTOS ANTI-INFECIOSOS: EXCETO ANTIVÍRICOS E ANTIFÚNGICOS ÀS INSTITUIÇÕES E SERVIÇOS DO SERVIÇO NACIONAL DE SAÚDE,FALSE
"FI0014/2016- MED. ANTI-INFECIOSOS, EXCETO ANTIVIRICOS E ANTIFÚNGICOS",Ao abrigo de acordo-quadro (art.º 259.º),Aquisição de bens móveis,"33600000-6, Produtos farmacêuticos","CHBM - Centro Hospital Barreiro Montijo, EPE (509186998)","HOSPIRA PORTUGAL, LDA (502918098)","1.455,00 €",05-04-2017,17-03-2016,365 dias,"Portugal, Setúbal, Barreiro",Artigo 259.º do Código dos Contratos Públicos,30-12-2016,"582,00 €",,Alteração de quantidades,,1326195,ACORDO QUADRO PARA FORNECIMENTO DE MEDICAMENTOS ANTI-INFECIOSOS: EXCETO ANTIVÍRICOS E ANTIFÚNGICOS ÀS INSTITUIÇÕES E SERVIÇOS DO SERVIÇO NACIONAL DE SAÚDE,FALSE
"FI0014/2016- MED. ANTI-INFECIOSOS, EXCETO ANTIVIRICOS E ANTIFÚNGICOS",Ao abrigo de acordo-quadro (art.º 259.º),Aquisição de bens móveis,"33600000-6, Produtos farmacêuticos","CHBM - Centro Hospital Barreiro Montijo, EPE (509186998)","HIKMA FARMACEUTICA, LDA. (502266791)","17.679,70 €",05-04-2017,17-03-2016,365 dias,"Portugal, Setúbal, Barreiro",Artigo 259.º do Código dos Contratos Públicos,30-12-2016,"16.456,20 €",,Alteração de quantidades,,1326195,ACORDO QUADRO PARA FORNECIMENTO DE MEDICAMENTOS ANTI-INFECIOSOS: EXCETO ANTIVÍRICOS E ANTIFÚNGICOS ÀS INSTITUIÇÕES E SERVIÇOS DO SERVIÇO NACIONAL DE SAÚDE,FALSE
"FI0014/2016- MED. ANTI-INFECIOSOS, EXCETO ANTIVIRICOS E ANTIFÚNGICOS",Ao abrigo de acordo-quadro (art.º 259.º),Aquisição de bens móveis,"33600000-6, Produtos farmacêuticos","CHBM - Centro Hospital Barreiro Montijo, EPE (509186998)","LABESFAL-LABORATORIOS ALMIRO, SA (501169580)","33.953,12 €",05-04-2017,17-03-2016,365 dias,"Portugal, Setúbal, Barreiro",Artigo 259.º do Código dos Contratos Públicos,30-12-2016,"19.012,14 €",,Alteração de quantidades,,1326195,ACORDO QUADRO PARA FORNECIMENTO DE MEDICAMENTOS ANTI-INFECIOSOS: EXCETO ANTIVÍRICOS E ANTIFÚNGICOS ÀS INSTITUIÇÕES E SERVIÇOS DO SERVIÇO NACIONAL DE SAÚDE,FALSE
"FI0014/2016- MED. ANTI-INFECIOSOS, EXCETO ANTIVIRICOS E ANTIFÚNGICOS",Ao abrigo de acordo-quadro (art.º 259.º),Aquisição de bens móveis,"33600000-6, Produtos farmacêuticos","CHBM - Centro Hospital Barreiro Montijo, EPE (509186998)",LABORATORIOS ATRAL S.A. (500162085),"3.892,93 €",05-04-2017,17-03-2016,365 dias,"Portugal, Setúbal, Barreiro",Artigo 259.º do Código dos Contratos Públicos,30-12-2016,"1.919,06 €",,Alteração de quantidades,,1326195,ACORDO QUADRO PARA FORNECIMENTO DE MEDICAMENTOS ANTI-INFECIOSOS: EXCETO ANTIVÍRICOS E ANTIFÚNGICOS ÀS INSTITUIÇÕES E SERVIÇOS DO SERVIÇO NACIONAL DE SAÚDE,FALSE
"FI0014/2016- MED. ANTI-INFECIOSOS, EXCETO ANTIVIRICOS E ANTIFÚNGICOS",Ao abrigo de acordo-quadro (art.º 259.º),Aquisição de bens móveis,"33600000-6, Produtos farmacêuticos","CHBM - Centro Hospital Barreiro Montijo, EPE (509186998)","LABORATORIOS NORMON, SA (505654156)","40.602,00 €",05-04-2017,17-03-2016,365 dias,"Portugal, Setúbal, Barreiro",Artigo 259.º do Código dos Contratos Públicos,30-12-2016,"29.604,00 €",,Alteração de quantidades,,1326195,ACORDO QUADRO PARA FORNECIMENTO DE MEDICAMENTOS ANTI-INFECIOSOS: EXCETO ANTIVÍRICOS E ANTIFÚNGICOS ÀS INSTITUIÇÕES E SERVIÇOS DO SERVIÇO NACIONAL DE SAÚDE,FALSE
"FI0014/2016- MED. ANTI-INFECIOSOS, EXCETO ANTIVIRICOS E ANTIFÚNGICOS",Ao abrigo de acordo-quadro (art.º 259.º),Aquisição de bens móveis,"33600000-6, Produtos farmacêuticos","CHBM - Centro Hospital Barreiro Montijo, EPE (509186998)",Merck Sharp & Dohme (500191360),"64.520,00 €",05-04-2017,17-03-2016,365 dias,"Portugal, Setúbal, Barreiro",Artigo 259.º do Código dos Contratos Públicos,30-12-2016,"57.637,60 €",,Alteração de quantidades,,1326195,ACORDO QUADRO PARA FORNECIMENTO DE MEDICAMENTOS ANTI-INFECIOSOS: EXCETO ANTIVÍRICOS E ANTIFÚNGICOS ÀS INSTITUIÇÕES E SERVIÇOS DO SERVIÇO NACIONAL DE SAÚDE,FALSE
"FI0014/2016- MED. ANTI-INFECIOSOS, EXCETO ANTIVIRICOS E ANTIFÚNGICOS",Ao abrigo de acordo-quadro (art.º 259.º),Aquisição de bens móveis,"33600000-6, Produtos farmacêuticos","CHBM - Centro Hospital Barreiro Montijo, EPE (509186998)","LABORATORIOS PFIZER, LDA. (500162166)","122,20 €",05-04-2017,17-03-2016,365 dias,"Portugal, Setúbal, Barreiro",Artigo 259.º do Código dos Contratos Públicos,30-12-2016,"87,40 €",,Alteração de quantidades,,1326195,ACORDO QUADRO PARA FORNECIMENTO DE MEDICAMENTOS ANTI-INFECIOSOS: EXCETO ANTIVÍRICOS E ANTIFÚNGICOS ÀS INSTITUIÇÕES E SERVIÇOS DO SERVIÇO NACIONAL DE SAÚDE,FALSE
"FI0014/2016- MED. ANTI-INFECIOSOS, EXCETO ANTIVIRICOS E ANTIFÚNGICOS",Ao abrigo de acordo-quadro (art.º 259.º),Aquisição de bens móveis,"33600000-6, Produtos farmacêuticos","CHBM - Centro Hospital Barreiro Montijo, EPE (509186998)","Novartis Farma - Produtos Farmacêuticos, S.A. (500063524)","49.540,52 €",05-04-2017,17-03-2016,365 dias,"Portugal, Setúbal, Barreiro",Artigo 259.º do Código dos Contratos Públicos,30-12-2016,"7.343,68 €",,Alteração de quantidades,,1326195,ACORDO QUADRO PARA FORNECIMENTO DE MEDICAMENTOS ANTI-INFECIOSOS: EXCETO ANTIVÍRICOS E ANTIFÚNGICOS ÀS INSTITUIÇÕES E SERVIÇOS DO SERVIÇO NACIONAL DE SAÚDE,FALSE
"FI0014/2016- MED. ANTI-INFECIOSOS, EXCETO ANTIVIRICOS E ANTIFÚNGICOS",Ao abrigo de acordo-quadro (art.º 259.º),Aquisição de bens móveis,"33600000-6, Produtos farmacêuticos","CHBM - Centro Hospital Barreiro Montijo, EPE (509186998)","GLAXOSMITHKLINE-PROD. FARMACÊUTICOS, LDA.          (500139962)","415,76 €",05-04-2017,17-03-2016,365 dias,"Portugal, Setúbal, Barreiro",Artigo 259.º do Código dos Contratos Públicos,30-12-2016,"",,Não existiu necessidade de aquisição,,1326195,ACORDO QUADRO PARA FORNECIMENTO DE MEDICAMENTOS ANTI-INFECIOSOS: EXCETO ANTIVÍRICOS E ANTIFÚNGICOS ÀS INSTITUIÇÕES E SERVIÇOS DO SERVIÇO NACIONAL DE SAÚDE,FALSE
"FI0014/2016- MED. ANTI-INFECIOSOS, EXCETO ANTIVIRICOS E ANTIFÚNGICOS",Ao abrigo de acordo-quadro (art.º 259.º),Aquisição de bens móveis,"33600000-6, Produtos farmacêuticos","CHBM - Centro Hospital Barreiro Montijo, EPE (509186998)","Ratiopharm - Com. Ind. Prod. Farmacêuticos, Lda (502414910)","7.279,00 €",05-04-2017,17-03-2016,365 dias,"Portugal, Setúbal, Barreiro",Artigo 259.º do Código dos Contratos Públicos,17-03-2016,"2.922,81 €",,Alteração de quantidades,,1326195,ACORDO QUADRO PARA FORNECIMENTO DE MEDICAMENTOS ANTI-INFECIOSOS: EXCETO ANTIVÍRICOS E ANTIFÚNGICOS ÀS INSTITUIÇÕES E SERVIÇOS DO SERVIÇO NACIONAL DE SAÚDE,FALSE
4EXC0021/2017 TUBO DE RX AMPOLA P O TAC,Ajuste Direto Regime Geral,Aquisição de bens móveis,"33000000-0, Equipamento médico, medicamentos e produtos para cuidados pessoais","Centro Hospitalar Barreiro Montijo, E. P. E. (509186998)","SIEMENS HEALTHCARE DIAGNOSTICS, UNIPESSOAL, LDA. (507925173)","60.000,00 €",05-04-2017,24-03-2017,20 dias,"Portugal, Setúbal, Barreiro","Artigo 24.º, n.º 1, alínea e) do Código dos Contratos Públicos",03-04-2017,"60.000,00 €",,"",,Não aplicável.,Não aplicável.,FALSE
"FI0014/2016- MED. ANTI-INFECIOSOS, EXCETO ANTIVIRICOS E ANTIFÚNGICOS",Ao abrigo de acordo-quadro (art.º 259.º),Aquisição de bens móveis,"33600000-6, Produtos farmacêuticos","CHBM - Centro Hospital Barreiro Montijo, EPE (509186998)","OVERPHARMA - PROD. MÉDICOS E FARMACÊUTICOS, LDA. (505792362)","4.461,02 €",05-04-2017,17-03-2016,365 dias,"Portugal, Setúbal, Barreiro",Artigo 259.º do Código dos Contratos Públicos,30-12-2016,"4.603,15 €",,Alteração de quantidades,,1326195,ACORDO QUADRO PARA FORNECIMENTO DE MEDICAMENTOS ANTI-INFECIOSOS: EXCETO ANTIVÍRICOS E ANTIFÚNGICOS ÀS INSTITUIÇÕES E SERVIÇOS DO SERVIÇO NACIONAL DE SAÚDE,FALSE
"FI0014/2016- MED. ANTI-INFECIOSOS, EXCETO ANTIVIRICOS E ANTIFÚNGICOS",Ao abrigo de acordo-quadro (art.º 259.º),Aquisição de bens móveis,"33600000-6, Produtos farmacêuticos","CHBM - Centro Hospital Barreiro Montijo, EPE (509186998)","ROCHE FARMACEUTICA QUIMICA, LDA (500233810)","17,85 €",05-04-2017,17-03-2016,365 dias,"Portugal, Setúbal, Barreiro",Artigo 259.º do Código dos Contratos Públicos,30-12-2016,"",,Não existiu necessidade de aquisição.,,1326195,ACORDO QUADRO PARA FORNECIMENTO DE MEDICAMENTOS ANTI-INFECIOSOS: EXCETO ANTIVÍRICOS E ANTIFÚNGICOS ÀS INSTITUIÇÕES E SERVIÇOS DO SERVIÇO NACIONAL DE SAÚDE,FALSE
"FI0014/2016- MED. ANTI-INFECIOSOS, EXCETO ANTIVIRICOS E ANTIFÚNGICOS",Ao abrigo de acordo-quadro (art.º 259.º),Aquisição de bens móveis,"33600000-6, Produtos farmacêuticos","CHBM - Centro Hospital Barreiro Montijo, EPE (509186998)",Sanofi Produtos Farmacêuticos (500134960),"1.761,85 €",05-04-2017,17-03-2016,365 dias,"Portugal, Setúbal, Barreiro",Artigo 259.º do Código dos Contratos Públicos,30-12-2016,"651,04 €",,Alteração de quantidades,,1326195,ACORDO QUADRO PARA FORNECIMENTO DE MEDICAMENTOS ANTI-INFECIOSOS: EXCETO ANTIVÍRICOS E ANTIFÚNGICOS ÀS INSTITUIÇÕES E SERVIÇOS DO SERVIÇO NACIONAL DE SAÚDE,FALSE
"4I0003/2017 AGULHA DESCARTAVEL 0,8X25 21G",Ao abrigo de acordo-quadro (art.º 259.º),Aquisição de bens móveis,"33000000-0, Equipamento médico, medicamentos e produtos para cuidados pessoais","Centro Hospitalar Barreiro Montijo, E. P. E. (509186998)","OVERPHARMA - PROD. MÉDICOS E FARMACÊUTICOS, LDA. (505792362)","43,00 €",05-04-2017,27-03-2017,20 dias,"Portugal, Setúbal, Barreiro",Artigo 259.º do Código dos Contratos Públicos,27-03-2017,"43,00 €",,"",,1341769,"ACORDO QUADRO PARA FORNECIMENTO DE SERINGAS, AGULHAS E CONTENTORES ÀS INSTITUIÇÕES E SERVIÇOS DO SERVIÇO NACIONAL DE SAÚDE PROGRAMA DE CONCURSO",FALSE
"FI0014/2016- MED. ANTI-INFECIOSOS, EXCETO ANTIVIRICOS E ANTIFÚNGICOS",Ao abrigo de acordo-quadro (art.º 259.º),Aquisição de bens móveis,"33600000-6, Produtos farmacêuticos","CHBM - Centro Hospital Barreiro Montijo, EPE (509186998)",DLA FARMACEUTICA SA                                (503894427),"171,07 €",05-04-2017,17-03-2016,365 dias,"Portugal, Setúbal, Barreiro",Artigo 259.º do Código dos Contratos Públicos,30-12-2016,"171,07 €",,"",,1326195,ACORDO QUADRO PARA FORNECIMENTO DE MEDICAMENTOS ANTI-INFECIOSOS: EXCETO ANTIVÍRICOS E ANTIFÚNGICOS ÀS INSTITUIÇÕES E SERVIÇOS DO SERVIÇO NACIONAL DE SAÚDE,FALSE
"FI0014/2016- MED. ANTI-INFECIOSOS, EXCETO ANTIVIRICOS E ANTIFÚNGICOS",Ao abrigo de acordo-quadro (art.º 259.º),Aquisição de bens móveis,"33600000-6, Produtos farmacêuticos","CHBM - Centro Hospital Barreiro Montijo, EPE (509186998)","SIDEFARMA-SOC. IND. EXPANSÃO FARMACEUTICA, SA (500717419)","518,00 €",05-04-2017,15-03-2016,365 dias,"Portugal, Setúbal, Barreiro",Artigo 259.º do Código dos Contratos Públicos,30-12-2016,"463,60 €",,Alteração de quantidades,,1326195,ACORDO QUADRO PARA FORNECIMENTO DE MEDICAMENTOS ANTI-INFECIOSOS: EXCETO ANTIVÍRICOS E ANTIFÚNGICOS ÀS INSTITUIÇÕES E SERVIÇOS DO SERVIÇO NACIONAL DE SAÚDE,FALSE
FI0010/2016- GASES MEDICINAIS E OUTROS,Ao abrigo de acordo-quadro (art.º 259.º),Aquisição de bens móveis,"33600000-6, Produtos farmacêuticos","CHBM - Centro Hospital Barreiro Montijo, EPE (509186998)","Linde Portugal, Lda. (500266344)","2.160,00 €",05-04-2017,18-02-2016,365 dias,"Portugal, Setúbal, Barreiro",Artigo 259.º do Código dos Contratos Públicos,30-12-2016,"2.160,00 €",,"",,575230,"CONCURSO PÚBLICO PARA A CELEBRAÇÃO DE CONTRATOS PÚBLICOS DE APROVISIONAMENTO PARA A ÁREA DA SAÚDE, COM VISTA AO FORNECIMENTO DE MATERIAL DE GASES MEDICINAIS E OUTROS ÀS INSTITUIÇÕES E SERVIÇOS DO SERVIÇO NACIONAL DE SAÚDE",FALSE
40070/2017 MACAS,Ajuste Direto Regime Geral,Aquisição de bens móveis,"33000000-0, Equipamento médico, medicamentos e produtos para cuidados pessoais","Centro Hospitalar Barreiro Montijo, E. P. E. (509186998)","STRYKER PORTUGAL PRODUTOS MÉDICOS, LDA. (504594214)","13.300,00 €",05-04-2017,08-02-2017,30 dias,"Portugal, Setúbal, Barreiro","Artigo 20.º, n.º 1, alínea a) do Código dos Contratos Públicos",01-03-2017,"13.300,00 €",,"",,Não aplicável.,Não aplicável.,FALSE
FI0010/2016- GASES MEDICINAIS E OUTROS,Ao abrigo de acordo-quadro (art.º 259.º),Aquisição de bens móveis,"33600000-6, Produtos farmacêuticos","CHBM - Centro Hospital Barreiro Montijo, EPE (509186998)","LINDE PORTUGAL, LDA  (500266344)","218.063,07 €",04-04-2017,18-02-2016,365 dias,"Portugal, Setúbal, Barreiro",Artigo 259.º do Código dos Contratos Públicos,30-12-2016,"161.781,32 €",,Alteração de quantidades,,575230,"CONCURSO PÚBLICO PARA A CELEBRAÇÃO DE CONTRATOS PÚBLICOS DE APROVISIONAMENTO PARA A ÁREA DA SAÚDE, COM VISTA AO FORNECIMENTO DE MATERIAL DE GASES MEDICINAIS E OUTROS ÀS INSTITUIÇÕES E SERVIÇOS DO SERVIÇO NACIONAL DE SAÚDE",FALSE
FI0011/2016- MED. NUTRIÇÃO PARENTÉRICA,Ao abrigo de acordo-quadro (art.º 259.º),Aquisição de bens móveis,"33600000-6, Produtos farmacêuticos","CHBM - Centro Hospital Barreiro Montijo, EPE (509186998)","FRESENIUS KABI PHARMA PORTUGAL,LDA (504293753)","126.631,26 €",04-04-2017,25-02-2016,365 dias,"Portugal, Setúbal, Barreiro",Artigo 259.º do Código dos Contratos Públicos,30-12-2016,"54.654,73 €",,Alteração de quantidades,,1377429,Acordo Quadro para fornecimento de medicamentos para Nutrição Parentérica às Instituições e Serviços do Serviço Nacional de Saúde,FALSE
FI0011/2016- MED. NUTRIÇÃO PARENTÉRICA,Ao abrigo de acordo-quadro (art.º 259.º),Aquisição de bens móveis,"33600000-6, Produtos farmacêuticos","CHBM - Centro Hospital Barreiro Montijo, EPE (509186998)","LABESFAL-LABORATORIOS ALMIRO, SA (501169580)","8.400,00 €",04-04-2017,25-02-2016,365 dias,"Portugal, Setúbal, Barreiro",Artigo 259.º do Código dos Contratos Públicos,30-12-2016,"8.190,00 €",,Alteração de quantidades,,1377429,Acordo Quadro para fornecimento de medicamentos para Nutrição Parentérica às Instituições e Serviços do Serviço Nacional de Saúde,FALSE
FI0011/2016- MED. NUTRIÇÃO PARENTÉRICA,Ao abrigo de acordo-quadro (art.º 259.º),Aquisição de bens móveis,"33600000-6, Produtos farmacêuticos","CHBM - Centro Hospital Barreiro Montijo, EPE (509186998)","B. Braun Medical, Lda (501506543)","418,80 €",04-04-2017,25-02-2016,365 dias,"Portugal, Setúbal, Barreiro",Artigo 259.º do Código dos Contratos Públicos,30-12-2016,"809,90 €",,Alteração de quantidades,,1377429,Acordo Quadro para fornecimento de medicamentos para Nutrição Parentérica às Instituições e Serviços do Serviço Nacional de Saúde,FALSE
FI0011/2016- MED. NUTRIÇÃO PARENTÉRICA,Ao abrigo de acordo-quadro (art.º 259.º),Aquisição de bens móveis,"33600000-6, Produtos farmacêuticos","CHBM - Centro Hospital Barreiro Montijo, EPE (509186998)","BAXTER MEDICO - FARMACÊUTICA, LDA (503347345)","28.263,60 €",04-04-2017,25-02-2016,365 dias,"Portugal, Setúbal, Barreiro",Artigo 259.º do Código dos Contratos Públicos,30-12-2016,"10.580,20 €",,Alteração de quantidades,,1377429,Acordo Quadro para fornecimento de medicamentos para Nutrição Parentérica às Instituições e Serviços do Serviço Nacional de Saúde,FALSE
FI0008/2016- MED. DO APARELHO CARDIOVASCULAR,Ao abrigo de acordo-quadro (art.º 259.º),Aquisição de bens móveis,"33600000-6, Produtos farmacêuticos","CHBM - Centro Hospital Barreiro Montijo, EPE (509186998)","GENERIS FARMACÊUTICA,SA   (508107997)","598,28 €",04-04-2017,19-02-2016,365 dias,"Portugal, Setúbal, Barreiro",Artigo 259.º do Código dos Contratos Públicos,30-12-2016,"1.762,78 €",,Alteração de quantidades,,1179915,"CONCURSO PÚBLICO PARA A CELEBRAÇÃO DE CONTRATOS PÚBLICOS DE APROVISIONAMENTO PARA A ÁREA DA SAÚDE, COM VISTA AO FORNECIMENTO DE MEDICAMENTOS DO APARELHO CARDIOVASCULAR, ÀS INSTITUIÇÕES E SERVIÇOS DO SERVIÇO NACIONAL DE SAÚDE",FALSE
FI0008/2016- MED. DO APARELHO CARDIOVASCULAR,Ao abrigo de acordo-quadro (art.º 259.º),Aquisição de bens móveis,"33600000-6, Produtos farmacêuticos","CHBM - Centro Hospital Barreiro Montijo, EPE (509186998)","LABESFAL-LABORATORIOS ALMIRO, SA (501169580)","19.346,22 €",04-04-2017,19-02-2016,365 dias,"Portugal, Setúbal, Barreiro",Artigo 259.º do Código dos Contratos Públicos,30-12-2016,"14.557,82 €",,Alteração de quantidades,,1179915,"CONCURSO PÚBLICO PARA A CELEBRAÇÃO DE CONTRATOS PÚBLICOS DE APROVISIONAMENTO PARA A ÁREA DA SAÚDE, COM VISTA AO FORNECIMENTO DE MEDICAMENTOS DO APARELHO CARDIOVASCULAR, ÀS INSTITUIÇÕES E SERVIÇOS DO SERVIÇO NACIONAL DE SAÚDE",FALSE
FI0008/2016- MED. DO APARELHO CARDIOVASCULAR,Ao abrigo de acordo-quadro (art.º 259.º),Aquisição de bens móveis,"33600000-6, Produtos farmacêuticos","CHBM - Centro Hospital Barreiro Montijo, EPE (509186998)","LABORATORIO PFIZER,LDA (500162166)","693,94 €",04-04-2017,19-02-2016,365 dias,"Portugal, Setúbal, Barreiro",Artigo 259.º do Código dos Contratos Públicos,30-12-2016,"527,04 €",,Alteração de quantidades,,1179915,"CONCURSO PÚBLICO PARA A CELEBRAÇÃO DE CONTRATOS PÚBLICOS DE APROVISIONAMENTO PARA A ÁREA DA SAÚDE, COM VISTA AO FORNECIMENTO DE MEDICAMENTOS DO APARELHO CARDIOVASCULAR, ÀS INSTITUIÇÕES E SERVIÇOS DO SERVIÇO NACIONAL DE SAÚDE",FALSE
FI0008/2016- MED. DO APARELHO CARDIOVASCULAR,Ao abrigo de acordo-quadro (art.º 259.º),Aquisição de bens móveis,"33600000-6, Produtos farmacêuticos","CHBM - Centro Hospital Barreiro Montijo, EPE (509186998)","HIKMA FARMACEUTICA (PORTUGAL), SA (502266791)","5.116,50 €",04-04-2017,19-02-2016,365 dias,"Portugal, Setúbal, Barreiro",Artigo 259.º do Código dos Contratos Públicos,30-12-2016,"2.994,09 €",,Alteração de quantidades,,1179915,"CONCURSO PÚBLICO PARA A CELEBRAÇÃO DE CONTRATOS PÚBLICOS DE APROVISIONAMENTO PARA A ÁREA DA SAÚDE, COM VISTA AO FORNECIMENTO DE MEDICAMENTOS DO APARELHO CARDIOVASCULAR, ÀS INSTITUIÇÕES E SERVIÇOS DO SERVIÇO NACIONAL DE SAÚDE",FALSE
FI0008/2016- MED. DO APARELHO CARDIOVASCULAR,Ao abrigo de acordo-quadro (art.º 259.º),Aquisição de bens móveis,"33600000-6, Produtos farmacêuticos","CHBM - Centro Hospital Barreiro Montijo, EPE (509186998)","FARMOZ-SOC.TECNICO MEDICINAL, SA (501505334)","277,59 €",04-04-2017,19-02-2016,365 dias,"Portugal, Setúbal, Barreiro",Artigo 259.º do Código dos Contratos Públicos,30-12-2016,"252,72 €",,Alteração de quantidades,,1179915,"CONCURSO PÚBLICO PARA A CELEBRAÇÃO DE CONTRATOS PÚBLICOS DE APROVISIONAMENTO PARA A ÁREA DA SAÚDE, COM VISTA AO FORNECIMENTO DE MEDICAMENTOS DO APARELHO CARDIOVASCULAR, ÀS INSTITUIÇÕES E SERVIÇOS DO SERVIÇO NACIONAL DE SAÚDE",FALSE
FI0008/2016- MED. DO APARELHO CARDIOVASCULAR,Ao abrigo de acordo-quadro (art.º 259.º),Aquisição de bens móveis,"33600000-6, Produtos farmacêuticos","CHBM - Centro Hospital Barreiro Montijo, EPE (509186998)",Bayer Portugal S.A. (500043256),"619,34 €",04-04-2017,19-02-2016,365 dias,"Portugal, Setúbal, Barreiro",Artigo 259.º do Código dos Contratos Públicos,30-12-2016,"278,28 €",,Alteração de quantidades,,1179915,"CONCURSO PÚBLICO PARA A CELEBRAÇÃO DE CONTRATOS PÚBLICOS DE APROVISIONAMENTO PARA A ÁREA DA SAÚDE, COM VISTA AO FORNECIMENTO DE MEDICAMENTOS DO APARELHO CARDIOVASCULAR, ÀS INSTITUIÇÕES E SERVIÇOS DO SERVIÇO NACIONAL DE SAÚDE",FALSE
FI0008/2016- MED. DO APARELHO CARDIOVASCULAR,Ao abrigo de acordo-quadro (art.º 259.º),Aquisição de bens móveis,"33600000-6, Produtos farmacêuticos","CHBM - Centro Hospital Barreiro Montijo, EPE (509186998)","BAXTER MEDICO - FARMACÊUTICA, LDA (503347345)","850,00 €",04-04-2017,19-02-2016,365 dias,"Portugal, Setúbal, Barreiro",Artigo 259.º do Código dos Contratos Públicos,30-12-2016,"425,00 €",,Alteração de quantidades,,1179915,"CONCURSO PÚBLICO PARA A CELEBRAÇÃO DE CONTRATOS PÚBLICOS DE APROVISIONAMENTO PARA A ÁREA DA SAÚDE, COM VISTA AO FORNECIMENTO DE MEDICAMENTOS DO APARELHO CARDIOVASCULAR, ÀS INSTITUIÇÕES E SERVIÇOS DO SERVIÇO NACIONAL DE SAÚDE",FALSE
FI0008/2016- MED. DO APARELHO CARDIOVASCULAR,Ao abrigo de acordo-quadro (art.º 259.º),Aquisição de bens móveis,"33600000-6, Produtos farmacêuticos","CHBM - Centro Hospital Barreiro Montijo, EPE (509186998)","B. Braun Medical, Lda (501506543)","2.140,00 €",04-04-2017,19-02-2016,365 dias,"Portugal, Setúbal, Barreiro",Artigo 259.º do Código dos Contratos Públicos,30-12-2016,"1.403,59 €",,Alteração de quantidades,,1179915,"CONCURSO PÚBLICO PARA A CELEBRAÇÃO DE CONTRATOS PÚBLICOS DE APROVISIONAMENTO PARA A ÁREA DA SAÚDE, COM VISTA AO FORNECIMENTO DE MEDICAMENTOS DO APARELHO CARDIOVASCULAR, ÀS INSTITUIÇÕES E SERVIÇOS DO SERVIÇO NACIONAL DE SAÚDE",FALSE
FI0008/2016- MED. DO APARELHO CARDIOVASCULAR,Ao abrigo de acordo-quadro (art.º 259.º),Aquisição de bens móveis,"33600000-6, Produtos farmacêuticos","CHBM - Centro Hospital Barreiro Montijo, EPE (509186998)","Aurovitas, Unipessoal, Lda. (513053239)","540,16 €",04-04-2017,19-02-2016,365 dias,"Portugal, Setúbal, Barreiro",Artigo 259.º do Código dos Contratos Públicos,30-12-2016,"534,90 €",,Alteração de quantidades,,1179915,"CONCURSO PÚBLICO PARA A CELEBRAÇÃO DE CONTRATOS PÚBLICOS DE APROVISIONAMENTO PARA A ÁREA DA SAÚDE, COM VISTA AO FORNECIMENTO DE MEDICAMENTOS DO APARELHO CARDIOVASCULAR, ÀS INSTITUIÇÕES E SERVIÇOS DO SERVIÇO NACIONAL DE SAÚDE",FALSE
FI0008/2016- MED. DO APARELHO CARDIOVASCULAR,Ao abrigo de acordo-quadro (art.º 259.º),Aquisição de bens móveis,"33600000-6, Produtos farmacêuticos","CHBM - Centro Hospital Barreiro Montijo, EPE (509186998)","ASTRAZENECA Produtos Farmacêuticos, Lda (502942240)","11.795,92 €",04-04-2017,19-02-2016,365 dias,"Portugal, Setúbal, Barreiro",Artigo 259.º do Código dos Contratos Públicos,30-12-2016,"6.929,98 €",,Alteração de quantidades,,1179915,"CONCURSO PÚBLICO PARA A CELEBRAÇÃO DE CONTRATOS PÚBLICOS DE APROVISIONAMENTO PARA A ÁREA DA SAÚDE, COM VISTA AO FORNECIMENTO DE MEDICAMENTOS DO APARELHO CARDIOVASCULAR, ÀS INSTITUIÇÕES E SERVIÇOS DO SERVIÇO NACIONAL DE SAÚDE",FALSE
FI0008/2016- MED. DO APARELHO CARDIOVASCULAR,Ao abrigo de acordo-quadro (art.º 259.º),Aquisição de bens móveis,"33600000-6, Produtos farmacêuticos","CHBM - Centro Hospital Barreiro Montijo, EPE (509186998)","TEVA PHARMA - PRODUTOS FARMACEUTICOS,LDA           (507045491)","567,00 €",04-04-2017,19-02-2016,365 dias,"Portugal, Setúbal, Barreiro",Artigo 259.º do Código dos Contratos Públicos,30-12-2016,"283,50 €",,Alteração de quantidades,,1179915,"CONCURSO PÚBLICO PARA A CELEBRAÇÃO DE CONTRATOS PÚBLICOS DE APROVISIONAMENTO PARA A ÁREA DA SAÚDE, COM VISTA AO FORNECIMENTO DE MEDICAMENTOS DO APARELHO CARDIOVASCULAR, ÀS INSTITUIÇÕES E SERVIÇOS DO SERVIÇO NACIONAL DE SAÚDE",FALSE
FI0008/2016- MED. DO APARELHO CARDIOVASCULAR,Ao abrigo de acordo-quadro (art.º 259.º),Aquisição de bens móveis,"33600000-6, Produtos farmacêuticos","CHBM - Centro Hospital Barreiro Montijo, EPE (509186998)",SIDEFARMA SOC IND EXP FARMAC                    (500717419),"1.520,00 €",04-04-2017,19-02-2016,365 dias,"Portugal, Setúbal, Barreiro",Artigo 259.º do Código dos Contratos Públicos,30-12-2016,"380,00 €",,Alterações de quantidades,,1179915,"CONCURSO PÚBLICO PARA A CELEBRAÇÃO DE CONTRATOS PÚBLICOS DE APROVISIONAMENTO PARA A ÁREA DA SAÚDE, COM VISTA AO FORNECIMENTO DE MEDICAMENTOS DO APARELHO CARDIOVASCULAR, ÀS INSTITUIÇÕES E SERVIÇOS DO SERVIÇO NACIONAL DE SAÚDE",FALSE
FI0008/2016- MED. DO APARELHO CARDIOVASCULAR,Ao abrigo de acordo-quadro (art.º 259.º),Aquisição de bens móveis,"33600000-6, Produtos farmacêuticos","CHBM - Centro Hospital Barreiro Montijo, EPE (509186998)","LAB. MEDINFAR, SA.                                 (500384045)","1.357,20 €",04-04-2017,19-02-2016,365 dias,"Portugal, Setúbal, Barreiro",Artigo 259.º do Código dos Contratos Públicos,30-12-2016,"275,00 €",,Alteração de quantidades,,1179915,"CONCURSO PÚBLICO PARA A CELEBRAÇÃO DE CONTRATOS PÚBLICOS DE APROVISIONAMENTO PARA A ÁREA DA SAÚDE, COM VISTA AO FORNECIMENTO DE MEDICAMENTOS DO APARELHO CARDIOVASCULAR, ÀS INSTITUIÇÕES E SERVIÇOS DO SERVIÇO NACIONAL DE SAÚDE",FALSE
FI0008/2016- MED. DO APARELHO CARDIOVASCULAR,Ao abrigo de acordo-quadro (art.º 259.º),Aquisição de bens móveis,"33600000-6, Produtos farmacêuticos","CHBM - Centro Hospital Barreiro Montijo, EPE (509186998)",OVERPHARMA (505792362),"1.959,35 €",04-04-2017,19-02-2016,365 dias,"Portugal, Setúbal, Barreiro",Artigo 259.º do Código dos Contratos Públicos,30-12-2016,"1.354,96 €",,Alteração de quantidades,,1179915,"CONCURSO PÚBLICO PARA A CELEBRAÇÃO DE CONTRATOS PÚBLICOS DE APROVISIONAMENTO PARA A ÁREA DA SAÚDE, COM VISTA AO FORNECIMENTO DE MEDICAMENTOS DO APARELHO CARDIOVASCULAR, ÀS INSTITUIÇÕES E SERVIÇOS DO SERVIÇO NACIONAL DE SAÚDE",FALSE
FI0008/2016- MED. DO APARELHO CARDIOVASCULAR,Ao abrigo de acordo-quadro (art.º 259.º),Aquisição de bens móveis,"33600000-6, Produtos farmacêuticos","CHBM - Centro Hospital Barreiro Montijo, EPE (509186998)","Pharmakern Portugal - Prod.Farmacêuticos, Unip.,Lda (507002571)","208,50 €",04-04-2017,19-02-2016,365 dias,"Portugal, Setúbal, Barreiro",Artigo 259.º do Código dos Contratos Públicos,30-12-2016,"175,13 €",,Alteração de quantidades,,1179915,"CONCURSO PÚBLICO PARA A CELEBRAÇÃO DE CONTRATOS PÚBLICOS DE APROVISIONAMENTO PARA A ÁREA DA SAÚDE, COM VISTA AO FORNECIMENTO DE MEDICAMENTOS DO APARELHO CARDIOVASCULAR, ÀS INSTITUIÇÕES E SERVIÇOS DO SERVIÇO NACIONAL DE SAÚDE",FALSE
FI0008/2016- MED. DO APARELHO CARDIOVASCULAR,Ao abrigo de acordo-quadro (art.º 259.º),Aquisição de bens móveis,"33600000-6, Produtos farmacêuticos","CHBM - Centro Hospital Barreiro Montijo, EPE (509186998)","SANOFI - Produtos Farmacêuticos, Lda. (500134960)","731,74 €",04-04-2017,19-02-2016,365 dias,"Portugal, Setúbal, Barreiro",Artigo 259.º do Código dos Contratos Públicos,30-12-2016,"467,94 €",,Alteração de quantidades,,1179915,"CONCURSO PÚBLICO PARA A CELEBRAÇÃO DE CONTRATOS PÚBLICOS DE APROVISIONAMENTO PARA A ÁREA DA SAÚDE, COM VISTA AO FORNECIMENTO DE MEDICAMENTOS DO APARELHO CARDIOVASCULAR, ÀS INSTITUIÇÕES E SERVIÇOS DO SERVIÇO NACIONAL DE SAÚDE",FALSE
"FI0001/2016- MED. ANTI-INFECIOSOS, ANTI-RETROVIRAIS",Ao abrigo de acordo-quadro (art.º 259.º),Aquisição de bens móveis,"33600000-6, Produtos farmacêuticos","CHBM - Centro Hospital Barreiro Montijo, EPE (509186998)","Janssen Cilag Farmacêutica, Lda (500189412)","99.373,26 €",04-04-2017,11-03-2016,365 dias,"Portugal, Setúbal, Barreiro",Artigo 259.º do Código dos Contratos Públicos,30-12-2016,"79.901,90 €",,Alteração de quantidades,,1120578,"CONCURSO PÚBLICO PARA A CELEBRAÇÃO DE CONTRATOS PÚBLICOS DE APROVISIONAMENTO PARA A ÁREA DA SAÚDE, COM VISTA AO FORNECIMENTO DE MEDICAMENTOS ANTI-RETROVIRAIS, ÀS INSTITUIÇÕES E SERVIÇOS DO SERVIÇO NACIONAL DE SAÚDE  ",FALSE
"FI0001/2016- MED. ANTI-INFECIOSOS, ANTI-RETROVIRAIS",Ao abrigo de acordo-quadro (art.º 259.º),Aquisição de bens móveis,"33600000-6, Produtos farmacêuticos","CHBM - Centro Hospital Barreiro Montijo, EPE (509186998)","GLAXOSMITHKLINE-PROD. FARMACÊUTICOS, LDA.          (500139962)","72,80 €",04-04-2017,11-03-2016,365 dias,"Portugal, Setúbal, Barreiro",Artigo 259.º do Código dos Contratos Públicos,30-12-2016,"100,79 €",,Alteração de quantidades,,1120578,"CONCURSO PÚBLICO PARA A CELEBRAÇÃO DE CONTRATOS PÚBLICOS DE APROVISIONAMENTO PARA A ÁREA DA SAÚDE, COM VISTA AO FORNECIMENTO DE MEDICAMENTOS ANTI-RETROVIRAIS, ÀS INSTITUIÇÕES E SERVIÇOS DO SERVIÇO NACIONAL DE SAÚDE  ",FALSE
"FI0001/2016- MED. ANTI-INFECIOSOS, ANTI-RETROVIRAIS",Ao abrigo de acordo-quadro (art.º 259.º),Aquisição de bens móveis,"33600000-6, Produtos farmacêuticos","CHBM - Centro Hospital Barreiro Montijo, EPE (509186998)","ACCORD HEALTHCARE, UNIPESSOAL Lda.     (508622263)","36.504,00 €",04-04-2017,11-03-2016,365 dias,"Portugal, Setúbal, Barreiro",Artigo 259.º do Código dos Contratos Públicos,30-12-2016,"24.336,00 €",,Alteração de quantidades,,1120578,"CONCURSO PÚBLICO PARA A CELEBRAÇÃO DE CONTRATOS PÚBLICOS DE APROVISIONAMENTO PARA A ÁREA DA SAÚDE, COM VISTA AO FORNECIMENTO DE MEDICAMENTOS ANTI-RETROVIRAIS, ÀS INSTITUIÇÕES E SERVIÇOS DO SERVIÇO NACIONAL DE SAÚDE  ",FALSE
"FI0001/2017-MED. ANTI-INFECIOSOS, ANTI-RETROVIRAIS",Ao abrigo de acordo-quadro (art.º 259.º),Aquisição de bens móveis,"33600000-6, Produtos farmacêuticos","CHBM - Centro Hospital Barreiro Montijo, EPE (509186998)","ABBVIE,LDA                                         (510229050)","504.484,53 €",04-04-2017,11-03-2016,365 dias,"Portugal, Setúbal, Barreiro",Artigo 259.º do Código dos Contratos Públicos,30-12-2016,"193.464,85 €",,Alteração de quantidades,,1120578,"CONCURSO PÚBLICO PARA A CELEBRAÇÃO DE CONTRATOS PÚBLICOS DE APROVISIONAMENTO PARA A ÁREA DA SAÚDE, COM VISTA AO FORNECIMENTO DE MEDICAMENTOS ANTI-RETROVIRAIS, ÀS INSTITUIÇÕES E SERVIÇOS DO SERVIÇO NACIONAL DE SAÚDE  ",FALSE
4S0045/2017 - PRÓTESE TRANSFEMURAL (ACIMA DO JOELHO) - JORGE GUERREIRO MENDONÇA,Ajuste Direto Regime Geral,Aquisição de serviços,"85000000-9, Serviços de saúde e acção social","Centro Hospitalar Barreiro Montijo, E. P. E. (509186998)","Ortopedia Moderna, Lda (500481300)","3.278,00 €",04-04-2017,25-01-2017,365 dias,"Portugal, Setúbal, Barreiro","Artigo 20.º, n.º 1, alínea a) do Código dos Contratos Públicos",31-01-2017,"3.278,00 €",,"",,Não aplicável.,Não aplicável.,FALSE
"FI0001/2016- MED. ANTI-INFECIOSOS, ANTI-RETROVIRAIS",Ao abrigo de acordo-quadro (art.º 259.º),Aquisição de bens móveis,"33600000-6, Produtos farmacêuticos","CHBM - Centro Hospital Barreiro Montijo, EPE (509186998)",UNILFARMA - UNIAO INTERN. LAB. S FARMACEUTICOS     (500293023),"49.799,19 €",03-04-2017,11-03-2016,365 dias,"Portugal, Setúbal, Barreiro",Artigo 259.º do Código dos Contratos Públicos,30-12-2016,"24.640,73 €",,Alteração de quantidades,,1120578,"CONCURSO PÚBLICO PARA A CELEBRAÇÃO DE CONTRATOS PÚBLICOS DE APROVISIONAMENTO PARA A ÁREA DA SAÚDE, COM VISTA AO FORNECIMENTO DE MEDICAMENTOS ANTI-RETROVIRAIS, ÀS INSTITUIÇÕES E SERVIÇOS DO SERVIÇO NACIONAL DE SAÚDE  ",FALSE
"FI0001/2016- MED. ANTI-INFECIOSOS, ANTI-RETROVIRAIS",Ao abrigo de acordo-quadro (art.º 259.º),Aquisição de bens móveis,"33600000-6, Produtos farmacêuticos","CHBM - Centro Hospital Barreiro Montijo, EPE (509186998)","VIIV HEALTHCARE, UNIPESSOAL LDA (509117961)","324.116,51 €",03-04-2017,11-03-2016,365 dias,"Portugal, Setúbal, Barreiro",Artigo 259.º do Código dos Contratos Públicos,30-12-2016,"384.386,49 €",,Alteração de quantidades,,1120578,"CONCURSO PÚBLICO PARA A CELEBRAÇÃO DE CONTRATOS PÚBLICOS DE APROVISIONAMENTO PARA A ÁREA DA SAÚDE, COM VISTA AO FORNECIMENTO DE MEDICAMENTOS ANTI-RETROVIRAIS, ÀS INSTITUIÇÕES E SERVIÇOS DO SERVIÇO NACIONAL DE SAÚDE  ",FALSE
"FI0001/2016- MED. ANTI-INFECIOSOS, ANTI-RETROVIRAIS",Ao abrigo de acordo-quadro (art.º 259.º),Aquisição de bens móveis,"33600000-6, Produtos farmacêuticos","CHBM - Centro Hospital Barreiro Montijo, EPE (509186998)",MSD (500191360),"78.702,49 €",03-04-2017,11-03-2016,365 dias,"Portugal, Setúbal, Barreiro",Artigo 259.º do Código dos Contratos Públicos,30-12-2016,"89.818,97 €",,Alteração de quantidades,,1120578,"CONCURSO PÚBLICO PARA A CELEBRAÇÃO DE CONTRATOS PÚBLICOS DE APROVISIONAMENTO PARA A ÁREA DA SAÚDE, COM VISTA AO FORNECIMENTO DE MEDICAMENTOS ANTI-RETROVIRAIS, ÀS INSTITUIÇÕES E SERVIÇOS DO SERVIÇO NACIONAL DE SAÚDE  ",FALSE
"FI0001/2016- MED. ANTI-INFECIOSOS, ANTI-RETROVIRAIS",Ao abrigo de acordo-quadro (art.º 259.º),Aquisição de bens móveis,"33600000-6, Produtos farmacêuticos","CHBM - Centro Hospital Barreiro Montijo, EPE (509186998)","TEVA PHARMA - PRODUTOS FARMACEUTICOS,LDA           (507045491)","63.655,80 €",03-04-2017,11-03-2016,365 dias,"Portugal, Setúbal, Barreiro",Artigo 259.º do Código dos Contratos Públicos,30-12-2016,"31.398,93 €",,Alteração de quantidades,,1120578,"CONCURSO PÚBLICO PARA A CELEBRAÇÃO DE CONTRATOS PÚBLICOS DE APROVISIONAMENTO PARA A ÁREA DA SAÚDE, COM VISTA AO FORNECIMENTO DE MEDICAMENTOS ANTI-RETROVIRAIS, ÀS INSTITUIÇÕES E SERVIÇOS DO SERVIÇO NACIONAL DE SAÚDE  ",FALSE
"FI0001/2016- MED. ANTI-INFECIOSOS, ANTI-RETROVIRAIS",Ao abrigo de acordo-quadro (art.º 259.º),Aquisição de bens móveis,"33600000-6, Produtos farmacêuticos","CHBM - Centro Hospital Barreiro Montijo, EPE (509186998)",BRISTOL-MYERS SQUIB FARMAC PORTUGUESA SA (500048193),"473.490,17 €",03-04-2017,11-03-2016,365 dias,"Portugal, Setúbal, Barreiro",Artigo 259.º do Código dos Contratos Públicos,30-12-2016,"230.445,54 €",,Alteração de quantidades,,1120578,"CONCURSO PÚBLICO PARA A CELEBRAÇÃO DE CONTRATOS PÚBLICOS DE APROVISIONAMENTO PARA A ÁREA DA SAÚDE, COM VISTA AO FORNECIMENTO DE MEDICAMENTOS ANTI-RETROVIRAIS, ÀS INSTITUIÇÕES E SERVIÇOS DO SERVIÇO NACIONAL DE SAÚDE  ",FALSE
"FI0001/2016- MED. ANTI-INFECIOSOS, ANTI-RETROVIRAIS",Ao abrigo de acordo-quadro (art.º 259.º),Aquisição de bens móveis,"33600000-6, Produtos farmacêuticos","CHBM - Centro Hospital Barreiro Montijo, EPE (509186998)","GILEAD SCIENCES, LDA (503604704)","1.396.106,50 €",03-04-2017,11-03-2016,365 dias,"Portugal, Setúbal, Barreiro",Artigo 259.º do Código dos Contratos Públicos,30-12-2016,"1.330.636,50 €",,Alteração de quantidades,,1120578,"CONCURSO PÚBLICO PARA A CELEBRAÇÃO DE CONTRATOS PÚBLICOS DE APROVISIONAMENTO PARA A ÁREA DA SAÚDE, COM VISTA AO FORNECIMENTO DE MEDICAMENTOS ANTI-RETROVIRAIS, ÀS INSTITUIÇÕES E SERVIÇOS DO SERVIÇO NACIONAL DE SAÚDE  ",FALSE
"FI0007/2016- MED. ANTISSÉTICOS, DESINFETANTES E OUTROS",Ao abrigo de acordo-quadro (art.º 259.º),Aquisição de bens móveis,"33600000-6, Produtos farmacêuticos","CHBM - Centro Hospital Barreiro Montijo, EPE (509186998)",VYGON (PORTUGAL) - PRODUTOS MEDICOS E FARMACÊUTICOS LIMITADA (503232785),"84,96 €",03-04-2017,08-04-2016,365 dias,"Portugal, Setúbal, Barreiro",Artigo 259.º do Código dos Contratos Públicos,30-12-2016,"42,48 €",,Alteração de quantidades,,1406003,CP 2015/8,FALSE
"FI0007/2016- MED. ANTISSÉTICOS, DESINFETANTES E OUTROS",Ao abrigo de acordo-quadro (art.º 259.º),Aquisição de bens móveis,"33600000-6, Produtos farmacêuticos","CHBM - Centro Hospital Barreiro Montijo, EPE (509186998)","VWR International - Material de Laboratório, Lda (503842770)","1.833,65 €",03-04-2017,08-04-2016,365 dias,"Portugal, Setúbal, Barreiro",Artigo 259.º do Código dos Contratos Públicos,30-12-2016,"1.356,25 €",,Alteração de quantidades,,1406003,CP 2015/8,FALSE
"FI0007/2016 - MED. ANTISSÉTICOS, DESINFETANTES E OUTROS",Ao abrigo de acordo-quadro (art.º 259.º),Aquisição de bens móveis,"33600000-6, Produtos farmacêuticos","CHBM - Centro Hospital Barreiro Montijo, EPE (509186998)","PROCLINICA-EQUIPAM.PRODUTOS CLINICOS,LDA (500222665)","3.171,72 €",03-04-2017,08-04-2016,365 dias,"Portugal, Setúbal, Barreiro",Artigo 259.º do Código dos Contratos Públicos,30-12-2016,"1.718,76 €",,Alteração de quantidades,,1406003,CP 2015/8,FALSE
"FI0007/2016- MED. ANTISSÉTICOS, DESINFETANTES E OUTROS",Ao abrigo de acordo-quadro (art.º 259.º),Aquisição de bens móveis,"33600000-6, Produtos farmacêuticos","CHBM - Centro Hospital Barreiro Montijo, EPE (509186998)",DIMOR LUSITANA- COMERCIO DE PRODUTOS DE SAÚDE E HIGIENE LDA (500730741),"3.627,00 €",03-04-2017,08-04-2016,365 dias,"Portugal, Setúbal, Barreiro",Artigo 259.º do Código dos Contratos Públicos,30-12-2016,"2.310,58 €",,Alteração de quantidades,,1406003,CP 2015/8,FALSE
"FI0007/2016- MED. ANTISSÉTICOS, DESINFETANTES E OUTROS",Ao abrigo de acordo-quadro (art.º 259.º),Aquisição de bens móveis,"33600000-6, Produtos farmacêuticos","CHBM - Centro Hospital Barreiro Montijo, EPE (509186998)","B. Braun Medical, Lda (501506543)","6.370,20 €",03-04-2017,08-04-2016,365 dias,"Portugal, Setúbal, Barreiro",Artigo 259.º do Código dos Contratos Públicos,30-12-2016,"4.955,93 €",,Alteração de quantidades,,1406003,CP 2015/8,FALSE
"FI0007/2016- MED. ANTISSÉTICOS, DESINFETANTES E OUTROS",Ao abrigo de acordo-quadro (art.º 259.º),Aquisição de bens móveis,"33600000-6, Produtos farmacêuticos","CHBM - Centro Hospital Barreiro Montijo, EPE (509186998)",PMH PRODUTOS MEDICO HOSPITALARES SA                (502376899),"4.377,60 €",03-04-2017,08-04-2016,365 dias,"Portugal, Setúbal, Barreiro",Artigo 259.º do Código dos Contratos Públicos,30-12-2016,"4.104,02 €",,Alteração de quantidades,,1406003,CP 2015/8,FALSE
"FI0007/2016 - MED. ANTISSÉTICOS, DESINFETANTES E OUTROS",Ao abrigo de acordo-quadro (art.º 259.º),Aquisição de bens móveis,"33600000-6, Produtos farmacêuticos","CHBM - Centro Hospital Barreiro Montijo, EPE (509186998)","Meda Pharma, SA (500082090)","116,34 €",03-04-2017,08-04-2016,365 dias,"Portugal, Setúbal, Barreiro",Artigo 259.º do Código dos Contratos Públicos,30-12-2016,"116,34 €",,"",,1406003,CP 2015/8,FALSE
FI0004/2016- MED. DO APARELHO RESPIRATÓRIO,Ao abrigo de acordo-quadro (art.º 259.º),Aquisição de bens móveis,"33600000-6, Produtos farmacêuticos","CHBM - Centro Hospital Barreiro Montijo, EPE (509186998)","LABESFAL - LABORATÓRIOS ALMIRO, SA (501169580)","12.780,80 €",31-03-2017,10-02-2016,365 dias,"Portugal, Setúbal, Barreiro",Artigo 259.º do Código dos Contratos Públicos,30-12-2016,"8.361,38 €",,Alteração de quantidades,,613816,"CONCURSO PÚBLICO PARA A CELEBRAÇÃO DE CONTRATOS PÚBLICOS DE APROVISIONAMENTO PARA A ÁREA DA SAÚDE, COM VISTA AO FORNECIMENTO DE MEDICAMENTOS DO APARELHO RESPIRATÓRIO, ÀS INSTITUIÇÕES E SERVIÇOS DO SERVIÇO NACIONAL DE SAÚDE",FALSE
FI0004/2016- MED. DO APARELHO RESPIRATÓRIO,Ao abrigo de acordo-quadro (art.º 259.º),Aquisição de bens móveis,"33600000-6, Produtos farmacêuticos","CHBM - Centro Hospital Barreiro Montijo, EPE (509186998)","Meda Pharma, SA (500082090)","187,11 €",31-03-2017,10-02-2016,365 dias,"Portugal, Setúbal, Barreiro",Artigo 259.º do Código dos Contratos Públicos,30-12-2016,"151,47 €",,Alteração de quantidades,,613816,"CONCURSO PÚBLICO PARA A CELEBRAÇÃO DE CONTRATOS PÚBLICOS DE APROVISIONAMENTO PARA A ÁREA DA SAÚDE, COM VISTA AO FORNECIMENTO DE MEDICAMENTOS DO APARELHO RESPIRATÓRIO, ÀS INSTITUIÇÕES E SERVIÇOS DO SERVIÇO NACIONAL DE SAÚDE",FALSE
FI0004/2016- MED. DO APARELHO RESPIRATÓRIO,Ao abrigo de acordo-quadro (art.º 259.º),Aquisição de bens móveis,"33600000-6, Produtos farmacêuticos","CHBM - Centro Hospital Barreiro Montijo, EPE (509186998)","GLAXOSMITHKLINE-PROD. FARMACÊUTICOS, LDA.          (500139962)","15.297,88 €",31-03-2017,10-02-2016,365 dias,"Portugal, Setúbal, Barreiro",Artigo 259.º do Código dos Contratos Públicos,30-12-2016,"14.261,01 €",,Alteração de quantidades,,613816,"CONCURSO PÚBLICO PARA A CELEBRAÇÃO DE CONTRATOS PÚBLICOS DE APROVISIONAMENTO PARA A ÁREA DA SAÚDE, COM VISTA AO FORNECIMENTO DE MEDICAMENTOS DO APARELHO RESPIRATÓRIO, ÀS INSTITUIÇÕES E SERVIÇOS DO SERVIÇO NACIONAL DE SAÚDE",FALSE
FI0004/2016- MED. DO APARELHO RESPIRATÓRIO,Ao abrigo de acordo-quadro (art.º 259.º),Aquisição de bens móveis,"33600000-6, Produtos farmacêuticos","CHBM - Centro Hospital Barreiro Montijo, EPE (509186998)","ANGELINI  FARMACEUTICA, LDA (500583650)","7.724,16 €",31-03-2017,10-02-2016,365 dias,"Portugal, Setúbal, Barreiro",Artigo 259.º do Código dos Contratos Públicos,30-12-2016,"7.487,03 €",,Alteração de quantidades,,613816,"CONCURSO PÚBLICO PARA A CELEBRAÇÃO DE CONTRATOS PÚBLICOS DE APROVISIONAMENTO PARA A ÁREA DA SAÚDE, COM VISTA AO FORNECIMENTO DE MEDICAMENTOS DO APARELHO RESPIRATÓRIO, ÀS INSTITUIÇÕES E SERVIÇOS DO SERVIÇO NACIONAL DE SAÚDE",FALSE
FI0004/2016- MED. DO APARELHO RESPIRATÓRIO,Ao abrigo de acordo-quadro (art.º 259.º),Aquisição de bens móveis,"33600000-6, Produtos farmacêuticos","CHBM - Centro Hospital Barreiro Montijo, EPE (509186998)","TEVA PHARMA - PRODUTOS FARMACEUTICOS,LDA           (507045491)","15.377,00 €",31-03-2017,10-02-2016,365 dias,"Portugal, Setúbal, Barreiro",Artigo 259.º do Código dos Contratos Públicos,30-12-2016,"11.900,00 €",,Alteração de quantidades,,613816,"CONCURSO PÚBLICO PARA A CELEBRAÇÃO DE CONTRATOS PÚBLICOS DE APROVISIONAMENTO PARA A ÁREA DA SAÚDE, COM VISTA AO FORNECIMENTO DE MEDICAMENTOS DO APARELHO RESPIRATÓRIO, ÀS INSTITUIÇÕES E SERVIÇOS DO SERVIÇO NACIONAL DE SAÚDE",FALSE
FI0004/2016- MED. DO APARELHO RESPIRATÓRIO,Ao abrigo de acordo-quadro (art.º 259.º),Aquisição de bens móveis,"33600000-6, Produtos farmacêuticos","CHBM - Centro Hospital Barreiro Montijo, EPE (509186998)","OVERPHARMA - PROD. MÉDICOS E FARMACÊUTICOS, LDA. (505792362)","40,95 €",31-03-2017,02-02-2016,365 dias,"Portugal, Setúbal, Barreiro",Artigo 259.º do Código dos Contratos Públicos,30-12-2016,"40,95 €",,"",,613816,"CONCURSO PÚBLICO PARA A CELEBRAÇÃO DE CONTRATOS PÚBLICOS DE APROVISIONAMENTO PARA A ÁREA DA SAÚDE, COM VISTA AO FORNECIMENTO DE MEDICAMENTOS DO APARELHO RESPIRATÓRIO, ÀS INSTITUIÇÕES E SERVIÇOS DO SERVIÇO NACIONAL DE SAÚDE",FALSE
FI0004/2016- MED. DO APARELHO RESPIRATÓRIO,Ao abrigo de acordo-quadro (art.º 259.º),Aquisição de bens móveis,"33600000-6, Produtos farmacêuticos","CHBM - Centro Hospital Barreiro Montijo, EPE (509186998)",UNILFARMA - UNIAO INTERN. LAB. S FARMACEUTICOS     (500293023),"6.704,00 €",31-03-2017,10-02-2016,365 dias,"Portugal, Setúbal, Barreiro",Artigo 259.º do Código dos Contratos Públicos,30-12-2016,"6.230,00 €",,Alteração de quantidades,,613816,"CONCURSO PÚBLICO PARA A CELEBRAÇÃO DE CONTRATOS PÚBLICOS DE APROVISIONAMENTO PARA A ÁREA DA SAÚDE, COM VISTA AO FORNECIMENTO DE MEDICAMENTOS DO APARELHO RESPIRATÓRIO, ÀS INSTITUIÇÕES E SERVIÇOS DO SERVIÇO NACIONAL DE SAÚDE",FALSE
FI0009/2016- MED. MATERIAL DISPOSABLE DE BLOCO OPERATÓRIO 1,Ao abrigo de acordo-quadro (art.º 259.º),Aquisição de bens móveis,"33600000-6, Produtos farmacêuticos","CHBM - Centro Hospital Barreiro Montijo, EPE (509186998)","OVERPHARMA - PROD. MÉDICOS E FARMACÊUTICOS, LDA. (505792362)","4.303,04 €",31-03-2017,10-02-2016,365 dias,"Portugal, Setúbal, Barreiro",Artigo 259.º do Código dos Contratos Públicos,30-12-2016,"1.827,86 €",,Alteração de quantidades,,451780,CP 2012/24 - MATERAIL DISPOSABLE DE BLOCO OPERATORIO,FALSE
F10005/2016 - APARELHO CARDIOVASCULAR,Concurso público,Aquisição de bens móveis,"33600000-6, Produtos farmacêuticos","Centro Hospitalar Barreiro Montijo, E. P. E. (509186998)","OVERPHARMA - PROD. MÉDICOS E FARMACÊUTICOS, LDA. (505792362)","29.960,17 €",31-03-2017,14-01-2016,365 dias,"Portugal, Setúbal, Barreiro","Artigo 20.º, n.º 1, alínea b) do Código dos Contratos Públicos",31-12-2016,"29.960,17 €",,"",,Não aplicável.,Não aplicável.,FALSE
F40013/2016 - PENSOS PARA FERIDAS CRÓNICAS,Ajuste Direto Regime Geral,Aquisição de bens móveis,"33600000-6, Produtos farmacêuticos","CHBM - Centro Hospital Barreiro Montijo, EPE (509186998)","SMITH & NEPHEW - PROD. FARMACEUTICOS, LDA. (503552461)","1.010,52 €",31-03-2017,14-04-2016,365 dias,"Portugal, Setúbal, Barreiro","Artigo 20.º, n.º 1, alínea a) do Código dos Contratos Públicos",31-12-2016,"798,50 €",,ALTERAÇÕES NAS QUANTIDADES,,Não aplicável.,Não aplicável.,FALSE
F40013/2016 - PENSOS PARA FERIDAS CRÓNICAS,Ajuste Direto Regime Geral,Aquisição de bens móveis,"33600000-6, Produtos farmacêuticos","CHBM - Centro Hospital Barreiro Montijo, EPE (509186998)","Covidien Portugal, Lda (503413410)","149,40 €",31-03-2017,14-04-2016,365 dias,"Portugal, Setúbal, Barreiro","Artigo 20.º, n.º 1, alínea a) do Código dos Contratos Públicos",31-12-2016,"",,ALTERAÇÕES NAS QUANTIDADES,,Não aplicável.,Não aplicável.,FALSE
F40013/2016 -PENSOS PARA FERIDAS CRÓNICAS,Ajuste Direto Regime Geral,Aquisição de bens móveis,"33600000-6, Produtos farmacêuticos","CHBM - Centro Hospital Barreiro Montijo, EPE (509186998)","KVTECH PORTUGAL - PROD. MEDICOS UNIPESSOAL, LDA (508671531)","80,00 €",31-03-2017,14-04-2016,365 dias,"Portugal, Setúbal, Barreiro","Artigo 20.º, n.º 1, alínea a) do Código dos Contratos Públicos",31-12-2016,"112,00 €",,ALTERAÇÕES NAS QUANTIDADES,,Não aplicável.,Não aplicável.,FALSE
F40013/2016 - PENSOS PARA FERIDAS CRÓNICAS,Ajuste Direto Regime Geral,Aquisição de bens móveis,"33600000-6, Produtos farmacêuticos","CHBM - Centro Hospital Barreiro Montijo, EPE (509186998)","PAUL HARTMANN, LDA (502271728)","2.576,28 €",31-03-2017,14-04-2016,365 dias,"Portugal, Setúbal, Barreiro","Artigo 20.º, n.º 1, alínea a) do Código dos Contratos Públicos",31-12-2016,"660,00 €",,ALTERAÇÕES NAS QUANTIDADES,,Não aplicável.,Não aplicável.,FALSE
F10004/2016 - PENSOS PARA FERIDAS CRÓNICAS (VACUOTERAPIA,Concurso público,Aquisição de bens móveis,"33600000-6, Produtos farmacêuticos","Centro Hospitalar Barreiro Montijo, E. P. E. (509186998)","SMITH & NEPHEW - PROD. FARMACEUTICOS, LDA. (503552461)","39.047,00 €",31-03-2017,10-03-2016,365 dias,"Portugal, Setúbal, Barreiro","Artigo 20.º, n.º 1, alínea b) do Código dos Contratos Públicos",31-12-2016,"39.047,00 €",,"",,Não aplicável.,Não aplicável.,FALSE
F10003/2016 - MEIOS DIAGNOSTICOS NÃO RADIOLOGICOS,Concurso público,Aquisição de bens móveis,"33600000-6, Produtos farmacêuticos","Centro Hospitalar Barreiro Montijo, E. P. E. (509186998)","ABBOTT LABORATORIOS, LDA (500006148)","25.815,00 €",31-03-2017,23-02-2016,365 dias,"Portugal, Setúbal, Barreiro","Artigo 20.º, n.º 1, alínea b) do Código dos Contratos Públicos",31-12-2016,"25.815,00 €",,"",,Não aplicável.,Não aplicável.,FALSE
F40012/2016 - MEDICAMENTOS - NUTRIÇÃO,Ajuste Direto Regime Geral,Aquisição de bens móveis,"33600000-6, Produtos farmacêuticos","CHBM - Centro Hospital Barreiro Montijo, EPE (509186998)","B.Braun Medical, Lda (501506543)","180,00 €",31-03-2017,11-02-2016,365 dias,"Portugal, Setúbal, Barreiro","Artigo 20.º, n.º 1, alínea a) do Código dos Contratos Públicos",31-12-2016,"",,ALTERAÇÕES NAS QUANTIDADES,,Não aplicável.,Não aplicável.,FALSE
F40012/2016 - MEDICAMENTOS - NUTRIÇÃO,Ajuste Direto Regime Geral,Aquisição de bens móveis,"33600000-6, Produtos farmacêuticos","CHBM - Centro Hospital Barreiro Montijo, EPE (509186998)","FRESENIUS KABI PHARMA PORTUGAL, LDA (504293753)","6.255,20 €",31-03-2017,11-02-2016,365 dias,"Portugal, Setúbal, Barreiro","Artigo 20.º, n.º 1, alínea a) do Código dos Contratos Públicos",31-12-2016,"7.543,30 €",,ALTERAÇÕES NAS QUANTIDADES,,Não aplicável.,Não aplicável.,FALSE
F40012/2016 - MEDICAMENTOS - NUTRIÇÃO,Ajuste Direto Regime Geral,Aquisição de bens móveis,"33600000-6, Produtos farmacêuticos","CHBM - Centro Hospital Barreiro Montijo, EPE (509186998)",NUTRICIA ADVANCED MEDICAL NUTRITION UNP.LDA (507558286),"8.667,60 €",31-03-2017,11-02-2016,365 dias,"Portugal, Setúbal, Barreiro","Artigo 20.º, n.º 1, alínea a) do Código dos Contratos Públicos",31-12-2016,"7.506,34 €",,ALTERAÇÕES NAS QUANTIDADES,,Não aplicável.,Não aplicável.,FALSE
F40012/2016 - MEDICAMENTOS - NUTRIÇÃO,Ajuste Direto Regime Geral,Aquisição de bens móveis,"33600000-6, Produtos farmacêuticos","CHBM - Centro Hospital Barreiro Montijo, EPE (509186998)","Sandoz farmacêutica, Lda (506985261)","174,72 €",31-03-2017,11-02-2016,365 dias,"Portugal, Setúbal, Barreiro","Artigo 20.º, n.º 1, alínea a) do Código dos Contratos Públicos",31-12-2016,"74,88 €",,ALTERAÇÕES NAS QUANTIDADES,,Não aplicável.,Não aplicável.,FALSE
FI0369/2016 - PROPANOL E ETANOL 500 ML E 100 ML SOL. ALCOÓLICA,Ao abrigo de acordo-quadro (art.º 259.º),Aquisição de bens móveis,"33600000-6, Produtos farmacêuticos","CHBM - Centro Hospital Barreiro Montijo, EPE (509186998)","B. Braun Medical, Lda (501506543)","11.347,00 €",31-03-2017,06-05-2016,365 dias,"Portugal, Setúbal, Barreiro",Artigo 259.º do Código dos Contratos Públicos,31-12-2016,"8.413,00 €",,ALTERAÇÕES NAS QUANTIDADES,,1406003,CP 2015/8,FALSE
