freguesia,acronym,validVotesPercentage,votes,dicofre
União das freguesias de Pontinha e Famões,PS,42.83,4426,111608
União das freguesias de Pontinha e Famões,PPD/PSD,15.01,1551,111608
União das freguesias de Pontinha e Famões,B.E.,9.89,1022,111608
União das freguesias de Pontinha e Famões,PCP-PEV,9.53,985,111608
União das freguesias de Pontinha e Famões,PAN,6.41,662,111608
União das freguesias de Pontinha e Famões,CDS-PP,4.04,418,111608
União das freguesias de Pontinha e Famões,PPM.PPV/CDC,3.09,319,111608
União das freguesias de Pontinha e Famões,A,2.07,214,111608
União das freguesias de Pontinha e Famões,L,1.67,173,111608
União das freguesias de Pontinha e Famões,PCTP/MRPP,1.27,131,111608
União das freguesias de Pontinha e Famões,NC,1.22,126,111608
União das freguesias de Pontinha e Famões,PNR,0.73,75,111608
União das freguesias de Pontinha e Famões,IL,0.64,66,111608
União das freguesias de Pontinha e Famões,PDR,0.48,50,111608
União das freguesias de Pontinha e Famões,PURP,0.45,47,111608
União das freguesias de Pontinha e Famões,PTP,0.42,43,111608
União das freguesias de Pontinha e Famões,MAS,0.25,26,111608
