Objeto do Contrato,Tipo de Procedimento,Tipo(s) de Contrato,CPVs,Entidade(s) Adjudicante(s),Entidade(s) Adjudicatária(s),Preço Contratual,Data de Publicação,Data de Celebração do Contrato,Prazo de Execução,Local de Execução,Fundamentação,Data de Fecho do Contrato,Preço Total Efetivo,Causas das Alterações ao Prazo,Causas das Alterações ao Preço,Estado,N.º registo do Acordo Quadro,Descrição do Acordo Quadro,Procedimento Centralizado
Aquisição de 1 Kit para extrção de ADN,Ajuste Direto Regime Geral,Aquisição de bens móveis<br/>Locação de bens móveis,"33694000-1, Meios de diagnóstico","Administração Regional de Saúde do Norte, I. P. (503135593)","TECNILAB PORTUGAL, SA (500758158)","1.363,85 €",10-02-2014,17-01-2014,365 dias,"Portugal, Vila Real, Vila Real","Artigo 24.º, n.º 1, alínea e) do Código dos Contratos Públicos",18-06-2014,"1.363,85 €",,"",,Não aplicável.,Não aplicável.,FALSE
Aquisição de 18 000 cartão de consulta; 27 000 ficha de metadona; 1000 blocos de requisição de análise de urina e 50 blocos guia de entrega de metadona,Ajuste Direto Regime Geral,Aquisição de bens móveis,"22100000-1, Livros, brochuras e folhetos impressos","Administração Regional de Saúde do Norte, I. P. (503135593)",Papelmunde  (501555315),"4.158,54 €",10-02-2014,07-02-2014,365 dias,"Portugal, Vila Real, Vila Real","Artigo 20.º, n.º 1, alínea a) do Código dos Contratos Públicos",16-10-2014,"4.158,54 €",,"",,Não aplicável.,Não aplicável.,FALSE
"Aquisição de 100 tubo endotraqueal c/ cuff nº 5; 100 tibos endotraqueal c/ cuff nº 5,5; 100 tubos endotraquel c/ cuff nº 6,5; 40 tubos endotraqueal c/ cuff nº 8,5; 40 tubos endotraqueal c/ cuff nº 6; 30 tubos endotraquel c/ cuff nº 7; 20 tubos endotraquel c/ cuff nº 8; 40 tubos endotraqueal c/ cuff nº ",Ajuste Direto Regime Geral,Aquisição de bens móveis,"33140000-3, Material médico de consumo","Administração Regional de Saúde do Norte, I. P. (503135593)",Smiths Medical Portugal (507445937),"861,37 €",10-02-2014,05-02-2014,365 dias,"Portugal, Vila Real, Vila Real","Artigo 20.º, n.º 1, alínea a) do Código dos Contratos Públicos",09-04-2014,"861,37 €",,"",,Não aplicável.,Não aplicável.,FALSE
"Aquisição de Atividades Ludopedagógicas , cartas Passe",Ajuste Direto Regime Geral,Aquisição de serviços,"79340000-9, Serviços de publicidade e marketing","Administração Regional de Saúde do Norte, I. P. (503135593)","Furtacores - Design e Comunicação, lda (506441679)","6.442,53 €",03-02-2014,22-11-2013,38 dias,"Portugal, Porto<BR/>Portugal, Aveiro<BR/>Portugal, Braga","Artigo 20.º, n.º 1, alínea a) do Código dos Contratos Públicos",27-12-2013,"6.442,53 €",,"",,Não aplicável.,Não aplicável.,FALSE
Aquisição de serviços de cópia e impressão em regime de outsourcing,Ajuste Direto Regime Geral,Aquisição de serviços,"79800000-2, Serviços de impressão e afins","Administração Regional de Saúde do Norte, I. P. (503135593)",kyocera Mita Portugal (500682127),"48.497,56 €",03-02-2014,18-01-2013,365 dias,"Portugal, Porto, Porto","Artigo 24.º, n.º 1, alínea c) do Código dos Contratos Públicos",31-12-2013,"54.788,51 €",,"O valor contratual submetido foi para um período de 10 meses, e com o decorrer do contrato houve a necessidade de o alterar para 12 meses. Serviços de cópia e impressão",,Não aplicável.,Não aplicável.,FALSE
Aluguer operacional de veículos automóveis e motociclos,Ao abrigo de acordo-quadro (art.º 258.º),Aquisição de serviços,"60170000-0, Aluguer de veículos para transporte de passageiros com condutor","Administração Regional de Saúde do Norte, I. P. (503135593)","Lease Plan Portugal, lda (502167610)","4.080,00 €",03-02-2014,02-01-2013,365 dias,"Portugal, Porto, Porto",Artigo 258.º do Código dos Contratos Públicos,31-12-2013,"4.080,00 €",,"",,188072,Concurso limitado por prévia qualificação para a celebração de acordo quadro para o fornecimento de veículos automóveis e motociclos e aluguer operacional de veículos.,FALSE
"Aquisição de 20 cuvetes plástica 50 mm com tampa; 10 caixas de ácido cianúrico: 35 caixas de LCK Cloreto; 5 Reagente LCW 532 - Mn; 5 reagentes LCK 301 - AI; 5 reagentes LCK 304 - NH$+; 5 reagentes LCK 339 - NO3 ;35 reagentes LCK 380 - TOC; 2 Unid. Padrão Adista LCA704 (P043-, CQO, N+, CI, N3, S42-)",Ajuste Direto Regime Geral,Aquisição de bens móveis,"33696000-5, Reagentes e meios de contraste","Administração Regional de Saúde do Norte, I. P. (503135593)","HACH LANGE, LDA (507155165)","9.384,45 €",03-02-2014,17-01-2014,365 dias,"Portugal, Vila Real, Vila Real","Artigo 20.º, n.º 1, alínea a) do Código dos Contratos Públicos","","",,"",,Não aplicável.,Não aplicável.,FALSE
Aquisição de 2 unid. comparador quanti-tray 2000; 1 000 ampolas de quanti-tray (colilert); 600 ampolas de colilert 18 teste Kit,Ajuste Direto Regime Geral,Aquisição de bens móveis,"33696000-5, Reagentes e meios de contraste","Administração Regional de Saúde do Norte, I. P. (503135593)",Iberlab & Imunorage (503406694),"4.715,00 €",03-02-2014,28-01-2014,365 dias,"Portugal, Vila Real, Vila Real","Artigo 20.º, n.º 1, alínea a) do Código dos Contratos Públicos",20-08-2014,"4.715,00 €",,"",,Não aplicável.,Não aplicável.,FALSE
"Aquisição de 140 unidades de Brometo de ipratrópio 20 ug/dose Sol. Pressu. inal Recip Press e 15 000 amoploas de brometo ipratrópio 0,25 mg/2ml Sol. inal. neb 2 ml",Ajuste Direto Regime Geral,Aquisição de bens móveis,"33694000-1, Meios de diagnóstico","Administração Regional de Saúde do Norte, I. P. (503135593)",UNILFARMA (500293023),"2.837,68 €",03-02-2014,31-01-2014,365 dias,"Portugal, Vila Real, Vila Real",Artigo 258.º do Código dos Contratos Públicos,20-11-2014,"2.837,68 €",,"",,1156699,"Aquisição de 140 unidades de Brometo de ipratrópio 20 ug/dose Sol. Pressu. inal Recip Press e 15 000 amoploas de brometo ipratrópio 0,25 mg/2ml Sol. inal. neb 2 ml",FALSE
"Aquisição de 50 tubos silicone c/ conexão recta e e, 90º Medela",Ajuste Direto Regime Geral,Aquisição de bens móveis,"33140000-3, Material médico de consumo","Administração Regional de Saúde do Norte, I. P. (503135593)","Bacelar & Irmão, Lda (500532818)","500,00 €",03-02-2014,03-02-2014,365 dias,"Portugal, Vila Real, Vila Real","Artigo 20.º, n.º 1, alínea a) do Código dos Contratos Públicos",15-04-2014,"500,00 €",,"",,Não aplicável.,Não aplicável.,FALSE
