freguesia,acronym,validVotesPercentage,votes,dicofre
"União das freguesias de Paradela, Contim e Fiães",PS,49.06,78,170639
"União das freguesias de Paradela, Contim e Fiães",PPD/PSD,40.25,64,170639
"União das freguesias de Paradela, Contim e Fiães",B.E.,4.4,7,170639
"União das freguesias de Paradela, Contim e Fiães",PAN,2.52,4,170639
"União das freguesias de Paradela, Contim e Fiães",A,0.63,1,170639
"União das freguesias de Paradela, Contim e Fiães",CDS-PP,0.63,1,170639
"União das freguesias de Paradela, Contim e Fiães",CH,0.63,1,170639
"União das freguesias de Paradela, Contim e Fiães",IL,0.63,1,170639
"União das freguesias de Paradela, Contim e Fiães",PCTP/MRPP,0.63,1,170639
"União das freguesias de Paradela, Contim e Fiães",R.I.R.,0.63,1,170639
"União das freguesias de Paradela, Contim e Fiães",L,0,0,170639
"União das freguesias de Paradela, Contim e Fiães",NC,0,0,170639
"União das freguesias de Paradela, Contim e Fiães",PCP-PEV,0,0,170639
"União das freguesias de Paradela, Contim e Fiães",PDR,0,0,170639
"União das freguesias de Paradela, Contim e Fiães",PNR,0,0,170639
"União das freguesias de Paradela, Contim e Fiães",PPM,0,0,170639
