freguesia,acronym,validVotesPercentage,votes,dicofre
Landeira,PS,41.8,135,071202
Landeira,PCP-PEV,36.53,118,071202
Landeira,PPD/PSD.CDS-PP,12.07,39,071202
Landeira,B.E.,3.72,12,071202
Landeira,PCTP/MRPP,2.17,7,071202
Landeira,MPT,1.24,4,071202
Landeira,L,0.93,3,071202
Landeira,MAS,0.31,1,071202
Landeira,PAN,0.31,1,071202
Landeira,PNR,0.31,1,071202
Landeira,POUS,0.31,1,071202
Landeira,PTP,0.31,1,071202
Landeira,PDA,0,0,071202
Landeira,PND,0,0,071202
Landeira,PPM,0,0,071202
Landeira,PPV,0,0,071202
