Objeto do Contrato,Tipo de Procedimento,Tipo(s) de Contrato,CPVs,Entidade(s) Adjudicante(s),Entidade(s) Adjudicatária(s),Preço Contratual,Data de Publicação,Data de Celebração do Contrato,Prazo de Execução,Local de Execução,Fundamentação,Data de Fecho do Contrato,Preço Total Efetivo,Causas das Alterações ao Prazo,Causas das Alterações ao Preço,Estado,N.º registo do Acordo Quadro,Descrição do Acordo Quadro,Procedimento Centralizado
AJ/33/2017 Aquisição de Material de Consumo Clínico – Outros Produtos - para o ano de 2017,Ajuste Direto Regime Geral,Aquisição de bens móveis,"33700000-7, Produtos para cuidados pessoais","Hospital de Magalhães Lemos, E. P. E. (502828790)",PAUL HARTMANN (502271728),"240,00 €",21-09-2017,03-07-2017,30 dias,"Portugal, Porto, Porto","Artigo 20.º, n.º 1, alínea a) do Código dos Contratos Públicos",,,,,,Não aplicável.,Não aplicável.,FALSE
IG/9/2017 Sabão Líquido na SPMS – AQ CP 8/2015 para 2017,Ajuste Direto Regime Geral,Aquisição de bens móveis,"39830000-9, Produtos de limpeza","Hospital de Magalhães Lemos, E. P. E. (502828790)","VYGON, LDA. (503232785)","339,00 €",21-09-2017,02-01-2017,30 dias,"Portugal, Porto, Porto","Artigo 20.º, n.º 1, alínea a) do Código dos Contratos Públicos",,,,,,Não aplicável.,Não aplicável.,FALSE
AJ/36/2017 Aquisição de sacos plásticos e papel para o ano de 2017,Ajuste Direto Regime Geral,Aquisição de bens móveis,"19520000-7, Produtos de plástico","Hospital de Magalhães Lemos, E. P. E. (502828790)","PLASTICOLORS,TRANSF.MAT.PLAST.LDA (504183346)","636,00 €",21-09-2017,22-05-2017,30 dias,"Portugal, Porto, Porto","Artigo 20.º, n.º 1, alínea a) do Código dos Contratos Públicos",,,,,,Não aplicável.,Não aplicável.,FALSE
AJ/37/2017 Aquisição de Material de Consumo Hoteleiro para o ano de 2017,Ajuste Direto Regime Geral,Aquisição de bens móveis,"39800000-0, Produtos de limpeza e polimento","Hospital de Magalhães Lemos, E. P. E. (502828790)","SCVINHAS, LDA. (509658857)","768,68 €",21-09-2017,06-07-2017,30 dias,"Portugal, Porto, Porto","Artigo 20.º, n.º 1, alínea a) do Código dos Contratos Públicos",,,,,,Não aplicável.,Não aplicável.,FALSE
AJ/23/2017 Fornecimento de produtos de mercearia para o ano de 2017,Ajuste Direto Regime Geral,Aquisição de bens móveis,"15400000-2, Óleos e gorduras animais e vegetais","Hospital de Magalhães Lemos, E. P. E. (502828790)",VILANDORINHO-ARMAZEM MERCEARIA (501140450),"634,50 €",21-09-2017,02-01-2017,8 dias,"Portugal, Porto, Porto","Artigo 20.º, n.º 1, alínea a) do Código dos Contratos Públicos",,,,,,Não aplicável.,Não aplicável.,FALSE
AJ/61/2017 Fornecimento de produtos hortícolas da 4ª gama para o ano de 2017,Ajuste Direto Regime Geral,Aquisição de bens móveis,"15300000-1, Fruta, produtos hortícolas e produtos afins","Hospital de Magalhães Lemos, E. P. E. (502828790)",FreshSabor (508879760),"480,50 €",21-09-2017,14-03-2017,8 dias,"Portugal, Porto, Porto","Artigo 20.º, n.º 1, alínea a) do Código dos Contratos Públicos",,,,,,Não aplicável.,Não aplicável.,FALSE
"AJ/17/2017 Fornecimento de carnes frescas, congeladas, derivados de carne, enchidos e fumados durante 2017",Ajuste Direto Regime Geral,Aquisição de bens móveis,"15100000-9, Produtos de origem animal, carne e produtos à base de carne","Hospital de Magalhães Lemos, E. P. E. (502828790)","Carnes São José - Comércio e Industria de Carnes, Lda (501235574)","620,46 €",21-09-2017,02-01-2017,8 dias,"Portugal, Porto, Porto","Artigo 20.º, n.º 1, alínea a) do Código dos Contratos Públicos",,,,,,Não aplicável.,Não aplicável.,FALSE
"AJ/19/2017 Fornecimento de congelados – peixes, derivados de peixe e legumes para o ano de 2017",Ajuste Direto Regime Geral,Aquisição de bens móveis,"15220000-6, Peixe, filetes de peixe e outras carnes de peixe, congelados","Hospital de Magalhães Lemos, E. P. E. (502828790)","Futuro em Relevo - Comércio de Carnes, Unip (509485693)","545,00 €",21-09-2017,02-01-2017,8 dias,"Portugal, Porto, Porto","Artigo 20.º, n.º 1, alínea a) do Código dos Contratos Públicos",,,,,,Não aplicável.,Não aplicável.,FALSE
"AJ/19/2017 Fornecimento de congelados – peixes, derivados de peixe e legumes para o ano de 2017",Ajuste Direto Regime Geral,Aquisição de bens móveis,"15300000-1, Fruta, produtos hortícolas e produtos afins","Hospital de Magalhães Lemos, E. P. E. (502828790)",A.MENDES TORRADO (501544984),"39,90 €",21-09-2017,02-01-2017,8 dias,"Portugal, Porto, Porto","Artigo 20.º, n.º 1, alínea a) do Código dos Contratos Públicos",,,,,,Não aplicável.,Não aplicável.,FALSE
"AJ/17/2017 Fornecimento de carnes frescas, congeladas, derivados de carne, enchidos e fumados durante 2017",Ajuste Direto Regime Geral,Aquisição de bens móveis,"15100000-9, Produtos de origem animal, carne e produtos à base de carne","Hospital de Magalhães Lemos, E. P. E. (502828790)","Futuro em Relevo - Comércio de Carnes, Unip (509485693)","270,46 €",21-09-2017,02-01-2017,8 dias,"Portugal, Porto, Porto","Artigo 20.º, n.º 1, alínea a) do Código dos Contratos Públicos",,,,,,Não aplicável.,Não aplicável.,FALSE
"AJ/19/2017 Fornecimento de congelados – peixes, derivados de peixe e legumes para o ano de 2017",Ajuste Direto Regime Geral,Aquisição de bens móveis,"15220000-6, Peixe, filetes de peixe e outras carnes de peixe, congelados","Hospital de Magalhães Lemos, E. P. E. (502828790)","Futuro em Relevo - Comércio de Carnes, Unip (509485693)","527,20 €",21-09-2017,02-01-2017,8 dias,"Portugal, Porto, Porto","Artigo 20.º, n.º 1, alínea a) do Código dos Contratos Públicos",,,,,,Não aplicável.,Não aplicável.,FALSE
AJ/60/2017 Fornecimento de leite e queijo fundido durante o ano de 2017,Ajuste Direto Regime Geral,Aquisição de bens móveis,"15500000-3, Lacticínios","Hospital de Magalhães Lemos, E. P. E. (502828790)",LACTOGAL (503183997),"451,18 €",21-09-2017,01-03-2017,8 dias,"Portugal, Porto, Porto","Artigo 20.º, n.º 1, alínea a) do Código dos Contratos Públicos",,,,,,Não aplicável.,Não aplicável.,FALSE
AJ/18/2017 Fornecimento de frutas e produtos hortícolas e da 4ª gama para o ano de 2017,Ajuste Direto Regime Geral,Aquisição de bens móveis,"15300000-1, Fruta, produtos hortícolas e produtos afins","Hospital de Magalhães Lemos, E. P. E. (502828790)","HORTIDOURO-PRODUTOS HORTICOLAS,LDA (507144007)","66,19 €",21-09-2017,02-01-2017,8 dias,"Portugal, Porto, Porto","Artigo 20.º, n.º 1, alínea a) do Código dos Contratos Públicos",,,,,,Não aplicável.,Não aplicável.,FALSE
AJ/18/2017 Fornecimento de frutas e produtos hortícolas e da 4ª gama para o ano de 2017,Ajuste Direto Regime Geral,Aquisição de bens móveis,"15300000-1, Fruta, produtos hortícolas e produtos afins","Hospital de Magalhães Lemos, E. P. E. (502828790)","HORTIDOURO-PRODUTOS HORTICOLAS,LDA (507144007)","556,00 €",21-09-2017,02-01-2017,8 dias,"Portugal, Porto, Porto","Artigo 20.º, n.º 1, alínea a) do Código dos Contratos Públicos",,,,,,Não aplicável.,Não aplicável.,FALSE
AJ/33/2017 Aquisição de Material de Consumo Clínico – Outros Produtos - para o ano de 2017,Ajuste Direto Regime Geral,Aquisição de bens móveis,"33140000-3, Material médico de consumo","Hospital de Magalhães Lemos, E. P. E. (502828790)",EUROCASMEDICA (503322105),"170,00 €",19-09-2017,03-07-2017,30 dias,"Portugal, Porto, Porto","Artigo 20.º, n.º 1, alínea a) do Código dos Contratos Públicos",,,,,,Não aplicável.,Não aplicável.,FALSE
AM/1016/2017 Contrato de assistência técnica aos multifunções e fotocopiadores para 2017,Ajuste Direto Regime Geral,Aquisição de serviços,"50000000-5, Serviços de reparação e manutenção","Hospital de Magalhães Lemos, E. P. E. (502828790)",XEROX (501656677),"711,00 €",19-09-2017,02-01-2017,360 dias,"Portugal, Porto, Porto","Artigo 20.º, n.º 1, alínea a) do Código dos Contratos Públicos",,,,,,Não aplicável.,Não aplicável.,FALSE
"AJ/38/2017 Serviços de Jardinagem no Hospital de Magalhães Lemos, E.P.E., para o ano de 2017",Ajuste Direto Regime Geral,Aquisição de serviços,"50800000-3, Serviços de reparação e manutenção diversos","Hospital de Magalhães Lemos, E. P. E. (502828790)","Consjardim Unipessoal, Lda. (509456111)","4.000,00 €",19-09-2017,02-01-2017,30 dias,"Portugal, Porto, Porto","Artigo 20.º, n.º 1, alínea a) do Código dos Contratos Públicos",,,,,,Não aplicável.,Não aplicável.,FALSE
AJ/48/2017 Fornecimento de pão e produtos de pastelaria para o ano de 2017,Ajuste Direto Regime Geral,Aquisição de bens móveis,"15810000-9, Produtos de panificação, produtos frescos de pastelaria e bolos","Hospital de Magalhães Lemos, E. P. E. (502828790)","BUFFET VARZIELA - Padaria e Pastelaria Unipessoal, Lda (513199195)","2.074,41 €",19-09-2017,14-03-2017,30 dias,"Portugal, Porto, Porto","Artigo 20.º, n.º 1, alínea a) do Código dos Contratos Públicos",,,,,,Não aplicável.,Não aplicável.,FALSE
AJ/48/2017 Fornecimento de pão e produtos de pastelaria para o ano de 2017,Ajuste Direto Regime Geral,Aquisição de bens móveis,"15810000-9, Produtos de panificação, produtos frescos de pastelaria e bolos","Hospital de Magalhães Lemos, E. P. E. (502828790)","BUFFET VARZIELA - Padaria e Pastelaria Unipessoal, Lda (513199195)","167,52 €",19-09-2017,14-03-2017,30 dias,"Portugal, Porto, Porto","Artigo 20.º, n.º 1, alínea a) do Código dos Contratos Públicos",,,,,,Não aplicável.,Não aplicável.,FALSE
AJ/60/2017 Fornecimento de leite e queijo fundido durante o ano de 2017,Ajuste Direto Regime Geral,Aquisição de bens móveis,"15500000-3, Lacticínios","Hospital de Magalhães Lemos, E. P. E. (502828790)",LACTOGAL (503183997),"490,87 €",19-09-2017,01-03-2017,8 dias,"Portugal, Porto, Porto","Artigo 20.º, n.º 1, alínea a) do Código dos Contratos Públicos",,,,,,Não aplicável.,Não aplicável.,FALSE
AJ/37/2017 Aquisição de Material de Consumo Hoteleiro para o ano de 2017,Ajuste Direto Regime Geral,Aquisição de bens móveis,"39800000-0, Produtos de limpeza e polimento","Hospital de Magalhães Lemos, E. P. E. (502828790)",Air Liquide Medicinal SA (501576436),"277,44 €",18-09-2017,06-07-2017,30 dias,"Portugal, Porto, Porto","Artigo 20.º, n.º 1, alínea a) do Código dos Contratos Públicos",,,,,,Não aplicável.,Não aplicável.,FALSE
AJ/37/2017 Aquisição de Material de Consumo Hoteleiro para o ano de 2017,Ajuste Direto Regime Geral,Aquisição de bens móveis,"39000000-2, Mobiliário (incl. de escritório), acessórios, aparelhos domésticos (excl. iluminação) e produtos de limpeza","Hospital de Magalhães Lemos, E. P. E. (502828790)",A.J.OLIVEIRA (502293748),"758,91 €",18-09-2017,06-07-2017,30 dias,"Portugal, Porto, Porto","Artigo 20.º, n.º 1, alínea a) do Código dos Contratos Públicos",,,,,,Não aplicável.,Não aplicável.,FALSE
"IG/24/2017 Material de Consumo Clínico - Fraldas, cuecas, chinelos, pensos, resguardos",Ajuste Direto Regime Geral,Aquisição de bens móveis,"33700000-7, Produtos para cuidados pessoais","Hospital de Magalhães Lemos, E. P. E. (502828790)","BASTOS VIEGAS,S.A. (500042772)","53,20 €",18-09-2017,19-01-2017,30 dias,"Portugal, Porto, Porto","Artigo 20.º, n.º 1, alínea a) do Código dos Contratos Públicos",,,,,,Não aplicável.,Não aplicável.,FALSE
AJ/39/2017 Aquisição de serviços de transporte de doentes em ambulância para o ano de 2017,Ajuste Direto Regime Geral,Aquisição de serviços,"60000000-8, Serviços de transporte (excl. transporte de resíduos)","Hospital de Magalhães Lemos, E. P. E. (502828790)","SALVAVIDA Transporte de Doentes, Lda (506532160)","2.332,32 €",18-09-2017,02-01-2017,30 dias,"Portugal, Porto, Porto","Artigo 20.º, n.º 1, alínea a) do Código dos Contratos Públicos",,,,,,Não aplicável.,Não aplicável.,FALSE
"AJ/19/2017 Fornecimento de congelados – peixes, derivados de peixe e legumes para o ano de 2017",Ajuste Direto Regime Geral,Aquisição de bens móveis,"15300000-1, Fruta, produtos hortícolas e produtos afins","Hospital de Magalhães Lemos, E. P. E. (502828790)",A.MENDES TORRADO (501544984),"13,40 €",14-09-2017,02-01-2017,8 dias,"Portugal, Porto, Porto","Artigo 20.º, n.º 1, alínea a) do Código dos Contratos Públicos",,,,,,Não aplicável.,Não aplicável.,FALSE
AJ/18/2017 Fornecimento de frutas e produtos hortícolas e da 4ª gama para o ano de 2017,Ajuste Direto Regime Geral,Aquisição de bens móveis,"15300000-1, Fruta, produtos hortícolas e produtos afins","Hospital de Magalhães Lemos, E. P. E. (502828790)","HORTIDOURO-PRODUTOS HORTICOLAS,LDA (507144007)","498,00 €",14-09-2017,02-01-2017,8 dias,"Portugal, Porto, Porto","Artigo 20.º, n.º 1, alínea a) do Código dos Contratos Públicos",,,,,,Não aplicável.,Não aplicável.,FALSE
"AJ/17/2017 Fornecimento de carnes frescas, congeladas, derivados de carne, enchidos e fumados durante 2017",Ajuste Direto Regime Geral,Aquisição de bens móveis,"15100000-9, Produtos de origem animal, carne e produtos à base de carne","Hospital de Magalhães Lemos, E. P. E. (502828790)","Carnes São José - Comércio e Industria de Carnes, Lda (501235574)","590,51 €",14-09-2017,02-01-2017,8 dias,"Portugal, Porto, Porto","Artigo 20.º, n.º 1, alínea a) do Código dos Contratos Públicos",,,,,,Não aplicável.,Não aplicável.,FALSE
AJ/33/2017 Aquisição de Material de Consumo Clínico – Outros Produtos - para o ano de 2017,Ajuste Direto Regime Geral,Aquisição de bens móveis,"33000000-0, Equipamento médico, medicamentos e produtos para cuidados pessoais","Hospital de Magalhães Lemos, E. P. E. (502828790)","BASTOS VIEGAS,S.A. (500042772)","228,00 €",14-09-2017,03-07-2017,30 dias,"Portugal, Porto, Porto","Artigo 20.º, n.º 1, alínea a) do Código dos Contratos Públicos",,,,,,Não aplicável.,Não aplicável.,FALSE
AJ/61/2017 Fornecimento de produtos hortícolas da 4ª gama para o ano de 2017,Ajuste Direto Regime Geral,Aquisição de bens móveis,"15300000-1, Fruta, produtos hortícolas e produtos afins","Hospital de Magalhães Lemos, E. P. E. (502828790)",FreshSabor (508879760),"527,50 €",14-09-2017,14-03-2017,8 dias,"Portugal, Porto, Porto","Artigo 20.º, n.º 1, alínea a) do Código dos Contratos Públicos",,,,,,Não aplicável.,Não aplicável.,FALSE
AJ/18/2017 Fornecimento de frutas e produtos hortícolas e da 4ª gama para o ano de 2017,Ajuste Direto Regime Geral,Aquisição de bens móveis,"15300000-1, Fruta, produtos hortícolas e produtos afins","Hospital de Magalhães Lemos, E. P. E. (502828790)","HORTIDOURO-PRODUTOS HORTICOLAS,LDA (507144007)","92,60 €",14-09-2017,02-01-2017,8 dias,"Portugal, Porto, Porto","Artigo 20.º, n.º 1, alínea a) do Código dos Contratos Públicos",,,,,,Não aplicável.,Não aplicável.,FALSE
AJ/37/2017 Aquisição de Material de Consumo Hoteleiro para o ano de 2017,Ajuste Direto Regime Geral,Aquisição de bens móveis,"39000000-2, Mobiliário (incl. de escritório), acessórios, aparelhos domésticos (excl. iluminação) e produtos de limpeza","Hospital de Magalhães Lemos, E. P. E. (502828790)","MEILEX, LDA. (501759441)","128,00 €",11-09-2017,06-07-2017,30 dias,"Portugal, Porto, Porto","Artigo 20.º, n.º 1, alínea a) do Código dos Contratos Públicos",,,,,,Não aplicável.,Não aplicável.,FALSE
IG/199/2017 - Consumo de energia até inicio do novo contrato,Ajuste Direto Regime Geral,Aquisição de serviços,"79000000-4, Serviços a empresas: direito, comercialização, consultoria, recrutamento, impressão e segurança","Hospital de Magalhães Lemos, E. P. E. (502828790)",EDP COMERCIAL (503504564),"1.040,74 €",11-09-2017,13-02-2017,30 dias,"Portugal, Porto, Porto","Artigo 20.º, n.º 1, alínea a) do Código dos Contratos Públicos",,,,,,Não aplicável.,Não aplicável.,FALSE
"IG/24/2017 Material de Consumo Clínico - Fraldas, cuecas, chinelos, pensos, resguardos",Ajuste Direto Regime Geral,Aquisição de bens móveis,"33000000-0, Equipamento médico, medicamentos e produtos para cuidados pessoais","Hospital de Magalhães Lemos, E. P. E. (502828790)","BASTOS VIEGAS,S.A. (500042772)","20,65 €",11-09-2017,19-01-2017,30 dias,"Portugal, Porto, Porto","Artigo 20.º, n.º 1, alínea a) do Código dos Contratos Públicos",,,,,,Não aplicável.,Não aplicável.,FALSE
AJ/372017 Aquisição de Material de Consumo Hoteleiro para o ano de 2017,Ajuste Direto Regime Geral,Aquisição de bens móveis,"39300000-5, Equipamento diverso","Hospital de Magalhães Lemos, E. P. E. (502828790)",HIGITOTAL (504297040),"12,53 €",11-09-2017,06-07-2017,30 dias,"Portugal, Porto, Porto","Artigo 20.º, n.º 1, alínea a) do Código dos Contratos Públicos",,,,,,Não aplicável.,Não aplicável.,FALSE
IG/8/2017 Combustiveis rodoviários para o ano de 2017_ 2016UMC373,Ajuste Direto Regime Geral,Aquisição de bens móveis,"09100000-0, Combustíveis","Hospital de Magalhães Lemos, E. P. E. (502828790)",Petróleos de Portugal - Petrogal SA (500697370),"852,27 €",11-09-2017,07-03-2017,30 dias,"Portugal, Porto, Porto","Artigo 20.º, n.º 1, alínea a) do Código dos Contratos Públicos",,,,,,Não aplicável.,Não aplicável.,FALSE
IG/5/2017 - Serviços de Segurança e Vigilância ao abrigo da SPMS_P259_ESPAP/2017-15,Ajuste Direto Regime Geral,Aquisição de serviços,"79000000-4, Serviços a empresas: direito, comercialização, consultoria, recrutamento, impressão e segurança","Hospital de Magalhães Lemos, E. P. E. (502828790)",PRESTIBEL (501326456),"12.898,71 €",11-09-2017,21-04-2017,30 dias,"Portugal, Porto, Porto","Artigo 20.º, n.º 1, alínea a) do Código dos Contratos Públicos",,,,,,Não aplicável.,Não aplicável.,FALSE
IG/7/2017 Aquisição de gás natural na SPMS para o ano de 2017,Ajuste Direto Regime Geral,Aquisição de serviços,"76000000-3, Serviços relacionados com as indústrias do gás e do petróleo","Hospital de Magalhães Lemos, E. P. E. (502828790)","Galp Power, SA (504723456)","1.844,62 €",11-09-2017,02-01-2017,30 dias,"Portugal, Porto, Porto","Artigo 20.º, n.º 1, alínea a) do Código dos Contratos Públicos",,,,,,Não aplicável.,Não aplicável.,FALSE
IG/7/2017 Aquisição de gás natural na SPMS para o ano de 2017,Ajuste Direto Regime Geral,Aquisição de serviços,"76000000-3, Serviços relacionados com as indústrias do gás e do petróleo","Hospital de Magalhães Lemos, E. P. E. (502828790)","Galp Power, SA (504723456)","2.267,94 €",11-09-2017,02-01-2017,30 dias,"Portugal, Porto, Porto","Artigo 20.º, n.º 1, alínea a) do Código dos Contratos Públicos",,,,,,Não aplicável.,Não aplicável.,FALSE
IG/133/2017 Serviços de manutenção do software PREL Ambulatório para o ano 2017,Ajuste Direto Regime Geral,Aquisição de serviços,"50000000-5, Serviços de reparação e manutenção","Hospital de Magalhães Lemos, E. P. E. (502828790)",SERVIÇOS TÉCNICOS INFORMATICA (502246995),"2.333,33 €",11-09-2017,07-02-2017,60 dias,"Portugal, Porto, Porto","Artigo 20.º, n.º 1, alínea a) do Código dos Contratos Públicos",,,,,,Não aplicável.,Não aplicável.,FALSE
