freguesia,acronym,validVotesPercentage,votes,dicofre
Sazes da Beira,PPD/PSD.CDS-PP,44.68,42,091219
Sazes da Beira,PS,38.3,36,091219
Sazes da Beira,MPT,11.7,11,091219
Sazes da Beira,B.E.,1.06,1,091219
Sazes da Beira,PCP-PEV,1.06,1,091219
Sazes da Beira,PCTP/MRPP,1.06,1,091219
Sazes da Beira,POUS,1.06,1,091219
Sazes da Beira,PPM,1.06,1,091219
Sazes da Beira,L,0,0,091219
Sazes da Beira,MAS,0,0,091219
Sazes da Beira,PAN,0,0,091219
Sazes da Beira,PDA,0,0,091219
Sazes da Beira,PND,0,0,091219
Sazes da Beira,PNR,0,0,091219
Sazes da Beira,PPV,0,0,091219
Sazes da Beira,PTP,0,0,091219
