Objeto do Contrato,Tipo de Procedimento,Tipo(s) de Contrato,CPVs,Entidade(s) Adjudicante(s),Entidade(s) Adjudicatária(s),Preço Contratual,Data de Publicação,Data de Celebração do Contrato,Prazo de Execução,Local de Execução,Fundamentação,Data de Fecho do Contrato,Preço Total Efetivo,Causas das Alterações ao Prazo,Causas das Alterações ao Preço,Estado,N.º registo do Acordo Quadro,Descrição do Acordo Quadro,Procedimento Centralizado
Aquisição de serviços para migração de dados no IPO Lisboa,Ajuste Direto Regime Geral,Outros Tipos (Concessão de exploração de bens do domínio público),"72510000-3, Serviços de gestão relacionados com a informática","SPMS - Serviços Partilhados do Ministério da Saúde, E. P. E. (509540716)","CAPGEMINI PORTUGAL Serviços de Consultadoria e Informática, S.A. (502829257)","9.888,00 €",30-11-2016,16-11-2016,180 dias,Portugal,"Artigo 20.º, n.º 1, alínea a) do Código dos Contratos Públicos",14-05-2017,"9.888,00 €",,,,Não aplicável.,Não aplicável.,FALSE
Aquisição de Preservativos e Gel lubrificante para o Programa Troca de Seringas,Ajuste Direto Regime Geral,Aquisição de bens móveis,"33140000-3, Material médico de consumo","SPMS- Serviços Partilhados do M. da Saúde, E.P.E. (509540716)","EZEQUIEL PANAO JORGE, LDA (501412727)","55.900,00 €",30-11-2016,28-09-2016,94 dias,Portugal,"Artigo 20.º, n.º 1, alínea a) do Código dos Contratos Públicos","","",,,,Não aplicável.,Não aplicável.,FALSE
"Aquisição de serviços jurídicos no âmbito do procedimento para a aquisição de serviços de rede informática da saúde,comunicações unificadas, centrais telefónicas e canal de serviço nacional de saúde e do procedimento relativo ao Centro de Contacto do SNS",Ajuste Direto Regime Geral,Aquisição de serviços,"79111000-5, Serviços de assessoria jurídica","SPMS - Serviços Partilhados do Ministério da Saúde, E. P. E. (509540716)",SÉRVULO & ASSOCIADOS - Sociedade de (504344285),"74.000,00 €",29-11-2016,12-09-2016,474 dias,Portugal,"Artigo 20.º, n.º 1, alínea a) do Código dos Contratos Públicos","","",,,,Não aplicável.,Não aplicável.,FALSE
Aquisição de serviços de manutenção evolutiva  novos desenvolvimentos para o SICC - SNC-AP,Ao abrigo de acordo-quadro (art.º 259.º),Aquisição de serviços,"72500000-0, Serviços relacionados com a informática","SPMS - Serviços Partilhados do Ministério da Saúde, E. P. E. (509540716)","AltranPortugal, S.A. (504272179)","114.804,80 €",21-11-2016,26-10-2016,365 dias,Portugal,Artigo 259.º do Código dos Contratos Públicos,"","",,,,425776,CONCURSO PÚBLICO n.º 20120117 -,FALSE
Aquisição de serviços TIC para alterações na plataforma de concursos especiais,Ajuste Direto Regime Geral,Outros Tipos (Concessão de exploração de bens do domínio público),"72500000-0, Serviços relacionados com a informática","SPMS- Serviços Partilhados do M. da Saúde, E.P.E. (509540716)","MasterLink - Sistemas de Informação, Lda (504143603)","5.000,00 €",21-11-2016,10-11-2016,60 dias,Portugal,"Artigo 20.º, n.º 1, alínea a) do Código dos Contratos Públicos",31-12-2016,"5.000,00 €",,,,Não aplicável.,Não aplicável.,FALSE
"Aquisição de serviços de metodologias """"Kaizen Lean"""" ",Ajuste Direto Regime Geral,Aquisição de serviços,"79420000-4, Serviços relacionados com a gestão","SPMS - Serviços Partilhados do Ministério da Saúde, E. P. E. (509540716)","KAIZEN INSTITUTE PORTUGAL – CONSULTORIA MANAGEMENT, UNIPESSOAL, LDA (508830001)","9.000,00 €",21-11-2016,09-11-2016,60 dias,Portugal,"Artigo 20.º, n.º 1, alínea a) do Código dos Contratos Públicos",31-12-2016,"9.000,00 €",,,,Não aplicável.,Não aplicável.,FALSE
Aquisição de serviços de auditoria à infraestrutura dos serviços centrais,Ajuste Direto Regime Geral,Outros Tipos (Concessão de exploração de bens do domínio público),"72810000-1, Serviços de auditoria informática","SPMS - Serviços Partilhados do Ministério da Saúde, E. P. E. (509540716)","Companhia IBM Portuguesa, S.A. (500068801)","74.950,00 €",21-11-2016,04-11-2016,419 dias,Portugal,"Artigo 20.º, n.º 1, alínea a) do Código dos Contratos Públicos",31-12-2017,"74.950,00 €",,,,Não aplicável.,Não aplicável.,FALSE
