freguesia,acronym,validVotesPercentage,votes,dicofre
Lamosa,PPD/PSD,40.7,35,181811
Lamosa,PS,36.05,31,181811
Lamosa,CDS-PP,10.47,9,181811
Lamosa,PDR,3.49,3,181811
Lamosa,A,2.33,2,181811
Lamosa,B.E.,2.33,2,181811
Lamosa,MAS,2.33,2,181811
Lamosa,NC,1.16,1,181811
Lamosa,PPM.PPV/CDC,1.16,1,181811
Lamosa,IL,0,0,181811
Lamosa,L,0,0,181811
Lamosa,PAN,0,0,181811
Lamosa,PCP-PEV,0,0,181811
Lamosa,PCTP/MRPP,0,0,181811
Lamosa,PNR,0,0,181811
Lamosa,PTP,0,0,181811
Lamosa,PURP,0,0,181811
