freguesia,acronym,validVotesPercentage,votes,dicofre
União das freguesias de Tondela e Nandufe,PPD/PSD.CDS-PP,40.5,582,182132
União das freguesias de Tondela e Nandufe,PS,31.52,453,182132
União das freguesias de Tondela e Nandufe,PCP-PEV,8.77,126,182132
União das freguesias de Tondela e Nandufe,MPT,6.68,96,182132
União das freguesias de Tondela e Nandufe,B.E.,5.22,75,182132
União das freguesias de Tondela e Nandufe,PAN,1.95,28,182132
União das freguesias de Tondela e Nandufe,L,1.6,23,182132
União das freguesias de Tondela e Nandufe,PCTP/MRPP,1.04,15,182132
União das freguesias de Tondela e Nandufe,PND,0.56,8,182132
União das freguesias de Tondela e Nandufe,PTP,0.56,8,182132
União das freguesias de Tondela e Nandufe,PPM,0.49,7,182132
União das freguesias de Tondela e Nandufe,PDA,0.28,4,182132
União das freguesias de Tondela e Nandufe,PNR,0.28,4,182132
União das freguesias de Tondela e Nandufe,PPV,0.28,4,182132
União das freguesias de Tondela e Nandufe,MAS,0.21,3,182132
União das freguesias de Tondela e Nandufe,POUS,0.07,1,182132
