freguesia,acronym,validVotesPercentage,votes,dicofre
Vendas Novas,PS,38.77,791,071201
Vendas Novas,PCP-PEV,24.9,508,071201
Vendas Novas,PPD/PSD,12.7,259,071201
Vendas Novas,B.E.,7.11,145,071201
Vendas Novas,CDS-PP,4.56,93,071201
Vendas Novas,PAN,3.24,66,071201
Vendas Novas,PCTP/MRPP,2.6,53,071201
Vendas Novas,PPM.PPV/CDC,1.57,32,071201
Vendas Novas,A,1.27,26,071201
Vendas Novas,NC,0.88,18,071201
Vendas Novas,L,0.74,15,071201
Vendas Novas,PURP,0.44,9,071201
Vendas Novas,IL,0.39,8,071201
Vendas Novas,PNR,0.34,7,071201
Vendas Novas,PDR,0.25,5,071201
Vendas Novas,PTP,0.2,4,071201
Vendas Novas,MAS,0.05,1,071201
