freguesia,acronym,validVotesPercentage,votes,dicofre
Alcanede,PPD/PSD,41.89,852,141604
Alcanede,PS,32.6,663,141604
Alcanede,B.E.,7.18,146,141604
Alcanede,CDS-PP,6.78,138,141604
Alcanede,PCP-PEV,3.1,63,141604
Alcanede,CH,1.43,29,141604
Alcanede,PAN,1.33,27,141604
Alcanede,IL,1.08,22,141604
Alcanede,R.I.R.,0.93,19,141604
Alcanede,A,0.69,14,141604
Alcanede,L,0.69,14,141604
Alcanede,PCTP/MRPP,0.44,9,141604
Alcanede,NC,0.39,8,141604
Alcanede,PNR,0.39,8,141604
Alcanede,PDR,0.34,7,141604
Alcanede,PPM,0.34,7,141604
Alcanede,MPT,0.2,4,141604
Alcanede,PTP,0.2,4,141604
Alcanede,PURP,0,0,141604
