freguesia,acronym,validVotesPercentage,votes,dicofre
Caniço,PS,31.33,3427,310803
Caniço,PPD/PSD,28.94,3165,310803
Caniço,JPP,16.11,1762,310803
Caniço,B.E.,6.82,746,310803
Caniço,CDS-PP,5.16,564,310803
Caniço,PAN,2.27,248,310803
Caniço,PCP-PEV,2,219,310803
Caniço,IL,0.99,108,310803
Caniço,R.I.R.,0.95,104,310803
Caniço,PTP,0.94,103,310803
Caniço,CH,0.91,100,310803
Caniço,PCTP/MRPP,0.77,84,310803
Caniço,A,0.69,76,310803
Caniço,PURP,0.52,57,310803
Caniço,L,0.51,56,310803
Caniço,PDR,0.37,41,310803
Caniço,MPT,0.3,33,310803
Caniço,NC,0.2,22,310803
Caniço,PNR,0.14,15,310803
Caniço,PPM,0.06,7,310803
