Objeto do Contrato,Tipo de Procedimento,Tipo(s) de Contrato,CPVs,Entidade(s) Adjudicante(s),Entidade(s) Adjudicatária(s),Preço Contratual,Data de Publicação,Data de Celebração do Contrato,Prazo de Execução,Local de Execução,Fundamentação,Data de Fecho do Contrato,Preço Total Efetivo,Causas das Alterações ao Prazo,Causas das Alterações ao Preço,Estado,N.º registo do Acordo Quadro,Descrição do Acordo Quadro,Procedimento Centralizado
"AQUISIÇÃO DE MATERIAL DE INCONTINÊNCIA, PROTECÇÃO CUTÂNEA",Ajuste Direto Regime Geral,Aquisição de bens móveis,"33751000-9, Fraldas descartáveis",HOSPITAL DR FRANCISCO ZAGALO (501510150),"PAUL HARTMANN LDA (502271728), INDAS PORTUGAL, LDA (503505196), EZEQUIEL PANÃO JORGE (501412727)","7.902,80 €",07-03-2012,11-01-2012,365 dias,"Portugal, Aveiro, Ovar","Artigo 26.º, n.º 1, alínea e) do Código dos Contratos Públicos",31-12-2012,"7.871,70 €",,Fornecimento abaixo do previsto,,Não aplicável.,Não aplicável.,
AQUISIÇÃO DE MATERIAL DE PENSO TRADICIONAL,Ajuste Direto Regime Geral,Aquisição de bens móveis,"33140000-3, Material médico de consumo",HOSPITAL DR FRANCISCO ZAGALO (501510150),"ALBINO DIAS ANDRADE, LDA (500013810), DOCWORLD,LDA (508592909), OVERPHARMA PROD. MEDICOS FARM (505792362), PERGUT PORTUGAL (501799729), BASTOS E VIEGAS, SA (500042772)","6.320,49 €",07-03-2012,11-01-2012,365 dias,"Portugal, Aveiro, Ovar","Artigo 26.º, n.º 1, alínea e) do Código dos Contratos Públicos",31-12-2012,"5.836,15 €",,fornecimento abaixo do previsto,,Não aplicável.,Não aplicável.,
"AQUISIÇÃO DE AGULHAS , SERINGAS E CONTENTORES",Ajuste Direto Regime Geral,Aquisição de bens móveis,"33140000-3, Material médico de consumo",HOSPITAL DR FRANCISCO ZAGALO (501510150),"PERGUT PORTUGAL (501799729), VIDROLAB 2 (501450629)","2.128,50 €",07-03-2012,02-02-2012,365 dias,"Portugal, Aveiro, Ovar","Artigo 26.º, n.º 1, alínea e) do Código dos Contratos Públicos",31-12-2012,"1.684,70 €",,Fornecimento abaixo do previsto,,Não aplicável.,Não aplicável.,
