freguesia,acronym,validVotesPercentage,votes,dicofre
Afife,PS,32.94,276,160901
Afife,PPD/PSD,29.83,250,160901
Afife,B.E.,12.29,103,160901
Afife,PCP-PEV,10.02,84,160901
Afife,CDS-PP,4.18,35,160901
Afife,PAN,3.1,26,160901
Afife,L,1.31,11,160901
Afife,CH,1.07,9,160901
Afife,PCTP/MRPP,1.07,9,160901
Afife,A,0.95,8,160901
Afife,IL,0.84,7,160901
Afife,R.I.R.,0.72,6,160901
Afife,JPP,0.36,3,160901
Afife,PPM,0.36,3,160901
Afife,PURP,0.36,3,160901
Afife,MPT,0.24,2,160901
Afife,PNR,0.24,2,160901
Afife,PDR,0.12,1,160901
Afife,NC,0,0,160901
Afife,PTP,0,0,160901
