freguesia,acronym,validVotesPercentage,votes,dicofre
União de freguesias de Freitas e Vila Cova,PS,51.09,211,030742
União de freguesias de Freitas e Vila Cova,PPD/PSD,26.39,109,030742
União de freguesias de Freitas e Vila Cova,B.E.,7.51,31,030742
União de freguesias de Freitas e Vila Cova,CDS-PP,4.36,18,030742
União de freguesias de Freitas e Vila Cova,PCP-PEV,4.12,17,030742
União de freguesias de Freitas e Vila Cova,R.I.R.,1.94,8,030742
União de freguesias de Freitas e Vila Cova,CH,1.69,7,030742
União de freguesias de Freitas e Vila Cova,MPT,0.48,2,030742
União de freguesias de Freitas e Vila Cova,PAN,0.48,2,030742
União de freguesias de Freitas e Vila Cova,PCTP/MRPP,0.48,2,030742
União de freguesias de Freitas e Vila Cova,PTP,0.48,2,030742
União de freguesias de Freitas e Vila Cova,A,0.24,1,030742
União de freguesias de Freitas e Vila Cova,JPP,0.24,1,030742
União de freguesias de Freitas e Vila Cova,MAS,0.24,1,030742
União de freguesias de Freitas e Vila Cova,NC,0.24,1,030742
União de freguesias de Freitas e Vila Cova,IL,0,0,030742
União de freguesias de Freitas e Vila Cova,L,0,0,030742
União de freguesias de Freitas e Vila Cova,PDR,0,0,030742
União de freguesias de Freitas e Vila Cova,PNR,0,0,030742
União de freguesias de Freitas e Vila Cova,PPM,0,0,030742
União de freguesias de Freitas e Vila Cova,PURP,0,0,030742
