freguesia,acronym,validVotesPercentage,votes,dicofre
Alcaria Ruiva,PCP-PEV,47.16,108,020901
Alcaria Ruiva,PS,33.62,77,020901
Alcaria Ruiva,PPD/PSD.CDS-PP,7.42,17,020901
Alcaria Ruiva,PCTP/MRPP,3.49,8,020901
Alcaria Ruiva,MPT,2.18,5,020901
Alcaria Ruiva,B.E.,1.75,4,020901
Alcaria Ruiva,L,0.87,2,020901
Alcaria Ruiva,PAN,0.87,2,020901
Alcaria Ruiva,PND,0.87,2,020901
Alcaria Ruiva,PNR,0.87,2,020901
Alcaria Ruiva,PPV,0.44,1,020901
Alcaria Ruiva,PTP,0.44,1,020901
Alcaria Ruiva,MAS,0,0,020901
Alcaria Ruiva,PDA,0,0,020901
Alcaria Ruiva,POUS,0,0,020901
Alcaria Ruiva,PPM,0,0,020901
