freguesia,acronym,validVotesPercentage,votes,dicofre
Barão de São Miguel,PS,37.27,41,081501
Barão de São Miguel,B.E.,20,22,081501
Barão de São Miguel,PPD/PSD,12.73,14,081501
Barão de São Miguel,PCP-PEV,11.82,13,081501
Barão de São Miguel,PAN,5.45,6,081501
Barão de São Miguel,PTP,2.73,3,081501
Barão de São Miguel,A,1.82,2,081501
Barão de São Miguel,L,1.82,2,081501
Barão de São Miguel,CDS-PP,0.91,1,081501
Barão de São Miguel,NC,0.91,1,081501
Barão de São Miguel,PCTP/MRPP,0.91,1,081501
Barão de São Miguel,PDR,0.91,1,081501
Barão de São Miguel,PNR,0.91,1,081501
Barão de São Miguel,PPM.PPV/CDC,0.91,1,081501
Barão de São Miguel,PURP,0.91,1,081501
Barão de São Miguel,IL,0,0,081501
Barão de São Miguel,MAS,0,0,081501
