freguesia,acronym,validVotesPercentage,votes,dicofre
"União das freguesias de Alhandra, São João dos Montes e Calhandriz",PS,41.1,2514,111412
"União das freguesias de Alhandra, São João dos Montes e Calhandriz",PCP-PEV,18.72,1145,111412
"União das freguesias de Alhandra, São João dos Montes e Calhandriz",PPD/PSD,14.32,876,111412
"União das freguesias de Alhandra, São João dos Montes e Calhandriz",B.E.,11.21,686,111412
"União das freguesias de Alhandra, São João dos Montes e Calhandriz",PAN,3.63,222,111412
"União das freguesias de Alhandra, São João dos Montes e Calhandriz",CDS-PP,2.34,143,111412
"União das freguesias de Alhandra, São João dos Montes e Calhandriz",CH,2.16,132,111412
"União das freguesias de Alhandra, São João dos Montes e Calhandriz",L,1.52,93,111412
"União das freguesias de Alhandra, São João dos Montes e Calhandriz",PCTP/MRPP,1.49,91,111412
"União das freguesias de Alhandra, São João dos Montes e Calhandriz",IL,0.9,55,111412
"União das freguesias de Alhandra, São João dos Montes e Calhandriz",A,0.56,34,111412
"União das freguesias de Alhandra, São João dos Montes e Calhandriz",R.I.R.,0.46,28,111412
"União das freguesias de Alhandra, São João dos Montes e Calhandriz",PDR,0.36,22,111412
"União das freguesias de Alhandra, São João dos Montes e Calhandriz",PNR,0.34,21,111412
"União das freguesias de Alhandra, São João dos Montes e Calhandriz",MPT,0.21,13,111412
"União das freguesias de Alhandra, São João dos Montes e Calhandriz",NC,0.21,13,111412
"União das freguesias de Alhandra, São João dos Montes e Calhandriz",MAS,0.15,9,111412
"União das freguesias de Alhandra, São João dos Montes e Calhandriz",PPM,0.11,7,111412
"União das freguesias de Alhandra, São João dos Montes e Calhandriz",PURP,0.11,7,111412
"União das freguesias de Alhandra, São João dos Montes e Calhandriz",PTP,0.1,6,111412
