Objeto do Contrato,Tipo de Procedimento,Tipo(s) de Contrato,CPVs,Entidade(s) Adjudicante(s),Entidade(s) Adjudicatária(s),Preço Contratual,Data de Publicação,Data de Celebração do Contrato,Prazo de Execução,Local de Execução,Fundamentação,Data de Fecho do Contrato,Preço Total Efetivo,Causas das Alterações ao Prazo,Causas das Alterações ao Preço,Estado,N.º registo do Acordo Quadro,Descrição do Acordo Quadro,Procedimento Centralizado
"Realização de Obras de Acessos Exteriores da Área Logística Nascente do CHSJ, EPE",Ajuste Direto Regime Geral,Empreitadas de obras públicas,"45000000-7, Construção","Centro Hospitalar de São João, E. P. E. (509821197)","Praiaco Soc Construções, Lda. (504970690)","99.796,00 €",29-01-2014,14-01-2014,60 dias,"Portugal, Porto, Porto","Artigo 19.º, alínea a) do Código dos Contratos Públicos",,,,,,Não aplicável.,Não aplicável.,FALSE
"Sistema análise e processamento de imagens Adaptive Targeting para o Acelerador Linear do Serviço de Radioterapia do CHSJ, EPE",Ajuste Direto Regime Geral,Aquisição de bens móveis,"48180000-3, Pacote de software para medicina","Centro Hospitalar de São João, E. P. E. (509821197)",Siemens SA (500247480),"72.000,00 €",29-01-2014,14-01-2014,60 dias,"Portugal, Porto, Porto","Artigo 24.º, n.º 1, alínea e) do Código dos Contratos Públicos",,,,,,Não aplicável.,Não aplicável.,FALSE
"Aquisição de 8 Discos HP para o Serviço Gestão Informação do CHSJ, EPE",Ajuste Direto Regime Geral,Aquisição de bens móveis,"30233132-5, Unidades de disco rígido","Centro Hospitalar São João, EPE (509821197)",ITEN Solutions (510728189),"7.450,00 €",27-01-2014,23-01-2014,15 dias,"Portugal, Porto, Porto","Artigo 20.º, n.º 1, alínea a) do Código dos Contratos Públicos",,,,,,Não aplicável.,Não aplicável.,FALSE
"Aquisição de 15 computadores Small Form Factor para diversos Serviços do CHSJ, EPE",Ajuste Direto Regime Geral,Aquisição de bens móveis,"30213000-5, Computadores pessoais","Centro Hospitalar São João, EPE (509821197)",ITEN Solutions SA (510728189),"9.390,75 €",21-01-2014,21-01-2014,15 dias,"Portugal, Porto, Porto","Artigo 20.º, n.º 1, alínea a) do Código dos Contratos Públicos",,,,,,Não aplicável.,Não aplicável.,FALSE
