freguesia,acronym,validVotesPercentage,votes,dicofre
Fornelos,PPD/PSD,43.86,182,030234
Fornelos,PS,27.47,114,030234
Fornelos,CDS-PP,17.83,74,030234
Fornelos,B.E.,3.61,15,030234
Fornelos,R.I.R.,1.93,8,030234
Fornelos,PAN,1.2,5,030234
Fornelos,MPT,0.96,4,030234
Fornelos,PCP-PEV,0.96,4,030234
Fornelos,A,0.72,3,030234
Fornelos,CH,0.48,2,030234
Fornelos,L,0.48,2,030234
Fornelos,PCTP/MRPP,0.48,2,030234
Fornelos,IL,0,0,030234
Fornelos,JPP,0,0,030234
Fornelos,MAS,0,0,030234
Fornelos,NC,0,0,030234
Fornelos,PDR,0,0,030234
Fornelos,PNR,0,0,030234
Fornelos,PPM,0,0,030234
Fornelos,PTP,0,0,030234
Fornelos,PURP,0,0,030234
