freguesia,acronym,validVotesPercentage,votes,dicofre
Canaveses,PPD/PSD.CDS-PP,64.71,55,171206
Canaveses,PS,23.53,20,171206
Canaveses,PCP-PEV,3.53,3,171206
Canaveses,PCTP/MRPP,2.35,2,171206
Canaveses,PND,2.35,2,171206
Canaveses,MPT,1.18,1,171206
Canaveses,PAN,1.18,1,171206
Canaveses,PTP,1.18,1,171206
Canaveses,B.E.,0,0,171206
Canaveses,L,0,0,171206
Canaveses,MAS,0,0,171206
Canaveses,PDA,0,0,171206
Canaveses,PNR,0,0,171206
Canaveses,POUS,0,0,171206
Canaveses,PPM,0,0,171206
Canaveses,PPV,0,0,171206
