Objeto do Contrato,Tipo de Procedimento,Tipo(s) de Contrato,CPVs,Entidade(s) Adjudicante(s),Entidade(s) Adjudicatária(s),Preço Contratual,Data de Publicação,Data de Celebração do Contrato,Prazo de Execução,Local de Execução,Fundamentação,Data de Fecho do Contrato,Preço Total Efetivo,Causas das Alterações ao Prazo,Causas das Alterações ao Preço,Estado,N.º registo do Acordo Quadro,Descrição do Acordo Quadro,Procedimento Centralizado
TREPROSTINILO 5 MG/ML SOL INJ FR 20 ML SC - Aquisição P259-AC-2017-54 - Ajuste Directo Nº 11114617,Ajuste Direto Regime Geral,Aquisição de bens móveis,"33000000-0, Equipamento médico, medicamentos e produtos para cuidados pessoais","Hospital Garcia de Orta, E. P. E. (506361470)","FERRER PORTUGAL, S.A. (500069190)","0,00 €",19-05-2017,03-05-2017,365 dias,"Portugal, Setúbal, Almada",Artigo 258.º do Código dos Contratos Públicos,,,,,,2756802,TREPROSTINILO 5 MG/ML SOL INJ FR 20 ML SC - Aquisição P259-AC-2017-54,FALSE
AQUISIÇÃO DE MATERIAL DE ELECTROMEDICINA - Ajuste Directo Nº 2411917,Ajuste Direto Regime Geral,Aquisição de bens móveis,"33100000-1, Equipamento médico","Hospital Garcia de Orta, E. P. E. (506361470)","MEDTRONIC PORTUGAL, LDA. (504223933)","23.794,00 €",19-05-2017,21-03-2017,365 dias,"Portugal, Setúbal, Almada","Artigo 20.º, n.º 1, alínea a) do Código dos Contratos Públicos",,,,,,Não aplicável.,Não aplicável.,FALSE
AQUISIÇÃO DE 5 CANDEIROS DE OBSERVAÇÃO COM FIXAÇÃO AO TECTO -  Ajuste Directo Nº 7400886,Ajuste Direto Regime Geral,Aquisição de bens móveis,"33100000-1, Equipamento médico","Hospital Garcia de Orta, E. P. E. (506361470)","DRAGER PORTUGAL, LDA. (508771323)","13.849,00 €",19-05-2017,29-12-2016,365 dias,"Portugal, Setúbal, Almada","Artigo 20.º, n.º 1, alínea a) do Código dos Contratos Públicos",,,,,,Não aplicável.,Não aplicável.,FALSE
ABACAVIR 600MG+LAMIVUDINA 300 MG COMP- P259-AC-2017-28 - Ajuste Directo Nº 11050317,Ao abrigo de acordo-quadro (art.º 259.º),Aquisição de bens móveis,"33000000-0, Equipamento médico, medicamentos e produtos para cuidados pessoais","Hospital Garcia de Orta, E. P. E. (506361470)","ViiV Healthcare, Unipessoal Lda (509117961)","24.000,00 €",19-05-2017,02-02-2017,365 dias,"Portugal, Setúbal, Almada",Artigo 259.º do Código dos Contratos Públicos,,,,,,2183729,Medicamentos antirretrovíricos para o tratamento da infeção por VIH,FALSE
BELIMUMAB - SPMS P259-AC-2017-13 - Ajuste Directo Nº 11056917,Ao abrigo de acordo-quadro (art.º 259.º),Aquisição de bens móveis,"33000000-0, Equipamento médico, medicamentos e produtos para cuidados pessoais","Hospital Garcia de Orta, E. P. E. (506361470)","GLAXOSMITHKLINE PROD. FARMACÊUTICOS, LDA. (500139962)","25.271,60 €",19-05-2017,03-03-2017,365 dias,"Portugal, Setúbal, Almada",Artigo 259.º do Código dos Contratos Públicos,,,,,,1771819,CP 2015/6 - Acordo quadro para o fornecimento de Medicamentos do Foro Oncológico,FALSE
HIDROXIUREIA (HIDROXICARBAMIDA) 500 MG CÁPS - Ajuste Directo Nº 11105617,Ao abrigo de acordo-quadro (art.º 259.º),Aquisição de bens móveis,"33000000-0, Equipamento médico, medicamentos e produtos para cuidados pessoais","Hospital Garcia de Orta, E. P. E. (506361470)",MEDAC SUCURSAL EM PORTUGAL (980369959),"5.006,61 €",19-05-2017,03-05-2017,90 dias,"Portugal, Setúbal, Almada",Artigo 259.º do Código dos Contratos Públicos,,,,,,1771819,CP 2015/6 - Acordo quadro para o fornecimento de Medicamentos do Foro Oncológico,FALSE
NIVOLUMAB 10 MG/ML SOL INJ FR 4 ML IV - Ajuste Directo Nº 14114817,Ajuste Direto Regime Geral,Aquisição de bens móveis,"33000000-0, Equipamento médico, medicamentos e produtos para cuidados pessoais","Hospital Garcia de Orta, E. P. E. (506361470)",BRISTOL-MYERS SQUIBB PORTUGAL (500207879),"10.560,00 €",18-05-2017,03-05-2017,365 dias,"Portugal, Setúbal, Almada","Artigo 24.º, n.º 1, alínea e) do Código dos Contratos Públicos",,,,,,Não aplicável.,Não aplicável.,FALSE
DARBEPOETINAS - Ajuste Directo Nº 11110817,Ao abrigo de acordo-quadro (art.º 259.º),Aquisição de bens móveis,"33000000-0, Equipamento médico, medicamentos e produtos para cuidados pessoais","Hospital Garcia de Orta, E. P. E. (506361470)","AMGEN - BIOFARMACÊUTICA, LDA. (502942959)","65.600,00 €",18-05-2017,04-05-2017,365 dias,"Portugal, Setúbal, Almada",Artigo 259.º do Código dos Contratos Públicos,,,,,,1348990,Acordo quadro para fornecimento de Estimulantes da Eritropoiese às instituições e serviços do serviço nacional de saúde,FALSE
ETANERCEPT SERINGA 50 MG/1 ML SOL INJ  1 ML SC - Ajuste Directo Nº 11106117,Ao abrigo de acordo-quadro (art.º 259.º),Aquisição de bens móveis,"33000000-0, Equipamento médico, medicamentos e produtos para cuidados pessoais","Hospital Garcia de Orta, E. P. E. (506361470)","Pfizer Biofarmaceutica, Sociedade Unipessoal Lda. (513300376)","132.683,04 €",18-05-2017,04-05-2017,90 dias,"Portugal, Setúbal, Almada",Artigo 259.º do Código dos Contratos Públicos,,,,,,1771819,CP 2015/6 - Acordo quadro para o fornecimento de Medicamentos do Foro Oncológico,FALSE
DOLUTEGRAVIR 50 MG + ABACAVIR 600 MG + LAMIVUDINA 300 MG COMP - Ajuste Directo Nº 14116317,Ajuste Direto Regime Geral,Aquisição de bens móveis,"33000000-0, Equipamento médico, medicamentos e produtos para cuidados pessoais","Hospital Garcia de Orta, E. P. E. (506361470)","VIIVHIV HEALTHCARE, UNIPESSOAL, LDA. (509117961)","100.800,18 €",18-05-2017,08-05-2017,90 dias,"Portugal, Setúbal, Almada","Artigo 24.º, n.º 1, alínea c) do Código dos Contratos Públicos",,,,,,Não aplicável.,Não aplicável.,FALSE
PERTUZUMAB 420 MG/14 ML SOL INJ FR 14 ML IV - Ajuste Directo Nº 11117417,Ao abrigo de acordo-quadro (art.º 259.º),Aquisição de bens móveis,"33000000-0, Equipamento médico, medicamentos e produtos para cuidados pessoais","Hospital Garcia de Orta, E. P. E. (506361470)","ROCHE FARMACEUTICA QUIMICA, LDA (500233810)","82.849,50 €",18-05-2017,11-05-2017,60 dias,"Portugal, Setúbal, Almada",Artigo 259.º do Código dos Contratos Públicos,,,,,,1771819,CP 2015/6 - Acordo quadro para o fornecimento de Medicamentos do Foro Oncológico,FALSE
CARDIOVERSOR DESFIBRILHADOR IMPLANTAVEL - Ajuste Directo Nº 2444936,Ajuste Direto Regime Geral,Aquisição de bens móveis,"33000000-0, Equipamento médico, medicamentos e produtos para cuidados pessoais","Hospital Garcia de Orta, E. P. E. (506361470)",ST. JUDE MEDICAL PORTUGAL (504180746),"9.000,00 €",18-05-2017,10-11-2016,365 dias,"Portugal, Setúbal, Almada","Artigo 20.º, n.º 1, alínea a) do Código dos Contratos Públicos",,,,,,Não aplicável.,Não aplicável.,FALSE
AMBRISENTANO 10 MG COMP- Aquisição P259-AC-2017-69 - Ajuste Directo Nº 11113317,Ao abrigo de acordo-quadro (art.º 259.º),Aquisição de bens móveis,"33000000-0, Equipamento médico, medicamentos e produtos para cuidados pessoais","Hospital Garcia de Orta, E. P. E. (506361470)","GLAXOSMITHKLINE PROD. FARMACÊUTICOS, LDA. (500139962)","63.042,41 €",18-05-2017,28-04-2017,365 dias,"Portugal, Setúbal, Almada",Artigo 259.º do Código dos Contratos Públicos,,,,,,1179915,"CONCURSO PÚBLICO PARA A CELEBRAÇÃO DE CONTRATOS PÚBLICOS DE APROVISIONAMENTO PARA A ÁREA DA SAÚDE, COM VISTA AO FORNECIMENTO DE MEDICAMENTOS DO APARELHO CARDIOVASCULAR, ÀS INSTITUIÇÕES E SERVIÇOS DO SERVIÇO NACIONAL DE SAÚDE",FALSE
AQUISIÇÃO DE MEDICAMENTOS P259-AC-2017-37 - Ajuste Directo Nº 11110717,Ao abrigo de acordo-quadro (art.º 259.º),Aquisição de bens móveis,"33000000-0, Equipamento médico, medicamentos e produtos para cuidados pessoais","Hospital Garcia de Orta, E. P. E. (506361470)","PFIZER BIOFARMACÊUTICA, SOC. UNIP., LDA. (513300376)","244.336,82 €",18-05-2017,24-04-2017,365 dias,"Portugal, Setúbal, Almada",Artigo 259.º do Código dos Contratos Públicos,,,,,,1771819,CP 2015/6 - Acordo quadro para o fornecimento de Medicamentos do Foro Oncológico,FALSE
LENALIDOMIDA 5 MG CÁPSULA - Aquisição AD-AC-2017-47 - Ajuste Directo Nº 11114517,Ajuste Direto Regime Geral,Aquisição de bens móveis,"33000000-0, Equipamento médico, medicamentos e produtos para cuidados pessoais","Hospital Garcia de Orta, E. P. E. (506361470)","CELGENE SOCIEDADE UNIPESSOAL, LDA. (507791690)","17.811,71 €",18-05-2017,28-04-2017,365 dias,"Portugal, Setúbal, Almada","Artigo 24.º, n.º 1, alínea e) do Código dos Contratos Públicos",,,,,,Não aplicável.,Não aplicável.,FALSE
PERMETREXEDO - AQUISIÇÃO P259-AC-2017-46 - Ajuste Directo Nº 11111617,Ao abrigo de acordo-quadro (art.º 259.º),Aquisição de bens móveis,"33000000-0, Equipamento médico, medicamentos e produtos para cuidados pessoais","Hospital Garcia de Orta, E. P. E. (506361470)","LILLY PORTUGAL PORTUGAL - PROD. FARM., LDA. (500165602)","17.591,20 €",17-05-2017,27-04-2017,365 dias,"Portugal, Setúbal, Almada",Artigo 259.º do Código dos Contratos Públicos,,,,,,1771819,CP 2015/6 - Acordo quadro para o fornecimento de Medicamentos do Foro Oncológico,FALSE
VEMURAFENIB 240 MG COMP - PROCEDIMENTO P259-AC-2017-22 - Ajuste Directo Nº 11094117,Ao abrigo de acordo-quadro (art.º 259.º),Aquisição de bens móveis,"33000000-0, Equipamento médico, medicamentos e produtos para cuidados pessoais","Hospital Garcia de Orta, E. P. E. (506361470)","ROCHE FARMACEUTICA QUIMICA, LDA (500233810)","40.662,44 €",17-05-2017,20-04-2017,365 dias,"Portugal, Setúbal, Almada",Artigo 259.º do Código dos Contratos Públicos,,,,,,1771819,CP 2015/6 - Acordo quadro para o fornecimento de Medicamentos do Foro Oncológico,FALSE
DEGARRELIX 80 MG PÓ SOL INJ FR SC - Aquisição P259-AC-2017-63 - Ajuste Directo nº 11112917,Ao abrigo de acordo-quadro (art.º 259.º),Aquisição de bens móveis,"33000000-0, Equipamento médico, medicamentos e produtos para cuidados pessoais","Hospital Garcia de Orta, E. P. E. (506361470)","FERRING PORTUGUESA - PROD. FARM. SOC. UNIP., LDA. (502034831)","5.600,04 €",17-05-2017,28-04-2017,365 dias,"Portugal, Setúbal, Almada",Artigo 259.º do Código dos Contratos Públicos,,,,,,1771819,CP 2015/6 - Acordo quadro para o fornecimento de Medicamentos do Foro Oncológico,FALSE
CARDIOVERSOR DESFIBRILHADOR IMPLANTAVEL - Ajuste Directo Nº 2444796,Ajuste Direto Regime Geral,Aquisição de bens móveis,"33000000-0, Equipamento médico, medicamentos e produtos para cuidados pessoais","Hospital Garcia de Orta, E. P. E. (506361470)",Biotronik Portugal (510726941),"8.750,00 €",17-05-2017,09-11-2016,365 dias,"Portugal, Setúbal, Almada","Artigo 20.º, n.º 1, alínea a) do Código dos Contratos Públicos",,,,,,Não aplicável.,Não aplicável.,FALSE
AQUISIÇÃO DE PAPEL DE RESGUARDO PARA MARQUESA - Ajuste Directo Nº 2407227,Ajuste Direto Regime Geral,Aquisição de bens móveis,"33000000-0, Equipamento médico, medicamentos e produtos para cuidados pessoais","Hospital Garcia de Orta, E. P. E. (506361470)","M. U. C. - MATERIAL UTILIDADE CLÍNICA, LDA. (502379308)","17.388,00 €",16-05-2017,07-04-2017,365 dias,"Portugal, Setúbal, Almada","Artigo 20.º, n.º 1, alínea a) do Código dos Contratos Públicos",,,,,,Não aplicável.,Não aplicável.,FALSE
PINCA EXTRACTORA DE PONTOS - Ajuste Directo Nº 2415087,Ajuste Direto Regime Geral,Aquisição de bens móveis,"33000000-0, Equipamento médico, medicamentos e produtos para cuidados pessoais","Hospital Garcia de Orta, E. P. E. (506361470)","B BRAUN MEDICAL, LDA (501506543)","8.795,80 €",11-05-2017,20-04-2017,365 dias,"Portugal, Setúbal, Almada","Artigo 20.º, n.º 1, alínea a) do Código dos Contratos Públicos",,,,,,Não aplicável.,Não aplicável.,FALSE
