freguesia,acronym,validVotesPercentage,votes,dicofre
Torreira,PPD/PSD,41.15,421,011204
Torreira,PS,28.74,294,011204
Torreira,B.E.,8.9,91,011204
Torreira,CDS-PP,8.02,82,011204
Torreira,PCP-PEV,3.71,38,011204
Torreira,PAN,3.32,34,011204
Torreira,CH,1.27,13,011204
Torreira,IL,1.27,13,011204
Torreira,R.I.R.,1.17,12,011204
Torreira,A,0.68,7,011204
Torreira,PCTP/MRPP,0.49,5,011204
Torreira,L,0.39,4,011204
Torreira,MPT,0.2,2,011204
Torreira,NC,0.2,2,011204
Torreira,PURP,0.2,2,011204
Torreira,JPP,0.1,1,011204
Torreira,PPM,0.1,1,011204
Torreira,PTP,0.1,1,011204
Torreira,PDR,0,0,011204
Torreira,PNR,0,0,011204
