freguesia,acronym,validVotesPercentage,votes,dicofre
Carriço,PPD/PSD.CDS-PP,47.23,367,101505
Carriço,PS,28.57,222,101505
Carriço,MPT,8.11,63,101505
Carriço,PCP-PEV,2.83,22,101505
Carriço,L,2.57,20,101505
Carriço,PCTP/MRPP,2.32,18,101505
Carriço,PND,1.93,15,101505
Carriço,B.E.,1.8,14,101505
Carriço,PAN,1.16,9,101505
Carriço,PTP,1.03,8,101505
Carriço,MAS,0.64,5,101505
Carriço,PPM,0.64,5,101505
Carriço,PDA,0.39,3,101505
Carriço,PNR,0.39,3,101505
Carriço,POUS,0.26,2,101505
Carriço,PPV,0.13,1,101505
