freguesia,acronym,validVotesPercentage,votes,dicofre
Castelo Branco,PS,34.84,3354,050205
Castelo Branco,PPD/PSD,22.23,2140,050205
Castelo Branco,B.E.,13.83,1331,050205
Castelo Branco,CDS-PP,6.12,589,050205
Castelo Branco,PAN,5.04,485,050205
Castelo Branco,PCP-PEV,4.91,473,050205
Castelo Branco,PPM.PPV/CDC,2.82,271,050205
Castelo Branco,A,2.79,269,050205
Castelo Branco,L,2.2,212,050205
Castelo Branco,NC,1.34,129,050205
Castelo Branco,PNR,0.83,80,050205
Castelo Branco,IL,0.82,79,050205
Castelo Branco,PCTP/MRPP,0.72,69,050205
Castelo Branco,PURP,0.71,68,050205
Castelo Branco,PDR,0.38,37,050205
Castelo Branco,MAS,0.24,23,050205
Castelo Branco,PTP,0.18,17,050205
