freguesia,acronym,validVotesPercentage,votes,dicofre
Feteiras,PS,61.9,195,420309
Feteiras,PPD/PSD,18.1,57,420309
Feteiras,B.E.,7.62,24,420309
Feteiras,CDS-PP,3.81,12,420309
Feteiras,PAN,2.22,7,420309
Feteiras,PCP-PEV,1.59,5,420309
Feteiras,PCTP/MRPP,1.27,4,420309
Feteiras,L,0.95,3,420309
Feteiras,CH,0.63,2,420309
Feteiras,IL,0.63,2,420309
Feteiras,PTP,0.63,2,420309
Feteiras,PNR,0.32,1,420309
Feteiras,PPM,0.32,1,420309
Feteiras,A,0,0,420309
Feteiras,MAS,0,0,420309
Feteiras,MPT,0,0,420309
Feteiras,PDR,0,0,420309
