freguesia,acronym,validVotesPercentage,votes,dicofre
Grijó de Parada,PS,51.47,70,040219
Grijó de Parada,PPD/PSD,30.15,41,040219
Grijó de Parada,CDS-PP,9.56,13,040219
Grijó de Parada,B.E.,2.94,4,040219
Grijó de Parada,PCP-PEV,2.94,4,040219
Grijó de Parada,IL,1.47,2,040219
Grijó de Parada,CH,0.74,1,040219
Grijó de Parada,R.I.R.,0.74,1,040219
Grijó de Parada,A,0,0,040219
Grijó de Parada,L,0,0,040219
Grijó de Parada,NC,0,0,040219
Grijó de Parada,PAN,0,0,040219
Grijó de Parada,PCTP/MRPP,0,0,040219
Grijó de Parada,PDR,0,0,040219
Grijó de Parada,PNR,0,0,040219
Grijó de Parada,PPM,0,0,040219
Grijó de Parada,PTP,0,0,040219
Grijó de Parada,PURP,0,0,040219
