freguesia,acronym,validVotesPercentage,votes,dicofre
"União das freguesias de Algés, Linda-a-Velha e Cruz Quebrada-Dafundo",PS,33.39,8634,111012
"União das freguesias de Algés, Linda-a-Velha e Cruz Quebrada-Dafundo",PPD/PSD,29.04,7510,111012
"União das freguesias de Algés, Linda-a-Velha e Cruz Quebrada-Dafundo",B.E.,9.04,2339,111012
"União das freguesias de Algés, Linda-a-Velha e Cruz Quebrada-Dafundo",PCP-PEV,6.93,1793,111012
"União das freguesias de Algés, Linda-a-Velha e Cruz Quebrada-Dafundo",CDS-PP,5.97,1543,111012
"União das freguesias de Algés, Linda-a-Velha e Cruz Quebrada-Dafundo",PAN,4.24,1096,111012
"União das freguesias de Algés, Linda-a-Velha e Cruz Quebrada-Dafundo",IL,3.75,969,111012
"União das freguesias de Algés, Linda-a-Velha e Cruz Quebrada-Dafundo",L,2.77,717,111012
"União das freguesias de Algés, Linda-a-Velha e Cruz Quebrada-Dafundo",A,1.63,421,111012
"União das freguesias de Algés, Linda-a-Velha e Cruz Quebrada-Dafundo",CH,1.19,308,111012
"União das freguesias de Algés, Linda-a-Velha e Cruz Quebrada-Dafundo",PCTP/MRPP,0.43,111,111012
"União das freguesias de Algés, Linda-a-Velha e Cruz Quebrada-Dafundo",NC,0.31,79,111012
"União das freguesias de Algés, Linda-a-Velha e Cruz Quebrada-Dafundo",MPT,0.28,72,111012
"União das freguesias de Algés, Linda-a-Velha e Cruz Quebrada-Dafundo",R.I.R.,0.28,72,111012
"União das freguesias de Algés, Linda-a-Velha e Cruz Quebrada-Dafundo",PNR,0.26,68,111012
"União das freguesias de Algés, Linda-a-Velha e Cruz Quebrada-Dafundo",PURP,0.18,47,111012
"União das freguesias de Algés, Linda-a-Velha e Cruz Quebrada-Dafundo",PPM,0.15,38,111012
"União das freguesias de Algés, Linda-a-Velha e Cruz Quebrada-Dafundo",PDR,0.09,23,111012
"União das freguesias de Algés, Linda-a-Velha e Cruz Quebrada-Dafundo",MAS,0.04,11,111012
"União das freguesias de Algés, Linda-a-Velha e Cruz Quebrada-Dafundo",PTP,0.03,9,111012
