freguesia,acronym,validVotesPercentage,votes,dicofre
Reguenga,PS,39.5,190,131418
Reguenga,PPD/PSD,37.21,179,131418
Reguenga,CDS-PP,5.61,27,131418
Reguenga,B.E.,5.41,26,131418
Reguenga,PAN,3.12,15,131418
Reguenga,PCP-PEV,2.7,13,131418
Reguenga,A,1.66,8,131418
Reguenga,L,1.25,6,131418
Reguenga,NC,0.83,4,131418
Reguenga,IL,0.62,3,131418
Reguenga,PCTP/MRPP,0.42,2,131418
Reguenga,PDR,0.42,2,131418
Reguenga,PPM.PPV/CDC,0.42,2,131418
Reguenga,PTP,0.42,2,131418
Reguenga,PURP,0.42,2,131418
Reguenga,MAS,0,0,131418
Reguenga,PNR,0,0,131418
