freguesia,acronym,validVotesPercentage,votes,dicofre
União das freguesias de Estremoz (Santa Maria e Santo André),PS,40.05,461,070414
União das freguesias de Estremoz (Santa Maria e Santo André),PPD/PSD,20.07,231,070414
União das freguesias de Estremoz (Santa Maria e Santo André),B.E.,10.51,121,070414
União das freguesias de Estremoz (Santa Maria e Santo André),PCP-PEV,10.51,121,070414
União das freguesias de Estremoz (Santa Maria e Santo André),CDS-PP,7.38,85,070414
União das freguesias de Estremoz (Santa Maria e Santo André),PPM.PPV/CDC,2.87,33,070414
União das freguesias de Estremoz (Santa Maria e Santo André),PAN,1.91,22,070414
União das freguesias de Estremoz (Santa Maria e Santo André),A,1.74,20,070414
União das freguesias de Estremoz (Santa Maria e Santo André),L,1.22,14,070414
União das freguesias de Estremoz (Santa Maria e Santo André),PCTP/MRPP,0.96,11,070414
União das freguesias de Estremoz (Santa Maria e Santo André),PURP,0.78,9,070414
União das freguesias de Estremoz (Santa Maria e Santo André),PNR,0.61,7,070414
União das freguesias de Estremoz (Santa Maria e Santo André),NC,0.43,5,070414
União das freguesias de Estremoz (Santa Maria e Santo André),PTP,0.43,5,070414
União das freguesias de Estremoz (Santa Maria e Santo André),IL,0.26,3,070414
União das freguesias de Estremoz (Santa Maria e Santo André),PDR,0.26,3,070414
União das freguesias de Estremoz (Santa Maria e Santo André),MAS,0,0,070414
