freguesia,acronym,validVotesPercentage,votes,dicofre
Seixo da Beira,PPD/PSD.CDS-PP,52.57,174,061118
Seixo da Beira,PS,34.74,115,061118
Seixo da Beira,MPT,3.02,10,061118
Seixo da Beira,PND,1.81,6,061118
Seixo da Beira,B.E.,1.51,5,061118
Seixo da Beira,PCP-PEV,1.21,4,061118
Seixo da Beira,PCTP/MRPP,1.21,4,061118
Seixo da Beira,PTP,1.21,4,061118
Seixo da Beira,MAS,0.91,3,061118
Seixo da Beira,PDA,0.6,2,061118
Seixo da Beira,PPM,0.6,2,061118
Seixo da Beira,L,0.3,1,061118
Seixo da Beira,PAN,0.3,1,061118
Seixo da Beira,PNR,0,0,061118
Seixo da Beira,POUS,0,0,061118
Seixo da Beira,PPV,0,0,061118
