Objeto do Contrato,Tipo de Procedimento,Tipo(s) de Contrato,CPVs,Entidade(s) Adjudicante(s),Entidade(s) Adjudicatária(s),Preço Contratual,Data de Publicação,Data de Celebração do Contrato,Prazo de Execução,Local de Execução,Fundamentação,Data de Fecho do Contrato,Preço Total Efetivo,Causas das Alterações ao Prazo,Causas das Alterações ao Preço,Estado,N.º registo do Acordo Quadro,Descrição do Acordo Quadro,Procedimento Centralizado
"O presente procedimento tem por objeto a aquisição dos bens acima identificados, para o CHPVVC,E.P.E.",Ao abrigo de acordo-quadro (art.º 259.º),Aquisição de bens móveis,"33622000-6, Medicamentos para o aparelho cardiovascular","Centro Hospitalar Póvoa de Varzim/Vila do Conde, EPE (508741823)","AUROVITAS UNIPESSOAL, LDA (513053239)","237,12 €",09-04-2018,06-02-2018,392 dias,"Portugal, Porto, Póvoa de Varzim",Artigo 259.º do Código dos Contratos Públicos,,,,,,2335591,CP 2016/01 - Acordo Quadro para fornecimento de Medicamentos do Aparelho Cardiovascular   às Instituições e Serviços do Serviço Nacional de Saúde,FALSE
"O presente procedimento tem por objeto a aquisição dos bens acima identificados, para o CHPVVC,E.P.E.",Ao abrigo de acordo-quadro (art.º 259.º),Aquisição de bens móveis,"33622000-6, Medicamentos para o aparelho cardiovascular","Centro Hospitalar Póvoa de Varzim/Vila do Conde, EPE (508741823)","AUROBINDO PHARMA PORTUGAL, (UNIP.) LDA (508527465)","75,00 €",09-04-2018,06-02-2018,392 dias,"Portugal, Porto, Póvoa de Varzim",Artigo 259.º do Código dos Contratos Públicos,,,,,,2335591,CP 2016/01 - Acordo Quadro para fornecimento de Medicamentos do Aparelho Cardiovascular   às Instituições e Serviços do Serviço Nacional de Saúde,FALSE
"O presente procedimento tem por objeto a aquisição dos bens acima identificados, para o CHPVVC,E.P.E. ",Ao abrigo de acordo-quadro (art.º 259.º),Aquisição de bens móveis,"33622000-6, Medicamentos para o aparelho cardiovascular","Centro Hospitalar Póvoa de Varzim/Vila do Conde, EPE (508741823)","Generis Farmaceutica, S.A. (508107997)","153,36 €",09-04-2018,06-02-2018,392 dias,"Portugal, Porto, Póvoa de Varzim",Artigo 259.º do Código dos Contratos Públicos,,,,,,2335591,CP 2016/01 - Acordo Quadro para fornecimento de Medicamentos do Aparelho Cardiovascular   às Instituições e Serviços do Serviço Nacional de Saúde,FALSE
"O presente procedimento tem por objeto a aquisição dos bens acima identificados, para o CHPVVC,E.P.E.           ",Ao abrigo de acordo-quadro (art.º 259.º),Aquisição de bens móveis,"33622000-6, Medicamentos para o aparelho cardiovascular","Centro Hospitalar Póvoa de Varzim/Vila do Conde, EPE (508741823)",PHARMAKERN PORTUGAL PRODUTOS FARMACEUTICOS SOCIEDADE UNIPESSOAL LDA PORTUGAL (507002571),"126,27 €",09-04-2018,06-02-2018,392 dias,"Portugal, Porto, Póvoa de Varzim",Artigo 259.º do Código dos Contratos Públicos,,,,,,2335591,CP 2016/01 - Acordo Quadro para fornecimento de Medicamentos do Aparelho Cardiovascular   às Instituições e Serviços do Serviço Nacional de Saúde,FALSE
"O presente procedimento tem por objeto a aquisição dos bens acima identificados, para o CHPVVC,E.P.E",Ao abrigo de acordo-quadro (art.º 259.º),Aquisição de bens móveis,"33622000-6, Medicamentos para o aparelho cardiovascular","Centro Hospitalar Póvoa de Varzim/Vila do Conde, EPE (508741823)","ASTRAZENECA-PRODUTOS FARMACÊUTICOS,LDA. (502942240)","32,38 €",09-04-2018,06-02-2018,392 dias,"Portugal, Porto, Póvoa de Varzim",Artigo 259.º do Código dos Contratos Públicos,,,,,,2335591,CP 2016/01 - Acordo Quadro para fornecimento de Medicamentos do Aparelho Cardiovascular   às Instituições e Serviços do Serviço Nacional de Saúde,FALSE
"O presente procedimento tem por objeto a aquisição dos bens acima identificados, para o CHPVVC,E.P.E",Ao abrigo de acordo-quadro (art.º 259.º),Aquisição de bens móveis,"33622000-6, Medicamentos para o aparelho cardiovascular","Centro Hospitalar Póvoa de Varzim/Vila do Conde, EPE (508741823)","Farmoz  - Sociedade Técnico Medicinal, SA (501505334)","208,57 €",09-04-2018,06-02-2018,392 dias,"Portugal, Porto, Póvoa de Varzim",Artigo 259.º do Código dos Contratos Públicos,,,,,,2335591,CP 2016/01 - Acordo Quadro para fornecimento de Medicamentos do Aparelho Cardiovascular   às Instituições e Serviços do Serviço Nacional de Saúde,FALSE
"O presente procedimento tem por objeto a aquisição dos bens acima identificados, para o CHPVVC,E.P.E.",Ao abrigo de acordo-quadro (art.º 259.º),Aquisição de bens móveis,"33622000-6, Medicamentos para o aparelho cardiovascular","Centro Hospitalar Póvoa de Varzim/Vila do Conde, EPE (508741823)",FRESENIUS KABI PHARMA PORTUGAL (504293753),"265,00 €",09-04-2018,06-02-2018,392 dias,"Portugal, Porto, Póvoa de Varzim",Artigo 259.º do Código dos Contratos Públicos,,,,,,2335591,CP 2016/01 - Acordo Quadro para fornecimento de Medicamentos do Aparelho Cardiovascular   às Instituições e Serviços do Serviço Nacional de Saúde,FALSE
"O presente procedimento tem por objeto a aquisição dos bens acima identificados, para o CHPVVC,E.P.E.      ",Ao abrigo de acordo-quadro (art.º 259.º),Aquisição de bens móveis,"33622000-6, Medicamentos para o aparelho cardiovascular","Centro Hospitalar Póvoa de Varzim/Vila do Conde, EPE (508741823)","LAB. MEDINFAR, SA. (500384045)","370,00 €",09-04-2018,06-02-2018,392 dias,"Portugal, Porto, Póvoa de Varzim",Artigo 259.º do Código dos Contratos Públicos,,,,,,2335591,CP 2016/01 - Acordo Quadro para fornecimento de Medicamentos do Aparelho Cardiovascular   às Instituições e Serviços do Serviço Nacional de Saúde,FALSE
"O presente procedimento tem por objeto a aquisição dos bens acima identificados, para o CHPVVC,E.P.E.",Ao abrigo de acordo-quadro (art.º 259.º),Aquisição de bens móveis,"33622000-6, Medicamentos para o aparelho cardiovascular","Centro Hospitalar Póvoa de Varzim/Vila do Conde, EPE (508741823)","LABORATORIOS PFIZER, S.A. (500162166)","257,80 €",09-04-2018,06-02-2018,392 dias,"Portugal, Porto, Póvoa de Varzim",Artigo 259.º do Código dos Contratos Públicos,,,,,,2335591,CP 2016/01 - Acordo Quadro para fornecimento de Medicamentos do Aparelho Cardiovascular   às Instituições e Serviços do Serviço Nacional de Saúde,FALSE
"O presente procedimento tem por objeto a aquisição dos bens acima identificados, para o CHPVVC,E.P.E.           ",Ao abrigo de acordo-quadro (art.º 259.º),Aquisição de bens móveis,"33622000-6, Medicamentos para o aparelho cardiovascular","Centro Hospitalar Póvoa de Varzim/Vila do Conde, EPE (508741823)","LABESFAL-LAB. ALMIRO, SA. (501169580)","7.454,00 €",09-04-2018,06-02-2018,392 dias,"Portugal, Porto, Póvoa de Varzim",Artigo 259.º do Código dos Contratos Públicos,,,,,,2335591,CP 2016/01 - Acordo Quadro para fornecimento de Medicamentos do Aparelho Cardiovascular   às Instituições e Serviços do Serviço Nacional de Saúde,FALSE
"O presente procedimento tem por objeto a aquisição dos bens acima identificados, para o CHPVVC,E.P.E.",Ao abrigo de acordo-quadro (art.º 259.º),Aquisição de bens móveis,"33622000-6, Medicamentos para o aparelho cardiovascular","Centro Hospitalar Póvoa de Varzim/Vila do Conde, EPE (508741823)",HIKMA FARMACÊUTICA (PORTUGAL) SA. (502266791),"494,00 €",09-04-2018,06-02-2018,392 dias,"Portugal, Porto, Póvoa de Varzim",Artigo 259.º do Código dos Contratos Públicos,,,,,,2335591,CP 2016/01 - Acordo Quadro para fornecimento de Medicamentos do Aparelho Cardiovascular   às Instituições e Serviços do Serviço Nacional de Saúde,FALSE
"O presente procedimento tem por objeto a aquisição dos bens acima identificados, para o CHPVVC,E.P.E. ",Ao abrigo de acordo-quadro (art.º 259.º),Aquisição de bens móveis,"33622000-6, Medicamentos para o aparelho cardiovascular","Centro Hospitalar Póvoa de Varzim/Vila do Conde, EPE (508741823)","FERRAZ LYNCE, SA (500113270)","27,17 €",09-04-2018,06-02-2018,392 dias,"Portugal, Porto, Póvoa de Varzim",Artigo 259.º do Código dos Contratos Públicos,,,,,,2335591,CP 2016/01 - Acordo Quadro para fornecimento de Medicamentos do Aparelho Cardiovascular   às Instituições e Serviços do Serviço Nacional de Saúde,FALSE
"O presente procedimento tem por objeto a aquisição dos bens acima identificados, para o CHPVVC,E.P.E.",Ao abrigo de acordo-quadro (art.º 259.º),Aquisição de bens móveis,"33622000-6, Medicamentos para o aparelho cardiovascular","Centro Hospitalar Póvoa de Varzim/Vila do Conde, EPE (508741823)","BAYER PORTUGAL, SA. (500043256)","34,00 €",09-04-2018,09-02-2018,392 dias,"Portugal, Porto, Póvoa de Varzim",Artigo 259.º do Código dos Contratos Públicos,,,,,,2335591,CP 2016/01 - Acordo Quadro para fornecimento de Medicamentos do Aparelho Cardiovascular   às Instituições e Serviços do Serviço Nacional de Saúde,FALSE
"O presente procedimento tem por objeto a aquisição dos bens acima identificados, para o CHPVVC,E.P.E.",Ao abrigo de acordo-quadro (art.º 259.º),Aquisição de bens móveis,"33661000-1, Medicamentos para o sistema nervoso","Centro Hospitalar Póvoa de Varzim/Vila do Conde, EPE (508741823)",BIOPORTUGAL (151508615),"420,00 €",06-04-2018,09-01-2018,406 dias,"Portugal, Porto, Póvoa de Varzim",Artigo 259.º do Código dos Contratos Públicos,,,,,,2211341,Medicamentos anestésicos e relaxantes musculares,FALSE
"O presente procedimento tem por objeto a aquisição dos bens acima identificados, para o CHPVVC,E.P.E.",Ao abrigo de acordo-quadro (art.º 259.º),Aquisição de bens móveis,"33661000-1, Medicamentos para o sistema nervoso","Centro Hospitalar Póvoa de Varzim/Vila do Conde, EPE (508741823)","BLUEMED UNIPESSOAL, LDA (509912060)","3.042,00 €",06-04-2018,09-01-2018,406 dias,"Portugal, Porto, Póvoa de Varzim",Artigo 259.º do Código dos Contratos Públicos,,,,,,2211341,Medicamentos anestésicos e relaxantes musculares,FALSE
"O presente procedimento tem por objeto a aquisição dos bens acima identificados, para o CHPVVC,E.P.E.",Ao abrigo de acordo-quadro (art.º 259.º),Aquisição de bens móveis,"33661000-1, Medicamentos para o sistema nervoso","Centro Hospitalar Póvoa de Varzim/Vila do Conde, EPE (508741823)","KORANGI-PRODUTOS FARMACEUTICOS,LDA. (505322307)","13.959,25 €",06-04-2018,09-01-2018,321 dias,"Portugal, Porto, Póvoa de Varzim",Artigo 259.º do Código dos Contratos Públicos,,,,,,2211341,Medicamentos anestésicos e relaxantes musculares,FALSE
"O presente procedimento tem por objeto a aquisição dos bens acima identificados, para o CHPVVC,E.P.E.",Ao abrigo de acordo-quadro (art.º 259.º),Aquisição de bens móveis,"33661000-1, Medicamentos para o sistema nervoso","Centro Hospitalar Póvoa de Varzim/Vila do Conde, EPE (508741823)",FRESENIUS KABI PHARMA PORTUGAL (504293753),"16.737,24 €",06-04-2018,09-01-2018,406 dias,"Portugal, Porto, Póvoa de Varzim",Artigo 259.º do Código dos Contratos Públicos,,,,,,2211341,Medicamentos anestésicos e relaxantes musculares,FALSE
"O presente procedimento tem por objeto a aquisição dos bens acima identificados, para o CHPVVC,E.P.E.",Ao abrigo de acordo-quadro (art.º 259.º),Aquisição de bens móveis,"33661000-1, Medicamentos para o sistema nervoso","Centro Hospitalar Póvoa de Varzim/Vila do Conde, EPE (508741823)","B BRAUN MEDICAL, LDA. (501506543)","5.936,00 €",06-04-2018,09-01-2018,406 dias,"Portugal, Porto, Póvoa de Varzim","Artigo 33.º, n.º 3 do Código dos Contratos Públicos",,,,,,2211341,Medicamentos anestésicos e relaxantes musculares,FALSE
"O presente procedimento tem por objeto a aquisição dos bens acima identificados, para o CHPVVC,E.P.E.",Ao abrigo de acordo-quadro (art.º 259.º),Aquisição de bens móveis,"33661000-1, Medicamentos para o sistema nervoso","Centro Hospitalar Póvoa de Varzim/Vila do Conde, EPE (508741823)",HIKMA FARMACÊUTICA (PORTUGAL) SA. (502266791),"916,00 €",06-04-2018,09-01-2018,406 dias,"Portugal, Porto, Póvoa de Varzim",Artigo 259.º do Código dos Contratos Públicos,,,,,,2211341,Medicamentos anestésicos e relaxantes musculares,FALSE
"O presente procedimento tem por objeto a aquisição dos bens acima identificados, para o CHPVVC,E.P.E.",Ao abrigo de acordo-quadro (art.º 259.º),Aquisição de bens móveis,"33661000-1, Medicamentos para o sistema nervoso","Centro Hospitalar Póvoa de Varzim/Vila do Conde, EPE (508741823)",BAXTER MEDICO - FARMACEUTICA (503347345),"33.248,16 €",06-04-2018,09-01-2018,335 dias,"Portugal, Porto, Póvoa de Varzim",Artigo 259.º do Código dos Contratos Públicos,,,,,,2211341,Medicamentos anestésicos e relaxantes musculares,FALSE
"O presente procedimento tem por objeto a aquisição dos bens acima identificados, para o CHPVVC,E.P.E.",Ao abrigo de acordo-quadro (art.º 259.º),Aquisição de bens móveis,"33600000-6, Produtos farmacêuticos","Centro Hospitalar Póvoa de Varzim/Vila do Conde, EPE (508741823)","Sandoz Farmacêutica, Lda. (506985261)","27,90 €",05-04-2018,06-03-2018,378 dias,"Portugal, Porto, Póvoa de Varzim",Artigo 259.º do Código dos Contratos Públicos,,,,,,1326195,ACORDO QUADRO PARA FORNECIMENTO DE MEDICAMENTOS ANTI-INFECIOSOS: EXCETO ANTIVÍRICOS E ANTIFÚNGICOS ÀS INSTITUIÇÕES E SERVIÇOS DO SERVIÇO NACIONAL DE SAÚDE,FALSE
"O presente procedimento tem por objeto a aquisição dos bens acima identificados, para o CHPVVC,E.P.E.",Ao abrigo de acordo-quadro (art.º 259.º),Aquisição de bens móveis,"33600000-6, Produtos farmacêuticos","Centro Hospitalar Póvoa de Varzim/Vila do Conde, EPE (508741823)","GENERIS - FARMACEUTICA, S.A. (508107997)","3.379,99 €",05-04-2018,06-03-2018,378 dias,"Portugal, Porto, Póvoa de Varzim",Artigo 259.º do Código dos Contratos Públicos,,,,,,1326195,ACORDO QUADRO PARA FORNECIMENTO DE MEDICAMENTOS ANTI-INFECIOSOS: EXCETO ANTIVÍRICOS E ANTIFÚNGICOS ÀS INSTITUIÇÕES E SERVIÇOS DO SERVIÇO NACIONAL DE SAÚDE,FALSE
"O presente procedimento tem por objeto a aquisição dos bens acima identificados, para o CHPVVC,E.P.E.",Ao abrigo de acordo-quadro (art.º 259.º),Aquisição de bens móveis,"33600000-6, Produtos farmacêuticos","Centro Hospitalar Póvoa de Varzim/Vila do Conde, EPE (508741823)",LABORATORIOS ATRAL S.A. (500162085),"2.000,00 €",05-04-2018,06-03-2018,378 dias,"Portugal, Porto, Póvoa de Varzim",Artigo 259.º do Código dos Contratos Públicos,,,,,,1326195,ACORDO QUADRO PARA FORNECIMENTO DE MEDICAMENTOS ANTI-INFECIOSOS: EXCETO ANTIVÍRICOS E ANTIFÚNGICOS ÀS INSTITUIÇÕES E SERVIÇOS DO SERVIÇO NACIONAL DE SAÚDE,FALSE
"O presente procedimento tem por objeto a aquisição dos bens acima identificados, para o CHPVVC,E.P.E.",Ao abrigo de acordo-quadro (art.º 259.º),Aquisição de bens móveis,"33600000-6, Produtos farmacêuticos","Centro Hospitalar Póvoa de Varzim/Vila do Conde, EPE (508741823)","Farmoz  - Sociedade Técnico Medicinal, SA (501505334)","7.969,83 €",05-04-2018,06-03-2018,378 dias,"Portugal, Porto, Póvoa de Varzim",Artigo 259.º do Código dos Contratos Públicos,,,,,,1326195,ACORDO QUADRO PARA FORNECIMENTO DE MEDICAMENTOS ANTI-INFECIOSOS: EXCETO ANTIVÍRICOS E ANTIFÚNGICOS ÀS INSTITUIÇÕES E SERVIÇOS DO SERVIÇO NACIONAL DE SAÚDE,FALSE
97000218 - Aquisição de Serviços de Manutenção do Software Maxpro instalado nas entidades do Ministério da Saúde para o ano de 2018,Ajuste Direto Regime Geral,Aquisição de serviços,"72000000-5, Serviços de TI: consultoria, desenvolvimento de software, Internet e apoio","Centro Hospitalar Póvoa de Varzim - Vila do Conde, E. P. E. (508741823)",SISQUAL (502772298),"6.001,75 €",04-04-2018,06-03-2018,365 dias,"Portugal, Porto, Póvoa de Varzim",Artigo 258.º do Código dos Contratos Públicos,,,,,,Não aplicável.,Não aplicável.,FALSE
"O presente procedimento tem por objeto a aquisição dos bens acima identificados, para o CHPVVC,E.P.E.",Ao abrigo de acordo-quadro (art.º 259.º),Aquisição de bens móveis,"33600000-6, Produtos farmacêuticos","Centro Hospitalar Póvoa de Varzim/Vila do Conde, EPE (508741823)","Sanofi - Produtos Farmacêuticos, Lda (500134960)","241,18 €",04-04-2018,06-03-2018,378 dias,"Portugal, Porto, Póvoa de Varzim",Artigo 259.º do Código dos Contratos Públicos,,,,,,1326195,ACORDO QUADRO PARA FORNECIMENTO DE MEDICAMENTOS ANTI-INFECIOSOS: EXCETO ANTIVÍRICOS E ANTIFÚNGICOS ÀS INSTITUIÇÕES E SERVIÇOS DO SERVIÇO NACIONAL DE SAÚDE,FALSE
"O presente procedimento tem por objeto a aquisição dos bens acima identificados, para o CHPVVC,E.P.E.",Ao abrigo de acordo-quadro (art.º 259.º),Aquisição de bens móveis,"33600000-6, Produtos farmacêuticos","Centro Hospitalar Póvoa de Varzim/Vila do Conde, EPE (508741823)","Fresenius Kabi Pharma, Lda. (504293753)","1.413,00 €",04-04-2018,06-03-2018,378 dias,"Portugal, Porto, Póvoa de Varzim",Artigo 259.º do Código dos Contratos Públicos,,,,,,1326195,ACORDO QUADRO PARA FORNECIMENTO DE MEDICAMENTOS ANTI-INFECIOSOS: EXCETO ANTIVÍRICOS E ANTIFÚNGICOS ÀS INSTITUIÇÕES E SERVIÇOS DO SERVIÇO NACIONAL DE SAÚDE,FALSE
"1.	O presente procedimento tem por objeto a aquisição dos bens acima identificados, para o CHPVVC,E.P.E.",Ao abrigo de acordo-quadro (art.º 259.º),Aquisição de bens móveis,"33600000-6, Produtos farmacêuticos","Centro Hospitalar Póvoa de Varzim/Vila do Conde, EPE (508741823)","B BRAUN MEDICAL, LDA (501506543)","765,00 €",04-04-2018,06-03-2018,378 dias,"Portugal, Porto, Póvoa de Varzim",Artigo 259.º do Código dos Contratos Públicos,,,,,,1326195,ACORDO QUADRO PARA FORNECIMENTO DE MEDICAMENTOS ANTI-INFECIOSOS: EXCETO ANTIVÍRICOS E ANTIFÚNGICOS ÀS INSTITUIÇÕES E SERVIÇOS DO SERVIÇO NACIONAL DE SAÚDE,FALSE
"O presente procedimento tem por objeto a aquisição dos bens acima identificados, para o CHPVVC,E.P.E.",Ao abrigo de acordo-quadro (art.º 259.º),Aquisição de bens móveis,"33600000-6, Produtos farmacêuticos","Centro Hospitalar Póvoa de Varzim/Vila do Conde, EPE (508741823)","Laboratórios Pfizer, Lda. (500162166)","89,00 €",04-04-2018,06-03-2018,378 dias,"Portugal, Porto, Póvoa de Varzim",Artigo 259.º do Código dos Contratos Públicos,,,,,,1326195,ACORDO QUADRO PARA FORNECIMENTO DE MEDICAMENTOS ANTI-INFECIOSOS: EXCETO ANTIVÍRICOS E ANTIFÚNGICOS ÀS INSTITUIÇÕES E SERVIÇOS DO SERVIÇO NACIONAL DE SAÚDE,FALSE
"O presente procedimento tem por objeto a aquisição dos bens acima identificados, para o CHPVVC,E.P.E.",Ao abrigo de acordo-quadro (art.º 259.º),Aquisição de bens móveis,"33600000-6, Produtos farmacêuticos","Centro Hospitalar Póvoa de Varzim/Vila do Conde, EPE (508741823)","Labesfal - Laboratórios Almiro, S.A. (501169580)","3.457,55 €",04-04-2018,06-03-2018,378 dias,"Portugal, Porto, Póvoa de Varzim",Artigo 259.º do Código dos Contratos Públicos,,,,,,1326195,ACORDO QUADRO PARA FORNECIMENTO DE MEDICAMENTOS ANTI-INFECIOSOS: EXCETO ANTIVÍRICOS E ANTIFÚNGICOS ÀS INSTITUIÇÕES E SERVIÇOS DO SERVIÇO NACIONAL DE SAÚDE,FALSE
"O presente procedimento tem por objeto a aquisição dos bens acima identificados, para o CHPVVC,E.P.E.",Ao abrigo de acordo-quadro (art.º 259.º),Aquisição de bens móveis,"33600000-6, Produtos farmacêuticos","Centro Hospitalar Póvoa de Varzim/Vila do Conde, EPE (508741823)","HIKMA FARMACEUTICA (PORTUGAL), SA (502266791)","14.518,00 €",04-04-2018,06-03-2018,378 dias,"Portugal, Porto, Póvoa de Varzim",Artigo 259.º do Código dos Contratos Públicos,,,,,,1326195,ACORDO QUADRO PARA FORNECIMENTO DE MEDICAMENTOS ANTI-INFECIOSOS: EXCETO ANTIVÍRICOS E ANTIFÚNGICOS ÀS INSTITUIÇÕES E SERVIÇOS DO SERVIÇO NACIONAL DE SAÚDE,FALSE
"O presente procedimento tem por objeto a aquisição dos bens acima identificados, para o CHPVVC,E.P.E.",Ao abrigo de acordo-quadro (art.º 259.º),Aquisição de bens móveis,"33661000-1, Medicamentos para o sistema nervoso","Centro Hospitalar Póvoa de Varzim/Vila do Conde, EPE (508741823)","Aurobindo Pharma Portugal, (Unip.) Lda. (508527465)","107,86 €",04-04-2018,06-02-2018,378 dias,"Portugal, Porto, Póvoa de Varzim",Artigo 259.º do Código dos Contratos Públicos,,,,,,2222779,Medicamentos do aparelho digestivo,FALSE
"O presente procedimento tem por objeto a aquisição dos bens acima identificados, para o CHPVVC,E.P.E.",Ao abrigo de acordo-quadro (art.º 259.º),Aquisição de bens móveis,"33661000-1, Medicamentos para o sistema nervoso","Centro Hospitalar Póvoa de Varzim/Vila do Conde, EPE (508741823)","LABORATORIOS NORMON, S.A (505654156)","2.124,00 €",04-04-2018,06-02-2018,378 dias,"Portugal, Porto, Póvoa de Varzim",Artigo 259.º do Código dos Contratos Públicos,,,,,,2222779,Medicamentos do aparelho digestivo,FALSE
"O presente procedimento tem por objeto a aquisição dos bens acima identificados, para o CHPVVC,E.P.E",Ao abrigo de acordo-quadro (art.º 259.º),Aquisição de bens móveis,"33661000-1, Medicamentos para o sistema nervoso","Centro Hospitalar Póvoa de Varzim/Vila do Conde, EPE (508741823)","Generis - Farmacêutica, S.A. (508107997)","794,52 €",04-04-2018,06-02-2018,378 dias,"Portugal, Porto, Póvoa de Varzim",Artigo 259.º do Código dos Contratos Públicos,,,,,,2222779,Medicamentos do aparelho digestivo,FALSE
"O presente procedimento tem por objecto a aquisição dos bens acima identificados, para o CHPVVC,E.P.E",Ao abrigo de acordo-quadro (art.º 259.º),Aquisição de bens móveis,"33661000-1, Medicamentos para o sistema nervoso","Centro Hospitalar Póvoa de Varzim/Vila do Conde, EPE (508741823)",Angelini (500583650),"1.890,00 €",04-04-2018,06-02-2018,378 dias,"Portugal, Porto, Póvoa de Varzim",Artigo 259.º do Código dos Contratos Públicos,,,,,,2222779,Medicamentos do aparelho digestivo,FALSE
"1.	O presente procedimento tem por objeto a aquisição dos bens acima identificados, para o CHPVVC,E.P.E.",Ao abrigo de acordo-quadro (art.º 259.º),Aquisição de bens móveis,"33661000-1, Medicamentos para o sistema nervoso","Centro Hospitalar Póvoa de Varzim/Vila do Conde, EPE (508741823)",OVERPHARMA PRODUTOS MEDICOS E FARMACEUTICOS LDA (505792362),"2.014,59 €",03-04-2018,06-02-2018,378 dias,"Portugal, Porto, Póvoa de Varzim",Artigo 259.º do Código dos Contratos Públicos,,,,,,2222779,Medicamentos do aparelho digestivo,FALSE
"O presente procedimento tem por objeto a aquisição dos bens acima identificados, para o CHPVVC,E.P.E.",Ao abrigo de acordo-quadro (art.º 259.º),Aquisição de bens móveis,"33661000-1, Medicamentos para o sistema nervoso","Centro Hospitalar Póvoa de Varzim/Vila do Conde, EPE (508741823)",Meda Pharma - Produtos Farmaceuticos SA (500082090),"5.130,00 €",03-04-2018,06-02-2018,378 dias,"Portugal, Porto, Póvoa de Varzim",Artigo 259.º do Código dos Contratos Públicos,,,,,,2222779,Medicamentos do aparelho digestivo,FALSE
"O presente procedimento tem por objeto a aquisição dos bens acima identificados, para o CHPVVC,E.P.E.",Ao abrigo de acordo-quadro (art.º 259.º),Aquisição de bens móveis,"33661000-1, Medicamentos para o sistema nervoso","Centro Hospitalar Póvoa de Varzim/Vila do Conde, EPE (508741823)","Sanofi - Produtos Farmacêuticos, Lda (500134960)","167,40 €",03-04-2018,06-02-2018,378 dias,"Portugal, Porto, Póvoa de Varzim",Artigo 259.º do Código dos Contratos Públicos,,,,,,2222779,Medicamentos do aparelho digestivo,FALSE
"O presente procedimento tem por objeto a aquisição dos bens acima identificados, para o CHPVVC,E.P.E.",Ao abrigo de acordo-quadro (art.º 259.º),Aquisição de bens móveis,"33661000-1, Medicamentos para o sistema nervoso","Centro Hospitalar Póvoa de Varzim/Vila do Conde, EPE (508741823)",OM PHARMA S.A. (500207410),"2.080,00 €",03-04-2018,06-02-2018,378 dias,"Portugal, Porto, Póvoa de Varzim",Artigo 259.º do Código dos Contratos Públicos,,,,,,2222779,Medicamentos do aparelho digestivo,FALSE
"O presente procedimento tem por objeto a aquisição dos bens acima identificados, para o CHPVVC,E.P.E.",Ao abrigo de acordo-quadro (art.º 259.º),Aquisição de bens móveis,"33661000-1, Medicamentos para o sistema nervoso","Centro Hospitalar Póvoa de Varzim/Vila do Conde, EPE (508741823)",LABORATORIO MEDINFAR PRODUTOS FARMACÊUTICOS S.A. (500384045),"1.681,00 €",03-04-2018,06-02-2018,378 dias,"Portugal, Porto, Póvoa de Varzim",Artigo 259.º do Código dos Contratos Públicos,,,,,,2222779,Medicamentos do aparelho digestivo,FALSE
"O presente procedimento tem por objeto a aquisição dos bens acima identificados, para o CHPVVC,E.P.E.",Ao abrigo de acordo-quadro (art.º 259.º),Aquisição de bens móveis,"33661000-1, Medicamentos para o sistema nervoso","Centro Hospitalar Póvoa de Varzim/Vila do Conde, EPE (508741823)",LABORATORIOS PFIZER LDA (500162166),"260,52 €",03-04-2018,06-02-2018,378 dias,"Portugal, Porto, Póvoa de Varzim",Artigo 259.º do Código dos Contratos Públicos,,,,,,2222779,Medicamentos do aparelho digestivo,FALSE
"O presente procedimento tem por objeto a aquisição dos bens acima identificados, para o CHPVVC,E.P.E.",Ao abrigo de acordo-quadro (art.º 259.º),Aquisição de bens móveis,"33661000-1, Medicamentos para o sistema nervoso","Centro Hospitalar Póvoa de Varzim/Vila do Conde, EPE (508741823)","Labesfal - Laboratórios Almiro, S.A. (501169580)","1.620,00 €",03-04-2018,06-02-2018,378 dias,"Portugal, Porto, Póvoa de Varzim",Artigo 259.º do Código dos Contratos Públicos,,,,,,2222779,Medicamentos do aparelho digestivo,FALSE
"O presente procedimento tem por objeto o fornecimento de Medicamentos e Outros Produtos Farmacêuticos em conformidade com as especificações constantes do Caderno de Encargos e de acordo com a listagem do Anexo III, durante o ano de 2018",Ajuste Direto Regime Geral,Aquisição de bens móveis,"33600000-6, Produtos farmacêuticos","Centro Hospitalar Póvoa de Varzim/Vila do Conde, EPE (508741823)",IMPORQUIMICA (502473274),"2.574,00 €",02-04-2018,13-03-2018,469 dias,"Portugal, Porto, Póvoa de Varzim","Artigo 20.º, n.º 1, alínea a) do Código dos Contratos Públicos",,,,,,Não aplicável.,Não aplicável.,FALSE
"O presente procedimento tem por objeto o fornecimento de Medicamentos e Outros Produtos Farmacêuticos em conformidade com as especificações constantes do Caderno de Encargos e de acordo com a listagem do Anexo III, durante o ano de 2018",Ajuste Direto Regime Geral,Aquisição de bens móveis,"33600000-6, Produtos farmacêuticos","Centro Hospitalar Póvoa de Varzim/Vila do Conde, EPE (508741823)","Spcare - Especialidades Farmacêuticas, Lda (508284872)","50,73 €",02-04-2018,13-03-2018,469 dias,"Portugal, Porto, Póvoa de Varzim","Artigo 20.º, n.º 1, alínea a) do Código dos Contratos Públicos",,,,,,Não aplicável.,Não aplicável.,FALSE
"O presente procedimento tem por objeto o fornecimento de Medicamentos e Outros Produtos Farmacêuticos em conformidade com as especificações constantes do Caderno de Encargos e de acordo com a listagem do Anexo III, durante o ano de 2018",Ajuste Direto Regime Geral,Aquisição de bens móveis,"33600000-6, Produtos farmacêuticos","Centro Hospitalar Póvoa de Varzim/Vila do Conde, EPE (508741823)",OVERPHARMA PRODUTOS MEDICOS E FARMACEUTICOS LDA (505792362),"953,92 €",02-04-2018,13-03-2018,469 dias,"Portugal, Porto, Póvoa de Varzim","Artigo 20.º, n.º 1, alínea a) do Código dos Contratos Públicos",,,,,,Não aplicável.,Não aplicável.,FALSE
"O presente procedimento tem por objeto o fornecimento de Medicamentos e Outros Produtos Farmacêuticos em conformidade com as especificações constantes do Caderno de Encargos e de acordo com a listagem do Anexo III, durante o ano de 2018.",Ajuste Direto Regime Geral,Aquisição de bens móveis,"33600000-6, Produtos farmacêuticos","Centro Hospitalar Póvoa de Varzim/Vila do Conde, EPE (508741823)","Proclinica equipamentos e produtos clinicos, Lda (500222665)","622,20 €",02-04-2018,13-03-2018,469 dias,"Portugal, Porto, Póvoa de Varzim","Artigo 20.º, n.º 1, alínea a) do Código dos Contratos Públicos",,,,,,Não aplicável.,Não aplicável.,FALSE
"O presente procedimento tem por objeto o fornecimento de Medicamentos e Outros Produtos Farmacêuticos em conformidade com as especificações constantes do Caderno de Encargos e de acordo com a listagem do Anexo III, durante o ano de 2018.",Ajuste Direto Regime Geral,Aquisição de bens móveis,"33600000-6, Produtos farmacêuticos","Centro Hospitalar Póvoa de Varzim/Vila do Conde, EPE (508741823)",ASTRAZENECA PRODUTOS FARMACEUTICOS LDA (502942240),"589,74 €",02-04-2018,13-03-2018,469 dias,"Portugal, Porto, Póvoa de Varzim","Artigo 20.º, n.º 1, alínea a) do Código dos Contratos Públicos",,,,,,Não aplicável.,Não aplicável.,FALSE
"O presente procedimento tem por objeto o fornecimento de Medicamentos e Outros Produtos Farmacêuticos em conformidade com as especificações constantes do Caderno de Encargos e de acordo com a listagem do Anexo III, durante o ano de 2018.",Ajuste Direto Regime Geral,Aquisição de bens móveis,"33600000-6, Produtos farmacêuticos","Centro Hospitalar Póvoa de Varzim/Vila do Conde, EPE (508741823)",B BRAUN MEDICAL LDA (501506543),"5.795,76 €",02-04-2018,13-03-2018,469 dias,"Portugal, Porto, Póvoa de Varzim","Artigo 20.º, n.º 1, alínea a) do Código dos Contratos Públicos",,,,,,Não aplicável.,Não aplicável.,FALSE
"O presente procedimento tem por objeto o fornecimento de Medicamentos e Outros Produtos Farmacêuticos em conformidade com as especificações constantes do Caderno de Encargos e de acordo com a listagem do Anexo III, durante o ano de 2018.",Ajuste Direto Regime Geral,Aquisição de bens móveis,"33600000-6, Produtos farmacêuticos","Centro Hospitalar Póvoa de Varzim/Vila do Conde, EPE (508741823)","Speculum – Artigos Médicos, S.A (502996323)","1.249,30 €",02-04-2018,13-03-2018,469 dias,"Portugal, Porto, Póvoa de Varzim","Artigo 20.º, n.º 1, alínea a) do Código dos Contratos Públicos",,,,,,Não aplicável.,Não aplicável.,FALSE
"O presente procedimento tem por objeto o fornecimento de Medicamentos e Outros Produtos Farmacêuticos em conformidade com as especificações constantes do Caderno de Encargos e de acordo com a listagem do Anexo III, durante o ano de 2018.",Ajuste Direto Regime Geral,Aquisição de bens móveis,"33600000-6, Produtos farmacêuticos","Centro Hospitalar Póvoa de Varzim/Vila do Conde, EPE (508741823)",LABESFAL - LABORATÓRIOS ALMIRO S.A. (501169580),"240,00 €",02-04-2018,13-03-2018,469 dias,"Portugal, Porto, Póvoa de Varzim","Artigo 20.º, n.º 1, alínea a) do Código dos Contratos Públicos",,,,,,Não aplicável.,Não aplicável.,FALSE
"O presente procedimento tem por objeto o fornecimento de Medicamentos e Outros Produtos Farmacêuticos em conformidade com as especificações constantes do Caderno de Encargos e de acordo com a listagem do Anexo III, durante o ano de 2018.",Ajuste Direto Regime Geral,Aquisição de bens móveis,"33600000-6, Produtos farmacêuticos","Centro Hospitalar Póvoa de Varzim/Vila do Conde, EPE (508741823)","A MARTINS & FERNANDES, SA (501172114)","251,16 €",02-04-2018,13-03-2018,469 dias,"Portugal, Porto, Póvoa de Varzim","Artigo 20.º, n.º 1, alínea a) do Código dos Contratos Públicos",,,,,,Não aplicável.,Não aplicável.,FALSE
