Objeto do Contrato,Tipo de Procedimento,Tipo(s) de Contrato,CPVs,Entidade(s) Adjudicante(s),Entidade(s) Adjudicatária(s),Preço Contratual,Data de Publicação,Data de Celebração do Contrato,Prazo de Execução,Local de Execução,Fundamentação,Data de Fecho do Contrato,Preço Total Efetivo,Causas das Alterações ao Prazo,Causas das Alterações ao Preço,Estado,N.º registo do Acordo Quadro,Descrição do Acordo Quadro,Procedimento Centralizado
Processo n.º 31/2199/2014 – Aquisição de Efavirenz 600 mg + Emtricitabina 200 mg + Tenofovir 245 mg e Emtricitabina 200 mg + Tenofovir 245 mg,Ajuste Direto Regime Geral,Aquisição de bens móveis,"33690000-3, Medicamentos vários","Centro Hospitalar do Algarve, E. P. E. (510745997)",gilead (503604704),"3.249.971,84 €",21-07-2014,04-07-2014,210 dias,"Portugal, Faro, Faro","Artigo 26.º, n.º 1, alínea e) do Código dos Contratos Públicos","","",,"",,Não aplicável.,Não aplicável.,FALSE
Aquisição de Material de Penso,Concurso público,Aquisição de bens móveis,"33140000-3, Material médico de consumo","Centro Hospitalar do Algarve, E. P. E. (510745997)","ABILIO FREIRE (500432600), FACTOR PLUS,S.A. (502810645), Kvtech Portugal - Produtos Médicos Unipessoal, Lda (508671531), B. BRAUN MEDICAL,LDA. (501506543), QUILABAN,LDA. (500399670), AVIQUIMICA IMPORT E MANUFATURA (500039720), BSN Medical (505385058), MEDTRONIC PORTUGAL, LDA. (504223933), EZEQUIEL PANAO JORGE,LDA (501412727), COVIDIEN PORTUGAL - PRODUTOS  DE SAUDE, UNIPESSOAL, LDA. (503413410), BASTOS VIEGAS,SA (500042772), Docworld – Dispositivos Médicos (508592909), JOHNSON & JOHNSON PROD.PROF. (500153370), PAUL HARTMANN, LDA. (502271728), MOLNLYCKE HEALTH CARE, LDA. (511101066), JMV-PRODUTOS HOSPITALARES (501887148)","67.977,40 €",17-07-2014,16-07-2014,168 dias,"Portugal, Faro, Portimão<BR/>Portugal, Faro, Faro<BR/>Portugal, Faro, Lagos","Artigo 20.º, n.º 1, alínea b) do Código dos Contratos Públicos","","",,"",,Não aplicável.,Não aplicável.,FALSE
Toneres,Ajuste Direto Regime Geral,Aquisição de bens móveis,"30000000-9, Máquinas, equipamento e material de escritório e de informática, excepto mobiliário e pacotes de programas (software)","Centro Hospitalar do Algarve, E. P. E. (510745997)","PRN INFORMÁTICA, LDA (504100327)","21.238,40 €",17-07-2014,20-03-2014,270 dias,"Portugal, Faro, Faro<BR/>Portugal, Faro, Portimão","Artigo 20.º, n.º 1, alínea a) do Código dos Contratos Públicos","","",,"",,Não aplicável.,Não aplicável.,FALSE
Serviços médicos urgência geral,Ajuste Direto Regime Geral,Aquisição de serviços,"85121100-4, Serviços de médicos de clínica geral","Centro Hospitalar do Algarve, E. P. E. (510745997)","J. C. Fernandes - Cirurgia Maxilo-Facial, Lda (505515172)","63.000,00 €",16-07-2014,03-03-2014,245 dias,"Portugal, Faro, Albufeira<BR/>Portugal, Faro, Faro<BR/>Portugal, Faro, Lagos","Artigo 20.º, n.º 1, alínea a) do Código dos Contratos Públicos",31-12-2014,"55.350,00 €",,"O valor inicial do Contrato teve por base as necessidades estimadas para o período de 1 de Maio  de 2014 a 31 Dezembro de 2014, o valor final reflecte as necessidades efectivas.",,Não aplicável.,Não aplicável.,FALSE
Seguro Acidentes de Trabalho e Doenças Profissionais -Unidade Portimão-2013,Ajuste Direto Regime Geral,Aquisição de serviços,"66512000-2, Serviços de seguros de acidentes e de saúde","Centro Hospitalar do Algarve, E. P. E. (510745997)",Companhia de Seguros Tranquilidade (500940231),"25.181,01 €",14-07-2014,09-07-2014,365 dias,"Portugal, Faro, Portimão","Artigo 20.º, n.º 1, alínea a) do Código dos Contratos Públicos","","",,"",,Não aplicável.,Não aplicável.,FALSE
Manutenção monitores e ventiladores,Ajuste Direto Regime Geral,Aquisição de serviços,"50420000-5, Serviços de reparação e manutenção de equipamento médico e cirúrgico","Centro Hospitalar do Algarve, E. P. E. (510745997)",Drager Portugal  (508771323),"20.928,66 €",11-07-2014,25-06-2014,365 dias,"Portugal, Faro, Faro","Artigo 24.º, n.º 1, alínea e) do Código dos Contratos Públicos","","",,"",,Não aplicável.,Não aplicável.,FALSE
Manutenção Equipamentos Oftalmologia,Ajuste Direto Regime Geral,Aquisição de serviços,"50420000-5, Serviços de reparação e manutenção de equipamento médico e cirúrgico","Centro Hospitalar do Algarve, E. P. E. (510745997)",PM Equipamentos Lda  (508299900),"8.744,00 €",11-07-2014,09-07-2014,150 dias,"Portugal, Faro, Faro","Artigo 24.º, n.º 1, alínea e) do Código dos Contratos Públicos","","",,"",,Não aplicável.,Não aplicável.,FALSE
Serviços Manutenção Equip  Informatico,Ajuste Direto Regime Geral,Aquisição de serviços,"50312000-5, Manutenção e reparação de equipamento informático","Centro Hospitalar do Algarve, E. P. E. (510745997)",Vortal (505141019),"13.565,00 €",11-07-2014,26-02-2014,365 dias,"Portugal, Faro, Faro<BR/>Portugal, Faro, Portimão<BR/>Portugal, Faro, Lagos","Artigo 20.º, n.º 1, alínea a) do Código dos Contratos Públicos","","",,"",,Não aplicável.,Não aplicável.,FALSE
