Objeto do Contrato,Tipo de Procedimento,Tipo(s) de Contrato,CPVs,Entidade(s) Adjudicante(s),Entidade(s) Adjudicatária(s),Preço Contratual,Data de Publicação,Data de Celebração do Contrato,Prazo de Execução,Local de Execução,Fundamentação,Data de Fecho do Contrato,Preço Total Efetivo,Causas das Alterações ao Prazo,Causas das Alterações ao Preço,Estado,N.º registo do Acordo Quadro,Descrição do Acordo Quadro,Procedimento Centralizado
Análise de vulnerabilidades em publicações na Web,Ajuste Direto Regime Geral,Aquisição de serviços,"72000000-5, Serviços de TI: consultoria, desenvolvimento de software, Internet e apoio","Instituto Nacional de Emergência Médica, I. P. (501356126)","Hardsecure, Soc. Unip., Lda. (509877877)","800,00 €",19-10-2016,18-10-2016,90 dias,"Portugal, Lisboa, Lisboa","Artigo 20.º, n.º 1, alínea a) do Código dos Contratos Públicos",,,,,,Não aplicável.,Não aplicável.,FALSE
Aquisição de dois servidores,Ajuste Direto Regime Geral,Aquisição de bens móveis,"30200000-1, Equipamento e material informático","Instituto Nacional de Emergência Médica, I. P. (501356126)",ATM - Sistemas de Informação e Serviços (509784267),"6.977,94 €",19-10-2016,30-09-2016,9 dias,"Portugal, Lisboa, Lisboa","Artigo 20.º, n.º 1, alínea a) do Código dos Contratos Públicos",,,,,,Não aplicável.,Não aplicável.,FALSE
Reparação da viatura 55-GR-92,Ajuste Direto Regime Geral,Aquisição de serviços,"50100000-6, Serviços de reparação e manutenção de veículos e equipamento afim, e serviços conexos","Instituto Nacional de Emergência Médica, I. P. (501356126)","gravity courage, lda (513702113)","15.003,58 €",18-10-2016,14-10-2016,5 dias,"Portugal, Lisboa, Odivelas","Artigo 20.º, n.º 1, alínea a) do Código dos Contratos Públicos",,,,,,Não aplicável.,Não aplicável.,FALSE
"Reparações no 3º Piso do edifício sede do INEM, IP. ",Ajuste Direto Regime Geral,Aquisição de serviços,"50000000-5, Serviços de reparação e manutenção","Instituto Nacional de Emergência Médica, I. P. (501356126)","AZERO - Construção Civil, Arquitetura e Decoração, Lda.  (500806756)","6.783,00 €",14-10-2016,11-10-2016,3 dias,"Portugal, Lisboa, Lisboa","Artigo 20.º, n.º 1, alínea a) do Código dos Contratos Públicos",,,,,,Não aplicável.,Não aplicável.,FALSE
"Prestação de serviços de helitransporte de doentes e serviços conexos, helicóptero ligeiro de Stª. Comba Dão - 1ª quinzena de outubro de 2016.",Ajuste Direto Regime Geral,Aquisição de serviços,"60000000-8, Serviços de transporte (excl. transporte de resíduos)","Instituto Nacional de Emergência Médica, I. P. (501356126)","BABCOCK MISSION CRITICAL SERVICES PORTUGAL, LDA (503546054)","78.629,03 €",14-10-2016,30-09-2016,15 dias,"Portugal, Portugal Continental","Artigo 24.º, n.º 1, alínea c) do Código dos Contratos Públicos",,,,,,Não aplicável.,Não aplicável.,FALSE
