Objeto do Contrato,Tipo de Procedimento,Tipo(s) de Contrato,CPVs,Entidade(s) Adjudicante(s),Entidade(s) Adjudicatária(s),Preço Contratual,Data de Publicação,Data de Celebração do Contrato,Prazo de Execução,Local de Execução,Fundamentação,Data de Fecho do Contrato,Preço Total Efetivo,Causas das Alterações ao Prazo,Causas das Alterações ao Preço,Estado,N.º registo do Acordo Quadro,Descrição do Acordo Quadro,Procedimento Centralizado
Prestação de Serviços Médicos na Área da Cuidados Intensivos 37004716 (horas-jan a março),Ajuste Direto Regime Geral,Aquisição de serviços,"85100000-0, Serviços de saúde","Centro Hospitalar do Médio Tejo, E. P. E. (506361608)","GERMANO & EMÍLIO - SERVIÇOS DE SAÚDE, LDA (508029570)","15.000,00 €",11-10-2016,13-06-2016,90 dias,"Portugal, Santarém, Torres Novas","Artigo 24.º, n.º 1, alínea c) do Código dos Contratos Públicos",,,,,,Não aplicável.,Não aplicável.,FALSE
Prestação de serviços Médicos na Área da Medicina Interna 37004716 (horas-jan a março),Ajuste Direto Regime Geral,Aquisição de serviços,"85100000-0, Serviços de saúde","Centro Hospitalar do Médio Tejo, E. P. E. (506361608)","SENTIDO COMPLETO -SERVIÇOS MÉDICOS ESPECIALIZADOS, LDA (509667759)","45.120,00 €",11-10-2016,13-06-2016,90 dias,"Portugal, Santarém, Torres Novas","Artigo 24.º, n.º 1, alínea c) do Código dos Contratos Públicos",,,,,,Não aplicável.,Não aplicável.,FALSE
Prestação de Serviços Médicos na Área da Neurorradiologia/Intervenção Minimamente Invasiva da Dor - 37020216 (horas - junho a dez),Ajuste Direto Regime Geral,Aquisição de serviços,"85100000-0, Serviços de saúde","Centro Hospitalar do Médio Tejo, E. P. E. (506361608)","IMAGENS VIÁVEIS, LDA  (508693756)","74.000,00 €",06-10-2016,28-07-2016,210 dias,"Portugal, Santarém, Torres Novas","Artigo 20.º, n.º 1, alínea a) do Código dos Contratos Públicos",,,,,,Não aplicável.,Não aplicável.,FALSE
Prestação de Serviços Médicos na Área da Triagem Geral - 37015516 (horas - jan a dez),Ajuste Direto Regime Geral,Aquisição de serviços,"85100000-0, Serviços de saúde","Centro Hospitalar do Médio Tejo, E. P. E. (506361608)","TALENTER - GESTÃO DE PROJECTOS, LDA (506111148)","25.000,00 €",06-10-2016,28-07-2016,360 dias,"Portugal, Santarém, Torres Novas","Artigo 20.º, n.º 1, alínea a) do Código dos Contratos Públicos",,,,,,Não aplicável.,Não aplicável.,FALSE
Prestação de Serviços Médicos na Área da Ortopedia - 37012516 (horas - jan a maio),Ajuste Direto Regime Geral,Aquisição de serviços,"85100000-0, Serviços de saúde","Centro Hospitalar do Médio Tejo, E. P. E. (506361608)","LUIS TOMAZ GONCALVES-SAUDE E TURISMO, LDA (509715869)","74.000,00 €",06-10-2016,28-07-2016,150 dias,"Portugal, Santarém, Torres Novas","Artigo 20.º, n.º 1, alínea a) do Código dos Contratos Públicos",,,,,,Não aplicável.,Não aplicável.,FALSE
Prestação de Serviços Médicos na Área da Triagem Geral - 37008416 (horas - 01/03 a 02/04/2016),Ajuste Direto Regime Geral,Aquisição de serviços,"85100000-0, Serviços de saúde","Centro Hospitalar do Médio Tejo, E. P. E. (506361608)","GENIUMSANA- SERVIÇOS MÉDICOS E ENGENHARIA, LDA (510174892)","78.750,00 €",06-10-2016,14-07-2016,30 dias,"Portugal, Santarém, Torres Novas","Artigo 24.º, n.º 1, alínea c) do Código dos Contratos Públicos",,,,,,Não aplicável.,Não aplicável.,FALSE
Serviços Médicos - Ortopedia,Ajuste Direto Regime Geral,Aquisição de serviços,"85100000-0, Serviços de saúde","Centro Hospitalar do Médio Tejo, E. P. E. (506361608)",Tiago Emanuel de Bessa Magalhães Oliveira (224071050),"19.800,00 €",06-10-2016,17-06-2016,240 dias,"Portugal, Santarém, Abrantes","Artigo 20.º, n.º 1, alínea a) do Código dos Contratos Públicos",,,,,,Não aplicável.,Não aplicável.,FALSE
Serviços Médicos - Cardiologia,Ajuste Direto Regime Geral,Aquisição de serviços,"85100000-0, Serviços de saúde","Centro Hospitalar do Médio Tejo, E. P. E. (506361608)",Nelson Carlos Vale (223319120),"34.000,00 €",06-10-2016,20-09-2016,240 dias,"Portugal, Santarém, Abrantes","Artigo 20.º, n.º 1, alínea a) do Código dos Contratos Públicos",,,,,,Não aplicável.,Não aplicável.,FALSE
Prestação de Serviços Médicos na Área da Triagem Geral e Pediatrica- (horas 01 abr a 30 abr)- 37008316,Ajuste Direto Regime Geral,Aquisição de serviços,"85100000-0, Serviços de saúde","Centro Hospitalar do Médio Tejo, E.P.E. (CHMT) (506361608)","QRS - SERVIÇOS DE SAÚDE, LDA  (510641261)","75.000,00 €",03-10-2016,21-06-2016,30 dias,"Portugal, Santarém, Torres Novas","Artigo 24.º, n.º 1, alínea a) do Código dos Contratos Públicos",,,,,,Não aplicável.,Não aplicável.,FALSE
Prestação de Serviços Médicos na Área dos Cuidados Intensivos- (horas abr a dez)- 37013916,Ajuste Direto Regime Geral,Aquisição de serviços,"85100000-0, Serviços de saúde","Centro Hospitalar do Médio Tejo, E. P. E. (506361608)","Germano & Emílio - Serviços de Saúde, Lda (508029570)","53.550,00 €",03-10-2016,28-07-2016,270 dias,"Portugal, Santarém, Torres Novas","Artigo 20.º, n.º 1, alínea a) do Código dos Contratos Públicos",,,,,,Não aplicável.,Não aplicável.,FALSE
