Objeto do Contrato,Tipo de Procedimento,Tipo(s) de Contrato,CPVs,Entidade(s) Adjudicante(s),Entidade(s) Adjudicatária(s),Preço Contratual,Data de Publicação,Data de Celebração do Contrato,Prazo de Execução,Local de Execução,Fundamentação,Data de Fecho do Contrato,Preço Total Efetivo,Causas das Alterações ao Prazo,Causas das Alterações ao Preço,Estado,N.º registo do Acordo Quadro,Descrição do Acordo Quadro,Procedimento Centralizado
Aquisição de testes de laboratório,Ajuste Direto Regime Geral,Aquisição de bens móveis,"33696500-0, Reagentes de laboratório","ADMINISTRAÇÃO REGIONAL DE SAÚDE DO CENTRO, I. P. (503122165)","A. Menarini Diagnósticos - Material de Laboratório, Lda (502610069)","18.570,00 €",11-04-2013,09-04-2013,365 dias,"Portugal, Leiria","Artigo 20.º, n.º 1, alínea a) do Código dos Contratos Públicos",,,,,,Não aplicável.,Não aplicável.,
"Calibração dos equipamentos dos Laboratórios de Saúde Pública da ARSC,IP.",Ajuste Direto Regime Geral,Aquisição de serviços,"98000000-3, Outros serviços comunitários, sociais e pessoais","Administração Regional de Saúde do Centro, I.P. (503122165)","Catim, Lda (501630473)","6.895,17 €",04-04-2013,04-04-2013,20 dias,"Portugal, Coimbra, Coimbra<BR/>Portugal, Aveiro, Aveiro<BR/>Portugal, Leiria, Leiria","Artigo 20.º, n.º 1, alínea a) do Código dos Contratos Públicos",,,,,,Não aplicável.,Não aplicável.,
