Objeto do Contrato,Tipo de Procedimento,Tipo(s) de Contrato,CPVs,Entidade(s) Adjudicante(s),Entidade(s) Adjudicatária(s),Preço Contratual,Data de Publicação,Data de Celebração do Contrato,Prazo de Execução,Local de Execução,Fundamentação,Data de Fecho do Contrato,Preço Total Efetivo,Causas das Alterações ao Prazo,Causas das Alterações ao Preço,Estado,N.º registo do Acordo Quadro,Descrição do Acordo Quadro,Procedimento Centralizado
Aquisição de serviços de manutenção de equipamentos de gastroenterologia,Ajuste Direto Regime Geral,Aquisição de serviços,"50421000-2, Serviços de reparação e manutenção de equipamento médico","Centro Hospitalar Médio Ave, E.P.E.. (508093937)","OLYMPUS IBERIA S.A.U., Sucursal em Portugal (980474710)","19.788,65 €",02-03-2016,22-02-2016,306 dias,"Portugal, Braga, Vila Nova de Famalicão","Artigo 20.º, n.º 1, alínea a) do Código dos Contratos Públicos",,,,,,Não aplicável.,Não aplicável.,FALSE
Aquisição de combustíveis rodoviários em postos públicos,Ao abrigo de acordo-quadro (art.º 259.º),Aquisição de bens móveis,"09100000-0, Combustíveis","Centro Hospitalar do Médio Ave, E. P. E. (508093937)","Petróleos de Portugal - Petrogal, S.A. (500697370)","22.958,93 €",24-02-2016,15-02-2016,321 dias,"Portugal, Porto, Santo Tirso<BR/>Portugal, Braga, Vila Nova de Famalicão",Artigo 259.º do Código dos Contratos Públicos,,,,,,400324,Acordo quadro de fornecimento de combustíveis rodoviários,TRUE
Aquisição de papel de fotocópia,Ao abrigo de acordo-quadro (art.º 259.º),Aquisição de bens móveis,"30197643-5, Papel para fotocópia","Centro Hospitalar do Médio Ave, E. P. E.  - SNCP (508093937)","OHMTécnica – Representações de Marcas, Lda. (504059521)","16.537,50 €",24-02-2016,30-12-2015,366 dias,"Portugal, Braga, Vila Nova de Famalicão<BR/>Portugal, Porto, Santo Tirso",Artigo 259.º do Código dos Contratos Públicos,,,,,,1351201,Acordo quadro de fornecimento de papel e economato,TRUE
