freguesia,acronym,validVotesPercentage,votes,dicofre
São Pedro de Veiga de Lila,PPD/PSD.CDS-PP,61.05,58,171223
São Pedro de Veiga de Lila,PS,30.53,29,171223
São Pedro de Veiga de Lila,PCP-PEV,4.21,4,171223
São Pedro de Veiga de Lila,PND,2.11,2,171223
São Pedro de Veiga de Lila,L,1.05,1,171223
São Pedro de Veiga de Lila,PPM,1.05,1,171223
São Pedro de Veiga de Lila,B.E.,0,0,171223
São Pedro de Veiga de Lila,MAS,0,0,171223
São Pedro de Veiga de Lila,MPT,0,0,171223
São Pedro de Veiga de Lila,PAN,0,0,171223
São Pedro de Veiga de Lila,PCTP/MRPP,0,0,171223
São Pedro de Veiga de Lila,PDA,0,0,171223
São Pedro de Veiga de Lila,PNR,0,0,171223
São Pedro de Veiga de Lila,POUS,0,0,171223
São Pedro de Veiga de Lila,PPV,0,0,171223
São Pedro de Veiga de Lila,PTP,0,0,171223
