freguesia,acronym,validVotesPercentage,votes,dicofre
Penela da Beira,PPD/PSD,43.23,67,181207
Penela da Beira,PS,39.35,61,181207
Penela da Beira,CDS-PP,6.45,10,181207
Penela da Beira,B.E.,5.16,8,181207
Penela da Beira,L,1.29,2,181207
Penela da Beira,NC,1.29,2,181207
Penela da Beira,PAN,1.29,2,181207
Penela da Beira,IL,0.65,1,181207
Penela da Beira,PTP,0.65,1,181207
Penela da Beira,R.I.R.,0.65,1,181207
Penela da Beira,A,0,0,181207
Penela da Beira,CH,0,0,181207
Penela da Beira,JPP,0,0,181207
Penela da Beira,MPT,0,0,181207
Penela da Beira,PCP-PEV,0,0,181207
Penela da Beira,PCTP/MRPP,0,0,181207
Penela da Beira,PDR,0,0,181207
Penela da Beira,PNR,0,0,181207
Penela da Beira,PPM,0,0,181207
Penela da Beira,PURP,0,0,181207
