freguesia,acronym,validVotesPercentage,votes,dicofre
Norte Grande (Neves),PS,41.77,66,450202
Norte Grande (Neves),CDS-PP,28.48,45,450202
Norte Grande (Neves),PPD/PSD,17.72,28,450202
Norte Grande (Neves),PCP-PEV,3.8,6,450202
Norte Grande (Neves),B.E.,2.53,4,450202
Norte Grande (Neves),PAN,1.9,3,450202
Norte Grande (Neves),PPM.PPV/CDC,1.9,3,450202
Norte Grande (Neves),A,0.63,1,450202
Norte Grande (Neves),L,0.63,1,450202
Norte Grande (Neves),PNR,0.63,1,450202
Norte Grande (Neves),IL,0,0,450202
Norte Grande (Neves),MAS,0,0,450202
Norte Grande (Neves),NC,0,0,450202
Norte Grande (Neves),PCTP/MRPP,0,0,450202
Norte Grande (Neves),PDR,0,0,450202
Norte Grande (Neves),PTP,0,0,450202
Norte Grande (Neves),PURP,0,0,450202
