freguesia,acronym,validVotesPercentage,votes,dicofre
União das freguesias de Silveiros e Rio Covo (Santa Eulália),PS,37.15,240,0302FE
União das freguesias de Silveiros e Rio Covo (Santa Eulália),PPD/PSD,34.37,222,0302FE
União das freguesias de Silveiros e Rio Covo (Santa Eulália),CDS-PP,6.5,42,0302FE
União das freguesias de Silveiros e Rio Covo (Santa Eulália),B.E.,5.42,35,0302FE
União das freguesias de Silveiros e Rio Covo (Santa Eulália),PAN,3.87,25,0302FE
União das freguesias de Silveiros e Rio Covo (Santa Eulália),PCP-PEV,2.32,15,0302FE
União das freguesias de Silveiros e Rio Covo (Santa Eulália),PPM.PPV/CDC,2.17,14,0302FE
União das freguesias de Silveiros e Rio Covo (Santa Eulália),A,1.39,9,0302FE
União das freguesias de Silveiros e Rio Covo (Santa Eulália),L,1.39,9,0302FE
União das freguesias de Silveiros e Rio Covo (Santa Eulália),MAS,1.39,9,0302FE
União das freguesias de Silveiros e Rio Covo (Santa Eulália),IL,1.08,7,0302FE
União das freguesias de Silveiros e Rio Covo (Santa Eulália),PCTP/MRPP,0.77,5,0302FE
União das freguesias de Silveiros e Rio Covo (Santa Eulália),PURP,0.62,4,0302FE
União das freguesias de Silveiros e Rio Covo (Santa Eulália),NC,0.46,3,0302FE
União das freguesias de Silveiros e Rio Covo (Santa Eulália),PDR,0.46,3,0302FE
União das freguesias de Silveiros e Rio Covo (Santa Eulália),PNR,0.46,3,0302FE
União das freguesias de Silveiros e Rio Covo (Santa Eulália),PTP,0.15,1,0302FE
