Objeto do Contrato,Tipo de Procedimento,Tipo(s) de Contrato,CPVs,Entidade(s) Adjudicante(s),Entidade(s) Adjudicatária(s),Preço Contratual,Data de Publicação,Data de Celebração do Contrato,Prazo de Execução,Local de Execução,Fundamentação,Data de Fecho do Contrato,Preço Total Efetivo,Causas das Alterações ao Prazo,Causas das Alterações ao Preço,Estado,N.º registo do Acordo Quadro,Descrição do Acordo Quadro,Procedimento Centralizado
47000918-EQUIPAMENTO MEDICO-CIRURGICO,Ajuste Direto Regime Geral,Aquisição de bens móveis,"33000000-0, Equipamento médico, medicamentos e produtos para cuidados pessoais",Hospital Dr. Francisco Zagalo - Ovar (501510150),"Smith & Nephew, Lda. (503552461)","19.715,00 €",09-01-2019,04-07-2018,150 dias,"Portugal, Aveiro, Ovar","Artigo 20.º, n.º 1, alínea d) do Código dos Contratos Públicos",31-12-2018,"19.715,00 €",,,,Não aplicável.,Não aplicável.,FALSE
49004618-SERVIÇOS NA AREA DE CONTABILIDADE (TOC),Ajuste Direto Regime Geral,Aquisição de serviços,"79000000-4, Serviços a empresas: direito, comercialização, consultoria, recrutamento, impressão e segurança",Hospital Dr. Francisco Zagalo - Ovar (501510150),LUIS MIGUEL RODRIGUES COSTA (TOC) (203037928),"10.431,60 €",04-01-2019,07-02-2018,360 dias,"Portugal, Aveiro, Ovar","Artigo 20.º, n.º 1, alínea d) do Código dos Contratos Públicos",31-12-2018,"10.431,60 €",,,,Não aplicável.,Não aplicável.,FALSE
Medicamentos com CHNM,Consulta Prévia,Aquisição de bens móveis,"33690000-3, Medicamentos vários",Hospital Dr. Francisco Zagalo - Ovar (501510150),KYOWA KIRIN FARMACEUTICA UNIPESSOAL LDA (514194880),"672,03 €",03-01-2019,30-01-2018,330 dias,"Portugal, Aveiro, Ovar","Artigo 20.º, n.º 1, alínea c) do Código dos Contratos Públicos","","",,,,Não aplicável.,Não aplicável.,FALSE
Medicamentos com CHNM,Consulta Prévia,Aquisição de bens móveis,"33690000-3, Medicamentos vários",Hospital Dr. Francisco Zagalo - Ovar (501510150),"LUSOMEDICAMENTA, SOC.TECN.FARMACIA S.A. (507150473)","32,40 €",03-01-2019,30-01-2018,330 dias,"Portugal, Aveiro, Ovar","Artigo 20.º, n.º 1, alínea c) do Código dos Contratos Públicos","","",,,,Não aplicável.,Não aplicável.,FALSE
Medicamentos com CHNM,Consulta Prévia,Aquisição de bens móveis,"33690000-3, Medicamentos vários",Hospital Dr. Francisco Zagalo - Ovar (501510150),"Takeda-Farmaceuticos Portugal, Lda. (502801204)","3.589,30 €",03-01-2019,30-01-2018,330 dias,"Portugal, Aveiro, Ovar","Artigo 20.º, n.º 1, alínea c) do Código dos Contratos Públicos","","",,,,Não aplicável.,Não aplicável.,FALSE
Medicamentos com CHNM,Consulta Prévia,Aquisição de bens móveis,"33690000-3, Medicamentos vários",Hospital Dr. Francisco Zagalo - Ovar (501510150),BLUEMED UNIP. LDA (509912060),"1.316,40 €",03-01-2019,30-01-2018,330 dias,"Portugal, Aveiro, Ovar","Artigo 20.º, n.º 1, alínea c) do Código dos Contratos Públicos","","",,,,Não aplicável.,Não aplicável.,FALSE
Medicamentos com CHNM,Consulta Prévia,Aquisição de bens móveis,"33690000-3, Medicamentos vários",Hospital Dr. Francisco Zagalo - Ovar (501510150),PHARMAKERN PORTUGAL-PROD. FARMACEUTICOS (507002571),"195,20 €",03-01-2019,30-01-2018,330 dias,"Portugal, Aveiro, Ovar","Artigo 20.º, n.º 1, alínea c) do Código dos Contratos Públicos","","",,,,Não aplicável.,Não aplicável.,FALSE
Medicamentos com CHNM,Consulta Prévia,Aquisição de bens móveis,"33690000-3, Medicamentos vários",Hospital Dr. Francisco Zagalo - Ovar (501510150),"BDRPHARMA, LDA (513077332)","97,04 €",03-01-2019,30-01-2018,330 dias,"Portugal, Aveiro, Ovar","Artigo 20.º, n.º 1, alínea c) do Código dos Contratos Públicos","","",,,,Não aplicável.,Não aplicável.,FALSE
Medicamentos com CHNM,Consulta Prévia,Aquisição de bens móveis,"33690000-3, Medicamentos vários",Hospital Dr. Francisco Zagalo - Ovar (501510150),"R2MC- Rangel, Produtos Farmaceuticos S.A. (510599818)","38,70 €",03-01-2019,30-01-2018,330 dias,"Portugal, Aveiro, Ovar","Artigo 20.º, n.º 1, alínea c) do Código dos Contratos Públicos","","",,,,Não aplicável.,Não aplicável.,FALSE
Medicamentos com CHNM,Consulta Prévia,Aquisição de bens móveis,"33690000-3, Medicamentos vários",Hospital Dr. Francisco Zagalo - Ovar (501510150),"AbbVie, Lda (510229050)","3.177,72 €",03-01-2019,30-01-2018,330 dias,"Portugal, Aveiro, Ovar","Artigo 20.º, n.º 1, alínea c) do Código dos Contratos Públicos","","",,,,Não aplicável.,Não aplicável.,FALSE
Medicamentos com CHNM,Consulta Prévia,Aquisição de bens móveis,"33690000-3, Medicamentos vários",Hospital Dr. Francisco Zagalo - Ovar (501510150),Laboratórios Normon SA (505654156),"494,29 €",03-01-2019,30-01-2018,330 dias,"Portugal, Aveiro, Ovar","Artigo 20.º, n.º 1, alínea c) do Código dos Contratos Públicos","","",,,,Não aplicável.,Não aplicável.,FALSE
Medicamentos com CHNM,Consulta Prévia,Aquisição de bens móveis,"33690000-3, Medicamentos vários",Hospital Dr. Francisco Zagalo - Ovar (501510150),DLA Farmacêutica SA (503894427),"107,20 €",03-01-2019,30-01-2018,330 dias,"Portugal, Aveiro, Ovar","Artigo 20.º, n.º 1, alínea c) do Código dos Contratos Públicos","","",,,,Não aplicável.,Não aplicável.,FALSE
Medicamentos com CHNM,Consulta Prévia,Aquisição de bens móveis,"33690000-3, Medicamentos vários",Hospital Dr. Francisco Zagalo - Ovar (501510150),"GENERIS FARMACÊUTICA, S.A. (508107997)","7.271,23 €",02-01-2019,30-01-2018,330 dias,"Portugal, Aveiro, Ovar","Artigo 20.º, n.º 1, alínea c) do Código dos Contratos Públicos","","",,,,Não aplicável.,Não aplicável.,FALSE
Medicamentos com CHNM,Consulta Prévia,Aquisição de bens móveis,"33690000-3, Medicamentos vários",Hospital Dr. Francisco Zagalo - Ovar (501510150),"DILOFAR, LDA (500563004)","310,00 €",02-01-2019,30-01-2018,330 dias,"Portugal, Aveiro, Ovar","Artigo 20.º, n.º 1, alínea c) do Código dos Contratos Públicos","","",,,,Não aplicável.,Não aplicável.,FALSE
Medicamentos com CHNM,Consulta Prévia,Aquisição de bens móveis,"33690000-3, Medicamentos vários",Hospital Dr. Francisco Zagalo - Ovar (501510150),SANDOZ FARMACEUTICA LDA (506985261),"252,83 €",02-01-2019,30-01-2018,330 dias,"Portugal, Aveiro, Ovar","Artigo 20.º, n.º 1, alínea c) do Código dos Contratos Públicos","","",,,,Não aplicável.,Não aplicável.,FALSE
Medicamentos com CHNM,Consulta Prévia,Aquisição de bens móveis,"33690000-3, Medicamentos vários",Hospital Dr. Francisco Zagalo - Ovar (501510150),"TEVA PHARMA-Prod.Farmacêuticos, Lda (507045491)","983,73 €",02-01-2019,30-01-2018,330 dias,"Portugal, Aveiro, Ovar","Artigo 20.º, n.º 1, alínea c) do Código dos Contratos Públicos","","",,,,Não aplicável.,Não aplicável.,FALSE
Medicamentos com CHNM,Consulta Prévia,Aquisição de bens móveis,"33690000-3, Medicamentos vários",Hospital Dr. Francisco Zagalo - Ovar (501510150),BAUSCH & LOMB (980218764),"187,25 €",02-01-2019,30-01-2018,330 dias,"Portugal, Aveiro, Ovar","Artigo 20.º, n.º 1, alínea c) do Código dos Contratos Públicos","","",,,,Não aplicável.,Não aplicável.,FALSE
Medicamentos com CHNM,Consulta Prévia,Aquisição de bens móveis,"33690000-3, Medicamentos vários",Hospital Dr. Francisco Zagalo - Ovar (501510150),GLAXO SMITHKLINE CONSUMER HEALTHCARE (500276994),"503,44 €",02-01-2019,30-01-2018,330 dias,"Portugal, Aveiro, Ovar","Artigo 20.º, n.º 1, alínea c) do Código dos Contratos Públicos","","",,,,Não aplicável.,Não aplicável.,FALSE
Medicamentos com CHNM,Consulta Prévia,Aquisição de bens móveis,"33690000-3, Medicamentos vários",Hospital Dr. Francisco Zagalo - Ovar (501510150),MYLAN (502248793),"915,84 €",02-01-2019,30-01-2018,330 dias,"Portugal, Aveiro, Ovar","Artigo 20.º, n.º 1, alínea c) do Código dos Contratos Públicos","","",,,,Não aplicável.,Não aplicável.,FALSE
Medicamentos com CHNM,Consulta Prévia,Aquisição de bens móveis,"33690000-3, Medicamentos vários",Hospital Dr. Francisco Zagalo - Ovar (501510150),OVERPHARMA PROD MEDICOS FARMACEUTICOS (505792362),"5.784,54 €",02-01-2019,30-01-2018,330 dias,"Portugal, Aveiro, Ovar","Artigo 20.º, n.º 1, alínea c) do Código dos Contratos Públicos","","",,,,Não aplicável.,Não aplicável.,FALSE
Medicamentos com CHNM,Consulta Prévia,Aquisição de bens móveis,"33690000-3, Medicamentos vários",Hospital Dr. Francisco Zagalo - Ovar (501510150),CSL  BEHRING (503047201),"948,00 €",02-01-2019,30-01-2018,330 dias,"Portugal, Aveiro, Ovar","Artigo 20.º, n.º 1, alínea c) do Código dos Contratos Públicos","","",,,,Não aplicável.,Não aplicável.,FALSE
Medicamentos com CHNM,Consulta Prévia,Aquisição de bens móveis,"33690000-3, Medicamentos vários",Hospital Dr. Francisco Zagalo - Ovar (501510150),RATIOPHARM (502414910),"74,06 €",02-01-2019,30-01-2018,330 dias,"Portugal, Aveiro, Ovar","Artigo 20.º, n.º 1, alínea c) do Código dos Contratos Públicos","","",,,,Não aplicável.,Não aplicável.,FALSE
Medicamentos com CHNM,Consulta Prévia,Aquisição de bens móveis,"33690000-3, Medicamentos vários",Hospital Dr. Francisco Zagalo - Ovar (501510150),PAUL HARTMANN LDA (502271728),"4.420,00 €",02-01-2019,30-01-2018,330 dias,"Portugal, Aveiro, Ovar","Artigo 20.º, n.º 1, alínea c) do Código dos Contratos Públicos","","",,,,Não aplicável.,Não aplicável.,FALSE
Medicamentos com CHNM,Consulta Prévia,Aquisição de bens móveis,"33690000-3, Medicamentos vários",Hospital Dr. Francisco Zagalo - Ovar (501510150),"FRESENIUS KABI PHARMA PORTUGAL, LDA (504293753)","6.533,80 €",02-01-2019,30-01-2018,330 dias,"Portugal, Aveiro, Ovar","Artigo 20.º, n.º 1, alínea c) do Código dos Contratos Públicos","","",,,,Não aplicável.,Não aplicável.,FALSE
Medicamentos com CHNM,Consulta Prévia,Aquisição de bens móveis,"33690000-3, Medicamentos vários",Hospital Dr. Francisco Zagalo - Ovar (501510150),ASTRA ZENECA PRO FARMACEUTICOS LDA (502942240),"20,62 €",02-01-2019,30-01-2018,330 dias,"Portugal, Aveiro, Ovar","Artigo 20.º, n.º 1, alínea c) do Código dos Contratos Públicos","","",,,,Não aplicável.,Não aplicável.,FALSE
Medicamentos com CHNM,Consulta Prévia,Aquisição de bens móveis,"33690000-3, Medicamentos vários",Hospital Dr. Francisco Zagalo - Ovar (501510150),HIKMA FARMACEUTICA PORTUGAL (502266791),"1.130,10 €",02-01-2019,30-01-2018,330 dias,"Portugal, Aveiro, Ovar","Artigo 20.º, n.º 1, alínea c) do Código dos Contratos Públicos","","",,,,Não aplicável.,Não aplicável.,FALSE
Medicamentos com CHNM,Consulta Prévia,Aquisição de bens móveis,"33690000-3, Medicamentos vários",Hospital Dr. Francisco Zagalo - Ovar (501510150),JANSSEN CILAG FARMACEUTICA LDA (500189412),"163,40 €",02-01-2019,30-01-2018,330 dias,"Portugal, Aveiro, Ovar","Artigo 20.º, n.º 1, alínea c) do Código dos Contratos Públicos","","",,,,Não aplicável.,Não aplicável.,FALSE
Medicamentos com CHNM,Consulta Prévia,Aquisição de bens móveis,"33690000-3, Medicamentos vários",Hospital Dr. Francisco Zagalo - Ovar (501510150),SANOFI PRODUTOS FARMACEUTICOS LDA (500134960),"461,36 €",02-01-2019,30-01-2018,330 dias,"Portugal, Aveiro, Ovar","Artigo 20.º, n.º 1, alínea c) do Código dos Contratos Públicos","","",,,,Não aplicável.,Não aplicável.,FALSE
Medicamentos com CHNM,Consulta Prévia,Aquisição de bens móveis,"33690000-3, Medicamentos vários",Hospital Dr. Francisco Zagalo - Ovar (501510150),CLINIFAR (503281115),"840,00 €",02-01-2019,30-01-2018,330 dias,"Portugal, Aveiro, Ovar","Artigo 20.º, n.º 1, alínea c) do Código dos Contratos Públicos","","",,,,Não aplicável.,Não aplicável.,FALSE
Medicamentos com CHNM,Consulta Prévia,Aquisição de bens móveis,"33690000-3, Medicamentos vários",Hospital Dr. Francisco Zagalo - Ovar (501510150),SIDEFARMA-SOC.IND.EXP.FARMAC. (500717419),"885,00 €",02-01-2019,30-01-2018,330 dias,"Portugal, Aveiro, Ovar","Artigo 20.º, n.º 1, alínea c) do Código dos Contratos Públicos","","",,,,Não aplicável.,Não aplicável.,FALSE
Medicamentos com CHNM,Consulta Prévia,Aquisição de bens móveis,"33690000-3, Medicamentos vários",Hospital Dr. Francisco Zagalo - Ovar (501510150),HOSPIRA PORTUGAL LDA (502918098),"12,50 €",02-01-2019,30-01-2018,330 dias,"Portugal, Aveiro, Ovar","Artigo 20.º, n.º 1, alínea c) do Código dos Contratos Públicos","","",,,,Não aplicável.,Não aplicável.,FALSE
Medicamentos com CHNM,Consulta Prévia,Aquisição de bens móveis,"33690000-3, Medicamentos vários",Hospital Dr. Francisco Zagalo - Ovar (501510150),LABORATORIO MEDINFAR (500384045),"505,70 €",02-01-2019,30-01-2018,330 dias,"Portugal, Aveiro, Ovar","Artigo 20.º, n.º 1, alínea c) do Código dos Contratos Públicos","","",,,,Não aplicável.,Não aplicável.,FALSE
Medicamentos com CHNM,Consulta Prévia,Aquisição de bens móveis,"33690000-3, Medicamentos vários",Hospital Dr. Francisco Zagalo - Ovar (501510150),GRIFOLS PORTUGAL (502041285),"1.004,00 €",02-01-2019,30-01-2018,330 dias,"Portugal, Aveiro, Ovar","Artigo 20.º, n.º 1, alínea c) do Código dos Contratos Públicos","","",,,,Não aplicável.,Não aplicável.,FALSE
Medicamentos com CHNM,Consulta Prévia,Aquisição de bens móveis,"33690000-3, Medicamentos vários",Hospital Dr. Francisco Zagalo - Ovar (501510150),B BRAUN MEDICAL LDA (501506543),"3.695,96 €",02-01-2019,30-01-2018,330 dias,"Portugal, Aveiro, Ovar","Artigo 20.º, n.º 1, alínea c) do Código dos Contratos Públicos","","",,,,Não aplicável.,Não aplicável.,FALSE
Medicamentos com CHNM,Consulta Prévia,Aquisição de bens móveis,"33690000-3, Medicamentos vários",Hospital Dr. Francisco Zagalo - Ovar (501510150),BAXTER (503347345),"364,30 €",02-01-2019,30-01-2018,330 dias,"Portugal, Aveiro, Ovar","Artigo 20.º, n.º 1, alínea c) do Código dos Contratos Públicos","","",,,,Não aplicável.,Não aplicável.,FALSE
Medicamentos com CHNM,Consulta Prévia,Aquisição de bens móveis,"33690000-3, Medicamentos vários",Hospital Dr. Francisco Zagalo - Ovar (501510150),UNILFARMA (500293023),"1.279,80 €",02-01-2019,30-01-2018,330 dias,"Portugal, Aveiro, Ovar","Artigo 20.º, n.º 1, alínea c) do Código dos Contratos Públicos","","",,,,Não aplicável.,Não aplicável.,FALSE
Medicamentos com CHNM,Consulta Prévia,Aquisição de bens móveis,"33690000-3, Medicamentos vários",Hospital Dr. Francisco Zagalo - Ovar (501510150),ROCHE FARMACEUTICA QUIMICA LDA (500233810),"72,06 €",02-01-2019,30-01-2018,330 dias,"Portugal, Aveiro, Ovar","Artigo 20.º, n.º 1, alínea c) do Código dos Contratos Públicos","","",,,,Não aplicável.,Não aplicável.,FALSE
Medicamentos com CHNM,Consulta Prévia,Aquisição de bens móveis,"33690000-3, Medicamentos vários",Hospital Dr. Francisco Zagalo - Ovar (501510150),MERCK SHARP & DOHME LDA (500191360),"1.305,30 €",02-01-2019,30-01-2018,330 dias,"Portugal, Aveiro, Ovar","Artigo 20.º, n.º 1, alínea c) do Código dos Contratos Públicos","","",,,,Não aplicável.,Não aplicável.,FALSE
Medicamentos com CHNM,Consulta Prévia,Aquisição de bens móveis,"33690000-3, Medicamentos vários",Hospital Dr. Francisco Zagalo - Ovar (501510150),GLAXO SMITHKLINE PROD FARMACEUTICOS (500139962),"233,80 €",02-01-2019,30-01-2018,330 dias,"Portugal, Aveiro, Ovar","Artigo 20.º, n.º 1, alínea c) do Código dos Contratos Públicos","","",,,,Não aplicável.,Não aplicável.,FALSE
Medicamentos com CHNM,Consulta Prévia,Aquisição de bens móveis,"33690000-3, Medicamentos vários",Hospital Dr. Francisco Zagalo - Ovar (501510150),LABORATORIOS VITORIA SA (500162220),"3,65 €",02-01-2019,30-01-2018,330 dias,"Portugal, Aveiro, Ovar","Artigo 20.º, n.º 1, alínea c) do Código dos Contratos Públicos","","",,,,Não aplicável.,Não aplicável.,FALSE
Medicamentos com CHNM,Consulta Prévia,Aquisição de bens móveis,"33690000-3, Medicamentos vários",Hospital Dr. Francisco Zagalo - Ovar (501510150),LABORATORIOS PFIZER LDA (500162166),"449,19 €",02-01-2019,30-01-2018,330 dias,"Portugal, Aveiro, Ovar","Artigo 20.º, n.º 1, alínea c) do Código dos Contratos Públicos","","",,,,Não aplicável.,Não aplicável.,FALSE
Medicamentos com CHNM,Consulta Prévia,Aquisição de bens móveis,"33690000-3, Medicamentos vários",Hospital Dr. Francisco Zagalo - Ovar (501510150),LABORATORIOS BIAL (500220913),"73,47 €",02-01-2019,30-01-2018,330 dias,"Portugal, Aveiro, Ovar","Artigo 20.º, n.º 1, alínea c) do Código dos Contratos Públicos","","",,,,Não aplicável.,Não aplicável.,FALSE
Medicamentos com CHNM,Consulta Prévia,Aquisição de bens móveis,"33690000-3, Medicamentos vários",Hospital Dr. Francisco Zagalo - Ovar (501510150),"Labesfal, Laboratorios Almiro SA (501169580)","4.499,08 €",02-01-2019,30-01-2018,330 dias,"Portugal, Aveiro, Ovar","Artigo 20.º, n.º 1, alínea c) do Código dos Contratos Públicos","","",,,,Não aplicável.,Não aplicável.,FALSE
Medicamentos com CHNM,Consulta Prévia,Aquisição de bens móveis,"33690000-3, Medicamentos vários",Hospital Dr. Francisco Zagalo - Ovar (501510150),GRUNENTHAL SA (500101965),"253,88 €",02-01-2019,30-01-2018,330 dias,"Portugal, Aveiro, Ovar","Artigo 20.º, n.º 1, alínea c) do Código dos Contratos Públicos","","",,,,Não aplicável.,Não aplicável.,FALSE
Medicamentos com CHNM,Consulta Prévia,Aquisição de bens móveis,"33690000-3, Medicamentos vários",Hospital Dr. Francisco Zagalo - Ovar (501510150),NOVARTIS FARMA (500063524),"148,91 €",02-01-2019,30-01-2018,360 dias,"Portugal, Aveiro, Ovar","Artigo 20.º, n.º 1, alínea c) do Código dos Contratos Públicos","","",,,,Não aplicável.,Não aplicável.,FALSE
Medicamentos com CHNM,Consulta Prévia,Aquisição de bens móveis,"33690000-3, Medicamentos vários",Hospital Dr. Francisco Zagalo - Ovar (501510150),BRISTOL MYERS SQUIBB FARMACEUTICA SA (500048193),"52,00 €",02-01-2019,30-01-2018,360 dias,"Portugal, Aveiro, Ovar","Artigo 20.º, n.º 1, alínea c) do Código dos Contratos Públicos","","",,,,Não aplicável.,Não aplicável.,FALSE
Medicamentos com CHNM,Consulta Prévia,Aquisição de bens móveis,"33690000-3, Medicamentos vários",Hospital Dr. Francisco Zagalo - Ovar (501510150),BAYER PORTUGAL SA (500043256),"79,00 €",02-01-2019,30-01-2018,360 dias,"Portugal, Aveiro, Ovar","Artigo 20.º, n.º 1, alínea c) do Código dos Contratos Públicos","","",,,,Não aplicável.,Não aplicável.,FALSE
Medicamentos com CHNM,Consulta Prévia,Aquisição de bens móveis,"33690000-3, Medicamentos vários",Hospital Dr. Francisco Zagalo - Ovar (501510150),A.MARTINS E FERNANDES S.A (501172114),"40,00 €",02-01-2019,30-01-2018,360 dias,"Portugal, Aveiro, Ovar","Artigo 20.º, n.º 1, alínea c) do Código dos Contratos Públicos","","",,,,Não aplicável.,Não aplicável.,FALSE
Medicamentos sem CHNM,Ajuste Direto Regime Geral,Aquisição de bens móveis,"33690000-3, Medicamentos vários",Hospital Dr. Francisco Zagalo - Ovar (501510150),NORGINE PORTUGAL FARMACÊUTICA UN. LDA (508676746),"1.020,00 €",02-01-2019,30-01-2018,330 dias,"Portugal, Aveiro, Ovar","Artigo 20.º, n.º 1, alínea d) do Código dos Contratos Públicos","","",,,,Não aplicável.,Não aplicável.,FALSE
Medicamentos sem CHNM,Ajuste Direto Regime Geral,Aquisição de bens móveis,"33690000-3, Medicamentos vários",Hospital Dr. Francisco Zagalo - Ovar (501510150),"BDRPHARMA, LDA (513077332)","1.582,53 €",02-01-2019,30-01-2018,330 dias,"Portugal, Aveiro, Ovar","Artigo 20.º, n.º 1, alínea d) do Código dos Contratos Públicos","","",,,,Não aplicável.,Não aplicável.,FALSE
Medicamentos sem CHNM,Ajuste Direto Regime Geral,Aquisição de bens móveis,"33690000-3, Medicamentos vários",Hospital Dr. Francisco Zagalo - Ovar (501510150),"Omega Pharma Portuguesa Unipessoal, Lda (506112233)","146,40 €",02-01-2019,30-01-2018,330 dias,"Portugal, Aveiro, Ovar","Artigo 20.º, n.º 1, alínea d) do Código dos Contratos Públicos","","",,,,Não aplicável.,Não aplicável.,FALSE
Medicamentos sem CHNM,Ajuste Direto Regime Geral,Aquisição de bens móveis,"33690000-3, Medicamentos vários",Hospital Dr. Francisco Zagalo - Ovar (501510150),"SPCARE - ESPECIALIDADES FARMACEUTICAS, LDA (508284872)","299,60 €",02-01-2019,30-01-2018,330 dias,"Portugal, Aveiro, Ovar","Artigo 20.º, n.º 1, alínea d) do Código dos Contratos Públicos","","",,,,Não aplicável.,Não aplicável.,FALSE
Medicamentos sem CHNM,Ajuste Direto Regime Geral,Aquisição de bens móveis,"33690000-3, Medicamentos vários",Hospital Dr. Francisco Zagalo - Ovar (501510150),"DILOFAR, LDA (500563004)","156,34 €",02-01-2019,30-01-2018,330 dias,"Portugal, Aveiro, Ovar","Artigo 20.º, n.º 1, alínea d) do Código dos Contratos Públicos","","",,,,Não aplicável.,Não aplicável.,FALSE
Medicamentos sem CHNM,Ajuste Direto Regime Geral,Aquisição de bens móveis,"33690000-3, Medicamentos vários",Hospital Dr. Francisco Zagalo - Ovar (501510150),"CICLUM FARMA UNIPESSOAL, LDA (504362674)","375,00 €",02-01-2019,30-01-2018,330 dias,"Portugal, Aveiro, Ovar","Artigo 20.º, n.º 1, alínea d) do Código dos Contratos Públicos","","",,,,Não aplicável.,Não aplicável.,FALSE
Medicamentos sem CHNM,Ajuste Direto Regime Geral,Aquisição de bens móveis,"33690000-3, Medicamentos vários",Hospital Dr. Francisco Zagalo - Ovar (501510150),GLAXO SMITHKLINE CONSUMER HEALTHCARE (500276994),"1.061,44 €",02-01-2019,30-01-2018,330 dias,"Portugal, Aveiro, Ovar","Artigo 20.º, n.º 1, alínea d) do Código dos Contratos Públicos","","",,,,Não aplicável.,Não aplicável.,FALSE
Medicamentos sem CHNM,Ajuste Direto Regime Geral,Aquisição de bens móveis,"33690000-3, Medicamentos vários",Hospital Dr. Francisco Zagalo - Ovar (501510150),MYLAN (502248793),"290,00 €",02-01-2019,30-01-2018,330 dias,"Portugal, Aveiro, Ovar","Artigo 20.º, n.º 1, alínea d) do Código dos Contratos Públicos","","",,,,Não aplicável.,Não aplicável.,FALSE
Medicamentos sem CHNM,Ajuste Direto Regime Geral,Aquisição de bens móveis,"33690000-3, Medicamentos vários",Hospital Dr. Francisco Zagalo - Ovar (501510150),"FRESENIUS KABI PHARMA PORTUGAL, LDA (504293753)","17,44 €",02-01-2019,30-01-2018,330 dias,"Portugal, Aveiro, Ovar","Artigo 20.º, n.º 1, alínea d) do Código dos Contratos Públicos","","",,,,Não aplicável.,Não aplicável.,FALSE
Medicamentos sem CHNM,Ajuste Direto Regime Geral,Aquisição de bens móveis,"33690000-3, Medicamentos vários",Hospital Dr. Francisco Zagalo - Ovar (501510150),SERVIER PORTUGAL LDA (502177420),"269,42 €",02-01-2019,30-01-2018,330 dias,"Portugal, Aveiro, Ovar","Artigo 20.º, n.º 1, alínea d) do Código dos Contratos Públicos","","",,,,Não aplicável.,Não aplicável.,FALSE
Medicamentos sem CHNM,Ajuste Direto Regime Geral,Aquisição de bens móveis,"33690000-3, Medicamentos vários",Hospital Dr. Francisco Zagalo - Ovar (501510150),MERCK SA (500650870),"540,00 €",02-01-2019,30-01-2018,330 dias,"Portugal, Aveiro, Ovar","Artigo 20.º, n.º 1, alínea d) do Código dos Contratos Públicos","","",,,,Não aplicável.,Não aplicável.,FALSE
Medicamentos sem CHNM,Ajuste Direto Regime Geral,Aquisição de bens móveis,"33690000-3, Medicamentos vários",Hospital Dr. Francisco Zagalo - Ovar (501510150),SANOFI PRODUTOS FARMACEUTICOS LDA (500134960),"66,50 €",02-01-2019,30-01-2018,330 dias,"Portugal, Aveiro, Ovar","Artigo 20.º, n.º 1, alínea d) do Código dos Contratos Públicos","","",,,,Não aplicável.,Não aplicável.,FALSE
Medicamentos sem CHNM,Ajuste Direto Regime Geral,Aquisição de bens móveis,"33690000-3, Medicamentos vários",Hospital Dr. Francisco Zagalo - Ovar (501510150),DISTRIFARMA SA (502948663),"228,25 €",02-01-2019,30-01-2018,330 dias,"Portugal, Aveiro, Ovar","Artigo 20.º, n.º 1, alínea d) do Código dos Contratos Públicos","","",,,,Não aplicável.,Não aplicável.,FALSE
Medicamentos sem CHNM,Ajuste Direto Regime Geral,Aquisição de bens móveis,"33690000-3, Medicamentos vários",Hospital Dr. Francisco Zagalo - Ovar (501510150),B BRAUN MEDICAL LDA (501506543),"781,85 €",02-01-2019,30-01-2018,330 dias,"Portugal, Aveiro, Ovar","Artigo 20.º, n.º 1, alínea d) do Código dos Contratos Públicos","","",,,,Não aplicável.,Não aplicável.,FALSE
Medicamentos sem CHNM,Ajuste Direto Regime Geral,Aquisição de bens móveis,"33690000-3, Medicamentos vários",Hospital Dr. Francisco Zagalo - Ovar (501510150),ANGELINI FARMACEUTICA LDA (500583650),"67,50 €",02-01-2019,30-01-2018,330 dias,"Portugal, Aveiro, Ovar","Artigo 20.º, n.º 1, alínea d) do Código dos Contratos Públicos","","",,,,Não aplicável.,Não aplicável.,FALSE
Medicamentos sem CHNM,Ajuste Direto Regime Geral,Aquisição de bens móveis,"33690000-3, Medicamentos vários",Hospital Dr. Francisco Zagalo - Ovar (501510150),UCB-PRODUTOS FARMACEUTICOS LDA (500291322),"88,95 €",02-01-2019,30-01-2018,330 dias,"Portugal, Aveiro, Ovar","Artigo 20.º, n.º 1, alínea d) do Código dos Contratos Públicos","","",,,,Não aplicável.,Não aplicável.,FALSE
Medicamentos sem CHNM,Ajuste Direto Regime Geral,Aquisição de bens móveis,"33690000-3, Medicamentos vários",Hospital Dr. Francisco Zagalo - Ovar (501510150),ROCHE FARMACEUTICA QUIMICA LDA (500233810),"29,40 €",02-01-2019,30-01-2018,330 dias,"Portugal, Aveiro, Ovar","Artigo 20.º, n.º 1, alínea d) do Código dos Contratos Públicos","","",,,,Não aplicável.,Não aplicável.,FALSE
Medicamentos sem CHNM,Ajuste Direto Regime Geral,Aquisição de bens móveis,"33690000-3, Medicamentos vários",Hospital Dr. Francisco Zagalo - Ovar (501510150),MERCK SHARP & DOHME LDA (500191360),"973,68 €",02-01-2019,30-01-2018,330 dias,"Portugal, Aveiro, Ovar","Artigo 20.º, n.º 1, alínea d) do Código dos Contratos Públicos","","",,,,Não aplicável.,Não aplicável.,FALSE
Medicamentos sem CHNM,Ajuste Direto Regime Geral,Aquisição de bens móveis,"33690000-3, Medicamentos vários",Hospital Dr. Francisco Zagalo - Ovar (501510150),LABORATORIOS VITORIA SA (500162220),"223,80 €",02-01-2019,30-01-2018,330 dias,"Portugal, Aveiro, Ovar","Artigo 20.º, n.º 1, alínea d) do Código dos Contratos Públicos","","",,,,Não aplicável.,Não aplicável.,FALSE
Medicamentos sem CHNM,Ajuste Direto Regime Geral,Aquisição de bens móveis,"33690000-3, Medicamentos vários",Hospital Dr. Francisco Zagalo - Ovar (501510150),LABORATORIOS PFIZER LDA (500162166),"108,43 €",02-01-2019,30-01-2018,330 dias,"Portugal, Aveiro, Ovar","Artigo 20.º, n.º 1, alínea d) do Código dos Contratos Públicos","","",,,,Não aplicável.,Não aplicável.,FALSE
Medicamentos sem CHNM,Ajuste Direto Regime Geral,Aquisição de bens móveis,"33690000-3, Medicamentos vários",Hospital Dr. Francisco Zagalo - Ovar (501510150),"Labesfal, Laboratorios Almiro SA (501169580)","1.224,31 €",02-01-2019,30-01-2018,330 dias,"Portugal, Aveiro, Ovar","Artigo 20.º, n.º 1, alínea d) do Código dos Contratos Públicos","","",,,,Não aplicável.,Não aplicável.,FALSE
Medicamentos sem CHNM,Ajuste Direto Regime Geral,Aquisição de bens móveis,"33690000-3, Medicamentos vários",Hospital Dr. Francisco Zagalo - Ovar (501510150),JOHNSON & JOHNSON LDA (500153370),"51,40 €",02-01-2019,30-01-2018,330 dias,"Portugal, Aveiro, Ovar","Artigo 20.º, n.º 1, alínea d) do Código dos Contratos Públicos","","",,,,Não aplicável.,Não aplicável.,FALSE
Medicamentos sem CHNM,Ajuste Direto Regime Geral,Aquisição de bens móveis,"33690000-3, Medicamentos vários",Hospital Dr. Francisco Zagalo - Ovar (501510150),JABA RECORDATI SA (500492867),"1,63 €",02-01-2019,30-01-2018,330 dias,"Portugal, Aveiro, Ovar","Artigo 20.º, n.º 1, alínea d) do Código dos Contratos Públicos","","",,,,Não aplicável.,Não aplicável.,FALSE
Medicamentos sem CHNM,Ajuste Direto Regime Geral,Aquisição de bens móveis,"33690000-3, Medicamentos vários",Hospital Dr. Francisco Zagalo - Ovar (501510150),FERRAZ LYNCE SA (500113270),"1.330,03 €",02-01-2019,30-01-2018,330 dias,"Portugal, Aveiro, Ovar","Artigo 20.º, n.º 1, alínea d) do Código dos Contratos Públicos","","",,,,Não aplicável.,Não aplicável.,FALSE
Medicamentos sem CHNM,Ajuste Direto Regime Geral,Aquisição de bens móveis,"33690000-3, Medicamentos vários",Hospital Dr. Francisco Zagalo - Ovar (501510150),BAYER PORTUGAL SA (500043256),"67,56 €",02-01-2019,30-01-2018,330 dias,"Portugal, Aveiro, Ovar","Artigo 20.º, n.º 1, alínea d) do Código dos Contratos Públicos","","",,,,Não aplicável.,Não aplicável.,FALSE
