freguesia,acronym,validVotesPercentage,votes,dicofre
Vila do Conde,PS,36.14,2484,131628
Vila do Conde,PPD/PSD,23.15,1591,131628
Vila do Conde,B.E.,11.95,821,131628
Vila do Conde,CDS-PP,7.17,493,131628
Vila do Conde,PAN,5.85,402,131628
Vila do Conde,PCP-PEV,5.3,364,131628
Vila do Conde,A,2.02,139,131628
Vila do Conde,L,1.85,127,131628
Vila do Conde,NC,1.72,118,131628
Vila do Conde,IL,1.45,100,131628
Vila do Conde,PPM.PPV/CDC,0.77,53,131628
Vila do Conde,PDR,0.76,52,131628
Vila do Conde,PCTP/MRPP,0.74,51,131628
Vila do Conde,PNR,0.41,28,131628
Vila do Conde,PURP,0.36,25,131628
Vila do Conde,PTP,0.22,15,131628
Vila do Conde,MAS,0.15,10,131628
