Objeto do Contrato,Tipo de Procedimento,Tipo(s) de Contrato,CPVs,Entidade(s) Adjudicante(s),Entidade(s) Adjudicatária(s),Preço Contratual,Data de Publicação,Data de Celebração do Contrato,Prazo de Execução,Local de Execução,Fundamentação,Data de Fecho do Contrato,Preço Total Efetivo,Causas das Alterações ao Prazo,Causas das Alterações ao Preço,Estado,N.º registo do Acordo Quadro,Descrição do Acordo Quadro,Procedimento Centralizado
110018/2018 - Aquisição de Reagentes para Microbiologia com colocação de Equipamentos,Concurso público,Aquisição de bens móveis,"33696500-0, Reagentes de laboratório","Centro Hospitalar Barreiro Montijo, E. P. E. (509186998)","IBCL, LDA (507001664)","97,50 €",10-08-2018,06-02-2018,365 dias,"Portugal, Setúbal, Barreiro","Artigo 20.º, n.º 1, alínea b) do Código dos Contratos Públicos","","","","",,Não aplicável.,Não aplicável.,FALSE
110018/2018 - Aquisição de Reagentes para Microbiologia com colocação de Equipamentos,Concurso público,Aquisição de bens móveis,"33696500-0, Reagentes de laboratório","Centro Hospitalar Barreiro Montijo, E. P. E. (509186998)",BAPTISTA MARQUES DIAGNOSTICA E REAGENTES LDA (501439110),"156,00 €",10-08-2018,06-02-2018,365 dias,"Portugal, Setúbal, Barreiro","Artigo 20.º, n.º 1, alínea b) do Código dos Contratos Públicos","","","","",,Não aplicável.,Não aplicável.,FALSE
110018/2018 - Aquisição de Reagentes para Microbiologia com colocação de Equipamentos,Concurso público,Aquisição de bens móveis,"33696500-0, Reagentes de laboratório","Centro Hospitalar Barreiro Montijo, E. P. E. (509186998)","CSPSAUDE - Centro de Serviços Partilhados, SA (508440246)","864,37 €",10-08-2018,06-02-2018,365 dias,"Portugal, Setúbal, Barreiro","Artigo 20.º, n.º 1, alínea b) do Código dos Contratos Públicos","","","","",,Não aplicável.,Não aplicável.,FALSE
110018/2018 - Aquisição de Reagentes para Microbiologia com colocação de Equipamentos,Concurso público,Aquisição de bens móveis,"33696500-0, Reagentes de laboratório","Centro Hospitalar Barreiro Montijo, E. P. E. (509186998)","Quilaban, SA (500399670)","390,00 €",10-08-2018,06-02-2018,365 dias,"Portugal, Setúbal, Barreiro","Artigo 20.º, n.º 1, alínea b) do Código dos Contratos Públicos","","","","",,Não aplicável.,Não aplicável.,FALSE
110018/2018 - Aquisição de Reagentes para Microbiologia com colocação de Equipamentos,Concurso público,Aquisição de bens móveis,"33696500-0, Reagentes de laboratório","Centro Hospitalar Barreiro Montijo, E. P. E. (509186998)",HEMICARE - HEALTH MEDICAL CARE (506517080),"588,20 €",10-08-2018,06-02-2018,365 dias,"Portugal, Setúbal, Barreiro","Artigo 20.º, n.º 1, alínea b) do Código dos Contratos Públicos","","","","",,Não aplicável.,Não aplicável.,FALSE
110018/2018 - Aquisição de Reagentes para Microbiologia com colocação de Equipamentos,Concurso público,Aquisição de bens móveis,"33696500-0, Reagentes de laboratório","Centro Hospitalar Barreiro Montijo, E. P. E. (509186998)","BIOGERM, SA (503265390)","5.823,39 €",10-08-2018,06-02-2018,365 dias,"Portugal, Setúbal, Barreiro","Artigo 20.º, n.º 1, alínea b) do Código dos Contratos Públicos","","","","",,Não aplicável.,Não aplicável.,FALSE
110018/2018 - Aquisição de Reagentes para Microbiologia com colocação de Equipamentos,Concurso público,Aquisição de bens móveis,"33696500-0, Reagentes de laboratório","Centro Hospitalar Barreiro Montijo, E. P. E. (509186998)","Bioportugal - Químico e Farmacêutica, Lda (502380543)","1.400,00 €",10-08-2018,06-02-2018,365 dias,"Portugal, Setúbal, Barreiro","Artigo 20.º, n.º 1, alínea b) do Código dos Contratos Públicos","","","","",,Não aplicável.,Não aplicável.,FALSE
30021/2018 Mamografo digital direto com Tomossintese,Consulta Prévia,Aquisição de bens móveis,"33000000-0, Equipamento médico, medicamentos e produtos para cuidados pessoais","Centro Hospitalar Barreiro Montijo, E. P. E. (509186998)","BENNASAR DIAGNOSTICA EQUIPAMENTOS MEDICOS, UNIP. LDA. (509366066)","72.600,00 €",10-08-2018,09-07-2018,45 dias,"Portugal, Setúbal, Barreiro","Artigo 20.º, n.º 1, alínea c) do Código dos Contratos Públicos",24-09-2018,"72.600,00 €","","",,Não aplicável.,Não aplicável.,FALSE
110018/2018 - Aquisição de Reagentes para Microbiologia com colocação de Equipamentos,Concurso público,Aquisição de bens móveis,"33696500-0, Reagentes de laboratório","Centro Hospitalar Barreiro Montijo, E. P. E. (509186998)","Fisher Scientific Unipessoal, Lda (506429210)","7.937,12 €",09-08-2018,06-02-2018,365 dias,"Portugal, Setúbal, Barreiro","Artigo 20.º, n.º 1, alínea b) do Código dos Contratos Públicos","","","","",,Não aplicável.,Não aplicável.,FALSE
110018/2018 - Aquisição de Reagentes para Microbiologia com colocação de Equipamentos,Concurso público,Aquisição de bens móveis,"33696500-0, Reagentes de laboratório","Centro Hospitalar Barreiro Montijo, E. P. E. (509186998)","Bio-Rad Laboratories, Lda (501301321)","8.617,58 €",09-08-2018,06-02-2018,365 dias,"Portugal, Setúbal, Barreiro","Artigo 20.º, n.º 1, alínea b) do Código dos Contratos Públicos","","","","",,Não aplicável.,Não aplicável.,FALSE
110018/2018 - Aquisição de Reagentes para Microbiologia com colocação de Equipamentos,Concurso público,Aquisição de bens móveis,"33696500-0, Reagentes de laboratório","Centro Hospitalar Barreiro Montijo, E. P. E. (509186998)",WERFEN PORTUGAL LDA. (501086110),"25.486,10 €",09-08-2018,19-02-2018,365 dias,"Portugal, Setúbal, Barreiro","Artigo 20.º, n.º 1, alínea b) do Código dos Contratos Públicos","","","","",,Não aplicável.,Não aplicável.,FALSE
110018/2018 - Aquisição de Reagentes para Microbiologia com colocação de Equipamentos,Concurso público,Aquisição de bens móveis,"33696500-0, Reagentes de laboratório","Centro Hospitalar Barreiro Montijo, E. P. E. (509186998)","BIOMERIEUX PORTUGAL, LDA (501524177)","54.044,50 €",09-08-2018,19-02-2018,365 dias,"Portugal, Setúbal, Barreiro","Artigo 20.º, n.º 1, alínea b) do Código dos Contratos Públicos","","","","",,Não aplicável.,Não aplicável.,FALSE
4S0025/2018 - Fornecimento de Serviços de Lavagem e Tratamento de Roupa para ao meses de Janeiro e Fevereiro de 2018,Ajuste Direto Regime Geral,Aquisição de serviços,"55100000-1, Serviços de hotelaria","CHBM - Centro Hospital Barreiro Montijo, EPE (509186998)",SUCH (500900469),"64.022,34 €",08-08-2018,08-01-2018,60 dias,"Portugal, Setúbal, Barreiro","Artigo 20.º, n.º 1, alínea a) do Código dos Contratos Públicos",28-02-2018,"66.339,11 €","Serviços a mais, na acepção do nº1 do artigo 454º do CCP ","Serviços a mais, na acepção do nº1 do artigo 454º do CCP ",,Não aplicável.,Não aplicável.,FALSE
4SUI0001/2018 - Fornecimento de Serviços de Segurança e Vigilância no CHBM,Ajuste Direto Regime Geral,Aquisição de serviços,"79710000-4, Serviços de segurança","Centro Hospitalar Barreiro Montijo, E. P. E. (509186998)","Prestibel - Empresa de Segurança, S.A. (501326456)","18.102,91 €",07-08-2018,24-04-2018,30 dias,"Portugal, Setúbal, Barreiro","Artigo 24.º, n.º 1, alínea c) do Código dos Contratos Públicos",31-05-2018,"63.586,96 €","","O prazo indicado pela SPMS para desenvolver o concurso anual tem vindo a ser consecutivamente prorrogado, nos termos da circular SO20963 de 29 de Setembro de 2017",,Não aplicável.,Não aplicável.,FALSE
4S0008/2018 - Fornecimento de Serviços de Segurança e Vigilância,Ajuste Direto Regime Geral,Aquisição de serviços,"79710000-4, Serviços de segurança","Centro Hospitalar Barreiro Montijo, E. P. E. (509186998)","Prestibel - Empresa de Segurança, S.A. (501326456)","44.443,16 €",07-08-2018,26-12-2017,60 dias,"Portugal, Setúbal, Barreiro","Artigo 20.º, n.º 1, alínea a) do Código dos Contratos Públicos",31-03-2018,"66.664,74 €","Aumento de quantidades - Serviços a mais, na aceção do nº1 do artº 454º do CCP.","Aumento de quantidades - Serviços a mais, na aceção do nº1 do artº 454º do CCP.",,Não aplicável.,Não aplicável.,FALSE
4SEX0029/2018-APOIO DE CABEÇA WHIMYER - ALEXANDRE DAVID VEIGA CASENAVE,Ajuste Direto Regime Geral,Aquisição de serviços,"85000000-9, Serviços de saúde e acção social","CHBM - Centro Hospital Barreiro Montijo, EPE (509186998)","ORTOPEDIA MODERNA, LDA (500481300)","612,55 €",02-08-2018,07-05-2018,365 dias,"Portugal, Setúbal, Barreiro","Artigo 24.º, n.º 1, alínea e) do Código dos Contratos Públicos",30-07-2018,"612,55 €","","",,Não aplicável.,Não aplicável.,FALSE
4S0041/2018-CADEIRA DE ALIMENTAÇÃO E CADEIRA DE TRANPORTE - MARIA VITÓRIA BALEIZÃO MARTINS,Ajuste Direto Regime Geral,Aquisição de serviços,"85000000-9, Serviços de saúde e acção social","Centro Hospitalar Barreiro Montijo, E. P. E. (509186998)","ORTOPAULOS - CENTRO DE ORTOPROTESIA, UNIP., LDA. (509305717)","4.303,56 €",02-08-2018,22-01-2018,365 dias,"Portugal, Setúbal, Barreiro","Artigo 22.º, n.º 2 do Código dos Contratos Públicos",06-03-2018,"4.303,56 €","","",,Não aplicável.,Não aplicável.,FALSE
8S0040/2018-CADEIRA RODAS - CÉLIO EVANDRO MANUEL SILVA,Ajuste Direto Regime Geral,Aquisição de serviços,"85000000-9, Serviços de saúde e acção social","Centro Hospitalar Barreiro Montijo, E. P. E. (509186998)","ORTOPAULOS - CENTRO DE ORTOPROTESIA, UNIP., LDA. (509305717)","7.854,91 €",02-08-2018,23-01-2018,364 dias,"Portugal, Setúbal, Barreiro","Artigo 22.º, n.º 2 do Código dos Contratos Públicos",21-02-2018,"7.854,91 €","","",,Não aplicável.,Não aplicável.,FALSE
4S0024/2018- PRÓTESE TRANSTIBIAL - JOSÉ MANUEL LOPES VICENTE,Ajuste Direto Regime Geral,Aquisição de serviços,"85000000-9, Serviços de saúde e acção social","Centro Hospitalar Barreiro Montijo, E. P. E. (509186998)","ORTOPEDIA MODERNA, LDA (500481300)","5.890,00 €",02-08-2018,20-01-2018,120 dias,"Portugal, Setúbal, Barreiro","Artigo 22.º, n.º 2 do Código dos Contratos Públicos",03-04-2018,"5.890,00 €","","",,Não aplicável.,Não aplicável.,FALSE
4SUI0006/2018 - Aquisição de Serviços de Alimentação para o mês de Junho de 2018,Ajuste Direto Regime Geral,Aquisição de serviços,"55100000-1, Serviços de hotelaria","Centro Hospitalar Barreiro Montijo, E. P. E. (509186998)","UNISELF - Sociedade de Restaurantes Públicos e Privados, SA (501323325)","72.717,18 €",01-08-2018,21-05-2018,30 dias,"Portugal, Setúbal, Barreiro","Artigo 24.º, n.º 1, alínea c) do Código dos Contratos Públicos",30-06-2018,"77.554,86 €","",Aumento da atividade assistencial,,Não aplicável.,Não aplicável.,FALSE
