freguesia,acronym,validVotesPercentage,votes,dicofre
União das freguesias de Junça e Naves,PPD/PSD.CDS-PP,37.5,33,090233
União das freguesias de Junça e Naves,PS,34.09,30,090233
União das freguesias de Junça e Naves,PCP-PEV,6.82,6,090233
União das freguesias de Junça e Naves,MPT,5.68,5,090233
União das freguesias de Junça e Naves,PTP,4.55,4,090233
União das freguesias de Junça e Naves,B.E.,2.27,2,090233
União das freguesias de Junça e Naves,PCTP/MRPP,2.27,2,090233
União das freguesias de Junça e Naves,PND,2.27,2,090233
União das freguesias de Junça e Naves,L,1.14,1,090233
União das freguesias de Junça e Naves,MAS,1.14,1,090233
União das freguesias de Junça e Naves,PAN,1.14,1,090233
União das freguesias de Junça e Naves,PDA,1.14,1,090233
União das freguesias de Junça e Naves,PNR,0,0,090233
União das freguesias de Junça e Naves,POUS,0,0,090233
União das freguesias de Junça e Naves,PPM,0,0,090233
União das freguesias de Junça e Naves,PPV,0,0,090233
