freguesia,acronym,validVotesPercentage,votes,dicofre
União das freguesias de Massamá e Monte Abraão,PS,36.49,5212,111125
União das freguesias de Massamá e Monte Abraão,PPD/PSD,15.3,2186,111125
União das freguesias de Massamá e Monte Abraão,B.E.,13.83,1976,111125
União das freguesias de Massamá e Monte Abraão,PCP-PEV,9.16,1309,111125
União das freguesias de Massamá e Monte Abraão,PAN,7.69,1098,111125
União das freguesias de Massamá e Monte Abraão,CDS-PP,4.94,705,111125
União das freguesias de Massamá e Monte Abraão,A,2.6,371,111125
União das freguesias de Massamá e Monte Abraão,L,2.6,371,111125
União das freguesias de Massamá e Monte Abraão,PPM.PPV/CDC,2.37,338,111125
União das freguesias de Massamá e Monte Abraão,NC,1.34,192,111125
União das freguesias de Massamá e Monte Abraão,PNR,0.9,129,111125
União das freguesias de Massamá e Monte Abraão,IL,0.81,116,111125
União das freguesias de Massamá e Monte Abraão,PCTP/MRPP,0.74,106,111125
União das freguesias de Massamá e Monte Abraão,PDR,0.4,57,111125
União das freguesias de Massamá e Monte Abraão,PURP,0.39,55,111125
União das freguesias de Massamá e Monte Abraão,MAS,0.26,37,111125
União das freguesias de Massamá e Monte Abraão,PTP,0.19,27,111125
