freguesia,acronym,validVotesPercentage,votes,dicofre
Luso,PS,40.85,261,011104
Luso,PPD/PSD,21.28,136,011104
Luso,B.E.,16.9,108,011104
Luso,PCP-PEV,5.16,33,011104
Luso,PAN,4.38,28,011104
Luso,CDS-PP,3.76,24,011104
Luso,A,2.03,13,011104
Luso,PPM.PPV/CDC,1.1,7,011104
Luso,L,0.94,6,011104
Luso,NC,0.94,6,011104
Luso,PCTP/MRPP,0.63,4,011104
Luso,PDR,0.63,4,011104
Luso,PURP,0.63,4,011104
Luso,PNR,0.31,2,011104
Luso,IL,0.16,1,011104
Luso,MAS,0.16,1,011104
Luso,PTP,0.16,1,011104
