freguesia,acronym,validVotesPercentage,votes,dicofre
São Brás,PPD/PSD,44.87,105,420514
São Brás,PS,34.19,80,420514
São Brás,B.E.,7.69,18,420514
São Brás,CDS-PP,4.27,10,420514
São Brás,PCP-PEV,2.99,7,420514
São Brás,L,1.28,3,420514
São Brás,PAN,1.28,3,420514
São Brás,PCTP/MRPP,1.28,3,420514
São Brás,A,0.43,1,420514
São Brás,CH,0.43,1,420514
São Brás,IL,0.43,1,420514
São Brás,MAS,0.43,1,420514
São Brás,PPM,0.43,1,420514
São Brás,MPT,0,0,420514
São Brás,PDR,0,0,420514
São Brás,PNR,0,0,420514
São Brás,PTP,0,0,420514
