freguesia,acronym,validVotesPercentage,votes,dicofre
União das freguesias de Paradinha e Nagosa,PS,38.24,39,180721
União das freguesias de Paradinha e Nagosa,PPD/PSD,33.33,34,180721
União das freguesias de Paradinha e Nagosa,PCP-PEV,5.88,6,180721
União das freguesias de Paradinha e Nagosa,PPM.PPV/CDC,5.88,6,180721
União das freguesias de Paradinha e Nagosa,CDS-PP,4.9,5,180721
União das freguesias de Paradinha e Nagosa,B.E.,2.94,3,180721
União das freguesias de Paradinha e Nagosa,A,1.96,2,180721
União das freguesias de Paradinha e Nagosa,L,1.96,2,180721
União das freguesias de Paradinha e Nagosa,PAN,1.96,2,180721
União das freguesias de Paradinha e Nagosa,PURP,1.96,2,180721
União das freguesias de Paradinha e Nagosa,PTP,0.98,1,180721
União das freguesias de Paradinha e Nagosa,IL,0,0,180721
União das freguesias de Paradinha e Nagosa,MAS,0,0,180721
União das freguesias de Paradinha e Nagosa,NC,0,0,180721
União das freguesias de Paradinha e Nagosa,PCTP/MRPP,0,0,180721
União das freguesias de Paradinha e Nagosa,PDR,0,0,180721
União das freguesias de Paradinha e Nagosa,PNR,0,0,180721
