freguesia,acronym,validVotesPercentage,votes,dicofre
São Roque do Pico,PPD/PSD,38.51,176,460305
São Roque do Pico,PS,35.89,164,460305
São Roque do Pico,B.E.,8.75,40,460305
São Roque do Pico,CDS-PP,5.47,25,460305
São Roque do Pico,PAN,2.84,13,460305
São Roque do Pico,PCP-PEV,1.75,8,460305
São Roque do Pico,CH,1.53,7,460305
São Roque do Pico,A,1.09,5,460305
São Roque do Pico,L,1.09,5,460305
São Roque do Pico,PCTP/MRPP,1.09,5,460305
São Roque do Pico,PNR,0.66,3,460305
São Roque do Pico,PPM,0.66,3,460305
São Roque do Pico,IL,0.22,1,460305
São Roque do Pico,MPT,0.22,1,460305
São Roque do Pico,PTP,0.22,1,460305
São Roque do Pico,MAS,0,0,460305
São Roque do Pico,PDR,0,0,460305
