Objeto do Contrato,Tipo de Procedimento,Tipo(s) de Contrato,CPVs,Entidade(s) Adjudicante(s),Entidade(s) Adjudicatária(s),Preço Contratual,Data de Publicação,Data de Celebração do Contrato,Prazo de Execução,Local de Execução,Fundamentação,Data de Fecho do Contrato,Preço Total Efetivo,Causas das Alterações ao Prazo,Causas das Alterações ao Preço,Estado,N.º registo do Acordo Quadro,Descrição do Acordo Quadro,Procedimento Centralizado
FORNEC.DIV.PROT.ORTOP.-PROTESE TOTAL ANCA CERÂMICA(AQ00034/16),Ajuste Direto Regime Geral,Aquisição de bens móveis,"33183200-8, Próteses ortopédicas","Centro Hospitalar Tondela-Viseu, E. P. E. (509822940)","STRYKER PORTUGAL PRODUTOS MÉDICOS, LDA. (504594214)","15.000,00 €",31-01-2019,15-11-2018,365 dias,"Portugal, Viseu, Viseu",Artigo 258.º do Código dos Contratos Públicos,,,,,,Não aplicável.,Não aplicável.,FALSE
FORN.DIV.PROT.ORTOPEDICAS-PROTESE ANCA NÃO CIMENTADA REVISÃO(AQ00034/16),Ajuste Direto Regime Geral,Aquisição de bens móveis,"33183200-8, Próteses ortopédicas","Centro Hospitalar Tondela-Viseu, E. P. E. (509822940)","LIMA IMPLANTES PORTUGAL s.u., LDA (508634784)","69.000,00 €",31-01-2019,03-09-2018,365 dias,"Portugal, Viseu, Viseu",Artigo 258.º do Código dos Contratos Públicos,,,,,,Não aplicável.,Não aplicável.,FALSE
DIVERSO MATERIAL CLINICO - PROTESE DO UMERO,Ajuste Direto Regime Geral,Aquisição de bens móveis,"33183200-8, Próteses ortopédicas","Centro Hospitalar Tondela-Viseu, E. P. E. (509822940)","LIMA IMPLANTES PORTUGAL s.u., LDA (508634784)","16.930,00 €",31-01-2019,29-06-2018,365 dias,"Portugal, Viseu, Viseu","Artigo 20.º, n.º 1, alínea d) do Código dos Contratos Públicos",,,,,,Não aplicável.,Não aplicável.,FALSE
DIVERSO MATERIAL CLINICO-PROTESE TOTAL UMERO INVERTIDO E ANATÓMICA (SNDC),Ajuste Direto Regime Geral,Aquisição de bens móveis,"33183200-8, Próteses ortopédicas","Centro Hospitalar Tondela-Viseu, E. P. E. (509822940)","LIMA IMPLANTES PORTUGAL s.u., LDA (508634784)","20.000,00 €",31-01-2019,15-11-2018,90 dias,"Portugal, Viseu, Viseu","Artigo 26.º, n.º 1, alínea a) do Código dos Contratos Públicos",,,,,,Não aplicável.,Não aplicável.,FALSE
VIDEOSCOPIO DESCARTAVEL P/LAPAROSCOPIA E CIRURGIA BILIAR TAMANHO LARGE,Ajuste Direto Regime Geral,Aquisição de bens móveis,"33141000-0, Material médico não químico descartável e produtos hematológicos","Centro Hospitalar Tondela-Viseu, E. P. E. (509822940)","IBERDATA EQUIPAMENTOS, SA (501904921)","14.000,00 €",30-01-2019,06-07-2018,365 dias,"Portugal, Viseu, Viseu","Artigo 24.º, n.º 1, alínea e), subalínea ii) do Código dos Contratos Públicos",,,,,,Não aplicável.,Não aplicável.,FALSE
DIVERSO MATERIAL CLINICO-CAVILHAS ANTROGADAS/RETROGADAS-UMERO (SNDC),Ajuste Direto Regime Geral,Aquisição de bens móveis,"33183200-8, Próteses ortopédicas","Centro Hospitalar Tondela-Viseu, E. P. E. (509822940)","STRYKER PORTUGAL PRODUTOS MÉDICOS, LDA. (504594214)","6.000,00 €",29-01-2019,19-11-2018,60 dias,"Portugal, Viseu, Viseu","Artigo 26.º, n.º 1, alínea a) do Código dos Contratos Públicos",,,,,,Não aplicável.,Não aplicável.,FALSE
DIVERSO MATERIAL CLINICO - GUIAS RETAS P/ ACTP,Ajuste Direto Regime Geral,Aquisição de bens móveis,"33140000-3, Material médico de consumo","Centro Hospitalar Tondela-Viseu, E. P. E. (509822940)","ABBOTT LABORATORIOS, LDA (500006148)","92.000,00 €",29-01-2019,01-10-2018,365 dias,"Portugal, Viseu, Viseu","Artigo 26.º, n.º 1, alínea a) do Código dos Contratos Públicos",,,,,,Não aplicável.,Não aplicável.,FALSE
"CATETER BALÃO, CATETER BALÃO E KIT SERINGA C/ MANOMETRO",Ajuste Direto Regime Geral,Aquisição de bens móveis,"33141210-5, Cateteres de balão","Centro Hospitalar Tondela-Viseu, E. P. E. (509822940)","MEDTRONIC PORTUGAL, LDA (504223933)","65.250,00 €",29-01-2019,09-08-2018,60 dias,"Portugal, Viseu, Viseu","Artigo 26.º, n.º 1, alínea a) do Código dos Contratos Públicos",,,,,,Não aplicável.,Não aplicável.,FALSE
ENTEROBACTERIACEAE PROD CARBAPENEMASES - PCR_AQ_3R-00647-17(8),Ajuste Direto Regime Geral,Aquisição de bens móveis,"33696500-0, Reagentes de laboratório","Centro Hospitalar Tondela-Viseu, E. P. E. (509822940)","WERFEN PORTUGAL, LDA. (EX. IZASA) (501086110)","8.000,00 €",29-01-2019,16-10-2018,90 dias,"Portugal, Viseu, Viseu",Artigo 258.º do Código dos Contratos Públicos,,,,,,Não aplicável.,Não aplicável.,FALSE
DIVERSO MATERIAL CLINICO-OSTEOSINTESE COLUNA (SNDC),Ajuste Direto Regime Geral,Aquisição de bens móveis,"33183200-8, Próteses ortopédicas","Centro Hospitalar Tondela-Viseu, E. P. E. (509822940)","JOHNSON & JOHNSON, LDA (500153370)","175.000,00 €",29-01-2019,01-10-2018,150 dias,"Portugal, Viseu, Viseu","Artigo 26.º, n.º 1, alínea a) do Código dos Contratos Públicos",,,,,,Não aplicável.,Não aplicável.,FALSE
DIVERSO MATERIAL CLINICO PARA SELAGEM E CORTE DE VASOS(AQ02427/16),Ajuste Direto Regime Geral,Aquisição de bens móveis,"33140000-3, Material médico de consumo","Centro Hospitalar Tondela-Viseu, E. P. E. (509822940)","MEDTRONIC PORTUGAL, LDA (504223933)","177.628,80 €",29-01-2019,14-11-2018,240 dias,"Portugal, Viseu, Viseu","Artigo 26.º, n.º 1, alínea e) do Código dos Contratos Públicos",,,,,,Não aplicável.,Não aplicável.,FALSE
INFUSOR PORTATIL DESCARTAVEL 2 DIAS 5ML/HORA VOLUME 250/275ML,Ajuste Direto Regime Geral,Aquisição de bens móveis,"33140000-3, Material médico de consumo","Centro Hospitalar Tondela-Viseu, E. P. E. (509822940)","MEDICINÁLIA CORMEDICA, LDA (500684324)","9.877,00 €",28-01-2019,17-01-2019,120 dias,"Portugal, Viseu, Viseu","Artigo 26.º, n.º 1, alínea a) do Código dos Contratos Públicos",,,,,,Não aplicável.,Não aplicável.,FALSE
TUBO FLEXIVEL DESCARTAVEL PARA 2 FRASCOS P/ BOMBA HYSTER,Ajuste Direto Regime Geral,Aquisição de bens móveis,"33141000-0, Material médico não químico descartável e produtos hematológicos","Centro Hospitalar Tondela-Viseu, E. P. E. (509822940)","LUSO PALEX UNIPESSOAL , LDA (503531588)","8.620,00 €",28-01-2019,28-12-2018,365 dias,"Portugal, Viseu, Viseu","Artigo 24.º, n.º 1, alínea e), subalínea ii) do Código dos Contratos Públicos",,,,,,Não aplicável.,Não aplicável.,FALSE
"REDE DUPLA FACE POLIPROP./HIDROGEL C/BALÃO EXPANSOR P/VIA LAPAROSC.20,3X25,4CM",Ajuste Direto Regime Geral,Aquisição de bens móveis,"33169000-2, Material cirúrgico","Centro Hospitalar Tondela-Viseu, E. P. E. (509822940)","C.R. BARD PORTUGAL, LDA. (502438274)","5.950,00 €",25-01-2019,14-01-2019,180 dias,"Portugal, Viseu, Viseu","Artigo 26.º, n.º 1, alínea a) do Código dos Contratos Públicos",,,,,,Não aplicável.,Não aplicável.,FALSE
MEIOS P/ REALIZ. DE ANAL. CLÍNICAS DE COAGULAÇÃO-4ºANO_  (AQ_3R/03268/2015),Ajuste Direto Regime Geral,Aquisição de bens móveis,"33696500-0, Reagentes de laboratório","Centro Hospitalar Tondela-Viseu, E. P. E. (509822940)","Werfen Portugal, Lda (501086110)","147.259,11 €",24-01-2019,03-01-2019,365 dias,"Portugal, Viseu, Viseu","Artigo 26.º, n.º 1, alínea e) do Código dos Contratos Públicos",,,,,,Não aplicável.,Não aplicável.,FALSE
CARGA PARA PINÇA APLICAÇÃO CLIPS LAPAROSCOPICO ENDOCLIP 10MM MEDIO,Ajuste Direto Regime Geral,Aquisição de bens móveis,"33141120-7, Clipes, suturas, ligaduras","Centro Hospitalar Tondela-Viseu, E. P. E. (509822940)","B.BRAUN MEDICAL, LDA (501506543)","6.990,48 €",23-01-2019,09-11-2018,365 dias,"Portugal, Viseu, Viseu","Artigo 24.º, n.º 1, alínea e), subalínea ii) do Código dos Contratos Públicos",,,,,,Não aplicável.,Não aplicável.,FALSE
"CATETER ARTERIAL RADIAL """"PUR"""" METODO SELDINGER ANTI PICADA 20GX8CM",Ajuste Direto Regime Geral,Aquisição de bens móveis,"33141200-2, Cateteres","Centro Hospitalar Tondela-Viseu, E. P. E. (509822940)","B.BRAUN MEDICAL, LDA (501506543)","6.400,00 €",23-01-2019,25-10-2018,180 dias,"Portugal, Viseu, Viseu","Artigo 26.º, n.º 1, alínea a) do Código dos Contratos Públicos",,,,,,Não aplicável.,Não aplicável.,FALSE
FORN.DIV.PROTESES ORTOPEDICAS-PROTESE TOTAL ANCA BI ARTICULADA(AQ00034/16),Ajuste Direto Regime Geral,Aquisição de bens móveis,"33183200-8, Próteses ortopédicas","Centro Hospitalar Tondela-Viseu, E. P. E. (509822940)","ARTUR SALGADO, LDA (503612600)","35.000,00 €",23-01-2019,21-11-2018,365 dias,"Portugal, Viseu, Viseu",Artigo 258.º do Código dos Contratos Públicos,,,,,,Não aplicável.,Não aplicável.,FALSE
DIVERSO MATERIAL CLINICO-LENTES OFTALMOLÓGICAS(AQ02257/17),Ajuste Direto Regime Geral,Aquisição de bens móveis,"33183200-8, Próteses ortopédicas","Centro Hospitalar Tondela-Viseu, E. P. E. (509822940)",ALCON PORTUGAL-PROD.EQUIP.OFTL (501251685),"60.000,00 €",23-01-2019,30-11-2018,365 dias,"Portugal, Viseu, Viseu",Artigo 258.º do Código dos Contratos Públicos,,,,,,Não aplicável.,Não aplicável.,FALSE
DIVERSO MATERIAL APLICADO OSTEOSSINTESE (ANO 2017),Ajuste Direto Regime Geral,Aquisição de bens móveis,"33183200-8, Próteses ortopédicas","Centro Hospitalar Tondela-Viseu, E. P. E. (509822940)","STRYKER PORTUGAL PRODUTOS MÉDICOS, LDA. (504594214)","52.098,27 €",23-01-2019,30-11-2018,365 dias,"Portugal, Viseu, Viseu","Artigo 26.º, n.º 1, alínea a) do Código dos Contratos Públicos",,,,,,Não aplicável.,Não aplicável.,FALSE
"LIMHA CONTRASTE PREMIUM ALTA PRESSÃO 54""""",Ajuste Direto Regime Geral,Aquisição de bens móveis,"33182000-9, Material de assistência à função cardíaca","Centro Hospitalar Tondela-Viseu, E. P. E. (509822940)",MED X-RAYz (506187071),"12.054,50 €",22-01-2019,23-10-2018,365 dias,"Portugal, Viseu, Viseu","Artigo 24.º, n.º 1, alínea e), subalínea ii) do Código dos Contratos Públicos",,,,,,Não aplicável.,Não aplicável.,FALSE
MEIOS P/ REALIZ. DE ANÁLISES CLÍNICAS DE IMUNOENSAIOS POR QUIMIOLUMINESCÊNCIA,Ajuste Direto Regime Geral,Aquisição de bens móveis<br/>Sociedade,"33183200-8, Próteses ortopédicas","Centro Hospitalar Tondela-Viseu, E. P. E. (509822940)","MEDTRONIC PORTUGAL, LDA (504223933)","220.000,00 €",22-01-2019,03-10-2017,365 dias,"Portugal, Viseu, Viseu","Artigo 24.º, n.º 1, alínea e) do Código dos Contratos Públicos",,,,,,Não aplicável.,Não aplicável.,FALSE
FIO GUIA ANGIOPLASTIA COM MEDIÇÃO PRESSÃO FLUXO,Ajuste Direto Regime Geral,Aquisição de bens móveis,"33182000-9, Material de assistência à função cardíaca","Centro Hospitalar Tondela-Viseu, E. P. E. (509822940)",Abbott Medical Portugal (504180746),"10.125,00 €",22-01-2019,23-10-2018,270 dias,"Portugal, Viseu, Viseu","Artigo 26.º, n.º 1, alínea a) do Código dos Contratos Públicos",,,,,,Não aplicável.,Não aplicável.,FALSE
MEIOS P/ REALIZAÇÃO DO TESTE DE DESPISTE DA TUBERCULOSE LATENTE POR IGRA,Ajuste Direto Regime Geral,Aquisição de bens móveis,"33696500-0, Reagentes de laboratório","Centro Hospitalar Tondela-Viseu, E. P. E. (509822940)","QUILABAN-QUÍMICA LABORATORIAL ANALÍTICA, S.A. (500399670)","18.840,00 €",22-01-2019,20-12-2018,180 dias,"Portugal, Viseu, Viseu","Artigo 26.º, n.º 1, alínea a) do Código dos Contratos Públicos",,,,,,Não aplicável.,Não aplicável.,FALSE
PAINEL QUIMICA GERAL PLUS - PICCOLO - TONDELA (AQ 3R/02106/16 - 3º),Ajuste Direto Regime Geral,Aquisição de bens móveis,"33696500-0, Reagentes de laboratório","Centro Hospitalar Tondela-Viseu, E. P. E. (509822940)","WERFEN PORTUGAL, LDA. (EX. IZASA) (501086110)","102.060,00 €",21-01-2019,11-10-2018,365 dias,"Portugal, Viseu, Viseu","Artigo 26.º, n.º 1, alínea e) do Código dos Contratos Públicos",,,,,,Não aplicável.,Não aplicável.,FALSE
