freguesia,acronym,validVotesPercentage,votes,dicofre
Abambres,PPD/PSD,58.54,96,040701
Abambres,PS,14.63,24,040701
Abambres,B.E.,7.93,13,040701
Abambres,CDS-PP,7.93,13,040701
Abambres,CH,1.83,3,040701
Abambres,PCP-PEV,1.83,3,040701
Abambres,A,1.22,2,040701
Abambres,PAN,1.22,2,040701
Abambres,PCTP/MRPP,1.22,2,040701
Abambres,PURP,1.22,2,040701
Abambres,L,0.61,1,040701
Abambres,NC,0.61,1,040701
Abambres,PNR,0.61,1,040701
Abambres,PTP,0.61,1,040701
Abambres,IL,0,0,040701
Abambres,PDR,0,0,040701
Abambres,PPM,0,0,040701
Abambres,R.I.R.,0,0,040701
