Objeto do Contrato,Tipo de Procedimento,Tipo(s) de Contrato,CPVs,Entidade(s) Adjudicante(s),Entidade(s) Adjudicatária(s),Preço Contratual,Data de Publicação,Data de Celebração do Contrato,Prazo de Execução,Local de Execução,Fundamentação,Data de Fecho do Contrato,Preço Total Efetivo,Causas das Alterações ao Prazo,Causas das Alterações ao Preço,Estado,N.º registo do Acordo Quadro,Descrição do Acordo Quadro,Procedimento Centralizado
040103322016-ARGATROBANO 100 MG/ML SOL INJ,Ajuste Direto Regime Geral,Aquisição de bens móveis,"33698000-9, Produtos para fins clínicos","Centro Hospitalar e Universitário de Coimbra, E. P. E. (510103448)",WEP CLINICAL (WE PHARMA) (GB944893866),"12.850,00 €",21-06-2018,24-02-2016,365 dias,"Portugal, Coimbra, Coimbra","Artigo 24.º, n.º 1, alínea e) do Código dos Contratos Públicos",31-12-2016,"12.850,00 €",,,,Não aplicável.,Não aplicável.,FALSE
procedimento n.º 040100032017 - Elosulfase alfa 1 mg/ml Sol inj Fr 5 ml IV,Ajuste Direto Regime Geral,Aquisição de bens móveis,"33600000-6, Produtos farmacêuticos","Centro Hospitalar e Universitário de Coimbra, E. P. E. (510103448)",LOGIFARMA-LOGÍSTICA FARMACÊUTICA S.A. (503934640),"396.831,00 €",21-06-2018,19-12-2016,365 dias,"Portugal, Coimbra, Coimbra","Artigo 24.º, n.º 1, alínea e) do Código dos Contratos Públicos",29-12-2017,"396.831,00 €",,,,Não aplicável.,Não aplicável.,FALSE
procedimento n.º 040101262017 - Elosulfase alfa 1 mg/ml Sol inj Fr 5 ml IV,Ajuste Direto Regime Geral,Aquisição de bens móveis,"33600000-6, Produtos farmacêuticos","Centro Hospitalar e Universitário de Coimbra, E. P. E. (510103448)",LOGIFARMA-LOGÍSTICA FARMACÊUTICA S.A. (503934640),"101.153,00 €",21-06-2018,12-01-2017,365 dias,"Portugal, Coimbra, Coimbra","Artigo 24.º, n.º 1, alínea e) do Código dos Contratos Públicos",29-12-2017,"101.153,00 €",,,,Não aplicável.,Não aplicável.,FALSE
OUTRO MATERIAL DE CONSUMO CLINICO,Ajuste Direto Regime Geral,Aquisição de bens móveis,"33000000-0, Equipamento médico, medicamentos e produtos para cuidados pessoais","Centro Hospitalar e Universitário de Coimbra, E. P. E. (510103448)",Boston Scientific Portugal (504988964),"9.500,00 €",21-06-2018,18-06-2018,180 dias,"Portugal, Coimbra, Coimbra","Artigo 24.º, n.º 1, alínea e), subalínea ii) do Código dos Contratos Públicos","","",,,,Não aplicável.,Não aplicável.,FALSE
procedimento n.º 040100022017  - Azacitidina 100 mg Pó susp inj Fr SC,Ajuste Direto Regime Geral,Aquisição de bens móveis,"33600000-6, Produtos farmacêuticos","Centro Hospitalar e Universitário de Coimbra, E. P. E. (510103448)",CELGENE - SOCIEDADE UNIPESSOAL LDA (507791690),"843.936,00 €",21-06-2018,22-12-2016,365 dias,"Portugal, Coimbra, Coimbra","Artigo 24.º, n.º 1, alínea e) do Código dos Contratos Públicos",29-12-2017,"843.936,00 €",,,,Não aplicável.,Não aplicável.,FALSE
OUTRO MATERIAL DE CONSUMO CLÍNICO,Ajuste Direto Regime Geral,Aquisição de bens móveis,"33000000-0, Equipamento médico, medicamentos e produtos para cuidados pessoais","Centro Hospitalar e Universitário de Coimbra, E. P. E. (510103448)","DRAGER PORTUGAL, LDA (508771323)","8.364,00 €",21-06-2018,15-06-2018,180 dias,"Portugal, Coimbra, Coimbra","Artigo 24.º, n.º 1, alínea e), subalínea ii) do Código dos Contratos Públicos","","",,,,Não aplicável.,Não aplicável.,FALSE
procedimento n.º 050103622017 - CP 2015/6 - Acordo quadro para o fornecimento de Medicamentos do Foro Oncológico - ref.ª  P259-AC-2017-10,Ao abrigo de acordo-quadro (art.º 259.º),Aquisição de bens móveis,"33600000-6, Produtos farmacêuticos","Centro Hospitalar e Universitário de Coimbra, E. P. E. (510103448)","ROCHE FARMACEUTICA QUIMICA, LDA (500233810)","2.628.420,41 €",21-06-2018,02-03-2017,365 dias,"Portugal, Coimbra, Coimbra",Artigo 259.º do Código dos Contratos Públicos,29-12-2017,"2.628.420,41 €",,,,1771819,CP 2015/6 - Acordo quadro para o fornecimento de Medicamentos do Foro Oncológico,FALSE
040102972016-MEDICAMENTOS URGENTES-ACTELION,Ajuste Direto Regime Geral,Aquisição de bens móveis,"33698000-9, Produtos para fins clínicos","Centro Hospitalar e Universitário de Coimbra, E. P. E. (510103448)","ACTELION PHARMACEUTICALS PORTUGAL, LDA. (507336488)","84.251,60 €",21-06-2018,02-05-2016,365 dias,"Portugal, Coimbra, Coimbra","Artigo 24.º, n.º 1, alínea e) do Código dos Contratos Públicos",31-12-2016,"84.251,60 €",,,,Não aplicável.,Não aplicável.,FALSE
040102992016-MEXILETINA 200 MG CAPS,Ajuste Direto Regime Geral,Aquisição de bens móveis,"33698000-9, Produtos para fins clínicos","Centro Hospitalar e Universitário de Coimbra, E. P. E. (510103448)","IDIS THE WORLD MEDICINES, LMTD (700513982)","2.810,70 €",21-06-2018,10-02-2016,365 dias,"Portugal, Coimbra, Coimbra","Artigo 24.º, n.º 1, alínea e) do Código dos Contratos Públicos",31-12-2016,"2.810,70 €",,,,Não aplicável.,Não aplicável.,FALSE
Empreitada de remodelação dos sistemas de tratamento de ar em futuro Internamento de Hematologia dos HUC - CHUC,Ajuste Direto Regime Geral,Empreitadas de obras públicas,"45000000-7, Construção","Centro Hospitalar e Universitário de Coimbra, E. P. E. (510103448)","Pinto & Cruz, Lda. (500217904)","63.800,23 €",21-06-2018,02-11-2015,30 dias,"Portugal, Coimbra, Coimbra","Artigo 25.º, n.º 1, alínea a) do Código dos Contratos Públicos","","",,,,Não aplicável.,Não aplicável.,FALSE
Espátula; Folhas duplas; Máscaras ; Empapador.,Ajuste Direto Regime Geral,Aquisição de bens móveis,"33000000-0, Equipamento médico, medicamentos e produtos para cuidados pessoais","Centro Hospitalar e Universitário de Coimbra, E. P. E. (510103448)","Factor Plus, SA (502810645)","38.558,35 €",20-06-2018,09-02-2018,180 dias,"Portugal, Coimbra, Coimbra","Artigo 24.º, n.º 1, alínea e) do Código dos Contratos Públicos","","",,,,Não aplicável.,Não aplicável.,FALSE
"050104372017 Aquisição de Medicamentos desencadeada pela SPMS, no âmbito de Despacho 1571/B de 2016, ao abrigo do Acordo Quadro 2015/6 e acordo Quadro 2016/40 - P259-AC-2017-16",Ao abrigo de acordo-quadro (art.º 259.º),Aquisição de bens móveis,"33698000-9, Produtos para fins clínicos","Centro Hospitalar e Universitário de Coimbra, E. P. E. (510103448)",ABBVIE (510229050),"1.637.088,02 €",20-06-2018,21-02-2017,365 dias,"Portugal, Coimbra, Coimbra",Artigo 259.º do Código dos Contratos Públicos,31-12-2017,"1.637.088,02 €",,,,2762166,"Aquisição de Medicamentos desencadeada pela SPMS, no âmbito de Despacho 1571/B de 2016, ao abrigo do Acordo Quadro 2015/6 e acordo Quadro 2016/40 - P259-AC-2017-16",FALSE
"0501052820187 Aquisição de Medicamentos desencadeada pela SPMS, no âmbito de Despacho 1571/B de 2016, ao abrigo do Acordo Quadro 2015/6 e Acordo Quadro 2016/40, Ref.ª P259-AC-2017-45",Ao abrigo de acordo-quadro (art.º 259.º),Aquisição de bens móveis,"33698000-9, Produtos para fins clínicos","Centro Hospitalar e Universitário de Coimbra, E. P. E. (510103448)","Janssen Cilag Farmacêutica, Lda (500189412)","4.010.985,94 €",20-06-2018,04-05-2017,365 dias,"Portugal, Coimbra, Coimbra",Artigo 259.º do Código dos Contratos Públicos,31-12-2017,"4.010.985,94 €",,,,2763728,"Aquisição de Medicamentos desencadeada pela SPMS, no âmbito de Despacho 1571/B de 2016, ao abrigo do Acordo Quadro 2015/6 e Acordo Quadro 2016/40, Ref.ª P259-AC-2017-45",FALSE
040102662016-IMUNOGLOBULINA HUMANA NORMAL 100MG/ML SOL INJ FR 50ML IV,Ajuste Direto Regime Geral,Aquisição de bens móveis,"33698000-9, Produtos para fins clínicos","Centro Hospitalar e Universitário de Coimbra, E. P. E. (510103448)","CSL BEHRING, LDA (503047201)","9.840,00 €",20-06-2018,29-01-2016,365 dias,"Portugal, Coimbra, Coimbra","Artigo 24.º, n.º 1, alínea e) do Código dos Contratos Públicos",31-12-2016,"9.840,00 €",,,,Não aplicável.,Não aplicável.,FALSE
Ansas; Terminal Mucosectomia; Pinças de Biópsia; Válvulas para Fibroscópio,Ajuste Direto Regime Geral,Aquisição de bens móveis,"33000000-0, Equipamento médico, medicamentos e produtos para cuidados pessoais","Centro Hospitalar e Universitário de Coimbra, E. P. E. (510103448)",OLYMPUS IBÉRIA (980474710),"29.817,86 €",20-06-2018,26-02-2018,180 dias,"Portugal, Coimbra, Coimbra","Artigo 24.º, n.º 1, alínea e) do Código dos Contratos Públicos","","",,,,Não aplicável.,Não aplicável.,FALSE
040102812016-DIMERCAPROL 100 MG/ML SOL INJ,Ajuste Direto Regime Geral,Aquisição de bens móveis,"33698000-9, Produtos para fins clínicos","Centro Hospitalar e Universitário de Coimbra, E. P. E. (510103448)","DUXPHARMA UNIPESSOAL, LDA (510803679)","3.150,00 €",20-06-2018,12-02-2016,365 dias,"Portugal, Coimbra, Coimbra","Artigo 24.º, n.º 1, alínea e) do Código dos Contratos Públicos",31-12-2016,"3.150,00 €",,,,Não aplicável.,Não aplicável.,FALSE
040102832016-DIGOXINA COMP/AMP,Ajuste Direto Regime Geral,Aquisição de bens móveis,"33698000-9, Produtos para fins clínicos","Centro Hospitalar e Universitário de Coimbra, E. P. E. (510103448)","BDRPHARMA, LDA (513077332)","3.322,48 €",20-06-2018,17-05-2016,365 dias,"Portugal, Coimbra, Coimbra","Artigo 24.º, n.º 1, alínea e) do Código dos Contratos Públicos",31-12-2016,"3.322,48 €",,,,Não aplicável.,Não aplicável.,FALSE
040102932016-MATRIZ BIOLOGICA LIOFILIZADA DE COLAGENIO COM ELASTINA,Ajuste Direto Regime Geral,Aquisição de bens móveis,"33698000-9, Produtos para fins clínicos","Centro Hospitalar e Universitário de Coimbra, E. P. E. (510103448)","MBA PORTUGAL, S.A. (504445960)","16.014,00 €",20-06-2018,01-03-2016,365 dias,"Portugal, Coimbra, Coimbra","Artigo 20.º, n.º 1, alínea a) do Código dos Contratos Públicos",31-12-2016,"16.014,00 €",,,,Não aplicável.,Não aplicável.,FALSE
"050104952017 Aquisição de Medicamentos desencadeada pela SPMS, no âmbito de Despacho 1571/B de 2016, ao abrigo do Acordo Quadro 2015/6 e Acordo Quadro 2016/40, Ref.ª P259-AC-2017-49",Ao abrigo de acordo-quadro (art.º 259.º),Aquisição de bens móveis,"33600000-6, Produtos farmacêuticos","Centro Hospitalar e Universitário de Coimbra, E. P. E. (510103448)","MERCK SHARP & DOHME, LDA (500191360)","2.018.618,20 €",19-06-2018,13-04-2017,365 dias,"Portugal, Coimbra, Coimbra",Artigo 259.º do Código dos Contratos Públicos,31-12-2017,"2.018.618,20 €",,,,2764010,"Aquisição de Medicamentos desencadeada pela SPMS, no âmbito de Despacho 1571/B de 2016, ao abrigo do Acordo Quadro 2015/6 e Acordo Quadro 2016/40, Ref.ª P259-AC-2017-49",FALSE
"050103512017 Aquisição de Medicamentos desencadeada pela SPMS, no âmbito do Despacho 1571/B de 2016, ao abrigo do Acordo Quadro 2016/40, Ref.ª P259-AC-2017-15. ",Ao abrigo de acordo-quadro (art.º 259.º),Aquisição de bens móveis,"33600000-6, Produtos farmacêuticos","Centro Hospitalar e Universitário de Coimbra, E. P. E. (510103448)","GILEAD SCIENCES, LDA (503604704)","3.521.871,54 €",19-06-2018,20-02-2017,365 dias,"Portugal, Coimbra, Coimbra",Artigo 259.º do Código dos Contratos Públicos,31-12-2017,"3.521.871,54 €",,,,2726261,"Aquisição de Medicamentos desencadeada pela SPMS, no âmbito do Despacho 1571/B de 2016, ao abrigo do Acordo Quadro 2016/40, Ref.ª P259-AC-2017-15.",FALSE
Diverso Material para Gastroenterologia,Ajuste Direto Regime Geral,Aquisição de bens móveis,"33000000-0, Equipamento médico, medicamentos e produtos para cuidados pessoais","Centro Hospitalar e Universitário de Coimbra, E. P. E. (510103448)","Alves & Cª (Irmãos),Lda (500310068)","37.578,50 €",19-06-2018,26-03-2018,180 dias,"Portugal, Coimbra, Coimbra","Artigo 24.º, n.º 1, alínea e) do Código dos Contratos Públicos","","",,,,Não aplicável.,Não aplicável.,FALSE
040205632018 - Material de Consumo Clinico,Ajuste Direto Regime Geral,Aquisição de bens móveis,"33000000-0, Equipamento médico, medicamentos e produtos para cuidados pessoais","Centro Hospitalar e Universitário de Coimbra, E. P. E. (510103448)","EZEQUIEL PANAO JORGE, LDA (501412727)","5.518,00 €",19-06-2018,21-02-2018,180 dias,"Portugal, Coimbra, Coimbra","Artigo 24.º, n.º 1, alínea e) do Código dos Contratos Públicos","","",,,,Não aplicável.,Não aplicável.,FALSE
"- Fios Guia; Cavilhas, Laminas, Tampas  PFN e Pernos de Bloqueio",Ajuste Direto Regime Geral,Aquisição de bens móveis,"33000000-0, Equipamento médico, medicamentos e produtos para cuidados pessoais","Centro Hospitalar e Universitário de Coimbra, E. P. E. (510103448)",Johnson & Johnson; Lda (500153370),"75.000,00 €",19-06-2018,23-01-2018,180 dias,"Portugal, Coimbra, Coimbra","Artigo 24.º, n.º 1, alínea e) do Código dos Contratos Públicos","","",,,,Não aplicável.,Não aplicável.,FALSE
050104972017 Aquisição de Medicam entos E517-EMTRICITABINA+RILPIVIRINA+ TENOFOVIR(200MG+25MG+245;CAPS/COMP. REFªAD-AC-2017-50,Ajuste Direto Regime Geral,Aquisição de bens móveis,"33690000-3, Medicamentos vários","Centro Hospitalar e Universitário de Coimbra, E. P. E. (510103448)",GILEAD (503604704),"973.500,02 €",19-06-2018,21-03-2017,365 dias,"Portugal, Coimbra, Coimbra","Artigo 24.º, n.º 1, alínea e) do Código dos Contratos Públicos",31-12-2017,"973.500,02 €",,,,Não aplicável.,Não aplicável.,FALSE
040206442018 - Material de Consumo Clinico,Ajuste Direto Regime Geral,Aquisição de bens móveis,"33000000-0, Equipamento médico, medicamentos e produtos para cuidados pessoais","Centro Hospitalar e Universitário de Coimbra, E. P. E. (510103448)","ZIMMER BIOMET PORT UNIP,LDA (EX-BIOMET POR UNIP LD (500254990)","6.965,00 €",19-06-2018,28-02-2018,20 dias,"Portugal, Coimbra, Coimbra","Artigo 24.º, n.º 1, alínea e) do Código dos Contratos Públicos","","",,,,Não aplicável.,Não aplicável.,FALSE
"Cal Sodada Para Ventilador; Mascaras Nasais; Campânulas; Circuitos Ventilador; Tubos de Ligação a Oxigénio ; Conexões; Filtros, Linhas de Amostragem; Barretes; Depósito de Cal sodada; Peça traqueostomia",Ajuste Direto Regime Geral,Aquisição de bens móveis,"33000000-0, Equipamento médico, medicamentos e produtos para cuidados pessoais","Centro Hospitalar e Universitário de Coimbra, E. P. E. (510103448)","INTERSURGICAL PORTUGAL - Comércio de Produtos Hospitalares, Lda (503480045)","12.260,30 €",19-06-2018,18-01-2018,180 dias,"Portugal, Coimbra, Coimbra","Artigo 24.º, n.º 1, alínea e) do Código dos Contratos Públicos","","",,,,Não aplicável.,Não aplicável.,FALSE
procedimento n.º 050102732017 - medicamentos do foro oncológico -P259 -AC-2016-246,Ao abrigo de acordo-quadro (art.º 259.º),Aquisição de bens móveis,"33600000-6, Produtos farmacêuticos","Centro Hospitalar e Universitário de Coimbra, E. P. E. (510103448)","NOVARTIS FARMA-PRODUT.FARMACEUTICOS, SA (500063524)","2.032.097,22 €",19-06-2018,07-03-2017,365 dias,"Portugal, Coimbra, Coimbra",Artigo 259.º do Código dos Contratos Públicos,29-12-2017,"2.014.950,03 €",,,,1771819,CP 2015/6 - Acordo quadro para o fornecimento de Medicamentos do Foro Oncológico,FALSE
"Aquisição de equipamento de impressão para diversos serviços do CHUC, E.P.E",Ajuste Direto Regime Geral,Aquisição de bens móveis,"30000000-9, Máquinas, equipamento e material de escritório e de informática, excepto mobiliário e pacotes de programas (software)","Centro Hospitalar e Universitário de Coimbra, E. P. E. (510103448)",MEGASOFT (501748156),"7.200,00 €",19-06-2018,07-06-2018,0 dias,"Portugal, Coimbra, Coimbra","Artigo 20.º, n.º 1, alínea d) do Código dos Contratos Públicos","","",,,,Não aplicável.,Não aplicável.,FALSE
Aquisição de 15 computadores completos para o serviço de neurologia A (373),Consulta Prévia,Aquisição de bens móveis,"30000000-9, Máquinas, equipamento e material de escritório e de informática, excepto mobiliário e pacotes de programas (software)","Centro Hospitalar e Universitário de Coimbra, E. P. E. (510103448)",BASE 2 (501333401),"7.650,00 €",19-06-2018,21-03-2018,5 dias,"Portugal, Coimbra, Coimbra","Artigo 20.º, n.º 1, alínea c) do Código dos Contratos Públicos","","",,,,Não aplicável.,Não aplicável.,FALSE
Aquisição de diverso equipamento médico cirúrgico para o Bloco operatório do Hospital  Geral do CHUC (2500108),Ajuste Direto Regime Geral,Aquisição de bens móveis,"33000000-0, Equipamento médico, medicamentos e produtos para cuidados pessoais","Centro Hospitalar e Universitário de Coimbra, E. P. E. (510103448)",olympus (980474710),"22.742,70 €",19-06-2018,12-04-2018,19 dias,"Portugal, Coimbra, Coimbra","Artigo 24.º, n.º 1, alínea e), subalínea ii) do Código dos Contratos Públicos",12-04-2018,"22.742,70 €",,,,Não aplicável.,Não aplicável.,FALSE
procedimento n.º 050100482017 - fornecimento de bens e prestação de serviço de diálise peritonela,Ao abrigo de acordo-quadro (art.º 258.º),Aquisição de bens móveis,"33600000-6, Produtos farmacêuticos","Centro Hospitalar e Universitário de Coimbra, E. P. E. (510103448)","BAXTER MEDICO - FARMACEUTICA, LDA (503347345), FRESENIUS MEDICAL CARE PORTUGAL, S.A. (503070220)","1.049.608,84 €",19-06-2018,09-02-2017,365 dias,"Portugal, Coimbra, Coimbra",Artigo 258.º do Código dos Contratos Públicos,29-12-2017,"1.049.608,84 €",,,,1481309,CP 2015/35 - Acordo quadro para fornecimento de bens e prestação de serviços de Diálise Peritoneal às Instituições e Serviços do Serviço Nacional de Saúde,FALSE
Aquisição de Um KIT de treino para laparoscopia,Ajuste Direto Regime Geral,Aquisição de bens móveis,"33000000-0, Equipamento médico, medicamentos e produtos para cuidados pessoais","Centro Hospitalar e Universitário de Coimbra, E. P. E. (510103448)",teprel (502262184),"2.256,00 €",19-06-2018,17-04-2018,30 dias,"Portugal, Coimbra, Coimbra","Artigo 24.º, n.º 1, alínea e), subalínea ii) do Código dos Contratos Públicos","","",,,,Não aplicável.,Não aplicável.,FALSE
"50102062017 Aquisição de Medicamentos desencadeada pela SPMS, no âmbito do Despacho 1571/B de 2016, ao abrigo do Acordo Quadro 2015/6 e Acordo Quadro 2016/40, Ref.ª P259-AC-2016-244 ",Ao abrigo de acordo-quadro (art.º 259.º),Aquisição de bens móveis,"33698000-9, Produtos para fins clínicos","Centro Hospitalar e Universitário de Coimbra, E. P. E. (510103448)","ABBVIE, LDA (510229050)","701.743,78 €",19-06-2018,25-01-2017,365 dias,"Portugal, Coimbra, Coimbra",Artigo 259.º do Código dos Contratos Públicos,31-12-2017,"701.743,78 €",,,,2769791,"Aquisição de Medicamentos desencadeada pela SPMS, no âmbito do Despacho 1571/B de 2016, ao abrigo do Acordo Quadro 2015/6 e Acordo Quadro 2016/40, Ref.ª P259-AC-2016-244 ",FALSE
Aquisição de impressoras de etiquetas e leitores de código de barras para o STSI,Consulta Prévia,Aquisição de bens móveis,"30000000-9, Máquinas, equipamento e material de escritório e de informática, excepto mobiliário e pacotes de programas (software)","Centro Hospitalar e Universitário de Coimbra, E. P. E. (510103448)",BURÓTICA (501178503),"3.264,00 €",19-06-2018,22-05-2018,30 dias,"Portugal, Coimbra, Coimbra","Artigo 20.º, n.º 1, alínea c) do Código dos Contratos Públicos","","",,,,Não aplicável.,Não aplicável.,FALSE
"50101932017 Aquisição de Medicamentos desencadeada pela SPMS, no âmbito do Despacho 1571/B de 2016, ao abrigo do Acordo Quadro 2015/6, Acordo Quadro 2015/7, Acordo Quadro 2014/18 e Acordo Quadro 2015/49, Ref.ª P259-AC-2016-229 ",Ao abrigo de acordo-quadro (art.º 259.º),Aquisição de bens móveis,"33690000-3, Medicamentos vários","Centro Hospitalar e Universitário de Coimbra, E. P. E. (510103448)","NOVARTIS FARMA-PRODUT.FARMACEUTICOS, SA (500063524)","2.047.401,31 €",19-06-2018,31-01-2017,365 dias,"Portugal, Coimbra, Coimbra",Artigo 259.º do Código dos Contratos Públicos,31-12-2017,"2.046.533,31 €",,,,2769597,"Aquisição de Medicamentos desencadeada pela SPMS, no âmbito do Despacho 1571/B de 2016, ao abrigo do Acordo Quadro 2015/6, Acordo Quadro 2015/7, Acordo Quadro 2014/18 e Acordo Quadro 2015/49, Ref.ª P259-AC-2016-229 ",FALSE
Indicadores Biológicos para Autoclave; Indicadores Químicos para Vapor; Manga Mista coe e sem Fole; Papel TNT,Ajuste Direto Regime Geral,Aquisição de bens móveis,"33000000-0, Equipamento médico, medicamentos e produtos para cuidados pessoais","Centro Hospitalar e Universitário de Coimbra, E. P. E. (510103448)",3M Espanha S.L. (Sucursal em Portugal) (980560241),"64.065,00 €",19-06-2018,01-02-2018,180 dias,"Portugal, Coimbra, Coimbra","Artigo 24.º, n.º 1, alínea e) do Código dos Contratos Públicos","","",,,,Não aplicável.,Não aplicável.,FALSE
040102642016-MATERIAL DE ACONDICIONAMENTO,Ajuste Direto Regime Geral,Aquisição de bens móveis,"33698000-9, Produtos para fins clínicos","Centro Hospitalar e Universitário de Coimbra, E. P. E. (510103448)","FRESENIUS (504293753), B.BRAUN (501506543), IBERVOXER (506716899), NORMAX (500203130)","11.999,47 €",18-06-2018,02-11-2016,365 dias,"Portugal, Coimbra, Coimbra","Artigo 20.º, n.º 1, alínea a) do Código dos Contratos Públicos",31-12-2016,"11.999,47 €",,,,Não aplicável.,Não aplicável.,FALSE
Aquisição de um undrive SIII e um morcelador electromecânico BO da MBB,Ajuste Direto Regime Geral,Aquisição de bens móveis,"33000000-0, Equipamento médico, medicamentos e produtos para cuidados pessoais","Centro Hospitalar e Universitário de Coimbra, E. P. E. (510103448)",TEPREL (502262184),"12.555,00 €",18-06-2018,26-04-2018,19 dias,"Portugal, Coimbra, Coimbra","Artigo 24.º, n.º 1, alínea e), subalínea ii) do Código dos Contratos Públicos","","",,,,Não aplicável.,Não aplicável.,FALSE
040102652016-IMUNOGLOBULINA HUMANA NORMAL 100 MG/ML SOL INJ FR 200 ML IV,Ajuste Direto Regime Geral,Aquisição de bens móveis,"33698000-9, Produtos para fins clínicos","Centro Hospitalar e Universitário de Coimbra, E. P. E. (510103448)","CSL BEHRING, LDA (503047201)","60.257,00 €",18-06-2018,22-02-2016,365 dias,"Portugal, Coimbra, Coimbra","Artigo 20.º, n.º 1, alínea a) do Código dos Contratos Públicos",31-12-2016,"60.257,00 €",,,,Não aplicável.,Não aplicável.,FALSE
Aquisição de de um conjunto de laparoscopia para o serviço de BO do Hospital Geral (2500108),Ajuste Direto Regime Geral,Aquisição de bens móveis,"33000000-0, Equipamento médico, medicamentos e produtos para cuidados pessoais","Centro Hospitalar e Universitário de Coimbra, E. P. E. (510103448)",olympus (98047410),"49.929,06 €",18-06-2018,01-06-2018,19 dias,"Portugal, Coimbra, Coimbra","Artigo 20.º, n.º 1, alínea a) do Código dos Contratos Públicos","","",,,,Não aplicável.,Não aplicável.,FALSE
040102602016-ANASTRAZOL 1MG COMP,Ajuste Direto Regime Geral,Aquisição de bens móveis,"33698000-9, Produtos para fins clínicos","Centro Hospitalar e Universitário de Coimbra, E. P. E. (510103448)","ASTRAZENECA PRODUTOS FARMACÊUTICOS, LDA (502942240)","573,43 €",18-06-2018,21-01-2016,365 dias,"Portugal, Coimbra, Coimbra","Artigo 24.º, n.º 1, alínea e) do Código dos Contratos Públicos",31-12-2016,"573,43 €",,,,Não aplicável.,Não aplicável.,FALSE
Aquisição de 2 equipamentos hanou endomat para o serviço de Ginecologia A+BO da MBB,Ajuste Direto Regime Geral,Aquisição de bens móveis,"33000000-0, Equipamento médico, medicamentos e produtos para cuidados pessoais","Centro Hospitalar e Universitário de Coimbra, E. P. E. (510103448)",TEPREL (502262184),"14.373,50 €",18-06-2018,02-05-2018,19 dias,"Portugal, Coimbra, Coimbra","Artigo 24.º, n.º 1, alínea e), subalínea ii) do Código dos Contratos Públicos","","",,,,Não aplicável.,Não aplicável.,FALSE
procedimento n.º 040140192017 - PEMBROLIZUMAB 50 MG PÓ CONC SOL INJ FR IV,Ajuste Direto Regime Geral,Aquisição de bens móveis,"33698000-9, Produtos para fins clínicos","Centro Hospitalar e Universitário de Coimbra, E. P. E. (510103448)","MERCK SHARP & DOHME, LDA (500191360)","346.500,00 €",18-06-2018,20-08-2017,365 dias,"Portugal, Coimbra, Coimbra","Artigo 24.º, n.º 1, alínea e) do Código dos Contratos Públicos",29-12-2017,"346.500,00 €",,,,Não aplicável.,Não aplicável.,FALSE
040102592016-DANAZOL 200MG CAPS,Ajuste Direto Regime Geral,Aquisição de bens móveis,"33698000-9, Produtos para fins clínicos","Centro Hospitalar e Universitário de Coimbra, E. P. E. (510103448)","DUXPHARMA UNIPESSOAL, LDA (510803679)","1.753,75 €",18-06-2018,28-01-2016,365 dias,"Portugal, Coimbra, Coimbra","Artigo 24.º, n.º 1, alínea e) do Código dos Contratos Públicos",31-12-2016,"1.753,75 €",,,,Não aplicável.,Não aplicável.,FALSE
Fornecimento de equipamentos diversos para a sala de altas do serviço de urgência do CHUC,Ajuste Direto Regime Geral,Aquisição de bens móveis,"39000000-2, Mobiliário (incl. de escritório), acessórios, aparelhos domésticos (excl. iluminação) e produtos de limpeza","Centro Hospitalar e Universitário de Coimbra, E. P. E. (510103448)",hospitecnica (505454238),"9.715,00 €",18-06-2018,15-06-2018,45 dias,"Portugal, Coimbra, Coimbra","Artigo 20.º, n.º 1, alínea a) do Código dos Contratos Públicos","","",,,,Não aplicável.,Não aplicável.,FALSE
"040102502016-FENILEFRINA 50 MG/0,5 ML COL SOL",Ajuste Direto Regime Geral,Aquisição de bens móveis,"33698000-9, Produtos para fins clínicos","Centro Hospitalar e Universitário de Coimbra, E. P. E. (510103448)","BAUSCH & LOMB, SA (980218764)","546,00 €",18-06-2018,28-01-2016,365 dias,"Portugal, Coimbra, Coimbra","Artigo 24.º, n.º 1, alínea e) do Código dos Contratos Públicos",31-12-2016,"546,00 €",,,,Não aplicável.,Não aplicável.,FALSE
040205712018 - Material de Consumo Clinico,Ajuste Direto Regime Geral,Aquisição de bens móveis,"33000000-0, Equipamento médico, medicamentos e produtos para cuidados pessoais","Centro Hospitalar e Universitário de Coimbra, E. P. E. (510103448)","MOONSURGE - IMPORT.  EXP. MATERIAL MEDICO,LDA (506657035)","6.300,80 €",18-06-2018,28-02-2018,360 dias,"Portugal, Coimbra, Coimbra","Artigo 24.º, n.º 1, alínea e) do Código dos Contratos Públicos","","",,,,Não aplicável.,Não aplicável.,FALSE
"040106722016-OMBITASVIR 12,5MG+PARITAPREVIR 75MG+RITONAVIR",Ajuste Direto Regime Geral,Aquisição de bens móveis,"33698000-9, Produtos para fins clínicos","Centro Hospitalar e Universitário de Coimbra, E. P. E. (510103448)","ABBVIE, LDA (510229050)","28.060,00 €",18-06-2018,11-03-2016,365 dias,"Portugal, Coimbra, Coimbra","Artigo 24.º, n.º 1, alínea e) do Código dos Contratos Públicos",31-12-2016,"28.060,00 €",,,,Não aplicável.,Não aplicável.,FALSE
040106732016-DACLATASVIR 60 MG COMP,Ajuste Direto Regime Geral,Aquisição de bens móveis,"33698000-9, Produtos para fins clínicos","Centro Hospitalar e Universitário de Coimbra, E. P. E. (510103448)","BRISTOL MYERS SQUIBB FARM.PORTUGUESA, SA (500048193)","25.601,97 €",18-06-2018,11-03-2016,365 dias,"Portugal, Coimbra, Coimbra","Artigo 24.º, n.º 1, alínea e) do Código dos Contratos Públicos",31-12-2016,"25.601,97 €",,,,Não aplicável.,Não aplicável.,FALSE
040106742016-DACLATASVIR 60 MG COMP,Ajuste Direto Regime Geral,Aquisição de bens móveis,"33698000-9, Produtos para fins clínicos","Centro Hospitalar e Universitário de Coimbra, E. P. E. (510103448)","BRISTOL MYERS SQUIBB FARM.PORTUGUESA, SA (500048193)","51.203,95 €",18-06-2018,11-03-2016,365 dias,"Portugal, Coimbra, Coimbra","Artigo 24.º, n.º 1, alínea e) do Código dos Contratos Públicos",31-12-2016,"51.203,95 €",,,,Não aplicável.,Não aplicável.,FALSE
040106752016-COLAGENIO (IMPLANTE)-APOSITO,Ajuste Direto Regime Geral,Aquisição de bens móveis,"33698000-9, Produtos para fins clínicos","Centro Hospitalar e Universitário de Coimbra, E. P. E. (510103448)","SOCIME II (504453939), OVERPHARMA (505792362)","14.346,58 €",18-06-2018,12-05-2016,365 dias,"Portugal, Coimbra, Coimbra","Artigo 20.º, n.º 1, alínea a) do Código dos Contratos Públicos",31-12-2016,"14.346,58 €",,,,Não aplicável.,Não aplicável.,FALSE
"050109012017Aquisição de Medicamentos desencadeada pela SPMS, no âmbito do Despacho 1571/B de 2016, ao abrigo do Acordo Quadro 2015/6 P259-AC-2017-117",Ao abrigo de acordo-quadro (art.º 259.º),Aquisição de bens móveis,"33690000-3, Medicamentos vários","Centro Hospitalar e Universitário de Coimbra, E. P. E. (510103448)","ACCORD HEALTHCARE UNIPESSOAL LDA (COMBINO PHARM) (508622263), MEDAC GESELLSCHAFT FUR KLINISCHE SPEZIALPRAPARATE (980369959), TEVA (507045491), FRESENIUS KABI PHARMA PORTUGAL, LDA (504293753), AUROVITAS UNIPESSOAL, LDA (513053239)","36.582,30 €",18-06-2018,17-08-2017,365 dias,"Portugal, Coimbra, Coimbra",Artigo 259.º do Código dos Contratos Públicos,31-12-2017,"36.582,30 €",,,,2770614,"Aquisição de Medicamentos desencadeada pela SPMS, no âmbito do Despacho 1571/B de 2016, ao abrigo do Acordo Quadro 2015/6 e Acordo Quadro 2015/7, Ref.ª P259-AC-2017-66 ",FALSE
50109032017 CP 2015/6 - Acordo quadro para o fornecimento de Medicamentos do Foro Oncológico P259-AC-2017-120,Ao abrigo de acordo-quadro (art.º 259.º),Aquisição de bens móveis,"33600000-6, Produtos farmacêuticos","Centro Hospitalar e Universitário de Coimbra, E. P. E. (510103448)","BAYER PORTUGAL, LDA (500043256), JANSSEN CILAG FARMACEUTICA, LDA (500189412), BRISTOL MYERS SQUIBB FARM.PORTUGUESA, SA (500048193)","443.364,78 €",18-06-2018,24-08-2017,365 dias,"Portugal, Coimbra, Coimbra",Artigo 259.º do Código dos Contratos Públicos,31-12-2017,"443.364,78 €",,,,1771819,CP 2015/6 - Acordo quadro para o fornecimento de Medicamentos do Foro Oncológico,FALSE
040106622016-PEMBROLIZUMAB 50 MG PO CONC SOL INJ FR IV,Ajuste Direto Regime Geral,Aquisição de bens móveis,"33698000-9, Produtos para fins clínicos","Centro Hospitalar e Universitário de Coimbra, E. P. E. (510103448)","MERCK SHARP E DOHME, LDA (500191360)","84.288,00 €",15-06-2018,29-03-2016,365 dias,"Portugal, Coimbra, Coimbra","Artigo 24.º, n.º 1, alínea e) do Código dos Contratos Públicos",31-12-2016,"84.288,00 €",,,,Não aplicável.,Não aplicável.,FALSE
040106242016-PEGASPARGASE 3750 UI SOL INJ,Ajuste Direto Regime Geral,Aquisição de bens móveis,"33698000-9, Produtos para fins clínicos","Centro Hospitalar e Universitário de Coimbra, E. P. E. (510103448)",ALLOGA PORTUGAL - ARMAZ. E DISTRIB. FARMAC. (504507230),"62.400,00 €",15-06-2018,25-02-2016,365 dias,"Portugal, Coimbra, Coimbra","Artigo 24.º, n.º 1, alínea e) do Código dos Contratos Públicos",31-12-2016,"62.400,00 €",,,,Não aplicável.,Não aplicável.,FALSE
040106192016-ALBUMINA HUMANA 200 G/L SOL INJ FR 50 ML IV,Ajuste Direto Regime Geral,Aquisição de bens móveis,"33698000-9, Produtos para fins clínicos","Centro Hospitalar e Universitário de Coimbra, E. P. E. (510103448)","CSL BEHRING, LDA (503047201)","25.650,00 €",15-06-2018,14-03-2016,365 dias,"Portugal, Coimbra, Coimbra","Artigo 20.º, n.º 1, alínea a) do Código dos Contratos Públicos",31-12-2016,"25.650,00 €",,,,Não aplicável.,Não aplicável.,FALSE
050109022017 CP 2015/6 - Acordo quadro para o fornecimento de Medicamentos do Foro Oncológico P259-AC-2017-119,Ao abrigo de acordo-quadro (art.º 259.º),Aquisição de bens móveis,"33600000-6, Produtos farmacêuticos","Centro Hospitalar e Universitário de Coimbra, E. P. E. (510103448)","ROCHE FARMACEUTICA QUIMICA, LDA (500233810)","232.000,70 €",15-06-2018,17-08-2017,365 dias,"Portugal, Coimbra, Coimbra",Artigo 259.º do Código dos Contratos Públicos,31-12-2017,"232.000,70 €",,,,1771819,CP 2015/6 - Acordo quadro para o fornecimento de Medicamentos do Foro Oncológico,FALSE
040206272018 - Material de Consumo Clinico,Ajuste Direto Regime Geral,Aquisição de bens móveis,"33000000-0, Equipamento médico, medicamentos e produtos para cuidados pessoais","Centro Hospitalar e Universitário de Coimbra, E. P. E. (510103448)","CAREWILL, LDA (507484851)","8.925,00 €",15-06-2018,28-02-2018,360 dias,"Portugal, Coimbra, Coimbra","Artigo 24.º, n.º 1, alínea e) do Código dos Contratos Públicos","","",,,,Não aplicável.,Não aplicável.,FALSE
procedimento n.º 040150392017-  aquisição de Cabazitaxel 60 mg/1.5 ml Conc e solv sol inj Fr 1.5 ml IV - AD-AC-2017-98 - SPMS,Ajuste Direto Regime Geral,Aquisição de bens móveis,"33000000-0, Equipamento médico, medicamentos e produtos para cuidados pessoais","Centro Hospitalar e Universitário de Coimbra, E. P. E. (510103448)","SANOFI - PRODUTOS FARMACEUTICOS , LDA (500134960)","39.710,00 €",15-06-2018,03-11-2017,365 dias,"Portugal, Coimbra, Coimbra","Artigo 24.º, n.º 1, alínea e) do Código dos Contratos Públicos",29-12-2017,"39.710,00 €",,,,Não aplicável.,Não aplicável.,FALSE
procedimento n.º 040149912017 - COMPRAS CENTRALIZADAS SPMS - PROFARIN - AD-AC-2017-102,Ao abrigo de acordo-quadro (art.º 259.º),Aquisição de bens móveis,"33000000-0, Equipamento médico, medicamentos e produtos para cuidados pessoais","Centro Hospitalar e Universitário de Coimbra, E. P. E. (510103448)","PROFARIN, LDA (500223238)","14.401,24 €",15-06-2018,10-11-2017,365 dias,"Portugal, Coimbra, Coimbra",Artigo 259.º do Código dos Contratos Públicos,29-12-2017,"14.401,24 €",,,,2948560,"Aquisição de Medicamentos (Despacho 1571-B/2017), Ref.ª AD-AC-2017-102.",FALSE
040205662018 - Material de Consumo Clinico,Ajuste Direto Regime Geral,Aquisição de bens móveis,"33000000-0, Equipamento médico, medicamentos e produtos para cuidados pessoais","Centro Hospitalar e Universitário de Coimbra, E. P. E. (510103448)","TELEFLEX MEDICAL, SAU (EX-ARROW IBÉRICA,  SA) (980249783)","9.374,40 €",15-06-2018,28-02-2018,180 dias,"Portugal, Coimbra, Coimbra","Artigo 24.º, n.º 1, alínea e) do Código dos Contratos Públicos","","",,,,Não aplicável.,Não aplicável.,FALSE
procedimento n.º 040139952017 - COMPRAS CENTRALIZADAS SPMS - ACTELION - AD-AC-2017-114,Ajuste Direto Regime Geral,Aquisição de bens móveis,"33000000-0, Equipamento médico, medicamentos e produtos para cuidados pessoais","Centro Hospitalar e Universitário de Coimbra, E. P. E. (510103448)","ACTELION PHARMACEUTICALS PORTUGAL, LDA. (507336488)","60.786,00 €",15-06-2018,30-11-2017,365 dias,"Portugal, Coimbra, Coimbra","Artigo 24.º, n.º 1, alínea e) do Código dos Contratos Públicos",29-12-2017,"60.786,00 €",,,,Não aplicável.,Não aplicável.,FALSE
procedimento n.º 050109882017 - COMPRAS CENTRALIZADAS SPMS - SP CARE - P259-AC-2017-126,Ao abrigo de acordo-quadro (art.º 259.º),Aquisição de bens móveis,"33000000-0, Equipamento médico, medicamentos e produtos para cuidados pessoais","Centro Hospitalar e Universitário de Coimbra, E. P. E. (510103448)",SOUTH POINT CARE (508284872),"5.496,00 €",15-06-2018,04-12-2017,365 dias,"Portugal, Coimbra, Coimbra",Artigo 259.º do Código dos Contratos Públicos,29-12-2017,"5.496,00 €",,,,1423488,ACORDO QUADRO PARA FORNECIMENTO DE DERIVADOS DO PLASMA HUMANO ÀS INSTITUIÇÕES E SERVIÇOS DO SERVIÇO NACIONAL DE SAÚDE CP 2015/9,FALSE
procedimento n.º 050109782017- compras centralizadas ref.ª P259-AC-2017-121,Ao abrigo de acordo-quadro (art.º 259.º),Aquisição de bens móveis,"33000000-0, Equipamento médico, medicamentos e produtos para cuidados pessoais","Centro Hospitalar e Universitário de Coimbra, E. P. E. (510103448)","ACCORD (508622263), Medac Sucursal em Portugal (980369959)","43.703,60 €",14-06-2018,14-11-2017,365 dias,"Portugal, Coimbra, Coimbra",Artigo 259.º do Código dos Contratos Públicos,29-12-2017,"43.703,60 €",,,,1771819,CP 2015/6 - Acordo quadro para o fornecimento de Medicamentos do Foro Oncológico,FALSE
procedimento n.º 050109382017 - COMPRAS CENTRALIZADAS SPMS - P259-AC-2017-130,Ao abrigo de acordo-quadro (art.º 259.º),Aquisição de bens móveis,"33000000-0, Equipamento médico, medicamentos e produtos para cuidados pessoais","Centro Hospitalar e Universitário de Coimbra, E. P. E. (510103448)","BAXTER MEDICO - FARMACEUTICA, LDA (503347345), Takeda - Farmacêuticos Portugal, Lda. (502801204), GRIFOLS PORTUGAL-PRODUTOS FARMACÊUTICOS E HOSPITALARES (502041285), Octapharma - Produtos Farmacêuticos, Lda. (502820780), CSL BEHRING, LDA (503047201)","718.405,07 €",14-06-2018,10-10-2017,365 dias,"Portugal, Coimbra, Coimbra",Artigo 259.º do Código dos Contratos Públicos,29-12-2017,"718.405,07 €",,,,1423488,ACORDO QUADRO PARA FORNECIMENTO DE DERIVADOS DO PLASMA HUMANO ÀS INSTITUIÇÕES E SERVIÇOS DO SERVIÇO NACIONAL DE SAÚDE CP 2015/9,FALSE
procedimento n.º 050109172018 - COMPRAS CENTRALIZADAS SPMS - P259-AC-2017-128,Ao abrigo de acordo-quadro (art.º 259.º),Aquisição de bens móveis,"33000000-0, Equipamento médico, medicamentos e produtos para cuidados pessoais","Centro Hospitalar e Universitário de Coimbra, E. P. E. (510103448)","Pfizer Biofarmaceutica, Sociedade Unipessoal Lda. (513300376)","4.256,04 €",14-06-2018,13-09-2017,365 dias,"Portugal, Coimbra, Coimbra",Artigo 259.º do Código dos Contratos Públicos,29-12-2017,"4.256,04 €",,,,2183729,Medicamentos antirretrovíricos para o tratamento da infeção por VIH,FALSE
Renovação do EDS-EBSCO discovery service-S.Documentação,Ajuste Direto Regime Geral,Aquisição de serviços,"79000000-4, Serviços a empresas: direito, comercialização, consultoria, recrutamento, impressão e segurança","Centro Hospitalar e Universitário de Coimbra, E. P. E. (510103448)",EBSCO (B-857657766),"6.600,00 €",14-06-2018,14-06-2018,365 dias,"Portugal, Coimbra, Coimbra","Artigo 24.º, n.º 1, alínea e), subalínea ii) do Código dos Contratos Públicos","","",,,,Não aplicável.,Não aplicável.,FALSE
procedimento n.º 050108822017 - COMPRAS CENTRALIZADAS SPMS-GILEAD-P259-AC-2017-113,Ao abrigo de acordo-quadro (art.º 259.º),Aquisição de bens móveis,"33000000-0, Equipamento médico, medicamentos e produtos para cuidados pessoais","Centro Hospitalar e Universitário de Coimbra, E. P. E. (510103448)","Gilead Sciences, Lda. (503604704)","1.591.777,44 €",13-06-2018,08-08-2017,365 dias,"Portugal, Coimbra, Coimbra",Artigo 259.º do Código dos Contratos Públicos,29-12-2017,"1.591.777,44 €",,,,2183729,Medicamentos antirretrovíricos para o tratamento da infeção por VIH,FALSE
050108452017 CP 2016/55 - Medicamentos Diversos P259-AC2017-95,Ao abrigo de acordo-quadro (art.º 259.º),Aquisição de bens móveis,"33698000-9, Produtos para fins clínicos","Centro Hospitalar e Universitário de Coimbra, E. P. E. (510103448)","CSL BEHRING, LDA (503047201)","8.032,00 €",13-06-2018,03-07-2017,365 dias,"Portugal, Coimbra, Coimbra",Artigo 259.º do Código dos Contratos Públicos,31-12-2017,"8.032,00 €",,,,2124520,CP 2016/55 - Medicamentos Diversos,FALSE
040106182016-MEDICAMENTOS DIVERSOS II,Ajuste Direto Regime Geral,Aquisição de bens móveis,"33698000-9, Produtos para fins clínicos","Centro Hospitalar e Universitário de Coimbra, E. P. E. (510103448)","SANOFI (500134960), SERVIR (502177420), AUROBINDO (508527465), SANDOZ (506985261)","8.870,16 €",13-06-2018,24-05-2016,365 dias,"Portugal, Coimbra, Coimbra","Artigo 20.º, n.º 1, alínea a) do Código dos Contratos Públicos",31-12-2016,"8.870,16 €",,,,Não aplicável.,Não aplicável.,FALSE
procedimento n.º 050108382017 - COMPRAS CENTRALIZADAS SPMS MATERIAL DE PENSO COM EFEITO TERAPÊUTICO P259/2017-02,Ao abrigo de acordo-quadro (art.º 259.º),Aquisição de bens móveis,"33000000-0, Equipamento médico, medicamentos e produtos para cuidados pessoais","Centro Hospitalar e Universitário de Coimbra, E. P. E. (510103448)","LABORATÓRIOS URGO, SLU (B83608604), MEDTRONIC PORTUGAL LDA (504223933), KVTECH PORTUGAL - PROD. MEDICOS UNIP., LDA (508671531), CLINIFAR - PROD. CLINICOS E FARMACEUTICOS, S.A. (503281115)","44.789,76 €",13-06-2018,06-07-2017,365 dias,"Portugal, Coimbra, Coimbra",Artigo 259.º do Código dos Contratos Públicos,29-12-2017,"44.789,76 €",,,,2967011,"157004 - Aquisição de material de penso c/ efeito terapêutico constante do AQ2014/10, ao abrigo do 259º",FALSE
050108812017 CP 2016/55 - Medicamentos Diversos P259-AC-2017-95,Ao abrigo de acordo-quadro (art.º 259.º),Aquisição de bens móveis,"33698000-9, Produtos para fins clínicos","Centro Hospitalar e Universitário de Coimbra, E. P. E. (510103448)",GRIFOLS PORTUGAL-PRODUTOS FARMACÊUTICOS E HOSPITALARES (502041285),"684.172,80 €",13-06-2018,25-07-2017,365 dias,"Portugal, Coimbra, Coimbra",Artigo 259.º do Código dos Contratos Públicos,31-12-2017,"684.172,80 €",,,,2124520,CP 2016/55 - Medicamentos Diversos,FALSE
Fraldas Para Adulto L e XL,Ajuste Direto Regime Geral,Aquisição de bens móveis,"33000000-0, Equipamento médico, medicamentos e produtos para cuidados pessoais","Centro Hospitalar e Universitário de Coimbra, E. P. E. (510103448)","Indas Portugal, Lda (503505196)","29.900,00 €",13-06-2018,25-01-2018,180 dias,"Portugal, Coimbra, Coimbra","Artigo 24.º, n.º 1, alínea e) do Código dos Contratos Públicos","","",,,,Não aplicável.,Não aplicável.,FALSE
050107772017 CP 2015/6 - Acordo quadro para o fornecimento de Medicamentos do Foro Oncológico P259-AC-2017-104-SPMS,Ao abrigo de acordo-quadro (art.º 259.º),Aquisição de bens móveis,"33698000-9, Produtos para fins clínicos","Centro Hospitalar e Universitário de Coimbra, E. P. E. (510103448)",LILLY FARMA (500165602),"67.726,12 €",13-06-2018,21-07-2017,365 dias,"Portugal, Coimbra, Coimbra",Artigo 259.º do Código dos Contratos Públicos,31-12-2017,"67.726,12 €",,,,1771819,CP 2015/6 - Acordo quadro para o fornecimento de Medicamentos do Foro Oncológico,FALSE
- Ventosas Descartáveis; Espéculos Vaginais Descartáveis;Cintos Abdominais ; Preservativos Esterilizados e Reservatórios Oxigénio para Ressuscitador Manual,Ajuste Direto Regime Geral,Aquisição de bens móveis,"33000000-0, Equipamento médico, medicamentos e produtos para cuidados pessoais","Centro Hospitalar e Universitário de Coimbra, E. P. E. (510103448)","Speculum - Artigos Médicos, S. A. (502996323)","36.662,48 €",13-06-2018,19-01-2018,180 dias,"Portugal, Coimbra, Coimbra","Artigo 24.º, n.º 1, alínea e) do Código dos Contratos Públicos","","",,,,Não aplicável.,Não aplicável.,FALSE
040206612018 - Material de Consumo Clinico,Ajuste Direto Regime Geral,Aquisição de bens móveis,"33000000-0, Equipamento médico, medicamentos e produtos para cuidados pessoais","Centro Hospitalar e Universitário de Coimbra, E. P. E. (510103448)","FACTOR PLUS, SA (502810645)","9.968,00 €",13-06-2018,28-02-2018,360 dias,"Portugal, Coimbra, Coimbra","Artigo 24.º, n.º 1, alínea e) do Código dos Contratos Públicos","","",,,,Não aplicável.,Não aplicável.,FALSE
05010789/2017 CP 2015/6 - Acordo quadro para o fornecimento de Medicamentos do Foro Oncológico P250-AC-2017-93,Ao abrigo de acordo-quadro (art.º 259.º),Aquisição de bens móveis,"33698000-9, Produtos para fins clínicos","Centro Hospitalar e Universitário de Coimbra, E. P. E. (510103448)","ASTRAZENECA PRODUTOS FARMACEUTICOS, LDA. (502942240)","261.043,00 €",13-06-2018,20-07-2017,365 dias,"Portugal, Coimbra, Coimbra",Artigo 259.º do Código dos Contratos Públicos,31-12-2017,"261.043,00 €",,,,1771819,CP 2015/6 - Acordo quadro para o fornecimento de Medicamentos do Foro Oncológico,FALSE
Holter implantavel,Ajuste Direto Regime Geral,Aquisição de bens móveis,"33182200-1, Aparelhos para estimulação cardíaca","Centro Hospitalar e Universitário de Coimbra, E. P. E. (510103448)",ABBOTT MEDICAL PORTUGAL (504180746),"7.362,00 €",12-06-2018,05-04-2018,360 dias,"Portugal, Coimbra, Coimbra","Artigo 24.º, n.º 1, alínea e) do Código dos Contratos Públicos","","",,,,Não aplicável.,Não aplicável.,FALSE
procedimento n.º 050108222017 - COMPRAS CENTRALIZADAS SPMS-P259-AC-2017-32,Ao abrigo de acordo-quadro (art.º 259.º),Aquisição de bens móveis,"33000000-0, Equipamento médico, medicamentos e produtos para cuidados pessoais","Centro Hospitalar e Universitário de Coimbra, E. P. E. (510103448)","Hikma Farmacêutica ( Portugal) S.a (502266791), FARMOZ - SOCIEDADE TÉCNICO MEDICINAL S.A. (501505334), Laboratórios Pfizer, Lda. (500162166), Medac Sucursal em Portugal (980369959), SANDOZ FARMACEUTICA, LDA (506985261)","126.789,44 €",12-06-2018,22-06-2017,365 dias,"Portugal, Coimbra, Coimbra",Artigo 259.º do Código dos Contratos Públicos,29-12-2017,"126.789,44 €",,,,2819753,"Aquisição de Medicamentos desencadeada pela SPMS, no âmbito do Despacho 1571/B de 2016, ao Abrigo do Acordo quadro 2015/6 e 2016/40, Ref.ª P259-AC-2017-32",FALSE
05010815/2017COMPRAS CENTRALIZADAS -SPMS REF. AD-AC-2017-42,Ajuste Direto Regime Geral,Aquisição de bens móveis,"33698000-9, Produtos para fins clínicos","Centro Hospitalar e Universitário de Coimbra, E. P. E. (510103448)","SANOFI - PRODUTOS FARMACEUTICOS , LDA (500134960)","165.117,90 €",12-06-2018,22-06-2017,365 dias,"Portugal, Coimbra, Coimbra","Artigo 24.º, n.º 1, alínea e) do Código dos Contratos Públicos",31-12-2017,"165.117,90 €",,,,Não aplicável.,Não aplicável.,FALSE
040105912016-INFLIXIMAB 100MG PO CONC SOL INJ FR IV,Ajuste Direto Regime Geral,Aquisição de bens móveis,"33700000-7, Produtos para cuidados pessoais","Centro Hospitalar e Universitário de Coimbra, E. P. E. (510103448)","MERCK SHARP & DOHME, LDA. (500191360)","70.000,00 €",12-06-2018,04-03-2016,365 dias,"Portugal, Coimbra, Coimbra","Artigo 24.º, n.º 1, alínea e) do Código dos Contratos Públicos",31-12-2016,"70.000,00 €",,,,Não aplicável.,Não aplicável.,FALSE
"050108142017 Aquisição de Medicamentos desencadeada pela SPMS, no âmbito do Despacho 1571/B de 2016, ao Abrigo do Acordo quadro 2015/6 e 2014/18, Ref.ª P259-AC-2017-86",Ao abrigo de acordo-quadro (art.º 259.º),Aquisição de bens móveis,"33698000-9, Produtos para fins clínicos","Centro Hospitalar e Universitário de Coimbra, E. P. E. (510103448)","SANOFI - PRODUTOS FARMACEUTICOS , LDA (500134960)","1.389.792,55 €",12-06-2018,12-07-2017,365 dias,"Portugal, Coimbra, Coimbra",Artigo 259.º do Código dos Contratos Públicos,31-12-2017,"1.389.792,55 €",,,,2819651,"Aquisição de Medicamentos desencadeada pela SPMS, no âmbito do Despacho 1571/B de 2016, ao Abrigo do Acordo quadro 2015/6 e 2014/18, Ref.ª P259-AC-2017-86",FALSE
040105932016-MATERIAS PRIMAS,Ajuste Direto Regime Geral,Aquisição de bens móveis,"33698000-9, Produtos para fins clínicos","Centro Hospitalar e Universitário de Coimbra, E. P. E. (510103448)","FAGRON IBERICA, S.A.U. (ES-A08199499)","2.221,74 €",12-06-2018,18-02-2016,365 dias,"Portugal, Coimbra, Coimbra","Artigo 20.º, n.º 1, alínea a) do Código dos Contratos Públicos",31-12-2016,"2.221,74 €",,,,Não aplicável.,Não aplicável.,FALSE
040105952016-ALBUMINA HUMANA 200G/L SOL INJ FR 50 ML IV,Ajuste Direto Regime Geral,Aquisição de bens móveis,"33698000-9, Produtos para fins clínicos","Centro Hospitalar e Universitário de Coimbra, E. P. E. (510103448)",CSL BEHRING (503047201),"27.750,00 €",12-06-2018,22-02-2016,365 dias,"Portugal, Coimbra, Coimbra","Artigo 20.º, n.º 1, alínea a) do Código dos Contratos Públicos",31-12-2016,"27.750,00 €",,,,Não aplicável.,Não aplicável.,FALSE
Maquinas de Sutura Linear com corte (Tecido Normal; Tecido fino),Ajuste Direto Regime Geral,Aquisição de bens móveis,"33000000-0, Equipamento médico, medicamentos e produtos para cuidados pessoais","Centro Hospitalar e Universitário de Coimbra, E. P. E. (510103448)","Medtronic Portugal, Lda (504223933)","75.089,67 €",12-06-2018,13-03-2018,180 dias,"Portugal, Coimbra, Coimbra","Artigo 24.º, n.º 1, alínea e) do Código dos Contratos Públicos","","",,,,Não aplicável.,Não aplicável.,FALSE
Fornecimento combustivel rodoviário-jan-fev-mar,Ajuste Direto Regime Geral,Locação de bens móveis,"09000000-3, Produtos petrolíferos, combustíveis, electricidade e outras fontes de energia","Centro Hospitalar e Universitário de Coimbra, E. P. E. (510103448)",Petroleos de Portugal (500697370),"22.678,49 €",12-06-2018,08-06-2018,90 dias,"Portugal, Coimbra, Coimbra","Artigo 24.º, n.º 1, alínea e), subalínea ii) do Código dos Contratos Públicos","","",,,,Não aplicável.,Não aplicável.,FALSE
Serviços de Assistência Espiritual e Religiosa-2018,Ajuste Direto Regime Geral,Aquisição de serviços,"79000000-4, Serviços a empresas: direito, comercialização, consultoria, recrutamento, impressão e segurança","Centro Hospitalar e Universitário de Coimbra, E. P. E. (510103448)",Seminario Maior de Coimbra (500792291),"15.494,00 €",12-06-2018,30-04-2018,365 dias,"Portugal, Coimbra, Coimbra","Artigo 24.º, n.º 1, alínea e), subalínea ii) do Código dos Contratos Públicos","","",,,,Não aplicável.,Não aplicável.,FALSE
040105962016-PEGASPARGASE 3750UI SOL INJ,Ajuste Direto Regime Geral,Aquisição de bens móveis,"33698000-9, Produtos para fins clínicos","Centro Hospitalar e Universitário de Coimbra, E. P. E. (510103448)",ALLOGA (504507230),"187.200,00 €",12-06-2018,06-04-2016,365 dias,"Portugal, Coimbra, Coimbra","Artigo 24.º, n.º 1, alínea e) do Código dos Contratos Públicos",31-12-2016,"187.200,00 €",,,,Não aplicável.,Não aplicável.,FALSE
- Máquinas Sutura Cirúrgicas para Correcção do Prolapso Hemorroidal - Máquinas Suturas Cirúrgicas via aberta e Laparoscópica,Ajuste Direto Regime Geral,Aquisição de bens móveis,"33000000-0, Equipamento médico, medicamentos e produtos para cuidados pessoais","Centro Hospitalar e Universitário de Coimbra, E. P. E. (510103448)",Medtronic Portugal; Lda (504223933),"74.179,50 €",12-06-2018,13-03-2018,180 dias,"Portugal, Coimbra, Coimbra","Artigo 24.º, n.º 1, alínea e) do Código dos Contratos Públicos","","",,,,Não aplicável.,Não aplicável.,FALSE
CAT SW GIAF-INDRA-SPMS ref. 00166_2017,Ajuste Direto Regime Geral,Aquisição de serviços,"72000000-5, Serviços de TI: consultoria, desenvolvimento de software, Internet e apoio","Centro Hospitalar e Universitário de Coimbra, E. P. E. (510103448)",Indra (506176142),"11.452,00 €",12-06-2018,06-04-2018,365 dias,"Portugal, Coimbra, Coimbra","Artigo 24.º, n.º 1, alínea e) do Código dos Contratos Públicos","","",,,,Não aplicável.,Não aplicável.,FALSE
Cargas Para Máquinas de Sutura,Ajuste Direto Regime Geral,Aquisição de bens móveis,"33000000-0, Equipamento médico, medicamentos e produtos para cuidados pessoais","Centro Hospitalar e Universitário de Coimbra, E. P. E. (510103448)","Medtronic Portugal, Lda (504223933)","74.797,20 €",12-06-2018,05-04-2018,180 dias,"Portugal, Coimbra, Coimbra","Artigo 24.º, n.º 1, alínea e) do Código dos Contratos Públicos","","",,,,Não aplicável.,Não aplicável.,FALSE
Projeto ERAS-Ações de formação-Programa de Cuidados Perioperatórios,Ajuste Direto Regime Geral,Aquisição de serviços,"79000000-4, Serviços a empresas: direito, comercialização, consultoria, recrutamento, impressão e segurança","Centro Hospitalar e Universitário de Coimbra, E. P. E. (510103448)",GLSMED LEARNING HELATH (513620044),"10.000,00 €",12-06-2018,17-05-2018,240 dias,"Portugal, Coimbra, Coimbra","Artigo 24.º, n.º 1, alínea e), subalínea ii) do Código dos Contratos Públicos","","",,,,Não aplicável.,Não aplicável.,FALSE
- Pontas Vitrectomia - Conjuntos Cirurgia Catarata,Ajuste Direto Regime Geral,Aquisição de bens móveis,"33000000-0, Equipamento médico, medicamentos e produtos para cuidados pessoais","Centro Hospitalar e Universitário de Coimbra, E. P. E. (510103448)","Abbott Medical Optics Spain, S.L. (980262364)","15.684,00 €",12-06-2018,09-03-2018,180 dias,"Portugal, Coimbra, Coimbra","Artigo 24.º, n.º 1, alínea e) do Código dos Contratos Públicos","","",,,,Não aplicável.,Não aplicável.,FALSE
040105902016-INFLIXIMAB 100 MG PO CONC SOL INJ FR IV,Ajuste Direto Regime Geral,Aquisição de bens móveis,"33698000-9, Produtos para fins clínicos","Centro Hospitalar e Universitário de Coimbra, E. P. E. (510103448)","MERCK SHARP E DOHME, LDA (500191360)","70.000,00 €",11-06-2018,10-03-2016,365 dias,"Portugal, Coimbra, Coimbra","Artigo 24.º, n.º 1, alínea e) do Código dos Contratos Públicos",31-12-2016,"70.000,00 €",,,,Não aplicável.,Não aplicável.,FALSE
"Contrato de aquisição de serviços para assegurar a Gestão Integrada de Resíduos Necessária ao CHUC, EPE",Concurso público,Aquisição de serviços,"90510000-5, Tratamento e eliminação de resíduos","Centro Hospitalar e Universitário de Coimbra, E.P. (510103448)",SUCH (500900469),"807.578,00 €",11-06-2018,05-06-2018,180 dias,"Portugal, Coimbra, Coimbra","Artigo 20.º, n.º 1, alínea b) do Código dos Contratos Públicos","","",,,,Não aplicável.,Não aplicável.,FALSE
040105772016-CARBONATO DE CALCIO 1000 MG CAPS,Ajuste Direto Regime Geral,Aquisição de bens móveis,"33698000-9, Produtos para fins clínicos","Centro Hospitalar e Universitário de Coimbra, E. P. E. (510103448)","PROFARIN, LDA (500223238)","5.580,00 €",11-06-2018,30-03-2016,365 dias,"Portugal, Coimbra, Coimbra","Artigo 24.º, n.º 1, alínea e) do Código dos Contratos Públicos",31-12-2016,"5.580,00 €",,,,Não aplicável.,Não aplicável.,FALSE
- Batas Cirúrgicas Irrecuperáveis L e XL - Manguitos de Protecção,Ajuste Direto Regime Geral,Aquisição de bens móveis,"33000000-0, Equipamento médico, medicamentos e produtos para cuidados pessoais","Centro Hospitalar e Universitário de Coimbra, E. P. E. (510103448)","OASIPOR - MedicalWear, S.A. (502260750)","44.406,00 €",11-06-2018,12-03-2018,180 dias,"Portugal, Coimbra, Coimbra","Artigo 24.º, n.º 1, alínea e) do Código dos Contratos Públicos","","",,,,Não aplicável.,Não aplicável.,FALSE
Pinças de Selagem e Corte  de Vasos (7mm),Ajuste Direto Regime Geral,Aquisição de bens móveis,"33000000-0, Equipamento médico, medicamentos e produtos para cuidados pessoais","Centro Hospitalar e Universitário de Coimbra, E. P. E. (510103448)",Medtronic Portugal; Lda (504223933),"73.800,00 €",11-06-2018,13-03-2018,180 dias,"Portugal, Coimbra, Coimbra","Artigo 24.º, n.º 1, alínea e) do Código dos Contratos Públicos","","",,,,Não aplicável.,Não aplicável.,FALSE
Máquinas de Sutura Linear com Corte; Pinças Descartáveis para Esófago; Punho Electrónico Reutilizável,Ajuste Direto Regime Geral,Aquisição de bens móveis,"33000000-0, Equipamento médico, medicamentos e produtos para cuidados pessoais","Centro Hospitalar e Universitário de Coimbra, E. P. E. (510103448)",Medtronic Portugal ;Lda (504223933),"70.137,48 €",11-06-2018,12-03-2018,180 dias,"Portugal, Coimbra, Coimbra","Artigo 24.º, n.º 1, alínea e) do Código dos Contratos Públicos","","",,,,Não aplicável.,Não aplicável.,FALSE
Pinças de Selagem vasos (5mm),Ajuste Direto Regime Geral,Aquisição de bens móveis,"33000000-0, Equipamento médico, medicamentos e produtos para cuidados pessoais","Centro Hospitalar e Universitário de Coimbra, E. P. E. (510103448)",Medtronic Portugal; Lda (504223933),"73.800,00 €",11-06-2018,09-03-2018,180 dias,"Portugal, Coimbra, Coimbra","Artigo 24.º, n.º 1, alínea e) do Código dos Contratos Públicos","","",,,,Não aplicável.,Não aplicável.,FALSE
procedimento n.º 050107872017 - COMPRAS CENTRALIZADAS SPMS-ROCHE - ref.ª AD-AC-2017-80,Ajuste Direto Regime Geral,Aquisição de bens móveis,"33000000-0, Equipamento médico, medicamentos e produtos para cuidados pessoais","Centro Hospitalar e Universitário de Coimbra, E. P. E. (510103448)","ROCHE FARMACEUTICA QUIMICA, LDA (500233810)","11.277,60 €",11-06-2018,21-06-2017,365 dias,"Portugal, Coimbra, Coimbra","Artigo 24.º, n.º 1, alínea e) do Código dos Contratos Públicos",29-12-2017,"11.277,60 €",,,,Não aplicável.,Não aplicável.,FALSE
Pinças de Selagem E Corte de Vasos,Ajuste Direto Regime Geral,Aquisição de bens móveis,"33000000-0, Equipamento médico, medicamentos e produtos para cuidados pessoais","Centro Hospitalar e Universitário de Coimbra, E. P. E. (510103448)","MEDTRONIC  PORTUGAL, LDA (504223933)","73.800,00 €",11-06-2018,13-03-2018,180 dias,"Portugal, Coimbra, Coimbra","Artigo 24.º, n.º 1, alínea e) do Código dos Contratos Públicos","","",,,,Não aplicável.,Não aplicável.,FALSE
040105702016-ESPUMA C/REBORDO 15X15CM APOSITO,Ajuste Direto Regime Geral,Aquisição de bens móveis,"33698000-9, Produtos para fins clínicos","Centro Hospitalar e Universitário de Coimbra, E. P. E. (510103448)","SMITH & NEPHEW (503552461), PAUL HARTMANN (502271728), MEDICINALIA (500684324), COVIDIEN (503413410), B.BRAUN (501506543)","1.096,41 €",11-06-2018,01-04-2016,365 dias,"Portugal, Coimbra, Coimbra","Artigo 20.º, n.º 1, alínea a) do Código dos Contratos Públicos",31-12-2016,"1.096,41 €",,,,Não aplicável.,Não aplicável.,FALSE
040105672016-OMBITASVIR+PARITAPREVIR 75MG+RITONAVIR 50MG COMP/DASABUVIR,Ajuste Direto Regime Geral,Aquisição de bens móveis,"33698000-9, Produtos para fins clínicos","Centro Hospitalar e Universitário de Coimbra, E. P. E. (510103448)",ABBVIE (510229050),"30.500,00 €",11-06-2018,11-03-2016,365 dias,"Portugal, Coimbra, Coimbra","Artigo 24.º, n.º 1, alínea e) do Código dos Contratos Públicos",31-12-2016,"30.500,00 €",,,,Não aplicável.,Não aplicável.,FALSE
040105592016-TRIAMCINOLONA 40 MG/ML SUSP INJ FR 1 ML INTRAVITREO,Ajuste Direto Regime Geral,Aquisição de bens móveis,"33698000-9, Produtos para fins clínicos","Centro Hospitalar e Universitário de Coimbra, E. P. E. (510103448)",ALCON PORTUGAL (501251685),"26.128,00 €",11-06-2018,04-04-2016,365 dias,"Portugal, Coimbra, Coimbra","Artigo 24.º, n.º 1, alínea e) do Código dos Contratos Públicos",31-12-2016,"26.128,00 €",,,,Não aplicável.,Não aplicável.,FALSE
"040105582016-OMBITASVIR 12,5MG+PARITAPREVIR 75MG+RITONAVIR 50MG COMP/DASABUVIR",Ajuste Direto Regime Geral,Aquisição de bens móveis,"33698000-9, Produtos para fins clínicos","Centro Hospitalar e Universitário de Coimbra, E. P. E. (510103448)",ABBVIE (510229050),"30.500,00 €",11-06-2018,11-03-2016,365 dias,"Portugal, Coimbra, Coimbra","Artigo 24.º, n.º 1, alínea e) do Código dos Contratos Públicos",31-12-2016,"30.500,00 €",,,,Não aplicável.,Não aplicável.,FALSE
"040105572016-OMBITASVIR 12,5MG+PARITAPREVIR 75MG+RITONAVIR 50MG COMP/DASABUVIR",Ajuste Direto Regime Geral,Aquisição de bens móveis,"33698000-9, Produtos para fins clínicos","Centro Hospitalar e Universitário de Coimbra, E. P. E. (510103448)",ABBVIE (510229050),"30.500,00 €",11-06-2018,11-03-2016,365 dias,"Portugal, Coimbra, Coimbra","Artigo 24.º, n.º 1, alínea e) do Código dos Contratos Públicos",31-12-2016,"30.500,00 €",,,,Não aplicável.,Não aplicável.,FALSE
procedimento n.º 050107882017 - COMPRAS CENTRALIZADAS SPMS-ROCHE - P259-AC-2017-106,Ao abrigo de acordo-quadro (art.º 259.º),Aquisição de bens móveis,"33000000-0, Equipamento médico, medicamentos e produtos para cuidados pessoais","Centro Hospitalar e Universitário de Coimbra, E. P. E. (510103448)","ROCHE FARMACEUTICA QUIMICA, LDA (500233810)","3.864.547,41 €",11-06-2018,12-06-2017,365 dias,"Portugal, Coimbra, Coimbra",Artigo 259.º do Código dos Contratos Públicos,29-12-2017,"3.864.547,41 €",,,,2776483,"Aquisição de Medicamentos desencadeada pela SPMS, no âmbito do Despacho 1571/B de 2016, ao abrigo do Acordo Quadro 2015/6, Ref.ª P259-AC-2017-106",FALSE
"040105562016-OMBITASVIR 12,5MG+PARITAPREVIR 75 MG+RITONAVIR 50MG COMP/DASABUVIR",Ajuste Direto Regime Geral,Aquisição de bens móveis,"33698000-9, Produtos para fins clínicos","Centro Hospitalar e Universitário de Coimbra, E. P. E. (510103448)",ABBVIE (510229050),"30.500,00 €",11-06-2018,11-03-2016,365 dias,"Portugal, Coimbra, Coimbra","Artigo 24.º, n.º 1, alínea e) do Código dos Contratos Públicos",31-12-2016,"30.500,00 €",,,,Não aplicável.,Não aplicável.,FALSE
Cateter stent (duplo J) longa duração,Ajuste Direto Regime Geral,Aquisição de bens móveis,"33000000-0, Equipamento médico, medicamentos e produtos para cuidados pessoais","Centro Hospitalar e Universitário de Coimbra, E. P. E. (510103448)","C.R.BARD PORTUGAL, Lda (502438274)","14.400,00 €",11-06-2018,12-03-2018,180 dias,"Portugal, Coimbra, Coimbra","Artigo 24.º, n.º 1, alínea e) do Código dos Contratos Públicos","","",,,,Não aplicável.,Não aplicável.,FALSE
procedimento n.º 050107852017 - COMPRAS CENTRALIZADAS SPMS-GILEAD-AD-AC-2017-63,Ajuste Direto Regime Geral,Aquisição de bens móveis,"33000000-0, Equipamento médico, medicamentos e produtos para cuidados pessoais","Centro Hospitalar e Universitário de Coimbra, E. P. E. (510103448)","Gilead Sciences, Lda. (503604704)","93.169,26 €",11-06-2018,21-06-2017,365 dias,"Portugal, Coimbra, Coimbra","Artigo 24.º, n.º 1, alínea e) do Código dos Contratos Públicos",29-12-2017,"93.169,26 €",,,,Não aplicável.,Não aplicável.,FALSE
