Objeto do Contrato,Tipo de Procedimento,Tipo(s) de Contrato,CPVs,Entidade(s) Adjudicante(s),Entidade(s) Adjudicatária(s),Preço Contratual,Data de Publicação,Data de Celebração do Contrato,Prazo de Execução,Local de Execução,Fundamentação,Data de Fecho do Contrato,Preço Total Efetivo,Causas das Alterações ao Prazo,Causas das Alterações ao Preço,Estado,N.º registo do Acordo Quadro,Descrição do Acordo Quadro,Procedimento Centralizado
"Serviços de alojamento e viagem para participação na reunião working party on pharmaceuticals and medical dvices """"GMDM regulamento de ensaios clinico"""", 1 participante/3 dias",Ao abrigo de acordo-quadro (art.º 258.º),Aquisição de serviços,"63510000-7, Serviços de agências de viagens e serviços similares","INFARMED - Autoridade Nacional do Medicamento e Produtos de Saúde, I. P. (600037002)","Topatlântico - Viagens e Turismo,SA (501061126)","1.186,64 €",11-12-2013,17-10-2013,3 dias,Bélgica,"Artigo 27.º, n.º 1, alínea h) do Código dos Contratos Públicos",,,,,,273814,"Acordo Quadro de viagens, transportes aéreos e alojamentos",
"Serviços de alojamento e viagem para participação na reunião EU-Assessors Meeting em Paris, 1 participante/3 dias",Ao abrigo de acordo-quadro (art.º 258.º),Aquisição de serviços,"63510000-7, Serviços de agências de viagens e serviços similares","INFARMED - Autoridade Nacional do Medicamento e Produtos de Saúde, I. P. (600037002)","Topatlântico - Viagens e Turismo,SA (501061126)","646,57 €",11-12-2013,05-12-2013,3 dias,Bélgica,"Artigo 27.º, n.º 1, alínea h) do Código dos Contratos Públicos",,,,,,273814,"Acordo Quadro de viagens, transportes aéreos e alojamentos",
Serviços de viagem e alojamento para participação na reunião Working party on pharmaceuticals on Medical Devices em Bruxelas - 1 participante/2 dias ( viagem reembolsada),Ao abrigo de acordo-quadro (art.º 258.º),Aquisição de serviços,"63510000-7, Serviços de agências de viagens e serviços similares","INFARMED - Autoridade Nacional do Medicamento e Produtos de Saúde, I. P. (600037002)","Topatlântico - Viagens e Turismo,SA (501061126)","692,98 €",11-12-2013,05-12-2013,2 dias,Bélgica,"Artigo 27.º, n.º 1, alínea h) do Código dos Contratos Públicos",,,,,,273814,"Acordo Quadro de viagens, transportes aéreos e alojamentos",
"Serviços de alojamento para participação na reunião de Directores de IT, em Viena de Austria,1 participante/3 dias ( viagem reembolsada)",Ao abrigo de acordo-quadro (art.º 258.º),Aquisição de serviços,"63510000-7, Serviços de agências de viagens e serviços similares","INFARMED - Autoridade Nacional do Medicamento e Produtos de Saúde, I. P. (600037002)","Pamtours- Viagens e Turismo,Lda (502844779)","130,00 €",11-12-2013,14-08-2013,3 dias,Áustria,"Artigo 27.º, n.º 1, alínea h) do Código dos Contratos Públicos",,,,,,273814,"Acordo Quadro de viagens, transportes aéreos e alojamentos",
Desenvolvimento de software em PHP_EA20130000729,Ajuste Direto Regime Geral,Aquisição de bens móveis,"48000000-8, Pacotes de software e sistemas de informação","INFARMED - Autoridade Nacional do Medicamento e Produtos de Saúde, I. P. (600037002)","ALTRAPORTUGAL, S.A. (504272179)","9.800,00 €",11-12-2013,09-12-2013,30 dias,Portugal,"Artigo 20.º, n.º 1, alínea a) do Código dos Contratos Públicos",,,,,,Não aplicável.,Não aplicável.,
"Serviço de alojamento e viagem para participação na reunião  """"Strengthening Collaborations for Operating Pharmacovigilance in Europe """"(SCOPE- Projecto Europeu) - 1 participante/2 dias ",Ao abrigo de acordo-quadro (art.º 258.º),Aquisição de serviços,"63510000-7, Serviços de agências de viagens e serviços similares","INFARMED - Autoridade Nacional do Medicamento e Produtos de Saúde, I. P. (600037002)","Topatlântico - Viagens e Turismo,SA (501061126)","796,05 €",11-12-2013,28-10-2013,2 dias,Luxemburgo,"Artigo 27.º, n.º 1, alínea h) do Código dos Contratos Públicos",,,,,,273814,"Acordo Quadro de viagens, transportes aéreos e alojamentos",
"Serviço de alojamento e viagem para participação na reunião  """"Strengthening Collaborations for Operating Pharmacovigilance in Europe """"(SCOPE- Projecto Europeu) - 1 participante/2 dias",Ao abrigo de acordo-quadro (art.º 258.º),Aquisição de serviços,"63510000-7, Serviços de agências de viagens e serviços similares","INFARMED - Autoridade Nacional do Medicamento e Produtos de Saúde, I. P. (600037002)","Topatlântico - Viagens e Tirismo,SA (501061126)","796,05 €",11-12-2013,13-11-2013,2 dias,Luxemburgo,"Artigo 27.º, n.º 1, alínea h) do Código dos Contratos Públicos",,,,,,273814,"Acordo Quadro de viagens, transportes aéreos e alojamentos",
"Serviços de alojamento e viagem para participação na reunião plenária CMDH e AESGP workshop """"Making the European Marjketing Autorisation procedures work for non-prescription medicines"""" em Londres-1 participante/5 dias",Ao abrigo de acordo-quadro (art.º 258.º),Aquisição de serviços,"63510000-7, Serviços de agências de viagens e serviços similares","INFARMED - Autoridade Nacional do Medicamento e Produtos de Saúde, I. P. (600037002)","Pamtours,- Viagens e Turismo,Lda (502844779)","1.305,85 €",11-12-2013,11-10-2013,5 dias,Reino Unido,"Artigo 27.º, n.º 1, alínea h) do Código dos Contratos Públicos",,,,,,273814,"Acordo Quadro de viagens, transportes aéreos e alojamentos",
"Aquisição de um visto para uma deslocação à India, 1 participante-8 dias",Ao abrigo de acordo-quadro (art.º 258.º),Aquisição de serviços,"63510000-7, Serviços de agências de viagens e serviços similares","INFARMED - Autoridade Nacional do Medicamento e Produtos de Saúde, I. P. (600037002)","Topatlântico- Viagens e Turismo,SA (501061126)","217,00 €",11-12-2013,24-10-2013,8 dias,Índia,"Artigo 27.º, n.º 1, alínea h) do Código dos Contratos Públicos",,,,,,273814,"Acordo Quadro de viagens, transportes aéreos e alojamentos",
"Serviços de viagem e alojamento para participação na reunião Working Party on Pharmaceuticals and Medical Devices, em Bruxelas- 1 participante/2 dias ( viagem reembolsada)",Ao abrigo de acordo-quadro (art.º 258.º),Aquisição de serviços,"63510000-7, Serviços de agências de viagens e serviços similares","INFARMED - Autoridade Nacional do Medicamento e Produtos de Saúde, I. P. (600037002)","Topatlântico - Viagens e Turismo,SA (501061126)","697,98 €",11-12-2013,25-11-2013,2 dias,Bélgica,"Artigo 27.º, n.º 1, alínea h) do Código dos Contratos Públicos",,,,,,273814,"Acordo Quadro de viagens, transportes aéreos e alojamentos",
"Serviço de alojamento e viagem para participação na reunião Expert Group pn the delegate acto on safety features for medicinal products for human use and stakeholder workshop, em Bruxelas- 1 participante/4 dias",Ao abrigo de acordo-quadro (art.º 258.º),Aquisição de serviços,"63510000-7, Serviços de agências de viagens e serviços similares","INFARMED - Autoridade Nacional do Medicamento e Produtos de Saúde, I. P. (600037002)","Topatlântico - Viagens e Turismo, SA (501061126)","1.152,98 €",11-12-2013,02-12-2013,4 dias,Bélgica,"Artigo 27.º, n.º 1, alínea h) do Código dos Contratos Públicos",,,,,,273814,"Acordo Quadro de viagens, transportes aéreos e alojamentos",
"Serviços de alojamento e viagem para participação na reunião Clinical Trials Facilitation Group (CTFG) Meeting, em Londres- 1 participante/3 dias",Ao abrigo de acordo-quadro (art.º 258.º),Aquisição de serviços,"63510000-7, Serviços de agências de viagens e serviços similares","INFARMED - Autoridade Nacional do Medicamento e Produtos de Saúde, I. P. (600037002)","Topatlântico - Viagens e Turismo,SA (501061126)","991,44 €",11-12-2013,05-12-2013,3 dias,Reino Unido,"Artigo 27.º, n.º 1, alínea h) do Código dos Contratos Públicos",,,,,,273814,"Acordo Quadro de viagens, transportes aéreos e alojamentos",
"Serviços de viagem e alojamento para participação na reunião Notice to applicants (NTA) Medicinal Products for Human and Veterinary Use, em Bruxelas-1 participante/2 dias (viagem Reembolsada)",Ao abrigo de acordo-quadro (art.º 258.º),Aquisição de serviços,"63510000-7, Serviços de agências de viagens e serviços similares","INFARMED - Autoridade Nacional do Medicamento e Produtos de Saúde, I. P. (600037002)","Topatlântico - Viagens e Turismo,SA (501061126)","910,98 €",10-12-2013,06-12-2013,2 dias,Bélgica,"Artigo 27.º, n.º 1, alínea h) do Código dos Contratos Públicos",,,,,,273814,"Acordo Quadro de viagens, transportes aéreos e alojamentos",
"Serviço de alojamento e viagem para participação na reunião IV European Conference on Health Law, em Coimbra- 1 participante/3 dias",Ao abrigo de acordo-quadro (art.º 258.º),Aquisição de serviços,"63510000-7, Serviços de agências de viagens e serviços similares","INFARMED - Autoridade Nacional do Medicamento e Produtos de Saúde, I. P. (600037002)","Topatlântico - Viagens e Turismo,SA (501061126)","213,00 €",05-12-2013,14-10-2013,3 dias,Portugal,"Artigo 27.º, n.º 1, alínea h) do Código dos Contratos Públicos",,,,,,273814,"Acordo Quadro de viagens, transportes aéreos e alojamentos",
"Serviço de viagem e alojamento para participação na reunião IV European Conference on Health Law em Coimbra,1 participante/3 dias",Ao abrigo de acordo-quadro (art.º 258.º),Aquisição de serviços,"63510000-7, Serviços de agências de viagens e serviços similares","INFARMED - Autoridade Nacional do Medicamento e Produtos de Saúde, I. P. (600037002)","Topatlântico - Viagens e Turismo, SA (501061126)","213,00 €",05-12-2013,14-10-2013,3 dias,Portugal,"Artigo 27.º, n.º 1, alínea h) do Código dos Contratos Públicos",,,,,,273814,"Acordo Quadro de viagens, transportes aéreos e alojamentos",
Serviço de alojamento e viagem para participação na reunião IV European Conference on Health Law em Coimbra - 1 participante/3 dias,Ao abrigo de acordo-quadro (art.º 258.º),Aquisição de serviços,"63510000-7, Serviços de agências de viagens e serviços similares","INFARMED - Autoridade Nacional do Medicamento e Produtos de Saúde, I. P. (600037002)","Topatlântico - Viagens e Turismo,SA (501061126)","213,00 €",05-12-2013,14-10-2013,3 dias,Portugal,"Artigo 27.º, n.º 1, alínea h) do Código dos Contratos Públicos",,,,,,273814,"Acordo Quadro de viagens, transportes aéreos e alojamentos",
Serviços de alojamento e viagem para participação na reunião IV da European Conference of Health Law em Coimbra - 1 participante/3 dias,Ao abrigo de acordo-quadro (art.º 258.º),Aquisição de serviços,"63510000-7, Serviços de agências de viagens e serviços similares","INFARMED - Autoridade Nacional do Medicamento e Produtos de Saúde, I. P. (600037002)","Topatlantico - Viagens e Turismo,SA (501061126)","213,00 €",05-12-2013,14-10-2013,3 dias,Portugal,"Artigo 27.º, n.º 1, alínea h) do Código dos Contratos Públicos",,,,,,273814,"Acordo Quadro de viagens, transportes aéreos e alojamentos",
"Serviços de alojamento e viagem para participação na reunião IV European e Conference on Health Law em Coimbra, 1 participante/3 dias",Ao abrigo de acordo-quadro (art.º 258.º),Aquisição de serviços,"63510000-7, Serviços de agências de viagens e serviços similares","INFARMED - Autoridade Nacional do Medicamento e Produtos de Saúde, I. P. (600037002)","Topatlântico - Viagens e Turismo,SA (501061126)","103,00 €",05-12-2013,14-10-2013,3 dias,Portugal,"Artigo 27.º, n.º 1, alínea h) do Código dos Contratos Públicos",,,,,,273814,"Acordo Quadro de viagens, transportes aéreos e alojamentos",
Serviços de alojamento e viagem para participação na reunião IV European Conference on Health Law em Coimbra- 1 participante/3 dias,Ao abrigo de acordo-quadro (art.º 258.º),Aquisição de serviços,"63510000-7, Serviços de agências de viagens e serviços similares","INFARMED - Autoridade Nacional do Medicamento e Produtos de Saúde, I. P. (600037002)","Topatlântico - Viagens e Turismo,SA (501061126)","103,00 €",05-12-2013,14-10-2013,3 dias,Portugal,"Artigo 27.º, n.º 1, alínea h) do Código dos Contratos Públicos",,,,,,273814,"Acordo Quadro de viagens, transportes aéreos e alojamentos",
Serviços de alojamento para participação na reunião IV European Conference on Health Law em Coimbra- 1 participante/3 dias,Ao abrigo de acordo-quadro (art.º 258.º),Aquisição de serviços,"63510000-7, Serviços de agências de viagens e serviços similares","INFARMED - Autoridade Nacional do Medicamento e Produtos de Saúde, I. P. (600037002)","Topatlântico - Viagens e Turismo,SA (501061126)","110,00 €",05-12-2013,14-10-2013,3 dias,Portugal,"Artigo 27.º, n.º 1, alínea h) do Código dos Contratos Públicos",,,,,,273814,"Acordo Quadro de viagens, transportes aéreos e alojamentos",
"Seviços de alojamento para participação na IV European Conference on Health Law, em Coimbra-1 participante/3 dias",Ao abrigo de acordo-quadro (art.º 258.º),Aquisição de serviços,"63510000-7, Serviços de agências de viagens e serviços similares","INFARMED - Autoridade Nacional do Medicamento e Produtos de Saúde, I. P. (600037002)","Topatlântico - Viagens e Turismo,SA (501061126)","110,00 €",05-12-2013,14-10-2013,3 dias,Portugal,"Artigo 27.º, n.º 1, alínea h) do Código dos Contratos Públicos",,,,,,273814,"Acordo Quadro de viagens, transportes aéreos e alojamentos",
Aquisição de serviços para manutenção do licenciamento do repositório de documentos AX e serviços de manutenção corretiva e evolutiva_EA20130000134,Ajuste Direto Regime Geral,Aquisição de serviços,"72000000-5, Serviços de TI: consultoria, desenvolvimento de software, Internet e apoio","INFARMED - Autoridade Nacional do Medicamento e Produtos de Saúde, I. P. (600037002)","INOVADATA, LDA (510079040)","8.442,57 €",03-12-2013,03-12-2013,360 dias,Portugal,"Artigo 20.º, n.º 1, alínea a) do Código dos Contratos Públicos",,,,,,Não aplicável.,Não aplicável.,
