freguesia,acronym,validVotesPercentage,votes,dicofre
Nespereira,PS,45.12,111,090612
Nespereira,PPD/PSD,25.61,63,090612
Nespereira,B.E.,11.38,28,090612
Nespereira,CDS-PP,5.69,14,090612
Nespereira,PCP-PEV,4.07,10,090612
Nespereira,A,2.85,7,090612
Nespereira,L,1.22,3,090612
Nespereira,PAN,1.22,3,090612
Nespereira,PCTP/MRPP,0.81,2,090612
Nespereira,PPM.PPV/CDC,0.81,2,090612
Nespereira,NC,0.41,1,090612
Nespereira,PDR,0.41,1,090612
Nespereira,PTP,0.41,1,090612
Nespereira,IL,0,0,090612
Nespereira,MAS,0,0,090612
Nespereira,PNR,0,0,090612
Nespereira,PURP,0,0,090612
