freguesia,acronym,validVotesPercentage,votes,dicofre
União das freguesias de Campo e Tamel (São Pedro Fins),PPD/PSD,47.23,222,030294
União das freguesias de Campo e Tamel (São Pedro Fins),PS,29.36,138,030294
União das freguesias de Campo e Tamel (São Pedro Fins),CDS-PP,8.3,39,030294
União das freguesias de Campo e Tamel (São Pedro Fins),PAN,4.04,19,030294
União das freguesias de Campo e Tamel (São Pedro Fins),B.E.,2.77,13,030294
União das freguesias de Campo e Tamel (São Pedro Fins),A,1.28,6,030294
União das freguesias de Campo e Tamel (São Pedro Fins),MAS,1.28,6,030294
União das freguesias de Campo e Tamel (São Pedro Fins),PCP-PEV,1.28,6,030294
União das freguesias de Campo e Tamel (São Pedro Fins),PDR,1.06,5,030294
União das freguesias de Campo e Tamel (São Pedro Fins),NC,0.85,4,030294
União das freguesias de Campo e Tamel (São Pedro Fins),L,0.64,3,030294
União das freguesias de Campo e Tamel (São Pedro Fins),PPM.PPV/CDC,0.64,3,030294
União das freguesias de Campo e Tamel (São Pedro Fins),PTP,0.64,3,030294
União das freguesias de Campo e Tamel (São Pedro Fins),PCTP/MRPP,0.21,1,030294
União das freguesias de Campo e Tamel (São Pedro Fins),PNR,0.21,1,030294
União das freguesias de Campo e Tamel (São Pedro Fins),PURP,0.21,1,030294
União das freguesias de Campo e Tamel (São Pedro Fins),IL,0,0,030294
