freguesia,acronym,validVotesPercentage,votes,dicofre
"União das freguesias de Raiva, Pedorido e Paraíso",PS,48.15,520,010610
"União das freguesias de Raiva, Pedorido e Paraíso",PPD/PSD.CDS-PP,25.46,275,010610
"União das freguesias de Raiva, Pedorido e Paraíso",MPT,7.13,77,010610
"União das freguesias de Raiva, Pedorido e Paraíso",B.E.,6.39,69,010610
"União das freguesias de Raiva, Pedorido e Paraíso",PCP-PEV,5.93,64,010610
"União das freguesias de Raiva, Pedorido e Paraíso",PCTP/MRPP,1.57,17,010610
"União das freguesias de Raiva, Pedorido e Paraíso",PAN,1.3,14,010610
"União das freguesias de Raiva, Pedorido e Paraíso",L,1.11,12,010610
"União das freguesias de Raiva, Pedorido e Paraíso",PTP,0.65,7,010610
"União das freguesias de Raiva, Pedorido e Paraíso",MAS,0.56,6,010610
"União das freguesias de Raiva, Pedorido e Paraíso",PND,0.56,6,010610
"União das freguesias de Raiva, Pedorido e Paraíso",PPM,0.46,5,010610
"União das freguesias de Raiva, Pedorido e Paraíso",PNR,0.28,3,010610
"União das freguesias de Raiva, Pedorido e Paraíso",POUS,0.28,3,010610
"União das freguesias de Raiva, Pedorido e Paraíso",PDA,0.19,2,010610
"União das freguesias de Raiva, Pedorido e Paraíso",PPV,0,0,010610
