Objeto do Contrato,Tipo de Procedimento,Tipo(s) de Contrato,CPVs,Entidade(s) Adjudicante(s),Entidade(s) Adjudicatária(s),Preço Contratual,Data de Publicação,Data de Celebração do Contrato,Prazo de Execução,Local de Execução,Fundamentação,Data de Fecho do Contrato,Preço Total Efetivo,Causas das Alterações ao Prazo,Causas das Alterações ao Preço,Estado,N.º registo do Acordo Quadro,Descrição do Acordo Quadro,Procedimento Centralizado
"Elaboração do projeto de execução de sistema solar térmico, no âmbito do POSEUR, no IPO-Porto.",Ajuste Direto Regime Geral,Aquisição de serviços,"71300000-1, Serviços de engenharia","Instituto Português de Oncologia do Porto Francisco Gentil, E. P. E. (506362299)","Escaleno, Lda (514466367)","15.600,00 €",20-11-2017,20-11-2017,60 dias,"Portugal, Porto, Porto","Artigo 20.º, n.º 1, alínea a) do Código dos Contratos Públicos",,,,,,Não aplicável.,Não aplicável.,FALSE
"Aquisição de solução para a segurança da informação, infraestrutura e aplicações.",Concurso público,Aquisição de bens móveis,"48730000-4, Pacote de software de segurança","IPO Porto FG, EPE (506362299)","Gonksys, S.A (510874169)","324.750,44 €",16-11-2017,26-10-2017,45 dias,"Portugal, Porto, Porto","Artigo 20.º, n.º 1, alínea b) do Código dos Contratos Públicos",,,,,,Não aplicável.,Não aplicável.,FALSE
