freguesia,acronym,validVotesPercentage,votes,dicofre
Cabreiro,PPD/PSD,58.33,112,160106
Cabreiro,PS,28.65,55,160106
Cabreiro,CDS-PP,4.17,8,160106
Cabreiro,B.E.,3.13,6,160106
Cabreiro,PCP-PEV,1.56,3,160106
Cabreiro,A,1.04,2,160106
Cabreiro,CH,0.52,1,160106
Cabreiro,JPP,0.52,1,160106
Cabreiro,PAN,0.52,1,160106
Cabreiro,PDR,0.52,1,160106
Cabreiro,PPM,0.52,1,160106
Cabreiro,R.I.R.,0.52,1,160106
Cabreiro,IL,0,0,160106
Cabreiro,L,0,0,160106
Cabreiro,MPT,0,0,160106
Cabreiro,NC,0,0,160106
Cabreiro,PCTP/MRPP,0,0,160106
Cabreiro,PNR,0,0,160106
Cabreiro,PTP,0,0,160106
Cabreiro,PURP,0,0,160106
