freguesia,acronym,validVotesPercentage,votes,dicofre
São Martinho,PCP-PEV,63.78,162,150105
São Martinho,PS,28.74,73,150105
São Martinho,B.E.,2.36,6,150105
São Martinho,PPD/PSD,1.97,5,150105
São Martinho,PCTP/MRPP,1.57,4,150105
São Martinho,A,0.79,2,150105
São Martinho,CDS-PP,0.39,1,150105
São Martinho,L,0.39,1,150105
São Martinho,CH,0,0,150105
São Martinho,IL,0,0,150105
São Martinho,MAS,0,0,150105
São Martinho,MPT,0,0,150105
São Martinho,NC,0,0,150105
São Martinho,PAN,0,0,150105
São Martinho,PDR,0,0,150105
São Martinho,PNR,0,0,150105
São Martinho,PPM,0,0,150105
São Martinho,PTP,0,0,150105
São Martinho,PURP,0,0,150105
São Martinho,R.I.R.,0,0,150105
