Objeto do Contrato,Tipo de Procedimento,Tipo(s) de Contrato,CPVs,Entidade(s) Adjudicante(s),Entidade(s) Adjudicatária(s),Preço Contratual,Data de Publicação,Data de Celebração do Contrato,Prazo de Execução,Local de Execução,Fundamentação,Data de Fecho do Contrato,Preço Total Efetivo,Causas das Alterações ao Prazo,Causas das Alterações ao Preço,Estado,N.º registo do Acordo Quadro,Descrição do Acordo Quadro,Procedimento Centralizado
Aq. medicamento exclusivo - Palonossetrom 0.25mg/ml sol inj fr 5ml iv,Ajuste Direto Regime Geral,Aquisição de bens móveis,"33000000-0, Equipamento médico, medicamentos e produtos para cuidados pessoais","Centro Hospitalar de Entre o Douro e Vouga, E.P.E. (508878462)",OM PHARMA S.A                                      (500207410),"205.464,00 €",31-01-2017,03-03-2016,1095 dias,"Portugal, Aveiro, Santa Maria da Feira","Artigo 24.º, n.º 1, alínea e) do Código dos Contratos Públicos",,,,,,Não aplicável.,Não aplicável.,FALSE
Aquisição de Carboximaltose Férrica 50mg/ml sol inj fr 20ml IV,Ajuste Direto Regime Geral,Aquisição de bens móveis,"33000000-0, Equipamento médico, medicamentos e produtos para cuidados pessoais","Centro Hospitalar de Entre o Douro e Vouga, E.P.E. (508878462)",OM PHARMA S.A                                      (500207410),"27.183,00 €",31-01-2017,09-06-2015,365 dias,"Portugal, Aveiro, Santa Maria da Feira","Artigo 24.º, n.º 1, alínea e) do Código dos Contratos Públicos",,,,,,Não aplicável.,Não aplicável.,FALSE
"Aquisição de Prestação de Serviços na Área de Protecção Radiológica, Controlo de Qualidade e Dosimetria",Ajuste Direto Regime Geral,Aquisição de bens móveis,"38000000-5, Equipamento laboratorial, óptico e de precisão (exc. óculos)","Centro Hospitalar de Entre o Douro e Vouga, E.P.E. (508878462)","Medical Consult Sociedade Unipessoal, Lda (504092138)","30.795,60 €",31-01-2017,01-04-2016,365 dias,"Portugal, Aveiro, Santa Maria da Feira","Artigo 20.º, n.º 1, alínea a) do Código dos Contratos Públicos",,,,,,Não aplicável.,Não aplicável.,FALSE
Aquisição de Reagentes de Microbiologia para Hemoculturas - Bactec,Ajuste Direto Regime Geral,Aquisição de bens móveis,"33696500-0, Reagentes de laboratório","CENTRO HOSPITALAR DE ENTRE O DOURO E VOUGA, E.P.E. (508878462)","QUILABAN - QUIMICA LABORATORIAL ANALITICA, S.A. (500399670)","61.634,98 €",31-01-2017,06-01-2017,365 dias,"Portugal, Aveiro, Santa Maria da Feira","Artigo 20.º, n.º 1, alínea a) do Código dos Contratos Públicos",,,,,,Não aplicável.,Não aplicável.,FALSE
0100006.122016 - Aquisição de Reagentes para Química / Imunoquímica,Concurso público,Aquisição de bens móveis,"33696500-0, Reagentes de laboratório","Centro Hospitalar de Entre o Douro e Vouga, E.P.E. (508878462)","ABBOTT LABORATORIOS, LDA (500006148)","142.640,65 €",27-01-2017,16-09-2016,104 dias,"Portugal, Aveiro, Santa Maria da Feira","Artigo 20.º, n.º 1, alínea b) do Código dos Contratos Públicos",,,,,,Não aplicável.,Não aplicável.,FALSE
"Denosumab 120mg sol inj fr 1,7ml sc",Ao abrigo de acordo-quadro (art.º 259.º),Aquisição de bens móveis,"33000000-0, Equipamento médico, medicamentos e produtos para cuidados pessoais","Centro Hospitalar de Entre o Douro e Vouga, E.P.E. (508878462)","AMGEN - BIOFARMACÊUTICA, LDA (502942959)","23.323,00 €",27-01-2017,18-01-2016,365 dias,"Portugal, Aveiro, Santa Maria da Feira",Artigo 259.º do Código dos Contratos Públicos,,,,,,1410779,CP 2015/47 - Acordo quadro para fornecimento de medicamentos do aparelho locomotor às instituições e serviços do serviço nacional de saúde,FALSE
Aq. de Medicamentos usados nas Afeções Oculares e Otorrinolaringológicas,Ajuste Direto Regime Geral,Aquisição de bens móveis,"33000000-0, Equipamento médico, medicamentos e produtos para cuidados pessoais","Centro Hospitalar de Entre o Douro e Vouga, E.P.E. (508878462)","NOVARTIS FARMA-PRODUT.FARMACEUTICOS, SA (500063524)","418.731,00 €",27-01-2017,06-01-2016,365 dias,"Portugal, Aveiro, Santa Maria da Feira",Artigo 258.º do Código dos Contratos Públicos,,,,,,Não aplicável.,Não aplicável.,FALSE
Aq. de Medicamentos usados nas Afeções Oculares e Otorrinolaringológicas,Ajuste Direto Regime Geral,Aquisição de bens móveis,"33000000-0, Equipamento médico, medicamentos e produtos para cuidados pessoais","Centro Hospitalar de Entre o Douro e Vouga, E.P.E. (508878462)","BAYER PORTUGAL, LDA (500043256)","21.401,70 €",27-01-2017,06-01-2016,365 dias,"Portugal, Aveiro, Santa Maria da Feira",Artigo 258.º do Código dos Contratos Públicos,,,,,,Não aplicável.,Não aplicável.,FALSE
"-Aq. Ligaduras , meias anti-tromboticas e ",Ajuste Direto Regime Geral,Aquisição de bens móveis,"33141100-1, Pensos; clipes, suturas, ligaduras","Centro Hospitalar de Entre o Douro e Vouga, E.P.E. (508878462)",OVERPHARMA- PRODUTOS MEDICOS FARMAC. LDA    (505792362),"1.716,00 €",26-01-2017,05-08-2015,730 dias,"Portugal, Aveiro, Santa Maria da Feira","Artigo 20.º, n.º 1, alínea a) do Código dos Contratos Públicos",,,,,,Não aplicável.,Não aplicável.,FALSE
" Aq. Ligaduras , meias anti-tromboticas e ",Ajuste Direto Regime Geral,Aquisição de bens móveis,"33141100-1, Pensos; clipes, suturas, ligaduras","Centro Hospitalar de Entre o Douro e Vouga, E.P.E. (508878462)","Bastos Viegas, SA (500042772)","2.233,56 €",26-01-2017,05-08-2015,730 dias,"Portugal, Aveiro, Santa Maria da Feira","Artigo 20.º, n.º 1, alínea a) do Código dos Contratos Públicos",,,,,,Não aplicável.,Não aplicável.,FALSE
Agulhas Hipodermicas,Ajuste Direto Regime Geral,Aquisição de bens móveis,"33140000-3, Material médico de consumo","Centro Hospitalar de Entre o Douro e Vouga, E.P.E. (508878462)","DOCWORLD, LDA (508592909)","0,00 €",26-01-2017,18-07-2016,365 dias,"Portugal, Aveiro, Santa Maria da Feira","Artigo 20.º, n.º 1, alínea a) do Código dos Contratos Públicos",,,,,,2565306,06/00001.23/2016- Agulhas Hipodérmicas (acordo quadro nº 022/2014),FALSE
"Aq. Ligaduras , meias anti-tromboticas e ",Ajuste Direto Regime Geral,Aquisição de bens móveis,"33141100-1, Pensos; clipes, suturas, ligaduras","Centro Hospitalar de Entre o Douro e Vouga, E.P.E. (508878462)","BSN medical, SA        (505385058)","30.938,90 €",26-01-2017,05-08-2015,730 dias,"Portugal, Aveiro, Santa Maria da Feira","Artigo 20.º, n.º 1, alínea a) do Código dos Contratos Públicos",,,,,,Não aplicável.,Não aplicável.,FALSE
"Aq. Ligaduras , meias anti-tromboticas e ",Ajuste Direto Regime Geral,Aquisição de bens móveis,"33141100-1, Pensos; clipes, suturas, ligaduras","Centro Hospitalar de Entre o Douro e Vouga, E.P.E. (508878462)","ALBINO DIAS ANDRADE, LDA (500013810)","2.068,00 €",26-01-2017,05-08-2015,730 dias,"Portugal, Aveiro, Santa Maria da Feira","Artigo 20.º, n.º 1, alínea a) do Código dos Contratos Públicos",,,,,,Não aplicável.,Não aplicável.,FALSE
"Aq. Ligaduras , meias anti-tromboticas e outros",Ajuste Direto Regime Geral,Aquisição de bens móveis,"33141100-1, Pensos; clipes, suturas, ligaduras","Centro Hospitalar de Entre o Douro e Vouga, E.P.E. (508878462)",MOLNLYCKE HEALTH CARE-COM.P.HOSPITALARES (511101066),"27.246,00 €",26-01-2017,05-08-2015,730 dias,"Portugal, Aveiro, Santa Maria da Feira","Artigo 20.º, n.º 1, alínea a) do Código dos Contratos Públicos",,,,,,Não aplicável.,Não aplicável.,FALSE
Agulhas Hipodérmicas,Ajuste Direto Regime Geral,Aquisição de bens móveis,"33140000-3, Material médico de consumo","Centro Hospitalar de Entre o Douro e Vouga, E.P.E. (508878462)",OVERPHARMA- PRODUTOS MEDICOS FARMAC. LDA    (505792362),"0,00 €",26-01-2017,15-07-2016,365 dias,"Portugal, Aveiro, Santa Maria da Feira","Artigo 20.º, n.º 1, alínea a) do Código dos Contratos Públicos",,,,,,2565306,06/00001.23/2016- Agulhas Hipodérmicas (acordo quadro nº 022/2014),FALSE
"Aq. Ligaduras , meias anti-tromboticas e outros",Ajuste Direto Regime Geral,Aquisição de bens móveis,"33141100-1, Pensos; clipes, suturas, ligaduras","Centro Hospitalar de Entre o Douro e Vouga, E.P.E. (508878462)","EZEQUIEL PANAO JORGE, LDA (501412727)","1.257,94 €",26-01-2017,10-08-2015,730 dias,"Portugal, Aveiro, Santa Maria da Feira","Artigo 20.º, n.º 1, alínea a) do Código dos Contratos Públicos",,,,,,Não aplicável.,Não aplicável.,FALSE
Agulhas Hipodérmicas,Ajuste Direto Regime Geral,Aquisição de bens móveis,"33140000-3, Material médico de consumo","Centro Hospitalar de Entre o Douro e Vouga, E.P.E. (508878462)","QUILABAN-QUIM.LABORATOR.ANALITICA, SA (500399670)","0,00 €",26-01-2017,10-08-2016,365 dias,"Portugal, Aveiro, Santa Maria da Feira","Artigo 20.º, n.º 1, alínea a) do Código dos Contratos Públicos",,,,,,2565306,06/00001.23/2016- Agulhas Hipodérmicas (acordo quadro nº 022/2014),FALSE
Aquisição de Medicamentos Exclusivos,Ajuste Direto Regime Geral,Aquisição de bens móveis,"33000000-0, Equipamento médico, medicamentos e produtos para cuidados pessoais","Centro Hospitalar de Entre o Douro e Vouga, E.P.E. (508878462)",DILOFAR DISTRIBUICAO TRANSPORTES E LOGISTICA       (500563004),"600,00 €",26-01-2017,26-10-2016,66 dias,"Portugal, Aveiro, Santa Maria da Feira","Artigo 24.º, n.º 1, alínea e) do Código dos Contratos Públicos",,,,,,Não aplicável.,Não aplicável.,FALSE
Aquisição de Medicamentos Exclusivos,Ajuste Direto Regime Geral,Aquisição de bens móveis,"33000000-0, Equipamento médico, medicamentos e produtos para cuidados pessoais","Centro Hospitalar de Entre o Douro e Vouga, E.P.E. (508878462)",Théa Portugal (507978358),"2.192,75 €",26-01-2017,26-10-2016,66 dias,"Portugal, Aveiro, Santa Maria da Feira","Artigo 24.º, n.º 1, alínea e) do Código dos Contratos Públicos",,,,,,Não aplicável.,Não aplicável.,FALSE
Aquisição de Medicamentos Exclusivos,Ajuste Direto Regime Geral,Aquisição de bens móveis,"33000000-0, Equipamento médico, medicamentos e produtos para cuidados pessoais","Centro Hospitalar de Entre o Douro e Vouga, E.P.E. (508878462)",EUSA PHARMA (UK) Limited - Sucursal Portugal (980532981),"750,00 €",26-01-2017,26-10-2016,66 dias,"Portugal, Aveiro, Santa Maria da Feira","Artigo 24.º, n.º 1, alínea e) do Código dos Contratos Públicos",,,,,,Não aplicável.,Não aplicável.,FALSE
Aquisição de Electrodos para Ressetoscopio,Ajuste Direto Regime Geral,Aquisição de bens móveis,"31711140-6, Eléctrodos","Centro Hospitalar de Entre o Douro e Vouga, E.P.E. (508878462)","JOHNSON E JOHNSON, LDA (500153370)","55.200,00 €",26-01-2017,21-11-2014,730 dias,"Portugal, Aveiro, Santa Maria da Feira","Artigo 24.º, n.º 1, alínea e) do Código dos Contratos Públicos",,,,,,Não aplicável.,Não aplicável.,FALSE
Contrato de prestação de serviços para Promoção e Implementação da Qualidade,Ajuste Direto Regime Geral,Aquisição de serviços,"72000000-5, Serviços de TI: consultoria, desenvolvimento de software, Internet e apoio","Centro Hospitalar de Entre o Douro e Vouga, E.P.E. (508878462)","Always The Best - Qualidade Hospitalar, Unipessoal, Lda (507645170)","8.750,00 €",26-01-2017,25-05-2016,1095 dias,"Portugal, Aveiro, Santa Maria da Feira","Artigo 20.º, n.º 1, alínea a) do Código dos Contratos Públicos",,,,,,Não aplicável.,Não aplicável.,FALSE
Material Diverso para Oncologia,Concurso público,Aquisição de bens móveis,"33140000-3, Material médico de consumo","Centro Hospitalar de Entre o Douro e Vouga, E.P.E. (508878462)","HR HOSPITALAR, UNIPESSOAL, LDA      (501895558)","2.890,00 €",26-01-2017,21-04-2015,730 dias,"Portugal, Aveiro, Santa Maria da Feira","Artigo 20.º, n.º 1, alínea b) do Código dos Contratos Públicos",,,,,,Não aplicável.,Não aplicável.,FALSE
Material Diverso para Oncologia,Concurso público,Aquisição de bens móveis,"33140000-3, Material médico de consumo","Centro Hospitalar de Entre o Douro e Vouga, E.P.E. (508878462)","VYGON (PORTUGAL), LDA (503232785)","32.965,00 €",26-01-2017,21-04-2015,730 dias,"Portugal, Aveiro, Santa Maria da Feira","Artigo 20.º, n.º 1, alínea b) do Código dos Contratos Públicos",,,,,,Não aplicável.,Não aplicável.,FALSE
Aq. medicamentos exclusivos: Ticagrelos 90mg comp. e Sitagliptina 25mg comp.,Ajuste Direto Regime Geral,Aquisição de bens móveis,"33000000-0, Equipamento médico, medicamentos e produtos para cuidados pessoais","Centro Hospitalar de Entre o Douro e Vouga, E.P.E. (508878462)","MERCK SHARP E DOHME, LDA (500191360)","94,16 €",26-01-2017,14-11-2016,36 dias,"Portugal, Aveiro, Santa Maria da Feira","Artigo 24.º, n.º 1, alínea e) do Código dos Contratos Públicos",,,,,,Não aplicável.,Não aplicável.,FALSE
"Aq. Medicamentos Exclusivos: Ticagrelos 90mg comp, Sitaglipina 25mg comp",Ajuste Direto Regime Geral,Aquisição de bens móveis,"33000000-0, Equipamento médico, medicamentos e produtos para cuidados pessoais","Centro Hospitalar de Entre o Douro e Vouga, E.P.E. (508878462)","ASTRAZENECA Produtos Farmacêuticos, Lda (502942240)","294,87 €",26-01-2017,14-01-2017,44 dias,"Portugal, Aveiro, Santa Maria da Feira","Artigo 24.º, n.º 1, alínea e) do Código dos Contratos Públicos",,,,,,Não aplicável.,Não aplicável.,FALSE
Material Diverso para Oncologia,Concurso público,Aquisição de bens móveis,"33140000-3, Material médico de consumo","Centro Hospitalar de Entre o Douro e Vouga, E.P.E. (508878462)","B. BRAUN MEDICAL, LDA. (501506543)","131.342,00 €",25-01-2017,21-04-2015,730 dias,"Portugal, Aveiro, Santa Maria da Feira","Artigo 20.º, n.º 1, alínea b) do Código dos Contratos Públicos",,,,,,Não aplicável.,Não aplicável.,FALSE
Aquisição de Prestação de Serviços para Fornecimento de Alimentação nº 11/00001.62/2017,Ajuste Direto Regime Geral,Aquisição de serviços,"55322000-3, Serviços de confecção de refeições","Centro Hospitalar de Entre o Douro e Vouga, E.P.E. (508878462)",Uniself - Soc. Restaurantes Publicos e Privados SA (501323325),"669.385,01 €",25-01-2017,06-01-2017,365 dias,"Portugal, Aveiro, Santa Maria da Feira","Artigo 27.º, n.º 1, alínea a) do Código dos Contratos Públicos",,,,,,Não aplicável.,Não aplicável.,FALSE
Aquisição de sitagliptina 50 mg comp,Ajuste Direto Regime Geral,Aquisição de bens móveis,"33000000-0, Equipamento médico, medicamentos e produtos para cuidados pessoais","Centro Hospitalar de Entre o Douro e Vouga, E.P.E. (508878462)","MERCK SHARP E DOHME, LDA (500191360)","292,80 €",25-01-2017,26-09-2016,70 dias,"Portugal, Aveiro, Santa Maria da Feira","Artigo 24.º, n.º 1, alínea e) do Código dos Contratos Públicos",,,,,,Não aplicável.,Não aplicável.,FALSE
Aq. Medicamento Doxorrubicina Lipossomica Peguilada 2mg/ml sol inj fr 10ml iv,Ajuste Direto Regime Geral,Aquisição de bens móveis,"33000000-0, Equipamento médico, medicamentos e produtos para cuidados pessoais","Centro Hospitalar de Entre o Douro e Vouga, E.P.E. (508878462)","Janssen Cilag Farmacêutica, Lda (500189412)","7.997,50 €",25-01-2017,21-11-2016,32 dias,"Portugal, Aveiro, Santa Maria da Feira","Artigo 24.º, n.º 1, alínea e) do Código dos Contratos Públicos",,,,,,Não aplicável.,Não aplicável.,FALSE
Aq. Sorafenib 200mg comp,Ajuste Direto Regime Geral,Aquisição de bens móveis,"33000000-0, Equipamento médico, medicamentos e produtos para cuidados pessoais","Centro Hospitalar de Entre o Douro e Vouga, E.P.E. (508878462)","BAYER PORTUGAL, LDA (500043256)","9.683,52 €",25-01-2017,05-12-2016,22 dias,"Portugal, Aveiro, Santa Maria da Feira","Artigo 24.º, n.º 1, alínea e) do Código dos Contratos Públicos",,,,,,Não aplicável.,Não aplicável.,FALSE
Máscaras (Respiradores de Partículas),Ajuste Direto Regime Geral,Aquisição de bens móveis,"33157400-9, Respiradores para fins médicos","CENTRO HOSPITALAR DE ENTRE O DOURO E VOUGA, E.P.E. (508878462)",FACTOR PLUS (502810645),"2.061,85 €",25-01-2017,02-11-2016,365 dias,"Portugal, Aveiro, Santa Maria da Feira","Artigo 20.º, n.º 1, alínea a) do Código dos Contratos Públicos",,,,,,Não aplicável.,Não aplicável.,FALSE
"03/00114.42/2016 - Aquisição de Software para aquisição, relatório, arquivo e distribuição de Exames ECG – Urgência CHEDV",Ajuste Direto Regime Geral,Aquisição de bens móveis,"48210000-3, Pacote de software para ligações em rede","CENTRO HOSPITALAR DE ENTRE O DOURO E VOUGA, E.P.E. (508878462)","Byme - Information technology, Lda (507790960)","8.500,00 €",25-01-2017,12-01-2017,12 dias,"Portugal, Aveiro, Santa Maria da Feira","Artigo 20.º, n.º 1, alínea a) do Código dos Contratos Públicos",,,,,,Não aplicável.,Não aplicável.,FALSE
Aquisição Infliximab - Remicade,Ajuste Direto Regime Geral,Aquisição de bens móveis,"33600000-6, Produtos farmacêuticos","CENTRO HOSPITALAR DE ENTRE O DOURO E VOUGA, E.P.E. (508878462)","MERCK SHARP E DOHME, LDA (500191360)","194.250,00 €",25-01-2017,16-08-2016,136 dias,"Portugal, Aveiro, Santa Maria da Feira","Artigo 24.º, n.º 1, alínea e) do Código dos Contratos Públicos",,,,,,Não aplicável.,Não aplicável.,FALSE
Máscaras (Respiradores de Partículas),Ajuste Direto Regime Geral,Aquisição de bens móveis,"33157400-9, Respiradores para fins médicos","CENTRO HOSPITALAR DE ENTRE O DOURO E VOUGA, E.P.E. (508878462)",NORMAX (102451958),"9.980,00 €",25-01-2017,02-11-2016,365 dias,"Portugal, Aveiro, Santa Maria da Feira","Artigo 20.º, n.º 1, alínea a) do Código dos Contratos Públicos",,,,,,Não aplicável.,Não aplicável.,FALSE
03/00098.62/2016 - Aquisição de Prestação de Serviços de Formação para Realização de Workshops Práticos e Desenvolvimento de Competências das Equipas do Serviço de Urgência no HSJM,Ajuste Direto Regime Geral,Aquisição de serviços,"79000000-4, Serviços a empresas: direito, comercialização, consultoria, recrutamento, impressão e segurança","Centro Hospitalar de Entre o Douro e Vouga, E.P.E. (508878462)",KAIZEN (508830001),"17.750,00 €",25-01-2017,11-11-2016,60 dias,"Portugal, Aveiro, São João da Madeira","Artigo 20.º, n.º 1, alínea a) do Código dos Contratos Públicos",,,,,,Não aplicável.,Não aplicável.,FALSE
Aq. Medicamentos Exclusivos Janssen-Cilag (Paliperidonas),Ajuste Direto Regime Geral,Aquisição de bens móveis,"33000000-0, Equipamento médico, medicamentos e produtos para cuidados pessoais","Centro Hospitalar de Entre o Douro e Vouga, E.P.E. (508878462)","JANSSEN CILAG FARMACEUTICA, LDA.                   (500189412)","4.924,46 €",25-01-2017,05-12-2016,22 dias,"Portugal, Aveiro, Santa Maria da Feira","Artigo 24.º, n.º 1, alínea e) do Código dos Contratos Públicos",,,,,,Não aplicável.,Não aplicável.,FALSE
Aquisição de hemostático reabsorvivel à base de cologéneo,Ajuste Direto Regime Geral,Aquisição de bens móveis,"33141127-6, Hemostáticos reabsorvíveis","Centro Hospitalar de Entre o Douro e Vouga, E.P.E. (508878462)","BAXTER MEDICO - FARMACEUTICO, LDA (503347345)","4.125,00 €",25-01-2017,07-12-2016,24 dias,"Portugal, Aveiro, Santa Maria da Feira","Artigo 24.º, n.º 1, alínea e) do Código dos Contratos Públicos",,,,,,Não aplicável.,Não aplicável.,FALSE
Material Diverso de Anestesia,Concurso público,Aquisição de bens móveis,"33140000-3, Material médico de consumo","Centro Hospitalar de Entre o Douro e Vouga, E.P.E. (508878462)","TELEFLEX MEDICAL, S.A. (980249783)","9.180,00 €",25-01-2017,09-02-2015,730 dias,"Portugal, Aveiro, Santa Maria da Feira","Artigo 20.º, n.º 1, alínea b) do Código dos Contratos Públicos",,,,,,Não aplicável.,Não aplicável.,FALSE
Material Diverso de Anestesia,Concurso público,Aquisição de bens móveis,"33140000-3, Material médico de consumo","Centro Hospitalar de Entre o Douro e Vouga, E.P.E. (508878462)",MBA (504445960),"5.872,00 €",25-01-2017,09-02-2015,730 dias,"Portugal, Aveiro, Santa Maria da Feira","Artigo 20.º, n.º 1, alínea b) do Código dos Contratos Públicos",,,,,,Não aplicável.,Não aplicável.,FALSE
Material Diverso de Anestesia,Concurso público,Aquisição de bens móveis,"33140000-3, Material médico de consumo","Centro Hospitalar de Entre o Douro e Vouga, E.P.E. (508878462)",PULMOCOR (501402578),"1.764,00 €",25-01-2017,09-02-2015,730 dias,"Portugal, Aveiro, Santa Maria da Feira","Artigo 20.º, n.º 1, alínea b) do Código dos Contratos Públicos",,,,,,Não aplicável.,Não aplicável.,FALSE
Material Diverso de Anestesia,Concurso público,Aquisição de bens móveis,"33140000-3, Material médico de consumo","Centro Hospitalar de Entre o Douro e Vouga, E.P.E. (508878462)",DRAGER (508771323),"14.528,00 €",25-01-2017,09-02-2015,730 dias,"Portugal, Aveiro, Santa Maria da Feira","Artigo 20.º, n.º 1, alínea b) do Código dos Contratos Públicos",,,,,,Não aplicável.,Não aplicável.,FALSE
Material Diverso de Anestesia,Concurso público,Aquisição de bens móveis,"33140000-3, Material médico de consumo","Centro Hospitalar de Entre o Douro e Vouga, E.P.E. (508878462)","COVIDIEN PORTUGAL - PRODUTOS SAUDE, UNIPESSOAL LDA (503413410)","59.775,70 €",25-01-2017,09-02-2015,730 dias,"Portugal, Aveiro, Santa Maria da Feira","Artigo 20.º, n.º 1, alínea b) do Código dos Contratos Públicos",,,,,,Não aplicável.,Não aplicável.,FALSE
Material Diverso de Anestesia,Concurso público,Aquisição de bens móveis,"33140000-3, Material médico de consumo","Centro Hospitalar de Entre o Douro e Vouga, E.P.E. (508878462)","SMITHS MEDICAL(PORTUGAL),LDA. (507445937)","50.280,00 €",25-01-2017,09-02-2015,730 dias,"Portugal, Aveiro, Santa Maria da Feira","Artigo 20.º, n.º 1, alínea b) do Código dos Contratos Públicos",,,,,,Não aplicável.,Não aplicável.,FALSE
03/00088.23/2014 - Aquisição de material para tratamento de feridas por pressão negativa,Ajuste Direto Regime Geral,Aquisição de bens móveis,"33000000-0, Equipamento médico, medicamentos e produtos para cuidados pessoais","Centro Hospitalar de Entre o Douro e Vouga, E.P.E. (508878462)",SMITH & NEPHEW (503552461),"21.370,00 €",25-01-2017,21-01-2015,365 dias,"Portugal, Aveiro, Santa Maria da Feira","Artigo 20.º, n.º 1, alínea a) do Código dos Contratos Públicos",,,,,,Não aplicável.,Não aplicável.,FALSE
Aquisição de Monitores de Sinais Vitais e Suportes,Ajuste Direto Regime Geral,Aquisição de bens móveis,"33000000-0, Equipamento médico, medicamentos e produtos para cuidados pessoais","Centro Hospitalar de Entre o Douro e Vouga, E.P.E. (508878462)",BACELAR & IRMAO LDA (500532818),"7.283,00 €",25-01-2017,29-12-2016,30 dias,"Portugal, Aveiro, Santa Maria da Feira","Artigo 20.º, n.º 1, alínea a) do Código dos Contratos Públicos",,,,,,Não aplicável.,Não aplicável.,FALSE
Material Diverso de Anestesia,Concurso público,Aquisição de bens móveis,"33140000-3, Material médico de consumo","Centro Hospitalar de Entre o Douro e Vouga, E.P.E. (508878462)",INTERSURGICAL (503480045),"46.339,38 €",25-01-2017,09-02-2015,750 dias,"Portugal, Aveiro, Santa Maria da Feira","Artigo 20.º, n.º 1, alínea b) do Código dos Contratos Públicos",,,,,,Não aplicável.,Não aplicável.,FALSE
02/00026.27/2014 – Aquisição de Material de Osteossintese para Coluna - Outros,Concurso público,Aquisição de bens móveis,"33183300-9, Aparelhos para osteossíntese","Centro Hospitalar de Entre o Douro e Vouga, E.P.E. (508878462)","NEUROWAVE, LDA (508537150)","1.028,26 €",25-01-2017,25-08-2015,1095 dias,"Portugal, Aveiro, Santa Maria da Feira","Artigo 20.º, n.º 1, alínea b) do Código dos Contratos Públicos",,,,,,Não aplicável.,Não aplicável.,FALSE
02/00026.27/2014 – Aquisição de Material de Osteossintese para Coluna - Outros,Concurso público,Aquisição de bens móveis,"33183300-9, Aparelhos para osteossíntese","Centro Hospitalar de Entre o Douro e Vouga, E.P.E. (508878462)",JOHNSON & JOHNSON (500153370),"26.760,00 €",25-01-2017,11-09-2015,1095 dias,"Portugal, Aveiro, Santa Maria da Feira","Artigo 20.º, n.º 1, alínea b) do Código dos Contratos Públicos",,,,,,Não aplicável.,Não aplicável.,FALSE
02/00026.27/2014 – Aquisição de Material de Osteossintese para Coluna - Outros,Concurso público,Aquisição de bens móveis,"33183300-9, Aparelhos para osteossíntese","Centro Hospitalar de Entre o Douro e Vouga, E.P.E. (508878462)","MEDTRONIC PORTUGAL, LDA. (504223933)","123.507,00 €",25-01-2017,11-09-2015,1095 dias,"Portugal, Aveiro, Santa Maria da Feira","Artigo 20.º, n.º 1, alínea b) do Código dos Contratos Públicos",,,,,,Não aplicável.,Não aplicável.,FALSE
02/00025.27/2014 –Aquisição de Material de Osteossintese para Artrodese da Coluna Dorso-Lombar,Concurso público,Aquisição de bens móveis,"33183300-9, Aparelhos para osteossíntese","Centro Hospitalar de Entre o Douro e Vouga, E.P.E. (508878462)","MEDTRONIC PORTUGAL, LDA. (504223933)","138.018,00 €",25-01-2017,13-10-2015,365 dias,"Portugal, Aveiro, Santa Maria da Feira","Artigo 20.º, n.º 1, alínea b) do Código dos Contratos Públicos",,,,,,Não aplicável.,Não aplicável.,FALSE
02/00021.29/2014 – Aquisição de Material Diverso para BO Ortopedia,Concurso público,Aquisição de bens móveis,"33183000-6, Material de assistência ortopédica","Centro Hospitalar de Entre o Douro e Vouga, E.P.E. (508878462)","B. BRAUN MEDICAL, LDA (501506543)","249,00 €",24-01-2017,04-08-2015,730 dias,"Portugal, Aveiro, Santa Maria da Feira","Artigo 20.º, n.º 1, alínea b) do Código dos Contratos Públicos",,,,,,Não aplicável.,Não aplicável.,FALSE
02/00021.29/2014 – Aquisição de Material Diverso para BO Ortopedia,Concurso público,Aquisição de bens móveis,"33183000-6, Material de assistência ortopédica","Centro Hospitalar de Entre o Douro e Vouga, E.P.E. (508878462)",BAXTER MEDICO FARMACEUTICA LDA (503347345),"1.190,00 €",24-01-2017,05-08-2015,730 dias,"Portugal, Aveiro, Santa Maria da Feira","Artigo 20.º, n.º 1, alínea b) do Código dos Contratos Públicos",,,,,,Não aplicável.,Não aplicável.,FALSE
02/00021.29/2014 – Aquisição de Material Diverso para BO Ortopedia,Concurso público,Aquisição de bens móveis,"33183000-6, Material de assistência ortopédica","Centro Hospitalar de Entre o Douro e Vouga, E.P.E. (508878462)",BIOMET PORTUGAL UNIPESSOAL LDA (500254990),"1.320,00 €",24-01-2017,17-08-2015,730 dias,"Portugal, Aveiro, Santa Maria da Feira","Artigo 20.º, n.º 1, alínea b) do Código dos Contratos Públicos",,,,,,Não aplicável.,Não aplicável.,FALSE
02/00021.29/2014 – Aquisição de Material Diverso para BO Ortopedia.,Concurso público,Aquisição de bens móveis,"33183000-6, Material de assistência ortopédica","Centro Hospitalar de Entre o Douro e Vouga, E.P.E. (508878462)",EXPOMEDICA (501886621),"3.792,00 €",24-01-2017,04-08-2015,730 dias,"Portugal, Aveiro, Santa Maria da Feira","Artigo 20.º, n.º 1, alínea b) do Código dos Contratos Públicos",,,,,,Não aplicável.,Não aplicável.,FALSE
02/00021.29/2014 – Aquisição de Material Diverso para BO Ortopedia,Concurso público,Aquisição de bens móveis,"33183000-6, Material de assistência ortopédica","Centro Hospitalar de Entre o Douro e Vouga, E.P.E. (508878462)",JOHNSON & JOHNSON (500153370),"4.632,00 €",24-01-2017,07-08-2015,730 dias,"Portugal, Aveiro, Santa Maria da Feira","Artigo 20.º, n.º 1, alínea b) do Código dos Contratos Públicos",,,,,,Não aplicável.,Não aplicável.,FALSE
02/00021.29/2014 – Aquisição de Material Diverso para BO Ortopedia,Concurso público,Aquisição de bens móveis,"33183000-6, Material de assistência ortopédica","Centro Hospitalar de Entre o Douro e Vouga, E.P.E. (508878462)","STRYKER PORTUGAL PRODUTOS MEDICOS, LDA (504594214)","120.644,00 €",24-01-2017,10-08-2015,1095 dias,"Portugal, Aveiro, Santa Maria da Feira","Artigo 20.º, n.º 1, alínea b) do Código dos Contratos Públicos",,,,,,Não aplicável.,Não aplicável.,FALSE
02/00016.27/2014 – Aquisição de Material de Osteossintese Especifico para Membro Superior,Concurso público,Aquisição de bens móveis,"33183300-9, Aparelhos para osteossíntese","Centro Hospitalar de Entre o Douro e Vouga, E.P.E. (508878462)",JOHNSON & JOHNSON (500153370),"11.835,00 €",24-01-2017,29-06-2015,1095 dias,"Portugal, Aveiro, Estarreja","Artigo 20.º, n.º 1, alínea b) do Código dos Contratos Públicos",,,,,,Não aplicável.,Não aplicável.,FALSE
02/00016.27/2014 – Aquisição de Material de Osteossintese Especifico para Membro Superior,Concurso público,Aquisição de bens móveis,"33183300-9, Aparelhos para osteossíntese","Centro Hospitalar de Entre o Douro e Vouga, E.P.E. (508878462)","STRYKER PORTUGAL PRODUTOS MEDICOS, LDA (504594214)","49.059,00 €",24-01-2017,07-07-2015,1095 dias,"Portugal, Aveiro, Santa Maria da Feira","Artigo 20.º, n.º 1, alínea b) do Código dos Contratos Públicos",,,,,,Não aplicável.,Não aplicável.,FALSE
02/00016.27/2014 – Aquisição de Material de Osteossintese Especifico para Membro Superior,Concurso público,Aquisição de bens móveis,"33183300-9, Aparelhos para osteossíntese","Centro Hospitalar de Entre o Douro e Vouga, E.P.E. (508878462)","MCTPOR, Unipessoal, Lda (510020569)","49.275,00 €",24-01-2017,07-07-2015,1095 dias,"Portugal, Aveiro, Santa Maria da Feira","Artigo 20.º, n.º 1, alínea b) do Código dos Contratos Públicos",,,,,,Não aplicável.,Não aplicável.,FALSE
02/00016.27/2014 – Aquisição de Material de Osteossintese Especifico para Membro Superior,Concurso público,Aquisição de bens móveis,"33183300-9, Aparelhos para osteossíntese","Centro Hospitalar de Entre o Douro e Vouga, E.P.E. (508878462)",BIOMET PORTUGAL UNIPESSOAL LDA (500254990),"53.340,00 €",24-01-2017,07-07-2015,1095 dias,"Portugal, Aveiro, Santa Maria da Feira","Artigo 20.º, n.º 1, alínea b) do Código dos Contratos Públicos",,,,,,Não aplicável.,Não aplicável.,FALSE
Aq. de medicamentos exclusivos,Ajuste Direto Regime Geral,Aquisição de bens móveis,"33000000-0, Equipamento médico, medicamentos e produtos para cuidados pessoais","Centro Hospitalar de Entre o Douro e Vouga, E.P.E. (508878462)","MERCK, SA (500650870)","468,48 €",24-01-2017,18-07-2016,365 dias,"Portugal, Aveiro, Santa Maria da Feira","Artigo 24.º, n.º 1, alínea e) do Código dos Contratos Públicos",,,,,,Não aplicável.,Não aplicável.,FALSE
Aquisição de Linha para preparação/administração Citostáticos – Opaco,Ajuste Direto Regime Geral,Aquisição de bens móveis,"33000000-0, Equipamento médico, medicamentos e produtos para cuidados pessoais","Centro Hospitalar de Entre o Douro e Vouga, E.P.E. (508878462)","B. BRAUN MEDICAL, LDA (501506543)","18.408,00 €",24-01-2017,21-04-2015,730 dias,"Portugal, Aveiro, Santa Maria da Feira","Artigo 20.º, n.º 1, alínea a) do Código dos Contratos Públicos",,,,,,Não aplicável.,Não aplicável.,FALSE
Aquisição de Ceritinib 150 mg caps,Ajuste Direto Regime Geral,Aquisição de bens móveis,"33600000-6, Produtos farmacêuticos","CENTRO HOSPITALAR DE ENTRE O DOURO E VOUGA, E.P.E. (508878462)","NOVARTIS FARMA-PRODUT.FARMACEUTICOS, SA (500063524)","34.980,03 €",24-01-2017,29-07-2016,180 dias,"Portugal, Aveiro, Santa Maria da Feira","Artigo 24.º, n.º 1, alínea e) do Código dos Contratos Públicos",,,,,,Não aplicável.,Não aplicável.,FALSE
"Aq. de Poliuretano c/ silicone super abs c/ rebordo 12,5cm x 12,5 cm cut est.",Ajuste Direto Regime Geral,Aquisição de bens móveis,"33000000-0, Equipamento médico, medicamentos e produtos para cuidados pessoais","Centro Hospitalar de Entre o Douro e Vouga, E.P.E. (508878462)",MOLNLYCKE HEALTH CARE-COM.P.HOSPITALARES (511101066),"2.676,00 €",24-01-2017,30-06-2016,180 dias,"Portugal, Aveiro, Santa Maria da Feira","Artigo 24.º, n.º 1, alínea e) do Código dos Contratos Públicos",,,,,,Não aplicável.,Não aplicável.,FALSE
Aq. de Impregnado de Colagénio 320 mg+Gentamicina 140 mg,Ajuste Direto Regime Geral,Aquisição de bens móveis,"33000000-0, Equipamento médico, medicamentos e produtos para cuidados pessoais","Centro Hospitalar de Entre o Douro e Vouga, E.P.E. (508878462)",BIOMET PORTUGAL UNIPESSOAL LDA (500254990),"1.540,00 €",24-01-2017,09-06-2016,180 dias,"Portugal, Aveiro, Santa Maria da Feira","Artigo 24.º, n.º 1, alínea e) do Código dos Contratos Públicos",,,,,,Não aplicável.,Não aplicável.,FALSE
" Prestação de Serviços """"Up to Date""""",Ajuste Direto Regime Geral,Aquisição de serviços,"80561000-4, Serviços de formação em matéria de saúde","Centro Hospitalar de Entre o Douro e Vouga, E.P.E. (508878462)",UpToDate (043310941),"25.128,46 €",24-01-2017,07-09-2016,365 dias,"Portugal, Aveiro, Santa Maria da Feira","Artigo 24.º, n.º 1, alínea e) do Código dos Contratos Públicos",,,,,,Não aplicável.,Não aplicável.,FALSE
02/00016.26/2016 - Aquisição de Próteses de Anca Primárias,Concurso público,Aquisição de bens móveis,"33183200-8, Próteses ortopédicas","Centro Hospitalar de Entre o Douro e Vouga, E.P.E. (508878462)","JOHNSON & JOHNSON, LDA  (500153370)","157.401,00 €",24-01-2017,10-08-2016,180 dias,"Portugal, Aveiro, Santa Maria da Feira",Artigo 155.º do Código dos Contratos Públicos,,,,,,Não aplicável.,Não aplicável.,FALSE
Aquisição de Neostigmina 0.5mg/1ml sol inj fr 1 ml,Ajuste Direto Regime Geral,Aquisição de bens móveis,"33000000-0, Equipamento médico, medicamentos e produtos para cuidados pessoais","Centro Hospitalar de Entre o Douro e Vouga, E.P.E. (508878462)","B. BRAUN MEDICAL, LDA. (501506543)","1.620,00 €",24-01-2017,27-04-2016,365 dias,"Portugal, Aveiro, Santa Maria da Feira","Artigo 24.º, n.º 1, alínea e) do Código dos Contratos Públicos",,,,,,Não aplicável.,Não aplicável.,FALSE
Aq. Secucinumab 150mg/1ml sol inj ser 0.9ml sc,Ajuste Direto Regime Geral,Aquisição de bens móveis,"33000000-0, Equipamento médico, medicamentos e produtos para cuidados pessoais","Centro Hospitalar de Entre o Douro e Vouga, E.P.E. (508878462)","NOVARTIS FARMA-PRODUT.FARMACEUTICOS, SA (500063524)","6.226,80 €",24-01-2017,12-12-2016,17 dias,"Portugal, Aveiro, Santa Maria da Feira","Artigo 24.º, n.º 1, alínea e) do Código dos Contratos Públicos",,,,,,Não aplicável.,Não aplicável.,FALSE
Aq. de Medicamentos Exclusivos Omega,Ajuste Direto Regime Geral,Aquisição de bens móveis,"33000000-0, Equipamento médico, medicamentos e produtos para cuidados pessoais","Centro Hospitalar de Entre o Douro e Vouga, E.P.E. (508878462)",Ómega Pharma Portuguesa (506112233),"3.052,30 €",24-01-2017,16-03-2016,365 dias,"Portugal, Aveiro, Santa Maria da Feira","Artigo 24.º, n.º 1, alínea e) do Código dos Contratos Públicos",,,,,,Não aplicável.,Não aplicável.,FALSE
Aquisição de Produtos Hoteleiros,Concurso público,Aquisição de bens móveis,"39830000-9, Produtos de limpeza","Centro Hospitalar de Entre o Douro e Vouga, E.P.E. (508878462)",JORGE ALMEIDA LDA. (503611956),"378,00 €",24-01-2017,03-08-2016,1095 dias,"Portugal, Aveiro, Santa Maria da Feira","Artigo 20.º, n.º 1, alínea b) do Código dos Contratos Públicos",,,,,,Não aplicável.,Não aplicável.,FALSE
Aquisição de Produtos Hoteleiros,Concurso público,Aquisição de bens móveis,"39830000-9, Produtos de limpeza","Centro Hospitalar de Entre o Douro e Vouga, E.P.E. (508878462)",Caimalider. Lda (513070788),"193,20 €",24-01-2017,03-08-2016,1095 dias,"Portugal, Aveiro, Santa Maria da Feira","Artigo 20.º, n.º 1, alínea b) do Código dos Contratos Públicos",,,,,,Não aplicável.,Não aplicável.,FALSE
Aquisição de Produtos Hoteleiros,Concurso público,Aquisição de bens móveis,"39830000-9, Produtos de limpeza","Centro Hospitalar de Entre o Douro e Vouga, E.P.E. (508878462)","Prodyalca - Comércio de Produtos Químicos, Ld (506565165)","1.213,20 €",24-01-2017,03-08-2016,1095 dias,"Portugal, Aveiro, Santa Maria da Feira","Artigo 20.º, n.º 1, alínea b) do Código dos Contratos Públicos",,,,,,Não aplicável.,Não aplicável.,FALSE
Aquisição de Produtos Hoteleiros,Concurso público,Aquisição de bens móveis,"39830000-9, Produtos de limpeza","Centro Hospitalar de Entre o Douro e Vouga, E.P.E. (508878462)",MEILEX (501759441),"1.900,80 €",24-01-2017,03-08-2016,1095 dias,"Portugal, Aveiro, Santa Maria da Feira","Artigo 20.º, n.º 1, alínea b) do Código dos Contratos Públicos",,,,,,Não aplicável.,Não aplicável.,FALSE
Aquisição de Produtos Hoteleiros,Concurso público,Aquisição de bens móveis,"39830000-9, Produtos de limpeza","Centro Hospitalar de Entre o Douro e Vouga, E.P.E. (508878462)","ASC - Comercio de Produtos de Higiene, Lda (505495414)","2.880,75 €",24-01-2017,03-08-2016,1095 dias,"Portugal, Aveiro, Santa Maria da Feira","Artigo 20.º, n.º 1, alínea b) do Código dos Contratos Públicos",,,,,,Não aplicável.,Não aplicável.,FALSE
Aq. de Morfina 10mg/1ml sol inj fr 1ml im iv,Ajuste Direto Regime Geral,Aquisição de bens móveis,"33000000-0, Equipamento médico, medicamentos e produtos para cuidados pessoais","Centro Hospitalar de Entre o Douro e Vouga, E.P.E. (508878462)","LABESFAL-LABORATORIOS ALMIRO, SA (501169580)","76.133,40 €",24-01-2017,15-03-2016,365 dias,"Portugal, Aveiro, Santa Maria da Feira","Artigo 20.º, n.º 1, alínea a) do Código dos Contratos Públicos",,,,,,Não aplicável.,Não aplicável.,FALSE
Aquisição de Produtos Hoteleiros,Concurso público,Aquisição de bens móveis,"39830000-9, Produtos de limpeza","Centro Hospitalar de Entre o Douro e Vouga, E.P.E. (508878462)","H.R.  - HOSPITALAR, UNIPESSOAL, LDA (501895558)","4.917,00 €",24-01-2017,03-08-2016,1095 dias,"Portugal, Aveiro, Santa Maria da Feira","Artigo 20.º, n.º 1, alínea b) do Código dos Contratos Públicos",,,,,,Não aplicável.,Não aplicável.,FALSE
Aquisição de Produtos Hoteleiros,Concurso público,Aquisição de bens móveis,"39830000-9, Produtos de limpeza","Centro Hospitalar de Entre o Douro e Vouga, E.P.E. (508878462)",PROSAM (505954613),"9.900,00 €",24-01-2017,03-08-2016,1095 dias,"Portugal, Aveiro, Santa Maria da Feira","Artigo 20.º, n.º 1, alínea b) do Código dos Contratos Públicos",,,,,,Não aplicável.,Não aplicável.,FALSE
Aquisição de Produtos Hoteleiros,Concurso público,Aquisição de bens móveis,"39830000-9, Produtos de limpeza","Centro Hospitalar de Entre o Douro e Vouga, E.P.E. (508878462)",J. M. Silva (503667544),"12.607,29 €",24-01-2017,03-08-2016,1095 dias,"Portugal, Aveiro, Santa Maria da Feira","Artigo 20.º, n.º 1, alínea b) do Código dos Contratos Públicos",,,,,,Não aplicável.,Não aplicável.,FALSE
Aquisição de Produtos Hoteleiros,Concurso público,Aquisição de bens móveis,"39830000-9, Produtos de limpeza","Centro Hospitalar de Entre o Douro e Vouga, E.P.E. (508878462)",JORGE ALMEIDA LDA. (503611956),"17.961,81 €",24-01-2017,03-08-2016,1095 dias,"Portugal, Aveiro, Santa Maria da Feira","Artigo 20.º, n.º 1, alínea b) do Código dos Contratos Públicos",,,,,,Não aplicável.,Não aplicável.,FALSE
Aquisição de Produtos Hoteleiros,Concurso público,Aquisição de bens móveis,"39830000-9, Produtos de limpeza","Centro Hospitalar de Entre o Douro e Vouga, E.P.E. (508878462)","A. J. OLIVEIRA,LDA (502293748)","50.897,72 €",24-01-2017,03-08-2016,1095 dias,"Portugal, Aveiro, Santa Maria da Feira","Artigo 20.º, n.º 1, alínea b) do Código dos Contratos Públicos",,,,,,Não aplicável.,Não aplicável.,FALSE
Aquisição de Clip Descartável Standard 90ª,Ajuste Direto Regime Geral,Aquisição de bens móveis,"33141120-7, Clipes, suturas, ligaduras","Centro Hospitalar de Entre o Douro e Vouga, E.P.E. (508878462)","OLYMPUS IBERIA, S.A.U. (980474710)","400,00 €",24-01-2017,03-06-2016,365 dias,"Portugal, Aveiro, Santa Maria da Feira","Artigo 20.º, n.º 1, alínea a) do Código dos Contratos Públicos",,,,,,Não aplicável.,Não aplicável.,FALSE
Aquisição de Serviços na Área da Comunicação,Ajuste Direto Regime Geral,Aquisição de serviços,"79000000-4, Serviços a empresas: direito, comercialização, consultoria, recrutamento, impressão e segurança","Centro Hospitalar de Entre o Douro e Vouga, E.P.E. (508878462)","Globiprotec, Unip. Lda (508194970)","21.000,00 €",24-01-2017,29-12-2016,365 dias,"Portugal, Aveiro, Santa Maria da Feira","Artigo 20.º, n.º 1, alínea a) do Código dos Contratos Públicos",,,,,,Não aplicável.,Não aplicável.,FALSE
Aquisição de Produtos Hoteleiros,Concurso público,Aquisição de bens móveis,"39830000-9, Produtos de limpeza","Centro Hospitalar de Entre o Douro e Vouga, E.P.E. (508878462)",AIR LIQUIDE (501576436),"64.160,70 €",24-01-2017,03-08-2016,1095 dias,"Portugal, Aveiro, Santa Maria da Feira","Artigo 20.º, n.º 1, alínea b) do Código dos Contratos Públicos",,,,,,Não aplicável.,Não aplicável.,FALSE
Aq. regorafenib 40mg comp.,Ajuste Direto Regime Geral,Aquisição de bens móveis,"33000000-0, Equipamento médico, medicamentos e produtos para cuidados pessoais","Centro Hospitalar de Entre o Douro e Vouga, E.P.E. (508878462)","BAYER PORTUGAL, LDA (500043256)","2.382,66 €",24-01-2017,12-01-2017,14 dias,"Portugal, Aveiro, Santa Maria da Feira","Artigo 20.º, n.º 1, alínea a) do Código dos Contratos Públicos",,,,,,Não aplicável.,Não aplicável.,FALSE
Aquisição Azitromicina 3.75mg/0.25g col,Ajuste Direto Regime Geral,Aquisição de bens móveis,"33000000-0, Equipamento médico, medicamentos e produtos para cuidados pessoais","Centro Hospitalar de Entre o Douro e Vouga, E.P.E. (508878462)",Théa Portugal (507978358),"1.437,15 €",24-01-2017,28-01-2016,365 dias,"Portugal, Aveiro, Santa Maria da Feira","Artigo 20.º, n.º 1, alínea a) do Código dos Contratos Públicos",,,,,,Não aplicável.,Não aplicável.,FALSE
06/00008.11/2016 - Aquisição de Octreotidos,Ao abrigo de acordo-quadro (art.º 259.º),Aquisição de bens móveis,"33600000-6, Produtos farmacêuticos","Centro Hospitalar de Entre o Douro e Vouga, E.P.E. (508878462)",Novartis Farma (500063524),"345.588,60 €",24-01-2017,16-03-2016,365 dias,"Portugal, Aveiro, Santa Maria da Feira",Artigo 259.º do Código dos Contratos Públicos,,,,,,1415640,CP 2015/7 - ACORDO QUADRO PARA FORNECIMENTO DE HORMONAS E OUTROS MEDICAMENTOS USADOS NO TRATAMENTO DAS DOENÇAS ENDÓCRINAS ÀS INSTITUIÇÕES E SERVIÇOS DO SERVIÇO NACIONAL DE SAÚDE,FALSE
Aquisição de Máquina e Recarga para Máquina de Sutura Endoscópia 60mm,Ajuste Direto Regime Geral,Aquisição de bens móveis,"33141120-7, Clipes, suturas, ligaduras","CENTRO HOSPITALAR DE ENTRE O DOURO E VOUGA, E.P.E. (508878462)","Johnson & Johnson, Lda. (500153370)","45.640,00 €",24-01-2017,05-02-2016,365 dias,"Portugal, Aveiro, Santa Maria da Feira","Artigo 24.º, n.º 1, alínea e) do Código dos Contratos Públicos",,,,,,Não aplicável.,Não aplicável.,FALSE
"Aquisição de Diversos Cateteres, Sistemas de Administração e Outros",Concurso público,Aquisição de bens móveis,"33140000-3, Material médico de consumo","Centro Hospitalar de Entre o Douro e Vouga, E.P.E. (508878462)",GRIFOLS PORTUGAL-PROD. FARM. HOSPI. LDA (502041285),"2.900,00 €",24-01-2017,16-06-2015,730 dias,"Portugal, Aveiro, Santa Maria da Feira","Artigo 20.º, n.º 1, alínea b) do Código dos Contratos Públicos",,,,,,Não aplicável.,Não aplicável.,FALSE
"Aquisição de Diversos Cateteres, Sistemas de Administração e Outros.",Concurso público,Aquisição de bens móveis,"33140000-3, Material médico de consumo","Centro Hospitalar de Entre o Douro e Vouga, E.P.E. (508878462)","MEDINFAR-SOROLÓGICO, SA (501197052)","4.400,00 €",24-01-2017,16-06-2015,730 dias,"Portugal, Aveiro, Santa Maria da Feira","Artigo 20.º, n.º 1, alínea b) do Código dos Contratos Públicos",,,,,,Não aplicável.,Não aplicável.,FALSE
"Aquisição de Diversos Cateteres, Sistemas de Administração e Outros.",Concurso público,Aquisição de bens móveis,"33140000-3, Material médico de consumo","Centro Hospitalar de Entre o Douro e Vouga, E.P.E. (508878462)","H.R. - HOSPITALAR, UNIPESSOAL, LDA (501895558)","275,00 €",24-01-2017,16-06-2015,730 dias,"Portugal, Aveiro, Santa Maria da Feira","Artigo 20.º, n.º 1, alínea b) do Código dos Contratos Públicos",,,,,,Não aplicável.,Não aplicável.,FALSE
"Aquisição de Diversos Cateteres, Sistemas de Administração e Outros.",Concurso público,Aquisição de bens móveis,"33140000-3, Material médico de consumo","Centro Hospitalar de Entre o Douro e Vouga, E.P.E. (508878462)","B. BRAUN MEDICAL, LDA (501506543)","8.351,60 €",24-01-2017,16-06-2015,730 dias,"Portugal, Aveiro, Santa Maria da Feira","Artigo 20.º, n.º 1, alínea b) do Código dos Contratos Públicos",,,,,,Não aplicável.,Não aplicável.,FALSE
"Aquisição de Diversos Cateteres, Sistemas de Administração e Outros.",Concurso público,Aquisição de bens móveis,"33140000-3, Material médico de consumo","Centro Hospitalar de Entre o Douro e Vouga, E.P.E. (508878462)",P.M.H.PROD.MEDICOS HOSPITALAR (502376899),"2.875,00 €",24-01-2017,16-06-2015,730 dias,"Portugal, Aveiro, Santa Maria da Feira","Artigo 20.º, n.º 1, alínea b) do Código dos Contratos Públicos",,,,,,Não aplicável.,Não aplicável.,FALSE
"Aquisição de Diversos Cateteres, Sistemas de Administração e Outros",Concurso público,Aquisição de bens móveis,"33140000-3, Material médico de consumo","Centro Hospitalar de Entre o Douro e Vouga, E.P.E. (508878462)","MEDICINÁLIA-CORMEDICA, LDA (500684324)","22,00 €",24-01-2017,16-06-2015,730 dias,"Portugal, Aveiro, Santa Maria da Feira","Artigo 20.º, n.º 1, alínea b) do Código dos Contratos Públicos",,,,,,Não aplicável.,Não aplicável.,FALSE
"Diverso de Cateteres, Sistemas de Administração e outros",Concurso público,Aquisição de bens móveis,"33140000-3, Material médico de consumo","Centro Hospitalar de Entre o Douro e Vouga, E.P.E. (508878462)",SPCARE - ESPECIALIDADES FARMACEUTICAS.LDA (508284872),"176,00 €",24-01-2017,16-06-2015,730 dias,"Portugal, Aveiro, Santa Maria da Feira","Artigo 20.º, n.º 1, alínea b) do Código dos Contratos Públicos",,,,,,Não aplicável.,Não aplicável.,FALSE
"Diverso de Cateteres, Sistemas de Administração e outros",Concurso público,Aquisição de bens móveis,"33140000-3, Material médico de consumo","Centro Hospitalar de Entre o Douro e Vouga, E.P.E. (508878462)","Vygon (Portugal) - Produtos Médicos e Farmacêuticos, Lda (503232785)","69.279,50 €",24-01-2017,15-06-2015,730 dias,"Portugal, Aveiro, Santa Maria da Feira","Artigo 20.º, n.º 1, alínea b) do Código dos Contratos Públicos",,,,,,Não aplicável.,Não aplicável.,FALSE
Aquisição de Meios de Contraste Radiológico,Concurso público,Aquisição de bens móveis,"33696800-3, Meios de contraste para raios X","Centro Hospitalar de Entre o Douro e Vouga, E.P.E. (508878462)","Bayer Portugal, S.A. (500043256)","347.483,40 €",24-01-2017,18-04-2016,1095 dias,"Portugal, Aveiro, Santa Maria da Feira","Artigo 20.º, n.º 1, alínea b) do Código dos Contratos Públicos",,,,,,Não aplicável.,Não aplicável.,FALSE
Máquinas de Sutura Linear,Concurso público,Aquisição de bens móveis,"33169000-2, Material cirúrgico","Centro Hospitalar de Entre o Douro e Vouga, E.P.E. (508878462)","Endotécnica - Material Cirúrgico, Lda (503818348)","7.200,00 €",23-01-2017,14-05-2015,730 dias,"Portugal, Aveiro, Santa Maria da Feira","Artigo 20.º, n.º 1, alínea b) do Código dos Contratos Públicos",,,,,,Não aplicável.,Não aplicável.,FALSE
Máquinas de Sutura Linear,Concurso público,Aquisição de bens móveis,"33169000-2, Material cirúrgico","Centro Hospitalar de Entre o Douro e Vouga, E.P.E. (508878462)","Johson & Johnson, Lda (500153370)","121.818,00 €",23-01-2017,20-05-2015,730 dias,"Portugal, Aveiro, Santa Maria da Feira","Artigo 20.º, n.º 1, alínea b) do Código dos Contratos Públicos",,,,,,Não aplicável.,Não aplicável.,FALSE
Aquisição de Seguro de Acidentes de Trabalho,Concurso público,Aquisição de serviços,"66512100-3, Serviços de seguros de acidentes","Centro Hospitalar de Entre o Douro e Vouga, E.P.E. (508878462)",Sosel - Corretores de Seguros SA (502379707),"254.667,30 €",23-01-2017,30-12-2015,365 dias,"Portugal, Aveiro, Santa Maria da Feira","Artigo 20.º, n.º 1, alínea b) do Código dos Contratos Públicos",,,,,,Não aplicável.,Não aplicável.,FALSE
