Objeto do Contrato,Tipo de Procedimento,Tipo(s) de Contrato,CPVs,Entidade(s) Adjudicante(s),Entidade(s) Adjudicatária(s),Preço Contratual,Data de Publicação,Data de Celebração do Contrato,Prazo de Execução,Local de Execução,Fundamentação,Data de Fecho do Contrato,Preço Total Efetivo,Causas das Alterações ao Prazo,Causas das Alterações ao Preço,Estado,N.º registo do Acordo Quadro,Descrição do Acordo Quadro,Procedimento Centralizado
CPR 0125/18 - Aquisição de mangas elásticas,Consulta Prévia,Aquisição de bens móveis,"33100000-1, Equipamento médico","IPO Porto FG, EPE (506362299)",MEDIVARIS-REPRES.MEDICAS LDA (502625422),"10.315,00 €",18-01-2019,01-01-2019,365 dias,"Portugal, Porto, Porto","Artigo 20.º, n.º 1, alínea c) do Código dos Contratos Públicos",,,,,,Não aplicável.,Não aplicável.,FALSE
Aquisição de fonte de eletrocirurgia,Consulta Prévia,Aquisição de bens móveis,"33161000-6, Unidade de electrocirurgia","IPO Porto FG, EPE (506362299)","ANGOSAÚDE - EQUIPAMENTOS DE SAÚDE, S.A. (507016882)","24.541,58 €",16-01-2019,12-09-2018,20 dias,"Portugal, Porto, Porto","Artigo 20.º, n.º 1, alínea c) do Código dos Contratos Públicos",,,,,,Não aplicável.,Não aplicável.,FALSE
"REPARAÇÃO DE MESA DE OPERAÇÕES, SALA 0",Ajuste Direto Regime Geral,Aquisição de serviços,"50400000-9, Serviços de reparação e manutenção de equipamento médico e de precisão","Instituto Português de Oncologia do Porto Francisco Gentil, E. P. E. (506362299)","Getinge Group Portugal, Unipessoal, Lda. (506819698)","5.947,03 €",16-01-2019,04-12-2018,20 dias,"Portugal, Porto, Porto","Artigo 24.º, n.º 1, alínea e), subalínea ii) do Código dos Contratos Públicos",,,,,,Não aplicável.,Não aplicável.,FALSE
MANUTENÇÃO DE SEPARADOR CELULAR AUTOMACS,Ajuste Direto Regime Geral,Aquisição de serviços,"50400000-9, Serviços de reparação e manutenção de equipamento médico e de precisão","Instituto Português de Oncologia do Porto Francisco Gentil, E. P. E. (506362299)","Citomed - Equipamentos Reagentes Laboratório, Lda (503492043)","12.916,00 €",16-01-2019,04-12-2018,20 dias,"Portugal, Porto, Porto","Artigo 24.º, n.º 1, alínea e), subalínea ii) do Código dos Contratos Públicos",,,,,,Não aplicável.,Não aplicável.,FALSE
Aquisição de medicamentos - Pegaspargase,Ajuste Direto Regime Geral,Aquisição de bens móveis,"33600000-6, Produtos farmacêuticos","Instituto Português de Oncologia do Porto Francisco Gentil, E. P. E. (506362299)",shire (509264662),"44.852,40 €",16-01-2019,28-12-2018,20 dias,"Portugal, Porto, Porto","Artigo 24.º, n.º 1, alínea e), subalínea ii) do Código dos Contratos Públicos",,,,,,Não aplicável.,Não aplicável.,FALSE
Aquisição centralizada SPMS - P259-2018-95 - BevacizUMAB,Ao abrigo de acordo-quadro (art.º 259.º),Aquisição de bens móveis,"33600000-6, Produtos farmacêuticos","Instituto Português de Oncologia do Porto Francisco Gentil, E. P. E. (506362299)","Roche Farmacêutica Química, Lda (500233810)","437.127,20 €",16-01-2019,29-08-2018,123 dias,"Portugal, Porto, Porto",Artigo 259.º do Código dos Contratos Públicos,,,,,,2969238,"CP 2017/6 - Acordo Quadro para fornecimento de Medicamentos do Foro Oncológico e Imunomoduladores, às Instituições e Serviços do Serviço Nacional de Saúde",FALSE
Aquisição de medicamentos - Palbociclib; SUNitinib; Crizotinib,Ajuste Direto Regime Geral,Aquisição de bens móveis,"33600000-6, Produtos farmacêuticos","Instituto Português de Oncologia do Porto Francisco Gentil, E. P. E. (506362299)","PFIZER BIOFARMACEUTICA, SOCIEDADE UNIPESSOAL, LDA (513300376)","167.429,08 €",16-01-2019,18-12-2018,20 dias,"Portugal, Porto, Porto","Artigo 24.º, n.º 1, alínea e), subalínea ii) do Código dos Contratos Públicos",,,,,,Não aplicável.,Não aplicável.,FALSE
Aquisição de medicamentos - Parecoxib; SUNitinib; Crizotinib; Palbociclib; Pegvisomant ,Ajuste Direto Regime Geral,Aquisição de bens móveis,"33600000-6, Produtos farmacêuticos","Instituto Português de Oncologia do Porto Francisco Gentil, E. P. E. (506362299)","PFIZER BIOFARMACEUTICA, SOCIEDADE UNIPESSOAL, LDA (513300376)","130.651,46 €",16-01-2019,23-11-2018,20 dias,"Portugal, Porto, Porto","Artigo 24.º, n.º 1, alínea e), subalínea ii) do Código dos Contratos Públicos",,,,,,Não aplicável.,Não aplicável.,FALSE
Aquisição de medicamentos - Palbociclib,Ajuste Direto Regime Geral,Aquisição de bens móveis,"33600000-6, Produtos farmacêuticos","Instituto Português de Oncologia do Porto Francisco Gentil, E. P. E. (506362299)","PFIZER BIOFARMACEUTICA, SOCIEDADE UNIPESSOAL, LDA (513300376)","189.000,03 €",16-01-2019,06-11-2018,20 dias,"Portugal, Porto, Porto","Artigo 24.º, n.º 1, alínea e), subalínea ii) do Código dos Contratos Públicos",,,,,,Não aplicável.,Não aplicável.,FALSE
Aquisição de medicamentos - Enzalutamida e Micafungina,Ajuste Direto Regime Geral,Aquisição de bens móveis,"33600000-6, Produtos farmacêuticos","Instituto Português de Oncologia do Porto Francisco Gentil, E. P. E. (506362299)","ASTELLAS FARMA, LDA (502540249)","142.229,30 €",15-01-2019,07-12-2018,20 dias,"Portugal, Porto, Porto","Artigo 24.º, n.º 1, alínea e), subalínea ii) do Código dos Contratos Públicos",,,,,,Não aplicável.,Não aplicável.,FALSE
SISTEMA DE DETECÇÃO ULTRA VIEW VENTANA; PROBNP G2 ELECSYS COBAS E 100; TESTES DE QUALIDADE; REAGENTES P/ TAN; COBAS EGFR MUTATION KIT ,Ajuste Direto Regime Geral,Aquisição de bens móveis,"33690000-3, Medicamentos vários","Instituto Português de Oncologia do Porto Francisco Gentil, E. P. E. (506362299)",ROCHE SISTEMA DE DIAGNOSTICOS (504282921),"93.322,92 €",15-01-2019,12-12-2018,20 dias,"Portugal, Porto, Porto","Artigo 24.º, n.º 1, alínea e), subalínea ii) do Código dos Contratos Públicos",,,,,,Não aplicável.,Não aplicável.,FALSE
Aquisição de BOMBAS INFUSORAS USO UNICO,Ajuste Direto Regime Geral,Aquisição de bens móveis,"33600000-6, Produtos farmacêuticos","Instituto Português de Oncologia do Porto Francisco Gentil, E. P. E. (506362299)","BAXTER MEDICO - FARMACEUTICO, LDA (503347345)","40.320,00 €",15-01-2019,05-12-2018,20 dias,"Portugal, Porto, Porto","Artigo 24.º, n.º 1, alínea e), subalínea ii) do Código dos Contratos Públicos",,,,,,Não aplicável.,Não aplicável.,FALSE
Aquisição de Reagentes STA,Ajuste Direto Regime Geral,Aquisição de bens móveis,"33696000-5, Reagentes e meios de contraste","Instituto Português de Oncologia do Porto Francisco Gentil, E. P. E. (506362299)","STAGO PORTUGAL,UNIPESSOAL,LDA (509952976)","13.634,57 €",15-01-2019,10-10-2018,20 dias,"Portugal, Porto, Porto","Artigo 20.º, n.º 1, alínea d) do Código dos Contratos Públicos",,,,,,Não aplicável.,Não aplicável.,FALSE
Aquisição de medicamentos - Defibrotido,Ajuste Direto Regime Geral,Aquisição de bens móveis,"33600000-6, Produtos farmacêuticos","Instituto Português de Oncologia do Porto Francisco Gentil, E. P. E. (506362299)",JAZZ PHARMACEUTICALS FRANCE SUCURSAL PORTUGAL (980540380),"89.460,00 €",11-01-2019,19-12-2018,20 dias,"Portugal, Porto, Porto","Artigo 24.º, n.º 1, alínea e), subalínea ii) do Código dos Contratos Públicos",,,,,,Não aplicável.,Não aplicável.,FALSE
Aquisição de medicamentos - Imunoglobulina antilinfócitos (coelho) e Ponatinib,Ajuste Direto Regime Geral,Aquisição de bens móveis,"33600000-6, Produtos farmacêuticos","Instituto Português de Oncologia do Porto Francisco Gentil, E. P. E. (506362299)",ALLOGA PORTUGAL (504507230),"46.608,82 €",11-01-2019,14-12-2018,20 dias,"Portugal, Porto, Porto","Artigo 24.º, n.º 1, alínea e), subalínea ii) do Código dos Contratos Públicos",,,,,,Não aplicável.,Não aplicável.,FALSE
MÁSCARA CRANIAL PARA RADIOTERAPIA,Ajuste Direto Regime Geral,Aquisição de bens móveis,"33150000-6, Dispositivos de radioterapia, mecanoterapia, electroterapia e fisioterapia","Instituto Português de Oncologia do Porto Francisco Gentil, E. P. E. (506362299)",Brainlab Sales GmbH (198159823),"7.575,00 €",11-01-2019,26-11-2018,20 dias,"Portugal, Porto, Porto","Artigo 24.º, n.º 1, alínea e), subalínea ii) do Código dos Contratos Públicos",,,,,,Não aplicável.,Não aplicável.,FALSE
