Objeto do Contrato,Tipo de Procedimento,Tipo(s) de Contrato,CPVs,Entidade(s) Adjudicante(s),Entidade(s) Adjudicatária(s),Preço Contratual,Data de Publicação,Data de Celebração do Contrato,Prazo de Execução,Local de Execução,Fundamentação,Data de Fecho do Contrato,Preço Total Efetivo,Causas das Alterações ao Prazo,Causas das Alterações ao Preço,Estado,N.º registo do Acordo Quadro,Descrição do Acordo Quadro,Procedimento Centralizado
"Aquisição de serviços de manutenção e suporte para as unidades de climatização, energia e segurança do Datacenter do Porto",Concurso público,Aquisição de serviços,"50312600-1, Manutenção e reparação de equipamento para as tecnologias da informação","SPMS- Serviços Partilhados do M. da Saúde, E.P.E. (509540716)",MAXIGLOBAL EQUIPAMENTOS E SERVIÇOS DE INFORMATICA SA (504320882),"11.200,00 €",30-07-2018,10-07-2018,365 dias,Portugal,"Artigo 20.º, n.º 1, alínea a) do Código dos Contratos Públicos",,,,,,Não aplicável.,Não aplicável.,FALSE
"Empreitada para remodelação e adaptação do edifício da SPMS, em Lisboa ",Concurso público,Empreitadas de obras públicas,"45259900-6, Modernização de instalações","SPMS- Serviços Partilhados do M. da Saúde, E.P.E. (509540716)",CADIMARTE-CONSTRUÇÕES LDA (502341165),"599.900,00 €",27-07-2018,10-04-2018,180 dias,Portugal,Artigo 28.º do Código dos Contratos Públicos,,,,,,Não aplicável.,Não aplicável.,FALSE
"Aquisição, Implementação e Exploração de Rede Informática da Saúde (RIS) ",Ajuste Direto Regime Geral,Aquisição de serviços,"72500000-0, Serviços relacionados com a informática","SPMS - Serviços Partilhados do Ministério da Saúde, E. P. E. (509540716)","NOS COMUNICACOES, S.A. (502604751)","720.000,00 €",26-07-2018,26-03-2018,180 dias,Portugal,"Artigo 24.º, n.º 1, alínea e) do Código dos Contratos Públicos",,,,,,Não aplicável.,Não aplicável.,FALSE
Serviços de assessoria Jurídica especializada (CCM),Ajuste Direto Regime Geral,Aquisição de serviços,"79411000-8, Serviços gerais de consultoria em matéria de gestão geral","SPMS - Serviços Partilhados do Ministério da Saúde, E. P. E. (509540716)","Telles de Abreu & Associados - Sociedade de Advogados, SP, RL (502790652)","19.050,00 €",26-07-2018,06-07-2018,180 dias,Portugal,"Artigo 20.º, n.º 1, alínea d) do Código dos Contratos Públicos",,,,,,Não aplicável.,Não aplicável.,FALSE
CP-AC-208-08 Aquisição de caricas (safecooker) no âmbito do programa troca de seringas,Concurso público,Aquisição de bens móveis,"33000000-0, Equipamento médico, medicamentos e produtos para cuidados pessoais","SPMS - Serviços Partilhados do Ministério da Saúde, E. P. E. (509540716)",Aphoticom Distribution (94501839971),"39.500,00 €",24-07-2018,29-06-2018,243 dias,"Portugal, Lisboa","Artigo 20.º, n.º 1, alínea a) do Código dos Contratos Públicos",,,,,,Não aplicável.,Não aplicável.,FALSE
Serviços de transferência e monitorização do Centro de Conferência e Monitorização (CCM SNS),Ajuste Direto Regime Geral,Aquisição de serviços,"79411000-8, Serviços gerais de consultoria em matéria de gestão geral","SPMS - Serviços Partilhados do Ministério da Saúde, E. P. E. (509540716)","Meo-Serviços de Comunicações e Multimédia, S.A (504615947)","320.036,00 €",23-07-2018,04-07-2018,90 dias,Portugal,"Artigo 24.º, n.º 1, alínea e), subalínea ii) do Código dos Contratos Públicos",,,,,,Não aplicável.,Não aplicável.,FALSE
Serviços para construção de modelos de avaliação de propostas,Ajuste Direto Regime Geral,Aquisição de serviços,"79418000-7, Serviços de consultoria em matéria de aquisições","SPMS - Serviços Partilhados do Ministério da Saúde, E. P. E. (509540716)",Bana Consulting Lda  (507505280),"19.950,00 €",23-07-2018,02-07-2018,180 dias,Portugal,"Artigo 20.º, n.º 1, alínea d) do Código dos Contratos Públicos",,,,,,Não aplicável.,Não aplicável.,FALSE
Convite ao abrigo do acordo quadro - Serviços para apoio ao PMO,Ao abrigo de acordo-quadro (art.º 259.º),Aquisição de serviços,"72500000-0, Serviços relacionados com a informática","SPMS - Serviços Partilhados do Ministério da Saúde, E. P. E. (509540716)","ALTRANPORTUGAL, SA (504272179)","67.445,00 €",23-07-2018,26-06-2018,360 dias,Portugal,Artigo 259.º do Código dos Contratos Públicos,,,,,,1423482,CELEBRAÇÃO DE ACORDO QUADRO PARA PRESTAÇÃO DE SERVIÇOS TIC E INTEROPERABILIDADE NA ÁREA DA SAÚDE,FALSE
Aquisição de serviços especializados para auditoria ao NPC EHEALTH,Ajuste Direto Regime Geral,Aquisição de serviços,"79212000-3, Serviços de auditoria","SPMS - Serviços Partilhados do Ministério da Saúde, E. P. E. (509540716)",Accenture Consultores de Gestão S.A (502309440),"12.000,00 €",23-07-2018,14-06-2018,15 dias,Portugal,"Artigo 20.º, n.º 1, alínea d) do Código dos Contratos Públicos",,,,,,Não aplicável.,Não aplicável.,FALSE
Serviços de Requalificação de Imagens das Salas,Ajuste Direto Regime Geral,Aquisição de serviços,"79822500-7, Serviços de concepção gráfica","SPMS - Serviços Partilhados do Ministério da Saúde, E. P. E. (509540716)","Shape - We Gather Ideas, Lda (514359196)","19.980,00 €",23-07-2018,25-06-2018,179 dias,Portugal,"Artigo 20.º, n.º 1, alínea a) do Código dos Contratos Públicos",,,,,,Não aplicável.,Não aplicável.,FALSE
(DCPI) CONCURSO PÚBLICO COM PUBLICIDADE NO JORNAL OFICIAL DA UNIÃO EUROPEIA PARA AQUISIÇÃO DE SERVIÇOS ESPECIALIZADOS PARA A ÁREA DE RECURSOS HUMANOS (20180182),Concurso público,Aquisição de serviços,"79414000-9, Serviços de consultoria em matéria de gestão de recursos humanos","SPMS- Serviços Partilhados do M. da Saúde, E.P.E. (509540716)",SEARCHWIND (509042635),"62.570,00 €",23-07-2018,29-06-2018,304 dias,Portugal,"Artigo 20.º, n.º 1, alínea a) do Código dos Contratos Públicos",,,,,,Não aplicável.,Não aplicável.,FALSE
(DCPI) CONCURSO PÚBLICO COM PUBLICIDADE NO JORNAL OFICIAL DA UNIÃO EUROPEIA PARA AQUISIÇÃO DE SERVIÇOS ESPECIALIZADOS PARA A ÁREA DE RECURSOS HUMANOS (20180182),Concurso público,Aquisição de serviços,"79414000-9, Serviços de consultoria em matéria de gestão de recursos humanos","SPMS- Serviços Partilhados do M. da Saúde, E.P.E. (509540716)",SEARCHWIND (509042635),"95.850,00 €",23-07-2018,29-06-2018,304 dias,Portugal,"Artigo 20.º, n.º 1, alínea a) do Código dos Contratos Públicos",,,,,,Não aplicável.,Não aplicável.,FALSE
