Objeto do Contrato,Tipo de Procedimento,Tipo(s) de Contrato,CPVs,Entidade(s) Adjudicante(s),Entidade(s) Adjudicatária(s),Preço Contratual,Data de Publicação,Data de Celebração do Contrato,Prazo de Execução,Local de Execução,Fundamentação,Data de Fecho do Contrato,Preço Total Efetivo,Causas das Alterações ao Prazo,Causas das Alterações ao Preço,Estado,N.º registo do Acordo Quadro,Descrição do Acordo Quadro,Procedimento Centralizado
"aquisição de pendente para dupla monitorização, 2 monitores de cirúrgicos HD de endoscopia, um dispositivo  DVR de imagem e registo (como oferta), montagem e instalação incluída",Ajuste Direto Regime Geral,Aquisição de bens móveis,"33168000-5, Aparelhos para endoscopia e endocirurgia","Unidade Local de Saúde do Alto Minho, E. P. E. (508786193)","Mundinter, SA (500199906)","19.269,25 €",30-07-2018,26-07-2018,20 dias,"Portugal, Viana do Castelo","Artigo 24.º, n.º 1, alínea e), subalínea i) do Código dos Contratos Públicos",,,,,,Não aplicável.,Não aplicável.,FALSE
Prestação de Serviços de Colocação e Fornecimento de Pessoal Assistente Operacional - 11 AOS,Consulta Prévia,Aquisição de serviços,"79414000-9, Serviços de consultoria em matéria de gestão de recursos humanos","Unidade Local de Saúde do Alto Minho, E. P. E. (508786193)","Wake Talente Unipessoal, Lda (510195636)","64.655,36 €",27-07-2018,20-04-2018,120 dias,"Portugal, Viana do Castelo, Viana do Castelo","Artigo 20.º, n.º 1, alínea c) do Código dos Contratos Públicos",,,,,,Não aplicável.,Não aplicável.,FALSE
remoção e colocação de teto no serviço de esterilização,Ajuste Direto Regime Geral,Empreitadas de obras públicas,"45410000-4, Trabalhos de estucagem","Unidade Local de Saúde do Alto Minho, E. P. E. (508786193)","M.N.RAMOS FERREIRA, ENGENHARIA, S.A (501421491)","12.150,00 €",27-07-2018,23-07-2018,30 dias,"Portugal, Viana do Castelo, Viana do Castelo","Artigo 19.º, alínea d) do Código dos Contratos Públicos",,,,,,Não aplicável.,Não aplicável.,FALSE
Prestação de Serviços de Formação para a ULSAM - SBV com DAE,Ajuste Direto Regime Geral,Aquisição de serviços,"79414000-9, Serviços de consultoria em matéria de gestão de recursos humanos","Unidade Local de Saúde do Alto Minho, E. P. E. (508786193)","Instituto Nacional de Emergência Médica, I. P. (501356126)","1.300,00 €",26-07-2018,09-04-2018,1 dias,"Portugal, Viana do Castelo, Viana do Castelo","Artigo 20.º, n.º 1, alínea d) do Código dos Contratos Públicos",,,,,,Não aplicável.,Não aplicável.,FALSE
Formação de Formadores Nível V,Consulta Prévia,Aquisição de serviços,"79414000-9, Serviços de consultoria em matéria de gestão de recursos humanos","Unidade Local de Saúde do Alto Minho, E. P. E. (508786193)","Instituto Nacional de Emergência Médica, I. P. (501356126)","3.400,00 €",26-07-2018,27-03-2018,2 dias,"Portugal, Viana do Castelo, Viana do Castelo","Artigo 20.º, n.º 1, alínea c) do Código dos Contratos Públicos",,,,,,Não aplicável.,Não aplicável.,FALSE
Prestação de Serviços de Formação para a ULSAM – Suporte Avançado de Vida - Instrutores,Consulta Prévia,Aquisição de serviços,"79414000-9, Serviços de consultoria em matéria de gestão de recursos humanos","Unidade Local de Saúde do Alto Minho, E. P. E. (508786193)","Instituto Nacional de Emergência Médica, I. P. (501356126)","5.100,00 €",25-07-2018,24-02-2018,2 dias,"Portugal, Viana do Castelo, Viana do Castelo","Artigo 20.º, n.º 1, alínea c) do Código dos Contratos Públicos",,,,,,Não aplicável.,Não aplicável.,FALSE
Serviços de Colocação e Fornecimento de Pessoal - 5 Administrativos,Consulta Prévia,Aquisição de serviços,"79414000-9, Serviços de consultoria em matéria de gestão de recursos humanos","Unidade Local de Saúde do Alto Minho, E. P. E. (508786193)","RH PORTUGAL - CONSULTORES EM INVESTIMENTOS HUMANOS, LDA (503461245)","5.794,75 €",24-07-2018,20-04-2018,150 dias,"Portugal, Viana do Castelo","Artigo 20.º, n.º 1, alínea c) do Código dos Contratos Públicos",,,,,,Não aplicável.,Não aplicável.,FALSE
prestação de serviços de limpeza hospitalar nas áreas comuns do hospital da santa luzia e do hospital conde bertiandos,Ao abrigo de acordo-quadro (art.º 259.º),Aquisição de serviços<br/>Aquisição de bens móveis,"90910000-9, Serviços de limpeza","Unidade Local de Saúde do Alto Minho, E. P. E. (508786193)","EUROMEX - FACILITY SERVICES, LDA. (502629428)","214.170,00 €",24-07-2018,30-11-2017,1095 dias,"Portugal, Viana do Castelo",Artigo 259.º do Código dos Contratos Públicos,,,,,,614429,Acordo quadro para higiene e limpeza,FALSE
"confeção, fornecimento e distribuição de alimentação aos doentes e funcionários da ulsam",Ajuste Direto Regime Geral,Aquisição de serviços,"55000000-0, Serviços de hotelaria, restauração e comércio a retalho","Unidade Local de Saúde do Alto Minho, E. P. E. (508786193)","Gertal - Companhia Geral de Restaurantes e Alimentação, SA (500126623)","257.274,67 €",24-07-2018,20-07-2018,61 dias,"Portugal, Viana do Castelo","Artigo 24.º, n.º 1, alínea c) do Código dos Contratos Públicos",,,,,,Não aplicável.,Não aplicável.,FALSE
aquisição de serviços de implementação do módulo de citotóxicos.,Ajuste Direto Regime Geral,Aquisição de serviços,"72591000-4, Desenvolvimento de contratos de níveis de serviços","Unidade Local de Saúde do Alto Minho, E. P. E. (508786193)","GLINTT - HEALTHCARE SOLUTIONS, S.A. (502479418)","9.820,00 €",23-07-2018,25-05-2018,20 dias,"Portugal, Viana do Castelo, Viana do Castelo","Artigo 24.º, n.º 1, alínea e), subalínea iii) do Código dos Contratos Públicos",,,,,,Não aplicável.,Não aplicável.,FALSE
