freguesia,acronym,validVotesPercentage,votes,dicofre
União das freguesias de Candoso São Tiago e Mascotelos,PS,42.53,521,030881
União das freguesias de Candoso São Tiago e Mascotelos,PPD/PSD,19.02,233,030881
União das freguesias de Candoso São Tiago e Mascotelos,B.E.,10.86,133,030881
União das freguesias de Candoso São Tiago e Mascotelos,CDS-PP,7.59,93,030881
União das freguesias de Candoso São Tiago e Mascotelos,PAN,5.47,67,030881
União das freguesias de Candoso São Tiago e Mascotelos,PCP-PEV,5.22,64,030881
União das freguesias de Candoso São Tiago e Mascotelos,A,1.63,20,030881
União das freguesias de Candoso São Tiago e Mascotelos,L,1.31,16,030881
União das freguesias de Candoso São Tiago e Mascotelos,PCTP/MRPP,1.22,15,030881
União das freguesias de Candoso São Tiago e Mascotelos,NC,1.14,14,030881
União das freguesias de Candoso São Tiago e Mascotelos,PPM.PPV/CDC,1.14,14,030881
União das freguesias de Candoso São Tiago e Mascotelos,IL,0.9,11,030881
União das freguesias de Candoso São Tiago e Mascotelos,PDR,0.65,8,030881
União das freguesias de Candoso São Tiago e Mascotelos,PURP,0.49,6,030881
União das freguesias de Candoso São Tiago e Mascotelos,PNR,0.41,5,030881
União das freguesias de Candoso São Tiago e Mascotelos,MAS,0.24,3,030881
União das freguesias de Candoso São Tiago e Mascotelos,PTP,0.16,2,030881
