freguesia,acronym,validVotesPercentage,votes,dicofre
"União das freguesias de Pedreira, Rande e Sernande",PS,50.7,399,130336
"União das freguesias de Pedreira, Rande e Sernande",PPD/PSD,20.58,162,130336
"União das freguesias de Pedreira, Rande e Sernande",B.E.,7.24,57,130336
"União das freguesias de Pedreira, Rande e Sernande",PCP-PEV,5.34,42,130336
"União das freguesias de Pedreira, Rande e Sernande",CDS-PP,4.96,39,130336
"União das freguesias de Pedreira, Rande e Sernande",PAN,3.56,28,130336
"União das freguesias de Pedreira, Rande e Sernande",PPM.PPV/CDC,1.14,9,130336
"União das freguesias de Pedreira, Rande e Sernande",NC,1.02,8,130336
"União das freguesias de Pedreira, Rande e Sernande",PDR,1.02,8,130336
"União das freguesias de Pedreira, Rande e Sernande",A,0.89,7,130336
"União das freguesias de Pedreira, Rande e Sernande",L,0.89,7,130336
"União das freguesias de Pedreira, Rande e Sernande",IL,0.64,5,130336
"União das freguesias de Pedreira, Rande e Sernande",PCTP/MRPP,0.64,5,130336
"União das freguesias de Pedreira, Rande e Sernande",PTP,0.64,5,130336
"União das freguesias de Pedreira, Rande e Sernande",PURP,0.64,5,130336
"União das freguesias de Pedreira, Rande e Sernande",PNR,0.13,1,130336
"União das freguesias de Pedreira, Rande e Sernande",MAS,0,0,130336
