freguesia,acronym,validVotesPercentage,votes,dicofre
Mansores,PPD/PSD,49.23,159,010413
Mansores,PS,23.22,75,010413
Mansores,CDS-PP,13.31,43,010413
Mansores,PAN,3.41,11,010413
Mansores,B.E.,3.1,10,010413
Mansores,PCP-PEV,1.55,5,010413
Mansores,A,1.24,4,010413
Mansores,IL,1.24,4,010413
Mansores,PCTP/MRPP,1.24,4,010413
Mansores,PDR,1.24,4,010413
Mansores,PPM.PPV/CDC,0.62,2,010413
Mansores,L,0.31,1,010413
Mansores,MAS,0.31,1,010413
Mansores,NC,0,0,010413
Mansores,PNR,0,0,010413
Mansores,PTP,0,0,010413
Mansores,PURP,0,0,010413
