freguesia,acronym,validVotesPercentage,votes,dicofre
Vilas Boas,PPD/PSD,58.49,31,170347
Vilas Boas,PS,20.75,11,170347
Vilas Boas,CDS-PP,9.43,5,170347
Vilas Boas,PCP-PEV,5.66,3,170347
Vilas Boas,PAN,3.77,2,170347
Vilas Boas,PPM.PPV/CDC,1.89,1,170347
Vilas Boas,A,0,0,170347
Vilas Boas,B.E.,0,0,170347
Vilas Boas,IL,0,0,170347
Vilas Boas,L,0,0,170347
Vilas Boas,MAS,0,0,170347
Vilas Boas,NC,0,0,170347
Vilas Boas,PCTP/MRPP,0,0,170347
Vilas Boas,PDR,0,0,170347
Vilas Boas,PNR,0,0,170347
Vilas Boas,PTP,0,0,170347
Vilas Boas,PURP,0,0,170347
