freguesia,acronym,validVotesPercentage,votes,dicofre
Coelhoso,PPD/PSD,68.57,72,040210
Coelhoso,PS,25.71,27,040210
Coelhoso,CDS-PP,1.9,2,040210
Coelhoso,NC,1.9,2,040210
Coelhoso,B.E.,0.95,1,040210
Coelhoso,PTP,0.95,1,040210
Coelhoso,A,0,0,040210
Coelhoso,IL,0,0,040210
Coelhoso,L,0,0,040210
Coelhoso,MAS,0,0,040210
Coelhoso,PAN,0,0,040210
Coelhoso,PCP-PEV,0,0,040210
Coelhoso,PCTP/MRPP,0,0,040210
Coelhoso,PDR,0,0,040210
Coelhoso,PNR,0,0,040210
Coelhoso,PPM.PPV/CDC,0,0,040210
Coelhoso,PURP,0,0,040210
