freguesia,acronym,validVotesPercentage,votes,dicofre
União das freguesias de Salvaterra de Magos e Foros de Salvaterra,PS,36.43,746,141508
União das freguesias de Salvaterra de Magos e Foros de Salvaterra,PPD/PSD,15.63,320,141508
União das freguesias de Salvaterra de Magos e Foros de Salvaterra,B.E.,11.08,227,141508
União das freguesias de Salvaterra de Magos e Foros de Salvaterra,PCP-PEV,10.94,224,141508
União das freguesias de Salvaterra de Magos e Foros de Salvaterra,CDS-PP,7.81,160,141508
União das freguesias de Salvaterra de Magos e Foros de Salvaterra,PAN,5.47,112,141508
União das freguesias de Salvaterra de Magos e Foros de Salvaterra,A,3.37,69,141508
União das freguesias de Salvaterra de Magos e Foros de Salvaterra,PPM.PPV/CDC,2.69,55,141508
União das freguesias de Salvaterra de Magos e Foros de Salvaterra,L,1.51,31,141508
União das freguesias de Salvaterra de Magos e Foros de Salvaterra,PCTP/MRPP,1.12,23,141508
União das freguesias de Salvaterra de Magos e Foros de Salvaterra,NC,0.88,18,141508
União das freguesias de Salvaterra de Magos e Foros de Salvaterra,PURP,0.78,16,141508
União das freguesias de Salvaterra de Magos e Foros de Salvaterra,PDR,0.73,15,141508
União das freguesias de Salvaterra de Magos e Foros de Salvaterra,IL,0.59,12,141508
União das freguesias de Salvaterra de Magos e Foros de Salvaterra,PNR,0.39,8,141508
União das freguesias de Salvaterra de Magos e Foros de Salvaterra,PTP,0.39,8,141508
União das freguesias de Salvaterra de Magos e Foros de Salvaterra,MAS,0.2,4,141508
