Objeto do Contrato,Tipo de Procedimento,Tipo(s) de Contrato,CPVs,Entidade(s) Adjudicante(s),Entidade(s) Adjudicatária(s),Preço Contratual,Data de Publicação,Data de Celebração do Contrato,Prazo de Execução,Local de Execução,Fundamentação,Data de Fecho do Contrato,Preço Total Efetivo,Causas das Alterações ao Prazo,Causas das Alterações ao Preço,Estado,N.º registo do Acordo Quadro,Descrição do Acordo Quadro,Procedimento Centralizado
Fornecimento Gás Propano a Granel 2018,Ajuste Direto Regime Geral,Aquisição de bens móveis,"09122100-1, Gás propano","Administração Regional de Saúde do Algarve, I. P. (503148709)","Rubis Energia Portugal, Sa (513108890)","6.246,38 €",10-04-2018,10-04-2018,365 dias,"Portugal, Faro, Faro","Artigo 20.º, n.º 1, alínea d) do Código dos Contratos Públicos",31-12-2018,"5.456,72 €",,Quantidades adjudicadas não fornecidas na totalidade.,,Não aplicável.,Não aplicável.,FALSE
Manutenção Correctiva e Evolutiva do Sistema OMEGA,Ajuste Direto Regime Geral,Aquisição de serviços,"72261000-2, Serviços de assistência em matéria de software","Administração Regional de Saúde do Algarve, I. P. (503148709)","ROCHE SISTEMAS DIAGNOSTICOS, LDA (504282921)","6.930,00 €",10-04-2018,09-04-2018,365 dias,"Portugal, Faro, Faro","Artigo 24.º, n.º 1, alínea e), subalínea iii) do Código dos Contratos Públicos",31-12-2018,"6.930,00 €",,"",,Não aplicável.,Não aplicável.,FALSE
"Manutenção dos Equipamentos Dentários e de Saúde Oral da ARS Algarve, IP 2018",Consulta Prévia,Aquisição de serviços,"50000000-5, Serviços de reparação e manutenção","Administração Regional de Saúde do Algarve, I. P. (503148709)",Montellano (500196494),"2.160,00 €",06-04-2018,06-04-2018,365 dias,"Portugal, Faro, Faro","Artigo 20.º, n.º 1, alínea c) do Código dos Contratos Públicos",31-12-2018,"2.160,00 €",,"",,Não aplicável.,Não aplicável.,FALSE
SC/108/2018 - Aquisição de Medicamentos Gerais.1,Ao abrigo de acordo-quadro (art.º 259.º),Aquisição de bens móveis,"33600000-6, Produtos farmacêuticos","Administração Regional de Saúde do Algarve, I. P. (503148709)","Ratiopharm, Lda. (502414910)","50,60 €",03-04-2018,03-04-2018,270 dias,"Portugal, Faro, Faro",Artigo 259.º do Código dos Contratos Públicos,19-11-2018,"50,60 €",,"",,2775691,CP 2017/5 - Acordo Quadro para fornecimento de Medicamentos anti-infeciosos: exceto antivíricos e antifúngicos,FALSE
SC/108/2018 - Aquisição de Medicamentos Gerais.1,Ao abrigo de acordo-quadro (art.º 259.º),Aquisição de bens móveis,"33600000-6, Produtos farmacêuticos","Administração Regional de Saúde do Algarve, I. P. (503148709)","Generis - Farmacêutica, S.A. (508107997)","40,00 €",03-04-2018,03-04-2018,270 dias,"Portugal, Faro, Faro",Artigo 259.º do Código dos Contratos Públicos,"","",,"",,2775691,CP 2017/5 - Acordo Quadro para fornecimento de Medicamentos anti-infeciosos: exceto antivíricos e antifúngicos,FALSE
SC/108/2018 - Aquisição de Medicamentos Gerais.1,Ao abrigo de acordo-quadro (art.º 259.º),Aquisição de bens móveis,"33600000-6, Produtos farmacêuticos","Administração Regional de Saúde do Algarve, I. P. (503148709)","Fresenius Kabi Pharma, Lda. (504293753)","200,00 €",03-04-2018,03-04-2018,270 dias,"Portugal, Faro, Faro",Artigo 259.º do Código dos Contratos Públicos,22-11-2018,"56,00 €",,Quantidades encomendadas.,,2775691,CP 2017/5 - Acordo Quadro para fornecimento de Medicamentos anti-infeciosos: exceto antivíricos e antifúngicos,FALSE
SC/108/2018 - Aquisição de Medicamentos Gerais.1,Ao abrigo de acordo-quadro (art.º 259.º),Aquisição de bens móveis,"33600000-6, Produtos farmacêuticos","Administração Regional de Saúde do Algarve, I. P. (503148709)","Laboratórios Pfizer, Lda. (500162166)","2.907,66 €",03-04-2018,02-04-2018,271 dias,"Portugal, Faro, Faro",Artigo 259.º do Código dos Contratos Públicos,21-11-2018,"2.907,66 €",,"",,2775691,CP 2017/5 - Acordo Quadro para fornecimento de Medicamentos anti-infeciosos: exceto antivíricos e antifúngicos,FALSE
SC/108/2018 - Aquisição de Medicamentos Gerais.1,Ao abrigo de acordo-quadro (art.º 259.º),Aquisição de bens móveis,"33600000-6, Produtos farmacêuticos","Administração Regional de Saúde do Algarve, I. P. (503148709)","Sandoz Farmacêutica, Lda. (506985261)","460,84 €",02-04-2018,02-04-2018,270 dias,"Portugal, Faro, Faro",Artigo 259.º do Código dos Contratos Públicos,28-11-2018,"422,56 €",,Quantidades encomendadas.,,2775691,CP 2017/5 - Acordo Quadro para fornecimento de Medicamentos anti-infeciosos: exceto antivíricos e antifúngicos,FALSE
