Objeto do Contrato,Tipo de Procedimento,Tipo(s) de Contrato,CPVs,Entidade(s) Adjudicante(s),Entidade(s) Adjudicatária(s),Preço Contratual,Data de Publicação,Data de Celebração do Contrato,Prazo de Execução,Local de Execução,Fundamentação,Data de Fecho do Contrato,Preço Total Efetivo,Causas das Alterações ao Prazo,Causas das Alterações ao Preço,Estado,N.º registo do Acordo Quadro,Descrição do Acordo Quadro,Procedimento Centralizado
4S0023/2018 SERV MED GINECOLOGIA-OBSTETRICIA P 2018,Ajuste Direto Regime Geral,Aquisição de serviços,"85100000-0, Serviços de saúde","Centro Hospitalar Barreiro Montijo, E. P. E. (509186998)",ANABELA GOMES & REFO - SERVIÇOS MEDICOS LDA (509708331),"50.474,80 €",05-06-2018,14-02-2018,365 dias,"Portugal, Setúbal, Barreiro","Artigo 24.º, n.º 1, alínea a) do Código dos Contratos Públicos",31-12-2018,"50.090,97 €",,Consumo efetivo inferior ao estimado,,Não aplicável.,Não aplicável.,FALSE
4S0040/2017 SERV MÉD GINECOLOGIA E OBSTETRICIA P/ ANO 2017,Ajuste Direto Regime Geral,Aquisição de serviços,"85100000-0, Serviços de saúde","CHBM - Centro Hospital Barreiro Montijo, EPE (509186998)",ANABELA GOMES & REFO - SERVIÇOS MEDICOS LDA (509708331),"56.160,00 €",27-10-2017,13-02-2017,365 dias,"Portugal, Setúbal, Barreiro","Artigo 20.º, n.º 1, alínea a) do Código dos Contratos Públicos",31-12-2017,"37.425,71 €",,Consumo efetivo inferior ao estimado,,Não aplicável.,Não aplicável.,FALSE
4S0027/2016 SERV MÉD OBSTETRICIA P ANO 2016,Ajuste Direto Regime Geral,Aquisição de serviços,"85141000-9, Serviços prestados pelo pessoal médico","Centro Hospitalar Barreiro Montijo, E. P. E. (509186998)",ANABELA GOMES & REFO - SERVIÇOS MEDICOS LDA (509708331),"56.160,00 €",14-11-2016,27-01-2016,366 dias,"Portugal, Setúbal, Barreiro","Artigo 20.º, n.º 1, alínea a) do Código dos Contratos Públicos",31-12-2016,"31.290,00 €",,Consumo efetivo inferior ao inicialmente estimado,,Não aplicável.,Não aplicável.,FALSE
Prestação de Serviços Médicos,Ajuste Direto Regime Geral,Aquisição de serviços,"85120000-6, Serviços de prática médica e serviços conexos","Hospital do Espírito Santo de Évora, E. P. E. (508085888)",ANABELA GOMES & REFO - SERVIÇOS MEDICOS LDA (509708331),"32.640,00 €",15-06-2016,19-11-2015,90 dias,"Portugal, Évora, Évora","Artigo 20.º, n.º 1, alínea a) do Código dos Contratos Públicos","","",,"",,Não aplicável.,Não aplicável.,FALSE
Aquisição de Prestação de Serviços Médicos,Ajuste Direto Regime Geral,Aquisição de serviços,"85121300-6, Serviços de cirurgia especializada","Hospital do Espírito Santo de Évora, E. P. E. (508085888)",ANABELA GOMES & REFO - SERVIÇOS MEDICOS LDA (509708331),"21.120,00 €",20-10-2015,05-08-2015,150 dias,"Portugal, Évora, Évora","Artigo 20.º, n.º 1, alínea a) do Código dos Contratos Públicos","","",,"",,Não aplicável.,Não aplicável.,FALSE
