Objeto do Contrato,Tipo de Procedimento,Tipo(s) de Contrato,CPVs,Entidade(s) Adjudicante(s),Entidade(s) Adjudicatária(s),Preço Contratual,Data de Publicação,Data de Celebração do Contrato,Prazo de Execução,Local de Execução,Fundamentação,Data de Fecho do Contrato,Preço Total Efetivo,Causas das Alterações ao Prazo,Causas das Alterações ao Preço,Estado,N.º registo do Acordo Quadro,Descrição do Acordo Quadro,Procedimento Centralizado
Aquisição de Serviços de Cuidados Médicos na Área de Medicina Geral e Familiar destinada à Urgência de Medicina do Centro Hospitalar de Lisboa Central – Janeiro de 2018,Ajuste Direto Regime Geral,Aquisição de serviços,"79625000-1, Serviços de fornecimento de pessoal médico","Centro Hospitalar de Lisboa Central, E. P. E. (508080142)",Janine Marlise Rodrigues Correia (242237142),"1.013,22 €",12-04-2018,24-01-2018,31 dias,"Portugal, Lisboa, Lisboa","Artigo 20.º, n.º 1, alínea a) do Código dos Contratos Públicos",,,,,,Não aplicável.,Não aplicável.,FALSE
Aquisição de Serviços de Cuidados Médicos na Área de Medicina Geral e Familiar destinado ao CHLC,Ajuste Direto Regime Geral,Aquisição de serviços,"85121100-4, Serviços de médicos de clínica geral","Centro Hospitalar de Lisboa Central, E.P.E. (CHLC) (508080142)",Janine Marlise Rodrigues Correia (242237142),"3.039,66 €",10-01-2018,02-10-2017,92 dias,"Portugal, Lisboa, Lisboa","Artigo 20.º, n.º 1, alínea a) do Código dos Contratos Públicos",,,,,,Não aplicável.,Não aplicável.,FALSE
