Objeto do Contrato,Tipo de Procedimento,Tipo(s) de Contrato,CPVs,Entidade(s) Adjudicante(s),Entidade(s) Adjudicatária(s),Preço Contratual,Data de Publicação,Data de Celebração do Contrato,Prazo de Execução,Local de Execução,Fundamentação,Data de Fecho do Contrato,Preço Total Efetivo,Causas das Alterações ao Prazo,Causas das Alterações ao Preço,Estado,N.º registo do Acordo Quadro,Descrição do Acordo Quadro,Procedimento Centralizado
Manutenção do Software Backups,Ajuste Direto Regime Geral,Aquisição de serviços,"72267100-0, Manutenção de software para as tecnologias da infomação","Centro Hospitalar do Médio Tejo, E.P.E. (CHMT) (506361608)","NLS - New Link Solutions, SA (505248948)","5.334,00 €",19-04-2016,24-02-2016,365 dias,"Portugal, Santarém, Torres Novas","Artigo 20.º, n.º 1, alínea a) do Código dos Contratos Públicos",,,,,,Não aplicável.,Não aplicável.,FALSE
Serviços de Instalação e Formação_Software Backups,Ajuste Direto Regime Geral,Aquisição de serviços,"72263000-6, Serviços de implementação de software","Centro Hospitalar do Médio Tejo, E.P.E. (CHMT) (506361608)","NLS-New Link Solutions, SA (505248948)","8.900,00 €",19-04-2016,24-02-2016,7 dias,"Portugal, Santarém, Torres Novas","Artigo 20.º, n.º 1, alínea a) do Código dos Contratos Públicos",,,,,,Não aplicável.,Não aplicável.,FALSE
Serviços Médicos de IVG,Ajuste Direto Regime Geral,Aquisição de serviços,"85100000-0, Serviços de saúde","Centro Hospitalar do Médio Tejo, E. P. E. (506361608)","Atualcare, Lda (510659365)","74.820,00 €",18-04-2016,18-04-2016,366 dias,"Portugal, Santarém, Abrantes<BR/>Portugal, Santarém, Tomar<BR/>Portugal, Santarém, Torres Novas","Artigo 20.º, n.º 1, alínea a) do Código dos Contratos Públicos",,,,,,Não aplicável.,Não aplicável.,FALSE
Gestão e Tratamento de Resíduos,Ajuste Direto Regime Geral,Aquisição de serviços,"90500000-2, Serviços relativos a resíduos e lixos","Centro Hospitalar do Médio Tejo, E. P. E. (506361608)","Ambimed - Gestão Ambiental, Lda (503593427)","16.857,57 €",14-04-2016,04-04-2016,30 dias,"Portugal, Santarém, Tomar<BR/>Portugal, Santarém, Abrantes<BR/>Portugal, Santarém, Torres Novas","Artigo 20.º, n.º 1, alínea a) do Código dos Contratos Públicos",,,,,,Não aplicável.,Não aplicável.,FALSE
Serviços Médicos - Ortopedia,Ajuste Direto Regime Geral,Aquisição de serviços,"85100000-0, Serviços de saúde","Centro Hospitalar do Médio Tejo, E. P. E. (506361608)","Ana Paula Pereira - Serviços Médicos, Lda (509841481)","74.800,00 €",11-04-2016,22-03-2016,366 dias,"Portugal, Santarém, Abrantes","Artigo 24.º, n.º 1, alínea c) do Código dos Contratos Públicos",,,,,,Não aplicável.,Não aplicável.,FALSE
