freguesia,acronym,validVotesPercentage,votes,dicofre
Guarda,PS,32.37,2563,090758
Guarda,PPD/PSD,29.84,2363,090758
Guarda,B.E.,13.22,1047,090758
Guarda,CDS-PP,6.68,529,090758
Guarda,PAN,3.9,309,090758
Guarda,PCP-PEV,2.82,223,090758
Guarda,A,2.53,200,090758
Guarda,PPM.PPV/CDC,2.41,191,090758
Guarda,L,1.97,156,090758
Guarda,NC,1.09,86,090758
Guarda,PCTP/MRPP,0.8,63,090758
Guarda,IL,0.62,49,090758
Guarda,PDR,0.58,46,090758
Guarda,PNR,0.57,45,090758
Guarda,PURP,0.34,27,090758
Guarda,PTP,0.19,15,090758
Guarda,MAS,0.09,7,090758
