freguesia,acronym,validVotesPercentage,votes,dicofre
Podame,PS,51.49,69,160422
Podame,PPD/PSD,30.6,41,160422
Podame,B.E.,7.46,10,160422
Podame,CDS-PP,4.48,6,160422
Podame,PCP-PEV,3.73,5,160422
Podame,JPP,0.75,1,160422
Podame,PNR,0.75,1,160422
Podame,PTP,0.75,1,160422
Podame,A,0,0,160422
Podame,CH,0,0,160422
Podame,IL,0,0,160422
Podame,L,0,0,160422
Podame,MPT,0,0,160422
Podame,NC,0,0,160422
Podame,PAN,0,0,160422
Podame,PCTP/MRPP,0,0,160422
Podame,PDR,0,0,160422
Podame,PPM,0,0,160422
Podame,PURP,0,0,160422
Podame,R.I.R.,0,0,160422
