ano,Sentimento,per
2016,Positivo,23.23
2016,Neutro,62.63
2016,Negativo,14.14
2017,Positivo,28.34
2017,Neutro,58.11
2017,Negativo,13.55
2018,Positivo,25.76
2018,Neutro,61.54
2018,Negativo,12.70
2019,Positivo,29.79
2019,Neutro,60.00
2019,Negativo,10.21