Objeto do Contrato,Tipo de Procedimento,Tipo(s) de Contrato,CPVs,Entidade(s) Adjudicante(s),Entidade(s) Adjudicatária(s),Preço Contratual,Data de Publicação,Data de Celebração do Contrato,Prazo de Execução,Local de Execução,Fundamentação,Data de Fecho do Contrato,Preço Total Efetivo,Causas das Alterações ao Prazo,Causas das Alterações ao Preço,Estado,N.º registo do Acordo Quadro,Descrição do Acordo Quadro,Procedimento Centralizado
"Aquisição de serviços para tradução de documentos técnicos """"tradução para Inglês - Termos de referencia Contratualização e Relatórios de Atividades"""" da ACSS, I.P.",Ajuste Direto Regime Geral,Aquisição de serviços,"79530000-8, Serviços de tradução","Administração Central do Sistema de Saúde, I. P. (508188423)","World Port-Serviços de Tradução e Revisão, Lda. (508614864)","5.164,32 €",13-09-2017,11-09-2017,51 dias,"Portugal, Lisboa, Lisboa","Artigo 20.º, n.º 1, alínea a) do Código dos Contratos Públicos",14-11-2017,"5.164,32 €",,,,Não aplicável.,Não aplicável.,FALSE
"Aquisição de serviços para apoio ao programa de regularização extraordinária dos vínculos precários da Administração Central do Sistema de Saúde, I.P.  ",Ajuste Direto Regime Geral,Aquisição de serviços,"79500000-9, Serviços auxiliares de escritório","Administração Central do Sistema de Saúde, I. P. (508188423)",Mariana Carneiro Pinto Pinheiro (220518971),"6.007,40 €",12-09-2017,31-08-2017,153 dias,"Portugal, Lisboa, Lisboa","Artigo 20.º, n.º 1, alínea a) do Código dos Contratos Públicos",31-01-2018,"6.007,40 €",,,,Não aplicável.,Não aplicável.,FALSE
"Aquisição de serviços para apoio ao programa de regularização extraordinária dos vínculos precários da Administração Central do Sistema de Saúde, I.P.  ",Ajuste Direto Regime Geral,Aquisição de serviços,"79500000-9, Serviços auxiliares de escritório","Administração Central do Sistema de Saúde, I. P. (508188423)",Eduardo Espírito Santo Mértolo Féteira (257859349),"6.007,40 €",12-09-2017,31-08-2017,153 dias,"Portugal, Lisboa, Lisboa","Artigo 20.º, n.º 1, alínea a) do Código dos Contratos Públicos",31-01-2018,"6.007,40 €",,,,Não aplicável.,Não aplicável.,FALSE
"Aquisição de serviços para apoio ao programa de regularização extraordinária dos vínculos precários da Administração Central do Sistema de Saúde, I.P.  ",Ajuste Direto Regime Geral,Aquisição de serviços,"79500000-9, Serviços auxiliares de escritório","Administração Central do Sistema de Saúde, I. P. (508188423)",Diogo Filipe Fonseca Seno (221776176),"6.007,40 €",12-09-2017,31-08-2017,153 dias,"Portugal, Lisboa, Lisboa","Artigo 20.º, n.º 1, alínea a) do Código dos Contratos Públicos",31-01-2018,"6.007,40 €",,,,Não aplicável.,Não aplicável.,FALSE
"Aquisição de serviços para apoio ao programa de regularização extraordinária dos vínculos precários da Administração Central do Sistema de Saúde, I.P.  ",Ajuste Direto Regime Geral,Aquisição de serviços,"79500000-9, Serviços auxiliares de escritório","Administração Central do Sistema de Saúde, I. P. (508188423)",Ana Rita Marques Grácio (258087579),"6.007,40 €",12-09-2017,31-08-2017,153 dias,"Portugal, Lisboa, Lisboa","Artigo 20.º, n.º 1, alínea a) do Código dos Contratos Públicos",31-01-2018,"6.007,40 €",,,,Não aplicável.,Não aplicável.,FALSE
