freguesia,acronym,validVotesPercentage,votes,dicofre
Calvão,PPD/PSD,52.21,319,011801
Calvão,CDS-PP,19.15,117,011801
Calvão,PS,11.13,68,011801
Calvão,B.E.,6.87,42,011801
Calvão,PAN,4.75,29,011801
Calvão,PPM.PPV/CDC,0.98,6,011801
Calvão,L,0.82,5,011801
Calvão,PDR,0.82,5,011801
Calvão,IL,0.65,4,011801
Calvão,NC,0.65,4,011801
Calvão,A,0.49,3,011801
Calvão,PCP-PEV,0.49,3,011801
Calvão,PTP,0.49,3,011801
Calvão,PNR,0.33,2,011801
Calvão,MAS,0.16,1,011801
Calvão,PCTP/MRPP,0,0,011801
Calvão,PURP,0,0,011801
