freguesia,acronym,validVotesPercentage,votes,dicofre
Riba de Mouro,PPD/PSD,56.17,214,160424
Riba de Mouro,PS,28.61,109,160424
Riba de Mouro,CDS-PP,7.35,28,160424
Riba de Mouro,B.E.,3.15,12,160424
Riba de Mouro,JPP,0.79,3,160424
Riba de Mouro,PAN,0.79,3,160424
Riba de Mouro,PPM,0.79,3,160424
Riba de Mouro,PCP-PEV,0.52,2,160424
Riba de Mouro,PCTP/MRPP,0.52,2,160424
Riba de Mouro,R.I.R.,0.52,2,160424
Riba de Mouro,L,0.26,1,160424
Riba de Mouro,NC,0.26,1,160424
Riba de Mouro,PURP,0.26,1,160424
Riba de Mouro,A,0,0,160424
Riba de Mouro,CH,0,0,160424
Riba de Mouro,IL,0,0,160424
Riba de Mouro,MPT,0,0,160424
Riba de Mouro,PDR,0,0,160424
Riba de Mouro,PNR,0,0,160424
Riba de Mouro,PTP,0,0,160424
