Objeto do Contrato,Tipo de Procedimento,Tipo(s) de Contrato,CPVs,Entidade(s) Adjudicante(s),Entidade(s) Adjudicatária(s),Preço Contratual,Data de Publicação,Data de Celebração do Contrato,Prazo de Execução,Local de Execução,Fundamentação,Data de Fecho do Contrato,Preço Total Efetivo,Causas das Alterações ao Prazo,Causas das Alterações ao Preço,Estado,N.º registo do Acordo Quadro,Descrição do Acordo Quadro,Procedimento Centralizado
OXIGENIO,Ajuste Direto Regime Geral,Aquisição de bens móveis,"33000000-0, Equipamento médico, medicamentos e produtos para cuidados pessoais","Unidade Local de Saúde do Norte Alentejano, E. P. E. (508094461)",AIR LIQUIDE MEDICINAL SA (501576436),"15,22 €",21-01-2019,16-01-2019,365 dias,"Portugal, Portalegre, Elvas<BR/>Portugal, Portalegre, Portalegre","Artigo 24.º, n.º 1, alínea c) do Código dos Contratos Públicos",,,,,,Não aplicável.,Não aplicável.,FALSE
OXIGENIO,Ajuste Direto Regime Geral,Aquisição de bens móveis,"33000000-0, Equipamento médico, medicamentos e produtos para cuidados pessoais","Unidade Local de Saúde do Norte Alentejano, E. P. E. (508094461)",AIR LIQUIDE MEDICINAL SA (501576436),"10,00 €",21-01-2019,16-01-2019,365 dias,"Portugal, Portalegre, Elvas<BR/>Portugal, Portalegre, Portalegre","Artigo 24.º, n.º 1, alínea c) do Código dos Contratos Públicos",,,,,,Não aplicável.,Não aplicável.,FALSE
"Aquisição de máquinas de sutura, extratores de agrafes e conjuntos de fleboextração - 2019",Consulta Prévia,Aquisição de bens móveis,"33140000-3, Material médico de consumo","Unidade Local de Saúde do Norte Alentejano, E. P. E. (508094461)","EUROCASMÉDICA - Produtos Hospitalares, S.A. (503322105)","403,20 €",17-01-2019,06-12-2018,365 dias,"Portugal<BR/>Portugal, Portalegre, Portalegre","Artigo 20.º, n.º 1, alínea c) do Código dos Contratos Públicos",,,,,,Não aplicável.,Não aplicável.,FALSE
"Aquisição de máquinas de sutura, extratores de agrafes e conjuntos de fleboextração - 2019",Consulta Prévia,Aquisição de bens móveis,"33140000-3, Material médico de consumo","Unidade Local de Saúde do Norte Alentejano, E. P. E. (508094461)",MEDTRONIC PORTUGAL LDA (504223933),"8.283,00 €",17-01-2019,06-12-2018,365 dias,Portugal,"Artigo 20.º, n.º 1, alínea c) do Código dos Contratos Públicos",,,,,,Não aplicável.,Não aplicável.,FALSE
Aquisição de curetas descartaveis AQ.36/2017 SPMS - 2019,Ao abrigo de acordo-quadro (art.º 259.º),Aquisição de bens móveis,"33100000-1, Equipamento médico","Unidade Local de Saúde do N. Alentejano,EPE(ULSNA) (508094461)",HR (501895558),"4.068,00 €",17-01-2019,25-10-2018,365 dias,"Portugal<BR/>Portugal, Portalegre, Portalegre",Artigo 259.º do Código dos Contratos Públicos,,,,,,2414255,CP 2017/36 - Acordo Quadro para fornecimento de material de dispositivos médicos diversos às Instituições e Serviços do Serviço Nacional de Saúde,FALSE
Aquisição de Lancetas para punção capilar AQ.31/2017 SPMS - 2019,Ao abrigo de acordo-quadro (art.º 259.º),Aquisição de bens móveis,"33190000-8, Dispositivos e produtos médicos variados","Unidade Local de Saúde do N. Alentejano,EPE(ULSNA) (508094461)",Iberlab (503406694),"5.990,40 €",17-01-2019,25-09-2018,365 dias,"Portugal<BR/>Portugal, Portalegre, Portalegre",Artigo 259.º do Código dos Contratos Públicos,,,,,,2810777,CP 2017/31 - Acordo Quadro para fornecimento de Material de Prevenção e Deteção de HIV às Instituições e Serviços do Serviço Nacional de Saúde,FALSE
Aquisição de agulhas de acesso vascular para motor de infusão para ULSNA EPR - 2019,Ajuste Direto Regime Geral,Aquisição de bens móveis,"33140000-3, Material médico de consumo","Unidade Local de Saúde do Norte Alentejano, E. P. E. (508094461)","TELEFLEX MEDICAL, S.A. (980249783)","2.910,00 €",17-01-2019,14-12-2018,365 dias,"Portugal, Portalegre, Portalegre","Artigo 24.º, n.º 1, alínea e), subalínea ii) do Código dos Contratos Públicos",,,,,,Não aplicável.,Não aplicável.,FALSE
"Aquisição de fios de sutura para a Unidade Local de Saúde do Norte Alentejano, EPE, para 2019",Concurso público,Aquisição de bens móveis,"33140000-3, Material médico de consumo","Unidade Local de Saúde do Norte Alentejano, E. P. E. (508094461)",MEDTRONIC PORTUGAL COMERCIO E DIST. APARELHOS MED. (504223933),"720,00 €",17-01-2019,17-01-2019,348 dias,"Portugal, Portalegre","Artigo 20.º, n.º 1, alínea b) do Código dos Contratos Públicos",,,,,,Não aplicável.,Não aplicável.,FALSE
Fornecimento de vários drenos para ULSNA EPE - Ano 2019,Ajuste Direto Regime Geral,Aquisição de bens móveis,"33140000-3, Material médico de consumo","Unidade Local de Saúde do Norte Alentejano, E. P. E. (508094461)","VYGON (PORTUGAL) - PRODUTOS MEDICOS E FARMACÊUTICOS, LDA (503232785)","673,00 €",17-01-2019,21-11-2018,365 dias,"Portugal, Portalegre, Portalegre","Artigo 20.º, n.º 1, alínea d) do Código dos Contratos Públicos",,,,,,Não aplicável.,Não aplicável.,FALSE
Alimentação,Ajuste Direto Regime Geral,Aquisição de serviços,"55000000-0, Serviços de hotelaria, restauração e comércio a retalho","Unidade Local de Saúde do Norte Alentejano, E. P. E. (508094461)",ITAU (500142858),"594.751,49 €",17-01-2019,16-01-2019,365 dias,"Portugal, Portalegre","Artigo 24.º, n.º 1, alínea c) do Código dos Contratos Públicos",,,,,,Não aplicável.,Não aplicável.,FALSE
Fornecimento de vários drenos para ULSNA EPE - Ano 2019,Ajuste Direto Regime Geral,Aquisição de bens móveis,"33140000-3, Material médico de consumo","Unidade Local de Saúde do Norte Alentejano, E. P. E. (508094461)","EZEQUIEL PANAO JORGE, LDA (501412727)","124,00 €",17-01-2019,21-11-2018,365 dias,"Portugal, Portalegre, Portalegre","Artigo 20.º, n.º 1, alínea d) do Código dos Contratos Públicos",,,,,,Não aplicável.,Não aplicável.,FALSE
Fornecimento de sistema para laqueação de varizes esofágicas para ULSNA EPE - Ano 2019,Ajuste Direto Regime Geral,Aquisição de bens móveis,"33140000-3, Material médico de consumo","Unidade Local de Saúde do Norte Alentejano, E. P. E. (508094461)","BIOSONDA - COMERCIO MAT. HOSPITALAR, LDA (501463313)","1.800,00 €",17-01-2019,22-11-2018,365 dias,"Portugal, Portalegre, Portalegre","Artigo 20.º, n.º 1, alínea d) do Código dos Contratos Públicos",,,,,,Não aplicável.,Não aplicável.,FALSE
Fornecimento de Ligaduras de Compressão e Dispositivos de Imob. ULSNA EPE-2019_AQ SPMS 80/2016,Ao abrigo de acordo-quadro (art.º 259.º),Aquisição de bens móveis,"33140000-3, Material médico de consumo","Unidade Local de Saúde do Norte Alentejano, E. P. E. (508094461)",Docworld (508592909),"315,16 €",17-01-2019,20-12-2018,365 dias,"Portugal, Portalegre, Portalegre",Artigo 259.º do Código dos Contratos Públicos,,,,,,2378981,Acordo quadro para fornecimento de Ligaduras de Compressão e Dispositivos de Imobilização às Instituições e Serviços do Serviço Nacional de Saúde.,FALSE
Fornecimento de Ligaduras de Compressão e Dispositivos de Imob. ULSNA EPE-2019_AQ SPMS 80/2016,Ao abrigo de acordo-quadro (art.º 259.º),Aquisição de bens móveis,"33140000-3, Material médico de consumo","Unidade Local de Saúde do Norte Alentejano, E. P. E. (508094461)",Bastos Viegas (500042772),"759,33 €",17-01-2019,20-12-2018,365 dias,"Portugal, Portalegre, Portalegre",Artigo 259.º do Código dos Contratos Públicos,,,,,,2378981,Acordo quadro para fornecimento de Ligaduras de Compressão e Dispositivos de Imobilização às Instituições e Serviços do Serviço Nacional de Saúde.,FALSE
"Fornecimento de Agulhas à ULSNA, EPE, para 2019 - AQ 213/2017",Ao abrigo de acordo-quadro (art.º 259.º),Aquisição de bens móveis,"33140000-3, Material médico de consumo","Unidade Local de Saúde do Norte Alentejano, E. P. E. (508094461)",NORMAX FABRICA DE VIDROS CIENTIFICOS (500203130),"240,00 €",16-01-2019,10-01-2019,349 dias,"Portugal, Portalegre",Artigo 259.º do Código dos Contratos Públicos,,,,,,3016192,CP 2017/213 - Acordo quadro para fornecimento de Agulhas às Instituições e Serviços do Serviço Nacional de Saúde,FALSE
"Fornecimento de Luvas para Uso Hospitalar, à ULSNA, EPE, durante 2019 - AQ 23/2017",Ao abrigo de acordo-quadro (art.º 259.º),Aquisição de bens móveis,"33140000-3, Material médico de consumo","Unidade Local de Saúde do Norte Alentejano, E. P. E. (508094461)","Medline international Portugal, Unipessoal, Lda (510533515)","2.310,00 €",16-01-2019,10-01-2019,349 dias,"Portugal, Portalegre",Artigo 259.º do Código dos Contratos Públicos,,,,,,2587226,CP 2017/23-Acordo quadro para fornecimento de Luvas para uso Hospitalar   às Instituições e Serviços do Serviço Nacional de Saúde,FALSE
"Fornecimento de Luvas para Uso Hospitalar, à ULSNA, EPE, durante 2019 - AQ 23/2017",Ao abrigo de acordo-quadro (art.º 259.º),Aquisição de bens móveis,"33140000-3, Material médico de consumo","Unidade Local de Saúde do Norte Alentejano, E. P. E. (508094461)","HR - Hospitalar, Lda. (501895558)","1.058,00 €",16-01-2019,10-01-2019,349 dias,"Portugal, Portalegre",Artigo 259.º do Código dos Contratos Públicos,,,,,,2587226,CP 2017/23-Acordo quadro para fornecimento de Luvas para uso Hospitalar   às Instituições e Serviços do Serviço Nacional de Saúde,FALSE
"Fornecimento de Material para Empacotamento em Esterilização à ULSNA, EPE, durante o ano 2019, AQ 43/2016 da SPMS",Ao abrigo de acordo-quadro (art.º 259.º),Aquisição de bens móveis,"33140000-3, Material médico de consumo","Unidade Local de Saúde do Norte Alentejano, E. P. E. (508094461)",DIMOR LUSITANA (500730741),"2.891,00 €",16-01-2019,10-01-2019,349 dias,"Portugal, Portalegre",Artigo 259.º do Código dos Contratos Públicos,,,,,,1974943,CP 2016/43 - Acordo quadro para fornecimento de Material para Empacotamento em Esterilização às Instituições e Serviços do Serviço Nacional de Saúde.,FALSE
Fornecimento de clamps e ventosas para ULSNA EPE - Ano 2019,Ajuste Direto Regime Geral,Aquisição de bens móveis,"33140000-3, Material médico de consumo","Unidade Local de Saúde do Norte Alentejano, E. P. E. (508094461)","SPECULUM, ARTIGOS MÉDICOS, SA (502996323)","4.218,60 €",16-01-2019,18-10-2018,363 dias,"Portugal, Portalegre, Portalegre","Artigo 20.º, n.º 1, alínea d) do Código dos Contratos Públicos",,,,,,Não aplicável.,Não aplicável.,FALSE
Fornecimento de Penso Hig.Pos-parto celulose/imperm.10X30cm para ULSNA EPE - Ano 2019,Ajuste Direto Regime Geral,Aquisição de bens móveis,"33140000-3, Material médico de consumo","Unidade Local de Saúde do Norte Alentejano, E. P. E. (508094461)","ESSITY PORTUGAL, LDA (EX. SCA) (503237612)","2.520,00 €",16-01-2019,18-10-2018,363 dias,"Portugal, Portalegre, Portalegre","Artigo 20.º, n.º 1, alínea d) do Código dos Contratos Públicos",,,,,,Não aplicável.,Não aplicável.,FALSE
Fornecimento de meias de embolectomia para  ULSNA EPE - Ano 2019,Ajuste Direto Regime Geral,Aquisição de bens móveis,"33140000-3, Material médico de consumo","Unidade Local de Saúde do Norte Alentejano, E. P. E. (508094461)",DIMOR LUSITANA-COM.PROD.SAUDE E HIG (500730741),"487,50 €",16-01-2019,22-10-2018,363 dias,"Portugal, Portalegre, Portalegre","Artigo 20.º, n.º 1, alínea d) do Código dos Contratos Públicos",,,,,,Não aplicável.,Não aplicável.,FALSE
Aquisição de Ansas e Electrodos para o bloco operatório do HDJMG - Ano 2019,Ajuste Direto Regime Geral,Aquisição de bens móveis,"33140000-3, Material médico de consumo","Unidade Local de Saúde do Norte Alentejano, E. P. E. (508094461)","FILSAT - EQUIPAMENTOS MEDICOS CIENTIFICOS, LDA (506708616)","1.440,00 €",16-01-2019,18-10-2018,363 dias,"Portugal, Portalegre, Portalegre","Artigo 20.º, n.º 1, alínea d) do Código dos Contratos Públicos",,,,,,Não aplicável.,Não aplicável.,FALSE
Aquisição de pulseiras térmicas de identificação para internamento para ULSNA EPE - Ano 2019,Ajuste Direto Regime Geral,Aquisição de bens móveis,"33140000-3, Material médico de consumo","Unidade Local de Saúde do Norte Alentejano, E. P. E. (508094461)","BIQ – HEALTH SOLUTIONS, LDA. (504105337)","4.625,00 €",15-01-2019,18-10-2018,363 dias,"Portugal, Portalegre, Portalegre","Artigo 20.º, n.º 1, alínea d) do Código dos Contratos Públicos",,,,,,Não aplicável.,Não aplicável.,FALSE
Fornecimento de copos para acamados para ULSNA EPE - Ano 2019,Ajuste Direto Regime Geral,Aquisição de bens móveis,"33140000-3, Material médico de consumo","Unidade Local de Saúde do Norte Alentejano, E. P. E. (508094461)",EME ELECTROMEDICA - EZEQUIEL PANAO JORGE (501412727),"2.268,00 €",15-01-2019,15-11-2018,363 dias,"Portugal, Portalegre, Portalegre","Artigo 20.º, n.º 1, alínea d) do Código dos Contratos Públicos",,,,,,Não aplicável.,Não aplicável.,FALSE
Fornecimento de Pulseiras TYVEK para ULSNA EPE - Ano 2019,Ajuste Direto Regime Geral,Aquisição de bens móveis,"33140000-3, Material médico de consumo","Unidade Local de Saúde do Norte Alentejano, E. P. E. (508094461)",AVIQUIMICA (500039720),"1.515,67 €",15-01-2019,18-10-2018,363 dias,"Portugal, Portalegre, Portalegre","Artigo 20.º, n.º 1, alínea d) do Código dos Contratos Públicos",,,,,,Não aplicável.,Não aplicável.,FALSE
Fornecimento de Bolsas para Cadáver e Sistemas de Drenagem para ULSNA EPE - Ano 2019,Ajuste Direto Regime Geral,Aquisição de bens móveis,"33140000-3, Material médico de consumo","Unidade Local de Saúde do Norte Alentejano, E. P. E. (508094461)","MUC - MATERIAL UTILIDADE  CLINICA, LDA (502379308)","824,10 €",15-01-2019,18-10-2018,363 dias,"Portugal, Portalegre, Portalegre","Artigo 20.º, n.º 1, alínea d) do Código dos Contratos Públicos",,,,,,Não aplicável.,Não aplicável.,FALSE
"Prestação de Serviços Médicos na Especialidade de Anestesiologia, na ULSNA, EPE (Período máximo janeiro a fevereiro de 2019)",Ajuste Direto Regime Geral,Aquisição de serviços,"85100000-0, Serviços de saúde","Unidade Local de Saúde do Norte Alentejano, E. P. E. (508094461)",Ciclipolis Serviços Médicos Lda (508320526),"86.422,08 €",15-01-2019,07-01-2019,59 dias,"Portugal, Portalegre","Artigo 24.º, n.º 1, alínea c) do Código dos Contratos Públicos",,,,,,Não aplicável.,Não aplicável.,FALSE
"Fornecimento de Kit's de Nefrostomia para ULSNA EPE, ano 2019",Ajuste Direto Regime Geral,Aquisição de bens móveis,"33140000-3, Material médico de consumo","Unidade Local de Saúde do Norte Alentejano, E. P. E. (508094461)","COLOPLAST PORTUGAL SOC. UNIP., LDA  (503989037)","361,25 €",15-01-2019,18-10-2018,363 dias,"Portugal, Portalegre, Portalegre","Artigo 20.º, n.º 1, alínea d) do Código dos Contratos Públicos",,,,,,Não aplicável.,Não aplicável.,FALSE
"Fornecimento de Material para Empacotamento em Esterilização à ULSNA, EPE, durante o ano 2019, AQ 43/2016 da SPMS",Ao abrigo de acordo-quadro (art.º 259.º),Aquisição de bens móveis,"33140000-3, Material médico de consumo","Unidade Local de Saúde do Norte Alentejano, E. P. E. (508094461)",JOHNSON JOHNSON MEDICAL (500153370),"370,00 €",15-01-2019,10-01-2019,350 dias,"Portugal, Portalegre",Artigo 259.º do Código dos Contratos Públicos,,,,,,1974943,CP 2016/43 - Acordo quadro para fornecimento de Material para Empacotamento em Esterilização às Instituições e Serviços do Serviço Nacional de Saúde.,FALSE
"Fornecimento de Material para Empacotamento em Esterilização à ULSNA, EPE, durante o ano 2019, AQ 43/2016 da SPMS",Ao abrigo de acordo-quadro (art.º 259.º),Aquisição de bens móveis,"33140000-3, Material médico de consumo","Unidade Local de Saúde do Norte Alentejano, E. P. E. (508094461)","Docworld, Lda (508592909)","4.421,96 €",15-01-2019,10-01-2019,350 dias,"Portugal, Portalegre",Artigo 259.º do Código dos Contratos Públicos,,,,,,1974943,CP 2016/43 - Acordo quadro para fornecimento de Material para Empacotamento em Esterilização às Instituições e Serviços do Serviço Nacional de Saúde.,FALSE
"Fornecimento de Luvas para Uso Hospitalar, à ULSNA, EPE, durante 2019 - AQ 23/2017",Ao abrigo de acordo-quadro (art.º 259.º),Aquisição de bens móveis,"33140000-3, Material médico de consumo","Unidade Local de Saúde do Norte Alentejano, E. P. E. (508094461)",EME ELECTROMEDICA - EZEQUIEL PANAO JORGE (501412727),"214,80 €",14-01-2019,10-01-2019,351 dias,"Portugal, Portalegre",Artigo 259.º do Código dos Contratos Públicos,,,,,,2587226,CP 2017/23-Acordo quadro para fornecimento de Luvas para uso Hospitalar   às Instituições e Serviços do Serviço Nacional de Saúde,FALSE
"Fornecimento de Agulhas à ULSNA, EPE, para 2019 - AQ 213/2017",Ao abrigo de acordo-quadro (art.º 259.º),Aquisição de bens móveis,"33140000-3, Material médico de consumo","Unidade Local de Saúde do Norte Alentejano, E. P. E. (508094461)","Docworld, Lda (508592909)","4.199,00 €",14-01-2019,10-01-2019,351 dias,"Portugal, Portalegre",Artigo 259.º do Código dos Contratos Públicos,,,,,,3016192,CP 2017/213 - Acordo quadro para fornecimento de Agulhas às Instituições e Serviços do Serviço Nacional de Saúde,FALSE
MEDICAMENTOS,Ajuste Direto Regime Geral,Aquisição de bens móveis,"35000000-4, Equipamento de segurança, combate a incêndios, polícia e defesa","Unidade Local de Saúde do Norte Alentejano, E. P. E. (508094461)","CARDINAL HEALTH PORTUGAL 513, UNIPESSOAL, LDA (513620834)","35,70 €",11-01-2019,14-12-2018,365 dias,"Portugal, Portalegre, Portalegre<BR/>Portugal, Portalegre, Elvas","Artigo 24.º, n.º 1, alínea c) do Código dos Contratos Públicos",,,,,,Não aplicável.,Não aplicável.,FALSE
MEDICAMENTOS,Ajuste Direto Regime Geral,Aquisição de bens móveis,"33000000-0, Equipamento médico, medicamentos e produtos para cuidados pessoais","Unidade Local de Saúde do Norte Alentejano, E. P. E. (508094461)","CARDINAL HEALTH PORTUGAL 513, UNIPESSOAL, LDA (513620834)","35,70 €",11-01-2019,14-12-2018,365 dias,"Portugal, Portalegre, Elvas<BR/>Portugal, Portalegre, Portalegre","Artigo 24.º, n.º 1, alínea c) do Código dos Contratos Públicos",,,,,,Não aplicável.,Não aplicável.,FALSE
MEDICAMENTOS,Ajuste Direto Regime Geral,Aquisição de bens móveis,"33000000-0, Equipamento médico, medicamentos e produtos para cuidados pessoais","Unidade Local de Saúde do Norte Alentejano, E. P. E. (508094461)",ROCHE SISTEMA DE DIAGNOSTICOS (504282921),"537,60 €",11-01-2019,14-12-2018,365 dias,"Portugal, Portalegre, Elvas<BR/>Portugal, Portalegre, Portalegre","Artigo 24.º, n.º 1, alínea c) do Código dos Contratos Públicos",,,,,,Não aplicável.,Não aplicável.,FALSE
MEDICAMENTOS,Ajuste Direto Regime Geral,Aquisição de bens móveis,"33000000-0, Equipamento médico, medicamentos e produtos para cuidados pessoais","Unidade Local de Saúde do Norte Alentejano, E. P. E. (508094461)",LOGIFARMA - LOGISTICA FARMACÊUTICA S.A. (503934640),"348,00 €",11-01-2019,14-12-2018,365 dias,"Portugal, Portalegre, Portalegre<BR/>Portugal, Portalegre, Elvas","Artigo 24.º, n.º 1, alínea c) do Código dos Contratos Públicos",,,,,,Não aplicável.,Não aplicável.,FALSE
MEDICAMENTOS,Ajuste Direto Regime Geral,Aquisição de bens móveis,"33000000-0, Equipamento médico, medicamentos e produtos para cuidados pessoais","Unidade Local de Saúde do Norte Alentejano, E. P. E. (508094461)",GUERBET A MARTINS  FERNANDES S A (501172114),"70,00 €",11-01-2019,14-12-2018,365 dias,"Portugal, Portalegre, Portalegre<BR/>Portugal, Portalegre, Elvas","Artigo 24.º, n.º 1, alínea c) do Código dos Contratos Públicos",,,,,,Não aplicável.,Não aplicável.,FALSE
MEDICAMENTOS,Ajuste Direto Regime Geral,Aquisição de bens móveis,"33000000-0, Equipamento médico, medicamentos e produtos para cuidados pessoais","Unidade Local de Saúde do Norte Alentejano, E. P. E. (508094461)","FARMACIA ELVAS UNIPESSOAL, LDA. (505542005)","29,13 €",11-01-2019,14-12-2018,365 dias,"Portugal, Portalegre, Elvas<BR/>Portugal, Portalegre, Portalegre","Artigo 24.º, n.º 1, alínea c) do Código dos Contratos Públicos",,,,,,Não aplicável.,Não aplicável.,FALSE
MEDICAMENTOS,Ajuste Direto Regime Geral,Aquisição de bens móveis,"33000000-0, Equipamento médico, medicamentos e produtos para cuidados pessoais","Unidade Local de Saúde do Norte Alentejano, E. P. E. (508094461)",DILOFAR DISTRIBUICAO TRANSPORTES E LOGISTICA (500563004),"170,20 €",11-01-2019,14-12-2018,365 dias,"Portugal, Portalegre, Elvas<BR/>Portugal, Portalegre, Portalegre","Artigo 24.º, n.º 1, alínea c) do Código dos Contratos Públicos",,,,,,Não aplicável.,Não aplicável.,FALSE
MEDICAMENTOS,Ajuste Direto Regime Geral,Aquisição de bens móveis,"33000000-0, Equipamento médico, medicamentos e produtos para cuidados pessoais","Unidade Local de Saúde do Norte Alentejano, E. P. E. (508094461)",CS PORTUGAL PRODUTOS FARMACEUTICOS (503395960),"84,00 €",11-01-2019,14-12-2018,365 dias,"Portugal, Portalegre, Elvas<BR/>Portugal, Portalegre, Portalegre","Artigo 24.º, n.º 1, alínea c) do Código dos Contratos Públicos",,,,,,Não aplicável.,Não aplicável.,FALSE
MEDICAMENTOS,Ajuste Direto Regime Geral,Aquisição de bens móveis,"33000000-0, Equipamento médico, medicamentos e produtos para cuidados pessoais","Unidade Local de Saúde do Norte Alentejano, E. P. E. (508094461)",BAUSCH  LOMB (980218764),"130,00 €",11-01-2019,14-12-2018,365 dias,"Portugal, Portalegre, Portalegre<BR/>Portugal, Portalegre, Elvas","Artigo 24.º, n.º 1, alínea c) do Código dos Contratos Públicos",,,,,,Não aplicável.,Não aplicável.,FALSE
MEDICAMENTOS,Ajuste Direto Regime Geral,Aquisição de bens móveis,"33000000-0, Equipamento médico, medicamentos e produtos para cuidados pessoais","Unidade Local de Saúde do Norte Alentejano, E. P. E. (508094461)",PAUL HARTMANN (502271728),"120,00 €",11-01-2019,14-12-2018,365 dias,"Portugal, Portalegre, Portalegre<BR/>Portugal, Portalegre, Elvas","Artigo 24.º, n.º 1, alínea c) do Código dos Contratos Públicos",,,,,,Não aplicável.,Não aplicável.,FALSE
MEDICAMENTOS,Ajuste Direto Regime Geral,Aquisição de bens móveis,"33000000-0, Equipamento médico, medicamentos e produtos para cuidados pessoais","Unidade Local de Saúde do Norte Alentejano, E. P. E. (508094461)","NUTRICIA ADVANCED MEDICAL NUTRICION, LDA. (507558286)","154,80 €",11-01-2019,14-12-2018,365 dias,"Portugal, Portalegre, Portalegre<BR/>Portugal, Portalegre, Elvas","Artigo 24.º, n.º 1, alínea c) do Código dos Contratos Públicos",,,,,,Não aplicável.,Não aplicável.,FALSE
MEDICAMENTOS,Ajuste Direto Regime Geral,Aquisição de bens móveis,"33000000-0, Equipamento médico, medicamentos e produtos para cuidados pessoais","Unidade Local de Saúde do Norte Alentejano, E. P. E. (508094461)",JOHNSON JOHNSON MEDICAL (500153370),"480,00 €",11-01-2019,14-12-2018,365 dias,"Portugal, Portalegre, Elvas<BR/>Portugal, Portalegre, Portalegre","Artigo 24.º, n.º 1, alínea c) do Código dos Contratos Públicos",,,,,,Não aplicável.,Não aplicável.,FALSE
MEDICAMENTOS,Ajuste Direto Regime Geral,Aquisição de bens móveis,"33000000-0, Equipamento médico, medicamentos e produtos para cuidados pessoais","Unidade Local de Saúde do Norte Alentejano, E. P. E. (508094461)","DR. FALK PHARMA PORTUGAL,LDA (506171612)","153,27 €",11-01-2019,14-12-2018,365 dias,"Portugal, Portalegre, Elvas<BR/>Portugal, Portalegre, Portalegre","Artigo 24.º, n.º 1, alínea c) do Código dos Contratos Públicos",,,,,,Não aplicável.,Não aplicável.,FALSE
MEDICAMENTOS,Ajuste Direto Regime Geral,Aquisição de bens móveis,"33000000-0, Equipamento médico, medicamentos e produtos para cuidados pessoais","Unidade Local de Saúde do Norte Alentejano, E. P. E. (508094461)",BRISTOL - MYERS SQUIBB SA. (500048193),"27,36 €",11-01-2019,14-12-2018,365 dias,"Portugal, Portalegre, Portalegre<BR/>Portugal, Portalegre, Elvas","Artigo 24.º, n.º 1, alínea c) do Código dos Contratos Públicos",,,,,,Não aplicável.,Não aplicável.,FALSE
MEDICAMENTOS,Ajuste Direto Regime Geral,Aquisição de bens móveis,"33000000-0, Equipamento médico, medicamentos e produtos para cuidados pessoais","Unidade Local de Saúde do Norte Alentejano, E. P. E. (508094461)","Johnson & Johnson Vision - AMO, SL - Suc. Portugal (980262364)","1.188,00 €",11-01-2019,14-12-2018,365 dias,"Portugal, Portalegre, Portalegre<BR/>Portugal, Portalegre, Elvas","Artigo 24.º, n.º 1, alínea c) do Código dos Contratos Públicos",,,,,,Não aplicável.,Não aplicável.,FALSE
MEDICAMENTOS,Ajuste Direto Regime Geral,Aquisição de bens móveis,"33000000-0, Equipamento médico, medicamentos e produtos para cuidados pessoais","Unidade Local de Saúde do Norte Alentejano, E. P. E. (508094461)",AIR LIQUIDE MEDICINAL SA (501576436),"101,76 €",11-01-2019,14-12-2018,365 dias,"Portugal, Portalegre, Portalegre<BR/>Portugal, Portalegre, Elvas","Artigo 24.º, n.º 1, alínea c) do Código dos Contratos Públicos",,,,,,Não aplicável.,Não aplicável.,FALSE
MEDICAMENTOS,Ajuste Direto Regime Geral,Aquisição de bens móveis,"33000000-0, Equipamento médico, medicamentos e produtos para cuidados pessoais","Unidade Local de Saúde do Norte Alentejano, E. P. E. (508094461)","FARMACIA ELVAS UNIPESSOAL, LDA. (505542005)","4,28 €",11-01-2019,14-12-2018,365 dias,"Portugal, Portalegre, Elvas<BR/>Portugal, Portalegre, Portalegre","Artigo 24.º, n.º 1, alínea c) do Código dos Contratos Públicos",,,,,,Não aplicável.,Não aplicável.,FALSE
MEDICAMENTOS,Ajuste Direto Regime Geral,Aquisição de bens móveis,"33000000-0, Equipamento médico, medicamentos e produtos para cuidados pessoais","Unidade Local de Saúde do Norte Alentejano, E. P. E. (508094461)",Clinigen Healthcare Ltd (100125104),"69,00 €",11-01-2019,14-12-2018,365 dias,"Portugal, Portalegre, Portalegre<BR/>Portugal, Portalegre, Elvas","Artigo 24.º, n.º 1, alínea c) do Código dos Contratos Públicos",,,,,,Não aplicável.,Não aplicável.,FALSE
MEDICAMENTOS,Ajuste Direto Regime Geral,Aquisição de bens móveis,"33000000-0, Equipamento médico, medicamentos e produtos para cuidados pessoais","Unidade Local de Saúde do Norte Alentejano, E. P. E. (508094461)","Celgene Sociedade Unipessoal, Lda. (507791690)","1.770,00 €",11-01-2019,14-12-2018,365 dias,"Portugal, Portalegre, Portalegre<BR/>Portugal, Portalegre, Elvas","Artigo 24.º, n.º 1, alínea c) do Código dos Contratos Públicos",,,,,,Não aplicável.,Não aplicável.,FALSE
MEDICAMENTOS,Ajuste Direto Regime Geral,Aquisição de bens móveis,"33000000-0, Equipamento médico, medicamentos e produtos para cuidados pessoais","Unidade Local de Saúde do Norte Alentejano, E. P. E. (508094461)",BRISTOL - MYERS SQUIBB SA. (500048193),"6.742,32 €",11-01-2019,14-12-2018,365 dias,"Portugal, Portalegre, Portalegre<BR/>Portugal, Portalegre, Elvas","Artigo 24.º, n.º 1, alínea c) do Código dos Contratos Públicos",,,,,,Não aplicável.,Não aplicável.,FALSE
MEDICAMENTOS,Ajuste Direto Regime Geral,Aquisição de bens móveis,"33000000-0, Equipamento médico, medicamentos e produtos para cuidados pessoais","Unidade Local de Saúde do Norte Alentejano, E. P. E. (508094461)","FARMACIA ELVAS UNIPESSOAL, LDA. (505542005)","23,55 €",11-01-2019,14-12-2018,365 dias,"Portugal, Portalegre, Elvas<BR/>Portugal, Portalegre, Portalegre","Artigo 24.º, n.º 1, alínea c) do Código dos Contratos Públicos",,,,,,Não aplicável.,Não aplicável.,FALSE
MEDICAMENTOS,Ajuste Direto Regime Geral,Aquisição de bens móveis,"33000000-0, Equipamento médico, medicamentos e produtos para cuidados pessoais","Unidade Local de Saúde do Norte Alentejano, E. P. E. (508094461)","FARMACIA ELVAS UNIPESSOAL, LDA. (505542005)","23,00 €",11-01-2019,14-12-2018,365 dias,"Portugal, Portalegre, Portalegre<BR/>Portugal, Portalegre, Elvas","Artigo 24.º, n.º 1, alínea c) do Código dos Contratos Públicos",,,,,,Não aplicável.,Não aplicável.,FALSE
MEDICAMENTOS,Ajuste Direto Regime Geral,Aquisição de bens móveis,"33000000-0, Equipamento médico, medicamentos e produtos para cuidados pessoais","Unidade Local de Saúde do Norte Alentejano, E. P. E. (508094461)","NOVARTIS FARMA-PROD.FARMACÊUTICOS,SA. (500063524)","6.628,34 €",11-01-2019,14-12-2018,365 dias,"Portugal, Portalegre, Portalegre","Artigo 24.º, n.º 1, alínea c) do Código dos Contratos Públicos",,,,,,Não aplicável.,Não aplicável.,FALSE
MEDICAMENTOS,Ajuste Direto Regime Geral,Aquisição de bens móveis,"33000000-0, Equipamento médico, medicamentos e produtos para cuidados pessoais","Unidade Local de Saúde do Norte Alentejano, E. P. E. (508094461)","NOVARTIS FARMA-PROD.FARMACÊUTICOS,SA. (500063524)","6.628,34 €",11-01-2019,14-12-2018,365 dias,"Portugal, Portalegre, Portalegre","Artigo 24.º, n.º 1, alínea c) do Código dos Contratos Públicos",,,,,,Não aplicável.,Não aplicável.,FALSE
