Objeto do Contrato,Tipo de Procedimento,Tipo(s) de Contrato,CPVs,Entidade(s) Adjudicante(s),Entidade(s) Adjudicatária(s),Preço Contratual,Data de Publicação,Data de Celebração do Contrato,Prazo de Execução,Local de Execução,Fundamentação,Data de Fecho do Contrato,Preço Total Efetivo,Causas das Alterações ao Prazo,Causas das Alterações ao Preço,Estado,N.º registo do Acordo Quadro,Descrição do Acordo Quadro,Procedimento Centralizado
Aquisição de Material de Laparoscopia com colocação de equipamento,Concurso público,Aquisição de bens móveis,"33100000-1, Equipamento médico","Unidade Local de Saúde do Norte Alentejano, E.P.E. (508094461)","Endotecnica - Material Cirurgico, Lda (503818348), COVIDIEN PORTUGAL (503413410), B BRAUN MEDICAL, LDA. (501506543), ENDOWAVE LDA (508651352), CLINIFAR SA (503281115)","101.288,34 €",31-10-2012,13-09-2012,1095 dias,"Portugal, Portalegre, Portalegre","Artigo 20.º, n.º 1, alínea b) do Código dos Contratos Públicos",31-12-2012,"101.288,34 €",,,,Não aplicável.,Não aplicável.,
"AQUISIÇÃO DE SERVIÇOS MÉDICOS DE MEDICINA GERAL E FAMILIAR, POR LOTES, PARA O ANO DE 2011, PARA A UNIDADE LOCAL DE SAÚDE DO NORTE ALENTEJANO, E.P.E",Concurso público,Aquisição de serviços,"85100000-0, Serviços de saúde","Unidade Local de Saúde do Norte Alentejano, E.P.E. (508094461)","Helped - Prestação de Serviços de Saúde, Lda. (506069010)","175.050,72 €",30-10-2012,30-06-2011,184 dias,"Portugal, Portalegre, Portalegre","Artigo 20.º, n.º 1, alínea b) do Código dos Contratos Públicos",30-06-2011,"175.050,72 €",,,,Não aplicável.,Não aplicável.,
"Prestação de Serviços de Lavagem, Tratamento e Fornecimento de Roupa em Regime de Aluguer à Unidade Local de Saúde do Norte Alentejano, EPE",Concurso público,Aquisição de serviços,"98311000-6, Serviços de recolha de roupa por lavandarias","Unidade Local de Saúde do Norte Alentejano, E.P.E. (508094461)","Lavapor - Lavandarias de Portugal, SA (508313422)","187.215,12 €",30-10-2012,28-06-2011,184 dias,"Portugal, Portalegre, Portalegre","Artigo 20.º, n.º 1, alínea b) do Código dos Contratos Públicos",31-12-2011,"187.215,12 €",,,,Não aplicável.,Não aplicável.,
"Prestação de Serviços de Lavagem, Tratamento e Fornecimento de Roupa em Regime de Aluguer à Unidade Local de Saúde do Norte Alentejano, EPE (2012)",Ajuste Direto Regime Geral,Aquisição de serviços,"98311000-6, Serviços de recolha de roupa por lavandarias","Unidade Local de Saúde do Norte Alentejano, E.P.E. (508094461)","Lavapor - Lavandarias de Portugal, SA (508313422)","312.025,23 €",30-10-2012,27-02-2012,306 dias,"Portugal, Portalegre, Portalegre","Artigo 27.º, n.º 1, alínea a) do Código dos Contratos Públicos",31-12-2012,"312.025,23 €",,,,Não aplicável.,Não aplicável.,
"Fornecimento de gases medicinais para a Unidade Local de Saúde do Norte Alentejano, EPE",Concurso público,Aquisição de bens móveis,"33000000-0, Equipamento médico, medicamentos e produtos para cuidados pessoais","Unidade Local de Saúde do Norte Alentejano, E.P.E. (508094461)","Air Liquide Medicinal, SA (501576436)","1.066.413,30 €",29-10-2012,01-01-2012,1095 dias,"Portugal, Portalegre, Portalegre","Artigo 20.º, n.º 1, alínea b) do Código dos Contratos Públicos",31-12-2013,"1.066.413,30 €",,,,Não aplicável.,Não aplicável.,
"Aquisição de Equipamento Médico e Mobiliário Hospitalar para a Unidade Local de Saúde do Norte Alentejano, EPE.",Concurso público,Aquisição de bens móveis,"33100000-1, Equipamento médico","Unidade Local de Saúde do Norte Alentejano, E.P.E. (508094461)","Intercromo, SA (504058568), Hill-Rom, Lda. (507992083), Sano-Técnica Medical (500239819), Icotrónica - Equipamento médico-hospitalar, Lda. (500715920), NKM Unipessoal, Lda. (508930138), Expomédica - Sociedade Exportadora Importadora de Material Médico, Lda. (501886621), Clinifar - Produtos Clínicos e Farmaceuticos, SA (503281115)","123.727,30 €",29-10-2012,04-11-2011,30 dias,"Portugal, Portalegre, Portalegre","Artigo 20.º, n.º 1, alínea b) do Código dos Contratos Públicos","","",,,,Não aplicável.,Não aplicável.,
Aquisição de aparelho de TAC para a Unidade de Imagiologia do Hospital Dr. José Maria Grande de Portalegre,Concurso público,Aquisição de bens móveis,"33115000-9, Aparelhos para tomografia","Unidade Local de Saúde do Norte Alentejano, E.P.E. (508094461)","Siemens, SA (500247480)","180.000,00 €",29-10-2012,13-06-2011,29 dias,"Portugal, Portalegre, Portalegre","Artigo 20.º, n.º 1, alínea b) do Código dos Contratos Públicos","","",,,,Não aplicável.,Não aplicável.,
Aquisição de cadeiras e secretária para a Unidade de Cuidados Intermédios do HSLE,Ajuste Direto Regime Geral,Aquisição de bens móveis,"39100000-3, Mobiliário","Unidade Local de Saúde do Norte Alentejano, E.P.E. (508094461)",FAMO - Indústria de Mobiliário de Escritório (500148074),"620,15 €",29-10-2012,30-03-2011,20 dias,"Portugal, Portalegre, Portalegre",Artigo 258.º do Código dos Contratos Públicos,30-03-2011,"620,15 €",,,,Não aplicável.,Não aplicável.,
"Aquisição de Uma Viatura no Âmbito do Projecto Inovador para a Saúde Mental da ULSNA, EPE",Ajuste Direto Regime Geral,Aquisição de bens móveis,"34110000-1, Automóveis de passageiros","Unidade Local de Saúde do Norte Alentejano, E.P.E. (508094461)","Renault Portugal, SA (500970602)","17.102,68 €",29-10-2012,10-08-2011,50 dias,"Portugal, Portalegre, Portalegre",Artigo 258.º do Código dos Contratos Públicos,10-08-2011,"17.102,68 €",,,,Não aplicável.,Não aplicável.,
"Aquisição de Cadeiras para o Serviço de Radiologia do Hospital Santa Luzia de Elvas - ULSNA, EPE",Ajuste Direto Regime Geral,Aquisição de bens móveis,"39112000-0, Cadeiras","Unidade Local de Saúde do Norte Alentejano, E.P.E. (508094461)","Haworth Portugal Mobiliário de Escritório, SA (500077622)","468,00 €",29-10-2012,20-12-2011,30 dias,"Portugal, Portalegre, Portalegre",Artigo 258.º do Código dos Contratos Públicos,"","",,,,Não aplicável.,Não aplicável.,
