freguesia,acronym,validVotesPercentage,votes,dicofre
São Matias,PS,48.87,65,020516
São Matias,PCP-PEV,19.55,26,020516
São Matias,B.E.,15.04,20,020516
São Matias,PPD/PSD,3.76,5,020516
São Matias,CDS-PP,3.01,4,020516
São Matias,PAN,3.01,4,020516
São Matias,PCTP/MRPP,2.26,3,020516
São Matias,PPM.PPV/CDC,1.5,2,020516
São Matias,A,0.75,1,020516
São Matias,MAS,0.75,1,020516
São Matias,PTP,0.75,1,020516
São Matias,PURP,0.75,1,020516
São Matias,IL,0,0,020516
São Matias,L,0,0,020516
São Matias,NC,0,0,020516
São Matias,PDR,0,0,020516
São Matias,PNR,0,0,020516
