freguesia,acronym,validVotesPercentage,votes,dicofre
Bárrio e Cepões,PPD/PSD,37.5,153,160755
Bárrio e Cepões,PS,31.13,127,160755
Bárrio e Cepões,CDS-PP,14.22,58,160755
Bárrio e Cepões,B.E.,8.09,33,160755
Bárrio e Cepões,PAN,3.19,13,160755
Bárrio e Cepões,PCP-PEV,2.21,9,160755
Bárrio e Cepões,PNR,0.74,3,160755
Bárrio e Cepões,IL,0.49,2,160755
Bárrio e Cepões,JPP,0.49,2,160755
Bárrio e Cepões,PTP,0.49,2,160755
Bárrio e Cepões,PURP,0.49,2,160755
Bárrio e Cepões,CH,0.25,1,160755
Bárrio e Cepões,L,0.25,1,160755
Bárrio e Cepões,MPT,0.25,1,160755
Bárrio e Cepões,NC,0.25,1,160755
Bárrio e Cepões,A,0,0,160755
Bárrio e Cepões,PCTP/MRPP,0,0,160755
Bárrio e Cepões,PDR,0,0,160755
Bárrio e Cepões,PPM,0,0,160755
Bárrio e Cepões,R.I.R.,0,0,160755
