freguesia,acronym,validVotesPercentage,votes,dicofre
União das freguesias de Campelos e Outeiro da Cabeça,PPD/PSD.CDS-PP,42.11,376,111322
União das freguesias de Campelos e Outeiro da Cabeça,PS,30.24,270,111322
União das freguesias de Campelos e Outeiro da Cabeça,PCP-PEV,10.64,95,111322
União das freguesias de Campelos e Outeiro da Cabeça,MPT,4.93,44,111322
União das freguesias de Campelos e Outeiro da Cabeça,B.E.,3.7,33,111322
União das freguesias de Campelos e Outeiro da Cabeça,PCTP/MRPP,1.68,15,111322
União das freguesias de Campelos e Outeiro da Cabeça,L,1.46,13,111322
União das freguesias de Campelos e Outeiro da Cabeça,PAN,1.23,11,111322
União das freguesias de Campelos e Outeiro da Cabeça,PND,1.12,10,111322
União das freguesias de Campelos e Outeiro da Cabeça,PPV,1.01,9,111322
União das freguesias de Campelos e Outeiro da Cabeça,MAS,0.56,5,111322
União das freguesias de Campelos e Outeiro da Cabeça,PPM,0.56,5,111322
União das freguesias de Campelos e Outeiro da Cabeça,PDA,0.34,3,111322
União das freguesias de Campelos e Outeiro da Cabeça,PTP,0.34,3,111322
União das freguesias de Campelos e Outeiro da Cabeça,POUS,0.11,1,111322
União das freguesias de Campelos e Outeiro da Cabeça,PNR,0,0,111322
