freguesia,acronym,validVotesPercentage,votes,dicofre
Moimenta da Beira,PS,39.53,268,180710
Moimenta da Beira,PPD/PSD,24.63,167,180710
Moimenta da Beira,CDS-PP,11.21,76,180710
Moimenta da Beira,B.E.,8.41,57,180710
Moimenta da Beira,PCP-PEV,4.28,29,180710
Moimenta da Beira,PAN,4.13,28,180710
Moimenta da Beira,L,1.77,12,180710
Moimenta da Beira,A,1.47,10,180710
Moimenta da Beira,NC,1.47,10,180710
Moimenta da Beira,PPM.PPV/CDC,1.47,10,180710
Moimenta da Beira,PNR,0.74,5,180710
Moimenta da Beira,PCTP/MRPP,0.29,2,180710
Moimenta da Beira,PDR,0.29,2,180710
Moimenta da Beira,IL,0.15,1,180710
Moimenta da Beira,MAS,0.15,1,180710
Moimenta da Beira,PTP,0,0,180710
Moimenta da Beira,PURP,0,0,180710
