Objeto do Contrato,Tipo de Procedimento,Tipo(s) de Contrato,CPVs,Entidade(s) Adjudicante(s),Entidade(s) Adjudicatária(s),Preço Contratual,Data de Publicação,Data de Celebração do Contrato,Prazo de Execução,Local de Execução,Fundamentação,Data de Fecho do Contrato,Preço Total Efetivo,Causas das Alterações ao Prazo,Causas das Alterações ao Preço,Estado,N.º registo do Acordo Quadro,Descrição do Acordo Quadro,Procedimento Centralizado
Aquisição de Cloridrato de Metadona para o ano 2014,Concurso público,Aquisição de bens móveis,"33693300-7, Tratamento da toxicodependência",Serviço de Intervenção nos Comportamentos Aditivos e nas Dependências (600084884),"Gold Farma - Comércio de Produtos Farmacêuticos, Lda (507372328)","201.036,64 €",10-09-2014,26-05-2014,360 dias,"Portugal, Lisboa, Lisboa","Artigo 20.º, n.º 1, alínea b) do Código dos Contratos Públicos",,,,,,Não aplicável.,Não aplicável.,FALSE
Aquisição de serviços de investigação no âmbito do inquérito nacional sobre comportamentos aditivos em meio prisional,Concurso público,Aquisição de serviços,"73110000-6, Serviços de investigação",Serviço de Intervenção nos Comportamentos Aditivos e nas Dependências (600084884),Instituto de Ciências Sociais e Políticas (600019152),"119.760,00 €",10-09-2014,25-07-2014,160 dias,"Portugal, Lisboa, Lisboa","Artigo 20.º, n.º 1, alínea b) do Código dos Contratos Públicos",,,,,,Não aplicável.,Não aplicável.,FALSE
"Aquisição de publicações  -  Linhas Orientadoras""""Segurança e Saúde do Trabalho e a Prevenção do Consumo de Substâncias Psicoativas: Linha Orientadoras para a Intervenção em Meio Laboral"""".",Ajuste Direto Regime Geral,Aquisição de serviços,"79000000-4, Serviços a empresas: direito, comercialização, consultoria, recrutamento, impressão e segurança",Serviço de Intervenção nos Comportamentos Aditivos e nas Dependências (600084884),"Loures Gráfica - Sociedade de Artes Gráficas, Lda (501709304)","2.950,00 €",05-09-2014,06-11-2013,20 dias,"Portugal, Lisboa, Lisboa","Artigo 20.º, n.º 1, alínea a) do Código dos Contratos Públicos",,,,,,Não aplicável.,Não aplicável.,FALSE
