freguesia,acronym,validVotesPercentage,votes,dicofre
Graça,PPD/PSD,47.06,72,101301
Graça,PS,32.68,50,101301
Graça,CDS-PP,4.58,7,101301
Graça,A,3.27,5,101301
Graça,B.E.,3.27,5,101301
Graça,IL,2.61,4,101301
Graça,PNR,1.31,2,101301
Graça,PURP,1.31,2,101301
Graça,L,0.65,1,101301
Graça,MAS,0.65,1,101301
Graça,NC,0.65,1,101301
Graça,PAN,0.65,1,101301
Graça,PCP-PEV,0.65,1,101301
Graça,PPM.PPV/CDC,0.65,1,101301
Graça,PCTP/MRPP,0,0,101301
Graça,PDR,0,0,101301
Graça,PTP,0,0,101301
