Objeto do Contrato,Tipo de Procedimento,Tipo(s) de Contrato,CPVs,Entidade(s) Adjudicante(s),Entidade(s) Adjudicatária(s),Preço Contratual,Data de Publicação,Data de Celebração do Contrato,Prazo de Execução,Local de Execução,Fundamentação,Data de Fecho do Contrato,Preço Total Efetivo,Causas das Alterações ao Prazo,Causas das Alterações ao Preço,Estado,N.º registo do Acordo Quadro,Descrição do Acordo Quadro,Procedimento Centralizado
Aquisição de serviços especializados e suporte aplicacional PREMIER da Microsoft e technical Account Manager,Ajuste Direto Regime Geral,Aquisição de serviços,"72261000-2, Serviços de assistência em matéria de software","SPMS- Serviços Partilhados do M. da Saúde, E.P.E. (509540716)",MSFT - Software para Microcomputadores (502586745),"199.000,00 €",03-03-2017,30-12-2016,365 dias,Portugal,"Artigo 24.º, n.º 1, alínea e) do Código dos Contratos Públicos",01-01-2018,"199.000,00 €",,,,Não aplicável.,Não aplicável.,FALSE
Aquisição de serviços de manutenção do Registo Nacional de Utentes (RNU),Ao abrigo de acordo-quadro (art.º 259.º),Aquisição de serviços,"71317200-5, Serviços de saúde e segurança","SPMS- Serviços Partilhados do M. da Saúde, E.P.E. (509540716)","AltranPortugal, SA (504272179)","84.330,40 €",01-03-2017,26-01-2017,545 dias,Portugal,Artigo 259.º do Código dos Contratos Públicos,"","",,,,2096651,Acordo quadro para Prestação de Serviços de Consultadoria na área Jurídica às Instituições e Serviços do Serviço Nacional de Saúde e entidades do Ministério da Saúde,FALSE
Aquisição de serviços de Administração de Sistemas,Ajuste Direto Regime Geral,Aquisição de serviços,"72222300-0, Serviços relacionados com as tecnologias da informação","SPMS - Serviços Partilhados do Ministério da Saúde, E. P. E. (509540716)","Iten Solutions -Sistemas de Informação, S.A. (510728189)","51.504,00 €",01-03-2017,30-01-2017,334 dias,Portugal,"Artigo 20.º, n.º 1, alínea a) do Código dos Contratos Públicos",31-12-2017,"51.504,00 €",,,,Não aplicável.,Não aplicável.,FALSE
"Aquisição de serviços de operação (roll out e suporte),manutenção e desenvolvimento da plataforma de interoperabilidade da SPMS (LIGHt)",Concurso público,Aquisição de serviços,"72500000-0, Serviços relacionados com a informática","SPMS - Serviços Partilhados do Ministério da Saúde, E. P. E. (509540716)","Optimizer- Serviços e Consultadoria Informática, Lda (504775936)","174.240,00 €",01-03-2017,06-02-2017,365 dias,Portugal,"Artigo 21.º, n.º 1, alínea b) do Código dos Contratos Públicos","","",,,,Não aplicável.,Não aplicável.,FALSE
Aquisição de equipamento informático,Ajuste Direto Regime Geral,Aquisição de bens móveis,"30200000-1, Equipamento e material informático","SPMS- Serviços Partilhados do M. da Saúde, E.P.E. (509540716)","Iten Solutions -Sistemas de Informação, S.A. (510728189)","6.895,90 €",01-03-2017,29-12-2016,60 dias,Portugal,"Artigo 20.º, n.º 1, alínea a) do Código dos Contratos Públicos",31-12-2016,"6.895,90 €",,,,Não aplicável.,Não aplicável.,FALSE
"Aquisição de serviços de manutenção de solução para centro de suporte da SPMS, EPE",Ajuste Direto Regime Geral,Aquisição de serviços,"72500000-0, Serviços relacionados com a informática","SPMS- Serviços Partilhados do M. da Saúde, E.P.E. (509540716)",NOS (502604751),"9.900,00 €",01-03-2017,02-02-2017,90 dias,Portugal,"Artigo 20.º, n.º 1, alínea a) do Código dos Contratos Públicos","","",,,,Não aplicável.,Não aplicável.,FALSE
Aquisição de serviços para elaboração de monitorização de processos internos da OSI,Ao abrigo de acordo-quadro (art.º 259.º),Aquisição de serviços,"71317200-5, Serviços de saúde e segurança","SPMS- Serviços Partilhados do M. da Saúde, E.P.E. (509540716)","Everis Portugal, S.A. (506204650)","90.013,44 €",01-03-2017,26-01-2017,365 dias,Portugal,Artigo 259.º do Código dos Contratos Públicos,26-01-2018,"90.013,44 €",,,,2096651,Acordo quadro para Prestação de Serviços de Consultadoria na área Jurídica às Instituições e Serviços do Serviço Nacional de Saúde e entidades do Ministério da Saúde,FALSE
Serviços de manutenção de equipamento IBM do Datacenter,Concurso público,Aquisição de serviços,"72500000-0, Serviços relacionados com a informática","SPMS - Serviços Partilhados do Ministério da Saúde, E. P. E. (509540716)","Informática El Corte Inglês, S.A. (980079659)","339.861,67 €",01-03-2017,31-01-2017,365 dias,Portugal,"Artigo 21.º, n.º 1, alínea b) do Código dos Contratos Públicos","","",,,,Não aplicável.,Não aplicável.,FALSE
"Aquisição de serviços de armazenamento, produção e distribuição de kits - Programa Troca de Seringas",Ajuste Direto Regime Geral,Aquisição de serviços,"79921000-6, Serviços de embalagem","SPMS - Serviços Partilhados do Ministério da Saúde, E. P. E. (509540716)","Efervescente - Design e Comunicação, Ldª (506738400)","26.962,50 €",21-02-2017,09-02-2017,90 dias,Portugal,"Artigo 20.º, n.º 1, alínea a) do Código dos Contratos Públicos",28-04-2017,"26.962,50 €",,,,Não aplicável.,Não aplicável.,FALSE
