Objeto do Contrato,Tipo de Procedimento,Tipo(s) de Contrato,CPVs,Entidade(s) Adjudicante(s),Entidade(s) Adjudicatária(s),Preço Contratual,Data de Publicação,Data de Celebração do Contrato,Prazo de Execução,Local de Execução,Fundamentação,Data de Fecho do Contrato,Preço Total Efetivo,Causas das Alterações ao Prazo,Causas das Alterações ao Preço,Estado,N.º registo do Acordo Quadro,Descrição do Acordo Quadro,Procedimento Centralizado
manutenção preventiva e assistência técnica aos fotocopiadores da ulsam,Ajuste Direto Regime Geral,Aquisição de serviços,"50313200-4, Serviços de manutenção de fotocopiadoras","Unidade Local de Saúde do Alto Minho, E. P. E. (508786193)","inCentea - Tecnologia de Gestão, S.A. (501968326)","10.775,00 €",19-04-2018,23-02-2018,306 dias,"Portugal, Viana do Castelo, Viana do Castelo","Artigo 20.º, n.º 1, alínea a) do Código dos Contratos Públicos",,,,,,Não aplicável.,Não aplicável.,FALSE
contratação da prestação de serviços de seguro de responsabilidade civil ramo automóvel e danos próprios para a frota da ulsam para 2018,Ajuste Direto Regime Geral,Aquisição de serviços,"66000000-0, Serviços de finanças e seguros","Unidade Local de Saúde do Alto Minho, E. P. E. (508786193)","Entreparentes - Soc. Mediação Seguros, Lda. (508688086)","12.346,54 €",18-04-2018,05-04-2018,365 dias,"Portugal, Viana do Castelo, Viana do Castelo","Artigo 20.º, n.º 1, alínea d) do Código dos Contratos Públicos",,,,,,Não aplicável.,Não aplicável.,FALSE
"contrato de manutenção e assistência técnica para os equipamentos de endoscopia de gastroenterologia, pneumologia e boc",Ajuste Direto Regime Geral,Aquisição de serviços,"50000000-5, Serviços de reparação e manutenção","Unidade Local de Saúde do Alto Minho, E. P. E. (508786193)","Olympus Ibéria, S.A.U. (980474710)","78.026,09 €",17-04-2018,12-04-2018,365 dias,"Portugal, Viana do Castelo, Viana do Castelo","Artigo 24.º, n.º 1, alínea e), subalínea iii) do Código dos Contratos Públicos",,,,,,Não aplicável.,Não aplicável.,FALSE
contrato para aquisição de serviços de manutenção dos sistemas de gestão risi nas entidades da saúde para o ano de 2018,Ajuste Direto Regime Geral,Aquisição de serviços,"72000000-5, Serviços de TI: consultoria, desenvolvimento de software, Internet e apoio","Unidade Local de Saúde do Alto Minho, E. P. E. (508786193)","RISI - Recursos, Ideias e Soluções Informáticas, Lda. (503754803)","10.200,00 €",16-04-2018,21-02-2018,365 dias,"Portugal, Viana do Castelo, Viana do Castelo","Artigo 24.º, n.º 1, alínea e), subalínea iii) do Código dos Contratos Públicos",,,,,,Não aplicável.,Não aplicável.,FALSE
aquisição de serviços de manutenção e assistência técnica aos pacs sectra instalados nas entidades do ministério da saúde para o ano 2018,Ajuste Direto Regime Geral,Aquisição de serviços,"72000000-5, Serviços de TI: consultoria, desenvolvimento de software, Internet e apoio","Unidade Local de Saúde do Alto Minho, E. P. E. (508786193)","Art Ces, Unipessoal Lda. (513270396)","57.683,00 €",12-04-2018,16-03-2018,365 dias,"Portugal, Viana do Castelo, Viana do Castelo","Artigo 24.º, n.º 1, alínea e), subalínea iii) do Código dos Contratos Públicos",,,,,,Não aplicável.,Não aplicável.,FALSE
aquisição de serviços de manutenção do software ghaf e prel instalados nas entidades do ministério da saúde para o ano 2018,Ajuste Direto Regime Geral,Aquisição de serviços,"72000000-5, Serviços de TI: consultoria, desenvolvimento de software, Internet e apoio","Unidade Local de Saúde do Alto Minho, E. P. E. (508786193)",ST+i (502246995),"4.500,00 €",12-04-2018,21-02-2018,365 dias,"Portugal, Viana do Castelo, Viana do Castelo","Artigo 24.º, n.º 1, alínea e), subalínea iii) do Código dos Contratos Públicos",,,,,,Não aplicável.,Não aplicável.,FALSE
aquisição de serviços de manutenção corretiva e evolutiva aos sistemas aplicacionais da first instalados nas entidades do ministério da saúde para o ano 2018,Ajuste Direto Regime Geral,Aquisição de serviços,"72000000-5, Serviços de TI: consultoria, desenvolvimento de software, Internet e apoio","Unidade Local de Saúde do Alto Minho, E. P. E. (508786193)","First Solutions - Sistemas de Informação, S.A. (505345978)","48.037,79 €",12-04-2018,12-01-2018,365 dias,"Portugal, Viana do Castelo, Viana do Castelo","Artigo 24.º, n.º 1, alínea e), subalínea iii) do Código dos Contratos Públicos",,,,,,Não aplicável.,Não aplicável.,FALSE
aquisição de equipamento e serviços de manutenção e assistência técnica do software labway instalados nas entidades do ministério da saúde para o ano 2018,Ajuste Direto Regime Geral,Aquisição de serviços,"72000000-5, Serviços de TI: consultoria, desenvolvimento de software, Internet e apoio","Unidade Local de Saúde do Alto Minho, E. P. E. (508786193)","Ambidata - Digital Innovation Solutions & Consulting, Lda. (504673734)","1.600,00 €",12-04-2018,12-01-2018,365 dias,"Portugal, Viana do Castelo, Viana do Castelo","Artigo 24.º, n.º 1, alínea e), subalínea iii) do Código dos Contratos Públicos",,,,,,Não aplicável.,Não aplicável.,FALSE
aquisição de serviços de manutenção corretiva e evolutiva dos sistemas clinidata instalados nas entidades do ministério da saúde para o ano 2018,Ajuste Direto Regime Geral,Aquisição de serviços,"72000000-5, Serviços de TI: consultoria, desenvolvimento de software, Internet e apoio","Unidade Local de Saúde do Alto Minho, E. P. E. (508786193)",Maxdata (502250259),"10.684,32 €",12-04-2018,07-03-2018,365 dias,"Portugal, Viana do Castelo, Viana do Castelo","Artigo 24.º, n.º 1, alínea e), subalínea iii) do Código dos Contratos Públicos",,,,,,Não aplicável.,Não aplicável.,FALSE
"MCH - Sacos recolha lixo, resíduos e roupas",Concurso público,Aquisição de bens móveis,"19640000-4, Sacos de polietileno para recolha de lixo e resíduos","Unidade Local de Saúde do Alto Minho, E. P. E. (508786193)","A.J.OLIVEIRA, LDA. (502293748)","71.088,70 €",12-04-2018,01-03-2018,365 dias,"Portugal, Viana do Castelo","Artigo 20.º, n.º 1, alínea b) do Código dos Contratos Públicos",,,,,,Não aplicável.,Não aplicável.,FALSE
