Objeto do Contrato,Tipo de Procedimento,Tipo(s) de Contrato,CPVs,Entidade(s) Adjudicante(s),Entidade(s) Adjudicatária(s),Preço Contratual,Data de Publicação,Data de Celebração do Contrato,Prazo de Execução,Local de Execução,Fundamentação,Data de Fecho do Contrato,Preço Total Efetivo,Causas das Alterações ao Prazo,Causas das Alterações ao Preço,Estado,N.º registo do Acordo Quadro,Descrição do Acordo Quadro,Procedimento Centralizado
FI0017/2016 - MEDICAMENTOS DO GRUPO 4: SANGUE,Ao abrigo de acordo-quadro (art.º 259.º),Aquisição de bens móveis,"33600000-6, Produtos farmacêuticos","Centro Hospitalar Barreiro Montijo, E. P. E. (509186998)","RATIOPHARM - COM. E IND. PROD. FARMACÊUTICOS, LDA. (502414910)","25,20 €",11-05-2017,11-03-2016,365 dias,"Portugal, Setúbal, Barreiro",Artigo 259.º do Código dos Contratos Públicos,30-12-2016,"25,20 €",,"",,599473,"CONCURSO PÚBLICO PARA A CELEBRAÇÃO DE CONTRATOS PÚBLICOS DE APROVISIONAMENTO PARA A ÁREA DA SAÚDE, COM VISTA AO FORNECIMENTO DE MEDICAMENTOS DE CONSUMO GERAL, GRUPO 4: SANGUE ÀS INSTITUIÇÕES E SERVIÇOS DO SERVIÇO NACIONAL DE SAÚDE",FALSE
FI0017/2016 - MEDICAMENTOS DO GRUPO 4: SANGUE,Ao abrigo de acordo-quadro (art.º 259.º),Aquisição de bens móveis,"33600000-6, Produtos farmacêuticos","Centro Hospitalar Barreiro Montijo, E. P. E. (509186998)","AMGEN - BIOFARMACÊUTICA, LDA. (502942959)","2.400,00 €",11-05-2017,11-03-2016,365 dias,"Portugal, Setúbal, Barreiro",Artigo 259.º do Código dos Contratos Públicos,30-12-2016,"2.400,00 €",,"",,599473,"CONCURSO PÚBLICO PARA A CELEBRAÇÃO DE CONTRATOS PÚBLICOS DE APROVISIONAMENTO PARA A ÁREA DA SAÚDE, COM VISTA AO FORNECIMENTO DE MEDICAMENTOS DE CONSUMO GERAL, GRUPO 4: SANGUE ÀS INSTITUIÇÕES E SERVIÇOS DO SERVIÇO NACIONAL DE SAÚDE",FALSE
FI0017/2016 - MEDICAMENTOS DO GRUPO 4: SANGUE,Ao abrigo de acordo-quadro (art.º 259.º),Aquisição de bens móveis,"33600000-6, Produtos farmacêuticos","Centro Hospitalar Barreiro Montijo, E. P. E. (509186998)","ACCORD HEALTHCARE, UNIPESSOAL, LDA (508622263)","1.461,75 €",11-05-2017,11-03-2016,365 dias,"Portugal, Setúbal, Barreiro",Artigo 259.º do Código dos Contratos Públicos,30-12-2016,"1.461,75 €",,"",,599473,"CONCURSO PÚBLICO PARA A CELEBRAÇÃO DE CONTRATOS PÚBLICOS DE APROVISIONAMENTO PARA A ÁREA DA SAÚDE, COM VISTA AO FORNECIMENTO DE MEDICAMENTOS DE CONSUMO GERAL, GRUPO 4: SANGUE ÀS INSTITUIÇÕES E SERVIÇOS DO SERVIÇO NACIONAL DE SAÚDE",FALSE
FI0017/2016 - MEDICAMENTOS DO GRUPO 4: SANGUE,Ao abrigo de acordo-quadro (art.º 259.º),Aquisição de bens móveis,"33600000-6, Produtos farmacêuticos","Centro Hospitalar Barreiro Montijo, E. P. E. (509186998)","UNILFARMA, LDA (500293023)","12.232,62 €",11-05-2017,11-03-2016,365 dias,"Portugal, Setúbal, Barreiro",Artigo 259.º do Código dos Contratos Públicos,30-12-2016,"12.232,62 €",,"",,599473,"CONCURSO PÚBLICO PARA A CELEBRAÇÃO DE CONTRATOS PÚBLICOS DE APROVISIONAMENTO PARA A ÁREA DA SAÚDE, COM VISTA AO FORNECIMENTO DE MEDICAMENTOS DE CONSUMO GERAL, GRUPO 4: SANGUE ÀS INSTITUIÇÕES E SERVIÇOS DO SERVIÇO NACIONAL DE SAÚDE",FALSE
FI0017/2016 - MEDICAMENTOS DO GRUPO 4: SANGUE,Ao abrigo de acordo-quadro (art.º 259.º),Aquisição de bens móveis,"33600000-6, Produtos farmacêuticos","Centro Hospitalar Barreiro Montijo, E. P. E. (509186998)","LABORATORIOS PFIZER, S.A. (500162166)","6.069,60 €",11-05-2017,11-03-2016,365 dias,"Portugal, Setúbal, Barreiro",Artigo 259.º do Código dos Contratos Públicos,30-12-2016,"6.069,60 €",,"",,599473,"CONCURSO PÚBLICO PARA A CELEBRAÇÃO DE CONTRATOS PÚBLICOS DE APROVISIONAMENTO PARA A ÁREA DA SAÚDE, COM VISTA AO FORNECIMENTO DE MEDICAMENTOS DE CONSUMO GERAL, GRUPO 4: SANGUE ÀS INSTITUIÇÕES E SERVIÇOS DO SERVIÇO NACIONAL DE SAÚDE",FALSE
FI0017/2016 - MEDICAMENTOS DO GRUPO 4: SANGUE,Ao abrigo de acordo-quadro (art.º 259.º),Aquisição de bens móveis,"33600000-6, Produtos farmacêuticos","Centro Hospitalar Barreiro Montijo, E. P. E. (509186998)","B. BRAUN MEDICAL, LDA (501506543)","588,00 €",11-05-2017,11-03-2016,365 dias,"Portugal, Setúbal, Barreiro",Artigo 259.º do Código dos Contratos Públicos,30-12-2016,"588,00 €",,"",,599473,"CONCURSO PÚBLICO PARA A CELEBRAÇÃO DE CONTRATOS PÚBLICOS DE APROVISIONAMENTO PARA A ÁREA DA SAÚDE, COM VISTA AO FORNECIMENTO DE MEDICAMENTOS DE CONSUMO GERAL, GRUPO 4: SANGUE ÀS INSTITUIÇÕES E SERVIÇOS DO SERVIÇO NACIONAL DE SAÚDE",FALSE
FI0017/2016 - MEDICAMENTOS DO GRUPO 4: SANGUE,Ao abrigo de acordo-quadro (art.º 259.º),Aquisição de bens móveis,"33600000-6, Produtos farmacêuticos","Centro Hospitalar Barreiro Montijo, E. P. E. (509186998)","SANOFI - PROD. FARMACÊUTICOS, LDA. (500134960)","154.507,98 €",11-05-2017,11-03-2016,365 dias,"Portugal, Setúbal, Barreiro",Artigo 259.º do Código dos Contratos Públicos,30-12-2016,"154.507,98 €",,"",,599473,"CONCURSO PÚBLICO PARA A CELEBRAÇÃO DE CONTRATOS PÚBLICOS DE APROVISIONAMENTO PARA A ÁREA DA SAÚDE, COM VISTA AO FORNECIMENTO DE MEDICAMENTOS DE CONSUMO GERAL, GRUPO 4: SANGUE ÀS INSTITUIÇÕES E SERVIÇOS DO SERVIÇO NACIONAL DE SAÚDE",FALSE
FI0017/2016 - MEDICAMENTOS DO GRUPO 4: SANGUE,Ao abrigo de acordo-quadro (art.º 259.º),Aquisição de bens móveis,"33600000-6, Produtos farmacêuticos","Centro Hospitalar Barreiro Montijo, E. P. E. (509186998)","HOSPIRA PORTUGAL, LDA. (502918098)","9.580,10 €",11-05-2017,11-03-2016,365 dias,"Portugal, Setúbal, Barreiro",Artigo 259.º do Código dos Contratos Públicos,30-12-2016,"9.580,10 €",,"",,599473,"CONCURSO PÚBLICO PARA A CELEBRAÇÃO DE CONTRATOS PÚBLICOS DE APROVISIONAMENTO PARA A ÁREA DA SAÚDE, COM VISTA AO FORNECIMENTO DE MEDICAMENTOS DE CONSUMO GERAL, GRUPO 4: SANGUE ÀS INSTITUIÇÕES E SERVIÇOS DO SERVIÇO NACIONAL DE SAÚDE",FALSE
4EXC0001/2017 - FIBRAS E  BAINHAS,Ajuste Direto Regime Geral,Aquisição de bens móveis,"33140000-3, Material médico de consumo","Centro Hospitalar Barreiro Montijo, E. P. E. (509186998)","Olympus Ibéria, S.A.U. - Suc. em Portugal (980474710)","30.368,24 €",11-05-2017,23-01-2017,365 dias,"Portugal, Setúbal, Barreiro","Artigo 24.º, n.º 1, alínea e) do Código dos Contratos Públicos",31-12-2017,"16.138,68 €",,ALTERAÇÃO DE QUANTIDADES,,Não aplicável.,Não aplicável.,FALSE
110011/2017 - SUTURA MECÂNICA,Concurso público,Aquisição de bens móveis,"33141125-2, Material de sutura cirúrgica","Centro Hospitalar Barreiro Montijo, E. P. E. (509186998)","MOONSURGE - IMPORT.  EXP. MATERIAL MEDICO,LDA (506657035)","11.600,00 €",11-05-2017,30-12-2016,365 dias,"Portugal, Setúbal, Barreiro","Artigo 20.º, n.º 1, alínea b) do Código dos Contratos Públicos",31-12-2017,"9.570,00 €",,ALTERAÇÃO DE QUANTIDADES,,Não aplicável.,Não aplicável.,FALSE
110011/2017 - SUTURA MECÂNICA,Concurso público,Aquisição de bens móveis,"33141125-2, Material de sutura cirúrgica","Centro Hospitalar Barreiro Montijo, E. P. E. (509186998)","MEDTRONIC PORTUGAL, LDA (504223933)","170.988,00 €",11-05-2017,30-12-2016,365 dias,"Portugal, Setúbal, Barreiro","Artigo 20.º, n.º 1, alínea b) do Código dos Contratos Públicos",31-12-2017,"148.097,20 €",,ALTERAÇÃO DE QUANTIDADES,,Não aplicável.,Não aplicável.,FALSE
FI0017/2016 - MEDICAMENTOS DO GRUPO 4: SANGUE,Ao abrigo de acordo-quadro (art.º 259.º),Aquisição de bens móveis,"33600000-6, Produtos farmacêuticos","Centro Hospitalar Barreiro Montijo, E. P. E. (509186998)","ROCHE FARMACEUTICA QUIMICA, LDA (500233810)","4.250,00 €",11-05-2017,11-03-2016,365 dias,"Portugal, Setúbal, Barreiro",Artigo 259.º do Código dos Contratos Públicos,30-12-2016,"4.250,00 €",,"",,599473,"CONCURSO PÚBLICO PARA A CELEBRAÇÃO DE CONTRATOS PÚBLICOS DE APROVISIONAMENTO PARA A ÁREA DA SAÚDE, COM VISTA AO FORNECIMENTO DE MEDICAMENTOS DE CONSUMO GERAL, GRUPO 4: SANGUE ÀS INSTITUIÇÕES E SERVIÇOS DO SERVIÇO NACIONAL DE SAÚDE",FALSE
FI0017/2016 - MEDICAMENTOS DO GRUPO 4: SANGUE,Ao abrigo de acordo-quadro (art.º 259.º),Aquisição de bens móveis,"33600000-6, Produtos farmacêuticos","Centro Hospitalar Barreiro Montijo, E. P. E. (509186998)","OM PHARMA, SA (500207410)","87.145,02 €",11-05-2017,11-03-2016,365 dias,"Portugal, Setúbal, Barreiro",Artigo 259.º do Código dos Contratos Públicos,30-12-2016,"87.145,02 €",,"",,599473,"CONCURSO PÚBLICO PARA A CELEBRAÇÃO DE CONTRATOS PÚBLICOS DE APROVISIONAMENTO PARA A ÁREA DA SAÚDE, COM VISTA AO FORNECIMENTO DE MEDICAMENTOS DE CONSUMO GERAL, GRUPO 4: SANGUE ÀS INSTITUIÇÕES E SERVIÇOS DO SERVIÇO NACIONAL DE SAÚDE",FALSE
FI0017/2016 - MEDICAMENTOS DO GRUPO 4: SANGUE,Ao abrigo de acordo-quadro (art.º 259.º),Aquisição de bens móveis,"33600000-6, Produtos farmacêuticos","Centro Hospitalar Barreiro Montijo, E. P. E. (509186998)","GENERIS-FARMACEUTICA, S.A. (508107997)","99,18 €",11-05-2017,11-03-2016,365 dias,"Portugal, Setúbal, Barreiro",Artigo 259.º do Código dos Contratos Públicos,11-03-2016,"99,18 €",,"",,599473,"CONCURSO PÚBLICO PARA A CELEBRAÇÃO DE CONTRATOS PÚBLICOS DE APROVISIONAMENTO PARA A ÁREA DA SAÚDE, COM VISTA AO FORNECIMENTO DE MEDICAMENTOS DE CONSUMO GERAL, GRUPO 4: SANGUE ÀS INSTITUIÇÕES E SERVIÇOS DO SERVIÇO NACIONAL DE SAÚDE",FALSE
FI0017/2016 - MEDICAMENTOS DO GRUPO 4: SANGUE,Ao abrigo de acordo-quadro (art.º 259.º),Aquisição de bens móveis,"33600000-6, Produtos farmacêuticos","Centro Hospitalar Barreiro Montijo, E. P. E. (509186998)",AUROVITAS UNIPESSOAL (513053239),"295,34 €",11-05-2017,11-03-2016,365 dias,"Portugal, Setúbal, Barreiro",Artigo 259.º do Código dos Contratos Públicos,30-12-2016,"295,34 €",,"",,599473,"CONCURSO PÚBLICO PARA A CELEBRAÇÃO DE CONTRATOS PÚBLICOS DE APROVISIONAMENTO PARA A ÁREA DA SAÚDE, COM VISTA AO FORNECIMENTO DE MEDICAMENTOS DE CONSUMO GERAL, GRUPO 4: SANGUE ÀS INSTITUIÇÕES E SERVIÇOS DO SERVIÇO NACIONAL DE SAÚDE",FALSE
110011/2017 - SUTURA MECÂNICA,Concurso público,Aquisição de bens móveis,"33141125-2, Material de sutura cirúrgica","Centro Hospitalar Barreiro Montijo, E. P. E. (509186998)",ENDOTECNICA MATERIAL CIRURGICO (503818348),"2.000,00 €",11-05-2017,30-12-2016,365 dias,"Portugal, Setúbal, Barreiro","Artigo 20.º, n.º 1, alínea b) do Código dos Contratos Públicos",31-12-2017,"1.200,00 €",,ALTERAÇÃO DE QUANTIDADES,,Não aplicável.,Não aplicável.,FALSE
FI0017/2016 - MEDICAMENTOS DO GRUPO 4: SANGUE,Ao abrigo de acordo-quadro (art.º 259.º),Aquisição de bens móveis,"33600000-6, Produtos farmacêuticos","Centro Hospitalar Barreiro Montijo, E. P. E. (509186998)","BAYER PORTUGAL, S.A. (500043256)","1.015,00 €",11-05-2017,16-03-2016,365 dias,"Portugal, Setúbal, Barreiro",Artigo 259.º do Código dos Contratos Públicos,30-12-2016,"1.015,00 €",,"",,599473,"CONCURSO PÚBLICO PARA A CELEBRAÇÃO DE CONTRATOS PÚBLICOS DE APROVISIONAMENTO PARA A ÁREA DA SAÚDE, COM VISTA AO FORNECIMENTO DE MEDICAMENTOS DE CONSUMO GERAL, GRUPO 4: SANGUE ÀS INSTITUIÇÕES E SERVIÇOS DO SERVIÇO NACIONAL DE SAÚDE",FALSE
110008/2017 - LENTES INTRA OCULARES,Concurso público,Aquisição de bens móveis,"33731110-7, Lentes intraoculares","Centro Hospitalar Barreiro Montijo, E. P. E. (509186998)","Ophtec Portugal - Excelentetitulo Unipessoal, Lda. (510255086)","630,00 €",11-05-2017,06-01-2017,365 dias,"Portugal, Setúbal, Barreiro","Artigo 20.º, n.º 1, alínea b) do Código dos Contratos Públicos",31-12-2017,"",,NÃO HOUVE NECESSIDADE DE AQUIRIR OS DM,,Não aplicável.,Não aplicável.,FALSE
110008/2017 - LENTES INTRA OCULARES,Concurso público,Aquisição de bens móveis,"33731110-7, Lentes intraoculares","Centro Hospitalar Barreiro Montijo, E. P. E. (509186998)",ALCON Portugal (501251685),"49.865,00 €",11-05-2017,06-01-2017,365 dias,"Portugal, Setúbal, Barreiro","Artigo 20.º, n.º 1, alínea b) do Código dos Contratos Públicos",31-12-2017,"31.495,08 €",,ALTERAÇÃO DE QUANTIDADES,,Não aplicável.,Não aplicável.,FALSE
110008/2017 - LENTES INTRA OCULARES,Concurso público,Aquisição de bens móveis,"33731110-7, Lentes intraoculares","Centro Hospitalar Barreiro Montijo, E. P. E. (509186998)",Abbott Medical Optics Spain S.L. (980262364),"103.248,00 €",11-05-2017,06-01-2017,365 dias,"Portugal, Setúbal, Barreiro","Artigo 20.º, n.º 1, alínea b) do Código dos Contratos Públicos",31-12-2017,"69.915,55 €",,ALTERAÇÃO DE QUANTIDADES,,Não aplicável.,Não aplicável.,FALSE
FI0016/2016 - MEDICAMENTOS - ESTIMULANTES DA ERITROPOIESE,Ao abrigo de acordo-quadro (art.º 259.º),Aquisição de bens móveis,"33600000-6, Produtos farmacêuticos","Centro Hospitalar Barreiro Montijo, E. P. E. (509186998)","HOSPIRA PORTUGAL, LDA. (502918098)","3.146,12 €",11-05-2017,01-03-2016,365 dias,"Portugal, Setúbal, Barreiro",Artigo 259.º do Código dos Contratos Públicos,30-12-2016,"3.146,12 €",,"",,463788,CP 2012/11 - Estimulantes da Eritropoiese,FALSE
FI0016/2016 - MEDICAMENTOS - ESTIMULANTES DA ERITROPOIESE,Ao abrigo de acordo-quadro (art.º 259.º),Aquisição de bens móveis,"33600000-6, Produtos farmacêuticos","Centro Hospitalar Barreiro Montijo, E. P. E. (509186998)","ROCHE FARMACEUTICA QUIMICA, LDA (500233810)","1.341,60 €",11-05-2017,01-03-2016,365 dias,"Portugal, Setúbal, Barreiro",Artigo 259.º do Código dos Contratos Públicos,30-12-2016,"1.341,60 €",,"",,463788,CP 2012/11 - Estimulantes da Eritropoiese,FALSE
FI0016/2016 - MEDICAMENTOS - ESTIMULANTES DA ERITROPOIESE,Ao abrigo de acordo-quadro (art.º 259.º),Aquisição de bens móveis,"33600000-6, Produtos farmacêuticos","Centro Hospitalar Barreiro Montijo, E. P. E. (509186998)","LABORATORIOS PFIZER, S.A. (500162166)","7.111,76 €",11-05-2017,01-03-2016,365 dias,"Portugal, Setúbal, Barreiro",Artigo 259.º do Código dos Contratos Públicos,30-12-2016,"7.111,76 €",,"",,463788,CP 2012/11 - Estimulantes da Eritropoiese,FALSE
110006/2017 - PROTESES DE JOELHO,Concurso público,Aquisição de bens móveis,"33141700-7, Material ortopédico","Centro Hospitalar Barreiro Montijo, E. P. E. (509186998)",Johnson & Johnson Medical (500153370),"122.886,00 €",10-05-2017,05-01-2017,365 dias,"Portugal, Setúbal, Barreiro","Artigo 20.º, n.º 1, alínea b) do Código dos Contratos Públicos",31-12-2017,"79.204,40 €",,ALTERAÇÃO DE QUANTIDADES,,Não aplicável.,Não aplicável.,FALSE
40076/2017 - PLACAS PROXIMAIS DA TIBIA,Ajuste Direto Regime Geral,Aquisição de bens móveis,"33140000-3, Material médico de consumo","CHBM - Centro Hospital Barreiro Montijo, EPE (509186998)",JOHNSON & JOHNSON MEDICAL (500153370),"14.520,00 €",10-05-2017,06-04-2017,365 dias,"Portugal, Setúbal, Barreiro","Artigo 20.º, n.º 1, alínea a) do Código dos Contratos Públicos",31-12-2017,"1.600,12 €",,ALTERAÇÃO DE QUANTIDADES,,Não aplicável.,Não aplicável.,FALSE
40050/2017 PROVA DE ESFORÇO,Ajuste Direto Regime Geral,Aquisição de bens móveis,"33000000-0, Equipamento médico, medicamentos e produtos para cuidados pessoais","Centro Hospitalar Barreiro Montijo, E. P. E. (509186998)","PULMOCOR, LDA (501402578)","37.600,00 €",10-05-2017,23-03-2017,90 dias,"Portugal, Setúbal, Barreiro","Artigo 20.º, n.º 1, alínea a) do Código dos Contratos Públicos",10-05-2017,"37.600,00 €",,"",,Não aplicável.,Não aplicável.,FALSE
110007/2017 - ENCAVILH. OSTEOSSINTESE; PLACAS; CIRURG. PÉ; COLUNA,Concurso público,Aquisição de bens móveis,"33141700-7, Material ortopédico","Centro Hospitalar Barreiro Montijo, E. P. E. (509186998)",ENDOTECNICA MATERIAL CIRURGICO (503818348),"5.940,00 €",10-05-2017,23-12-2016,365 dias,"Portugal, Setúbal, Barreiro","Artigo 20.º, n.º 1, alínea b) do Código dos Contratos Públicos",31-12-2017,"800,00 €",,ALTERAÇÃO DE QUANTIDADES,,Não aplicável.,Não aplicável.,FALSE
110007/2017 - ENCAVILH. OSTEOSSINTESE; PLACAS; CIRURG. PÉ; COLUNA,Concurso público,Aquisição de bens móveis,"33141700-7, Material ortopédico","Centro Hospitalar Barreiro Montijo, E. P. E. (509186998)",Striker Produtos Médicos Unipessoal Lda. (504594214),"114.453,00 €",10-05-2017,23-12-2016,365 dias,"Portugal, Setúbal, Barreiro","Artigo 20.º, n.º 1, alínea b) do Código dos Contratos Públicos",31-12-2017,"118.998,05 €",,ALTERAÇÃO DE QUANTIDADES,,Não aplicável.,Não aplicável.,FALSE
110004/2017 - MATERIAL PARA CORRECÇÃO DE HERNIAS,Concurso público,Aquisição de bens móveis,"33169000-2, Material cirúrgico","Centro Hospitalar Barreiro Montijo, E. P. E. (509186998)","C. R. BARD PORTUGAL, LDA. (502438274)","16.040,00 €",10-05-2017,28-12-2016,365 dias,"Portugal, Setúbal, Barreiro","Artigo 20.º, n.º 1, alínea b) do Código dos Contratos Públicos",31-12-2017,"12.250,00 €",,ALTERAÇÃO DE QUANTIDADES,,Não aplicável.,Não aplicável.,FALSE
110004/2017 - MATERIAL PARA CORRECÇÃO DE HERNIAS,Concurso público,Aquisição de bens móveis,"33169000-2, Material cirúrgico","Centro Hospitalar Barreiro Montijo, E. P. E. (509186998)","Medtronic Portugal, Lda (504223933)","10.870,00 €",10-05-2017,28-12-2016,365 dias,"Portugal, Setúbal, Barreiro","Artigo 20.º, n.º 1, alínea b) do Código dos Contratos Públicos",31-12-2017,"5.120,00 €",,ALTERAÇÃO DE QUANTIDADES,,Não aplicável.,Não aplicável.,FALSE
110002/2017 - MATERIAL PARA CIRURGIA LAPAROSCOPICA,Concurso público,Aquisição de bens móveis,"33169000-2, Material cirúrgico","Centro Hospitalar Barreiro Montijo, E. P. E. (509186998)",ENDOTECNICA MATERIAL CIRURGICO (503818348),"82.380,00 €",10-05-2017,28-12-2016,365 dias,"Portugal, Setúbal, Barreiro","Artigo 20.º, n.º 1, alínea b) do Código dos Contratos Públicos",31-12-2017,"78.340,00 €",,ALTERAÇÃO DE QUANTIDADES,,Não aplicável.,Não aplicável.,FALSE
4S0006/2017 - SERVIÇOS DE BIBLIOTECA ON LINE P/ 2017,Ajuste Direto Regime Geral,Aquisição de serviços,"72410000-7, Serviços de fornecimento","Centro Hospitalar Barreiro Montijo, E. P. E. (509186998)",UpToDate (043310941),"17.292,29 €",10-05-2017,23-12-2016,365 dias,"Portugal, Setúbal, Barreiro","Artigo 20.º, n.º 1, alínea a) do Código dos Contratos Públicos",31-12-2017,"17.292,29 €",,"",,Não aplicável.,Não aplicável.,FALSE
4SEX0019/2017 - SOLUÇÃO DE GESTÃO HORARIOS E CONTROLO BIOMETRICO DE PRESENÇAS P/ ANO 2017,Ajuste Direto Regime Geral,Aquisição de serviços,"50000000-5, Serviços de reparação e manutenção","Centro Hospitalar Barreiro Montijo, E. P. E. (509186998)","RISI, LDA. (503754803)","7.292,40 €",10-05-2017,05-01-2017,365 dias,"Portugal, Setúbal, Barreiro","Artigo 24.º, n.º 1, alínea e) do Código dos Contratos Públicos",31-12-2017,"7.292,40 €",,"",,Não aplicável.,Não aplicável.,FALSE
4SEX0016/2017 - CAT E MANUT À REDE - HARDWARE E SOFTWARE DO SERVIÇO DE RADIOTERAPIA P/ 2017,Ajuste Direto Regime Geral,Aquisição de serviços,"50000000-5, Serviços de reparação e manutenção","Centro Hospitalar Barreiro Montijo, E. P. E. (509186998)","Varian Medical Systems Ibérica, Sucursal em Portugal (980236436)","99.282,00 €",10-05-2017,13-01-2017,365 dias,"Portugal, Setúbal, Barreiro","Artigo 24.º, n.º 1, alínea e) do Código dos Contratos Públicos",31-12-2017,"74.461,50 €",,EMPRESA NÃO FACTUROU A TOTALIDADE DO CONTRATO ATÉ 31.12.2017,,Não aplicável.,Não aplicável.,FALSE
4SEX0015/2017 - CAT E MANUT AOS EQUIPAMENTOS DO SERVIÇO DE RADIOTERAPIA P/ 2017,Ajuste Direto Regime Geral,Aquisição de serviços,"50000000-5, Serviços de reparação e manutenção","Centro Hospitalar Barreiro Montijo, E. P. E. (509186998)","Varian Medical Systems Ibérica, Sucursal em Portugal (980236436)","240.000,00 €",10-05-2017,23-01-2017,365 dias,"Portugal, Setúbal, Barreiro","Artigo 24.º, n.º 1, alínea e) do Código dos Contratos Públicos",31-12-2017,"180.000,00 €",,EMPRESA NÃO FACTUROU A TOTALIDADE DO CONTRATO ATÉ 31.12.2017,,Não aplicável.,Não aplicável.,FALSE
4SEX0004/2017 - CAT E MANUT AOS EQUIP. IMAGIOLOGIA MARCA G.E. E AOS APARELHOS ANESTESIA MARCA DATEX P/2017,Ajuste Direto Regime Geral,Aquisição de serviços,"50000000-5, Serviços de reparação e manutenção","Centro Hospitalar Barreiro Montijo, E. P. E. (509186998)",General Electric Portuguesa S.A. (500357129),"77.828,55 €",10-05-2017,24-01-2017,365 dias,"Portugal, Setúbal, Barreiro","Artigo 24.º, n.º 1, alínea e) do Código dos Contratos Públicos",31-12-2017,"75.893,56 €",,EMPRESA NÃO FACTUROU A TOTALIDADE DO CONTRATO ATÉ 31.12.2017,,Não aplicável.,Não aplicável.,FALSE
"4SEX0014/2017 - CAT E MANUT DOS ECOGRAFOS TOSHIBA, P/ ANO 2017",Ajuste Direto Regime Geral,Aquisição de serviços,"50000000-5, Serviços de reparação e manutenção","Centro Hospitalar Barreiro Montijo, E. P. E. (509186998)",TOSHIBA MEDICAL SYSTEMS S.A. (980023700),"17.475,00 €",10-05-2017,23-02-2017,365 dias,"Portugal, Setúbal, Barreiro","Artigo 24.º, n.º 1, alínea e) do Código dos Contratos Públicos",31-12-2017,"17.475,00 €",,"",,Não aplicável.,Não aplicável.,FALSE
"4SEX0013/2017 - CAT E MANUT. 3 GERADORES DA CENTRAL TERMICA, P/ 2017 - PROG. ALIGEIRADO",Ajuste Direto Regime Geral,Aquisição de serviços,"50000000-5, Serviços de reparação e manutenção","Centro Hospitalar Barreiro Montijo, E. P. E. (509186998)",TERMETAL (500626758),"14.123,91 €",10-05-2017,24-01-2017,365 dias,"Portugal, Setúbal, Barreiro","Artigo 24.º, n.º 1, alínea e) do Código dos Contratos Públicos",31-12-2017,"14.123,91 €",,"",,Não aplicável.,Não aplicável.,FALSE
"4SEX0012/2017 - CAT E MANUT 5 ECOGRAFOS ACUSON E 1 TAC SOMATON, P/ 2017",Ajuste Direto Regime Geral,Aquisição de serviços,"50000000-5, Serviços de reparação e manutenção","Centro Hospitalar Barreiro Montijo, E. P. E. (509186998)","Siemens Healthcare, Lda (507925173)","41.017,95 €",10-05-2017,24-01-2017,365 dias,"Portugal, Setúbal, Barreiro","Artigo 24.º, n.º 1, alínea e) do Código dos Contratos Públicos",31-12-2017,"41.017,95 €",,"",,Não aplicável.,Não aplicável.,FALSE
FI0022/2016 - MEDICAMENTOS DERIVADOS DO PLASMA HUMANO,Ao abrigo de acordo-quadro (art.º 259.º),Aquisição de bens móveis,"33600000-6, Produtos farmacêuticos","Centro Hospitalar Barreiro Montijo, E. P. E. (509186998)","KEDRION PORTUGAL-DIST. PROD. FARM., LDA (508472830)","2.025,00 €",09-05-2017,01-03-2016,365 dias,"Portugal, Setúbal, Barreiro",Artigo 259.º do Código dos Contratos Públicos,30-12-2016,"2.025,00 €",,"",,535788,"CONCURSO PÚBLICO PARA A CELEBRAÇÃO DE CONTRATOSPÚBLICOS DE APROVISIONAMENTO PARA A ÁREA DA SAÚDE, COM VISTA AO FORNECIMENTO DE DERIVADOS DO PLASMA HUMANOÀS INSTITUIÇÕES E SERVIÇOS DO SERVIÇO NACIONAL DE SAÚDE",FALSE
FI0022/2016 - MEDICAMENTOS DERIVADOS DO PLASMA HUMANO,Ao abrigo de acordo-quadro (art.º 259.º),Aquisição de bens móveis,"33600000-6, Produtos farmacêuticos","Centro Hospitalar Barreiro Montijo, E. P. E. (509186998)","GRIFOLS PORTUGAL - PROD. FARMAC. E HOSP., LDA. (502041285)","52.665,60 €",09-05-2017,01-03-2016,365 dias,"Portugal, Setúbal, Barreiro",Artigo 259.º do Código dos Contratos Públicos,30-12-2016,"52.665,60 €",,"",,535788,"CONCURSO PÚBLICO PARA A CELEBRAÇÃO DE CONTRATOSPÚBLICOS DE APROVISIONAMENTO PARA A ÁREA DA SAÚDE, COM VISTA AO FORNECIMENTO DE DERIVADOS DO PLASMA HUMANOÀS INSTITUIÇÕES E SERVIÇOS DO SERVIÇO NACIONAL DE SAÚDE",FALSE
FI0022/2016 - MEDICAMENTOS DERIVADOS DO PLASMA HUMANO,Ao abrigo de acordo-quadro (art.º 259.º),Aquisição de bens móveis,"33600000-6, Produtos farmacêuticos","Centro Hospitalar Barreiro Montijo, E. P. E. (509186998)","C S L BEHRING, LDA. (503047201)","11.004,00 €",09-05-2017,01-03-2016,365 dias,"Portugal, Setúbal, Barreiro",Artigo 259.º do Código dos Contratos Públicos,30-12-2016,"11.004,00 €",,"",,535788,"CONCURSO PÚBLICO PARA A CELEBRAÇÃO DE CONTRATOSPÚBLICOS DE APROVISIONAMENTO PARA A ÁREA DA SAÚDE, COM VISTA AO FORNECIMENTO DE DERIVADOS DO PLASMA HUMANOÀS INSTITUIÇÕES E SERVIÇOS DO SERVIÇO NACIONAL DE SAÚDE",FALSE
FI0022/2016 - MEDICAMENTOS DERIVADOS DO PLASMA HUMANO,Ao abrigo de acordo-quadro (art.º 259.º),Aquisição de bens móveis,"33600000-6, Produtos farmacêuticos","Centro Hospitalar Barreiro Montijo, E. P. E. (509186998)",OCTAPHARMA (502595302),"100.006,50 €",09-05-2017,01-03-2016,365 dias,"Portugal, Setúbal, Barreiro",Artigo 259.º do Código dos Contratos Públicos,30-12-2016,"100.006,50 €",,"",,535788,"CONCURSO PÚBLICO PARA A CELEBRAÇÃO DE CONTRATOSPÚBLICOS DE APROVISIONAMENTO PARA A ÁREA DA SAÚDE, COM VISTA AO FORNECIMENTO DE DERIVADOS DO PLASMA HUMANOÀS INSTITUIÇÕES E SERVIÇOS DO SERVIÇO NACIONAL DE SAÚDE",FALSE
110004/2017 - MATERIAL PARA CORRECÇÃO DE HERNIAS,Concurso público,Aquisição de bens móveis,"33169000-2, Material cirúrgico","Centro Hospitalar Barreiro Montijo, E. P. E. (509186998)",JMV - Produtos Hospitalares (501887148),"3.098,00 €",09-05-2017,28-12-2016,365 dias,"Portugal, Setúbal, Barreiro","Artigo 20.º, n.º 1, alínea b) do Código dos Contratos Públicos",31-12-2017,"1.592,50 €",,ALTERAÇÃO DE QUANTIDADES,,Não aplicável.,Não aplicável.,FALSE
110004/2017 - MATERIAL PARA CORRECÇÃO DE HERNIAS,Concurso público,Aquisição de bens móveis,"33169000-2, Material cirúrgico","Centro Hospitalar Barreiro Montijo, E. P. E. (509186998)","B.Braun Medical, Lda (501506543)","1.600,00 €",09-05-2017,28-12-2016,365 dias,"Portugal, Setúbal, Barreiro","Artigo 20.º, n.º 1, alínea b) do Código dos Contratos Públicos",31-12-2017,"2.250,00 €",,ALTERAÇÃO DE QUANTIDADES,,Não aplicável.,Não aplicável.,FALSE
110002/2017 - MATERIAL PARA CIRURGIA LAPAROSCOPICA,Concurso público,Aquisição de bens móveis,"33169000-2, Material cirúrgico","Centro Hospitalar Barreiro Montijo, E. P. E. (509186998)","Teleflex Medical, SA (980249783)","840,00 €",09-05-2017,28-12-2016,365 dias,"Portugal, Setúbal, Barreiro","Artigo 20.º, n.º 1, alínea b) do Código dos Contratos Públicos",31-12-2017,"",,NÃO HOUVE NECESSIDADE DE ADQUIRIR ESTE DM,,Não aplicável.,Não aplicável.,FALSE
110002/2017 - MATERIAL PARA CIRURGIA LAPAROSCOPICA,Concurso público,Aquisição de bens móveis,"33169000-2, Material cirúrgico","Centro Hospitalar Barreiro Montijo, E. P. E. (509186998)","Medtronic Portugal, Lda (504223933)","262,50 €",09-05-2017,28-12-2016,365 dias,"Portugal, Setúbal, Barreiro","Artigo 20.º, n.º 1, alínea b) do Código dos Contratos Públicos",31-12-2017,"144,78 €",,ALTERAÇÃO DE QUANTIDADES,,Não aplicável.,Não aplicável.,FALSE
110002/2017 - MATERIAL PARA CIRURGIA LAPAROSCOPICA,Concurso público,Aquisição de bens móveis,"33169000-2, Material cirúrgico","Centro Hospitalar Barreiro Montijo, E. P. E. (509186998)","Teleflex Medical, SA (980249783)","1.838,40 €",09-05-2017,28-12-2016,365 dias,"Portugal, Setúbal, Barreiro","Artigo 20.º, n.º 1, alínea b) do Código dos Contratos Públicos",31-12-2017,"351,72 €",,ALTERAÇÃO DE QUANTIDADES,,Não aplicável.,Não aplicável.,FALSE
110001/2017 - MATERIAL PARA CIRURGIA ENDOSCOPICA,Concurso público,Aquisição de bens móveis,"33169000-2, Material cirúrgico","Centro Hospitalar Barreiro Montijo, E. P. E. (509186998)",ENDOTECNICA MATERIAL CIRURGICO (503818348),"3.700,00 €",09-05-2017,28-12-2016,365 dias,"Portugal, Setúbal, Barreiro","Artigo 20.º, n.º 1, alínea b) do Código dos Contratos Públicos",31-12-2017,"2.220,00 €",,ALTERAÇÃO DE QUANTIDADES,,Não aplicável.,Não aplicável.,FALSE
110001/2017 - MATERIAL PARA CIRURGIA ENDOSCOPICA,Concurso público,Aquisição de bens móveis,"33169000-2, Material cirúrgico","Centro Hospitalar Barreiro Montijo, E. P. E. (509186998)",Eurocasmedica (503322105),"960,00 €",09-05-2017,28-12-2016,365 dias,"Portugal, Setúbal, Barreiro","Artigo 20.º, n.º 1, alínea b) do Código dos Contratos Públicos",31-12-2017,"47,50 €",,ALTERAÇÃO DE QUANTIDADES,,Não aplicável.,Não aplicável.,FALSE
110001/2017 - MATERIAL PARA CIRURGIA ENDOSCOPICA,Concurso público,Aquisição de bens móveis,"33169000-2, Material cirúrgico","Centro Hospitalar Barreiro Montijo, E. P. E. (509186998)",JMV - Produtos Hospitalares (501887148),"21.603,40 €",09-05-2017,28-12-2016,365 dias,"Portugal, Setúbal, Barreiro","Artigo 20.º, n.º 1, alínea b) do Código dos Contratos Públicos",31-12-2017,"13.506,00 €",,ALTERAÇÃO DE QUANTIDADES,,Não aplicável.,Não aplicável.,FALSE
110001/2017 - MATERIAL PARA CIRURGIA ENDOSCOPICA,Concurso público,Aquisição de bens móveis,"33169000-2, Material cirúrgico","Centro Hospitalar Barreiro Montijo, E. P. E. (509186998)","Medtronic Portugal, Lda (504223933)","49.044,00 €",09-05-2017,28-12-2016,365 dias,"Portugal, Setúbal, Barreiro","Artigo 20.º, n.º 1, alínea b) do Código dos Contratos Públicos",31-12-2017,"36.464,00 €",,ALTERAÇÃO DE QUANTIDADES,,Não aplicável.,Não aplicável.,FALSE
FI0013/2016 - MED. CORRECTIVOS VOLÉMIA E OUTRAS SOLUÇÕES ESTERÉIS,Ao abrigo de acordo-quadro (art.º 259.º),Aquisição de bens móveis,"33600000-6, Produtos farmacêuticos","CHBM - Centro Hospital Barreiro Montijo, EPE (509186998)","B. BRAUN MEDICAL, LDA (501506543)","26.668,77 €",08-05-2017,21-04-2016,365 dias,"Portugal, Setúbal, Barreiro",Artigo 259.º do Código dos Contratos Públicos,30-12-2016,"26.668,77 €",,"",,405999,CONCURSO PÚBLICO PARA A CELEBRAÇÃO DE CONTRATOS PÚBLICOS DE APROVISIONAMENTO PARA AQUISIÇÃO CORRECTIVOS DA VOLÉMIA E OUTRAS SOLUÇÕES ESTÉREIS,FALSE
FI0013/2016 - MED. CORRECTIVOS VOLÉMIA E OUTRAS SOLUÇÕES ESTERÉIS,Ao abrigo de acordo-quadro (art.º 259.º),Aquisição de bens móveis,"33600000-6, Produtos farmacêuticos","CHBM - Centro Hospital Barreiro Montijo, EPE (509186998)","BAXTER MEDICO - FARMACEUTICA, LDA (503347345)","44.349,23 €",08-05-2017,21-04-2016,365 dias,"Portugal, Setúbal, Barreiro",Artigo 259.º do Código dos Contratos Públicos,30-12-2016,"44.349,23 €",,"",,405999,CONCURSO PÚBLICO PARA A CELEBRAÇÃO DE CONTRATOS PÚBLICOS DE APROVISIONAMENTO PARA AQUISIÇÃO CORRECTIVOS DA VOLÉMIA E OUTRAS SOLUÇÕES ESTÉREIS,FALSE
FI0013/2016 - MED. CORRECTIVOS VOLÉMIA E OUTRAS SOLUÇÕES ESTERÉIS,Ao abrigo de acordo-quadro (art.º 259.º),Aquisição de bens móveis,"33600000-6, Produtos farmacêuticos","CHBM - Centro Hospital Barreiro Montijo, EPE (509186998)","GRIFOLS PORTUGAL - PROD. FARMAC. E HOSP., LDA. (502041285)","11.506,02 €",08-05-2017,21-04-2016,365 dias,"Portugal, Setúbal, Barreiro",Artigo 259.º do Código dos Contratos Públicos,30-12-2016,"11.506,02 €",,"",,405999,CONCURSO PÚBLICO PARA A CELEBRAÇÃO DE CONTRATOS PÚBLICOS DE APROVISIONAMENTO PARA AQUISIÇÃO CORRECTIVOS DA VOLÉMIA E OUTRAS SOLUÇÕES ESTÉREIS,FALSE
FI0013/2016 - MED. CORRECTIVOS VOLÉMIA E OUTRAS SOLUÇÕES ESTERÉIS,Ao abrigo de acordo-quadro (art.º 259.º),Aquisição de bens móveis,"33600000-6, Produtos farmacêuticos","Centro Hospitalar Barreiro Montijo, E. P. E. (509186998)","LABESFAL-L. ESP. FARM. ALMIRO, (501169580)","49.668,40 €",08-05-2017,21-04-2016,365 dias,"Portugal, Setúbal, Barreiro",Artigo 259.º do Código dos Contratos Públicos,30-12-2016,"49.668,40 €",,"",,405999,CONCURSO PÚBLICO PARA A CELEBRAÇÃO DE CONTRATOS PÚBLICOS DE APROVISIONAMENTO PARA AQUISIÇÃO CORRECTIVOS DA VOLÉMIA E OUTRAS SOLUÇÕES ESTÉREIS,FALSE
FI0013/2016 - MED. CORRECTIVOS VOLÉMIA E OUTRAS SOLUÇÕES ESTERÉIS,Ao abrigo de acordo-quadro (art.º 259.º),Aquisição de bens móveis,"33600000-6, Produtos farmacêuticos","Centro Hospitalar Barreiro Montijo, E. P. E. (509186998)","OVERPHARMA - PROD. MÉDICOS E FARMACÊUTICOS, LDA. (505792362)","199.945,68 €",08-05-2017,21-04-2016,365 dias,"Portugal, Setúbal, Barreiro",Artigo 259.º do Código dos Contratos Públicos,30-12-2016,"199.945,68 €",,"",,405999,CONCURSO PÚBLICO PARA A CELEBRAÇÃO DE CONTRATOS PÚBLICOS DE APROVISIONAMENTO PARA AQUISIÇÃO CORRECTIVOS DA VOLÉMIA E OUTRAS SOLUÇÕES ESTÉREIS,FALSE
FI0013/2016 - MED. CORRECTIVOS VOLÉMIA E OUTRAS SOLUÇÕES ESTERÉIS,Ao abrigo de acordo-quadro (art.º 259.º),Aquisição de bens móveis,"33600000-6, Produtos farmacêuticos","Centro Hospitalar Barreiro Montijo, E. P. E. (509186998)","FRESENIUS KABI PHARMA PORTUGAL, LDA. (504293753)","28.672,10 €",08-05-2017,21-04-2016,365 dias,"Portugal, Setúbal, Barreiro",Artigo 259.º do Código dos Contratos Públicos,30-12-2016,"28.672,10 €",,"",,405999,CONCURSO PÚBLICO PARA A CELEBRAÇÃO DE CONTRATOS PÚBLICOS DE APROVISIONAMENTO PARA AQUISIÇÃO CORRECTIVOS DA VOLÉMIA E OUTRAS SOLUÇÕES ESTÉREIS,FALSE
FI0092/2016 - MED. DIVERSOS (SPMS 2015064 ),Ao abrigo de acordo-quadro (art.º 259.º),Aquisição de bens móveis,"33600000-6, Produtos farmacêuticos","Centro Hospitalar Barreiro Montijo, E. P. E. (509186998)","BAYER PORTUGAL, S.A. (500043256)","312,00 €",08-05-2017,14-04-2016,365 dias,"Portugal, Setúbal, Barreiro",Artigo 259.º do Código dos Contratos Públicos,30-12-2016,"312,00 €",,"",,461370,"CP 2012/44 - MEDICAMENTOS ANALGÉSICOS, ANTIPIRÉTICOS E ANTIDEPRESSIVOS",FALSE
FI0092/2016 - MED. DIVERSOS (SPMS 2015064 ),Ao abrigo de acordo-quadro (art.º 259.º),Aquisição de bens móveis,"33600000-6, Produtos farmacêuticos","Centro Hospitalar Barreiro Montijo, E. P. E. (509186998)","UNILFARMA, LDA (500293023)","2.693,25 €",08-05-2017,14-04-2016,365 dias,"Portugal, Setúbal, Barreiro",Artigo 259.º do Código dos Contratos Públicos,30-12-2016,"2.693,25 €",,"",,461370,"CP 2012/44 - MEDICAMENTOS ANALGÉSICOS, ANTIPIRÉTICOS E ANTIDEPRESSIVOS",FALSE
FI0092/2016 - MED. DIVERSOS (SPMS 2015064 ),Ao abrigo de acordo-quadro (art.º 259.º),Aquisição de bens móveis,"33600000-6, Produtos farmacêuticos","Centro Hospitalar Barreiro Montijo, E. P. E. (509186998)","HIKMA FARMACEUTICA (PORTUGAL), LDA. (502266791)","2.380,00 €",08-05-2017,14-04-2016,365 dias,"Portugal, Setúbal, Barreiro",Artigo 259.º do Código dos Contratos Públicos,30-12-2016,"2.380,00 €",,"",,461370,"CP 2012/44 - MEDICAMENTOS ANALGÉSICOS, ANTIPIRÉTICOS E ANTIDEPRESSIVOS",FALSE
FI0092/2016 - MED. DIVERSOS (SPMS 2015064 ),Ao abrigo de acordo-quadro (art.º 259.º),Aquisição de bens móveis,"33600000-6, Produtos farmacêuticos","Centro Hospitalar Barreiro Montijo, E. P. E. (509186998)","OVERPHARMA - PROD. MÉDICOS E FARMACÊUTICOS, LDA. (505792362)","227,14 €",08-05-2017,14-04-2016,365 dias,"Portugal, Setúbal, Barreiro",Artigo 259.º do Código dos Contratos Públicos,30-12-2016,"227,14 €",,"",,461370,"CP 2012/44 - MEDICAMENTOS ANALGÉSICOS, ANTIPIRÉTICOS E ANTIDEPRESSIVOS",FALSE
FI0092/2016 - MED. DIVERSOS (SPMS 2015064 ),Ao abrigo de acordo-quadro (art.º 259.º),Aquisição de bens móveis,"33600000-6, Produtos farmacêuticos","Centro Hospitalar Barreiro Montijo, E. P. E. (509186998)","MEDINFAR-PROD FARMACEUTICO, S. (500384045)","1.040,00 €",08-05-2017,14-04-2016,365 dias,"Portugal, Setúbal, Barreiro",Artigo 259.º do Código dos Contratos Públicos,30-12-2016,"1.040,00 €",,"",,461370,"CP 2012/44 - MEDICAMENTOS ANALGÉSICOS, ANTIPIRÉTICOS E ANTIDEPRESSIVOS",FALSE
FI0092/2016 - MED. DIVERSOS (SPMS 2015064 ),Ao abrigo de acordo-quadro (art.º 259.º),Aquisição de bens móveis,"33600000-6, Produtos farmacêuticos","Centro Hospitalar Barreiro Montijo, E. P. E. (509186998)","B. BRAUN MEDICAL, LDA (501506543)","23.180,00 €",08-05-2017,14-04-2016,365 dias,"Portugal, Setúbal, Barreiro",Artigo 259.º do Código dos Contratos Públicos,30-12-2016,"23.180,00 €",,"",,461370,"CP 2012/44 - MEDICAMENTOS ANALGÉSICOS, ANTIPIRÉTICOS E ANTIDEPRESSIVOS",FALSE
FI0092/2016 - MED. DIVERSOS (SPMS 2015064 ),Ao abrigo de acordo-quadro (art.º 259.º),Aquisição de bens móveis,"33600000-6, Produtos farmacêuticos","Centro Hospitalar Barreiro Montijo, E. P. E. (509186998)","PHARMAKERN PORTUGAL-PROD. FARMAC., LDA (507002571)","156,80 €",08-05-2017,14-04-2016,365 dias,"Portugal, Setúbal, Barreiro","Artigo 33.º, n.º 3 do Código dos Contratos Públicos",30-12-2016,"156,80 €",,"",,461370,"CP 2012/44 - MEDICAMENTOS ANALGÉSICOS, ANTIPIRÉTICOS E ANTIDEPRESSIVOS",FALSE
40007/2017 - MATERIAL PARA ORTOPEDIA,Ajuste Direto Regime Geral,Aquisição de bens móveis,"33140000-3, Material médico de consumo","CHBM - Centro Hospital Barreiro Montijo, EPE (509186998)",EUROSINTESE (503491403),"22.876,65 €",08-05-2017,30-01-2017,365 dias,"Portugal, Setúbal, Barreiro","Artigo 20.º, n.º 1, alínea a) do Código dos Contratos Públicos",31-12-2017,"5.973,49 €",,ALTERAÇÃO DE QUANTIDADES,,Não aplicável.,Não aplicável.,FALSE
40048/2017 - CORRECÇÃO INCONTINENCIA URINÁRIA E GINECOLOGIA,Ajuste Direto Regime Geral,Aquisição de bens móveis,"33140000-3, Material médico de consumo","CHBM - Centro Hospital Barreiro Montijo, EPE (509186998)",ENDOTECNICA MATERIAL CIRURGICO (503818348),"12.500,00 €",08-05-2017,30-01-2017,365 dias,"Portugal, Setúbal, Barreiro","Artigo 20.º, n.º 1, alínea a) do Código dos Contratos Públicos",31-12-2017,"17.181,00 €",,ALTERAÇÃO DE QUANTIDADES,,Não aplicável.,Não aplicável.,FALSE
40048/2017 - CORRECÇÃO INCONTINENCIA URINÁRIA E GINECOLOGIA,Ajuste Direto Regime Geral,Aquisição de bens móveis,"33140000-3, Material médico de consumo","CHBM - Centro Hospital Barreiro Montijo, EPE (509186998)","BAYER PORTUGAL, LDA (500043256)","7.500,00 €",08-05-2017,30-01-2017,365 dias,"Portugal, Setúbal, Barreiro","Artigo 20.º, n.º 1, alínea a) do Código dos Contratos Públicos",31-12-2017,"7.500,00 €",,"",,Não aplicável.,Não aplicável.,FALSE
40037/2017 - MATERIAL P/OFTALMOLOGIA,Ajuste Direto Regime Geral,Aquisição de bens móveis,"33140000-3, Material médico de consumo","CHBM - Centro Hospital Barreiro Montijo, EPE (509186998)",ALCON PORTUGAL-PROD.EQUIP.OFTALMOLOGICOS (501251685),"64,68 €",08-05-2017,10-01-2017,365 dias,"Portugal, Setúbal, Barreiro","Artigo 20.º, n.º 1, alínea a) do Código dos Contratos Públicos",31-12-2017,"",,NÃO HOUVE NECESSIDADE DE ADQUIRIR ESTES DM,,Não aplicável.,Não aplicável.,FALSE
40037/2017 - MATERIAL P/OFTALMOLOGIA,Ajuste Direto Regime Geral,Aquisição de bens móveis,"33140000-3, Material médico de consumo","CHBM - Centro Hospital Barreiro Montijo, EPE (509186998)","Overpharma, Lda. (505792362)","1.273,20 €",08-05-2017,10-01-2017,365 dias,"Portugal, Setúbal, Barreiro","Artigo 20.º, n.º 1, alínea a) do Código dos Contratos Públicos",31-12-2017,"30,90 €",,ALTERAÇÃO DE QUANTIDADES,,Não aplicável.,Não aplicável.,FALSE
40037/2017 - MATERIAL P/OFTALMOLOGIA,Ajuste Direto Regime Geral,Aquisição de bens móveis,"33140000-3, Material médico de consumo","CHBM - Centro Hospital Barreiro Montijo, EPE (509186998)","OFTALDATA - PRODUTOS P\ OFTALMOLOGIA, LDA (504887459)","7.275,00 €",08-05-2017,10-01-2017,365 dias,"Portugal, Setúbal, Barreiro","Artigo 20.º, n.º 1, alínea a) do Código dos Contratos Públicos",31-12-2017,"11.246,74 €",,ALTERAÇÃO DE QUANTIDADES,,Não aplicável.,Não aplicável.,FALSE
"FI0005/2016 - MED. ANALGÉSICOS, ANTIPIRÉTICOS E ANTIDEPRESSORES",Ao abrigo de acordo-quadro (art.º 259.º),Aquisição de bens móveis,"33600000-6, Produtos farmacêuticos","Centro Hospitalar Barreiro Montijo, E. P. E. (509186998)","B. BRAUN MEDICAL, LDA (501506543)","28.680,00 €",05-05-2017,11-02-2016,365 dias,"Portugal, Setúbal, Barreiro",Artigo 259.º do Código dos Contratos Públicos,30-12-2016,"28.680,00 €",,"",,461370,"CP 2012/44 - MEDICAMENTOS ANALGÉSICOS, ANTIPIRÉTICOS E ANTIDEPRESSIVOS",FALSE
"FI0005/2016 - MED. ANALGÉSICOS, ANTIPIRÉTICOS E ANTIDEPRESSORES",Ao abrigo de acordo-quadro (art.º 259.º),Aquisição de bens móveis,"33600000-6, Produtos farmacêuticos","Centro Hospitalar Barreiro Montijo, E. P. E. (509186998)",AUROVITAS UNIPESSOAL (513053239),"355,95 €",05-05-2017,11-02-2016,365 dias,"Portugal, Setúbal, Barreiro",Artigo 259.º do Código dos Contratos Públicos,30-12-2016,"355,95 €",,"",,461370,"CP 2012/44 - MEDICAMENTOS ANALGÉSICOS, ANTIPIRÉTICOS E ANTIDEPRESSIVOS",FALSE
"FI0005/2016 - MED. ANALGÉSICOS, ANTIPIRÉTICOS E ANTIDEPRESSORES",Ao abrigo de acordo-quadro (art.º 259.º),Aquisição de bens móveis,"33600000-6, Produtos farmacêuticos","Centro Hospitalar Barreiro Montijo, E. P. E. (509186998)","UNILFARMA, LDA (500293023)","12.880,00 €",05-05-2017,11-02-2016,365 dias,"Portugal, Setúbal, Barreiro",Artigo 259.º do Código dos Contratos Públicos,30-12-2016,"12.880,00 €",,"",,461370,"CP 2012/44 - MEDICAMENTOS ANALGÉSICOS, ANTIPIRÉTICOS E ANTIDEPRESSIVOS",FALSE
"FI0005/2016 - MED. ANALGÉSICOS, ANTIPIRÉTICOS E ANTIDEPRESSORES",Ao abrigo de acordo-quadro (art.º 259.º),Aquisição de bens móveis,"33600000-6, Produtos farmacêuticos","Centro Hospitalar Barreiro Montijo, E. P. E. (509186998)","GRUNENTHAL, S.A. (500101965)","486,00 €",05-05-2017,11-02-2016,365 dias,"Portugal, Setúbal, Barreiro",Artigo 259.º do Código dos Contratos Públicos,30-12-2016,"486,00 €",,"",,461370,"CP 2012/44 - MEDICAMENTOS ANALGÉSICOS, ANTIPIRÉTICOS E ANTIDEPRESSIVOS",FALSE
"FI0005/2016 - MED. ANALGÉSICOS, ANTIPIRÉTICOS E ANTIDEPRESSORES",Ao abrigo de acordo-quadro (art.º 259.º),Aquisição de bens móveis,"33600000-6, Produtos farmacêuticos","Centro Hospitalar Barreiro Montijo, E. P. E. (509186998)","MERCK SHARP & DOHME, LDA (500191360)","24,82 €",05-05-2017,11-02-2016,365 dias,"Portugal, Setúbal, Barreiro",Artigo 259.º do Código dos Contratos Públicos,30-12-2016,"24,82 €",,"",,461370,"CP 2012/44 - MEDICAMENTOS ANALGÉSICOS, ANTIPIRÉTICOS E ANTIDEPRESSIVOS",FALSE
"FI0005/2016 - MED. ANALGÉSICOS, ANTIPIRÉTICOS E ANTIDEPRESSORES",Ao abrigo de acordo-quadro (art.º 259.º),Aquisição de bens móveis,"33600000-6, Produtos farmacêuticos","Centro Hospitalar Barreiro Montijo, E. P. E. (509186998)","LABESFAL-L. ESP. FARM. ALMIRO, (501169580)","18.790,00 €",05-05-2017,11-02-2016,365 dias,"Portugal, Setúbal, Barreiro",Artigo 259.º do Código dos Contratos Públicos,30-12-2016,"18.790,00 €",,"",,461370,"CP 2012/44 - MEDICAMENTOS ANALGÉSICOS, ANTIPIRÉTICOS E ANTIDEPRESSIVOS",FALSE
"FI0005/2016 - MED. ANALGÉSICOS, ANTIPIRÉTICOS E ANTIDEPRESSORES",Ao abrigo de acordo-quadro (art.º 259.º),Aquisição de bens móveis,"33600000-6, Produtos farmacêuticos","Centro Hospitalar Barreiro Montijo, E. P. E. (509186998)","HIKMA FARMACEUTICA (PORTUGAL), LDA. (502266791)","4.087,50 €",05-05-2017,11-02-2016,365 dias,"Portugal, Setúbal, Barreiro",Artigo 259.º do Código dos Contratos Públicos,30-12-2016,"4.087,50 €",,"",,461370,"CP 2012/44 - MEDICAMENTOS ANALGÉSICOS, ANTIPIRÉTICOS E ANTIDEPRESSIVOS",FALSE
"FI0005/2016 - MED. ANALGÉSICOS, ANTIPIRÉTICOS E ANTIDEPRESSORES",Ao abrigo de acordo-quadro (art.º 259.º),Aquisição de bens móveis,"33600000-6, Produtos farmacêuticos","Centro Hospitalar Barreiro Montijo, E. P. E. (509186998)",FERRER PORTUGAL S.A. (500069190),"3.182,39 €",05-05-2017,11-02-2016,365 dias,"Portugal, Setúbal, Barreiro",Artigo 259.º do Código dos Contratos Públicos,30-12-2016,"3.182,39 €",,"",,461370,"CP 2012/44 - MEDICAMENTOS ANALGÉSICOS, ANTIPIRÉTICOS E ANTIDEPRESSIVOS",FALSE
"FI0005/2016 - MED. ANALGÉSICOS, ANTIPIRÉTICOS E ANTIDEPRESSORES",Ao abrigo de acordo-quadro (art.º 259.º),Aquisição de bens móveis,"33600000-6, Produtos farmacêuticos","Centro Hospitalar Barreiro Montijo, E. P. E. (509186998)","GENERIS-FARMACEUTICA, S.A. (508107997)","719,42 €",05-05-2017,11-02-2016,365 dias,"Portugal, Setúbal, Barreiro",Artigo 259.º do Código dos Contratos Públicos,30-12-2016,"719,42 €",,"",,461370,"CP 2012/44 - MEDICAMENTOS ANALGÉSICOS, ANTIPIRÉTICOS E ANTIDEPRESSIVOS",FALSE
"FI0005/2016 - MED. ANALGÉSICOS, ANTIPIRÉTICOS E ANTIDEPRESSORES",Ao abrigo de acordo-quadro (art.º 259.º),Aquisição de bens móveis,"33600000-6, Produtos farmacêuticos","Centro Hospitalar Barreiro Montijo, E. P. E. (509186998)","OVERPHARMA - PROD. MÉDICOS E FARMACÊUTICOS, LDA. (505792362)","2.515,87 €",05-05-2017,11-02-2016,365 dias,"Portugal, Setúbal, Barreiro",Artigo 259.º do Código dos Contratos Públicos,30-12-2016,"2.515,87 €",,"",,461370,"CP 2012/44 - MEDICAMENTOS ANALGÉSICOS, ANTIPIRÉTICOS E ANTIDEPRESSIVOS",FALSE
"FI0005/2016 - MED. ANALGÉSICOS, ANTIPIRÉTICOS E ANTIDEPRESSORES",Ao abrigo de acordo-quadro (art.º 259.º),Aquisição de bens móveis,"33600000-6, Produtos farmacêuticos","Centro Hospitalar Barreiro Montijo, E. P. E. (509186998)","JANSSEN CILAG FARMACEUTICA, LDA (500189412)","880,10 €",05-05-2017,11-02-2016,365 dias,"Portugal, Setúbal, Barreiro",Artigo 259.º do Código dos Contratos Públicos,30-12-2016,"880,10 €",,"",,461370,"CP 2012/44 - MEDICAMENTOS ANALGÉSICOS, ANTIPIRÉTICOS E ANTIDEPRESSIVOS",FALSE
F70001/2016 - FUNDO-MANEIO,Ajuste Direto Regime Geral,Aquisição de bens móveis,"33600000-6, Produtos farmacêuticos","Centro Hospitalar Barreiro Montijo, E. P. E. (509186998)",FARMACIA SILVA INACIO (509804705),"966,53 €",05-05-2017,04-01-2016,365 dias,"Portugal, Setúbal, Barreiro","Artigo 20.º, n.º 1, alínea a) do Código dos Contratos Públicos",30-12-2016,"966,53 €",,"",,Não aplicável.,Não aplicável.,FALSE
FI0363/2016 - PARECOXIB 40 MG AMP,Ao abrigo de acordo-quadro (art.º 259.º),Aquisição de bens móveis,"33600000-6, Produtos farmacêuticos","Centro Hospitalar Barreiro Montijo, E. P. E. (509186998)","PFIZER BIOFARMACÊUTICA, SOC. UNIPESSOAL,LDA (513300376)","667,00 €",05-05-2017,11-04-2016,365 dias,"Portugal, Setúbal, Barreiro",Artigo 259.º do Código dos Contratos Públicos,30-12-2016,"667,00 €",,"",,600392,"CONCURSO PÚBLICO PARA A CELEBRAÇÃO DE CONTRATOS PÚBLICOS DE APROVISIONAMENTO PARA A ÁREA DA SAÚDE, COM VISTA AO FORNECIMENTO DE MEDICAMENTOS DE CONSUMO GERAL - APARELHO LOCOMOTOR ÀS INSTITUIÇÕES E SERVIÇOS DO SERVIÇO NACIONAL DE SAÚDE",FALSE
FEXC0154/2016 - SIMEPREVIR 150 MG CÁPS,Ajuste Direto Regime Geral,Aquisição de bens móveis,"33600000-6, Produtos farmacêuticos","Centro Hospitalar Barreiro Montijo, E. P. E. (509186998)","JANSSEN CILAG FARMACEUTICA, LDA (500189412)","47.818,26 €",05-05-2017,22-06-2016,20 dias,"Portugal, Setúbal, Barreiro","Artigo 24.º, n.º 1, alínea e) do Código dos Contratos Públicos",24-06-2016,"47.818,26 €",,"",,Não aplicável.,Não aplicável.,FALSE
40007/2017 - MATERIAL PARA ORTOPEDIA,Ajuste Direto Regime Geral,Aquisição de bens móveis,"33140000-3, Material médico de consumo","CHBM - Centro Hospital Barreiro Montijo, EPE (509186998)","SMITH & NEPHEW, LDA.                               (503552461)","408,00 €",05-05-2017,30-01-2017,365 dias,"Portugal, Setúbal, Barreiro","Artigo 20.º, n.º 1, alínea a) do Código dos Contratos Públicos",31-12-2017,"59,00 €",,ALTERAÇÃO DE QUANTIDADES,,Não aplicável.,Não aplicável.,FALSE
40007/2017 - MATERIAL PARA ORTOPEDIA,Ajuste Direto Regime Geral,Aquisição de bens móveis,"33140000-3, Material médico de consumo","CHBM - Centro Hospital Barreiro Montijo, EPE (509186998)",BIOMET PORTUGAL UNIPESSOAL LDA (500254990),"1.888,00 €",05-05-2017,30-01-2017,365 dias,"Portugal, Setúbal, Barreiro","Artigo 20.º, n.º 1, alínea a) do Código dos Contratos Públicos",31-12-2017,"",,NÃO HOUVE NECESSIDADE DE AQUIRIR ESTES DM,,Não aplicável.,Não aplicável.,FALSE
40007/2017 - MATERIAL PARA ORTOPEDIA,Ajuste Direto Regime Geral,Aquisição de bens móveis,"33140000-3, Material médico de consumo","CHBM - Centro Hospital Barreiro Montijo, EPE (509186998)",BONECARE (505899914),"3.554,09 €",05-05-2017,30-01-2017,365 dias,"Portugal, Setúbal, Barreiro","Artigo 20.º, n.º 1, alínea a) do Código dos Contratos Públicos",31-12-2017,"178,00 €",,ALTERAÇÃO DE QUANTIDADES,,Não aplicável.,Não aplicável.,FALSE
40007/2017 - MATERIAL PARA ORTOPEDIA,Ajuste Direto Regime Geral,Aquisição de bens móveis,"33140000-3, Material médico de consumo","CHBM - Centro Hospital Barreiro Montijo, EPE (509186998)",Eurocasmedica (503322105),"244,69 €",05-05-2017,30-01-2017,365 dias,"Portugal, Setúbal, Barreiro","Artigo 20.º, n.º 1, alínea a) do Código dos Contratos Públicos",31-12-2017,"27,39 €",,ALTERAÇÃO DE QUANTIDADES,,Não aplicável.,Não aplicável.,FALSE
FEXC0151/2016 - DACLATASVIR 60 MG COMP,Ajuste Direto Regime Geral,Aquisição de bens móveis,"33600000-6, Produtos farmacêuticos","Centro Hospitalar Barreiro Montijo, E. P. E. (509186998)",BRISTOL MYERS SQUIBB-FARM. POR (500048193),"51.203,95 €",05-05-2017,22-06-2016,20 dias,"Portugal, Setúbal, Barreiro","Artigo 24.º, n.º 1, alínea e) do Código dos Contratos Públicos",23-06-2016,"51.203,95 €",,"",,Não aplicável.,Não aplicável.,FALSE
40007/2017 - MATERIAL PARA ORTOPEDIA,Ajuste Direto Regime Geral,Aquisição de bens móveis,"33140000-3, Material médico de consumo","CHBM - Centro Hospital Barreiro Montijo, EPE (509186998)",Striker Produtos Médicos Unipessoal Lda. (504594214),"7.925,00 €",05-05-2017,30-01-2017,365 dias,"Portugal, Setúbal, Barreiro","Artigo 20.º, n.º 1, alínea a) do Código dos Contratos Públicos",31-12-2017,"5.610,01 €",,ALTERAÇÃO DE QUANTIDADES,,Não aplicável.,Não aplicável.,FALSE
FEXC0152/2016 - DACLATASVIR 60 MG COMP,Ajuste Direto Regime Geral,Aquisição de bens móveis,"33600000-6, Produtos farmacêuticos","Centro Hospitalar Barreiro Montijo, E. P. E. (509186998)",BRISTOL MYERS SQUIBB-FARM. POR (500048193),"51.203,95 €",05-05-2017,22-06-2016,20 dias,"Portugal, Setúbal, Barreiro","Artigo 24.º, n.º 1, alínea e) do Código dos Contratos Públicos",23-06-2016,"51.203,95 €",,"",,Não aplicável.,Não aplicável.,FALSE
40007/2017 - MATERIAL PARA ORTOPEDIA,Ajuste Direto Regime Geral,Aquisição de bens móveis,"33140000-3, Material médico de consumo","CHBM - Centro Hospital Barreiro Montijo, EPE (509186998)","Johnson & Johnson, Lda (500153370)","270,00 €",05-05-2017,30-01-2017,365 dias,"Portugal, Setúbal, Barreiro","Artigo 20.º, n.º 1, alínea a) do Código dos Contratos Públicos",31-12-2017,"90,00 €",,ALTERAÇÃO DE QUANTIDADES,,Não aplicável.,Não aplicável.,FALSE
40007/2017 - MATERIAL PARA ORTOPEDIA,Ajuste Direto Regime Geral,Aquisição de bens móveis,"33140000-3, Material médico de consumo","CHBM - Centro Hospital Barreiro Montijo, EPE (509186998)","B BRAUN MEDICAL, LDA.                              (501506543)","582,46 €",05-05-2017,30-01-2017,365 dias,"Portugal, Setúbal, Barreiro","Artigo 20.º, n.º 1, alínea a) do Código dos Contratos Públicos",31-12-2017,"241,86 €",,ALTERAÇÃO DE QUANTIDADES,,Não aplicável.,Não aplicável.,FALSE
40007/2017 - MATERIAL PARA ORTOPEDIA,Ajuste Direto Regime Geral,Aquisição de bens móveis,"33140000-3, Material médico de consumo","CHBM - Centro Hospital Barreiro Montijo, EPE (509186998)","EXPOMEDICA-SOC.EXP.IMPORT.MAT.MED.,LDA (501886621)","38,30 €",05-05-2017,30-01-2017,365 dias,"Portugal, Setúbal, Barreiro","Artigo 20.º, n.º 1, alínea a) do Código dos Contratos Públicos",31-12-2017,"",,NÃO HOUVE NECESSIDADE DE AQUIRIR ESTES DM,,Não aplicável.,Não aplicável.,FALSE
FEXC0153/2016 - DACLATASVIR 60 MG COMP,Ajuste Direto Regime Geral,Aquisição de bens móveis,"33600000-6, Produtos farmacêuticos","Centro Hospitalar Barreiro Montijo, E. P. E. (509186998)",BRISTOL MYERS SQUIBB-FARM. POR (500048193),"51.203,95 €",05-05-2017,20-05-2016,20 dias,"Portugal, Setúbal, Barreiro","Artigo 24.º, n.º 1, alínea e) do Código dos Contratos Públicos",30-05-2016,"51.203,95 €",,"",,Não aplicável.,Não aplicável.,FALSE
FEXC0185/2016 - LEDIPASvir 90MG + SOFOSBUVIR 400MG COMP; SOFOSBUvir 400 MG COMP REVES,Ajuste Direto Regime Geral,Aquisição de bens móveis,"33600000-6, Produtos farmacêuticos","Centro Hospitalar Barreiro Montijo, E. P. E. (509186998)","GILEAD SCIENCES, LDA. (503604704)","210.843,15 €",05-05-2017,29-11-2016,20 dias,"Portugal, Setúbal, Barreiro","Artigo 24.º, n.º 1, alínea e) do Código dos Contratos Públicos",30-11-2016,"210.843,15 €",,"",,Não aplicável.,Não aplicável.,FALSE
40003/2017 - MATERIAL PARA ANESTESIA,Ajuste Direto Regime Geral,Aquisição de bens móveis,"33140000-3, Material médico de consumo","CHBM - Centro Hospital Barreiro Montijo, EPE (509186998)",Intersurgical (503480045),"11.109,30 €",05-05-2017,17-01-2017,365 dias,"Portugal, Setúbal, Barreiro","Artigo 20.º, n.º 1, alínea a) do Código dos Contratos Públicos",31-12-2017,"12.108,79 €",,ALTERAÇÃO DE QUANTIDADES,,Não aplicável.,Não aplicável.,FALSE
FI0410/2016 - TERLIPRESSINA ACETATO 1MG SOL INJ,Ao abrigo de acordo-quadro (art.º 259.º),Aquisição de bens móveis,"33600000-6, Produtos farmacêuticos","Centro Hospitalar Barreiro Montijo, E. P. E. (509186998)","FERRING PORTUGUESA - PROD. FARM. SOC. UNIP., LDA. (502034831)","7.200,00 €",05-05-2017,12-10-2016,365 dias,"Portugal, Setúbal, Barreiro",Artigo 259.º do Código dos Contratos Públicos,30-12-2016,"7.200,00 €",,"",,603979,"CONCURSO PÚBLICO PARA A CELEBRAÇÃO DE CONTRATOS PÚBLICOS DE APROVISIONAMENTO PARA A ÁREA DA SAÚDE, COM VISTA AO FORNECIMENTO DE HORMONAS E OUTROS MEDICAMENTOS USADOS NO TRATAMENTO DAS DOENÇAS ENDÓCRINAS, ÀS INSTITUIÇÕES E SERVIÇOS DO SERVIÇO NACIONAL DE SAÚDE",FALSE
40003/2017 - MATERIAL PARA ANESTESIA,Ajuste Direto Regime Geral,Aquisição de bens móveis,"33140000-3, Material médico de consumo","CHBM - Centro Hospital Barreiro Montijo, EPE (509186998)","MEDTRONIC PORTUGAL, LDA (504223933)","1.095,00 €",05-05-2017,17-01-2017,365 dias,"Portugal, Setúbal, Barreiro","Artigo 20.º, n.º 1, alínea a) do Código dos Contratos Públicos",31-12-2017,"6.738,01 €",,ALTERAÇÃO DE QUANTIDADES,,Não aplicável.,Não aplicável.,FALSE
"FEXC0190/2016 - OMBITASvir 12,5 MG + PARITAPREVIR 75 MG + RITONAVIR 50 MG COMP REVES",Ajuste Direto Regime Geral,Aquisição de bens móveis,"33600000-6, Produtos farmacêuticos","Centro Hospitalar Barreiro Montijo, E. P. E. (509186998)","AbbVie, LDA (510229050)","28.060,00 €",05-05-2017,06-12-2016,20 dias,"Portugal, Setúbal, Barreiro","Artigo 24.º, n.º 1, alínea e) do Código dos Contratos Públicos",15-12-2016,"28.060,00 €",,"",,Não aplicável.,Não aplicável.,FALSE
40003/2017 - MATERIAL PARA ANESTESIA,Ajuste Direto Regime Geral,Aquisição de bens móveis,"33140000-3, Material médico de consumo","CHBM - Centro Hospital Barreiro Montijo, EPE (509186998)","MBA PORTUGAL, S.A. (504445960)","1.402,70 €",05-05-2017,17-01-2017,365 dias,"Portugal, Setúbal, Barreiro","Artigo 20.º, n.º 1, alínea a) do Código dos Contratos Públicos",31-12-2017,"920,00 €",,ALTERAÇÃO DE QUANTIDADES,,Não aplicável.,Não aplicável.,FALSE
40003/2017 - MATERIAL PARA ANESTESIA,Ajuste Direto Regime Geral,Aquisição de bens móveis,"33140000-3, Material médico de consumo","CHBM - Centro Hospital Barreiro Montijo, EPE (509186998)","TELEFLEX MEDICAL, S.A. (980249783)","51,60 €",05-05-2017,17-01-2017,365 dias,"Portugal, Setúbal, Barreiro","Artigo 20.º, n.º 1, alínea a) do Código dos Contratos Públicos",31-12-2017,"",,NÃO HOUVE NECESSIDADE DE AQUIRIR ESTES DM,,Não aplicável.,Não aplicável.,FALSE
40003/2017 - MATERIAL PARA ANESTESIA,Ajuste Direto Regime Geral,Aquisição de bens móveis,"33140000-3, Material médico de consumo","CHBM - Centro Hospital Barreiro Montijo, EPE (509186998)","SMITHS MEDICAL (PORTUGAL),UNIPESSOAL,LDA (507445937)","1.138,00 €",05-05-2017,17-01-2017,365 dias,"Portugal, Setúbal, Barreiro","Artigo 20.º, n.º 1, alínea a) do Código dos Contratos Públicos",31-12-2017,"1.645,50 €",,ALTERAÇÃO DE QUANTIDADES,,Não aplicável.,Não aplicável.,FALSE
40003/2017 - MATERIAL PARA ANESTESIA,Ajuste Direto Regime Geral,Aquisição de bens móveis,"33140000-3, Material médico de consumo","CHBM - Centro Hospital Barreiro Montijo, EPE (509186998)","Dräger Portugal, Lda. (508771323)","639,20 €",05-05-2017,17-01-2017,365 dias,"Portugal, Setúbal, Barreiro","Artigo 20.º, n.º 1, alínea a) do Código dos Contratos Públicos",31-12-2017,"670,01 €",,ALTERAÇÃO DE QUANTIDADES,,Não aplicável.,Não aplicável.,FALSE
40003/2017 - MATERIAL PARA ANESTESIA,Ajuste Direto Regime Geral,Aquisição de bens móveis,"33140000-3, Material médico de consumo","CHBM - Centro Hospital Barreiro Montijo, EPE (509186998)","B BRAUN MEDICAL, LDA.                              (501506543)","66,44 €",05-05-2017,17-01-2017,365 dias,"Portugal, Setúbal, Barreiro","Artigo 20.º, n.º 1, alínea a) do Código dos Contratos Públicos",31-12-2017,"27,50 €",,ALTERAÇÃO DE QUANTIDADES,,Não aplicável.,Não aplicável.,FALSE
40002/2017 - MATERIAL DE UROLOGIA,Ajuste Direto Regime Geral,Aquisição de bens móveis,"33140000-3, Material médico de consumo","CHBM - Centro Hospital Barreiro Montijo, EPE (509186998)",C.R. Bard Portugal (502438274),"249,50 €",05-05-2017,05-01-2017,365 dias,"Portugal, Setúbal, Barreiro","Artigo 20.º, n.º 1, alínea a) do Código dos Contratos Públicos",31-12-2017,"199,59 €",,ALTERAÇÃO DE QUANTIDADES,,Não aplicável.,Não aplicável.,FALSE
40002/2017 - MATERIAL DE UROLOGIA,Ajuste Direto Regime Geral,Aquisição de bens móveis,"33140000-3, Material médico de consumo","CHBM - Centro Hospital Barreiro Montijo, EPE (509186998)",ENDOTECNICA MATERIAL CIRURGICO (503818348),"306,00 €",05-05-2017,05-01-2017,365 dias,"Portugal, Setúbal, Barreiro","Artigo 20.º, n.º 1, alínea a) do Código dos Contratos Públicos",31-12-2017,"",,NÃO HOUVE NECESSIDADE DE ADQUIRIR ESTES DM,,Não aplicável.,Não aplicável.,FALSE
40002/2017 - MATERIAL DE UROLOGIA,Ajuste Direto Regime Geral,Aquisição de bens móveis,"33140000-3, Material médico de consumo","CHBM - Centro Hospital Barreiro Montijo, EPE (509186998)","COLOPLAST PORTUGAL SOC. UNIP., LDA (EX PORGES) (503989037)","21.692,13 €",05-05-2017,05-01-2017,365 dias,"Portugal, Setúbal, Barreiro","Artigo 20.º, n.º 1, alínea a) do Código dos Contratos Públicos",31-12-2017,"17.798,22 €",,ALTERAÇÃO DE QUANTIDADES,,Não aplicável.,Não aplicável.,FALSE
40002/2017 - MATERIAL DE UROLOGIA,Ajuste Direto Regime Geral,Aquisição de bens móveis,"33140000-3, Material médico de consumo","CHBM - Centro Hospital Barreiro Montijo, EPE (509186998)","EXPOMEDICA-SOC.EXP.IMPORT.MAT.MED.,LDA (501886621)","900,00 €",05-05-2017,05-01-2017,365 dias,"Portugal, Setúbal, Barreiro","Artigo 20.º, n.º 1, alínea a) do Código dos Contratos Públicos",31-12-2017,"379,18 €",,ALTERAÇÃO DE QUANTIDADES,,Não aplicável.,Não aplicável.,FALSE
40002/2017 - MATERIAL DE UROLOGIA,Ajuste Direto Regime Geral,Aquisição de bens móveis,"33140000-3, Material médico de consumo","CHBM - Centro Hospital Barreiro Montijo, EPE (509186998)","Teprel - Equipamentos Médicos, SA. (502262184)","4.191,26 €",03-05-2017,05-01-2017,365 dias,"Portugal, Setúbal, Barreiro","Artigo 20.º, n.º 1, alínea a) do Código dos Contratos Públicos",31-12-2017,"708,00 €",,ALTERAÇÃO DE QUANTIDADES,,Não aplicável.,Não aplicável.,FALSE
