Country,2014,2019,taxa_crescimento
Poland,"23,83",43,"80,44%"
Slovakia,"13,05","22,74","74,25%"
Czechia,"18,2","28,72","57,80%"
Romania,"32,44","49,02","51,11%"
Hungary,"28,97","43,36","49,67%"
Spain,"43,81","64,32","46,82%"
Austria,"45,39","59,3","30,65%"
Germany,"48,1","61,5","27,86%"
France,"42,43","50,97","20,13%"
Croatia,"25,24","29,65","17,47%"
Denmark,"56,32",66,"17,19%"
Slovenia,"24,55","28,29","15,23%"
Netherlands,"37,32","41,8","12,00%"
Lithuania,"47,35","52,88","11,68%"
Latvia,"30,24","33,6","11,11%"
Sweden,"51,07","53,3","4,37%"
Finland,"39,1","40,7","4,09%"
United Kingdom,"35,6",37,"3,93%"
Estonia,"36,52","37,6","2,96%"
Cyprus,"43,97","44,99","2,32%"
Belgium,"89,64",89,"-0,71%"
Luxembourg,"85,55","84,1","-1,69%"
Italy,"57,22","56,09","-1,97%"
Malta,"74,8","72,6","-2,94%"
Greece,"59,97","57,86","-3,52%"
Ireland,"52,44","49,3","-5,99%"
Portugal,"33,67","31,01","-7,90%"
Bulgaria,"35,84","30,83","-13,98%"