freguesia,acronym,validVotesPercentage,votes,dicofre
Freiria,PS,40.07,446,111306
Freiria,PPD/PSD,32.52,362,111306
Freiria,B.E.,7.37,82,111306
Freiria,CDS-PP,5.66,63,111306
Freiria,PAN,2.96,33,111306
Freiria,PCP-PEV,2.96,33,111306
Freiria,CH,2.34,26,111306
Freiria,A,1.44,16,111306
Freiria,PCTP/MRPP,0.81,9,111306
Freiria,L,0.72,8,111306
Freiria,R.I.R.,0.72,8,111306
Freiria,IL,0.54,6,111306
Freiria,PPM,0.54,6,111306
Freiria,NC,0.45,5,111306
Freiria,PDR,0.36,4,111306
Freiria,MAS,0.18,2,111306
Freiria,MPT,0.18,2,111306
Freiria,PNR,0.18,2,111306
Freiria,PTP,0,0,111306
Freiria,PURP,0,0,111306
