freguesia,acronym,validVotesPercentage,votes,dicofre
Malhada Sorda,PPD/PSD,43.66,31,090213
Malhada Sorda,PS,22.54,16,090213
Malhada Sorda,B.E.,9.86,7,090213
Malhada Sorda,CDS-PP,7.04,5,090213
Malhada Sorda,PCP-PEV,5.63,4,090213
Malhada Sorda,PCTP/MRPP,5.63,4,090213
Malhada Sorda,PTP,4.23,3,090213
Malhada Sorda,IL,1.41,1,090213
Malhada Sorda,A,0,0,090213
Malhada Sorda,L,0,0,090213
Malhada Sorda,MAS,0,0,090213
Malhada Sorda,NC,0,0,090213
Malhada Sorda,PAN,0,0,090213
Malhada Sorda,PDR,0,0,090213
Malhada Sorda,PNR,0,0,090213
Malhada Sorda,PPM.PPV/CDC,0,0,090213
Malhada Sorda,PURP,0,0,090213
