Objeto do Contrato,Tipo de Procedimento,Tipo(s) de Contrato,CPVs,Entidade(s) Adjudicante(s),Entidade(s) Adjudicatária(s),Preço Contratual,Data de Publicação,Data de Celebração do Contrato,Prazo de Execução,Local de Execução,Fundamentação,Data de Fecho do Contrato,Preço Total Efetivo,Causas das Alterações ao Prazo,Causas das Alterações ao Preço,Estado,N.º registo do Acordo Quadro,Descrição do Acordo Quadro,Procedimento Centralizado
Vedação da Ex-Escola do Cerco / ACES Porto Oriental,Ajuste Direto Regime Geral,Empreitadas de obras públicas,"45454000-4, Obras de reestruturação","Administração Regional de Saúde do Norte, I.P. (503135593)","CAF - Construções Cruz Archer & Ferreira, Lda (501777865)","50.600,00 €",21-12-2012,15-11-2012,30 dias,"Portugal, Porto, Porto","Artigo 19.º, alínea a) do Código dos Contratos Públicos","","50.600,00 €",O serviço onde se executaram os trabalhos não parou o seu normal funcionamento pelo que condicionou o atraso da empreitada.,"",,Não aplicável.,Não aplicável.,
Adaptação para instalação USFs Bela Saúde e Emília Peres,Ajuste Direto Regime Geral,Empreitadas de obras públicas,"45454000-4, Obras de reestruturação","Administração Regional de Saúde do Norte, I.P. (503135593)","Civilsabe - Projectos e Construção, Lda (509254993)","43.892,00 €",21-12-2012,16-11-2012,30 dias,"Portugal, Porto, Valongo","Artigo 19.º, alínea a) do Código dos Contratos Públicos","","43.892,00 €",O serviço onde se executaram os trabalhos não parou o seu normal funcionamento pelo que condicionou o atraso da empreitada.,"",,Não aplicável.,Não aplicável.,
Complementares USF Faria de Guimarães,Ajuste Direto Regime Geral,Empreitadas de obras públicas,"45453000-7, Obras de revisão e recuperação","Administração Regional de Saúde do Norte, I.P. (503135593)","Desfilvital, Construções, Lda (510344186)","23.222,60 €",21-12-2012,06-11-2012,50 dias,"Portugal, Porto, Porto","Artigo 19.º, alínea a) do Código dos Contratos Públicos","","23.222,60 €",Atraso devido à formalização processual.,"",,Não aplicável.,Não aplicável.,
"Climatização UCSP, USP, SASU e CDP Maia",Ajuste Direto Regime Geral,Empreitadas de obras públicas,"45350000-5, Instalações mecânicas","Administração Regional de Saúde do Norte, I.P. (503135593)","Montequi - Montagens e Equipamentos, Unipessoal, Lda (505009919)","43.327,00 €",21-12-2012,19-10-2012,30 dias,"Portugal, Porto, Maia","Artigo 19.º, alínea a) do Código dos Contratos Públicos","","43.327,00 €",O serviço onde se executaram os trabalhos não parou o seu normal funcionamento pelo que condicionou o atraso da empreitada.,"",,Não aplicável.,Não aplicável.,
Caixilharia USF Nova Era,Ajuste Direto Regime Geral,Empreitadas de obras públicas,"45421110-8, Instalação de caixilharia de portas e janelas","Administração Regional de Saúde do Norte, I.P. (503135593)","Calibre Universal, Construções, Lda (509468276)","39.610,00 €",21-12-2012,24-10-2012,30 dias,"Portugal, Porto, Paredes","Artigo 19.º, alínea a) do Código dos Contratos Públicos","","39.610,00 €",O serviço onde se executaram os trabalhos não parou o seu normal funcionamento pelo que condicionou o atraso da empreitada.,O serviço onde se executaram os trabalhos não parou o seu normal funcionamento pelo que condicionou o atraso da empreitada.,,Não aplicável.,Não aplicável.,
Reparação / Substituição de Sistema de Climatização CS Vila Real I,Ajuste Direto Regime Geral,Empreitadas de obras públicas,"45350000-5, Instalações mecânicas","Administração Regional de Saúde do Norte, I.P. (503135593)","Climave, Equipamentos Electromecânicos, Lda (503926140)","62.172,49 €",21-12-2012,19-06-2012,70 dias,"Portugal, Vila Real, Vila Real","Artigo 19.º, alínea a) do Código dos Contratos Públicos","","62.172,49 €",O serviço onde se executaram os trabalhos não parou o seu normal funcionamento pelo que condicionou o atraso da empreitada.,"",,Não aplicável.,Não aplicável.,
Revestimentos e Isolamento da Fachada US Aver-o-Mar,Ajuste Direto Regime Geral,Empreitadas de obras públicas,"45454000-4, Obras de reestruturação","Administração Regional de Saúde do Norte, I.P. (503135593)","Imagens de Betão, Lda (510387594)","81.278,40 €",21-12-2012,29-11-2012,30 dias,"Portugal, Porto, Póvoa de Varzim","Artigo 19.º, alínea a) do Código dos Contratos Públicos",05-01-2013,"81.278,40 €","","",,Não aplicável.,Não aplicável.,
Alteração do Pavimento USF Saúde em Familia,Ajuste Direto Regime Geral,Empreitadas de obras públicas,"45453000-7, Obras de revisão e recuperação","Administração Regional de Saúde do Norte, I.P. (503135593)","Ideias & Inigmas, Unipessoal, Lda (509895786)","24.085,62 €",21-12-2012,26-09-2012,90 dias,"Portugal, Porto, Maia","Artigo 19.º, alínea a) do Código dos Contratos Públicos","","24.085,62 €",As obras foram terminadas num prazo inferior ao estipulado,"",,Não aplicável.,Não aplicável.,
Arranjos de tellhado e caleiras USF Modivas,Ajuste Direto Regime Geral,Empreitadas de obras públicas,"45453000-7, Obras de revisão e recuperação","Administração Regional de Saúde do Norte, I.P. (503135593)","Tirsopinta - Pinturas e Acabamentos de Construção, Lda (506553132)","16.120,00 €",21-12-2012,25-09-2012,30 dias,"Portugal, Porto, Vila do Conde","Artigo 19.º, alínea a) do Código dos Contratos Públicos",29-10-2012,"16.120,00 €","","",,Não aplicável.,Não aplicável.,
Pinturas e Instalação Eletrica CS Foz do Douro,Ajuste Direto Regime Geral,Empreitadas de obras públicas,"45453100-8, Obras de recuperação","Administração Regional de Saúde do Norte, I.P. (503135593)","José Marques Ferreira, Unipessoal, Lda (509813976)","78.654,44 €",21-12-2012,13-09-2012,90 dias,"Portugal, Porto, Porto","Artigo 19.º, alínea a) do Código dos Contratos Públicos",28-12-2012,"78.654,44 €","","",,Não aplicável.,Não aplicável.,
Manutenção e Reparação Interior USF Rainha D. Amélia,Ajuste Direto Regime Geral,Empreitadas de obras públicas,"45453000-7, Obras de revisão e recuperação","Administração Regional de Saúde do Norte, I.P. (503135593)","Elementarcon, SA (508167183)","15.012,17 €",21-12-2012,20-09-2012,20 dias,"Portugal, Porto, Porto","Artigo 19.º, alínea a) do Código dos Contratos Públicos",18-10-2012,"15.012,17 €","","",,Não aplicável.,Não aplicável.,
Manutenção e Adaptação do Interior UCC Trofa,Ajuste Direto Regime Geral,Empreitadas de obras públicas,"45454000-4, Obras de reestruturação","Administração Regional de Saúde do Norte, I.P. (503135593)","Betão na Cidade, Lda (510234690)","22.917,98 €",21-12-2012,20-09-2012,30 dias,"Portugal, Porto, Santo Tirso","Artigo 19.º, alínea a) do Código dos Contratos Públicos",20-12-2012,"22.917,98 €","","",,Não aplicável.,Não aplicável.,
Arranjos Exteriores e Diversos USF Paços de Sousa,Ajuste Direto Regime Geral,Empreitadas de obras públicas,"45454000-4, Obras de reestruturação","Administração Regional de Saúde do Norte, I.P. (503135593)","Nobre Objectivo, Construções, Lda (508705339)","31.608,05 €",21-12-2012,19-09-2012,30 dias,"Portugal, Porto, Penafiel","Artigo 19.º, alínea a) do Código dos Contratos Públicos","","31.608,05 €",O serviço onde se executaram os trabalhos não parou o seu normal funcionamento pelo que condicionou o atraso da empreitada.,"",,Não aplicável.,Não aplicável.,
Águas Pluviais e Passeios Exteriores CS Santa Maria da Feira,Ajuste Direto Regime Geral,Empreitadas de obras públicas,"45454000-4, Obras de reestruturação","Administração Regional de Saúde do Norte, I.P. (503135593)","Átomo Matriz, Construção e Coordenação, Lda (510098428)","19.146,73 €",21-12-2012,09-05-2012,30 dias,"Portugal, Aveiro, Santa Maria da Feira","Artigo 19.º, alínea a) do Código dos Contratos Públicos","","19.146,73 €",O serviço onde se executaram os trabalhos não parou o seu normal funcionamento pelo que condicionou o atraso da empreitada.,"",,Não aplicável.,Não aplicável.,
Reparação e Beneficiação CS Santa Maria da Feira,Ajuste Direto Regime Geral,Empreitadas de obras públicas,"45453100-8, Obras de recuperação","Administração Regional de Saúde do Norte, I.P. (503135593)","Átomo Matriz, Construção e Coordenação, Lda (510098428)","25.797,52 €",21-12-2012,18-05-2012,30 dias,"Portugal, Aveiro, Santa Maria da Feira","Artigo 22.º, n.º 1, alínea b) do Código dos Contratos Públicos","","25.797,52 €",O serviço onde se executaram os trabalhos não parou o seu normal funcionamento pelo que condicionou o atraso da empreitada.,"",,Não aplicável.,Não aplicável.,
Cofres e Placards de afixação,Ajuste Direto Regime Geral,Aquisição de bens móveis,"39100000-3, Mobiliário","Administração Regional de Saúde do Norte, I.P. (503135593)",Sifam (502388579),"17.159,00 €",21-12-2012,10-10-2012,20 dias,"Portugal, Porto, Valongo<BR/>Portugal, Braga, Braga<BR/>Portugal, Viseu, Lamego<BR/>Portugal, Vila Real, Vila Real","Artigo 20.º, n.º 1, alínea a) do Código dos Contratos Públicos",04-12-2012,"17.159,00 €","","",,Não aplicável.,Não aplicável.,
"Exteriores, Diversos e Eletricidade Exterior no CS Paranhos",Ajuste Direto Regime Geral,Empreitadas de obras públicas,"45454000-4, Obras de reestruturação","Administração Regional de Saúde do Norte, I.P. (503135593)","Ferteimetal, Lda (510146058)","37.312,61 €",21-12-2012,24-09-2012,60 dias,"Portugal, Porto, Porto","Artigo 19.º, alínea a) do Código dos Contratos Públicos","","37.312,61 €",A obra terminou antes do previsto.,"",,Não aplicável.,Não aplicável.,
Climatização Piso 1 de edifício de sede Latino Coelho,Ajuste Direto Regime Geral,Empreitadas de obras públicas,"45350000-5, Instalações mecânicas","Administração Regional de Saúde do Norte, I.P. (503135593)","Centelha do Ártico - Unipessoal, Lda (509749151)","9.730,00 €",21-12-2012,20-04-2012,30 dias,"Portugal, Porto, Porto","Artigo 19.º, alínea a) do Código dos Contratos Públicos",24-07-2012,"9.730,00 €","","",,Não aplicável.,Não aplicável.,
Equipamento médico  e mobiliário hospitalar variado,Ajuste Direto Regime Geral,Aquisição de bens móveis,"33100000-1, Equipamento médico","Administração Regional de Saúde do Norte, I.P. (503135593)","Bacelar & Irmão, Lda. (500532818)","18.993,50 €",18-12-2012,30-07-2012,20 dias,"Portugal, Porto, Paredes<BR/>Portugal, Porto, Vila Nova de Gaia","Artigo 20.º, n.º 1, alínea a) do Código dos Contratos Públicos",10-10-2012,"18.993,50 €","","",,Não aplicável.,Não aplicável.,
Serviços de Assessoria e Apoio Técnico na Organização do Congresso Internacional de Cuidados Paliativos e Reunião da Organização Mundial de Saúde em Portugal,Ajuste Direto Regime Geral,Aquisição de serviços,"79411000-8, Serviços gerais de consultoria em matéria de gestão geral","Administração Regional de Saúde do Norte, I.P. (503135593)","Gesaworld Portugal, Lda (508485193)","15.000,00 €",17-12-2012,03-09-2012,90 dias,"Portugal, Porto, Porto","Artigo 20.º, n.º 1, alínea a) do Código dos Contratos Públicos",31-12-2012,"9.000,00 €","",Só se realizaram 60% dos serviços adquiridos,,Não aplicável.,Não aplicável.,
Variado equipamento médico,Ajuste Direto Regime Geral,Aquisição de bens móveis,"33100000-1, Equipamento médico","Administração Regional de Saúde do Norte, I.P. (503135593)",Bacelar e Irmão Lda. (500532818),"27.979,38 €",17-12-2012,12-07-2012,20 dias,"Portugal, Vila Real, Vila Real<BR/>Portugal, Braga, Braga<BR/>Portugal, Aveiro, Arouca<BR/>Portugal, Porto, Porto","Artigo 20.º, n.º 1, alínea a) do Código dos Contratos Públicos",30-08-2012,"27.979,38 €","","",,Não aplicável.,Não aplicável.,
Contrato para execução da empreitada de USFs Ara Trajano e Duovida - Impermeabilização da Cobertura,Ajuste Direto Regime Geral,Empreitadas de obras públicas,"45261910-6, Reparação de coberturas","Administração Regional de Saúde do Norte, I.P. (503135593)","João Fernandes da Silva, SA (500669686)","24.717,92 €",17-12-2012,12-12-2012,15 dias,"Portugal, Braga, Guimarães","Artigo 19.º, alínea a) do Código dos Contratos Públicos","","24.717,92 €",Execução Antecipada,"",,Não aplicável.,Não aplicável.,
Máscara plástica p/ nebulização irrecuperável (criança),Ajuste Direto Regime Geral,Aquisição de bens móveis,"33140000-3, Material médico de consumo","Administração Regional de Saúde do Norte, I.P. (503135593)",INTERSUGICAL PORTUGAL (503480045),"441,69 €",14-12-2012,07-12-2012,365 dias,"Portugal, Vila Real, Vila Real<BR/>Portugal, Vila Real, Vila Real","Artigo 20.º, n.º 1, alínea a) do Código dos Contratos Públicos",28-12-2012,"441,69 €","","",,Não aplicável.,Não aplicável.,
Bancadas Hospitalares e Cacifos,Ajuste Direto Regime Geral,Aquisição de bens móveis,"39100000-3, Mobiliário<BR/>33100000-1, Equipamento médico","Administração Regional de Saúde do Norte, I.P. (503135593)",Industrial Laborum (506692027),"9.800,00 €",11-12-2012,09-07-2012,20 dias,"Portugal, Porto, Maia<BR/>Portugal, Aveiro, Espinho","Artigo 20.º, n.º 1, alínea a) do Código dos Contratos Públicos",05-11-2012,"9.800,00 €","","",,Não aplicável.,Não aplicável.,
