freguesia,acronym,validVotesPercentage,votes,dicofre
Castro Vicente,PPD/PSD,58,58,040808
Castro Vicente,PS,25,25,040808
Castro Vicente,B.E.,6,6,040808
Castro Vicente,CDS-PP,5,5,040808
Castro Vicente,PAN,2,2,040808
Castro Vicente,A,1,1,040808
Castro Vicente,NC,1,1,040808
Castro Vicente,PCP-PEV,1,1,040808
Castro Vicente,PTP,1,1,040808
Castro Vicente,IL,0,0,040808
Castro Vicente,L,0,0,040808
Castro Vicente,MAS,0,0,040808
Castro Vicente,PCTP/MRPP,0,0,040808
Castro Vicente,PDR,0,0,040808
Castro Vicente,PNR,0,0,040808
Castro Vicente,PPM.PPV/CDC,0,0,040808
Castro Vicente,PURP,0,0,040808
