Objeto do Contrato,Tipo de Procedimento,Tipo(s) de Contrato,CPVs,Entidade(s) Adjudicante(s),Entidade(s) Adjudicatária(s),Preço Contratual,Data de Publicação,Data de Celebração do Contrato,Prazo de Execução,Local de Execução,Fundamentação,Data de Fecho do Contrato,Preço Total Efetivo,Causas das Alterações ao Prazo,Causas das Alterações ao Preço,Estado,N.º registo do Acordo Quadro,Descrição do Acordo Quadro,Procedimento Centralizado
Aquisição de Correctivos da Volémia e Outras Soluções Estéreis- medicamentos sem CHNM,Ao abrigo de acordo-quadro (art.º 259.º),Aquisição de bens móveis,"33692510-5, Fluidos intravenosos",Hospital Dr. Francisco Zagalo (501510150),Overpharma (505792362),"3.780,00 €",29-01-2015,02-01-2015,365 dias,"Portugal, Aveiro, Ovar",Artigo 259.º do Código dos Contratos Públicos,31-12-2015,"4.057,20 €",,Aumento do valor previsto,,1331181,Acordo Quadro para fornecimento de corretivos da volémia e outras soluções estéreis às Instituições e Serviços do Serviço Nacional de Saúde,FALSE
Aquisição de Correctivos da Volémia e Outras Soluções Estéreis- medicamentos sem CHNM,Ao abrigo de acordo-quadro (art.º 259.º),Aquisição de bens móveis,"33692510-5, Fluidos intravenosos",Hospital Dr. Francisco Zagalo (501510150),B.Braun Lda (501506543),"3.500,00 €",29-01-2015,02-01-2015,365 dias,"Portugal, Aveiro, Ovar",Artigo 259.º do Código dos Contratos Públicos,31-12-2015,"3.125,00 €",,Não utilização do valor previsto,,1331181,Acordo Quadro para fornecimento de corretivos da volémia e outras soluções estéreis às Instituições e Serviços do Serviço Nacional de Saúde,FALSE
501169580,Ao abrigo de acordo-quadro (art.º 259.º),Aquisição de bens móveis,"33692400-1, Soluções para perfusão",Hospital Dr. Francisco Zagalo (501510150),"Overpharma, Lda (505792362)","6.203,20 €",29-01-2015,02-01-2015,365 dias,"Portugal, Aveiro, Ovar",Artigo 259.º do Código dos Contratos Públicos,31-12-2015,"5.588,30 €",,Não utilização do valor previsto,,1331181,Acordo Quadro para fornecimento de corretivos da volémia e outras soluções estéreis às Instituições e Serviços do Serviço Nacional de Saúde,FALSE
Correctivos de Volémia e Outras Soluções Estereis-Medicamentos com CHNM,Ao abrigo de acordo-quadro (art.º 259.º),Aquisição de bens móveis,"33692400-1, Soluções para perfusão",Hospital Dr. Francisco Zagalo (501510150),"Labesfal, SA (501169580)","840,51 €",29-01-2015,02-01-2015,365 dias,"Portugal, Aveiro, Ovar",Artigo 259.º do Código dos Contratos Públicos,31-12-2015,"1.111,20 €",,Aumento do valor previsto,,1331181,Acordo Quadro para fornecimento de corretivos da volémia e outras soluções estéreis às Instituições e Serviços do Serviço Nacional de Saúde,FALSE
Correctivos de Volémia e Outras Soluções Estereis-Medicamentos com CHNM,Ao abrigo de acordo-quadro (art.º 259.º),Aquisição de bens móveis,"33692400-1, Soluções para perfusão",Hospital Dr. Francisco Zagalo (501510150),"Grifols, Lda (502041285)","514,50 €",29-01-2015,02-01-2015,365 dias,"Portugal, Aveiro, Ovar",Artigo 259.º do Código dos Contratos Públicos,31-12-2015,"488,00 €",,Não utilização do valor previsto,,1331181,Acordo Quadro para fornecimento de corretivos da volémia e outras soluções estéreis às Instituições e Serviços do Serviço Nacional de Saúde,FALSE
Correctivos de Volémia e Outras Soluções Estereis-Medicamentos com CHNM,Ao abrigo de acordo-quadro (art.º 259.º),Aquisição de bens móveis,"33692400-1, Soluções para perfusão",Hospital Dr. Francisco Zagalo (501510150),"Baxter, Lda (503347345)","65,46 €",29-01-2015,02-01-2015,365 dias,"Portugal, Aveiro, Ovar",Artigo 259.º do Código dos Contratos Públicos,31-12-2015,"",,Não utilização do valor previsto,,1331181,Acordo Quadro para fornecimento de corretivos da volémia e outras soluções estéreis às Instituições e Serviços do Serviço Nacional de Saúde,FALSE
Correctivos de Volémia e Outras Soluções Estereis-Medicamentos com CNMH,Ao abrigo de acordo-quadro (art.º 259.º),Aquisição de bens móveis,"33692400-1, Soluções para perfusão",Hospital Dr. Francisco Zagalo (501510150),B.Braun (501506543),"1.413,60 €",29-01-2015,02-01-2015,365 dias,"Portugal, Aveiro, Ovar",Artigo 259.º do Código dos Contratos Públicos,31-12-2015,"1.670,40 €",,Aumento do valor previsto,,1331181,Acordo Quadro para fornecimento de corretivos da volémia e outras soluções estéreis às Instituições e Serviços do Serviço Nacional de Saúde,FALSE
Aquisição de Nutrição Parentérica,Ao abrigo de acordo-quadro (art.º 259.º),Aquisição de bens móveis,"33692200-9, Produtos para nutrição parenteral",Hospital Dr. Francisco Zagalo (501510150),B.Braun (501506543),"1.125,52 €",29-01-2015,02-01-2015,365 dias,"Portugal, Aveiro, Ovar",Artigo 259.º do Código dos Contratos Públicos,31-12-2015,"",,Não utilização do valor previsto,,1377429,Acordo Quadro para fornecimento de medicamentos para Nutrição Parentérica às Instituições e Serviços do Serviço Nacional de Saúde,FALSE
Aparelho de anestesia com gases e monitor hemodinamico,Ajuste Direto Regime Geral,Aquisição de bens móveis,"33100000-1, Equipamento médico",Hospital Dr. Francisco Zagalo - Ovar (501510150),"Remeditec-Importação e Comerc. Equip. Saude, S. A. (505086344)","37.093,00 €",28-01-2015,17-12-2014,30 dias,"Portugal, Aveiro, Ovar","Artigo 20.º, n.º 1, alínea a) do Código dos Contratos Públicos",31-12-2014,"37.093,00 €",,"",,Não aplicável.,Não aplicável.,FALSE
Aqquisição de medicamentos do Foro Oncológico,Ajuste Direto Regime Geral,Aquisição de bens móveis,"33652000-5, Antineoplásicos e imunomoduladores",Hospital Dr. Francisco Zagalo (501510150),AbbVie (510229050),"1.599,47 €",26-01-2015,21-01-2015,333 dias,"Portugal, Aveiro, Ovar",Artigo 258.º do Código dos Contratos Públicos,31-12-2015,"732,33 €",,Não utilização do valor previsto,,Não aplicável.,Não aplicável.,FALSE
Aquisição de medicamentos do Foro Oncológico,Ajuste Direto Regime Geral,Aquisição de bens móveis,"33652000-5, Antineoplásicos e imunomoduladores",Hospital Dr. Francisco Zagalo (501510150),Ipsen Portugal (502609800),"1.092,00 €",26-01-2015,21-01-2015,333 dias,"Portugal, Aveiro, Ovar",Artigo 258.º do Código dos Contratos Públicos,31-12-2015,"",,Não utilização do valor previsto,,Não aplicável.,Não aplicável.,FALSE
Aquisição de medicamentos do Foro Oncológico,Ajuste Direto Regime Geral,Aquisição de bens móveis,"33652000-5, Antineoplásicos e imunomoduladores",Hospital Dr. Francisco Zagalo (501510150),Astra Zeneca (502942240),"1.724,79 €",26-01-2015,21-01-2015,334 dias,"Portugal, Aveiro, Ovar",Artigo 258.º do Código dos Contratos Públicos,31-12-2015,"3.665,20 €",,Aumento do valor previsto,,Não aplicável.,Não aplicável.,FALSE
