freguesia,acronym,validVotesPercentage,votes,dicofre
"União das freguesias de Mamouros, Alva e Ribolhos",PPD/PSD.CDS-PP,43.49,177,180323
"União das freguesias de Mamouros, Alva e Ribolhos",PS,39.07,159,180323
"União das freguesias de Mamouros, Alva e Ribolhos",MPT,4.91,20,180323
"União das freguesias de Mamouros, Alva e Ribolhos",PCP-PEV,3.44,14,180323
"União das freguesias de Mamouros, Alva e Ribolhos",PCTP/MRPP,1.47,6,180323
"União das freguesias de Mamouros, Alva e Ribolhos",PND,1.47,6,180323
"União das freguesias de Mamouros, Alva e Ribolhos",PNR,1.47,6,180323
"União das freguesias de Mamouros, Alva e Ribolhos",L,0.98,4,180323
"União das freguesias de Mamouros, Alva e Ribolhos",B.E.,0.74,3,180323
"União das freguesias de Mamouros, Alva e Ribolhos",MAS,0.74,3,180323
"União das freguesias de Mamouros, Alva e Ribolhos",PPM,0.74,3,180323
"União das freguesias de Mamouros, Alva e Ribolhos",PPV,0.49,2,180323
"União das freguesias de Mamouros, Alva e Ribolhos",PTP,0.49,2,180323
"União das freguesias de Mamouros, Alva e Ribolhos",PAN,0.25,1,180323
"União das freguesias de Mamouros, Alva e Ribolhos",PDA,0.25,1,180323
"União das freguesias de Mamouros, Alva e Ribolhos",POUS,0,0,180323
