freguesia,acronym,validVotesPercentage,votes,dicofre
União das freguesias de Gavião e Atalaia,PS,52.11,297,120906
União das freguesias de Gavião e Atalaia,PPD/PSD.CDS-PP,19.12,109,120906
União das freguesias de Gavião e Atalaia,PCP-PEV,12.11,69,120906
União das freguesias de Gavião e Atalaia,MPT,5.61,32,120906
União das freguesias de Gavião e Atalaia,B.E.,4.21,24,120906
União das freguesias de Gavião e Atalaia,PCTP/MRPP,1.93,11,120906
União das freguesias de Gavião e Atalaia,PAN,1.05,6,120906
União das freguesias de Gavião e Atalaia,L,0.88,5,120906
União das freguesias de Gavião e Atalaia,PPM,0.88,5,120906
União das freguesias de Gavião e Atalaia,MAS,0.7,4,120906
União das freguesias de Gavião e Atalaia,PND,0.35,2,120906
União das freguesias de Gavião e Atalaia,PNR,0.35,2,120906
União das freguesias de Gavião e Atalaia,PPV,0.35,2,120906
União das freguesias de Gavião e Atalaia,POUS,0.18,1,120906
União das freguesias de Gavião e Atalaia,PTP,0.18,1,120906
União das freguesias de Gavião e Atalaia,PDA,0,0,120906
