freguesia,acronym,validVotesPercentage,votes,dicofre
União das freguesias de Côja e Barril de Alva,PS,46.99,273,060121
União das freguesias de Côja e Barril de Alva,PPD/PSD.CDS-PP,29.43,171,060121
União das freguesias de Côja e Barril de Alva,MPT,7.57,44,060121
União das freguesias de Côja e Barril de Alva,PCP-PEV,5.34,31,060121
União das freguesias de Côja e Barril de Alva,B.E.,4.13,24,060121
União das freguesias de Côja e Barril de Alva,PAN,1.55,9,060121
União das freguesias de Côja e Barril de Alva,L,1.03,6,060121
União das freguesias de Côja e Barril de Alva,PCTP/MRPP,0.86,5,060121
União das freguesias de Côja e Barril de Alva,PNR,0.69,4,060121
União das freguesias de Côja e Barril de Alva,PND,0.52,3,060121
União das freguesias de Côja e Barril de Alva,MAS,0.34,2,060121
União das freguesias de Côja e Barril de Alva,PDA,0.34,2,060121
União das freguesias de Côja e Barril de Alva,POUS,0.34,2,060121
União das freguesias de Côja e Barril de Alva,PPM,0.34,2,060121
União das freguesias de Côja e Barril de Alva,PTP,0.34,2,060121
União das freguesias de Côja e Barril de Alva,PPV,0.17,1,060121
