freguesia,acronym,validVotesPercentage,votes,dicofre
Pêro Viseu,PS,44.67,134,050421
Pêro Viseu,PPD/PSD,21.33,64,050421
Pêro Viseu,B.E.,16,48,050421
Pêro Viseu,CH,3.33,10,050421
Pêro Viseu,CDS-PP,3,9,050421
Pêro Viseu,PAN,2.33,7,050421
Pêro Viseu,L,2,6,050421
Pêro Viseu,PCP-PEV,1.33,4,050421
Pêro Viseu,PCTP/MRPP,1.33,4,050421
Pêro Viseu,A,1,3,050421
Pêro Viseu,IL,0.67,2,050421
Pêro Viseu,PPM,0.67,2,050421
Pêro Viseu,PTP,0.67,2,050421
Pêro Viseu,R.I.R.,0.67,2,050421
Pêro Viseu,PDR,0.33,1,050421
Pêro Viseu,PNR,0.33,1,050421
Pêro Viseu,PURP,0.33,1,050421
Pêro Viseu,MPT,0,0,050421
