Objeto do Contrato,Tipo de Procedimento,Tipo(s) de Contrato,CPVs,Entidade(s) Adjudicante(s),Entidade(s) Adjudicatária(s),Preço Contratual,Data de Publicação,Data de Celebração do Contrato,Prazo de Execução,Local de Execução,Fundamentação,Data de Fecho do Contrato,Preço Total Efetivo,Causas das Alterações ao Prazo,Causas das Alterações ao Preço,Estado,N.º registo do Acordo Quadro,Descrição do Acordo Quadro,Procedimento Centralizado
"Prestação de Serviços Médicos, na Especialidade de Cardiologia, na ULSNA, EPE (Ano 2017)",Ajuste Direto Regime Geral,Aquisição de serviços,"85100000-0, Serviços de saúde","Unidade Local de Saúde do Norte Alentejano, E. P. E. (508094461)",Hamad Mahmoud Hamad (259822833),"190.173,60 €",21-02-2017,17-01-2017,365 dias,"Portugal, Portalegre, Portalegre","Artigo 24.º, n.º 1, alínea c) do Código dos Contratos Públicos",17-01-2017,"190.173,60 €",,,,Não aplicável.,Não aplicável.,FALSE
"Prestação de Serviços Médicos, na Especialidade de Psiquiatria, na ULSNA, EPE (Ano 2017)",Ajuste Direto Regime Geral,Aquisição de serviços,"85100000-0, Serviços de saúde","Unidade Local de Saúde do Norte Alentejano, E. P. E. (508094461)",Ofélia de Castro Maia Fernandes (245347127),"21.960,00 €",21-02-2017,02-01-2017,365 dias,"Portugal, Portalegre, Portalegre","Artigo 24.º, n.º 1, alínea c) do Código dos Contratos Públicos",02-01-2017,"21.960,00 €",,,,Não aplicável.,Não aplicável.,FALSE
"Prestação de Serviços Médicos, na Especialidade de Psiquiatria, na ULSNA, EPE (Ano 2017)",Ajuste Direto Regime Geral,Aquisição de serviços,"85100000-0, Serviços de saúde","Unidade Local de Saúde do Norte Alentejano, E. P. E. (508094461)",Maria Antónia Batista Pinto Bandeira Mateus Zamora (222411198),"34.560,00 €",21-02-2017,02-01-2017,365 dias,"Portugal, Portalegre, Portalegre","Artigo 24.º, n.º 1, alínea c) do Código dos Contratos Públicos",02-01-2017,"34.560,00 €",,,,Não aplicável.,Não aplicável.,FALSE
"Prestação de Serviços Médicos, na Especialidade de Radiologia, na ULSNA, EPE (Ano 2017)",Ajuste Direto Regime Geral,Aquisição de serviços,"85100000-0, Serviços de saúde","Unidade Local de Saúde do Norte Alentejano, E. P. E. (508094461)","Diagnóstico por Imagem Sagasta, SL (B06620696)","74.880,00 €",21-02-2017,14-12-2016,365 dias,"Portugal, Portalegre, Portalegre","Artigo 27.º, n.º 1, alínea a) do Código dos Contratos Públicos",14-12-2016,"74.880,00 €",,,,Não aplicável.,Não aplicável.,FALSE
"Prestação de Serviços Médicos, na Especialidade de Pedopsiquiatria, na ULSNA, EPE (Ano 2017)",Ajuste Direto Regime Geral,Aquisição de serviços,"85100000-0, Serviços de saúde","Unidade Local de Saúde do Norte Alentejano, E. P. E. (508094461)","Despacio Unipessoal, Lda (506580482)","9.360,00 €",21-02-2017,15-12-2016,365 dias,"Portugal, Portalegre, Portalegre","Artigo 27.º, n.º 1, alínea a) do Código dos Contratos Públicos",15-12-2016,"9.360,00 €",,,,Não aplicável.,Não aplicável.,FALSE
"Prestação de Serviços Médicos na Vmer, na ULSNA, EPE (Ano de 2017)",Ajuste Direto Regime Geral,Aquisição de serviços,"85100000-0, Serviços de saúde","Unidade Local de Saúde do Norte Alentejano, E. P. E. (508094461)",António Sávio da Gama (194488845),"31.200,00 €",21-02-2017,19-12-2016,365 dias,"Portugal, Portalegre, Portalegre","Artigo 24.º, n.º 1, alínea c) do Código dos Contratos Públicos",19-12-2016,"31.200,00 €",,,,Não aplicável.,Não aplicável.,FALSE
"Prestação de Serviços Médicos na Vmer, na ULSNA, EPE (Ano de 2017)",Ajuste Direto Regime Geral,Aquisição de serviços,"85100000-0, Serviços de saúde","Unidade Local de Saúde do Norte Alentejano, E. P. E. (508094461)",Maria Leonor Daniel Lopes Gomes (104994932),"15.600,00 €",21-02-2017,19-12-2016,365 dias,"Portugal, Portalegre, Portalegre","Artigo 24.º, n.º 1, alínea c) do Código dos Contratos Públicos",19-12-2016,"15.600,00 €",,,,Não aplicável.,Não aplicável.,FALSE
"Prestação de Serviços Médicos na Vmer, na ULSNA, EPE (Jan a Março de 2017)",Ajuste Direto Regime Geral,Aquisição de serviços,"85100000-0, Serviços de saúde","Unidade Local de Saúde do Norte Alentejano, E. P. E. (508094461)","GS24 - Helathcare Solutions, S.A (507824652)","13.727,16 €",21-02-2017,12-01-2017,90 dias,"Portugal, Portalegre, Portalegre","Artigo 24.º, n.º 1, alínea c) do Código dos Contratos Públicos",12-01-2017,"13.727,16 €",,,,Não aplicável.,Não aplicável.,FALSE
"Prestação de Serviços Médicos na UCI do HDJMG, na ULSNA, EPE (Jan a Março de 2017)",Ajuste Direto Regime Geral,Aquisição de serviços,"85100000-0, Serviços de saúde","Unidade Local de Saúde do Norte Alentejano, E. P. E. (508094461)","Intensivoesteto, Lda (509667120)","7.770,00 €",21-02-2017,03-01-2017,90 dias,"Portugal, Portalegre, Portalegre","Artigo 24.º, n.º 1, alínea c) do Código dos Contratos Públicos",03-01-2017,"7.770,00 €",,,,Não aplicável.,Não aplicável.,FALSE
"Prestação de Serviços Médicos na Especialidade de Ortopedia, na ULSNA, EPE (Jan a Abril de 2017)",Ajuste Direto Regime Geral,Aquisição de serviços,"85100000-0, Serviços de saúde","Unidade Local de Saúde do Norte Alentejano, E. P. E. (508094461)","José da Graça Temudo Mousinho, Lda (509135692)","45.044,15 €",21-02-2017,10-02-2017,120 dias,"Portugal, Portalegre, Portalegre","Artigo 24.º, n.º 1, alínea c) do Código dos Contratos Públicos",10-02-2017,"45.044,15 €",,,,Não aplicável.,Não aplicável.,FALSE
"Prestação de Serviços de Assistência Técnica e Aplicação de Materiais nas Centrais de Produção e Rede de Gases Medicinais da ULSNA, EPE, Ano 2017",Ajuste Direto Regime Geral,Aquisição de serviços,"50000000-5, Serviços de reparação e manutenção","Unidade Local de Saúde do Norte Alentejano, E. P. E. (508094461)","Air Liquide Medicinal, S.A. (501576436)","13.789,47 €",20-02-2017,14-12-2016,365 dias,"Portugal, Portalegre, Portalegre","Artigo 24.º, n.º 1, alínea e) do Código dos Contratos Públicos",14-12-2016,"13.789,47 €",,,,Não aplicável.,Não aplicável.,FALSE
"Prestação de Serviços de Reparação de Sondas do Hospital Dr. José Maria Grande, Portalegre",Ajuste Direto Regime Geral,Aquisição de serviços,"50000000-5, Serviços de reparação e manutenção","Unidade Local de Saúde do Norte Alentejano, E. P. E. (508094461)","General Electric Portuguesa, S.A (500357129)","8.610,00 €",20-02-2017,28-12-2016,30 dias,"Portugal, Portalegre, Portalegre","Artigo 20.º, n.º 1, alínea a) do Código dos Contratos Públicos",30-01-2017,"8.610,00 €",,,,Não aplicável.,Não aplicável.,FALSE
"Prestação de Serviços de Manutenção de 11 (onze) Elevadores da Unidade Local de Saúde do Norte Alentejano, EPE., Ano 2017",Ajuste Direto Regime Geral,Aquisição de serviços,"50000000-5, Serviços de reparação e manutenção","Unidade Local de Saúde do Norte Alentejano, E. P. E. (508094461)",Schindler (502353740),"9.900,00 €",20-02-2017,11-01-2017,365 dias,"Portugal, Portalegre, Portalegre","Artigo 20.º, n.º 1, alínea a) do Código dos Contratos Públicos",11-01-2017,"9.900,00 €",,,,Não aplicável.,Não aplicável.,FALSE
"Fornecimento de Sacos e Cintas de Plástico para a ULSNA, EPE - Ano 2017",Concurso público,Aquisição de bens móveis,"19500000-1, Materiais de plástico e de borracha","Unidade Local de Saúde do Norte Alentejano, E. P. E. (508094461)",PLASTICOLORES TRANSFORMACAO MATERIAS PLASTICAS (504183346),"45.648,00 €",17-02-2017,02-01-2017,365 dias,"Portugal, Portalegre","Artigo 20.º, n.º 1, alínea b) do Código dos Contratos Públicos",17-02-2017,"45.648,00 €",,,,Não aplicável.,Não aplicável.,FALSE
"Aquisição de Material de Consumo Hoteleiro e Limpeza, para a ULSNA, EPE - Ano 2017",Ajuste Direto Regime Geral,Aquisição de bens móveis,"33700000-7, Produtos para cuidados pessoais","Unidade Local de Saúde do N. Alentejano,EPE(ULSNA) (508094461)",MUC - MAT UTILIDADE CLIN. (502379308),"7.236,00 €",17-02-2017,11-01-2017,365 dias,"Portugal, Portalegre","Artigo 20.º, n.º 1, alínea a) do Código dos Contratos Públicos",17-02-2017,"7.236,00 €",,,,Não aplicável.,Não aplicável.,FALSE
"Aquisição de Material de Consumo Hoteleiro e Limpeza, para a ULSNA, EPE - Ano 2017",Ajuste Direto Regime Geral,Aquisição de bens móveis,"33700000-7, Produtos para cuidados pessoais","Unidade Local de Saúde do N. Alentejano,EPE(ULSNA) (508094461)",MEILEX LDA. (501759441),"7.009,20 €",17-02-2017,11-01-2017,365 dias,"Portugal, Portalegre","Artigo 20.º, n.º 1, alínea a) do Código dos Contratos Públicos",17-02-2017,"7.009,20 €",,,,Não aplicável.,Não aplicável.,FALSE
"Aquisição de Material de Consumo Hoteleiro e Limpeza, para a ULSNA, EPE - Ano 2017",Ajuste Direto Regime Geral,Aquisição de bens móveis,"33700000-7, Produtos para cuidados pessoais","Unidade Local de Saúde do N. Alentejano,EPE(ULSNA) (508094461)","Flex 2000 - Produtos Flexiveis, S.A. (504663232)","4.151,40 €",17-02-2017,11-01-2017,365 dias,"Portugal, Portalegre","Artigo 20.º, n.º 1, alínea a) do Código dos Contratos Públicos",17-02-2017,"4.151,40 €",,,,Não aplicável.,Não aplicável.,FALSE
"Aquisição de Material de Consumo Hoteleiro e Limpeza, para a ULSNA, EPE - Ano 2017",Ajuste Direto Regime Geral,Aquisição de bens móveis,"33700000-7, Produtos para cuidados pessoais","Unidade Local de Saúde do N. Alentejano,EPE(ULSNA) (508094461)",ANASTACIO SALDANHA UNIPESSOAL LDA. (505804441),"323,90 €",17-02-2017,11-01-2017,365 dias,"Portugal, Portalegre","Artigo 20.º, n.º 1, alínea a) do Código dos Contratos Públicos",17-02-2017,"323,90 €",,,,Não aplicável.,Não aplicável.,FALSE
"Aquisição de Material de Consumo Hoteleiro e Limpeza, para a ULSNA, EPE - Ano 2017",Ajuste Direto Regime Geral,Aquisição de bens móveis,"33700000-7, Produtos para cuidados pessoais","Unidade Local de Saúde do N. Alentejano,EPE(ULSNA) (508094461)",AVIQUIMICA PRODUCOES MANUFACTURAS (500039720),"259,00 €",17-02-2017,11-01-2017,365 dias,"Portugal, Portalegre","Artigo 20.º, n.º 1, alínea a) do Código dos Contratos Públicos",17-02-2017,"259,00 €",,,,Não aplicável.,Não aplicável.,FALSE
"Aquisição de Modelos e Impressos para a ULSNA, EPE - Ano 2017",Ajuste Direto Regime Geral,Aquisição de bens móveis,"22900000-9, Material impresso diverso","Unidade Local de Saúde do N. Alentejano,EPE(ULSNA) (508094461)","ENVELOPRINTER, LDA (508469830)","6.833,95 €",17-02-2017,02-01-2017,365 dias,"Portugal, Portalegre","Artigo 20.º, n.º 1, alínea a) do Código dos Contratos Públicos",17-02-2017,"6.833,95 €",,,,Não aplicável.,Não aplicável.,FALSE
"Aquisição de Consumíveis Informáticos para a ULSNA, EPE - Ano 2017",Ajuste Direto Regime Geral,Aquisição de bens móveis,"30200000-1, Equipamento e material informático","Unidade Local de Saúde do Norte Alentejano, E. P. E. (508094461)",NOVABIT (503411302),"5.239,56 €",17-02-2017,27-01-2017,395 dias,"Portugal, Portalegre","Artigo 20.º, n.º 1, alínea a) do Código dos Contratos Públicos",17-02-2017,"5.239,56 €",,,,Não aplicável.,Não aplicável.,FALSE
"Aquisição de Consumíveis Informáticos para a ULSNA, EPE - Ano 2017",Ajuste Direto Regime Geral,Aquisição de bens móveis,"30200000-1, Equipamento e material informático","Unidade Local de Saúde do Norte Alentejano, E. P. E. (508094461)",TopToner-Reciclagem e Comercialização de Consumive (504242644),"102,00 €",17-02-2017,27-01-2017,365 dias,"Portugal, Portalegre","Artigo 20.º, n.º 1, alínea a) do Código dos Contratos Públicos",17-02-2017,"102,00 €",,,,Não aplicável.,Não aplicável.,FALSE
"Prestação de Serviços Médicos na UCI, na ULSNA, EPE (Janeiro a Março de 2017)",Ajuste Direto Regime Geral,Aquisição de serviços,"85100000-0, Serviços de saúde","Unidade Local de Saúde do Norte Alentejano, E. P. E. (508094461)","Begin Future, Lda (508738300)","5.040,00 €",17-02-2017,03-01-2017,90 dias,"Portugal, Portalegre, Portalegre","Artigo 24.º, n.º 1, alínea c) do Código dos Contratos Públicos",03-01-2017,"5.040,00 €",,,,Não aplicável.,Não aplicável.,FALSE
"Aquisição de Etiquetas P/Impressora para a ULSNA, EPE - Ano 2017",Ajuste Direto Regime Geral,Aquisição de bens móveis,"30192800-9, Etiquetas autocolantes","Unidade Local de Saúde do N. Alentejano,EPE(ULSNA) (508094461)",ZETES BUROTICA SA (501178503),"349,00 €",17-02-2017,10-01-2017,395 dias,"Portugal, Portalegre","Artigo 20.º, n.º 1, alínea a) do Código dos Contratos Públicos",17-02-2017,"349,00 €",,,,Não aplicável.,Não aplicável.,FALSE
"Aquisição de Etiquetas P/Impressora para a ULSNA, EPE - Ano 2017",Ajuste Direto Regime Geral,Aquisição de bens móveis,"30192800-9, Etiquetas autocolantes","Unidade Local de Saúde do N. Alentejano,EPE(ULSNA) (508094461)",Olmar - Artigos de Papelaria Lda. (508831989),"1.771,25 €",17-02-2017,10-01-2017,365 dias,"Portugal, Portalegre","Artigo 20.º, n.º 1, alínea a) do Código dos Contratos Públicos",17-02-2017,"1.771,25 €",,,,Não aplicável.,Não aplicável.,FALSE
"Aquisição de Etiquetas P/Impressora para a ULSNA, EPE - Ano 2017",Ajuste Direto Regime Geral,Aquisição de bens móveis,"30192800-9, Etiquetas autocolantes","Unidade Local de Saúde do N. Alentejano,EPE(ULSNA) (508094461)",Marcos de Azevedo Dias (108701476),"235,88 €",17-02-2017,10-01-2017,365 dias,"Portugal, Portalegre","Artigo 20.º, n.º 1, alínea a) do Código dos Contratos Públicos",17-02-2017,"235,88 €",,,,Não aplicável.,Não aplicável.,FALSE
"Prestação de Serviços Médicos na UCI, na ULSNA, EPE (Janeiro a Março de 2017)",Ajuste Direto Regime Geral,Aquisição de serviços,"85100000-0, Serviços de saúde","Unidade Local de Saúde do Norte Alentejano, E. P. E. (508094461)","Honorismédica, Lda (509799191)","10.920,00 €",17-02-2017,12-01-2017,90 dias,"Portugal, Portalegre, Portalegre","Artigo 24.º, n.º 1, alínea c) do Código dos Contratos Públicos",12-01-2017,"10.920,00 €",,,,Não aplicável.,Não aplicável.,FALSE
"Prestação de Serviços Médicos na UCI, na ULSNA, EPE (Janeiro a Março de 2017)",Ajuste Direto Regime Geral,Aquisição de serviços,"85100000-0, Serviços de saúde","Unidade Local de Saúde do Norte Alentejano, E. P. E. (508094461)","Jorge Vila, Lda (504227190)","29.190,00 €",17-02-2017,12-01-2017,90 dias,"Portugal, Portalegre, Portalegre","Artigo 24.º, n.º 1, alínea c) do Código dos Contratos Públicos",12-01-2017,"29.190,00 €",,,,Não aplicável.,Não aplicável.,FALSE
"Aquisição de Etiquetas P/Impressora para a ULSNA, EPE - Ano 2017",Ajuste Direto Regime Geral,Aquisição de bens móveis,"30190000-7, Equipamento e material de escritório diverso","Unidade Local de Saúde do N. Alentejano,EPE(ULSNA) (508094461)",DATA LABEL PORTUGAL (506448967),"3.328,68 €",17-02-2017,10-01-2017,365 dias,"Portugal, Portalegre","Artigo 20.º, n.º 1, alínea a) do Código dos Contratos Públicos",17-02-2017,"3.328,68 €",,,,Não aplicável.,Não aplicável.,FALSE
"Prestação de Serviços Médicos na UCI, na ULSNA, EPE (Ano 2017)",Ajuste Direto Regime Geral,Aquisição de serviços,"85100000-0, Serviços de saúde","Unidade Local de Saúde do Norte Alentejano, E. P. E. (508094461)",Pablo Nieto Sanchez (266855911),"62.640,00 €",17-02-2017,20-12-2016,365 dias,"Portugal, Portalegre, Portalegre","Artigo 21.º, n.º 1, alínea a) do Código dos Contratos Públicos",20-12-2016,"62.640,00 €",,,,Não aplicável.,Não aplicável.,FALSE
"Prestação de Serviços Médicos na Especialidade de Medicina no Trabalho, na ULSNA, EPE (Ano 2017)",Ajuste Direto Regime Geral,Aquisição de serviços,"85100000-0, Serviços de saúde","Unidade Local de Saúde do Norte Alentejano, E. P. E. (508094461)","Ponlufi - Prestação e Gestão de serviços Médico, Lda (502465000)","54.558,00 €",17-02-2017,12-01-2017,365 dias,"Portugal, Portalegre, Portalegre","Artigo 27.º, n.º 1, alínea a) do Código dos Contratos Públicos",12-01-2017,"54.558,00 €",,,,Não aplicável.,Não aplicável.,FALSE
"Prestação de Serviços Médicos na Especialidade de Gastroenterologia, na ULSNA, EPE (Ano 2017)",Ajuste Direto Regime Geral,Aquisição de serviços,"85100000-0, Serviços de saúde","Unidade Local de Saúde do Norte Alentejano, E. P. E. (508094461)",Rogério Godinho (176874070),"28.920,00 €",17-02-2017,02-01-2017,365 dias,"Portugal, Portalegre, Elvas","Artigo 21.º, n.º 1, alínea a) do Código dos Contratos Públicos",02-01-2017,"28.920,00 €",,,,Não aplicável.,Não aplicável.,FALSE
"Prestação de Serviços Médicos na Especialidade de Gastroenterologia, na ULSNA, EPE (Ano 2017)",Ajuste Direto Regime Geral,Aquisição de serviços,"85100000-0, Serviços de saúde","Unidade Local de Saúde do Norte Alentejano, E. P. E. (508094461)","Clinalbi, Lda (508272912)","91.784,00 €",17-02-2017,10-01-2017,365 dias,"Portugal, Portalegre, Portalegre","Artigo 27.º, n.º 1, alínea a) do Código dos Contratos Públicos",10-01-2017,"91.784,00 €",,,,Não aplicável.,Não aplicável.,FALSE
"Prestação de Serviços Médicos na Triagem Pediátrica do HDJMG, na ULSNA, EPE (Ano 2017)",Ajuste Direto Regime Geral,Aquisição de serviços,"85100000-0, Serviços de saúde","Unidade Local de Saúde do Norte Alentejano, E. P. E. (508094461)","Zamudio, Ariza e Gonalez, Lda (513071229)","146.000,00 €",17-02-2017,14-12-2016,365 dias,"Portugal, Portalegre, Portalegre","Artigo 27.º, n.º 1, alínea a) do Código dos Contratos Públicos",14-12-2016,"146.000,00 €",,,,Não aplicável.,Não aplicável.,FALSE
"Prestação de Serviços Médicos no Centro de Saúde de Montargil, na ULSNA, EPE (Ano 2017)",Ajuste Direto Regime Geral,Aquisição de serviços,"85100000-0, Serviços de saúde","Unidade Local de Saúde do Norte Alentejano, E. P. E. (508094461)","Corevalue Healthcare Solutions, Lda (513654577)","37.447,20 €",17-02-2017,09-12-2016,365 dias,"Portugal, Portalegre, Ponte de Sor","Artigo 27.º, n.º 1, alínea a) do Código dos Contratos Públicos",09-12-2016,"37.447,20 €",,,,Não aplicável.,Não aplicável.,FALSE
Prestação de Serviços Médicos no Centro de Saúde de Ponte de Sôr (Ano de 2017),Ajuste Direto Regime Geral,Aquisição de serviços,"85100000-0, Serviços de saúde","Unidade Local de Saúde do Norte Alentejano, E. P. E. (508094461)","Honorismédica, Lda (509799191)","111.636,00 €",16-02-2017,14-12-2016,365 dias,"Portugal, Portalegre, Ponte de Sor","Artigo 27.º, n.º 1, alínea a) do Código dos Contratos Públicos",14-12-2016,"111.636,00 €",,,,Não aplicável.,Não aplicável.,FALSE
"Prestação de Serviços Médicos, na Especialidade de Pediatria, na ULSNA, EPE (Janeiro a Março de 2017)",Ajuste Direto Regime Geral,Aquisição de serviços,"85100000-0, Serviços de saúde","Unidade Local de Saúde do Norte Alentejano, E. P. E. (508094461)","Clinica Pediátrica Muñoz Rodriguez, S.L (B06711220)","18.720,00 €",16-02-2017,08-02-2017,90 dias,"Portugal, Portalegre, Portalegre","Artigo 24.º, n.º 1, alínea c) do Código dos Contratos Públicos",08-02-2017,"18.720,00 €",,,,Não aplicável.,Não aplicável.,FALSE
"Prestação de Serviços Médicos, na Especialidade de Pediatria, na ULSNA, EPE (Janeiro a Março de 2017)",Ajuste Direto Regime Geral,Aquisição de serviços,"85100000-0, Serviços de saúde","Unidade Local de Saúde do Norte Alentejano, E. P. E. (508094461)","Consultório de Pediatria Eugénia Capela, Lda (504212842)","24.960,00 €",16-02-2017,08-02-2017,90 dias,"Portugal, Portalegre, Portalegre","Artigo 24.º, n.º 1, alínea c) do Código dos Contratos Públicos",08-02-2017,"24.960,00 €",,,,Não aplicável.,Não aplicável.,FALSE
"Prestação de Serviços Médicos, na Especialidade de Medicina Interna, na ULSNA, EPE (Janeiro a Março de 2017)",Ajuste Direto Regime Geral,Aquisição de serviços,"85100000-0, Serviços de saúde","Unidade Local de Saúde do Norte Alentejano, E. P. E. (508094461)","honorismédica, Lda (509799191)","69.498,00 €",16-02-2017,20-12-2016,90 dias,"Portugal, Portalegre, Portalegre","Artigo 24.º, n.º 1, alínea c) do Código dos Contratos Públicos",20-12-2016,"69.498,00 €",,,,Não aplicável.,Não aplicável.,FALSE
"Prestação de Serviços Médicos, na Especialidade de Anestesiologia, na ULSNA, EPE (Janeiro a Março de 2017)",Ajuste Direto Regime Geral,Aquisição de serviços,"85100000-0, Serviços de saúde","Unidade Local de Saúde do Norte Alentejano, E. P. E. (508094461)","Ciclipolis, Serviços Médicos, Lda (508320526)","149.655,00 €",16-02-2017,12-01-2017,90 dias,"Portugal, Portalegre, Portalegre","Artigo 24.º, n.º 1, alínea c) do Código dos Contratos Públicos",12-01-2017,"149.655,00 €",,,,Não aplicável.,Não aplicável.,FALSE
"PRESTAÇÃO DE SERVIÇOS DE SEGURO DE ACIDENTES DE TRABALHO, ANO 2017",Ajuste Direto Regime Geral,Aquisição de serviços,"66000000-0, Serviços de finanças e seguros","Unidade Local de Saúde do Norte Alentejano, E. P. E. (508094461)",COMPANHIA DE SEGUROS TRANQUILIDADE (500940231),"166.910,10 €",13-02-2017,28-12-2016,365 dias,"Portugal, Portalegre, Portalegre","Artigo 26.º, n.º 1, alínea a) do Código dos Contratos Públicos",28-12-2016,"166.910,10 €",,,,Não aplicável.,Não aplicável.,FALSE
"PRESTAÇÃO DE SERVIÇOS DE SEGURO AUTOMOVEL, ANO 2017",Ajuste Direto Regime Geral,Aquisição de serviços,"66000000-0, Serviços de finanças e seguros","Unidade Local de Saúde do Norte Alentejano, E. P. E. (508094461)",FIDELIDADE MUNDIAL - SEGUROS (500918880),"8.549,29 €",13-02-2017,19-12-2016,365 dias,"Portugal, Portalegre, Portalegre","Artigo 27.º, n.º 1, alínea a) do Código dos Contratos Públicos",19-12-2016,"8.549,29 €",,,,Não aplicável.,Não aplicável.,FALSE
