Objeto do Contrato,Tipo de Procedimento,Tipo(s) de Contrato,CPVs,Entidade(s) Adjudicante(s),Entidade(s) Adjudicatária(s),Preço Contratual,Data de Publicação,Data de Celebração do Contrato,Prazo de Execução,Local de Execução,Fundamentação,Data de Fecho do Contrato,Preço Total Efetivo,Causas das Alterações ao Prazo,Causas das Alterações ao Preço,Estado,N.º registo do Acordo Quadro,Descrição do Acordo Quadro,Procedimento Centralizado
Aquisição de serviços para manutenção da rede informática da DGS - bolsa de horas fixa e bolsa de horas variável,Ajuste Direto Regime Geral,Aquisição de serviços,"72500000-0, Serviços relacionados com a informática",Direcção-Geral da Saúde (600037100),"Winteam-Sistemas de Engenharia, Lda. (505150417)","13.247,52 €",30-05-2012,21-05-2012,365 dias,"Portugal, Lisboa, Lisboa","Artigo 20.º, n.º 1, alínea a) do Código dos Contratos Públicos",31-05-2013,"13.247,52 €",,,,Não aplicável.,Não aplicável.,
Aquisição de serviços para a plataforma informática de inquéritos de 2011 referente à <br/>Campanha Nacional de Higiene das Mãos,Ajuste Direto Regime Geral,Aquisição de serviços,"72540000-2, Serviços de actualização informática",Direcção-Geral da Saúde (600037100),ByValue-Sistemas de Informação Lda. (508124948),"8.700,00 €",30-05-2012,24-05-2012,365 dias,Portugal,"Artigo 20.º, n.º 1, alínea a) do Código dos Contratos Públicos",21-06-2012,"8.700,00 €",,,,Não aplicável.,Não aplicável.,
Aquisição de serviços de consultoria e investigação para apoiar a DGS na monitorização e avaliação do RFE (Regime da Fruta Escolar),Ajuste Direto Regime Geral,Aquisição de serviços,"73210000-7, Serviços de consultoria em matéria de investigação",Direcção-Geral da Saúde (600037100),Faculdade de Ciências da Nutrição e Alimentação da Universidade do Porto (501413197),"36.800,00 €",29-05-2012,03-05-2012,141 dias,Portugal,"Artigo 27.º, n.º 1, alínea b) do Código dos Contratos Públicos",28-05-2012,"36.800,00 €",,,,Não aplicável.,Não aplicável.,
"Aquisição de serviços de tecnologia de informação e comunicação (TIC) para a realização do inquérito, administração e análise da informação ao Estudo Nacional de Prevalência das Doenças Orais",Ajuste Direto Regime Geral,Aquisição de serviços,"72222300-0, Serviços relacionados com as tecnologias da informação",Direcção-Geral da Saúde (600037100),"iUZ Technologies, Ldª (507976460)","32.400,00 €",28-05-2012,17-11-2011,126 dias,"Portugal, Lisboa, Lisboa","Artigo 20.º, n.º 1, alínea a) do Código dos Contratos Públicos",24-05-2012,"32.400,00 €",,,,Não aplicável.,Não aplicável.,
