freguesia,acronym,validVotesPercentage,votes,dicofre
Montalvão,PS,46.38,64,121205
Montalvão,PCP-PEV,28.99,40,121205
Montalvão,PPD/PSD.CDS-PP,15.22,21,121205
Montalvão,PCTP/MRPP,2.9,4,121205
Montalvão,B.E.,1.45,2,121205
Montalvão,L,1.45,2,121205
Montalvão,PND,1.45,2,121205
Montalvão,MPT,0.72,1,121205
Montalvão,PAN,0.72,1,121205
Montalvão,PNR,0.72,1,121205
Montalvão,MAS,0,0,121205
Montalvão,PDA,0,0,121205
Montalvão,POUS,0,0,121205
Montalvão,PPM,0,0,121205
Montalvão,PPV,0,0,121205
Montalvão,PTP,0,0,121205
