freguesia,acronym,validVotesPercentage,votes,dicofre
"União das freguesias de Margaride (Santa Eulália), Várzea, Lagares, Varziela e Moure",PS,40.53,3548,130335
"União das freguesias de Margaride (Santa Eulália), Várzea, Lagares, Varziela e Moure",PPD/PSD,35.84,3138,130335
"União das freguesias de Margaride (Santa Eulália), Várzea, Lagares, Varziela e Moure",B.E.,8.53,747,130335
"União das freguesias de Margaride (Santa Eulália), Várzea, Lagares, Varziela e Moure",PCP-PEV,3.26,285,130335
"União das freguesias de Margaride (Santa Eulália), Várzea, Lagares, Varziela e Moure",CDS-PP,3.1,271,130335
"União das freguesias de Margaride (Santa Eulália), Várzea, Lagares, Varziela e Moure",PAN,2.67,234,130335
"União das freguesias de Margaride (Santa Eulália), Várzea, Lagares, Varziela e Moure",R.I.R.,1.13,99,130335
"União das freguesias de Margaride (Santa Eulália), Várzea, Lagares, Varziela e Moure",IL,0.97,85,130335
"União das freguesias de Margaride (Santa Eulália), Várzea, Lagares, Varziela e Moure",L,0.81,71,130335
"União das freguesias de Margaride (Santa Eulália), Várzea, Lagares, Varziela e Moure",PCTP/MRPP,0.67,59,130335
"União das freguesias de Margaride (Santa Eulália), Várzea, Lagares, Varziela e Moure",CH,0.62,54,130335
"União das freguesias de Margaride (Santa Eulália), Várzea, Lagares, Varziela e Moure",A,0.5,44,130335
"União das freguesias de Margaride (Santa Eulália), Várzea, Lagares, Varziela e Moure",PURP,0.26,23,130335
"União das freguesias de Margaride (Santa Eulália), Várzea, Lagares, Varziela e Moure",PTP,0.25,22,130335
"União das freguesias de Margaride (Santa Eulália), Várzea, Lagares, Varziela e Moure",MPT,0.19,17,130335
"União das freguesias de Margaride (Santa Eulália), Várzea, Lagares, Varziela e Moure",PNR,0.17,15,130335
"União das freguesias de Margaride (Santa Eulália), Várzea, Lagares, Varziela e Moure",NC,0.16,14,130335
"União das freguesias de Margaride (Santa Eulália), Várzea, Lagares, Varziela e Moure",JPP,0.11,10,130335
"União das freguesias de Margaride (Santa Eulália), Várzea, Lagares, Varziela e Moure",MAS,0.08,7,130335
"União das freguesias de Margaride (Santa Eulália), Várzea, Lagares, Varziela e Moure",PDR,0.07,6,130335
"União das freguesias de Margaride (Santa Eulália), Várzea, Lagares, Varziela e Moure",PPM,0.07,6,130335
