freguesia,acronym,validVotesPercentage,votes,dicofre
Balugães,PPD/PSD.CDS-PP,42.5,136,030212
Balugães,PS,31.87,102,030212
Balugães,MPT,8.13,26,030212
Balugães,PCP-PEV,5.31,17,030212
Balugães,B.E.,4.06,13,030212
Balugães,PAN,1.56,5,030212
Balugães,MAS,1.25,4,030212
Balugães,PCTP/MRPP,1.25,4,030212
Balugães,PPV,1.25,4,030212
Balugães,L,0.94,3,030212
Balugães,PPM,0.94,3,030212
Balugães,POUS,0.63,2,030212
Balugães,PND,0.31,1,030212
Balugães,PDA,0,0,030212
Balugães,PNR,0,0,030212
Balugães,PTP,0,0,030212
