Objeto do Contrato,Tipo de Procedimento,Tipo(s) de Contrato,CPVs,Entidade(s) Adjudicante(s),Entidade(s) Adjudicatária(s),Preço Contratual,Data de Publicação,Data de Celebração do Contrato,Prazo de Execução,Local de Execução,Fundamentação,Data de Fecho do Contrato,Preço Total Efetivo,Causas das Alterações ao Prazo,Causas das Alterações ao Preço,Estado,N.º registo do Acordo Quadro,Descrição do Acordo Quadro,Procedimento Centralizado
"Dispositivos p/ encerramento da artéria femoral, lotes desertos dos concursos 1-2.0046/17 e 1-2.0083/17 p/ 2017",Ajuste Direto Regime Geral,Aquisição de bens móveis,"33140000-3, Material médico de consumo","Centro Hospitalar de Lisboa Central, E.P.E. (CHLC) (508080142)","J. M. FARMACÊUTICA, LDA (503550558)","55.675,00 €",11-04-2017,30-03-2017,264 dias,"Portugal, Lisboa, Lisboa","Artigo 20.º, n.º 1, alínea a) do Código dos Contratos Públicos",,,,,,Não aplicável.,Não aplicável.,FALSE
Serras e Brocas para Craniotomia,Ajuste Direto Regime Geral,Aquisição de bens móveis,"33100000-1, Equipamento médico","Centro Hospitalar de Lisboa Central, E. P. E. (508080142)","MEDTRONIC PORTUGAL, LDA (504223933)","27.361,10 €",11-04-2017,03-04-2017,264 dias,"Portugal, Lisboa, Lisboa","Artigo 20.º, n.º 1, alínea a) do Código dos Contratos Públicos",,,,,,Não aplicável.,Não aplicável.,FALSE
1-2.0109/17 - Colas Sintéticas e Colas Cirurgicas,Concurso público,Aquisição de bens móveis,"33140000-3, Material médico de consumo","Centro Hospitalar de Lisboa Central, E. P. E. (508080142)","Lusopalex, Lda (503531588)","110.356,45 €",11-04-2017,30-03-2017,276 dias,"Portugal, Lisboa, Lisboa","Artigo 20.º, n.º 1, alínea b) do Código dos Contratos Públicos",,,,,,Não aplicável.,Não aplicável.,FALSE
"Bosentano 62,5mg comp",Ajuste Direto Regime Geral,Aquisição de bens móveis,"33000000-0, Equipamento médico, medicamentos e produtos para cuidados pessoais","Centro Hospitalar de Lisboa Central, E. P. E. (508080142)",Actelion  (507336488),"28.851,20 €",11-04-2017,06-04-2017,30 dias,"Portugal, Lisboa, Lisboa","Artigo 24.º, n.º 1, alínea c) do Código dos Contratos Públicos",,,,,,Não aplicável.,Não aplicável.,FALSE
"Aquisição de Bosentano 32 e 62,5mg comp",Ajuste Direto Regime Geral,Aquisição de bens móveis,"33000000-0, Equipamento médico, medicamentos e produtos para cuidados pessoais","Centro Hospitalar de Lisboa Central, E. P. E. (508080142)",Actelion Pharmaceuticals (507336488),"32.658,08 €",11-04-2017,19-01-2017,30 dias,"Portugal, Lisboa, Lisboa","Artigo 24.º, n.º 1, alínea c) do Código dos Contratos Públicos",,,,,,Não aplicável.,Não aplicável.,FALSE
"Prestação de Serviços de lavagem e tratamento de roupa hospitalar e dos fardamentos dos profissionais do CHLC, EPE ",Concurso público,Aquisição de serviços,"98311000-6, Serviços de recolha de roupa por lavandarias","Centro Hospitalar de Lisboa Central, E. P. E. (508080142)","LRH - Lavandaria Roupa Hospitalar, Lda (514051990)","160.718,20 €",11-04-2017,27-02-2017,306 dias,"Portugal, Lisboa, Lisboa","Artigo 20.º, n.º 1, alínea b) do Código dos Contratos Públicos",,,,,,Não aplicável.,Não aplicável.,FALSE
Aquisição de Fatores VIII e IX da Coagulação Humana,Ajuste Direto Regime Geral,Aquisição de bens móveis,"33000000-0, Equipamento médico, medicamentos e produtos para cuidados pessoais","Centro Hospitalar de Lisboa Central, E. P. E. (508080142)",Octapharma produtos  farmacêuticos Lda (502820780),"146.045,00 €",11-04-2017,06-04-2017,30 dias,"Portugal, Lisboa, Lisboa","Artigo 24.º, n.º 1, alínea c) do Código dos Contratos Públicos",,,,,,Não aplicável.,Não aplicável.,FALSE
"Prestação de Serviços de lavagem e tratamento de roupa hospitalar e dos fardamentos dos profissionais do CHLC, EPE ",Concurso público,Aquisição de serviços,"98311000-6, Serviços de recolha de roupa por lavandarias","Centro Hospitalar de Lisboa Central, E. P. E. (508080142)","LRH - Lavandaria Roupa Hospitalar, Lda (514051990)","86.217,60 €",11-04-2017,27-02-2017,306 dias,"Portugal, Lisboa, Lisboa","Artigo 20.º, n.º 1, alínea b) do Código dos Contratos Públicos",,,,,,Não aplicável.,Não aplicável.,FALSE
"Prestação de Serviços de lavagem e tratamento de roupa hospitalar e dos fardamentos dos profissionais do CHLC, EPE",Concurso público,Aquisição de serviços,"98311000-6, Serviços de recolha de roupa por lavandarias","Centro Hospitalar de Lisboa Central, E. P. E. (508080142)","LRH - Lavandaria Roupa Hospitalar, Lda (514051990)","168.645,30 €",11-04-2017,27-02-2017,306 dias,"Portugal, Lisboa, Lisboa","Artigo 20.º, n.º 1, alínea b) do Código dos Contratos Públicos",,,,,,Não aplicável.,Não aplicável.,FALSE
"Prestação de Serviços de lavagem e tratamento de roupa hospitalar e dos fardamentos dos profissionais do CHLC, EPE ",Concurso público,Aquisição de serviços,"98311000-6, Serviços de recolha de roupa por lavandarias","Centro Hospitalar de Lisboa Central, E. P. E. (508080142)","LRH - Lavandaria Roupa Hospitalar, Lda (514051990)","125.235,50 €",11-04-2017,27-02-2017,306 dias,"Portugal, Lisboa, Lisboa","Artigo 20.º, n.º 1, alínea b) do Código dos Contratos Públicos",,,,,,Não aplicável.,Não aplicável.,FALSE
"Prestação de Serviços de lavagem e tratamento de roupa hospitalar e dos fardamentos dos profissionais do CHLC, EPE",Concurso público,Aquisição de serviços,"98311000-6, Serviços de recolha de roupa por lavandarias","Centro Hospitalar de Lisboa Central, E. P. E. (508080142)","LRH - Lavandaria Roupa Hospitalar, Lda (514051990)","333.645,80 €",11-04-2017,27-02-2017,306 dias,"Portugal, Lisboa, Lisboa","Artigo 20.º, n.º 1, alínea b) do Código dos Contratos Públicos",,,,,,Não aplicável.,Não aplicável.,FALSE
4-2.0469/17 - Material para Polissonografia p/2017,Ajuste Direto Regime Geral,Aquisição de bens móveis,"33140000-3, Material médico de consumo","Centro Hospitalar de Lisboa Central, E. P. E. (508080142)"," Air Liquide Medicinal, S.A (501576436)","2.000,00 €",11-04-2017,11-04-2017,264 dias,"Portugal, Lisboa, Lisboa","Artigo 20.º, n.º 1, alínea a) do Código dos Contratos Públicos",,,,,,Não aplicável.,Não aplicável.,FALSE
Stents intracraneanos e kits trombectomia,Concurso público,Aquisição de bens móveis,"33000000-0, Equipamento médico, medicamentos e produtos para cuidados pessoais","Centro Hospitalar de Lisboa Central, E. P. E. (508080142)",Terumo Europe España (980472024),"30.000,00 €",10-04-2017,13-03-2017,230 dias,"Portugal, Lisboa, Lisboa","Artigo 20.º, n.º 1, alínea b) do Código dos Contratos Públicos",,,,,,Não aplicável.,Não aplicável.,FALSE
Stents intracraneanos e kits trombectomia,Concurso público,Aquisição de bens móveis,"33000000-0, Equipamento médico, medicamentos e produtos para cuidados pessoais","Centro Hospitalar de Lisboa Central, E. P. E. (508080142)",Penumbra (DE815054796),"701.480,00 €",10-04-2017,15-03-2017,230 dias,"Portugal, Lisboa, Lisboa","Artigo 20.º, n.º 1, alínea b) do Código dos Contratos Públicos",,,,,,Não aplicável.,Não aplicável.,FALSE
Stents intracraneanos e kits trombectomia,Concurso público,Aquisição de bens móveis,"33000000-0, Equipamento médico, medicamentos e produtos para cuidados pessoais","Centro Hospitalar de Lisboa Central, E. P. E. (508080142)",Medtronic Portugal (504223933),"205.700,00 €",10-04-2017,20-03-2017,230 dias,"Portugal, Lisboa, Lisboa","Artigo 20.º, n.º 1, alínea b) do Código dos Contratos Públicos",,,,,,Não aplicável.,Não aplicável.,FALSE
Stents intracraneanos e kits de trombectomia,Concurso público,Aquisição de bens móveis,"33000000-0, Equipamento médico, medicamentos e produtos para cuidados pessoais","Centro Hospitalar de Lisboa Central, E. P. E. (508080142)",Medicinália-Cormédica (500684324),"259.030,00 €",10-04-2017,20-03-2017,230 dias,"Portugal, Lisboa, Lisboa","Artigo 20.º, n.º 1, alínea b) do Código dos Contratos Públicos",,,,,,Não aplicável.,Não aplicável.,FALSE
Stents intracraneanos e kits de trombectomia,Concurso público,Aquisição de bens móveis,"33184100-4, Implantes cirúrgicos","Centro Hospitalar de Lisboa Central, E. P. E. (508080142)",Johnson & Johnson Medical (500153370),"94.470,00 €",10-04-2017,13-03-2017,230 dias,"Portugal, Lisboa, Lisboa","Artigo 20.º, n.º 1, alínea b) do Código dos Contratos Públicos",,,,,,Não aplicável.,Não aplicável.,FALSE
Stents intracranianos e kits trobectomia,Concurso público,Aquisição de bens móveis,"33000000-0, Equipamento médico, medicamentos e produtos para cuidados pessoais","Centro Hospitalar de Lisboa Central, E. P. E. (508080142)",Dermis (507988990),"20.700,00 €",10-04-2017,22-03-2017,230 dias,"Portugal, Lisboa, Lisboa","Artigo 20.º, n.º 1, alínea b) do Código dos Contratos Públicos",,,,,,Não aplicável.,Não aplicável.,FALSE
Stents intracraneanos e kits de trombectomia,Concurso público,Aquisição de bens móveis,"33000000-0, Equipamento médico, medicamentos e produtos para cuidados pessoais","Centro Hospitalar de Lisboa Central, E. P. E. (508080142)",Cateter (502914319),"143.100,00 €",10-04-2017,13-03-2017,230 dias,"Portugal, Lisboa, Lisboa","Artigo 20.º, n.º 1, alínea b) do Código dos Contratos Públicos",,,,,,Não aplicável.,Não aplicável.,FALSE
Stents intracranianos e kits trombectomia,Concurso público,Aquisição de bens móveis,"33184100-4, Implantes cirúrgicos","Centro Hospitalar de Lisboa Central, E. P. E. (508080142)",Biomédica (501745459),"204.500,00 €",10-04-2017,22-03-2017,230 dias,"Portugal, Lisboa, Lisboa","Artigo 20.º, n.º 1, alínea b) do Código dos Contratos Públicos",,,,,,Não aplicável.,Não aplicável.,FALSE
Cateteres forgaty,Ajuste Direto Regime Geral,Aquisição de bens móveis,"33140000-3, Material médico de consumo","Centro Hospitalar de Lisboa Central, E.P.E. (CHLC) (508080142)","Medinfar, SA             (501197052)","41.085,00 €",07-04-2017,23-02-2017,309 dias,"Portugal, Lisboa, Lisboa","Artigo 20.º, n.º 1, alínea a) do Código dos Contratos Públicos",,,,,,Não aplicável.,Não aplicável.,FALSE
Sacos para aspirador de secreções,Ajuste Direto Regime Geral,Aquisição de bens móveis,"33100000-1, Equipamento médico","Centro Hospitalar de Lisboa Central, E.P.E. (CHLC) (508080142)",PMH PRODUTOS MEDICO HOSPITALARES SA                (502376899),"24.017,00 €",07-04-2017,20-03-2017,90 dias,"Portugal, Lisboa, Lisboa","Artigo 20.º, n.º 1, alínea a) do Código dos Contratos Públicos",,,,,,Não aplicável.,Não aplicável.,FALSE
4-2.0449/17 - Slings Sintéticos p/Incontinência Urinária da Mulher,Ajuste Direto Regime Geral,Aquisição de bens móveis,"33140000-3, Material médico de consumo","Centro Hospitalar de Lisboa Central, E.P.E. (CHLC) (508080142)","ENDOTÉCNICA, LDA. (503818348)","21.320,00 €",06-04-2017,13-03-2017,293 dias,"Portugal, Lisboa, Lisboa","Artigo 20.º, n.º 1, alínea a) do Código dos Contratos Públicos",,,,,,Não aplicável.,Não aplicável.,FALSE
