freguesia,acronym,validVotesPercentage,votes,dicofre
Castelões,PS,44.74,476,031210
Castelões,PPD/PSD,32.71,348,031210
Castelões,B.E.,9.3,99,031210
Castelões,PAN,3.2,34,031210
Castelões,CDS-PP,2.73,29,031210
Castelões,PCP-PEV,2.73,29,031210
Castelões,L,0.94,10,031210
Castelões,R.I.R.,0.94,10,031210
Castelões,IL,0.47,5,031210
Castelões,CH,0.38,4,031210
Castelões,PCTP/MRPP,0.38,4,031210
Castelões,A,0.28,3,031210
Castelões,MPT,0.28,3,031210
Castelões,PDR,0.28,3,031210
Castelões,NC,0.19,2,031210
Castelões,MAS,0.09,1,031210
Castelões,PNR,0.09,1,031210
Castelões,PPM,0.09,1,031210
Castelões,PTP,0.09,1,031210
Castelões,PURP,0.09,1,031210
Castelões,JPP,0,0,031210
