freguesia,acronym,validVotesPercentage,votes,dicofre
Fajã de Baixo,PS,37.91,677,420306
Fajã de Baixo,PPD/PSD,31.75,567,420306
Fajã de Baixo,B.E.,11.09,198,420306
Fajã de Baixo,CDS-PP,4.7,84,420306
Fajã de Baixo,PAN,3.98,71,420306
Fajã de Baixo,PCP-PEV,2.74,49,420306
Fajã de Baixo,A,2.02,36,420306
Fajã de Baixo,CH,1.74,31,420306
Fajã de Baixo,L,1.12,20,420306
Fajã de Baixo,IL,1.01,18,420306
Fajã de Baixo,PPM,0.56,10,420306
Fajã de Baixo,MPT,0.5,9,420306
Fajã de Baixo,PCTP/MRPP,0.34,6,420306
Fajã de Baixo,PNR,0.34,6,420306
Fajã de Baixo,MAS,0.11,2,420306
Fajã de Baixo,PTP,0.11,2,420306
Fajã de Baixo,PDR,0,0,420306
