Objeto do Contrato,Tipo de Procedimento,Tipo(s) de Contrato,CPVs,Entidade(s) Adjudicante(s),Entidade(s) Adjudicatária(s),Preço Contratual,Data de Publicação,Data de Celebração do Contrato,Prazo de Execução,Local de Execução,Fundamentação,Data de Fecho do Contrato,Preço Total Efetivo,Causas das Alterações ao Prazo,Causas das Alterações ao Preço,Estado,N.º registo do Acordo Quadro,Descrição do Acordo Quadro,Procedimento Centralizado
"MATERIAL DE CONSUMO CLÍNICO DIVERSOS III, EM CPA.",Ao abrigo de acordo-quadro (art.º 259.º),Aquisição de bens móveis,"33190000-8, Dispositivos e produtos médicos variados","Hospital do Espírito Santo de Évora, E. P. E. (508085888)","MEDICINALIA-CORMEDICA (500684324), B BRAUN MEDICAL LDA (501506543), BASTOS VIEGAS SA (500042772), FRESENIUS MEDICAL CARE LDA (503070220), MUNDINTER SA (500199906)","958,86 €",21-11-2013,19-11-2013,45 dias,"Portugal, Évora, Évora",Artigo 259.º do Código dos Contratos Públicos,,,,,,552526,"CONCURSO PÚBLICO PARA A CELEBRAÇÃO DE CONTRATOS PÚBLICOS DE APROVISIONAMENTO PARA A ÁREA DA SAÚDE, COM VISTA AO FORNECIMENTO DE DISPOSITIVOS MÉDICOS DIVERSOS",
"MATERIAL DE CONSUMO CLÍNICO DIVERSOS III, EM CPA.",Ao abrigo de acordo-quadro (art.º 259.º),Aquisição de bens móveis,"33190000-8, Dispositivos e produtos médicos variados","Hospital do Espírito Santo de Évora, E. P. E. (508085888)","BASTOS VIEGAS SA (500042772), ALBINO DIAS ANDRADE (500013810), ABILIO FREIRE LDA (500432600)","6.367,00 €",21-11-2013,19-11-2013,45 dias,"Portugal, Évora, Évora",Artigo 259.º do Código dos Contratos Públicos,,,,,,534953,"CONCURSO PÚBLICO PARA A CELEBRAÇÃO DE CONTRATOS PÚBLICOS DE APROVISIONAMENTO PARA A ÁREA DA SAÚDE, COM VISTA AO FORNECIMENTO DE MATERIAL DE PENSO TRADICIONAL/CLASSICO - PARTE 1 - ÀS INSTITUIÇÕES E SERVIÇOS DO SERVIÇO NACIONAL DE SAÚDE  ",
"MATERIAL DE CONSUMO CLÍNICO DIVERSOS III, EM CPA.",Ao abrigo de acordo-quadro (art.º 259.º),Aquisição de bens móveis,"33190000-8, Dispositivos e produtos médicos variados","Hospital do Espírito Santo de Évora, E. P. E. (508085888)","PERGUT PORTUGAL (501799729), BASTOS VIEGAS SA (500042772), PAUL HARTMANN LDA (502271728)","652,00 €",21-11-2013,19-11-2013,45 dias,"Portugal, Évora, Évora",Artigo 259.º do Código dos Contratos Públicos,,,,,,537931,"CONCURSO PÚBLICO PARA A CELEBRAÇÃO DE CONTRATOS PÚBLICOS DE APROVISIONAMENTO PARA A ÁREA DA SAÚDE, COM VISTA AO FORNECIMENTO DE MATERIAL DISPOSABLE DE BLOCO OPERATÓRIO - PARTE 2, ÀS INSTITUIÇÕES E SERVIÇOS DO SERVIÇO NACIONAL DE SAÚDE  ",
"AQUISIÇÃO DE MEIOS COMPLEMENTARES DE DIAGNÓSTICO NO EXTERIOR DE IMAGIOLOGIA: T´S, ECOGRAFIAS/MAMOGRAFIA, ESTUDO DOPPLER E RADIOLOGIA DE INTERVENÇÃO",Ajuste Direto Regime Geral,Aquisição de serviços,"85150000-5, Serviços de imagiologia médica","Hospital do Espírito Santo de Évora, E. P. E. (508085888)","CLINICA DO CORAÇÃO DO ALENTEJO SA (502376457), CDI - CLINICA DIAGNOSTICO POR IMAGEM (502830654)","46.788,31 €",21-11-2013,29-08-2013,120 dias,"Portugal, Évora, Évora","Artigo 20.º, n.º 1, alínea a) do Código dos Contratos Públicos",,,,,,Não aplicável.,Não aplicável.,
AQUISIÇÃO DE MCDT`S NO EXTERIOR: TRATAMENTOS DE MEDICINA FÍSICA E REABILITAÇÃO.,Ajuste Direto Regime Geral,Aquisição de serviços,"85111400-4, Serviços hospitalares de reabilitação","Hospital do Espírito Santo de Évora, E. P. E. (508085888)","FISIEVE - CENTRO MED FIS REAB DE ÉVORA LDA (500991057), FISIRED - FISIOTERAPIA E MEDICINA UNIPES LDA (509133436), HOSPITAL  S JOAO DEUS (500927731)","17.251,48 €",21-11-2013,12-09-2013,60 dias,"Portugal, Évora, Évora","Artigo 20.º, n.º 1, alínea a) do Código dos Contratos Públicos",,,,,,Não aplicável.,Não aplicável.,
Aquisição de medicamentos,Ao abrigo de acordo-quadro (art.º 259.º),Aquisição de bens móveis,"33690000-3, Medicamentos vários","Hospital do Espírito Santo de Évora, E. P. E. (508085888)",Merck Sa (500650870),"25.971,30 €",21-11-2013,14-11-2013,8 dias,"Portugal, Évora, Évora",Artigo 259.º do Código dos Contratos Públicos,,,,,,345900,CONCURSO PÚBLICO PARA A CELEBRAÇÃO DE CONTRATOS PÚBLICOS DE APROVISIONAMENTO PARA AQUISIÇÃO MEDICAMENTOS DO FORO ONCOLÓGICO,
MATERIAL DE PENSO DE EFEITO TERAPÊUTICO,Ao abrigo de acordo-quadro (art.º 259.º),Aquisição de bens móveis,"33690000-3, Medicamentos vários","Hospital do Espírito Santo de Évora, E. P. E. (508085888)","SMITH & NEPHEW LDA (503552461), 3M PORTUGAL LDA (500193940), OVERPHARMA LDA (505792362), PAUL HARTMANN LDA (502271728), B BRAUN MEDICAL LDA (501506543), LINEA MEDICA-DISP MED CIRG SA (505148676), SPCARE - ESPECIALIDADES FARMACEUTICAS LDA (508284872), QUILABAN QUIMICA LABORATORIAL ANALITICA SA (500399670), KVTECH PORTUGAL - PRODUTOS MEDICOS UNIP (508671531), PARS CONSULTORIA PREST SERVICO (505642948)","37.728,82 €",20-11-2013,13-11-2013,365 dias,"Portugal, Évora, Évora",Artigo 259.º do Código dos Contratos Públicos,,,,,,534953,"CONCURSO PÚBLICO PARA A CELEBRAÇÃO DE CONTRATOS PÚBLICOS DE APROVISIONAMENTO PARA A ÁREA DA SAÚDE, COM VISTA AO FORNECIMENTO DE MATERIAL DE PENSO TRADICIONAL/CLASSICO - PARTE 1 - ÀS INSTITUIÇÕES E SERVIÇOS DO SERVIÇO NACIONAL DE SAÚDE  ",
"MEDICAMENTOS DO APARELHO CARDIOVASCULAR, EM CPA",Ao abrigo de acordo-quadro (art.º 259.º),Aquisição de bens móveis,"33622000-6, Medicamentos para o aparelho cardiovascular","Hospital do Espírito Santo de Évora, E. P. E. (508085888)","OVERPHARMA LDA (505792362), HIKMA FARMACEUTICA (502266791), B BRAUN MEDICAL LDA (501506543), SANOFI- PRODUTOS FARMACEUTICOS LDA (500134960), BAXTER MEDICO FARMACEUTICA LDA (503347345), MEDA PHARMA S A (500082090), GENERIS - FARMACEUTICA SA (508107997), LABESFAL SA (501169580), RATIOPHARM LDA (502414910)","2.363,56 €",19-11-2013,06-11-2013,60 dias,"Portugal, Évora, Évora",Artigo 259.º do Código dos Contratos Públicos,,,,,,513025,"CONCURSO PÚBLICO PARA A CELEBRAÇÃO DE CONTRATOS PÚBLICOS DE APROVISIONAMENTO PARA A ÁREA DA SAÚDE, COM VISTA AO FORNECIMENTO DE MEDICAMENTOS DE CONSUMO GERAL  (FFOSI)- APARELHO CARDIOVASCULAR., ÀS INSTITUIÇÕES E SERVIÇOS DO SERVIÇO NACIONAL DE SAÚDE",
"LUVAS DE USO MÉDICO, EM CPA.",Ao abrigo de acordo-quadro (art.º 259.º),Aquisição de bens móveis,"33190000-8, Dispositivos e produtos médicos variados","Hospital do Espírito Santo de Évora, E. P. E. (508085888)","BASTOS VIEGAS SA (500042772), VWR-INTERNACIONAL MAT LAB LDA (503842770), H R - HOSPITALAR LDA (501895558), EZEQUIEL PANAO JORGE LDA (501412727)","8.886,27 €",19-11-2013,03-10-2013,90 dias,"Portugal, Évora, Évora",Artigo 259.º do Código dos Contratos Públicos,,,,,,544071,"CONCURSO PÚBLICO PARA A CELEBRAÇÃO DE CONTRATOS PÚBLICOS DE APROVISIONAMENTO PARA A ÁREA DA SAÚDE, COM VISTA AO FORNECIMENTO DE LUVAS PARA USO MÉDICO, ÀS INSTITUIÇÕES E SERVIÇOS DO SERVIÇO NACIONAL DE SAÚDE",
COMPUTADORES,Ajuste Direto Regime Geral,Aquisição de bens móveis,"30231100-8, Terminais de computador","Hospital do Espírito Santo de Évora, E. P. E. (508085888)",INFORMATICA EL CORTE INGLES (980079659),"7.418,84 €",19-11-2013,10-09-2013,90 dias,"Portugal, Évora, Évora","Artigo 20.º, n.º 1, alínea a) do Código dos Contratos Públicos",,,,,,Não aplicável.,Não aplicável.,
TONER E TINTEIROS.,Ajuste Direto Regime Geral,Aquisição de bens móveis,"30125110-5, Tóner para impressoras laser e aparelhos de fax","Hospital do Espírito Santo de Évora, E. P. E. (508085888)","STAPLES PORTUGAL - EQUIP ESCRITORIO SA (503789372), FLUIR - CONS EQUIP INFORMATICOS UNIP LDA (506212424), NOVABIT INFORMATICA UNIPESSOAL LDA (503411302)","2.207,21 €",19-11-2013,15-10-2013,120 dias,"Portugal, Évora, Évora","Artigo 24.º, n.º 1, alínea e) do Código dos Contratos Públicos",,,,,,Não aplicável.,Não aplicável.,
Aquisição de DM para angiografia coronária,Concurso público,Aquisição de bens móveis,"33141210-5, Cateteres de balão","Hospital do Espírito Santo de Évora, E.P.E. (508085888)","JOHNSON & JOHNSON LDA                              (500153370), B BRAUN MEDICAL LDA                                (501506543), MEDICAL VALUE SA                                   (509776531), BOSTON SCIENTIFIC PORTUGAL LDA                     (504988964)","126.880,20 €",19-11-2013,24-10-2013,365 dias,"Portugal, Évora, Évora","Artigo 20.º, n.º 1, alínea b) do Código dos Contratos Públicos",,,,,,Não aplicável.,Não aplicável.,
Lentes Tóricas,Ajuste Direto Regime Geral,Aquisição de bens móveis,"33730000-6, Produtos para o cuidado dos olhos e lentes de correcção","Hospital do Espírito Santo de Évora, EPE (508085888)",BAUSCH & LOMB S A (980218764),"3.800,00 €",19-11-2013,01-10-2013,60 dias,"Portugal, Évora, Évora",Artigo 258.º do Código dos Contratos Públicos,,,,,,Não aplicável.,Não aplicável.,
CENTRIFUGA.,Ajuste Direto Regime Geral,Aquisição de bens móveis,"42931100-2, Centrifugadoras de laboratório e acessórios","Hospital do Espírito Santo de Évora, EPE (508085888)","GRUPO TAPER, LDA (506886336)","25.874,00 €",19-11-2013,24-10-2013,30 dias,"Portugal, Évora, Évora",Artigo 258.º do Código dos Contratos Públicos,,,,,,Não aplicável.,Não aplicável.,
"MATERIAL DE CONSUMO CLINICO DIVERSO, EM CPA.",Ao abrigo de acordo-quadro (art.º 259.º),Aquisição de bens móveis,"33190000-8, Dispositivos e produtos médicos variados","Hospital do Espírito Santo de Évora, E. P. E. (508085888)",B BRAUN MEDICAL LDA (501506543),"55,80 €",19-11-2013,14-08-2013,150 dias,"Portugal, Évora, Évora",Artigo 259.º do Código dos Contratos Públicos,,,,,,419168,CONCURSO PÚBLICO PARA A CELEBRAÇÃO DE CONTRATOS PÚBLICOS DE APROVISIONAMENTO PARA AQUISIÇÃO DE MATERIAL OSTOMIA DE ELIMINAÇÃO,
"MATERIAL DE CONSUMO CLINICO DIVERSO, EM CPA.",Ao abrigo de acordo-quadro (art.º 259.º),Aquisição de bens móveis,"33190000-8, Dispositivos e produtos médicos variados","Hospital do Espírito Santo de Évora, E. P. E. (508085888)",OVERPHARMA LDA (505792362),"1.302,00 €",19-11-2013,14-08-2013,150 dias,"Portugal, Évora, Évora",Artigo 259.º do Código dos Contratos Públicos,,,,,,451780,CP 2012/24 - MATERAIL DISPOSABLE DE BLOCO OPERATORIO,
"MATERIAL DE CONSUMO CLINICO DIVERSO, EM CPA.",Ao abrigo de acordo-quadro (art.º 259.º),Aquisição de bens móveis,"33190000-8, Dispositivos e produtos médicos variados","Hospital do Espírito Santo de Évora, E. P. E. (508085888)",NORMAX LDA (500203130),"625,00 €",19-11-2013,14-08-2013,150 dias,"Portugal, Évora, Évora",Artigo 259.º do Código dos Contratos Públicos,,,,,,448705,"CONCURSO PÚBLICO PARA A CELEBRAÇÃO DE CONTRATOS PÚBLICOS DE APROVISIONAMENTO PARA A ÁREA DA SAÚDE, COM VISTA AO FORNECIMENTO DE SERINGAS, AGULHAS, CONTENTORES E SISTEMAS FECHADOS DE COLHEITA,  ÀS INSTITUIÇÕES E SERVIÇOS DO SERVIÇO NACIONAL DE SAÚDE",
"MATERIAL DE CONSUMO CLINICO DIVERSOS, EM CPA.",Ao abrigo de acordo-quadro (art.º 259.º),Aquisição de bens móveis,"33140000-3, Material médico de consumo","Hospital do Espírito Santo de Évora, E. P. E. (508085888)","3M PORTUGAL LDA (500193940), PAUL HARTMANN LDA (502271728), OVERPHARMA LDA (505792362)","1.503,50 €",19-11-2013,14-08-2013,150 dias,"Portugal, Évora, Évora",Artigo 259.º do Código dos Contratos Públicos,,,,,,534953,"CONCURSO PÚBLICO PARA A CELEBRAÇÃO DE CONTRATOS PÚBLICOS DE APROVISIONAMENTO PARA A ÁREA DA SAÚDE, COM VISTA AO FORNECIMENTO DE MATERIAL DE PENSO TRADICIONAL/CLASSICO - PARTE 1 - ÀS INSTITUIÇÕES E SERVIÇOS DO SERVIÇO NACIONAL DE SAÚDE  ",
"MEDICAMENTOS DIVERSOS II, EM CPA.",Ao abrigo de acordo-quadro (art.º 259.º),Aquisição de bens móveis,"33690000-3, Medicamentos vários","Hospital do Espírito Santo de Évora, E. P. E. (508085888)","B BRAUN MEDICAL LDA (501506543), LABESFAL SA (501169580), FRESENIUS KABI PHARMA PORTUGAL (504293753)","4.879,32 €",19-11-2013,22-08-2013,120 dias,"Portugal, Évora, Évora",Artigo 259.º do Código dos Contratos Públicos,,,,,,461372,CP 2012/45 - MEDICAMENTOS ANESTÉSICOS E RELAXANTES MUSCULARES,
"MEDICAMENTOS DIVERSOS II, EM CPA.",Ao abrigo de acordo-quadro (art.º 259.º),Aquisição de bens móveis,"33690000-3, Medicamentos vários","Hospital do Espírito Santo de Évora, E. P. E. (508085888)",FARMOZ - SOC TECNICO MEDICINAL SA (501505334),"85,20 €",19-11-2013,22-08-2013,120 dias,"Portugal, Évora, Évora",Artigo 259.º do Código dos Contratos Públicos,,,,,,461370,"CP 2012/44 - MEDICAMENTOS ANALGÉSICOS, ANTIPIRÉTICOS E ANTIDEPRESSIVOS",
"MEDICAMENTOS DIVERSOS II, EM CPA.",Ao abrigo de acordo-quadro (art.º 259.º),Aquisição de bens móveis,"33690000-3, Medicamentos vários","Hospital do Espírito Santo de Évora, E. P. E. (508085888)","FARMOZ - SOC TECNICO MEDICINAL SA (501505334), ROCHE FARMACEUTICA QUIMICA LDA (500233810)","1.745,09 €",19-11-2013,22-08-2013,120 dias,"Portugal, Évora, Évora",Artigo 259.º do Código dos Contratos Públicos,,,,,,611354,"CONCURSO PÚBLICO PARA A CELEBRAÇÃO DE CONTRATOS PÚBLICOS DE APROVISIONAMENTO PARA A ÁREA DA SAÚDE, COM VISTA AO FORNECIMENTO DE MEDICAMENTOS ANTI-INFECIOSOS: ANTIVÍRICOS E ANTIFÚNGICOS, ÀS INSTITUIÇÕES E SERVIÇOS DO SERVIÇO NACIONAL DE SAÚDE",
"MEDICAMENTOS DIVERSOS II, EM CPA.",Ao abrigo de acordo-quadro (art.º 259.º),Aquisição de bens móveis,"33690000-3, Medicamentos vários","Hospital do Espírito Santo de Évora, E. P. E. (508085888)",UNILFARMA (500293023),"2.797,34 €",19-11-2013,22-08-2013,120 dias,"Portugal, Évora, Évora",Artigo 259.º do Código dos Contratos Públicos,,,,,,469931,CP 2012/12 - Medicamentos do Aparelho Respiratório,
"MEDICAMENTOS DIVERSOS II, EM CPA.",Ao abrigo de acordo-quadro (art.º 259.º),Aquisição de bens móveis,"33690000-3, Medicamentos vários","Hospital do Espírito Santo de Évora, E. P. E. (508085888)",OVERPHARMA LDA (505792362),"108,80 €",19-11-2013,22-08-2013,120 dias,"Portugal, Évora, Évora",Artigo 259.º do Código dos Contratos Públicos,,,,,,178089,"CONCURSO PÚBLICO PARA A CELEBRAÇÃO DE CONTRATOS PÚBLICOS DE APROVISIONAMENTO PARA AQUISIÇÃO DE ANTISSÉPTICOS, DESINFECTANTES E OUTROS ",
"MEDICAMENTOS DIVERSOS II, EM CPA.",Ao abrigo de acordo-quadro (art.º 259.º),Aquisição de bens móveis,"33690000-3, Medicamentos vários","Hospital do Espírito Santo de Évora, E. P. E. (508085888)","LAB PFIZER LDA (500162166), ROCHE FARMACEUTICA QUIMICA LDA (500233810)","130,78 €",19-11-2013,22-08-2013,120 dias,"Portugal, Évora, Évora",Artigo 259.º do Código dos Contratos Públicos,,,,,,611389,"CONCURSO PÚBLICO PARA A CELEBRAÇÃO DE CONTRATOS PÚBLICOS DE APROVISIONAMENTO PARA A ÁREA DA SAÚDE, COM VISTA AO FORNECIMENTO DE MEDICAMENTOS ANTI-INFECIOSOS: EXCETO ANTIVÍRICOS E ANTIFÚNGICOS, ÀS INSTITUIÇÕES E SERVIÇOS DO SERVIÇO NACIONAL DE SAÚDE",
"MEDICAMENTOS DIVERSOS II, EM CPA.",Ao abrigo de acordo-quadro (art.º 259.º),Aquisição de bens móveis,"33690000-3, Medicamentos vários","Hospital do Espírito Santo de Évora, E. P. E. (508085888)",BAXTER MEDICO FARMACEUTICA LDA (503347345),"3.665,04 €",19-11-2013,22-08-2013,120 dias,"Portugal, Évora, Évora",Artigo 259.º do Código dos Contratos Públicos,,,,,,405999,CONCURSO PÚBLICO PARA A CELEBRAÇÃO DE CONTRATOS PÚBLICOS DE APROVISIONAMENTO PARA AQUISIÇÃO CORRECTIVOS DA VOLÉMIA E OUTRAS SOLUÇÕES ESTÉREIS,
MEDICAMENTOS DIVERSOS III,Ao abrigo de acordo-quadro (art.º 259.º),Aquisição de bens móveis,"33690000-3, Medicamentos vários","Hospital do Espírito Santo de Évora, E. P. E. (508085888)",LAB PFIZER LDA (500162166),"49,53 €",18-11-2013,10-10-2013,120 dias,"Portugal, Évora, Évora",Artigo 259.º do Código dos Contratos Públicos,,,,,,345900,CONCURSO PÚBLICO PARA A CELEBRAÇÃO DE CONTRATOS PÚBLICOS DE APROVISIONAMENTO PARA AQUISIÇÃO MEDICAMENTOS DO FORO ONCOLÓGICO,
MEDICAMENTOS DIVERSOS III EM CPA,Ao abrigo de acordo-quadro (art.º 259.º),Aquisição de bens móveis,"33690000-3, Medicamentos vários","Hospital do Espírito Santo de Évora, E. P. E. (508085888)",ROCHE FARMACEUTICA QUIMICA LDA (500233810),"1.515,94 €",18-11-2013,10-10-2013,120 dias,"Portugal, Évora, Évora",Artigo 259.º do Código dos Contratos Públicos,,,,,,603979,"CONCURSO PÚBLICO PARA A CELEBRAÇÃO DE CONTRATOS PÚBLICOS DE APROVISIONAMENTO PARA A ÁREA DA SAÚDE, COM VISTA AO FORNECIMENTO DE HORMONAS E OUTROS MEDICAMENTOS USADOS NO TRATAMENTO DAS DOENÇAS ENDÓCRINAS, ÀS INSTITUIÇÕES E SERVIÇOS DO SERVIÇO NACIONAL DE SAÚDE",
MEDICAMENTOS E VACINAS EM CPA,Ao abrigo de acordo-quadro (art.º 259.º),Aquisição de bens móveis,"33690000-3, Medicamentos vários","Hospital do Espírito Santo de Évora, E. P. E. (508085888)",GLAXOSMITHKLINE CONSUM HEALTHC (500276994),"297,00 €",18-11-2013,14-08-2013,150 dias,"Portugal, Évora, Évora",Artigo 259.º do Código dos Contratos Públicos,,,,,,610556,"CONCURSO PÚBLICO PARA A CELEBRAÇÃO DE CONTRATOS PÚBLICOS DE APROVISIONAMENTO PARA A ÁREA DA SAÚDE, COM VISTA AO FORNECIMENTO DE VACINAS E TUBERCULINAS, ÀS INSTITUIÇÕES E SERVIÇOS DO SERVIÇO NACIONAL DE SAÚDE",
MEDICAMENTOS E VACINAS EM CPA,Ao abrigo de acordo-quadro (art.º 259.º),Aquisição de bens móveis,"33690000-3, Medicamentos vários","Hospital do Espírito Santo de Évora, E. P. E. (508085888)","LAB MEDINFAR (500384045), GLAXOSMITHKLINE CONSUM HEALTHC (500276994)","875,00 €",18-11-2013,14-08-2013,150 dias,"Portugal, Évora, Évora",Artigo 259.º do Código dos Contratos Públicos,,,,,,469931,CP 2012/12 - Medicamentos do Aparelho Respiratório,
Aquisição de medicamentos,Ao abrigo de acordo-quadro (art.º 259.º),Aquisição de bens móveis,"33690000-3, Medicamentos vários","Hospital do Espírito Santo de Évora, E. P. E. (508085888)",Biogen (506415740),"23.994,00 €",13-11-2013,01-11-2013,8 dias,"Portugal, Évora, Évora",Artigo 259.º do Código dos Contratos Públicos,,,,,,383205,CONCURSO PÚBLICO PARA A CELEBRAÇÃO DE CONTRATOS PÚBLICOS DE APROVISIONAMENTO PARA AQUISIÇÃO MEDICAMENTOS DO FORO ONCOLÓGICO II,
