Objeto do Contrato,Tipo de Procedimento,Tipo(s) de Contrato,CPVs,Entidade(s) Adjudicante(s),Entidade(s) Adjudicatária(s),Preço Contratual,Data de Publicação,Data de Celebração do Contrato,Prazo de Execução,Local de Execução,Fundamentação,Data de Fecho do Contrato,Preço Total Efetivo,Causas das Alterações ao Prazo,Causas das Alterações ao Preço,Estado,N.º registo do Acordo Quadro,Descrição do Acordo Quadro,Procedimento Centralizado
Aquisição e instalação de 2 switch,Ajuste Direto Regime Geral,Aquisição de bens móveis,"32541000-7, Equipamento de comutação","Unidade Local de Saúde de Castelo Branco, E. P. E. (509309844)","GONKSYS, S.A. (510874169)","6.427,78 €",10-09-2015,03-09-2015,15 dias,"Portugal, Castelo Branco, Castelo Branco","Artigo 20.º, n.º 1, alínea a) do Código dos Contratos Públicos",21-09-2015,"6.427,78 €",,,,Não aplicável.,Não aplicável.,FALSE
1 Desfibrilhador com Pacing e SpO2_Obstetricia/Ginecologia,Ajuste Direto Regime Geral,Aquisição de bens móveis,"33182100-0, Desfibrilhador","Unidade Local de Saúde de Castelo Branco, E. P. E. (509309844)","PHYSIO PORTUGAL SALES, UNIPESSOAL, LDA (510137946)","8.117,90 €",07-09-2015,27-08-2015,45 dias,"Portugal, Castelo Branco, Castelo Branco","Artigo 20.º, n.º 1, alínea a) do Código dos Contratos Públicos",28-12-2015,"8.117,90 €",,,,Não aplicável.,Não aplicável.,FALSE
"Aquisição e instalação de 1 Videogastroscópio para Gastrenterologia, com retoma do avariado",Ajuste Direto Regime Geral,Aquisição de bens móveis,"33168000-5, Aparelhos para endoscopia e endocirurgia","Unidade Local de Saúde de Castelo Branco, E.P.E. (509309844)","OLYMPUS IBERIA, S.A.U.-Sucursal em  Portugal (980474710)","12.650,00 €",02-09-2015,28-08-2015,30 dias,"Portugal, Castelo Branco, Castelo Branco","Artigo 24.º, n.º 1, alínea e) do Código dos Contratos Públicos",03-09-2015,"12.650,00 €",,,,Não aplicável.,Não aplicável.,FALSE
