freguesia,acronym,validVotesPercentage,votes,dicofre
"União das freguesias de Aldoar, Foz do Douro e Nevogilde",PPD/PSD,47.21,8148,131216
"União das freguesias de Aldoar, Foz do Douro e Nevogilde",PS,22.8,3935,131216
"União das freguesias de Aldoar, Foz do Douro e Nevogilde",CDS-PP,7.91,1365,131216
"União das freguesias de Aldoar, Foz do Douro e Nevogilde",B.E.,7.07,1220,131216
"União das freguesias de Aldoar, Foz do Douro e Nevogilde",IL,4.99,862,131216
"União das freguesias de Aldoar, Foz do Douro e Nevogilde",PCP-PEV,4.1,708,131216
"União das freguesias de Aldoar, Foz do Douro e Nevogilde",PAN,2.39,412,131216
"União das freguesias de Aldoar, Foz do Douro e Nevogilde",L,1.24,214,131216
"União das freguesias de Aldoar, Foz do Douro e Nevogilde",A,0.67,115,131216
"União das freguesias de Aldoar, Foz do Douro e Nevogilde",R.I.R.,0.32,56,131216
"União das freguesias de Aldoar, Foz do Douro e Nevogilde",CH,0.31,53,131216
"União das freguesias de Aldoar, Foz do Douro e Nevogilde",PCTP/MRPP,0.27,47,131216
"União das freguesias de Aldoar, Foz do Douro e Nevogilde",NC,0.14,24,131216
"União das freguesias de Aldoar, Foz do Douro e Nevogilde",PNR,0.14,25,131216
"União das freguesias de Aldoar, Foz do Douro e Nevogilde",MPT,0.11,19,131216
"União das freguesias de Aldoar, Foz do Douro e Nevogilde",PPM,0.11,19,131216
"União das freguesias de Aldoar, Foz do Douro e Nevogilde",PURP,0.1,17,131216
"União das freguesias de Aldoar, Foz do Douro e Nevogilde",PTP,0.06,10,131216
"União das freguesias de Aldoar, Foz do Douro e Nevogilde",JPP,0.03,5,131216
"União das freguesias de Aldoar, Foz do Douro e Nevogilde",PDR,0.03,5,131216
"União das freguesias de Aldoar, Foz do Douro e Nevogilde",MAS,0.01,1,131216
