freguesia,acronym,validVotesPercentage,votes,dicofre
Bragado,PPD/PSD,52.02,90,171304
Bragado,PS,32.95,57,171304
Bragado,CDS-PP,4.62,8,171304
Bragado,PAN,2.89,5,171304
Bragado,B.E.,2.31,4,171304
Bragado,NC,1.16,2,171304
Bragado,A,0.58,1,171304
Bragado,L,0.58,1,171304
Bragado,MAS,0.58,1,171304
Bragado,PCTP/MRPP,0.58,1,171304
Bragado,PDR,0.58,1,171304
Bragado,PNR,0.58,1,171304
Bragado,PPM.PPV/CDC,0.58,1,171304
Bragado,IL,0,0,171304
Bragado,PCP-PEV,0,0,171304
Bragado,PTP,0,0,171304
Bragado,PURP,0,0,171304
