freguesia,acronym,validVotesPercentage,votes,dicofre
Sabóia,PS,52.92,172,021103
Sabóia,PCP-PEV,16,52,021103
Sabóia,PPD/PSD.CDS-PP,10.77,35,021103
Sabóia,PCTP/MRPP,5.23,17,021103
Sabóia,MPT,4.92,16,021103
Sabóia,B.E.,4.62,15,021103
Sabóia,L,2.15,7,021103
Sabóia,PAN,1.54,5,021103
Sabóia,PND,0.62,2,021103
Sabóia,PNR,0.62,2,021103
Sabóia,PPM,0.62,2,021103
Sabóia,MAS,0,0,021103
Sabóia,PDA,0,0,021103
Sabóia,POUS,0,0,021103
Sabóia,PPV,0,0,021103
Sabóia,PTP,0,0,021103
