freguesia,acronym,validVotesPercentage,votes,dicofre
Sines,PS,37.52,1887,151301
Sines,PCP-PEV,17.22,866,151301
Sines,B.E.,16.15,812,151301
Sines,PPD/PSD,13.38,673,151301
Sines,PAN,4.1,206,151301
Sines,CDS-PP,2.76,139,151301
Sines,CH,1.61,81,151301
Sines,PCTP/MRPP,1.41,71,151301
Sines,L,1.15,58,151301
Sines,R.I.R.,0.95,48,151301
Sines,IL,0.82,41,151301
Sines,A,0.72,36,151301
Sines,PDR,0.46,23,151301
Sines,MPT,0.38,19,151301
Sines,PNR,0.3,15,151301
Sines,NC,0.28,14,151301
Sines,PTP,0.24,12,151301
Sines,PURP,0.24,12,151301
Sines,PPM,0.2,10,151301
Sines,MAS,0.12,6,151301
