Objeto do Contrato,Tipo de Procedimento,Tipo(s) de Contrato,CPVs,Entidade(s) Adjudicante(s),Entidade(s) Adjudicatária(s),Preço Contratual,Data de Publicação,Data de Celebração do Contrato,Prazo de Execução,Local de Execução,Fundamentação,Data de Fecho do Contrato,Preço Total Efetivo,Causas das Alterações ao Prazo,Causas das Alterações ao Preço,Estado,N.º registo do Acordo Quadro,Descrição do Acordo Quadro,Procedimento Centralizado
AQUISIÇÃO DE PRODUTOS FARMACÊUTICOS,Ajuste Direto Regime Geral,Aquisição de bens móveis,"33600000-6, Produtos farmacêuticos","Administração Regional de Saúde do Norte, I.P. (503135593)","ROCHE SISTEMAS DE DIAGNÒSTICOS, LDA (504282921)","8.476,45 €",24-05-2012,13-03-2012,30 dias,"Portugal, Vila Real, Vila Real","Artigo 24.º, n.º 1, alínea e) do Código dos Contratos Públicos",25-06-2012,"8.476,45 €",,,,Não aplicável.,Não aplicável.,
AQUISIÇÃO DE DIVERSO EQUIPAMENTO DENTÁRIO,Ajuste Direto Regime Geral,Aquisição de bens móveis,"33110000-4, Equipamento de imagiologia para uso médico, dentário e veterinário","Administração Regional de Saúde do Norte, I.P. (503135593)","EUROCONEXÃO (509522327), MACHADO MALCHER, LDA (500174245), MONTELLANO (500196494)","7.052,00 €",24-05-2012,02-03-2012,30 dias,"Portugal, Vila Real, Vila Real","Artigo 20.º, n.º 1, alínea a) do Código dos Contratos Públicos","","",,,,Não aplicável.,Não aplicável.,
