freguesia,acronym,validVotesPercentage,votes,dicofre
União das freguesias de Cabreiros e Albergaria da Serra,PS,56.92,37,010422
União das freguesias de Cabreiros e Albergaria da Serra,PPD/PSD,27.69,18,010422
União das freguesias de Cabreiros e Albergaria da Serra,B.E.,7.69,5,010422
União das freguesias de Cabreiros e Albergaria da Serra,PCP-PEV,1.54,1,010422
União das freguesias de Cabreiros e Albergaria da Serra,PCTP/MRPP,1.54,1,010422
União das freguesias de Cabreiros e Albergaria da Serra,PNR,1.54,1,010422
União das freguesias de Cabreiros e Albergaria da Serra,PPM.PPV/CDC,1.54,1,010422
União das freguesias de Cabreiros e Albergaria da Serra,PTP,1.54,1,010422
União das freguesias de Cabreiros e Albergaria da Serra,A,0,0,010422
União das freguesias de Cabreiros e Albergaria da Serra,CDS-PP,0,0,010422
União das freguesias de Cabreiros e Albergaria da Serra,IL,0,0,010422
União das freguesias de Cabreiros e Albergaria da Serra,L,0,0,010422
União das freguesias de Cabreiros e Albergaria da Serra,MAS,0,0,010422
União das freguesias de Cabreiros e Albergaria da Serra,NC,0,0,010422
União das freguesias de Cabreiros e Albergaria da Serra,PAN,0,0,010422
União das freguesias de Cabreiros e Albergaria da Serra,PDR,0,0,010422
União das freguesias de Cabreiros e Albergaria da Serra,PURP,0,0,010422
