freguesia,acronym,validVotesPercentage,votes,dicofre
União das freguesias de Proença-a-Nova e Peral,PS,41.43,645,050807
União das freguesias de Proença-a-Nova e Peral,PPD/PSD,33.85,527,050807
União das freguesias de Proença-a-Nova e Peral,CDS-PP,6.62,103,050807
União das freguesias de Proença-a-Nova e Peral,B.E.,6.23,97,050807
União das freguesias de Proença-a-Nova e Peral,PAN,3.79,59,050807
União das freguesias de Proença-a-Nova e Peral,PCP-PEV,1.48,23,050807
União das freguesias de Proença-a-Nova e Peral,PPM.PPV/CDC,1.48,23,050807
União das freguesias de Proença-a-Nova e Peral,A,1.41,22,050807
União das freguesias de Proença-a-Nova e Peral,L,0.83,13,050807
União das freguesias de Proença-a-Nova e Peral,IL,0.64,10,050807
União das freguesias de Proença-a-Nova e Peral,PDR,0.45,7,050807
União das freguesias de Proença-a-Nova e Peral,PURP,0.45,7,050807
União das freguesias de Proença-a-Nova e Peral,PCTP/MRPP,0.39,6,050807
União das freguesias de Proença-a-Nova e Peral,NC,0.32,5,050807
União das freguesias de Proença-a-Nova e Peral,PNR,0.26,4,050807
União das freguesias de Proença-a-Nova e Peral,PTP,0.26,4,050807
União das freguesias de Proença-a-Nova e Peral,MAS,0.13,2,050807
