Objeto do Contrato,Tipo de Procedimento,Tipo(s) de Contrato,CPVs,Entidade(s) Adjudicante(s),Entidade(s) Adjudicatária(s),Preço Contratual,Data de Publicação,Data de Celebração do Contrato,Prazo de Execução,Local de Execução,Fundamentação,Data de Fecho do Contrato,Preço Total Efetivo,Causas das Alterações ao Prazo,Causas das Alterações ao Preço,Estado,N.º registo do Acordo Quadro,Descrição do Acordo Quadro,Procedimento Centralizado
Próteses Testiculares,Ajuste Direto Regime Geral,Aquisição de bens móveis,"33140000-3, Material médico de consumo","Centro Hospitalar de Lisboa Central, E.P.E. (CHLC) (508080142)","COLOPLAST PORTUGAL-SOC.UNIPESSOAL, LDA. (503989037)","4.785,00 €",11-08-2017,11-08-2017,142 dias,"Portugal, Lisboa, Lisboa","Artigo 20.º, n.º 1, alínea a) do Código dos Contratos Públicos",,,,,,Não aplicável.,Não aplicável.,FALSE
"Aquisição de Tomografia Computorizada para Cardíaco Avançado (Hospital de Santa Marta) – LISBOA-06-4842-FEDER-000017, destinado ao Centro Hospitalar de Lisboa Central, EPE",Concurso público,Aquisição de bens móveis,"33110000-4, Equipamento de imagiologia para uso médico, dentário e veterinário","Centro Hospitalar de Lisboa Central, E. P. E. (508080142)","Siemens Healthcare, Lda (507925173)","850.000,00 €",11-08-2017,03-08-2017,15 dias,"Portugal, Lisboa, Lisboa","Artigo 20.º, n.º 1, alínea b) do Código dos Contratos Públicos",,,,,,Não aplicável.,Não aplicável.,FALSE
"Sistema de Administração de Sangue, desembaciador de óptica e outros",Ajuste Direto Regime Geral,Aquisição de bens móveis,"33140000-3, Material médico de consumo","Centro Hospitalar de Lisboa Central, E.P.E. (CHLC) (508080142)","Smiths Medical (Portugal), Lda. (507445937)","1.830,00 €",10-08-2017,07-08-2017,143 dias,"Portugal, Lisboa, Lisboa","Artigo 20.º, n.º 1, alínea a) do Código dos Contratos Públicos",,,,,,Não aplicável.,Não aplicável.,FALSE
"Sistema de Administração de Sangue, desembaciador de óptica e outros",Ajuste Direto Regime Geral,Aquisição de bens móveis,"33140000-3, Material médico de consumo","Centro Hospitalar de Lisboa Central, E.P.E. (CHLC) (508080142)","AVIQUÍMICA IMPORT. E MANUFACTURAS, LDA. (500039720)","630,00 €",10-08-2017,07-08-2017,143 dias,"Portugal, Lisboa, Lisboa","Artigo 20.º, n.º 1, alínea a) do Código dos Contratos Públicos",,,,,,Não aplicável.,Não aplicável.,FALSE
"Sistema de Administração de Sangue, desembaciador de óptica e outros",Ajuste Direto Regime Geral,Aquisição de bens móveis,"33140000-3, Material médico de consumo","Centro Hospitalar de Lisboa Central, E.P.E. (CHLC) (508080142)","Bastos Viegas, S.A. (500042772)","1.056,00 €",10-08-2017,07-08-2017,143 dias,"Portugal, Lisboa, Lisboa","Artigo 20.º, n.º 1, alínea a) do Código dos Contratos Públicos",,,,,,Não aplicável.,Não aplicável.,FALSE
Cateteres endovenosos com sistema de proteção,Ao abrigo de acordo-quadro (art.º 259.º),Aquisição de bens móveis,"33000000-0, Equipamento médico, medicamentos e produtos para cuidados pessoais","Centro Hospitalar de Lisboa Central, E. P. E. (508080142)","Smiths Medical (Portugal), Lda. (507445937)","35.475,00 €",08-08-2017,17-07-2017,167 dias,"Portugal, Lisboa, Lisboa",Artigo 259.º do Código dos Contratos Públicos,,,,,,2622225,CP 2017/26 - Acordo Quadro para Fornecimento de Cateteres   às Instituições e Serviços do Serviço Nacional de Saúde,FALSE
Agulhas microondas com colocação de equipamento,Concurso público,Aquisição de bens móveis,"33140000-3, Material médico de consumo","Centro Hospitalar de Lisboa Central, E. P. E. (508080142)","TERUMO EUROPE ESPANA, SL (980472024), MEDICINÁLIA CORMEDICA (500684324)","200.000,00 €",08-08-2017,11-07-2017,173 dias,"Portugal, Lisboa, Lisboa","Artigo 20.º, n.º 1, alínea b) do Código dos Contratos Públicos",,,,,,Não aplicável.,Não aplicável.,FALSE
Guia fibra optica,Ajuste Direto Regime Geral,Aquisição de bens móveis,"33140000-3, Material médico de consumo","Centro Hospitalar de Lisboa Central, E.P.E. (CHLC) (508080142)",ARTUR OLIVEIRA (155810073),"5.759,63 €",08-08-2017,07-08-2017,145 dias,"Portugal, Lisboa, Lisboa","Artigo 20.º, n.º 1, alínea a) do Código dos Contratos Públicos",,,,,,Não aplicável.,Não aplicável.,FALSE
Serras e Brocas para Craniotomia,Ajuste Direto Regime Geral,Aquisição de bens móveis,"33140000-3, Material médico de consumo","Centro Hospitalar de Lisboa Central, E.P.E. (CHLC) (508080142)","MEDTRONIC PORTUGAL, LDA (504223933)","27.361,10 €",07-08-2017,28-07-2017,156 dias,"Portugal, Lisboa, Lisboa","Artigo 20.º, n.º 1, alínea a) do Código dos Contratos Públicos",,,,,,Não aplicável.,Não aplicável.,FALSE
Material Uso Único para Vídeo Cirurgia,Concurso público,Aquisição de bens móveis,"33169000-2, Material cirúrgico","Centro Hospitalar de Lisboa Central, E. P. E. (508080142)","Clínifar - Produtos Clínicos e Farmacêuticos, S.A. (503281115)","3.626,10 €",07-08-2017,29-06-2017,185 dias,"Portugal, Lisboa, Lisboa","Artigo 20.º, n.º 1, alínea b) do Código dos Contratos Públicos",,,,,,Não aplicável.,Não aplicável.,FALSE
Material Uso Único para Vídeo Cirurgia,Concurso público,Aquisição de bens móveis,"33169000-2, Material cirúrgico","Centro Hospitalar de Lisboa Central, E. P. E. (508080142)","ENDOTÉCNICA - Material Cirurgico, Lda (503818348)","88.407,00 €",07-08-2017,31-07-2017,153 dias,"Portugal, Lisboa, Lisboa","Artigo 20.º, n.º 1, alínea b) do Código dos Contratos Públicos",,,,,,Não aplicável.,Não aplicável.,FALSE
Válvulas Cardíacas Biológicas,Concurso público,Aquisição de bens móveis,"33182220-7, Válvulas cardíacas","Centro Hospitalar de Lisboa Central, E. P. E. (508080142)","Edwards Lifesciences (Portugal), Lda. (508014832)","132.300,00 €",07-08-2017,02-08-2017,152 dias,"Portugal, Lisboa, Lisboa","Artigo 20.º, n.º 1, alínea b) do Código dos Contratos Públicos",,,,,,Não aplicável.,Não aplicável.,FALSE
Aquisição de material para estimulação cerebral profunda,Concurso público,Aquisição de bens móveis,"33140000-3, Material médico de consumo","Centro Hospitalar de Lisboa Central, E. P. E. (508080142)","MEDTRONIC PORTUGAL, LDA (504223933)","66.420,00 €",07-08-2017,28-07-2017,156 dias,"Portugal, Lisboa, Lisboa","Artigo 20.º, n.º 1, alínea b) do Código dos Contratos Públicos",,,,,,Não aplicável.,Não aplicável.,FALSE
Placas e parafusos para fixação de costelas,Ajuste Direto Regime Geral,Aquisição de bens móveis,"33000000-0, Equipamento médico, medicamentos e produtos para cuidados pessoais","Centro Hospitalar de Lisboa Central, E. P. E. (508080142)",JOHNSON & JOHNSON MEDICAL (500153370),"5.991,57 €",07-08-2017,18-05-2017,227 dias,"Portugal, Lisboa, Lisboa","Artigo 20.º, n.º 1, alínea a) do Código dos Contratos Públicos",,,,,,Não aplicável.,Não aplicável.,FALSE
1-1-5013/2017-Reagentes HCV Genotipagem,Concurso público,Aquisição de bens móveis,"33696500-0, Reagentes de laboratório","Centro Hospitalar de Lisboa Central, E. P. E. (508080142)","Siemens Healthcare, Lda. (507925173)","146.067,75 €",04-08-2017,31-07-2017,180 dias,"Portugal, Lisboa, Lisboa","Artigo 20.º, n.º 1, alínea b) do Código dos Contratos Públicos",,,,,,Não aplicável.,Não aplicável.,FALSE
EVEROLIMUS,Ajuste Direto Regime Geral,Aquisição de bens móveis,"33696500-0, Reagentes de laboratório","Centro Hospitalar de Lisboa Central, E. P. E. (508080142)","ROCHE DIAGNOSTICOS, SOC.UNIPESSOAL, LDA (504282921)","9.500,00 €",04-08-2017,03-08-2017,180 dias,"Portugal, Lisboa, Lisboa","Artigo 20.º, n.º 1, alínea a) do Código dos Contratos Públicos",,,,,,Não aplicável.,Não aplicável.,FALSE
Válvulas aórticas,Ajuste Direto Regime Geral,Aquisição de bens móveis,"33000000-0, Equipamento médico, medicamentos e produtos para cuidados pessoais","Centro Hospitalar de Lisboa Central, E. P. E. (508080142)","Edwards Lifesciences (Portugal), Lda. (508014832)","18.900,00 €",04-08-2017,28-07-2017,156 dias,"Portugal, Lisboa, Lisboa","Artigo 20.º, n.º 1, alínea a) do Código dos Contratos Públicos",,,,,,Não aplicável.,Não aplicável.,FALSE
Pensos,Concurso público,Aquisição de bens móveis,"33140000-3, Material médico de consumo","Centro Hospitalar de Lisboa Central, E. P. E. (508080142)","MEDTRONIC PORTUGAL, LDA (504223933), 3M Portugal, Lda. (500193940), BASTOS VIEGAS, SA (500042772)","49.071,60 €",04-08-2017,20-07-2017,164 dias,"Portugal, Lisboa, Lisboa","Artigo 20.º, n.º 1, alínea b) do Código dos Contratos Públicos",,,,,,Não aplicável.,Não aplicável.,FALSE
Sistema de punção e perfuração por radiofrequência com colocação de equipamento,Ajuste Direto Regime Geral,Aquisição de bens móveis,"33100000-1, Equipamento médico","Centro Hospitalar de Lisboa Central, E.P.E. (CHLC) (508080142)",Intervenção (504203827),"13.524,00 €",04-08-2017,24-07-2017,160 dias,"Portugal, Lisboa, Lisboa","Artigo 20.º, n.º 1, alínea a) do Código dos Contratos Públicos",,,,,,Não aplicável.,Não aplicável.,FALSE
Sondas de cio-ablação com colocação de equipamento,Ajuste Direto Regime Geral,Aquisição de bens móveis,"33000000-0, Equipamento médico, medicamentos e produtos para cuidados pessoais","Centro Hospitalar de Lisboa Central, E. P. E. (508080142)",LUSOPALEX LDA. (503531588),"36.000,00 €",04-08-2017,13-07-2017,171 dias,"Portugal, Lisboa, Lisboa","Artigo 20.º, n.º 1, alínea a) do Código dos Contratos Públicos",,,,,,Não aplicável.,Não aplicável.,FALSE
Balão para angioplastia,Ajuste Direto Regime Geral,Aquisição de bens móveis,"33000000-0, Equipamento médico, medicamentos e produtos para cuidados pessoais","Centro Hospitalar de Lisboa Central, E. P. E. (508080142)",Terumo Europe España SL (980472024),"23.010,00 €",04-08-2017,18-07-2017,40 dias,"Portugal, Lisboa, Lisboa","Artigo 20.º, n.º 1, alínea a) do Código dos Contratos Públicos",,,,,,Não aplicável.,Não aplicável.,FALSE
DEXAMETASONA,Ajuste Direto Regime Geral,Aquisição de bens móveis,"33000000-0, Equipamento médico, medicamentos e produtos para cuidados pessoais","Centro Hospitalar de Lisboa Central, E. P. E. (508080142)","BDRPHARMA, LDA (513077332)","36.000,00 €",04-08-2017,13-07-2017,216 dias,"Portugal, Lisboa, Lisboa","Artigo 20.º, n.º 1, alínea a) do Código dos Contratos Públicos",,,,,,Não aplicável.,Não aplicável.,FALSE
DIETA MODULAR LIPIDICA-ÓLEO DE LORENZO,Ajuste Direto Regime Geral,Aquisição de bens móveis,"33000000-0, Equipamento médico, medicamentos e produtos para cuidados pessoais","Centro Hospitalar de Lisboa Central, E. P. E. (508080142)",NUTRÍCIA ADVANCED MEDICAL NUTICION – UNIPESSOAL LDA (507558286),"6.129,72 €",04-08-2017,27-04-2017,216 dias,"Portugal, Lisboa, Lisboa","Artigo 20.º, n.º 1, alínea a) do Código dos Contratos Públicos",,,,,,Não aplicável.,Não aplicável.,FALSE
Miglustate,Ajuste Direto Regime Geral,Aquisição de bens móveis,"33000000-0, Equipamento médico, medicamentos e produtos para cuidados pessoais","Centro Hospitalar de Lisboa Central, E. P. E. (508080142)","Actelion Pharmaceuticals Portugal, Lda. (507336488)","17.760,00 €",04-08-2017,09-06-2017,216 dias,"Portugal, Lisboa, Lisboa","Artigo 20.º, n.º 1, alínea a) do Código dos Contratos Públicos",,,,,,Não aplicável.,Não aplicável.,FALSE
PENTOSTATINA 10 MG,Ao abrigo de acordo-quadro (art.º 259.º),Aquisição de bens móveis,"33000000-0, Equipamento médico, medicamentos e produtos para cuidados pessoais","Centro Hospitalar de Lisboa Central, E. P. E. (508080142)","LABORATÓRIOS PFIZER, LDA. (500162166)","6.484,80 €",03-08-2017,11-07-2017,215 dias,"Portugal, Lisboa, Lisboa",Artigo 259.º do Código dos Contratos Públicos,,,,,,1771819,CP 2015/6 - Acordo quadro para o fornecimento de Medicamentos do Foro Oncológico,FALSE
OCRIPLASMINA,Ajuste Direto Regime Geral,Aquisição de bens móveis,"33000000-0, Equipamento médico, medicamentos e produtos para cuidados pessoais","Centro Hospitalar de Lisboa Central, E. P. E. (508080142)","Novartis Farma - Produtos Farmacêuticos, S.A. (500063524)","2.961,80 €",03-08-2017,02-08-2017,215 dias,"Portugal, Lisboa, Lisboa","Artigo 24.º, n.º 1, alínea e) do Código dos Contratos Públicos",,,,,,Não aplicável.,Não aplicável.,FALSE
"OBRAS DE BENEFICIAÇÃO DO SERVIÇO DE PMA DO CHLC, EPE (MAC)",Concurso público,Empreitadas de obras públicas,"45000000-7, Construção","Centro Hospitalar de Lisboa Central, E. P. E. (508080142)","Efima - Eficiência, Instalações e Manutenção, Lda (513097759)","226.868,77 €",03-08-2017,05-07-2017,30 dias,"Portugal, Lisboa, Lisboa","Artigo 19.º, alínea b) do Código dos Contratos Públicos",,,,,,Não aplicável.,Não aplicável.,FALSE
Bevacizumab,Ao abrigo de acordo-quadro (art.º 259.º),Aquisição de bens móveis,"33000000-0, Equipamento médico, medicamentos e produtos para cuidados pessoais","Centro Hospitalar de Lisboa Central, E. P. E. (508080142)","Roche Farmacêutica Química, Lda. (500233810)","7.479,00 €",03-08-2017,02-08-2017,215 dias,"Portugal, Lisboa, Lisboa",Artigo 259.º do Código dos Contratos Públicos,,,,,,1771819,CP 2015/6 - Acordo quadro para o fornecimento de Medicamentos do Foro Oncológico,FALSE
Detecção de MRSA e Carbapenemases por Biologia Molecular em produtos biológicos,Ajuste Direto Regime Geral,Aquisição de bens móveis,"33696500-0, Reagentes de laboratório","Centro Hospitalar de Lisboa Central, E. P. E. (508080142)","Werfen Portugal, Lda (501086110)","34.200,00 €",02-08-2017,18-07-2017,200 dias,"Portugal, Lisboa, Lisboa","Artigo 20.º, n.º 1, alínea a) do Código dos Contratos Públicos",,,,,,Não aplicável.,Não aplicável.,FALSE
"Microguias 0.008""""  e  Microespiras 0.010""""",Ajuste Direto Regime Geral,Aquisição de bens móveis,"33000000-0, Equipamento médico, medicamentos e produtos para cuidados pessoais","Centro Hospitalar de Lisboa Central, E. P. E. (508080142)",World Médica S.L. (B-82612599),"33.250,00 €",02-08-2017,10-07-2017,120 dias,"Portugal, Lisboa, Lisboa","Artigo 20.º, n.º 1, alínea a) do Código dos Contratos Públicos",,,,,,Não aplicável.,Não aplicável.,FALSE
"DEXTRANOMERO,AC.HIALURONICO,FR/AMP. 1ML+SERINGA P/ ADM. DEXTRANÓMERO C/ ÁC. HIALURÓNICO",Ajuste Direto Regime Geral,Aquisição de bens móveis,"33000000-0, Equipamento médico, medicamentos e produtos para cuidados pessoais","Centro Hospitalar de Lisboa Central, E. P. E. (508080142)","PROFARIN-DIST.FARMAC.IND.,LDA. (500223238)","11.461,25 €",02-08-2017,31-07-2017,245 dias,"Portugal, Lisboa, Lisboa","Artigo 20.º, n.º 1, alínea a) do Código dos Contratos Públicos",,,,,,Não aplicável.,Não aplicável.,FALSE
APOMORFINA 5 MG/ML SOL INJ FR 20 ML SC,Ajuste Direto Regime Geral,Aquisição de bens móveis,"33000000-0, Equipamento médico, medicamentos e produtos para cuidados pessoais","Centro Hospitalar de Lisboa Central, E. P. E. (508080142)","Laboratório Farmacêuticos Rovi, S.A. (980166705)","7.120,80 €",02-08-2017,13-07-2017,215 dias,"Portugal, Lisboa, Lisboa","Artigo 20.º, n.º 1, alínea a) do Código dos Contratos Públicos",,,,,,Não aplicável.,Não aplicável.,FALSE
Guias angioplastia coronária,Ajuste Direto Regime Geral,Aquisição de bens móveis,"33000000-0, Equipamento médico, medicamentos e produtos para cuidados pessoais","Centro Hospitalar de Lisboa Central, E. P. E. (508080142)",World Médica (B-82612599),"8.300,00 €",01-08-2017,01-08-2017,120 dias,"Portugal, Lisboa, Lisboa","Artigo 20.º, n.º 1, alínea a) do Código dos Contratos Públicos",,,,,,Não aplicável.,Não aplicável.,FALSE
