Objeto do Contrato,Tipo de Procedimento,Tipo(s) de Contrato,CPVs,Entidade(s) Adjudicante(s),Entidade(s) Adjudicatária(s),Preço Contratual,Data de Publicação,Data de Celebração do Contrato,Prazo de Execução,Local de Execução,Fundamentação,Data de Fecho do Contrato,Preço Total Efetivo,Causas das Alterações ao Prazo,Causas das Alterações ao Preço,Estado,N.º registo do Acordo Quadro,Descrição do Acordo Quadro,Procedimento Centralizado
Aquisição de serviços de radiologia - Baixo Tâmega / ARSN,Ajuste Direto Regime Geral,Aquisição de serviços,"79620000-6, Serviços de fornecimento de pessoal, inclusive temporário","Administração Regional de Saúde do Norte, I. P. (503135593)","Labirinto Magnético, LDA (510521460)","41.595,84 €",02-08-2016,12-02-2016,366 dias,"Portugal, Porto, Amarante","Artigo 24.º, n.º 1, alínea c) do Código dos Contratos Públicos",31-12-2016,"41.595,84 €",,,,Não aplicável.,Não aplicável.,FALSE
Aquisição de serviços técnicos de radiologia- Serviço de Urgência Básica de Cinfães - ACES Baixo Tâmega,Ajuste Direto Regime Geral,Aquisição de serviços,"85140000-2, Serviços de saúde diversos","Administração Regional de Saúde do Norte, I. P. (503135593)","Labirinto Magnético, lda (510521460)","6,06 €",26-11-2013,07-11-2013,92 dias,"Portugal, Viseu, Cinfães","Artigo 20.º, n.º 1, alínea a) do Código dos Contratos Públicos",31-12-2013,"6,06 €",,,,Não aplicável.,Não aplicável.,
