Objeto do Contrato,Tipo de Procedimento,Tipo(s) de Contrato,CPVs,Entidade(s) Adjudicante(s),Entidade(s) Adjudicatária(s),Preço Contratual,Data de Publicação,Data de Celebração do Contrato,Prazo de Execução,Local de Execução,Fundamentação,Data de Fecho do Contrato,Preço Total Efetivo,Causas das Alterações ao Prazo,Causas das Alterações ao Preço,Estado,N.º registo do Acordo Quadro,Descrição do Acordo Quadro,Procedimento Centralizado
Aquisição de serviços de assessoria jurídica para o INSA,Ajuste Direto Regime Geral,Aquisição de serviços,"73200000-4, Serviços de consultoria em matéria de investigação e desenvolvimento","Instituto Nacional de Saúde Doutor Ricardo Jorge, I. P. (501427511)","Bruno Dias & Maria João Mendes, Associados (508966094)","14.580,00 €",13-11-2015,02-10-2015,91 dias,"Portugal, Setúbal, Setúbal<BR/>Portugal, Porto, Porto<BR/>Portugal, Lisboa, Lisboa","Artigo 20.º, n.º 1, alínea a) do Código dos Contratos Públicos",,,,,,Não aplicável.,Não aplicável.,FALSE
Aquisição de auriculares com bluetooth para o INSA,Ajuste Direto Regime Geral,Aquisição de bens móveis,"32570000-9, Equipamento para comunicações","Instituto Nacional de Saúde Doutor Ricardo Jorge, I. P. (501427511)","MEO - Serviços de Comunicação e Multimédia, SA (504615947)","129,44 €",13-11-2015,13-10-2015,90 dias,"Portugal, Lisboa, Lisboa","Artigo 20.º, n.º 1, alínea a) do Código dos Contratos Públicos",,,,,,Não aplicável.,Não aplicável.,FALSE
Aquisição de reagentes para o rastreio neonatal no INSA Porto,Ajuste Direto Regime Geral,Aquisição de bens móveis,"33696500-0, Reagentes de laboratório",Instituto Nacional de Saúde Dr.Ricardo Jorge(INSA) (501427511),"ILC - Instrumentos de Laboratório e Científicos, Lda (500948208)","18.220,00 €",13-11-2015,26-10-2015,90 dias,"Portugal, Porto, Porto","Artigo 20.º, n.º 1, alínea a) do Código dos Contratos Públicos",,,,,,Não aplicável.,Não aplicável.,FALSE
Aquisição de serviços de pintura da sala de reuniões do Conselho Directivo do INSA,Ajuste Direto Regime Geral,Aquisição de serviços,"50000000-5, Serviços de reparação e manutenção","Instituto Nacional de Saúde Doutor Ricardo Jorge, I. P. (501427511)","Gofermode, Lda (510247474)","500,00 €",13-11-2015,20-10-2015,90 dias,"Portugal, Lisboa, Lisboa","Artigo 20.º, n.º 1, alínea a) do Código dos Contratos Públicos",,,,,,Não aplicável.,Não aplicável.,FALSE
Aquisição de reagentes para cultura de tecidos,Ajuste Direto Regime Geral,Aquisição de bens móveis,"33696500-0, Reagentes de laboratório",Instituto Nacional de Saúde Dr.Ricardo Jorge(INSA) (501427511),"Alfagene - Novas Tecnologias das Ciências da Vida, Lda (503387398)","4.342,32 €",13-11-2015,21-10-2015,90 dias,"Portugal, Lisboa, Lisboa","Artigo 26.º, n.º 1, alínea a) do Código dos Contratos Públicos",,,,,,Não aplicável.,Não aplicável.,FALSE
Aquisição de tubos de PBS para o DGH do INSA,Ajuste Direto Regime Geral,Aquisição de bens móveis,"33100000-1, Equipamento médico","Instituto Nacional de Saúde Doutor Ricardo Jorge, I. P. (501427511)","Dynamic-MR Equipamentos de Laboratório e Serviços, Lda (510757774)","450,00 €",13-11-2015,20-10-2015,90 dias,"Portugal, Lisboa, Lisboa","Artigo 26.º, n.º 1, alínea a) do Código dos Contratos Públicos",,,,,,Não aplicável.,Não aplicável.,FALSE
"Empreitada de obras publicas para remodelação dos laboratórios BSL 3 para o Instituto Nacional de Saúde Doutor Ricardo Jorge, I.P.",Concurso público,Empreitadas de obras públicas,"45454000-4, Obras de reestruturação",Instituto Nacional de Saúde Dr.Ricardo Jorge(INSA) (501427511),"Gofermode, Lda (510247474)","21.158,36 €",13-11-2015,14-09-2015,67 dias,"Portugal, Lisboa, Lisboa","Artigo 19.º, alínea b) do Código dos Contratos Públicos",,,,,,Não aplicável.,Não aplicável.,FALSE
Aquisição de vestuário de uso diário e de protecção,Concurso público,Aquisição de bens móveis,"18100000-0, Vestuário profissional, vestuário de trabalho especial e acessórios","Instituto Nacional de Saúde Doutor Ricardo Jorge, I. P. (501427511)","Daylife, Lda (513057641)","5.930,35 €",12-11-2015,23-10-2015,90 dias,"Portugal, Lisboa, Lisboa","Artigo 20.º, n.º 1, alínea b) do Código dos Contratos Públicos",,,,,,Não aplicável.,Não aplicável.,FALSE
Aquisição de vestuário de uso diário e de protecção,Concurso público,Aquisição de bens móveis,"18100000-0, Vestuário profissional, vestuário de trabalho especial e acessórios","Instituto Nacional de Saúde Doutor Ricardo Jorge, I. P. (501427511)","Moredis, Lda (508647568)","643,80 €",12-11-2015,23-10-2015,90 dias,"Portugal, Lisboa, Lisboa","Artigo 20.º, n.º 1, alínea b) do Código dos Contratos Públicos",,,,,,Não aplicável.,Não aplicável.,FALSE
Aquisição de enzima decilubiquinona para o DG-URN Porto,Ajuste Direto Regime Geral,Aquisição de bens móveis,"33100000-1, Equipamento médico","Instituto Nacional de Saúde Doutor Ricardo Jorge, I. P. (501427511)","Grupo Taper - Equipamentos de precisão científica, Lda (506886336)","250,00 €",12-11-2015,02-10-2015,90 dias,"Portugal, Lisboa, Lisboa","Artigo 20.º, n.º 1, alínea a) do Código dos Contratos Públicos",,,,,,Não aplicável.,Não aplicável.,FALSE
Aquisição de serviços para ensaios do P3 para o INSA,Ajuste Direto Regime Geral,Aquisição de serviços,"73111000-3, Serviços relacionados com laboratórios de investigação",Instituto Nacional de Saúde Dr.Ricardo Jorge(INSA) (501427511),"Tradelabor, Lda (503069442)","1.940,00 €",12-11-2015,26-10-2015,90 dias,"Portugal, Lisboa, Lisboa","Artigo 20.º, n.º 1, alínea a) do Código dos Contratos Públicos",,,,,,Não aplicável.,Não aplicável.,FALSE
Aquisição de material de esterilização eliminação e proteção para o INSA,Concurso público,Aquisição de bens móveis,"33140000-3, Material médico de consumo","Instituto Nacional de Saúde Dr. Ricardo Jorge, I. P. (501427511)","VWR Internacional, Lda (503842770)","10.761,59 €",12-11-2015,16-06-2015,90 dias,"Portugal, Lisboa, Lisboa<BR/>Portugal, Setúbal, Setúbal<BR/>Portugal, Porto, Porto","Artigo 20.º, n.º 1, alínea b) do Código dos Contratos Públicos",,,,,,Não aplicável.,Não aplicável.,FALSE
Aquisição de bens para fins exclusivos de investigação no INSA,Ajuste Direto Regime Geral,Aquisição de bens móveis,"33140000-3, Material médico de consumo","Instituto Nacional de Saúde Doutor Ricardo Jorge, I. P. (501427511)","UNICAM - Sistemas Analíticos, Lda (502614625)","149,00 €",12-11-2015,29-10-2015,90 dias,"Portugal, Lisboa, Lisboa","Artigo 26.º, n.º 1, alínea b) do Código dos Contratos Públicos",,,,,,Não aplicável.,Não aplicável.,FALSE
