freguesia,acronym,validVotesPercentage,votes,dicofre
Alte,PS,53.39,252,080802
Alte,PPD/PSD,18.64,88,080802
Alte,PCP-PEV,6.14,29,080802
Alte,B.E.,5.93,28,080802
Alte,CDS-PP,4.03,19,080802
Alte,PAN,3.81,18,080802
Alte,PCTP/MRPP,2.12,10,080802
Alte,L,1.48,7,080802
Alte,PPM.PPV/CDC,1.27,6,080802
Alte,NC,0.85,4,080802
Alte,A,0.42,2,080802
Alte,IL,0.42,2,080802
Alte,MAS,0.42,2,080802
Alte,PTP,0.42,2,080802
Alte,PDR,0.21,1,080802
Alte,PNR,0.21,1,080802
Alte,PURP,0.21,1,080802
