Objeto do Contrato,Tipo de Procedimento,Tipo(s) de Contrato,CPVs,Entidade(s) Adjudicante(s),Entidade(s) Adjudicatária(s),Preço Contratual,Data de Publicação,Data de Celebração do Contrato,Prazo de Execução,Local de Execução,Fundamentação,Data de Fecho do Contrato,Preço Total Efetivo,Causas das Alterações ao Prazo,Causas das Alterações ao Preço,Estado,N.º registo do Acordo Quadro,Descrição do Acordo Quadro,Procedimento Centralizado
material laboratório - anatomia,Consulta Prévia,Aquisição de bens móveis,"33700000-7, Produtos para cuidados pessoais","Centro Hospitalar de Setúbal, E. P. E. (507606787)",VWR INTERNATIONAL (503842770),"6.489,62 €",31-01-2019,28-01-2019,365 dias,"Portugal, Setúbal, Setúbal","Artigo 20.º, n.º 1, alínea c) do Código dos Contratos Públicos",,,,,,Não aplicável.,Não aplicável.,FALSE
material laboratório - anatomia,Consulta Prévia,Aquisição de bens móveis,"33160000-9, Técnicas cirúrgicas","Centro Hospitalar de Setúbal, E. P. E. (507606787)",Normax (500203130),"951,30 €",31-01-2019,28-01-2019,365 dias,"Portugal, Setúbal, Setúbal","Artigo 20.º, n.º 1, alínea c) do Código dos Contratos Públicos",,,,,,Não aplicável.,Não aplicável.,FALSE
material laboratório - anatomia,Consulta Prévia,Aquisição de bens móveis,"33141000-0, Material médico não químico descartável e produtos hematológicos","Centro Hospitalar de Setúbal, E. P. E. (507606787)",j.m. -imp.rep.lda (504855107),"158,32 €",31-01-2019,28-01-2019,365 dias,"Portugal, Setúbal, Setúbal","Artigo 20.º, n.º 1, alínea c) do Código dos Contratos Públicos",,,,,,Não aplicável.,Não aplicável.,FALSE
material laboratório - anatomia,Consulta Prévia,Aquisição de bens móveis,"33000000-0, Equipamento médico, medicamentos e produtos para cuidados pessoais","Centro Hospitalar de Setúbal, E. P. E. (507606787)","Enzifarma-Diagnostica e Farmaceutica, SA (503636975)","270,00 €",31-01-2019,28-01-2019,365 dias,"Portugal, Setúbal, Setúbal","Artigo 20.º, n.º 1, alínea c) do Código dos Contratos Públicos",,,,,,Não aplicável.,Não aplicável.,FALSE
material laboratório - anatomia,Consulta Prévia,Aquisição de bens móveis,"33140000-3, Material médico de consumo","Centro Hospitalar de Setúbal, E. P. E. (507606787)",AZOLAB-COM.MAT.LAB.LDA (506332918),"62,11 €",31-01-2019,28-01-2019,365 dias,"Portugal, Setúbal, Setúbal","Artigo 20.º, n.º 1, alínea c) do Código dos Contratos Públicos",,,,,,Não aplicável.,Não aplicável.,FALSE
PAPEL DE CONSUMO HOTELEIRO PARA O ANO 2019,Consulta Prévia,Aquisição de bens móveis,"33760000-5, Papel higiénico, lenços, toalhas de mão e guardanapos","Centro Hospitalar de Setúbal, E. P. E. (507606787)","SERVISAN - PROD DE HIGIENE, SA (500246530)","24.743,10 €",29-01-2019,10-01-2019,365 dias,"Portugal, Setúbal, Setúbal","Artigo 20.º, n.º 1, alínea c) do Código dos Contratos Públicos",,,,,,Não aplicável.,Não aplicável.,FALSE
PAPEL DE CONSUMO HOTELEIRO PARA O ANO 2019,Consulta Prévia,Aquisição de bens móveis,"33771000-5, Produtos sanitários de papel","Centro Hospitalar de Setúbal, E. P. E. (507606787)","MUC, LDA (502379308)","7.921,00 €",29-01-2019,10-01-2019,365 dias,"Portugal, Setúbal, Setúbal","Artigo 20.º, n.º 1, alínea c) do Código dos Contratos Públicos",,,,,,Não aplicável.,Não aplicável.,FALSE
PAPEL DE CONSUMO HOTELEIRO PARA O ANO 2019,Consulta Prévia,Aquisição de bens móveis,"33700000-7, Produtos para cuidados pessoais","Centro Hospitalar de Setúbal, E. P. E. (507606787)","MAX ONE MAT ESCRITÓRIO, LDA (507052609)","5.576,00 €",29-01-2019,10-01-2019,365 dias,"Portugal, Setúbal, Setúbal","Artigo 20.º, n.º 1, alínea c) do Código dos Contratos Públicos",,,,,,Não aplicável.,Não aplicável.,FALSE
PAPEL DE CONSUMO HOTELEIRO PARA O ANO 2019,Consulta Prévia,Aquisição de bens móveis,"33000000-0, Equipamento médico, medicamentos e produtos para cuidados pessoais","Centro Hospitalar de Setúbal, E. P. E. (507606787)","EXCACLEAN, LDA (508758190)","41,50 €",29-01-2019,10-01-2019,365 dias,"Portugal, Setúbal, Setúbal","Artigo 20.º, n.º 1, alínea c) do Código dos Contratos Públicos",,,,,,Não aplicável.,Não aplicável.,FALSE
Sofosbuvir 400 mg + Velpatasvir 100 mg + Voxilaprevir 100 mg Comp,Ao abrigo de acordo-quadro (art.º 259.º),Aquisição de bens móveis,"33600000-6, Produtos farmacêuticos","Centro Hospitalar de Setúbal, E. P. E. (507606787)","GILEAD SCIENCES, LDA. (503604704)","92.366,40 €",21-01-2019,11-01-2019,10 dias,"Portugal, Setúbal, Setúbal",Artigo 259.º do Código dos Contratos Públicos,,,,,,3023927,CP 2017/67 - Medicamentos para a Hepatite C crónica,FALSE
Citarabina 100 mg/ml Sol inj Fr 20 ml IV Dexametasona 700 µg Impl intravítreo Aplic Intravítreo,Ajuste Direto Regime Geral,Aquisição de bens móveis,"33600000-6, Produtos farmacêuticos","Centro Hospitalar de Setúbal, E. P. E. (507606787)","Profarin, Lda. (500223238), FRESENIUS KABI PHARMA PORTUGAL, LDª (504293753)","4.400,20 €",21-01-2019,17-01-2019,10 dias,"Portugal, Setúbal, Setúbal","Artigo 21.º, n.º 1, alínea c) do Código dos Contratos Públicos",,,,,,Não aplicável.,Não aplicável.,FALSE
