freguesia,acronym,validVotesPercentage,votes,dicofre
Fradizela,PS,40.86,38,040714
Fradizela,PPD/PSD,35.48,33,040714
Fradizela,CDS-PP,10.75,10,040714
Fradizela,B.E.,4.3,4,040714
Fradizela,PAN,2.15,2,040714
Fradizela,PCP-PEV,2.15,2,040714
Fradizela,PDR,2.15,2,040714
Fradizela,A,1.08,1,040714
Fradizela,PCTP/MRPP,1.08,1,040714
Fradizela,IL,0,0,040714
Fradizela,L,0,0,040714
Fradizela,MAS,0,0,040714
Fradizela,NC,0,0,040714
Fradizela,PNR,0,0,040714
Fradizela,PPM.PPV/CDC,0,0,040714
Fradizela,PTP,0,0,040714
Fradizela,PURP,0,0,040714
