freguesia,acronym,validVotesPercentage,votes,dicofre
Calheta,PS,46.81,198,450101
Calheta,PPD/PSD,26,110,450101
Calheta,CDS-PP,9.93,42,450101
Calheta,B.E.,5.67,24,450101
Calheta,PCP-PEV,4.73,20,450101
Calheta,PAN,3.07,13,450101
Calheta,A,0.95,4,450101
Calheta,PNR,0.95,4,450101
Calheta,CH,0.47,2,450101
Calheta,PCTP/MRPP,0.47,2,450101
Calheta,PPM,0.47,2,450101
Calheta,IL,0.24,1,450101
Calheta,MAS,0.24,1,450101
Calheta,L,0,0,450101
Calheta,MPT,0,0,450101
Calheta,PDR,0,0,450101
Calheta,PTP,0,0,450101
