Objeto do Contrato,Tipo de Procedimento,Tipo(s) de Contrato,CPVs,Entidade(s) Adjudicante(s),Entidade(s) Adjudicatária(s),Preço Contratual,Data de Publicação,Data de Celebração do Contrato,Prazo de Execução,Local de Execução,Fundamentação,Data de Fecho do Contrato,Preço Total Efetivo,Causas das Alterações ao Prazo,Causas das Alterações ao Preço,Estado,N.º registo do Acordo Quadro,Descrição do Acordo Quadro,Procedimento Centralizado
Aquisição material cirurgico,Ajuste Direto Regime Geral,Aquisição de bens móveis,"33141121-4, Suturas cirúrgicas",Hospital Dr. Francisco Zagalo (501510150),"B. BRAUN MEDICAL, LDA (501506543)","3.809,81 €",10-01-2018,03-08-2017,120 dias,"Portugal, Aveiro, Ovar","Artigo 20.º, n.º 1, alínea a) do Código dos Contratos Públicos",29-12-2017,"3.809,81 €",,"",,Não aplicável.,Não aplicável.,FALSE
Aquisição material cirurgico,Ajuste Direto Regime Geral,Aquisição de bens móveis,"33141121-4, Suturas cirúrgicas",Hospital Dr. Francisco Zagalo (501510150),"HR HOSPITALAR, UNIPESSOAL, LDA     (501895558)","263,52 €",10-01-2018,03-08-2017,120 dias,"Portugal, Aveiro, Ovar","Artigo 20.º, n.º 1, alínea a) do Código dos Contratos Públicos",29-12-2017,"263,52 €",,"",,Não aplicável.,Não aplicável.,FALSE
Aquisição material consumo clinico diverso,Ajuste Direto Regime Geral,Aquisição de bens móveis,"33140000-3, Material médico de consumo",Hospital Dr. Francisco Zagalo (501510150),Endotécnica (503818348),"220,00 €",10-01-2018,03-08-2017,120 dias,"Portugal, Aveiro, Ovar","Artigo 20.º, n.º 1, alínea a) do Código dos Contratos Públicos","","",,"",,Não aplicável.,Não aplicável.,FALSE
Aquisição material consumo clinico diverso,Ajuste Direto Regime Geral,Aquisição de bens móveis,"33140000-3, Material médico de consumo",Hospital Dr. Francisco Zagalo (501510150),AVIQUIMICA (500039720),"94,50 €",10-01-2018,03-08-2017,120 dias,"Portugal, Aveiro, Ovar","Artigo 20.º, n.º 1, alínea a) do Código dos Contratos Públicos","","",,"",,Não aplicável.,Não aplicável.,FALSE
Aquisição material ligamentoplastia,Ajuste Direto Regime Geral,Aquisição de bens móveis,"33183000-6, Material de assistência ortopédica",Hospital Dr. Francisco Zagalo (501510150),STRYKER (504594214),"4.704,00 €",10-01-2018,03-02-2017,330 dias,"Portugal, Aveiro, Ovar","Artigo 20.º, n.º 1, alínea a) do Código dos Contratos Públicos",29-12-2017,"4.704,00 €",,"",,Não aplicável.,Não aplicável.,FALSE
Aquisição material oftalmologia,Ajuste Direto Regime Geral,Aquisição de bens móveis,"33730000-6, Produtos para o cuidado dos olhos e lentes de correcção",Hospital Dr. Francisco Zagalo (501510150),"Bausch & Lomb, S. A. (980218764)","10.820,00 €",09-01-2018,04-12-2017,360 dias,"Portugal, Aveiro, Ovar","Artigo 24.º, n.º 1, alínea e) do Código dos Contratos Públicos",29-12-2017,"10.820,00 €",,"",,Não aplicável.,Não aplicável.,FALSE
Aquisição material consumo clinico,Ajuste Direto Regime Geral,Aquisição de bens móveis,"33140000-3, Material médico de consumo",Hospital Dr. Francisco Zagalo (501510150),"PORTO SAUDE, LDA (502927178)","2.988,00 €",08-01-2018,28-12-2017,3 dias,"Portugal, Aveiro, Ovar","Artigo 20.º, n.º 1, alínea a) do Código dos Contratos Públicos",29-12-2017,"2.988,00 €",,"",,Não aplicável.,Não aplicável.,FALSE
Aquisição material consumo clinico,Ajuste Direto Regime Geral,Aquisição de bens móveis,"33140000-3, Material médico de consumo",Hospital Dr. Francisco Zagalo (501510150),Feiramédica (503731900),"262,20 €",08-01-2018,28-12-2017,3 dias,"Portugal, Aveiro, Ovar","Artigo 20.º, n.º 1, alínea a) do Código dos Contratos Públicos",29-12-2017,"262,20 €",,"",,Não aplicável.,Não aplicável.,FALSE
51001817 - AQUISIÇÃO DE GASES MEDICINAIS,Ajuste Direto Regime Geral,Aquisição de bens móveis,"24111000-5, Hidrogénio, árgon, gases raros, azoto e oxigénio",Hospital Dr. Francisco Zagalo (501510150),ACAIL GAS SA (503789151),"7.787,42 €",08-01-2018,20-08-2017,150 dias,"Portugal, Aveiro, Ovar","Artigo 20.º, n.º 1, alínea a) do Código dos Contratos Públicos",29-12-2017,"7.787,42 €",,"",,Não aplicável.,Não aplicável.,FALSE
51000117 - MEDICAMENTOS C/CHNM,Ajuste Direto Regime Geral,Aquisição de bens móveis,"33690000-3, Medicamentos vários",Hospital Dr. Francisco Zagalo (501510150),"SANOFI - PRODUTOS FARMACÊUTICOS, LDA. (500134960)","12.113,61 €",03-01-2018,16-01-2017,350 dias,"Portugal, Aveiro, Ovar","Artigo 20.º, n.º 1, alínea a) do Código dos Contratos Públicos",29-12-2017,"12.113,61 €",,"",,Não aplicável.,Não aplicável.,FALSE
AD 45001317 Aquisição material economato,Ajuste Direto Regime Geral,Aquisição de bens móveis,"30192000-1, Material de escritório",Hospital Dr. Francisco Zagalo (501510150),"BUROTICA-SOC.EST. E EQUIP.,SA (501178503)","69,14 €",03-01-2018,03-11-2017,30 dias,"Portugal, Aveiro, Ovar","Artigo 20.º, n.º 1, alínea a) do Código dos Contratos Públicos",27-12-2017,"69,14 €",,"",,Não aplicável.,Não aplicável.,FALSE
AD 45001317 Aquisição material economato,Ajuste Direto Regime Geral,Aquisição de bens móveis,"30192000-1, Material de escritório",Hospital Dr. Francisco Zagalo (501510150),"ENVELOPRINTER,LDA (508469830)","79,50 €",03-01-2018,03-11-2017,30 dias,"Portugal, Aveiro, Ovar","Artigo 20.º, n.º 1, alínea a) do Código dos Contratos Públicos",27-12-2017,"79,50 €",,"",,Não aplicável.,Não aplicável.,FALSE
AD 45001317 Aquisição material economato,Ajuste Direto Regime Geral,Aquisição de bens móveis,"30192000-1, Material de escritório",Hospital Dr. Francisco Zagalo (501510150),"Seabra Tavares, Lda (501823212)","65,60 €",03-01-2018,03-11-2017,30 dias,"Portugal, Aveiro, Ovar","Artigo 20.º, n.º 1, alínea a) do Código dos Contratos Públicos",27-12-2017,"65,60 €",,"",,Não aplicável.,Não aplicável.,FALSE
AD 45001317 Aquisição material economato,Ajuste Direto Regime Geral,Aquisição de bens móveis,"30192000-1, Material de escritório",Hospital Dr. Francisco Zagalo (501510150),JMV (501887148),"96,00 €",03-01-2018,03-11-2017,30 dias,"Portugal, Aveiro, Ovar","Artigo 20.º, n.º 1, alínea a) do Código dos Contratos Públicos",27-12-2017,"96,00 €",,"",,Não aplicável.,Não aplicável.,FALSE
AD 45001317 Aquisição material economato,Ajuste Direto Regime Geral,Aquisição de bens móveis,"30192000-1, Material de escritório",Hospital Dr. Francisco Zagalo (501510150),"Papelaria Carvalho, Lda (500211248)","15,00 €",03-01-2018,03-11-2017,30 dias,"Portugal, Aveiro, Ovar","Artigo 20.º, n.º 1, alínea a) do Código dos Contratos Públicos",27-12-2017,"15,00 €",,"",,Não aplicável.,Não aplicável.,FALSE
51000117 - MEDICAMENTOS C/ CHNM,Ajuste Direto Regime Geral,Aquisição de bens móveis,"33690000-3, Medicamentos vários",Hospital Dr. Francisco Zagalo (501510150),"Takeda - Farmacêuticos Portugal, Lda. (502801204)","276,10 €",02-01-2018,16-01-2017,350 dias,"Portugal, Aveiro, Ovar","Artigo 20.º, n.º 1, alínea a) do Código dos Contratos Públicos",29-12-2017,"276,10 €",,"",,Não aplicável.,Não aplicável.,FALSE
51000117 - MEDICAMENTOS C/ CHNM,Ajuste Direto Regime Geral,Aquisição de bens móveis,"33690000-3, Medicamentos vários",Hospital Dr. Francisco Zagalo (501510150),Bluefish Pharmaceuticals AB (509426590),"35,05 €",02-01-2018,16-01-2017,350 dias,"Portugal, Aveiro, Ovar","Artigo 20.º, n.º 1, alínea a) do Código dos Contratos Públicos",29-12-2017,"35,05 €",,"",,Não aplicável.,Não aplicável.,FALSE
51000117 - MEDICAMENTOS C/ CHNM,Ajuste Direto Regime Geral,Aquisição de bens móveis,"33690000-3, Medicamentos vários",Hospital Dr. Francisco Zagalo (501510150),BLUEMED (509912060),"1.419,60 €",02-01-2018,16-01-2017,350 dias,"Portugal, Aveiro, Ovar","Artigo 20.º, n.º 1, alínea a) do Código dos Contratos Públicos",29-12-2017,"1.419,60 €",,"",,Não aplicável.,Não aplicável.,FALSE
51000117 - MEDICAMENTOS C/ CHNM,Ajuste Direto Regime Geral,Aquisição de bens móveis,"33690000-3, Medicamentos vários",Hospital Dr. Francisco Zagalo (501510150),OM PHARMA S.A (500207410),"240,00 €",02-01-2018,16-01-2017,350 dias,"Portugal, Aveiro, Ovar","Artigo 20.º, n.º 1, alínea a) do Código dos Contratos Públicos",29-12-2017,"240,00 €",,"",,Não aplicável.,Não aplicável.,FALSE
51000117 - MEDICAMENTOS C/ CHNM,Ajuste Direto Regime Geral,Aquisição de bens móveis,"33690000-3, Medicamentos vários",Hospital Dr. Francisco Zagalo (501510150),"PHARMAKERN PORTUGAL, LDA. (507002571)","209,76 €",02-01-2018,16-01-2017,350 dias,"Portugal, Aveiro, Ovar","Artigo 20.º, n.º 1, alínea a) do Código dos Contratos Públicos",29-12-2017,"209,76 €",,"",,Não aplicável.,Não aplicável.,FALSE
51000117 - MEDICAMENTOS C/ CHNM,Ajuste Direto Regime Geral,Aquisição de bens móveis,"33690000-3, Medicamentos vários",Hospital Dr. Francisco Zagalo (501510150),"AUROVITAS UNIPESSOAL, LDA. (513053239)","253,53 €",02-01-2018,16-01-2017,350 dias,"Portugal, Aveiro, Ovar","Artigo 20.º, n.º 1, alínea a) do Código dos Contratos Públicos",29-12-2017,"253,53 €",,"",,Não aplicável.,Não aplicável.,FALSE
51000117 - MEDICAMENTOS C/ CHNM,Ajuste Direto Regime Geral,Aquisição de bens móveis,"33690000-3, Medicamentos vários",Hospital Dr. Francisco Zagalo (501510150),"ABBVIE, LDA (510229050)","4.236,96 €",02-01-2018,16-01-2017,350 dias,"Portugal, Aveiro, Ovar","Artigo 20.º, n.º 1, alínea a) do Código dos Contratos Públicos",29-12-2017,"4.236,96 €",,"",,Não aplicável.,Não aplicável.,FALSE
51000117 - MEDICAMENTOS C/ CHNM,Ajuste Direto Regime Geral,Aquisição de bens móveis,"33690000-3, Medicamentos vários",Hospital Dr. Francisco Zagalo (501510150),"LABORATORIOS NORMON,SA (505654156)","1.882,57 €",02-01-2018,16-01-2017,350 dias,"Portugal, Aveiro, Ovar","Artigo 20.º, n.º 1, alínea a) do Código dos Contratos Públicos",29-12-2017,"1.882,57 €",,"",,Não aplicável.,Não aplicável.,FALSE
51000117 - MEDICAMENTOS C/ CHNM,Ajuste Direto Regime Geral,Aquisição de bens móveis,"33690000-3, Medicamentos vários",Hospital Dr. Francisco Zagalo (501510150),"ACCORD HEALTHCARE, UNIPESSOAL LDA (508622263)","455,34 €",02-01-2018,16-01-2017,350 dias,"Portugal, Aveiro, Ovar","Artigo 20.º, n.º 1, alínea a) do Código dos Contratos Públicos",29-12-2017,"455,34 €",,"",,Não aplicável.,Não aplicável.,FALSE
51000117 - MEDICAMENTOS C/ CHNM,Ajuste Direto Regime Geral,Aquisição de bens móveis,"33690000-3, Medicamentos vários",Hospital Dr. Francisco Zagalo (501510150),"DLA Azevedos, SA (503894427)","107,20 €",02-01-2018,16-01-2017,350 dias,"Portugal, Aveiro, Ovar","Artigo 20.º, n.º 1, alínea a) do Código dos Contratos Públicos",29-12-2017,"107,20 €",,"",,Não aplicável.,Não aplicável.,FALSE
51000117 - MEDICAMENTOS C/ CHNM,Ajuste Direto Regime Geral,Aquisição de bens móveis,"33690000-3, Medicamentos vários",Hospital Dr. Francisco Zagalo (501510150),"GENERIS-FARMACEUTICA,SA (508107997)","5.584,84 €",02-01-2018,16-01-2017,350 dias,"Portugal, Aveiro, Ovar","Artigo 20.º, n.º 1, alínea a) do Código dos Contratos Públicos",29-12-2017,"5.584,84 €",,"",,Não aplicável.,Não aplicável.,FALSE
51000117 - MEDICAMENTOS C/CHNM,Ajuste Direto Regime Geral,Aquisição de bens móveis,"33690000-3, Medicamentos vários",Hospital Dr. Francisco Zagalo (501510150),"Bioportugal, Lda (502380543)","62,50 €",02-01-2018,16-01-2017,350 dias,"Portugal, Aveiro, Ovar","Artigo 20.º, n.º 1, alínea a) do Código dos Contratos Públicos",29-12-2017,"62,50 €",,"",,Não aplicável.,Não aplicável.,FALSE
51000117 - MEDICAMENTOS C/CHNM,Ajuste Direto Regime Geral,Aquisição de bens móveis,"33690000-3, Medicamentos vários",Hospital Dr. Francisco Zagalo (501510150),"ALLOGA PORTUGAL-ARMAZENAGEM E DISTRIBUICAO FARMACEUTICA,S. UNIPESS LDA (504507230)","882,00 €",02-01-2018,16-01-2017,350 dias,"Portugal, Aveiro, Ovar","Artigo 20.º, n.º 1, alínea a) do Código dos Contratos Públicos",29-12-2017,"973,46 €",,valor superior a previsão,,Não aplicável.,Não aplicável.,FALSE
51000117 - MEDICAMENTOS C/CHNM,Ajuste Direto Regime Geral,Aquisição de bens móveis,"33690000-3, Medicamentos vários",Hospital Dr. Francisco Zagalo (501510150),SANDOZ FARMACEUTICA LDA   (506985261),"184,24 €",02-01-2018,16-01-2017,350 dias,"Portugal, Aveiro, Ovar","Artigo 20.º, n.º 1, alínea a) do Código dos Contratos Públicos",29-12-2017,"184,24 €",,"",,Não aplicável.,Não aplicável.,FALSE
51000117 - MEDICAMENTOS C/CHNM,Ajuste Direto Regime Geral,Aquisição de bens móveis,"33690000-3, Medicamentos vários",Hospital Dr. Francisco Zagalo (501510150),"LABORATORIO EDOL-PROD.FARMACEUTICOS, SA (507072642)","135,50 €",02-01-2018,16-01-2017,350 dias,"Portugal, Aveiro, Ovar","Artigo 20.º, n.º 1, alínea a) do Código dos Contratos Públicos",29-12-2017,"135,50 €",,"",,Não aplicável.,Não aplicável.,FALSE
51000117 - MEDICAMENTOS C/CHNM,Ajuste Direto Regime Geral,Aquisição de bens móveis,"33690000-3, Medicamentos vários",Hospital Dr. Francisco Zagalo (501510150),"Teva Pharma - Produtos Farmacêuticos, Lda. (507045491)","1.374,06 €",02-01-2018,16-01-2017,350 dias,"Portugal, Aveiro, Ovar","Artigo 20.º, n.º 1, alínea a) do Código dos Contratos Públicos",29-12-2017,"1.374,06 €",,"",,Não aplicável.,Não aplicável.,FALSE
51000117 - MEDICAMENTOS C/CHNM,Ajuste Direto Regime Geral,Aquisição de bens móveis,"33690000-3, Medicamentos vários",Hospital Dr. Francisco Zagalo (501510150),"BAUSCH E LOMB, SA (980218764)","224,70 €",02-01-2018,16-01-2017,350 dias,"Portugal, Aveiro, Ovar","Artigo 20.º, n.º 1, alínea a) do Código dos Contratos Públicos",29-12-2017,"224,70 €",,"",,Não aplicável.,Não aplicável.,FALSE
51000117 - MEDICAMENTOS C/CHNM,Ajuste Direto Regime Geral,Aquisição de bens móveis,"33690000-3, Medicamentos vários",Hospital Dr. Francisco Zagalo (501510150),Glaxo Smithkline Consumer Healthcare (500276994),"104,16 €",02-01-2018,16-01-2017,350 dias,"Portugal, Aveiro, Ovar","Artigo 20.º, n.º 1, alínea a) do Código dos Contratos Públicos",29-12-2017,"",,valor da previsão superior as necessidades,,Não aplicável.,Não aplicável.,FALSE
