Objeto do Contrato,Tipo de Procedimento,Tipo(s) de Contrato,CPVs,Entidade(s) Adjudicante(s),Entidade(s) Adjudicatária(s),Preço Contratual,Data de Publicação,Data de Celebração do Contrato,Prazo de Execução,Local de Execução,Fundamentação,Data de Fecho do Contrato,Preço Total Efetivo,Causas das Alterações ao Prazo,Causas das Alterações ao Preço,Estado,N.º registo do Acordo Quadro,Descrição do Acordo Quadro,Procedimento Centralizado
Aquisição de exames vários MCDT efectuados a utentes em Nov. e Dez/2010,Ajuste Direto Regime Geral,Aquisição de serviços,"85140000-2, Serviços de saúde diversos",HOSPITAL DR FRANCISCO ZAGALO (501510150),ARS DE CENTRO-SUB.REGIÃO SAUDE AVEIRO (503122165),"13.574,10 €",06-01-2012,05-01-2012,60 dias,"Portugal, Aveiro, Ovar","Artigo 24.º, n.º 1, alínea b) do Código dos Contratos Públicos",05-01-2012,"13.574,10 €",,"",,Não aplicável.,Não aplicável.,
Aquisição de Exames MCDT - de Imagiologia efectuados em Dezembro/2011,Ajuste Direto Regime Geral,Aquisição de serviços,"85150000-5, Serviços de imagiologia médica",HOSPITAL DR FRANCISCO ZAGALO (501510150),DR. PINTO LEITE-INSTITUTO DE RADIOLOGIA (501396772),"7.809,00 €",06-01-2012,05-01-2012,30 dias,"Portugal, Aveiro, Ovar","Artigo 20.º, n.º 1, alínea a) do Código dos Contratos Públicos",05-01-2012,"7.809,00 €",,"",,Não aplicável.,Não aplicável.,
AQUISIÇÃO DE TRABALHO TEMPORARIO PARA ENFERMEIRO EM DEZEMBRO/2011,Ajuste Direto Regime Geral,Aquisição de serviços,"79620000-6, Serviços de fornecimento de pessoal, inclusive temporário",HOSPITAL DR FRANCISCO ZAGALO (501510150),"TONUS-TRABALHO TEMPORARIO, LDA. (508986460)","24.554,46 €",04-01-2012,03-01-2012,30 dias,"Portugal, Aveiro, Ovar","Artigo 20.º, n.º 1, alínea a) do Código dos Contratos Públicos",03-01-2012,"24.554,46 €",,"",,Não aplicável.,Não aplicável.,
Aquisição de Trabalho Temporario para assistentes operacionais para o mês de Dez/2011,Ajuste Direto Regime Geral,Aquisição de serviços,"79620000-6, Serviços de fornecimento de pessoal, inclusive temporário",HOSPITAL DR FRANCISCO ZAGALO (501510150),"TONUS-TRABALHO TEMPORARIO, LDA (508986460)","22.294,00 €",04-01-2012,03-01-2012,30 dias,"Portugal, Aveiro, Ovar","Artigo 20.º, n.º 1, alínea a) do Código dos Contratos Públicos",03-01-2012,"22.294,00 €",,"",,Não aplicável.,Não aplicável.,
Aquisição de Trabalho Temporario em Tecnicos Diagnosticos Terapeuticos para o mês de Dezembro/2011,Ajuste Direto Regime Geral,Aquisição de serviços,"79620000-6, Serviços de fornecimento de pessoal, inclusive temporário",HOSPITAL DR FRANCISCO ZAGALO (501510150),"TONUS-TRABALHO TEMPORARIO, LDA. (508986460)","6.800,84 €",04-01-2012,03-01-2012,30 dias,"Portugal, Aveiro, Ovar","Artigo 20.º, n.º 1, alínea a) do Código dos Contratos Públicos",03-01-2012,"6.800,84 €",,"",,Não aplicável.,Não aplicável.,
Pagamento do fornecimento de electricidade relativo a Dezembro/2011,Ajuste Direto Regime Geral,Aquisição de serviços,"65300000-6, Serviços de distribuição de electricidade e serviços conexos",HOSPITAL DR FRANCISCO ZAGALO (501510150),"EDP-SERVIÇO UNIVERSAL, S.A. (507846044)","6.580,05 €",04-01-2012,30-12-2011,30 dias,"Portugal, Aveiro, Ovar","Artigo 24.º, n.º 1, alínea c) do Código dos Contratos Públicos",31-12-2011,"5.349,64 €",,Calculado o valor do IVA,,Não aplicável.,Não aplicável.,
