freguesia,acronym,validVotesPercentage,votes,dicofre
União das freguesias de Adoufe e Vilarinho de Samardã,PPD/PSD.CDS-PP,36.94,290,171431
União das freguesias de Adoufe e Vilarinho de Samardã,PS,33.63,264,171431
União das freguesias de Adoufe e Vilarinho de Samardã,MPT,9.55,75,171431
União das freguesias de Adoufe e Vilarinho de Samardã,PCP-PEV,6.5,51,171431
União das freguesias de Adoufe e Vilarinho de Samardã,B.E.,3.57,28,171431
União das freguesias de Adoufe e Vilarinho de Samardã,PCTP/MRPP,1.53,12,171431
União das freguesias de Adoufe e Vilarinho de Samardã,PTP,1.4,11,171431
União das freguesias de Adoufe e Vilarinho de Samardã,MAS,1.27,10,171431
União das freguesias de Adoufe e Vilarinho de Samardã,PPV,1.27,10,171431
União das freguesias de Adoufe e Vilarinho de Samardã,PAN,1.15,9,171431
União das freguesias de Adoufe e Vilarinho de Samardã,L,0.89,7,171431
União das freguesias de Adoufe e Vilarinho de Samardã,PNR,0.76,6,171431
União das freguesias de Adoufe e Vilarinho de Samardã,PND,0.51,4,171431
União das freguesias de Adoufe e Vilarinho de Samardã,PPM,0.51,4,171431
União das freguesias de Adoufe e Vilarinho de Samardã,PDA,0.38,3,171431
União das freguesias de Adoufe e Vilarinho de Samardã,POUS,0.13,1,171431
