freguesia,acronym,validVotesPercentage,votes,dicofre
Loureiro,PS,50.12,214,170805
Loureiro,PPD/PSD,29.98,128,170805
Loureiro,B.E.,7.73,33,170805
Loureiro,CDS-PP,4.45,19,170805
Loureiro,PCP-PEV,2.11,9,170805
Loureiro,PAN,1.41,6,170805
Loureiro,CH,0.94,4,170805
Loureiro,PCTP/MRPP,0.94,4,170805
Loureiro,R.I.R.,0.94,4,170805
Loureiro,PDR,0.47,2,170805
Loureiro,A,0.23,1,170805
Loureiro,L,0.23,1,170805
Loureiro,NC,0.23,1,170805
Loureiro,PPM,0.23,1,170805
Loureiro,IL,0,0,170805
Loureiro,PNR,0,0,170805
