freguesia,acronym,validVotesPercentage,votes,dicofre
Cunha,PPD/PSD,70.4,88,181804
Cunha,CDS-PP,14.4,18,181804
Cunha,PS,11.2,14,181804
Cunha,A,0.8,1,181804
Cunha,B.E.,0.8,1,181804
Cunha,NC,0.8,1,181804
Cunha,PAN,0.8,1,181804
Cunha,PCP-PEV,0.8,1,181804
Cunha,IL,0,0,181804
Cunha,L,0,0,181804
Cunha,MAS,0,0,181804
Cunha,PCTP/MRPP,0,0,181804
Cunha,PDR,0,0,181804
Cunha,PNR,0,0,181804
Cunha,PPM.PPV/CDC,0,0,181804
Cunha,PTP,0,0,181804
Cunha,PURP,0,0,181804
