Objeto do Contrato,Tipo de Procedimento,Tipo(s) de Contrato,CPVs,Entidade(s) Adjudicante(s),Entidade(s) Adjudicatária(s),Preço Contratual,Data de Publicação,Data de Celebração do Contrato,Prazo de Execução,Local de Execução,Fundamentação,Data de Fecho do Contrato,Preço Total Efetivo,Causas das Alterações ao Prazo,Causas das Alterações ao Preço,Estado,N.º registo do Acordo Quadro,Descrição do Acordo Quadro,Procedimento Centralizado
"Aquisição de Sistemas de Monitorização de Sinais Vitais para o Centro Hospitalar de São João, EPE.",Concurso público,Aquisição de bens móveis,"33123210-3, Aparelhos para monitorização cardíaca","Centro Hospitalar de São João, E. P. E. (509821197)","Philips Portuguesa, SA (500216843)","340.000,00 €",21-02-2017,20-02-2017,45 dias,"Portugal, Porto, Porto","Artigo 20.º, n.º 1, alínea b) do Código dos Contratos Públicos",,,,,,Não aplicável.,Não aplicável.,FALSE
"Aquisição de um Morcelador Uterino para Serviço de Ginecologia/Obstetrícia do CHSJ, EPE",Ajuste Direto Regime Geral,Aquisição de bens móveis,"33162000-3, Aparelhos e instrumentos para blocos operatórios","Centro Hospitalar de São João, E. P. E. (509821197)","Moonsurge - Imp. Exp. Mat. Médico, Lda. (506657035)","8.500,00 €",21-02-2017,17-02-2017,30 dias,"Portugal, Porto, Porto","Artigo 20.º, n.º 1, alínea a) do Código dos Contratos Públicos",,,,,,Não aplicável.,Não aplicável.,FALSE
"Contrato de Contrato de Assistência Técnica ao Sistema de Gestão Documental, Kofax Workstations e Volume, e do Software Cvision Trapeze do CHSJ, EPE, para o ano de 2017",Ajuste Direto Regime Geral,Aquisição de serviços,"50000000-5, Serviços de reparação e manutenção","Centro Hospitalar de São João, E. P. E. (509821197)",WeMake-Tecnologias de Informação Lda. (506097250),"11.724,72 €",21-02-2017,27-01-2017,365 dias,"Portugal, Porto, Porto","Artigo 24.º, n.º 1, alínea e) do Código dos Contratos Públicos",,,,,,Não aplicável.,Não aplicável.,FALSE
"Contrato de Manutenção e Assistência Técnica às Câmaras de Fluxo Laminar, Salas Limpas, Hotes e Estufas de CO2 do CHSJ, EPE., para o ano de 2017",Ajuste Direto Regime Geral,Aquisição de serviços,"50000000-5, Serviços de reparação e manutenção","Centro Hospitalar de São João, E. P. E. (509821197)",TRADELABOR (503069442),"7.886,00 €",20-02-2017,17-02-2017,365 dias,"Portugal, Porto, Porto","Artigo 20.º, n.º 1, alínea a) do Código dos Contratos Públicos",,,,,,Não aplicável.,Não aplicável.,FALSE
"Aquisição de Serviços de Manutenção aos Equipamentos de Frio do CHSJ, EPE., para o ano de 2017",Ajuste Direto Regime Geral,Aquisição de serviços,"50000000-5, Serviços de reparação e manutenção","Centro Hospitalar de São João, E. P. E. (509821197)",certilab serviços de assistência (505403013),"48.616,40 €",17-02-2017,17-02-2017,365 dias,"Portugal, Porto, Porto","Artigo 20.º, n.º 1, alínea a) do Código dos Contratos Públicos",,,,,,Não aplicável.,Não aplicável.,FALSE
" Renovação do Contrato de Manutenção e Assistência Técnica do Software CMS XIO bem como o suporte ao seu Hardware, instalados no CHSJ,EPE, para o ano 2017",Ajuste Direto Regime Geral,Aquisição de serviços,"50000000-5, Serviços de reparação e manutenção","Centro Hospitalar de São João, E. P. E. (509821197)","SOCIEDADE AVANÇO, S.A. (500264236)","19.951,22 €",17-02-2017,13-01-2017,365 dias,"Portugal, Porto, Porto","Artigo 24.º, n.º 1, alínea e) do Código dos Contratos Públicos",,,,,,Não aplicável.,Não aplicável.,FALSE
"Contrato de manutenção e assistência técnica aos Intensificadores de imagem """"Zihem"""" existentes no CHSJ, EPE, para o ano de 2017",Ajuste Direto Regime Geral,Aquisição de serviços,"50000000-5, Serviços de reparação e manutenção","Centro Hospitalar de São João, E. P. E. (509821197)",IBERDATA (501904921),"2.700,00 €",17-02-2017,17-02-2017,365 dias,"Portugal, Porto, Porto","Artigo 24.º, n.º 1, alínea e) do Código dos Contratos Públicos",,,,,,Não aplicável.,Não aplicável.,FALSE
"Renovação do Contrato de Manutenção e Assistência Técnica às Mesas Operatórias """"Maquet"""" existentes do CHSJ, EPE. para o ano de 2017",Ajuste Direto Regime Geral,Aquisição de serviços,"50000000-5, Serviços de reparação e manutenção","Centro Hospitalar de São João, E. P. E. (509821197)","Getinge unipessoal, Lda (506819698)","38.480,00 €",14-02-2017,18-01-2017,365 dias,"Portugal, Porto, Porto","Artigo 24.º, n.º 1, alínea e) do Código dos Contratos Públicos",,,,,,Não aplicável.,Não aplicável.,FALSE
"Contrato de Manutenção e Assistência Técnica aos equipamentos Grifols instalados no CHSJ,EPE, para o ano de 2017",Ajuste Direto Regime Geral,Aquisição de serviços,"50000000-5, Serviços de reparação e manutenção","Centro Hospitalar de São João, E. P. E. (509821197)","GRIFOLS PORTUGAL,LDA. (502041285)","13.667,26 €",14-02-2017,25-01-2017,365 dias,"Portugal, Porto, Porto","Artigo 24.º, n.º 1, alínea e) do Código dos Contratos Públicos",,,,,,Não aplicável.,Não aplicável.,FALSE
