freguesia,acronym,validVotesPercentage,votes,dicofre
Cordinhã,PS,51.06,120,060205
Cordinhã,PPD/PSD,25.96,61,060205
Cordinhã,B.E.,9.36,22,060205
Cordinhã,CDS-PP,5.53,13,060205
Cordinhã,IL,2.55,6,060205
Cordinhã,PCP-PEV,1.28,3,060205
Cordinhã,L,0.85,2,060205
Cordinhã,PAN,0.85,2,060205
Cordinhã,PNR,0.85,2,060205
Cordinhã,A,0.43,1,060205
Cordinhã,NC,0.43,1,060205
Cordinhã,PCTP/MRPP,0.43,1,060205
Cordinhã,PTP,0.43,1,060205
Cordinhã,MAS,0,0,060205
Cordinhã,PDR,0,0,060205
Cordinhã,PPM.PPV/CDC,0,0,060205
Cordinhã,PURP,0,0,060205
