freguesia,acronym,validVotesPercentage,votes,dicofre
União das freguesias de Vilarouco e Pereiros,PPD/PSD.CDS-PP,52.41,76,181517
União das freguesias de Vilarouco e Pereiros,PS,31.03,45,181517
União das freguesias de Vilarouco e Pereiros,B.E.,2.76,4,181517
União das freguesias de Vilarouco e Pereiros,MPT,2.76,4,181517
União das freguesias de Vilarouco e Pereiros,PCP-PEV,2.07,3,181517
União das freguesias de Vilarouco e Pereiros,PCTP/MRPP,2.07,3,181517
União das freguesias de Vilarouco e Pereiros,PND,2.07,3,181517
União das freguesias de Vilarouco e Pereiros,PNR,1.38,2,181517
União das freguesias de Vilarouco e Pereiros,PPM,1.38,2,181517
União das freguesias de Vilarouco e Pereiros,L,0.69,1,181517
União das freguesias de Vilarouco e Pereiros,MAS,0.69,1,181517
União das freguesias de Vilarouco e Pereiros,PAN,0.69,1,181517
União das freguesias de Vilarouco e Pereiros,PDA,0,0,181517
União das freguesias de Vilarouco e Pereiros,POUS,0,0,181517
União das freguesias de Vilarouco e Pereiros,PPV,0,0,181517
União das freguesias de Vilarouco e Pereiros,PTP,0,0,181517
