freguesia,acronym,validVotesPercentage,votes,dicofre
Sobral da Serra,PPD/PSD,44.88,57,090744
Sobral da Serra,PS,33.07,42,090744
Sobral da Serra,B.E.,8.66,11,090744
Sobral da Serra,CDS-PP,4.72,6,090744
Sobral da Serra,PCP-PEV,3.15,4,090744
Sobral da Serra,CH,1.57,2,090744
Sobral da Serra,A,0.79,1,090744
Sobral da Serra,NC,0.79,1,090744
Sobral da Serra,PCTP/MRPP,0.79,1,090744
Sobral da Serra,PDR,0.79,1,090744
Sobral da Serra,PTP,0.79,1,090744
Sobral da Serra,IL,0,0,090744
Sobral da Serra,L,0,0,090744
Sobral da Serra,MPT,0,0,090744
Sobral da Serra,PAN,0,0,090744
Sobral da Serra,PNR,0,0,090744
Sobral da Serra,PPM,0,0,090744
Sobral da Serra,PURP,0,0,090744
Sobral da Serra,R.I.R.,0,0,090744
