freguesia,acronym,validVotesPercentage,votes,dicofre
Gavieira,PPD/PSD.CDS-PP,49.48,48,160113
Gavieira,PS,35.05,34,160113
Gavieira,MPT,5.15,5,160113
Gavieira,PND,2.06,2,160113
Gavieira,B.E.,1.03,1,160113
Gavieira,L,1.03,1,160113
Gavieira,MAS,1.03,1,160113
Gavieira,PCP-PEV,1.03,1,160113
Gavieira,PCTP/MRPP,1.03,1,160113
Gavieira,PPM,1.03,1,160113
Gavieira,PPV,1.03,1,160113
Gavieira,PTP,1.03,1,160113
Gavieira,PAN,0,0,160113
Gavieira,PDA,0,0,160113
Gavieira,PNR,0,0,160113
Gavieira,POUS,0,0,160113
