freguesia,acronym,validVotesPercentage,votes,dicofre
Candelária,PS,56.96,90,460202
Candelária,PPD/PSD,25.32,40,460202
Candelária,B.E.,3.8,6,460202
Candelária,PCP-PEV,2.53,4,460202
Candelária,PPM.PPV/CDC,2.53,4,460202
Candelária,PAN,1.9,3,460202
Candelária,PCTP/MRPP,1.9,3,460202
Candelária,CDS-PP,1.27,2,460202
Candelária,L,1.27,2,460202
Candelária,MAS,1.27,2,460202
Candelária,A,0.63,1,460202
Candelária,NC,0.63,1,460202
Candelária,IL,0,0,460202
Candelária,PDR,0,0,460202
Candelária,PNR,0,0,460202
Candelária,PTP,0,0,460202
Candelária,PURP,0,0,460202
