freguesia,acronym,validVotesPercentage,votes,dicofre
Macieira de Cambra,PS,37.76,586,011906
Macieira de Cambra,PPD/PSD,22.36,347,011906
Macieira de Cambra,CDS-PP,17.4,270,011906
Macieira de Cambra,B.E.,8.63,134,011906
Macieira de Cambra,PAN,4.06,63,011906
Macieira de Cambra,PCP-PEV,2.26,35,011906
Macieira de Cambra,A,1.42,22,011906
Macieira de Cambra,PPM.PPV/CDC,0.97,15,011906
Macieira de Cambra,L,0.9,14,011906
Macieira de Cambra,NC,0.84,13,011906
Macieira de Cambra,PNR,0.77,12,011906
Macieira de Cambra,IL,0.71,11,011906
Macieira de Cambra,PDR,0.52,8,011906
Macieira de Cambra,PCTP/MRPP,0.45,7,011906
Macieira de Cambra,PTP,0.45,7,011906
Macieira de Cambra,PURP,0.45,7,011906
Macieira de Cambra,MAS,0.06,1,011906
