Objeto do Contrato,Tipo de Procedimento,Tipo(s) de Contrato,CPVs,Entidade(s) Adjudicante(s),Entidade(s) Adjudicatária(s),Preço Contratual,Data de Publicação,Data de Celebração do Contrato,Prazo de Execução,Local de Execução,Fundamentação,Data de Fecho do Contrato,Preço Total Efetivo,Causas das Alterações ao Prazo,Causas das Alterações ao Preço,Estado,N.º registo do Acordo Quadro,Descrição do Acordo Quadro,Procedimento Centralizado
Aquisição de Serviços jurídicos ao abrigo do Acordo Quadro da SPMS- 2018,Ao abrigo de acordo-quadro (art.º 259.º),Aquisição de serviços,"79100000-5, Serviços jurídicos","Administração Central do Sistema de Saúde, I. P. (508188423)",Brito Artur Silva & Associados- Sociedade de Advogado SP RL (509100007),"9.100,00 €",20-11-2018,20-09-2018,102 dias,"Portugal, Lisboa, Lisboa",Artigo 259.º do Código dos Contratos Públicos,31-12-2018,"",,Sem execução,,2096651,Acordo quadro para Prestação de Serviços de Consultadoria na área Jurídica às Instituições e Serviços do Serviço Nacional de Saúde e entidades do Ministério da Saúde,FALSE
Consultadoria na área da segurança de dados para  da segurança de dados para o setor da Saúde ao abrigo do AQ CP2016/112,Ao abrigo de acordo-quadro (art.º 259.º),Aquisição de serviços,"71317210-8, Serviços de consultoria em matéria de saúde e segurança","Administração Central do Sistema de Saúde, I. P. (508188423)",ITEN Solutions - Sistemas de Informação (510728189),"26.316,00 €",20-11-2018,30-10-2018,62 dias,"Portugal, Lisboa, Lisboa",Artigo 259.º do Código dos Contratos Públicos,31-12-2018,"26.316,00 €",,"",,1950010,Acordo quadro para Prestação de Serviços de Consultadoria na área da Saúde e Segurança   às Instituições e Serviços do Serviço Nacional de Saúde,FALSE
