freguesia,acronym,validVotesPercentage,votes,dicofre
Rendufinho,PPD/PSD,40.91,72,030921
Rendufinho,PS,32.95,58,030921
Rendufinho,CDS-PP,7.95,14,030921
Rendufinho,B.E.,6.82,12,030921
Rendufinho,PCP-PEV,3.98,7,030921
Rendufinho,PAN,3.41,6,030921
Rendufinho,L,1.7,3,030921
Rendufinho,PPM.PPV/CDC,1.14,2,030921
Rendufinho,MAS,0.57,1,030921
Rendufinho,PCTP/MRPP,0.57,1,030921
Rendufinho,A,0,0,030921
Rendufinho,IL,0,0,030921
Rendufinho,NC,0,0,030921
Rendufinho,PDR,0,0,030921
Rendufinho,PNR,0,0,030921
Rendufinho,PTP,0,0,030921
Rendufinho,PURP,0,0,030921
