freguesia,acronym,validVotesPercentage,votes,dicofre
Pinho,PPD/PSD,50.73,104,170213
Pinho,PS,36.59,75,170213
Pinho,CDS-PP,7.8,16,170213
Pinho,B.E.,1.95,4,170213
Pinho,PCP-PEV,0.98,2,170213
Pinho,CH,0.49,1,170213
Pinho,NC,0.49,1,170213
Pinho,PAN,0.49,1,170213
Pinho,PDR,0.49,1,170213
Pinho,A,0,0,170213
Pinho,IL,0,0,170213
Pinho,L,0,0,170213
Pinho,PCTP/MRPP,0,0,170213
Pinho,PNR,0,0,170213
Pinho,PPM,0,0,170213
Pinho,R.I.R.,0,0,170213
