freguesia,acronym,validVotesPercentage,votes,dicofre
União das freguesias de Marrancos e Arcozelo,PPD/PSD,65.08,192,031364
União das freguesias de Marrancos e Arcozelo,PS,15.59,46,031364
União das freguesias de Marrancos e Arcozelo,B.E.,6.1,18,031364
União das freguesias de Marrancos e Arcozelo,CDS-PP,6.1,18,031364
União das freguesias de Marrancos e Arcozelo,PAN,1.69,5,031364
União das freguesias de Marrancos e Arcozelo,A,1.02,3,031364
União das freguesias de Marrancos e Arcozelo,PPM.PPV/CDC,1.02,3,031364
União das freguesias de Marrancos e Arcozelo,L,0.68,2,031364
União das freguesias de Marrancos e Arcozelo,MAS,0.68,2,031364
União das freguesias de Marrancos e Arcozelo,PCP-PEV,0.68,2,031364
União das freguesias de Marrancos e Arcozelo,NC,0.34,1,031364
União das freguesias de Marrancos e Arcozelo,PCTP/MRPP,0.34,1,031364
União das freguesias de Marrancos e Arcozelo,PDR,0.34,1,031364
União das freguesias de Marrancos e Arcozelo,PNR,0.34,1,031364
União das freguesias de Marrancos e Arcozelo,IL,0,0,031364
União das freguesias de Marrancos e Arcozelo,PTP,0,0,031364
União das freguesias de Marrancos e Arcozelo,PURP,0,0,031364
