Objeto do Contrato,Tipo de Procedimento,Tipo(s) de Contrato,CPVs,Entidade(s) Adjudicante(s),Entidade(s) Adjudicatária(s),Preço Contratual,Data de Publicação,Data de Celebração do Contrato,Prazo de Execução,Local de Execução,Fundamentação,Data de Fecho do Contrato,Preço Total Efetivo,Causas das Alterações ao Prazo,Causas das Alterações ao Preço,Estado,N.º registo do Acordo Quadro,Descrição do Acordo Quadro,Procedimento Centralizado
Assessoria Jurídica,Ajuste Direto Regime Geral,Aquisição de serviços,"79140000-7, Serviços de assessoria e informação jurídicas","Administração Central do Sistema de Saúde, I.P. (508188423)","Saragoça da Matta & Silveiro de Barros - Soc. Advogados, RL (505324539)","43.200,00 €",23-11-2011,30-03-2009,365 dias,"Portugal, Lisboa, Lisboa","Artigo 20.º, n.º 1, alínea a) do Código dos Contratos Públicos",30-03-2010,"43.200,00 €",,,,Não aplicável.,Não aplicável.,
Assessoria Jurídica,Ajuste Direto Regime Geral,Aquisição de serviços,"79140000-7, Serviços de assessoria e informação jurídicas","Administração Central do Sistema de Saúde, I.P. (508188423)",Saragoça da Matta & Silveiro de Barros - Soc. Advogados (505324539),"54.000,00 €",23-11-2011,01-07-2010,365 dias,"Portugal, Lisboa, Lisboa","Artigo 27.º, n.º 1, alínea f) do Código dos Contratos Públicos",01-07-2011,"54.000,00 €",,,,Não aplicável.,Não aplicável.,
