freguesia,acronym,validVotesPercentage,votes,dicofre
Perelhal,PPD/PSD.CDS-PP,45.11,203,030260
Perelhal,PS,28.22,127,030260
Perelhal,MPT,11.56,52,030260
Perelhal,PCP-PEV,3.56,16,030260
Perelhal,B.E.,2.89,13,030260
Perelhal,PAN,2.22,10,030260
Perelhal,PCTP/MRPP,1.33,6,030260
Perelhal,PND,1.33,6,030260
Perelhal,L,1.11,5,030260
Perelhal,PNR,0.89,4,030260
Perelhal,PPM,0.89,4,030260
Perelhal,PTP,0.44,2,030260
Perelhal,MAS,0.22,1,030260
Perelhal,PPV,0.22,1,030260
Perelhal,PDA,0,0,030260
Perelhal,POUS,0,0,030260
