freguesia,acronym,validVotesPercentage,votes,dicofre
Castanheiro do Sul,PPD/PSD,48.74,97,181501
Castanheiro do Sul,PS,36.18,72,181501
Castanheiro do Sul,B.E.,3.52,7,181501
Castanheiro do Sul,PCP-PEV,3.52,7,181501
Castanheiro do Sul,CDS-PP,2.51,5,181501
Castanheiro do Sul,PCTP/MRPP,1.01,2,181501
Castanheiro do Sul,PPM,1.01,2,181501
Castanheiro do Sul,PURP,1.01,2,181501
Castanheiro do Sul,CH,0.5,1,181501
Castanheiro do Sul,MPT,0.5,1,181501
Castanheiro do Sul,NC,0.5,1,181501
Castanheiro do Sul,PAN,0.5,1,181501
Castanheiro do Sul,PDR,0.5,1,181501
Castanheiro do Sul,A,0,0,181501
Castanheiro do Sul,IL,0,0,181501
Castanheiro do Sul,JPP,0,0,181501
Castanheiro do Sul,L,0,0,181501
Castanheiro do Sul,PNR,0,0,181501
Castanheiro do Sul,PTP,0,0,181501
Castanheiro do Sul,R.I.R.,0,0,181501
