Objeto do Contrato,Tipo de Procedimento,Tipo(s) de Contrato,CPVs,Entidade(s) Adjudicante(s),Entidade(s) Adjudicatária(s),Preço Contratual,Data de Publicação,Data de Celebração do Contrato,Prazo de Execução,Local de Execução,Fundamentação,Data de Fecho do Contrato,Preço Total Efetivo,Causas das Alterações ao Prazo,Causas das Alterações ao Preço,Estado,N.º registo do Acordo Quadro,Descrição do Acordo Quadro,Procedimento Centralizado
Reparação rede de iluminação exterior,Ajuste Direto Regime Geral,Aquisição de serviços,"50000000-5, Serviços de reparação e manutenção",Serviço de Utilização Comum dos Hospitais (500900469),"JOAO JACINTO TOME, S.A. (500149771)","5.293,78 €",19-10-2018,18-10-2018,30 dias,"Portugal, Lisboa, Lisboa","Artigo 20.º, n.º 1, alínea d) do Código dos Contratos Públicos",,,,,,Não aplicável.,Não aplicável.,FALSE
FORNECIMENTO DE COMBUSTÍVEL AQUECIMENTO A GRANEL - BIOHEATING – NO DEPÓSITO DA LAVANDARIA DO HOSPITAL ROVISCO PAIS (TOCHA),Ajuste Direto Regime Geral,Aquisição de bens móveis,"09200000-1, Petróleo, carvão e produtos petrolíferos",Serviço de Utilização Comum dos Hospitais (500900469),"BIOADVANCE -THE NEXT GENERATION, LDA (507990650)","72.800,00 €",18-10-2018,17-10-2018,72 dias,"Portugal, Coimbra, Cantanhede","Artigo 24.º, n.º 1, alínea e), subalínea ii) do Código dos Contratos Públicos",,,,,,Não aplicável.,Não aplicável.,FALSE
Prestação de Serviços Jurídicos e Patrocínio Forense,Ajuste Direto Regime Geral,Aquisição de serviços,"79000000-4, Serviços a empresas: direito, comercialização, consultoria, recrutamento, impressão e segurança",Serviço de Utilização Comum dos Hospitais (500900469),EFCM (514213833),"74.900,00 €",17-10-2018,17-10-2018,76 dias,Portugal,"Artigo 24.º, n.º 1, alínea e), subalínea iii) do Código dos Contratos Públicos",,,,,,Não aplicável.,Não aplicável.,FALSE
Fornecimento e montagem de equipamento de controlo e gestão dos acessos para o Hospital Nossa Senhora do Rosário.,Ao abrigo de acordo-quadro (art.º 259.º),Outros Tipos (Prestação do Serviço Universal),"51200000-4, Serviços de instalação de equipamento para medição, controlo, ensaio e navegação",Serviço de Utilização Comum dos Hospitais (500900469),"SOLTRAFEGO SOLUÇÕES DE TRANSITO, ESTACIONAMENTO E COMUNICAÇOES, S.A. (506370836)","238.887,36 €",17-10-2018,17-10-2018,50 dias,"Portugal, Setúbal, Montijo",Artigo 259.º do Código dos Contratos Públicos,,,,,,2617532,"CLPQ 17/002 - Requalificação, Ordenamento e Construção de Parques de Estacionamento e Fornecimento de Equipamentos para Controlo e Gestão de acessos.",FALSE
Serviços de Auditorias Externas De Conformidade Legal Conforme Referenciais OHSAS E ISO 14001,Ajuste Direto Regime Geral,Aquisição de serviços,"79000000-4, Serviços a empresas: direito, comercialização, consultoria, recrutamento, impressão e segurança",Serviço de Utilização Comum dos Hospitais (500900469),"WEMAKE – Tecnologias de Informação, Lda. (506097250)","6.350,00 €",16-10-2018,10-07-2018,365 dias,Portugal,"Artigo 20.º, n.º 1, alínea d) do Código dos Contratos Públicos",,,,,,Não aplicável.,Não aplicável.,FALSE
Serviços Informáticos para licenciamento de Software de Proteção Antivírus - McAfee,Ajuste Direto Regime Geral,Aquisição de bens móveis,"48000000-8, Pacotes de software e sistemas de informação",Serviço de Utilização Comum dos Hospitais (500900469),IDW - CONS. SERV. INFORMAÇÃO (504243926),"7.700,00 €",16-10-2018,29-06-2018,365 dias,Portugal,"Artigo 20.º, n.º 1, alínea d) do Código dos Contratos Públicos",,,,,,Não aplicável.,Não aplicável.,FALSE
UPGRADE TECNOLÓGICO DOS EQUIPAMENTOS DE CONTROLO DE PARQUES DE ESTACIONAMENTO DE DIVERSOS HOSPITAIS,Ajuste Direto Regime Geral,Aquisição de serviços,"51000000-9, Serviços de instalação (excepto software)",Serviço de Utilização Comum dos Hospitais (500900469),"SOLTRAFEGO SOLUÇÕES DE TRANSITO, ESTACIONAMENTO E COMUNICAÇOES, S.A. (506370836)","325.319,92 €",16-10-2018,15-10-2018,5 dias,"Portugal, Lisboa, Lisboa<BR/>Portugal, Porto, Matosinhos","Artigo 24.º, n.º 1, alínea e), subalínea ii) do Código dos Contratos Públicos",,,,,,Não aplicável.,Não aplicável.,FALSE
Serviços Essenciais Para Preparação De Armazém De Arquivo Do SUCH,Ajuste Direto Regime Geral,Aquisição de serviços,"51000000-9, Serviços de instalação (excepto software)",Serviço de Utilização Comum dos Hospitais (500900469),"Malveiro & Garvão, Lda (502516178)","5.736,00 €",16-10-2018,19-07-2018,30 dias,"Portugal, Lisboa, Sintra","Artigo 20.º, n.º 1, alínea d) do Código dos Contratos Públicos",,,,,,Não aplicável.,Não aplicável.,FALSE
Aquisição Tubos para requalificação das condutas de água do Hospital Nossa Senhora do Rosário,Ajuste Direto Regime Geral,Aquisição de bens móveis,"44160000-9, Condutas de longa distância, condutas, canos, tubagem de revestimento, tubos e artigos afins",Serviço de Utilização Comum dos Hospitais (500900469),"Miltubos, Lda (509624499)","18.819,00 €",16-10-2018,03-08-2018,30 dias,"Portugal, Setúbal, Montijo","Artigo 20.º, n.º 1, alínea d) do Código dos Contratos Públicos",,,,,,Não aplicável.,Não aplicável.,FALSE
