Objeto do Contrato,Tipo de Procedimento,Tipo(s) de Contrato,CPVs,Entidade(s) Adjudicante(s),Entidade(s) Adjudicatária(s),Preço Contratual,Data de Publicação,Data de Celebração do Contrato,Prazo de Execução,Local de Execução,Fundamentação,Data de Fecho do Contrato,Preço Total Efetivo,Causas das Alterações ao Prazo,Causas das Alterações ao Preço,Estado,N.º registo do Acordo Quadro,Descrição do Acordo Quadro,Procedimento Centralizado
Prestação de serviços de assistência técnica,Ajuste Direto Regime Geral,Aquisição de serviços,"71356000-8, Serviços técnicos","Hospital do Espírito Santo de Évora, EPE (508085888)",Attendsys - Soluções Globais de Atendimento (510306802),"8.616,46 €",21-11-2017,24-11-2016,365 dias,"Portugal, Évora, Évora","Artigo 24.º, n.º 1, alínea e) do Código dos Contratos Públicos",,,,,,Não aplicável.,Não aplicável.,FALSE
"Aquisição de MCDT's  ao exterior, de Anatomia Patológica",Concurso público,Aquisição de serviços,"85148000-8, Serviços de análises clínicas","Hospital do Espírito Santo de Évora, E. P. E. (508085888)",Macedo Dias Laboratório  (502613653),"57.927,20 €",21-11-2017,15-03-2017,270 dias,"Portugal, Évora, Évora","Artigo 20.º, n.º 1, alínea b) do Código dos Contratos Públicos",,,,,,Não aplicável.,Não aplicável.,FALSE
Prestação de serviços em medicina física e reabilitação,Ajuste Direto Regime Geral,Aquisição de serviços,"85120000-6, Serviços de prática médica e serviços conexos","Hospital do Espírito Santo de Évora, EPE (508085888)",Fisired (509133436),"11.514,63 €",21-11-2017,16-01-2017,365 dias,"Portugal, Évora, Évora","Artigo 20.º, n.º 1, alínea a) do Código dos Contratos Públicos",,,,,,Não aplicável.,Não aplicável.,FALSE
Prestação de serviços em medicina física e reabilitação,Ajuste Direto Regime Geral,Aquisição de serviços,"85120000-6, Serviços de prática médica e serviços conexos","Hospital do Espírito Santo de Évora, E. P. E. (508085888)",CLINICA RECUPERAÇÃO M H VILA VIÇOSA LDA (502960639),"25.555,25 €",21-11-2017,16-01-2017,365 dias,"Portugal, Évora, Évora","Artigo 20.º, n.º 1, alínea a) do Código dos Contratos Públicos",,,,,,Não aplicável.,Não aplicável.,FALSE
Serviços de comunicação de voz em local fixo,Ao abrigo de acordo-quadro (art.º 259.º),Aquisição de serviços,"64210000-1, Serviços telefónicos e de transmissão de dados","Hospital do Espírito Santo de Évora, E. P. E. (508085888)",Meo Serviço de Comunicações S.A. (502600268),"1.106,40 €",21-11-2017,24-01-2017,365 dias,"Portugal, Évora, Évora",Artigo 259.º do Código dos Contratos Públicos,,,,,,92007,Concurso limitado por prévia qualificação para a celebração de acordo quadro para a prestação de serviços de comunicações de voz e dados em local fixo.,FALSE
Fornecimento de combustíveis rodoviários,Ao abrigo de acordo-quadro (art.º 259.º),Aquisição de bens móveis,"09100000-0, Combustíveis","Hospital do Espírito Santo de Évora, E. P. E. (508085888)","PETROLEOS DE PORTUGAL - PETROGAL, S.A (500697370)","1.647,96 €",21-11-2017,07-01-2017,30 dias,"Portugal, Évora, Évora",Artigo 259.º do Código dos Contratos Públicos,,,,,,400324,Acordo quadro de fornecimento de combustíveis rodoviários,FALSE
Fornecimento de gás natural,Ao abrigo de acordo-quadro (art.º 259.º),Aquisição de bens móveis,"09120000-6, Combustíveis gasosos","Hospital do Espírito Santo de Évora, E. P. E. (508085888)","GALP POWER, SA (504723456)","109.514,98 €",21-11-2017,15-12-2016,365 dias,"Portugal, Évora, Évora",Artigo 259.º do Código dos Contratos Públicos,,,,,,1555095,Acordo quadro para o fornecimento de gás natural em regime de mercado livre para Portugal Continental,FALSE
Prestação de serviços de comunicação,Ajuste Direto Regime Geral,Aquisição de serviços,"64216000-3, Serviços de informação e mensagens electrónicas","Hospital do Espírito Santo de Évora, E. P. E. (508085888)",Meo Serviço de Comunicações S.A. (502600268),"3.350,00 €",21-11-2017,17-02-2017,350 dias,"Portugal, Évora, Évora","Artigo 20.º, n.º 1, alínea a) do Código dos Contratos Públicos",,,,,,Não aplicável.,Não aplicável.,FALSE
Prestação de serviços em medicina física e reabilitação,Ajuste Direto Regime Geral,Aquisição de serviços,"85120000-6, Serviços de prática médica e serviços conexos","Hospital do Espírito Santo de Évora, E. P. E. (508085888)",Susana Capela Gusmão Flamínio (196884667),"11.468,84 €",21-11-2017,16-01-2017,365 dias,"Portugal, Évora, Évora","Artigo 20.º, n.º 1, alínea a) do Código dos Contratos Públicos",,,,,,Não aplicável.,Não aplicável.,FALSE
Prestação de serviços em medicina física e reabilitação,Ajuste Direto Regime Geral,Aquisição de serviços,"85120000-6, Serviços de prática médica e serviços conexos","Hospital do Espírito Santo de Évora, E. P. E. (508085888)",SANTA CASA DA MISERICORDIA DE MORA (500848599),"2.609,48 €",21-11-2017,19-01-2017,365 dias,"Portugal, Évora, Évora","Artigo 20.º, n.º 1, alínea a) do Código dos Contratos Públicos",,,,,,Não aplicável.,Não aplicável.,FALSE
Prestação de serviços de medicina física e reabilitação,Ajuste Direto Regime Geral,Aquisição de serviços,"85120000-6, Serviços de prática médica e serviços conexos","Hospital do Espírito Santo de Évora, E. P. E. (508085888)",Hospital São João de Deus (500927731),"8.268,36 €",21-11-2017,01-02-2017,365 dias,"Portugal, Évora, Évora","Artigo 20.º, n.º 1, alínea a) do Código dos Contratos Públicos",,,,,,Não aplicável.,Não aplicável.,FALSE
Prestação de serviços de medicina física e reabilitação,Ajuste Direto Regime Geral,Aquisição de serviços,"85120000-6, Serviços de prática médica e serviços conexos","Hospital do Espírito Santo de Évora, E. P. E. (508085888)",CALENDARIO DO TEMPO LDA (508498376),"12.722,84 €",21-11-2017,16-01-2017,365 dias,"Portugal, Évora, Évora","Artigo 20.º, n.º 1, alínea a) do Código dos Contratos Públicos",,,,,,Não aplicável.,Não aplicável.,FALSE
Prestação de serviços de medicina física e reabilitação,Ajuste Direto Regime Geral,Aquisição de serviços,"85120000-6, Serviços de prática médica e serviços conexos","Hospital do Espírito Santo de Évora, E. P. E. (508085888)",FISIEVE - CENTRO MED FIS REAB DE ÉVORA LDA (500991057),"20.269,00 €",20-11-2017,16-01-2017,365 dias,"Portugal, Évora, Évora","Artigo 20.º, n.º 1, alínea a) do Código dos Contratos Públicos",,,,,,Não aplicável.,Não aplicável.,FALSE
Prestação de serviços em medicina física e reabilitação,Ajuste Direto Regime Geral,Aquisição de serviços,"85120000-6, Serviços de prática médica e serviços conexos","Hospital do Espírito Santo de Évora, E. P. E. (508085888)",FISIONOVA-CLINICA FISIOT REABILITAÇÃO LDA (506221067),"34.499,48 €",20-11-2017,16-01-2017,365 dias,"Portugal, Évora, Évora","Artigo 20.º, n.º 1, alínea a) do Código dos Contratos Públicos",,,,,,Não aplicável.,Não aplicável.,FALSE
Prestação de serviços médicos em anestesia,Ajuste Direto Regime Geral,Aquisição de serviços,"85120000-6, Serviços de prática médica e serviços conexos","Hospital do Espírito Santo de Évora, E. P. E. (508085888)","Corevalue Healthcare Solutions, Lda. (513654577)","18.201,38 €",20-11-2017,02-06-2017,30 dias,"Portugal, Évora, Évora","Artigo 24.º, n.º 1, alínea c) do Código dos Contratos Públicos",,,,,,Não aplicável.,Não aplicável.,FALSE
Aquisição de equipamento de cópia e impressão,Ajuste Direto Regime Geral,Aquisição de bens móveis,"30200000-1, Equipamento e material informático","Hospital do Espírito Santo de Évora, E. P. E. (508085888)","BASEDOIS - INFORMÁTICA E TELECOMUNICAÇÕES, LDA (501333401)","306.975,00 €",20-11-2017,23-04-2015,30 dias,"Portugal, Évora, Évora","Artigo 27.º, n.º 1, alínea h) do Código dos Contratos Públicos",,,,,,Não aplicável.,Não aplicável.,FALSE
Prestação de serviços técnicos de diagnostico e terapêutica,Ajuste Direto Regime Geral,Aquisição de serviços,"85120000-6, Serviços de prática médica e serviços conexos","Hospital do Espírito Santo de Évora, E. P. E. (508085888)",José André Baleizão Branquinho (247665541),"4.550,00 €",20-11-2017,11-10-2017,90 dias,"Portugal, Évora, Évora","Artigo 20.º, n.º 1, alínea a) do Código dos Contratos Públicos",,,,,,Não aplicável.,Não aplicável.,FALSE
Aquisição de ligaduras de compressão e dispositivos de compressão,Ao abrigo de acordo-quadro (art.º 259.º),Aquisição de bens móveis,"33140000-3, Material médico de consumo","Hospital do Espírito Santo de Évora, E. P. E. (508085888)",Abílio Freire (500432600),"3.377,68 €",17-11-2017,31-10-2017,60 dias,"Portugal, Évora, Évora",Artigo 259.º do Código dos Contratos Públicos,,,,,,2378981,Acordo quadro para fornecimento de Ligaduras de Compressão e Dispositivos de Imobilização às Instituições e Serviços do Serviço Nacional de Saúde.,FALSE
Prestação de serviços de Nutricionista,Ajuste Direto Regime Geral,Aquisição de serviços,"98300000-6, Serviços diversos","Hospital do Espírito Santo de Évora, E. P. E. (508085888)",Sofia Carmo Oliveira Alves (246637307),"7.200,00 €",17-11-2017,30-08-2017,120 dias,"Portugal, Évora, Évora","Artigo 20.º, n.º 1, alínea a) do Código dos Contratos Públicos",,,,,,Não aplicável.,Não aplicável.,FALSE
Prestação de serviços de limpeza,Concurso público,Aquisição de serviços,"90910000-9, Serviços de limpeza","Hospital do Espírito Santo de Évora, E. P. E. (508085888)",Nova Serviços. Lda (502117281),"3.094.240,50 €",16-11-2017,24-11-2016,365 dias,"Portugal, Évora, Évora","Artigo 20.º, n.º 1, alínea b) do Código dos Contratos Públicos",,,,,,Não aplicável.,Não aplicável.,FALSE
Prestação de serviços de limpeza,Ajuste Direto Regime Geral,Aquisição de serviços,"90910000-9, Serviços de limpeza","Hospital do Espírito Santo de Évora, E. P. E. (508085888)","CLIMEX - CONTROLO DE AMBIENTE, S.A. (501891560)","203.700,00 €",16-11-2017,24-08-2016,90 dias,"Portugal, Évora, Évora","Artigo 24.º, n.º 1, alínea c) do Código dos Contratos Públicos",,,,,,Não aplicável.,Não aplicável.,FALSE
Prestação de serviços em Electroencefalografia,Ajuste Direto Regime Geral,Aquisição de serviços,"85120000-6, Serviços de prática médica e serviços conexos","Hospital do Espírito Santo de Évora, E. P. E. (508085888)","Alberto Leal - Neurofisiologia, Lda (505714930)","6.750,00 €",16-11-2017,22-06-2016,180 dias,"Portugal, Évora, Évora","Artigo 20.º, n.º 1, alínea a) do Código dos Contratos Públicos",,,,,,Não aplicável.,Não aplicável.,FALSE
Prestação de serviços médicos em Telerradiologia,Ajuste Direto Regime Geral,Aquisição de serviços,"85120000-6, Serviços de prática médica e serviços conexos","Hospital do Espírito Santo de Évora, E. P. E. (508085888)",DR CAMPOS COSTA CONSULTORIO TOMOG COMPUT SA (502082429),"44.120,00 €",16-11-2017,04-10-2016,90 dias,"Portugal, Évora, Évora","Artigo 20.º, n.º 1, alínea a) do Código dos Contratos Públicos",,,,,,Não aplicável.,Não aplicável.,FALSE
Prestação de serviços de assistência técnica,Ajuste Direto Regime Geral,Aquisição de serviços,"71356200-0, Serviços de assistência técnica","Hospital do Espírito Santo de Évora, E. P. E. (508085888)","Alert LifeSciences, SA (507567455)","107.259,32 €",16-11-2017,28-04-2016,365 dias,"Portugal, Évora, Évora","Artigo 24.º, n.º 1, alínea e) do Código dos Contratos Públicos",,,,,,Não aplicável.,Não aplicável.,FALSE
Prestação de serviços de assistência técnica,Ajuste Direto Regime Geral,Aquisição de serviços,"71356200-0, Serviços de assistência técnica","Hospital do Espírito Santo de Évora, E. P. E. (508085888)","SIEMENS HEALTHCARE, LDA (507925173)","130.000,00 €",14-11-2017,18-10-2017,365 dias,"Portugal, Évora, Évora","Artigo 24.º, n.º 1, alínea e) do Código dos Contratos Públicos",,,,,,Não aplicável.,Não aplicável.,FALSE
Prestação de serviços de técnico de diagnostico e terapêutica,Ajuste Direto Regime Geral,Aquisição de serviços,"85149000-5, Serviços farmacêuticos","Hospital do Espírito Santo de Évora, E. P. E. (508085888)",Milene Pereira Ramires (235038989),"2.800,00 €",14-11-2017,08-11-2017,60 dias,"Portugal, Évora, Évora","Artigo 20.º, n.º 1, alínea a) do Código dos Contratos Públicos",,,,,,Não aplicável.,Não aplicável.,FALSE
Aquisição de medicamentos oncológicos: Bicalutamida 50mg,Ao abrigo de acordo-quadro (art.º 259.º),Aquisição de bens móveis,"33652000-5, Antineoplásicos e imunomoduladores","Hospital do Espírito Santo de Évora, E. P. E. (508085888)","Teva Pharma - Produtos Farmacêuticos, Lda (507045491)","1.401,57 €",13-11-2017,10-10-2017,80 dias,"Portugal, Évora, Évora",Artigo 259.º do Código dos Contratos Públicos,,,,,,1771819,CP 2015/6 - Acordo quadro para o fornecimento de Medicamentos do Foro Oncológico,FALSE
