freguesia,acronym,validVotesPercentage,votes,dicofre
São Pedro de Nordestinho,PS,61.54,48,420210
São Pedro de Nordestinho,PPD/PSD.CDS-PP,23.08,18,420210
São Pedro de Nordestinho,B.E.,3.85,3,420210
São Pedro de Nordestinho,MPT,3.85,3,420210
São Pedro de Nordestinho,PCP-PEV,2.56,2,420210
São Pedro de Nordestinho,PND,2.56,2,420210
São Pedro de Nordestinho,PAN,1.28,1,420210
São Pedro de Nordestinho,PPM,1.28,1,420210
São Pedro de Nordestinho,L,0,0,420210
São Pedro de Nordestinho,MAS,0,0,420210
São Pedro de Nordestinho,PCTP/MRPP,0,0,420210
São Pedro de Nordestinho,PDA,0,0,420210
São Pedro de Nordestinho,PNR,0,0,420210
São Pedro de Nordestinho,POUS,0,0,420210
São Pedro de Nordestinho,PPV,0,0,420210
São Pedro de Nordestinho,PTP,0,0,420210
