freguesia,acronym,validVotesPercentage,votes,dicofre
Pena Verde,PPD/PSD.CDS-PP,62.61,149,090109
Pena Verde,PS,24.79,59,090109
Pena Verde,MPT,4.2,10,090109
Pena Verde,B.E.,2.94,7,090109
Pena Verde,PND,1.26,3,090109
Pena Verde,MAS,0.84,2,090109
Pena Verde,PAN,0.84,2,090109
Pena Verde,PTP,0.84,2,090109
Pena Verde,L,0.42,1,090109
Pena Verde,PDA,0.42,1,090109
Pena Verde,PNR,0.42,1,090109
Pena Verde,PPV,0.42,1,090109
Pena Verde,PCP-PEV,0,0,090109
Pena Verde,PCTP/MRPP,0,0,090109
Pena Verde,POUS,0,0,090109
Pena Verde,PPM,0,0,090109
