freguesia,acronym,validVotesPercentage,votes,dicofre
Longa,PPD/PSD.CDS-PP,68.49,50,181908
Longa,PS,19.18,14,181908
Longa,MPT,4.11,3,181908
Longa,PCP-PEV,2.74,2,181908
Longa,PND,2.74,2,181908
Longa,PDA,1.37,1,181908
Longa,PPM,1.37,1,181908
Longa,B.E.,0,0,181908
Longa,L,0,0,181908
Longa,MAS,0,0,181908
Longa,PAN,0,0,181908
Longa,PCTP/MRPP,0,0,181908
Longa,PNR,0,0,181908
Longa,POUS,0,0,181908
Longa,PPV,0,0,181908
Longa,PTP,0,0,181908
