Objeto do Contrato,Tipo de Procedimento,Tipo(s) de Contrato,CPVs,Entidade(s) Adjudicante(s),Entidade(s) Adjudicatária(s),Preço Contratual,Data de Publicação,Data de Celebração do Contrato,Prazo de Execução,Local de Execução,Fundamentação,Data de Fecho do Contrato,Preço Total Efetivo,Causas das Alterações ao Prazo,Causas das Alterações ao Preço,Estado,N.º registo do Acordo Quadro,Descrição do Acordo Quadro,Procedimento Centralizado
Aquisição de Impressos,Ajuste Direto Regime Geral,Aquisição de bens móveis,"22000000-0, Material impresso e afins","Administração Regional de Saúde do Alentejo, I. P. (503148768)",Gráfica Central Mealhadense (500129789),"5.490,15 €",11-07-2014,12-05-2014,365 dias,"Portugal, Évora","Artigo 20.º, n.º 1, alínea a) do Código dos Contratos Públicos",31-12-2014,"5.490,15 €",,,,Não aplicável.,Não aplicável.,FALSE
Aquisição de Serviços na Área da Formação Profissional - 2014,Ajuste Direto Regime Geral,Aquisição de serviços,"66171000-9, Serviços de consultoria financeira",Administração Regional de Saúde do Alentejo (ARSA) (503148768),"Serga - Serviços, Organização e Informática, Lda. (502213531)","4.930,00 €",08-07-2014,20-06-2014,183 dias,"Portugal, Évora, Évora","Artigo 20.º, n.º 1, alínea a) do Código dos Contratos Públicos",30-12-2014,"4.930,00 €",,,,Não aplicável.,Não aplicável.,FALSE
Licenciamento e Implementação de uma Solução no âmbito do SIIMA Rastreios (Módulo Gestão Imagem e serviços),Ajuste Direto Regime Geral,Aquisição de bens móveis,"48000000-8, Pacotes de software e sistemas de informação","Administração Regional de Saúde do Alentejo, I. P. (503148768)","First Solutions Partners, S.A. (507987349)","6.238,00 €",03-07-2014,03-12-2013,120 dias,"Portugal, Évora, Évora","Artigo 20.º, n.º 1, alínea a) do Código dos Contratos Públicos",28-02-2014,"6.238,00 €",,,,Não aplicável.,Não aplicável.,FALSE
