Objeto do Contrato,Tipo de Procedimento,Tipo(s) de Contrato,CPVs,Entidade(s) Adjudicante(s),Entidade(s) Adjudicatária(s),Preço Contratual,Data de Publicação,Data de Celebração do Contrato,Prazo de Execução,Local de Execução,Fundamentação,Data de Fecho do Contrato,Preço Total Efetivo,Causas das Alterações ao Prazo,Causas das Alterações ao Preço,Estado,N.º registo do Acordo Quadro,Descrição do Acordo Quadro,Procedimento Centralizado
Serviços médicos,Ajuste Direto Regime Geral,Aquisição de serviços,"85121100-4, Serviços de médicos de clínica geral","Hospital Professor Doutor Fernando Fonseca, E. P. E. (503035416)",João Carlos Gomes Sanca (228371341),"11.700,00 €",21-01-2016,22-12-2015,90 dias,"Portugal, Lisboa, Amadora","Artigo 20.º, n.º 1, alínea a) do Código dos Contratos Públicos",,,,,,Não aplicável.,Não aplicável.,FALSE
PRESTAÇÃO DE SERVIÇOS MÉDICOS,Ajuste Direto Regime Geral,Aquisição de serviços,"85121100-4, Serviços de médicos de clínica geral","Hospital Professor Doutor Fernando Fonseca, E. P. E. (503035416)",Mário Ialá (214321193),"37.800,00 €",21-01-2016,09-11-2015,248 dias,"Portugal, Lisboa, Amadora","Artigo 20.º, n.º 1, alínea a) do Código dos Contratos Públicos",,,,,,Não aplicável.,Não aplicável.,FALSE
Serviços de recolha e tratamento de resíduos hospitalares,Ajuste Direto Regime Geral,Aquisição de serviços,"90524100-7, Serviços de recolha de resíduos hospitalares","Hospital Professor Doutor Fernando Fonseca, E. P. E. (503035416)","Ambimed – Gestão Ambiental, Lda. (503593427)","298.907,19 €",20-01-2016,13-01-2016,334 dias,"Portugal, Lisboa, Amadora","Artigo 20.º, n.º 1, alínea a) do Código dos Contratos Públicos",,,,,,Não aplicável.,Não aplicável.,FALSE
Seringas para Bomba Perfusora 50ml,Ajuste Direto Regime Geral,Aquisição de bens móveis,"33141310-6, Seringas","Hospital Professor Doutor Fernando Fonseca, E. P. E. (503035416)",PMH - Produtos Médicos Hospitalares (502376899),"5.557,50 €",20-01-2016,13-01-2016,365 dias,"Portugal, Lisboa, Amadora","Artigo 20.º, n.º 1, alínea a) do Código dos Contratos Públicos",,,,,,Não aplicável.,Não aplicável.,FALSE
Seringas para Bomba Perfusora,Ajuste Direto Regime Geral,Aquisição de bens móveis,"33141310-6, Seringas","Hospital Professor Doutor Fernando Fonseca, E. P. E. (503035416)",B.Braun  (501506543),"5.572,00 €",20-01-2016,06-01-2016,365 dias,"Portugal, Lisboa, Amadora","Artigo 20.º, n.º 1, alínea a) do Código dos Contratos Públicos",,,,,,Não aplicável.,Não aplicável.,FALSE
" 4 Monitores Cardíacos com Traçado ECG, TA e SPO2, 3 Monitores de Sinais Vitais ",Ajuste Direto Regime Geral,Aquisição de bens móveis,"33195100-4, Monitores",Hospital Prof. Doutor Fernando Fonseca E.P.E. (503035416),"CLINIFAR - PRODUTOS CLINICOS E FARMACEUTICOS, S.A.  (503281115)","14.145,00 €",20-01-2016,30-12-2015,30 dias,"Portugal, Lisboa, Amadora","Artigo 20.º, n.º 1, alínea a) do Código dos Contratos Públicos",,,,,,Não aplicável.,Não aplicável.,FALSE
Prestação de serviços médicos,Ajuste Direto Regime Geral,Aquisição de serviços,"85121100-4, Serviços de médicos de clínica geral","Hospital Professor Doutor Fernando Fonseca, E. P. E. (503035416)",Susana Patrícia Baltasar Pacheco  (237291045),"6.120,00 €",15-01-2016,26-08-2015,119 dias,"Portugal, Lisboa, Amadora","Artigo 20.º, n.º 1, alínea a) do Código dos Contratos Públicos",,,,,,Não aplicável.,Não aplicável.,FALSE
Desfibrilhadores,Ajuste Direto Regime Geral,Aquisição de bens móveis,"33182100-0, Desfibrilhador",Hospital Prof. Doutor Fernando Fonseca E.P.E. (503035416),"CLINIFAR - PRODUTOS CLINICOS E FARMACEUTICOS, S.A.  (503281115)","16.800,00 €",15-01-2016,29-12-2015,30 dias,"Portugal, Lisboa, Amadora","Artigo 20.º, n.º 1, alínea a) do Código dos Contratos Públicos",,,,,,Não aplicável.,Não aplicável.,FALSE
Quiosques multimédia,Ajuste Direto Regime Geral,Aquisição de bens móveis,"32322000-6, Equipamento multimédia",Hospital Prof. Doutor Fernando Fonseca E.P.E. (503035416),"Proside – Concepção e Implementação de Soluções Informáticas, Lda  (506951405)","45.958,00 €",15-01-2016,12-05-2015,21 dias,"Portugal, Lisboa, Amadora","Artigo 20.º, n.º 1, alínea a) do Código dos Contratos Públicos",,,,,,Não aplicável.,Não aplicável.,FALSE
Dois Ecógrafos,Concurso público,Aquisição de bens móveis,"33112000-8, Equipamento de imagiologia por ecos, ultra-sons e doppler","Hospital Professor Doutor Fernando Fonseca, E. P. E. (503035416)","GENERAL ELECTRIC PORTUGUESA, S.A.  (500357129)","32.000,00 €",15-01-2016,22-12-2015,30 dias,"Portugal, Lisboa, Amadora","Artigo 20.º, n.º 1, alínea b) do Código dos Contratos Públicos",,,,,,Não aplicável.,Não aplicável.,FALSE
Renovação da Assinatura da Base de Dados ClinicalKey,Ajuste Direto Regime Geral,Aquisição de serviços,"79980000-7, Serviços de assinatura",Hospital Prof. Doutor Fernando Fonseca E.P.E. (503035416),LusoDoc (502609982),"42.285,62 €",12-01-2016,04-01-2016,5 dias,"Portugal, Lisboa, Amadora","Artigo 20.º, n.º 1, alínea a) do Código dos Contratos Públicos",,,,,,Não aplicável.,Não aplicável.,FALSE
