freguesia,acronym,validVotesPercentage,votes,dicofre
"União das freguesias de Algoso, Campo de Víboras e Uva",PPD/PSD.CDS-PP,71.54,176,041115
"União das freguesias de Algoso, Campo de Víboras e Uva",PS,20.33,50,041115
"União das freguesias de Algoso, Campo de Víboras e Uva",MPT,2.44,6,041115
"União das freguesias de Algoso, Campo de Víboras e Uva",B.E.,1.22,3,041115
"União das freguesias de Algoso, Campo de Víboras e Uva",PND,1.22,3,041115
"União das freguesias de Algoso, Campo de Víboras e Uva",MAS,0.81,2,041115
"União das freguesias de Algoso, Campo de Víboras e Uva",PAN,0.81,2,041115
"União das freguesias de Algoso, Campo de Víboras e Uva",PCP-PEV,0.81,2,041115
"União das freguesias de Algoso, Campo de Víboras e Uva",PDA,0.41,1,041115
"União das freguesias de Algoso, Campo de Víboras e Uva",POUS,0.41,1,041115
"União das freguesias de Algoso, Campo de Víboras e Uva",L,0,0,041115
"União das freguesias de Algoso, Campo de Víboras e Uva",PCTP/MRPP,0,0,041115
"União das freguesias de Algoso, Campo de Víboras e Uva",PNR,0,0,041115
"União das freguesias de Algoso, Campo de Víboras e Uva",PPM,0,0,041115
"União das freguesias de Algoso, Campo de Víboras e Uva",PPV,0,0,041115
"União das freguesias de Algoso, Campo de Víboras e Uva",PTP,0,0,041115
