freguesia,acronym,validVotesPercentage,votes,dicofre
Três Povos,PS,49.15,174,050432
Três Povos,PPD/PSD,25.71,91,050432
Três Povos,CDS-PP,7.34,26,050432
Três Povos,B.E.,6.78,24,050432
Três Povos,PCP-PEV,3.39,12,050432
Três Povos,PAN,2.26,8,050432
Três Povos,L,1.13,4,050432
Três Povos,CH,0.85,3,050432
Três Povos,R.I.R.,0.85,3,050432
Três Povos,A,0.56,2,050432
Três Povos,PNR,0.56,2,050432
Três Povos,PTP,0.56,2,050432
Três Povos,IL,0.28,1,050432
Três Povos,MPT,0.28,1,050432
Três Povos,PCTP/MRPP,0.28,1,050432
Três Povos,PDR,0,0,050432
Três Povos,PPM,0,0,050432
Três Povos,PURP,0,0,050432
