Objeto do Contrato,Tipo de Procedimento,Tipo(s) de Contrato,CPVs,Entidade(s) Adjudicante(s),Entidade(s) Adjudicatária(s),Preço Contratual,Data de Publicação,Data de Celebração do Contrato,Prazo de Execução,Local de Execução,Fundamentação,Data de Fecho do Contrato,Preço Total Efetivo,Causas das Alterações ao Prazo,Causas das Alterações ao Preço,Estado,N.º registo do Acordo Quadro,Descrição do Acordo Quadro,Procedimento Centralizado
Aquisição de medicamentos,Ao abrigo de acordo-quadro (art.º 259.º),Aquisição de bens móveis,"33600000-6, Produtos farmacêuticos","Administração Regional de Saúde do Centro, I. P. (503122165)",Generis Farmaceutica sa (505625520),"268,00 €",21-01-2014,21-01-2014,120 dias,"Portugal, Coimbra, Coimbra",Artigo 259.º do Código dos Contratos Públicos,,,,,,370804,CONCURSO PÚBLICO PARA A CELEBRAÇÃO DE CONTRATOS PÚBLICOS DE APROVISIONAMENTO PARA AQUISIÇÃO HORMONAS E OUTROS MEDICAMENTOS USADOS NO TRATAMENTO DAS DOENÇAS ENDÓCRINAS,FALSE
Prestação de Serviços de assistencia técnica e manutenção  do elevador instalado no CS de Pombal,Ajuste Direto Regime Geral,Aquisição de serviços,"50750000-7, Serviços de manutenção de elevadores","Administração Regional de Saúde do Centro, I.P. (503122165)",Grupnor Lda (500959579),"228,00 €",21-01-2014,19-12-2013,365 dias,"Portugal, Leiria, Pombal",Artigo 258.º do Código dos Contratos Públicos,,,,,,Não aplicável.,Não aplicável.,FALSE
Processo n.º 13800018. ACES Baixo Mondego. Centro de Saúde de Fernão de Magalhães. Obras para instalação de plataforma elevatória.,Ajuste Direto Regime Geral,Empreitadas de obras públicas,"45000000-7, Construção","Administração Regional de Saúde do Centro, I. P. (503122165)","Construções A. Martins Rodrigues, Lda (501630910)","11.244,18 €",21-01-2014,24-10-2013,15 dias,"Portugal, Coimbra, Coimbra","Artigo 19.º, alínea a) do Código dos Contratos Públicos",,,,,,Não aplicável.,Não aplicável.,FALSE
Prestação de Serviços de manutenção e assistencia tecnica elevador no CS Marinha Grande,Ajuste Direto Regime Geral,Aquisição de serviços,"50700000-2, Serviços de reparação e manutenção de equipamento em edifícios","ADMINISTRAÇÃO REGIONAL DE SAÚDE DO CENTRO, I. P. (503122165)",Thyssenkrupp Elevadores SA (501445226),"22,19 €",21-01-2014,01-06-2013,365 dias,"Portugal, Leiria, Marinha Grande",Artigo 258.º do Código dos Contratos Públicos,,,,,,Não aplicável.,Não aplicável.,FALSE
Processo 13250117 - aquisição material clinico,Ao abrigo de acordo-quadro (art.º 259.º),Aquisição de bens móveis,"33140000-3, Material médico de consumo","Administração Regional de Saúde do Centro, I. P. (503122165)","Quilaban, Lda (500399670)","1.757,80 €",20-01-2014,15-01-2014,180 dias,"Portugal, Coimbra, Coimbra<BR/>Portugal, Viseu, Viseu",Artigo 259.º do Código dos Contratos Públicos,,,,,,598830,"CONCURSO PÚBLICO PARA A CELEBRAÇÃO DE CONTRATOS PÚBLICOS DE APROVISIONAMENTO PARA A ÁREA DA SAÚDE, COM VISTA AO FORNECIMENTO DE MATERIAL DE INCONTINÊNCIA, PROTEÇÃO CUTÂNEA E ALÍVIO DE PRESSÃO, ÀS INSTITUIÇÕES E SERVIÇOS DO SERVIÇO NACIONAL DE SAÚDE",FALSE
Processo 13250116 - Material consumo clinico,Ao abrigo de acordo-quadro (art.º 259.º),Aquisição de bens móveis,"33140000-3, Material médico de consumo","Administração Regional de Saúde do Centro, I. P. (503122165)","Bastos Viegas, SA (500042772)","1.049,60 €",20-01-2014,15-01-2014,180 dias,"Portugal, Viseu, Viseu<BR/>Portugal, Coimbra, Coimbra",Artigo 259.º do Código dos Contratos Públicos,,,,,,544071,"CONCURSO PÚBLICO PARA A CELEBRAÇÃO DE CONTRATOS PÚBLICOS DE APROVISIONAMENTO PARA A ÁREA DA SAÚDE, COM VISTA AO FORNECIMENTO DE LUVAS PARA USO MÉDICO, ÀS INSTITUIÇÕES E SERVIÇOS DO SERVIÇO NACIONAL DE SAÚDE",FALSE
Processo 13250116 - Material consumo clinico,Ao abrigo de acordo-quadro (art.º 259.º),Aquisição de bens móveis,"33140000-3, Material médico de consumo","Administração Regional de Saúde do Centro, I. P. (503122165)","Pergut Portugal, Lda (501799729)","3.168,00 €",20-01-2014,15-01-2014,180 dias,"Portugal, Coimbra, Coimbra<BR/>Portugal, Viseu, Viseu",Artigo 259.º do Código dos Contratos Públicos,,,,,,544071,"CONCURSO PÚBLICO PARA A CELEBRAÇÃO DE CONTRATOS PÚBLICOS DE APROVISIONAMENTO PARA A ÁREA DA SAÚDE, COM VISTA AO FORNECIMENTO DE LUVAS PARA USO MÉDICO, ÀS INSTITUIÇÕES E SERVIÇOS DO SERVIÇO NACIONAL DE SAÚDE",FALSE
Processo 13250116 - Material consumo clinico,Ao abrigo de acordo-quadro (art.º 259.º),Aquisição de bens móveis,"33140000-3, Material médico de consumo","Administração Regional de Saúde do Centro, I. P. (503122165)","Pergut Portugal, Lda (501799729)","11.520,00 €",20-01-2014,15-01-2014,180 dias,"Portugal, Viseu, Viseu<BR/>Portugal, Coimbra, Coimbra",Artigo 259.º do Código dos Contratos Públicos,,,,,,544071,"CONCURSO PÚBLICO PARA A CELEBRAÇÃO DE CONTRATOS PÚBLICOS DE APROVISIONAMENTO PARA A ÁREA DA SAÚDE, COM VISTA AO FORNECIMENTO DE LUVAS PARA USO MÉDICO, ÀS INSTITUIÇÕES E SERVIÇOS DO SERVIÇO NACIONAL DE SAÚDE",FALSE
Aquisição de lenticulas p/ Laboratórios de Saúde Pública,Ajuste Direto Regime Geral,Aquisição de bens móveis,"33696500-0, Reagentes de laboratório","Administração Regional de Saúde do Centro, I.P. (503122165)","Normax - Fábrica de Vidros Cientificos, Lda (500203130)","4.868,50 €",20-01-2014,20-01-2014,365 dias,"Portugal, Leiria, Leiria<BR/>Portugal, Coimbra, Coimbra<BR/>Portugal, Aveiro, Aveiro","Artigo 20.º, n.º 1, alínea a) do Código dos Contratos Públicos",,,,,,Não aplicável.,Não aplicável.,FALSE
Aquisição de vacina,Ajuste Direto Regime Geral,Aquisição de bens móveis,"33600000-6, Produtos farmacêuticos","Administração Regional de Saúde do Centro, I. P. (503122165)","CSL BEHRING,Lda (503047201)","41.250,00 €",20-01-2014,09-01-2014,30 dias,"Portugal, Coimbra, Coimbra","Artigo 24.º, n.º 1, alínea e) do Código dos Contratos Públicos",,,,,,Não aplicável.,Não aplicável.,FALSE
Aquisição de equipamento diverso p/ UCC Laços Mar e Ria e UCC Sever Vouga,Ajuste Direto Regime Geral,Aquisição de bens móveis,"33000000-0, Equipamento médico, medicamentos e produtos para cuidados pessoais","Administração Regional de Saúde do Centro, I.P. (503122165)","Promeicentro, Lda (506470113)","142,50 €",17-01-2014,17-01-2014,15 dias,"Portugal, Aveiro, Aveiro","Artigo 20.º, n.º 1, alínea a) do Código dos Contratos Públicos",,,,,,Não aplicável.,Não aplicável.,FALSE
Aquisição de equipamento diverso p/ UCC Laços Mar e Ria e UCC Sever Vouga,Ajuste Direto Regime Geral,Aquisição de bens móveis,"33000000-0, Equipamento médico, medicamentos e produtos para cuidados pessoais","Administração Regional de Saúde do Centro, I.P. (503122165)","Bastos Viegas, SA (500042772)","1.180,00 €",17-01-2014,17-01-2014,15 dias,"Portugal, Aveiro, Sever do Vouga<BR/>Portugal, Aveiro, Aveiro","Artigo 20.º, n.º 1, alínea a) do Código dos Contratos Públicos",,,,,,Não aplicável.,Não aplicável.,FALSE
Processo n.º 900982. Elaboração do projeto para o CS Sever do Vouga.,Ajuste Direto Regime Geral,Aquisição de serviços,"71000000-8, Serviços de arquitectura, construção, engenharia e inspecção","Administração Regional de Saúde do Centro, I. P. (503122165)",SUCH-Serviço Utilização dos Hospitais (500900469),"7.312,50 €",17-01-2014,07-03-2012,60 dias,"Portugal, Viseu, Viseu","Artigo 20.º, n.º 1, alínea a) do Código dos Contratos Públicos",,,,,,Não aplicável.,Não aplicável.,FALSE
