Objeto do Contrato,Tipo de Procedimento,Tipo(s) de Contrato,CPVs,Entidade(s) Adjudicante(s),Entidade(s) Adjudicatária(s),Preço Contratual,Data de Publicação,Data de Celebração do Contrato,Prazo de Execução,Local de Execução,Fundamentação,Data de Fecho do Contrato,Preço Total Efetivo,Causas das Alterações ao Prazo,Causas das Alterações ao Preço,Estado,N.º registo do Acordo Quadro,Descrição do Acordo Quadro,Procedimento Centralizado
Seguros de Acidentes de Trabalho em RCTFP,Ajuste Direto Regime Geral,Aquisição de serviços,"66510000-8, Serviços de seguros","Hospital do Espírito Santo de Évora, E. P. E. (508085888)","Generali - Companhia de Seguros, SPA (980060613)","14.639,13 €",09-02-2015,20-11-2014,31 dias,"Portugal, Évora, Évora","Artigo 20.º, n.º 1, alínea a) do Código dos Contratos Públicos",,,,,,Não aplicável.,Não aplicável.,FALSE
MCDT's analises,Ajuste Direto Regime Geral,Aquisição de serviços,"85148000-8, Serviços de análises clínicas","Hospital do Espírito Santo de Évora, E. P. E. (508085888)",Laboratorio Fernando Teixeira (500065012),"15.515,14 €",05-02-2015,03-11-2014,120 dias,"Portugal, Évora, Évora","Artigo 20.º, n.º 1, alínea a) do Código dos Contratos Públicos",,,,,,Não aplicável.,Não aplicável.,FALSE
