Objeto do Contrato,Tipo de Procedimento,Tipo(s) de Contrato,CPVs,Entidade(s) Adjudicante(s),Entidade(s) Adjudicatária(s),Preço Contratual,Data de Publicação,Data de Celebração do Contrato,Prazo de Execução,Local de Execução,Fundamentação,Data de Fecho do Contrato,Preço Total Efetivo,Causas das Alterações ao Prazo,Causas das Alterações ao Preço,Estado,N.º registo do Acordo Quadro,Descrição do Acordo Quadro,Procedimento Centralizado
Sonda com iluminação p/ Ciclofotocoagulação a Laser G; Sonda MicroPulse MP3,Ajuste Direto Regime Geral,Aquisição de bens móveis,"33100000-1, Equipamento médico",Instituto de Oftalmologia do Dr. Gama Pinto (600000052),José Cotta (500155739),"6.000,00 €",27-12-2018,27-12-2018,1 dias,"Portugal, Lisboa, Lisboa","Artigo 24.º, n.º 1, alínea e), subalínea ii) do Código dos Contratos Públicos",27-12-2018,"6.000,00 €",,"",,Não aplicável.,Não aplicável.,FALSE
Aquisição de Equipamentos,Concurso público,Aquisição de bens móveis,"33100000-1, Equipamento médico",Instituto de Oftalmologia do Dr. Gama Pinto (600000052),"OFTALDATA - PRODUTOS P\ OFTALMOLOGIA, LDA (504887459)","48.600,00 €",26-12-2018,21-12-2018,5 dias,"Portugal, Lisboa, Lisboa","Artigo 155.º, alínea a) do Código dos Contratos Públicos",27-12-2018,"",,Fornecedor informou que não consegue entregar material no prazo previsto no caderno de encargos,,Não aplicável.,Não aplicável.,FALSE
Aquisição de Equipamentos,Concurso público,Aquisição de bens móveis,"33100000-1, Equipamento médico",Instituto de Oftalmologia do Dr. Gama Pinto (600000052),José Cotta (500155739),"27.500,00 €",26-12-2018,21-12-2018,5 dias,"Portugal, Lisboa, Lisboa","Artigo 155.º, alínea a) do Código dos Contratos Públicos",27-12-2018,"27.500,00 €",,"",,Não aplicável.,Não aplicável.,FALSE
