Objeto do Contrato,Tipo de Procedimento,Tipo(s) de Contrato,CPVs,Entidade(s) Adjudicante(s),Entidade(s) Adjudicatária(s),Preço Contratual,Data de Publicação,Data de Celebração do Contrato,Prazo de Execução,Local de Execução,Fundamentação,Data de Fecho do Contrato,Preço Total Efetivo,Causas das Alterações ao Prazo,Causas das Alterações ao Preço,Estado,N.º registo do Acordo Quadro,Descrição do Acordo Quadro,Procedimento Centralizado
41000213 - Programa Controlo Qualidade Externo,Ajuste Direto Regime Geral,Aquisição de bens móveis,"33696500-0, Reagentes de laboratório","Centro Hospitalar Póvoa de Varzim - Vila do Conde, E. P. E. (508741823)","BIOGNÓSTICA - DISTRIB. PROD. E EQUIP. TÉCNICOS,LDA (504441256)","2.738,00 €",28-10-2015,04-04-2013,271 dias,"Portugal, Porto, Póvoa de Varzim","Artigo 20.º, n.º 1, alínea a) do Código dos Contratos Públicos",,,,,,Não aplicável.,Não aplicável.,FALSE
41000213 - Programa Controlo Qualidade Externo,Ajuste Direto Regime Geral,Aquisição de bens móveis,"33696500-0, Reagentes de laboratório","Centro Hospitalar Póvoa de Varzim - Vila do Conde, E. P. E. (508741823)",BIO-RAD LABORATORIES LDA (501301321),"1.050,00 €",28-10-2015,04-04-2013,271 dias,"Portugal, Porto, Póvoa de Varzim","Artigo 20.º, n.º 1, alínea a) do Código dos Contratos Públicos",,,,,,Não aplicável.,Não aplicável.,FALSE
41000213 - Programa Controlo Qualidade Externo,Ajuste Direto Regime Geral,Aquisição de bens móveis,"33696500-0, Reagentes de laboratório","Centro Hospitalar Póvoa de Varzim - Vila do Conde, E. P. E. (508741823)","IRLANDOX- LABORATÓRIOS QUÍMICA ANALÍTICA, LDA (502515619)","2.271,14 €",28-10-2015,04-04-2013,271 dias,"Portugal, Porto, Póvoa de Varzim","Artigo 20.º, n.º 1, alínea a) do Código dos Contratos Públicos",,,,,,Não aplicável.,Não aplicável.,FALSE
41000213 - Programa de Controlo de Qualidade Externo,Ajuste Direto Regime Geral,Aquisição de bens móveis,"33696500-0, Reagentes de laboratório","Centro Hospitalar Póvoa de Varzim - Vila do Conde, E. P. E. (508741823)",INSTITUTO NAC. SAUDE DR RICARDO JORGE (501427511),"669,30 €",27-10-2015,04-04-2013,271 dias,"Portugal, Porto, Póvoa de Varzim","Artigo 20.º, n.º 1, alínea a) do Código dos Contratos Públicos",,,,,,Não aplicável.,Não aplicável.,FALSE
42001113 - Material Clínico para SIV,Ajuste Direto Regime Geral,Aquisição de bens móveis,"33140000-3, Material médico de consumo","Centro Hospitalar Póvoa de Varzim - Vila do Conde, E. P. E. (508741823)","PHYSIO PORTUGAL SALES, UNIPESSOAL, LDA (510137946)","4.650,00 €",26-10-2015,04-04-2013,271 dias,"Portugal, Porto, Póvoa de Varzim","Artigo 20.º, n.º 1, alínea a) do Código dos Contratos Públicos",,,,,,Não aplicável.,Não aplicável.,FALSE
42001113 - Material Clínico para SIV,Ajuste Direto Regime Geral,Aquisição de bens móveis,"33140000-3, Material médico de consumo","Centro Hospitalar Póvoa de Varzim - Vila do Conde, E. P. E. (508741823)","RMV - PRODUTOS HOSPITALARES, UNIPESSOAL LDA (507866347)","172,72 €",26-10-2015,04-04-2013,271 dias,"Portugal, Porto, Póvoa de Varzim","Artigo 20.º, n.º 1, alínea a) do Código dos Contratos Públicos",,,,,,Não aplicável.,Não aplicável.,FALSE
42001113 - Material Clínico para SIV,Ajuste Direto Regime Geral,Aquisição de bens móveis,"33140000-3, Material médico de consumo","Centro Hospitalar Póvoa de Varzim - Vila do Conde, E. P. E. (508741823)",PAUL HARTMANN LDA (502271728),"76,00 €",26-10-2015,04-04-2013,271 dias,"Portugal, Porto, Póvoa de Varzim","Artigo 20.º, n.º 1, alínea a) do Código dos Contratos Públicos",,,,,,Não aplicável.,Não aplicável.,FALSE
42001113 - Material Clínico para SIV,Ajuste Direto Regime Geral,Aquisição de bens móveis,"33140000-3, Material médico de consumo","Centro Hospitalar Póvoa de Varzim - Vila do Conde, E. P. E. (508741823)","MUNDINTER-INTERC.M.COMERCIO,SA (500199906)","10,50 €",26-10-2015,04-04-2013,271 dias,"Portugal, Porto, Póvoa de Varzim","Artigo 20.º, n.º 1, alínea a) do Código dos Contratos Públicos",,,,,,Não aplicável.,Não aplicável.,FALSE
42001113 - Material Clínico para SIV,Ajuste Direto Regime Geral,Aquisição de bens móveis,"33140000-3, Material médico de consumo","Centro Hospitalar Póvoa de Varzim - Vila do Conde, E. P. E. (508741823)","INTERSURGICAL PORTUGAL, LDA (503480045)","110,50 €",26-10-2015,04-04-2013,271 dias,"Portugal, Porto, Póvoa de Varzim","Artigo 20.º, n.º 1, alínea a) do Código dos Contratos Públicos",,,,,,Não aplicável.,Não aplicável.,FALSE
42001113 - Material Clínico para SIV,Ajuste Direto Regime Geral,Aquisição de bens móveis,"33140000-3, Material médico de consumo","Centro Hospitalar Póvoa de Varzim - Vila do Conde, E. P. E. (508741823)",IBERDATA EQUIPAMENTOS SA (501904921),"4.582,57 €",26-10-2015,04-04-2013,271 dias,"Portugal, Porto, Póvoa de Varzim","Artigo 20.º, n.º 1, alínea a) do Código dos Contratos Públicos",,,,,,Não aplicável.,Não aplicável.,FALSE
42001113 - Material Clínico para SIV,Ajuste Direto Regime Geral,Aquisição de bens móveis,"33140000-3, Material médico de consumo","Centro Hospitalar Póvoa de Varzim - Vila do Conde, E. P. E. (508741823)","H.R. HOSPITALAR, UNIPESSOAL, LDA (501895558)","1.135,00 €",26-10-2015,04-04-2013,271 dias,"Portugal, Porto, Póvoa de Varzim","Artigo 20.º, n.º 1, alínea a) do Código dos Contratos Públicos",,,,,,Não aplicável.,Não aplicável.,FALSE
42001113 - Material Clínico para SIV,Ajuste Direto Regime Geral,Aquisição de bens móveis,"33141000-0, Material médico não químico descartável e produtos hematológicos","Centro Hospitalar Póvoa de Varzim - Vila do Conde, E. P. E. (508741823)","MEDICINALIA CORMEDICA - MCMEDICAL,LDA (500684324)","185,00 €",26-10-2015,04-04-2013,271 dias,"Portugal, Porto, Póvoa de Varzim","Artigo 20.º, n.º 1, alínea a) do Código dos Contratos Públicos",,,,,,Não aplicável.,Não aplicável.,FALSE
42001113 - Material Clínica para SIV,Ajuste Direto Regime Geral,Aquisição de bens móveis,"33140000-3, Material médico de consumo","Centro Hospitalar Póvoa de Varzim - Vila do Conde, E. P. E. (508741823)","BASTOS VIEGAS, S.A. (500042772)","536,88 €",26-10-2015,04-04-2013,271 dias,"Portugal, Porto, Póvoa de Varzim","Artigo 20.º, n.º 1, alínea a) do Código dos Contratos Públicos",,,,,,Não aplicável.,Não aplicável.,FALSE
"Fornecimento de roupa e fardamento hospitalar para o CHPVVC, E.P.E.",Ajuste Direto Regime Geral,Aquisição de bens móveis,"39512000-4, Roupa de cama","Centro Hospitalar Póvoa de Varzim - Vila do Conde, E.P.E. (508741823)","MUNDIFATO - RIBEIRO & CARLOS, LDA (502383542)","11.229,75 €",22-10-2015,21-11-2013,365 dias,"Portugal, Porto, Póvoa de Varzim","Artigo 20.º, n.º 1, alínea a) do Código dos Contratos Públicos",,,,,,Não aplicável.,Não aplicável.,
81201112 - Osteossíntese - Tendo por base as necessidades apresentadas pelo Director de serviço relacionados com a actividade cirúrgica de ortopedia que serão necessárias até à conclusão dos procedimentos concursais que se encontram a decorrer.,Ajuste Direto Regime Geral,Aquisição de bens móveis,"33183300-9, Aparelhos para osteossíntese","Centro Hospitalar Póvoa de Varzim - Vila do Conde, E. P. E. (508741823)","STRYKER PORTUGAL PROD.MEDICOS, LDA (504594214)","19.434,50 €",21-10-2015,13-02-2014,60 dias,"Portugal, Porto, Póvoa de Varzim","Artigo 20.º, n.º 1, alínea a) do Código dos Contratos Públicos",,,,,,Não aplicável.,Não aplicável.,FALSE
