freguesia,acronym,validVotesPercentage,votes,dicofre
União das freguesias da Sé e São Lourenço,PS,38.1,1535,121411
União das freguesias da Sé e São Lourenço,PPD/PSD.CDS-PP,28,1128,121411
União das freguesias da Sé e São Lourenço,PCP-PEV,14.52,585,121411
União das freguesias da Sé e São Lourenço,MPT,6.23,251,121411
União das freguesias da Sé e São Lourenço,B.E.,5.46,220,121411
União das freguesias da Sé e São Lourenço,PCTP/MRPP,2.01,81,121411
União das freguesias da Sé e São Lourenço,L,1.76,71,121411
União das freguesias da Sé e São Lourenço,PAN,1.37,55,121411
União das freguesias da Sé e São Lourenço,PNR,0.5,20,121411
União das freguesias da Sé e São Lourenço,PPM,0.42,17,121411
União das freguesias da Sé e São Lourenço,PTP,0.42,17,121411
União das freguesias da Sé e São Lourenço,MAS,0.35,14,121411
União das freguesias da Sé e São Lourenço,PND,0.3,12,121411
União das freguesias da Sé e São Lourenço,POUS,0.25,10,121411
União das freguesias da Sé e São Lourenço,PPV,0.25,10,121411
União das freguesias da Sé e São Lourenço,PDA,0.07,3,121411
