freguesia,acronym,validVotesPercentage,votes,dicofre
Cacia,PS,31.12,585,010502
Cacia,PPD/PSD.CDS-PP,30.43,572,010502
Cacia,MPT,12.39,233,010502
Cacia,PCP-PEV,9.68,182,010502
Cacia,B.E.,6.33,119,010502
Cacia,L,2.39,45,010502
Cacia,PCTP/MRPP,2.13,40,010502
Cacia,PAN,1.28,24,010502
Cacia,PND,0.74,14,010502
Cacia,PPM,0.74,14,010502
Cacia,MAS,0.69,13,010502
Cacia,PTP,0.64,12,010502
Cacia,PNR,0.53,10,010502
Cacia,PPV,0.43,8,010502
Cacia,POUS,0.27,5,010502
Cacia,PDA,0.21,4,010502
