Objeto do Contrato,Tipo de Procedimento,Tipo(s) de Contrato,CPVs,Entidade(s) Adjudicante(s),Entidade(s) Adjudicatária(s),Preço Contratual,Data de Publicação,Data de Celebração do Contrato,Prazo de Execução,Local de Execução,Fundamentação,Data de Fecho do Contrato,Preço Total Efetivo,Causas das Alterações ao Prazo,Causas das Alterações ao Preço,Estado,N.º registo do Acordo Quadro,Descrição do Acordo Quadro,Procedimento Centralizado
"1148O17 Medicamento analgésico, antipiréticos e antidepressivos",Ao abrigo de acordo-quadro (art.º 259.º),Aquisição de bens móveis,"33600000-6, Produtos farmacêuticos","Centro Hospitalar de Leiria, E. P. E. (509822932)",OVERPHARMA-PROD.MEDICOS FARMACEUTICOS (505792362),"104,83 €",09-06-2017,07-06-2017,210 dias,"Portugal, Leiria, Leiria","Artigo 20.º, n.º 1, alínea b) do Código dos Contratos Públicos","","",,,,1974985,"Medicamentos Analgésicos, Antipiréticos e Antidepressivos",FALSE
"1148O17 Medicamento analgésico, antipiréticos e antidepressivos",Ao abrigo de acordo-quadro (art.º 259.º),Aquisição de bens móveis,"33600000-6, Produtos farmacêuticos","Centro Hospitalar de Leiria, E. P. E. (509822932)","LABORATORIO MEDINFAR, SA (500384045)","1.560,00 €",09-06-2017,07-06-2017,210 dias,"Portugal, Leiria, Leiria","Artigo 20.º, n.º 1, alínea b) do Código dos Contratos Públicos","","",,,,1974985,"Medicamentos Analgésicos, Antipiréticos e Antidepressivos",FALSE
"1148O17 Medicamento analgésico, antipiréticos e antidepressivos",Ao abrigo de acordo-quadro (art.º 259.º),Aquisição de bens móveis,"33600000-6, Produtos farmacêuticos","Centro Hospitalar de Leiria, E. P. E. (509822932)","UNILFARMA-UNIAO INTERN.LABOR.FARM., LDA (500293023)","425,60 €",09-06-2017,07-06-2017,210 dias,"Portugal, Leiria, Leiria","Artigo 20.º, n.º 1, alínea b) do Código dos Contratos Públicos","","",,,,1974985,"Medicamentos Analgésicos, Antipiréticos e Antidepressivos",FALSE
"1148O17 Medicamento analgésico, antipiréticos e antidepressivos",Ao abrigo de acordo-quadro (art.º 259.º),Aquisição de bens móveis,"33600000-6, Produtos farmacêuticos","Centro Hospitalar de Leiria, E. P. E. (509822932)","RATIOPHARM-COM.IND.PROD.FARMACEUT., LDA (502414910)","24,32 €",09-06-2017,07-06-2017,210 dias,"Portugal, Leiria, Leiria","Artigo 20.º, n.º 1, alínea b) do Código dos Contratos Públicos","","",,,,1974985,"Medicamentos Analgésicos, Antipiréticos e Antidepressivos",FALSE
1103E17 ALCOOL ISOPROPILICO 70% - 500 ML ESTERELIZADO,Ajuste Direto Regime Geral,Aquisição de bens móveis,"33600000-6, Produtos farmacêuticos","Centro Hospitalar de Leiria, E. P. E. (509822932)","VWR INTERNACIONAL-MAT.LABORATOR.,LDA (503842770)","858,80 €",09-06-2017,07-06-2017,210 dias,"Portugal, Leiria, Leiria","Artigo 20.º, n.º 1, alínea a) do Código dos Contratos Públicos","","",,,,Não aplicável.,Não aplicável.,FALSE
Propofol 200 mg/20 ml,Ao abrigo de acordo-quadro (art.º 259.º),Aquisição de bens móveis,"33600000-6, Produtos farmacêuticos","Centro Hospitalar de Leiria, E. P. E. (509822932)","FRESENIUS KABI PHARMA PORTUGAL,LDA (504293753)","316,00 €",09-06-2017,07-06-2017,20 dias,"Portugal, Leiria, Leiria",Artigo 259.º do Código dos Contratos Públicos,09-06-2017,"316,00 €",,,,611371,"CONCURSO PÚBLICO PARA A CELEBRAÇÃO DE CONTRATOS PÚBLICOS DE APROVISIONAMENTO PARA A ÁREA DA SAÚDE, COM VISTA AO FORNECIMENTO DE MEDICAMENTOS ANESTÉSICOS E RELAXANTES MUSCULARES, ÀS INSTITUIÇÕES E SERVIÇOS DO SERVIÇO NACIONAL DE SAÚDE    ",FALSE
Derivados do plasma,Ao abrigo de acordo-quadro (art.º 259.º),Aquisição de bens móveis,"33600000-6, Produtos farmacêuticos","Centro Hospitalar de Leiria, E. P. E. (509822932)","CSL  BEHRING, LDA (503047201)","800,00 €",09-06-2017,08-06-2017,20 dias,"Portugal, Leiria, Leiria",Artigo 259.º do Código dos Contratos Públicos,09-06-2017,"800,00 €",,,,1423488,ACORDO QUADRO PARA FORNECIMENTO DE DERIVADOS DO PLASMA HUMANO ÀS INSTITUIÇÕES E SERVIÇOS DO SERVIÇO NACIONAL DE SAÚDE CP 2015/9,FALSE
"Medicamento Bisoprolol 2,5 mg comp - CPA 2016/01",Ao abrigo de acordo-quadro (art.º 259.º),Aquisição de bens móveis,"33600000-6, Produtos farmacêuticos","Centro Hospitalar de Leiria, E. P. E. (509822932)",Aurobindo Pharma Portugal (508527465),"680,00 €",09-06-2017,08-06-2017,210 dias,"Portugal, Leiria, Leiria",Artigo 259.º do Código dos Contratos Públicos,"","",,,,2335591,CP 2016/01 - Acordo Quadro para fornecimento de Medicamentos do Aparelho Cardiovascular   às Instituições e Serviços do Serviço Nacional de Saúde,FALSE
Medicamento Exclusivo Fentanilo Sublingual,Ajuste Direto Regime Geral,Aquisição de bens móveis,"33600000-6, Produtos farmacêuticos","Centro Hospitalar de Leiria, E. P. E. (509822932)",ALLOGA (504507230),"24.772,00 €",09-06-2017,08-06-2017,270 dias,"Portugal, Leiria, Leiria","Artigo 24.º, n.º 1, alínea e) do Código dos Contratos Públicos","","",,,,Não aplicável.,Não aplicável.,FALSE
1131O17 Medicamento Amoxicilina + Ácido Clavulânico,Ao abrigo de acordo-quadro (art.º 259.º),Aquisição de bens móveis,"33600000-6, Produtos farmacêuticos","Centro Hospitalar de Leiria, E. P. E. (509822932)","GENERIS-FARMACEUTICA,SA (508107997)","60.800,00 €",09-06-2017,07-06-2017,210 dias,"Portugal, Leiria, Leiria",Artigo 259.º do Código dos Contratos Públicos,"","",,,,1326195,ACORDO QUADRO PARA FORNECIMENTO DE MEDICAMENTOS ANTI-INFECIOSOS: EXCETO ANTIVÍRICOS E ANTIFÚNGICOS ÀS INSTITUIÇÕES E SERVIÇOS DO SERVIÇO NACIONAL DE SAÚDE,FALSE
Marcador cirúrgico,Ajuste Direto Regime Geral,Aquisição de bens móveis,"33140000-3, Material médico de consumo","Centro Hospitalar de Leiria, E. P. E. (509822932)","MEDTRONIC PORTUGAL, LDA (504223933)","248,00 €",09-06-2017,03-01-2017,180 dias,"Portugal, Leiria, Leiria","Artigo 20.º, n.º 1, alínea a) do Código dos Contratos Públicos",16-05-2017,"248,00 €",,,,Não aplicável.,Não aplicável.,FALSE
Lâmina laringoscópio,Ajuste Direto Regime Geral,Aquisição de bens móveis,"33140000-3, Material médico de consumo","Centro Hospitalar de Leiria, E. P. E. (509822932)","INTERSURGICAL PORTUGAL, LDA (503480045)","116,80 €",09-06-2017,03-01-2017,180 dias,"Portugal, Leiria, Leiria","Artigo 20.º, n.º 1, alínea a) do Código dos Contratos Públicos",16-05-2017,"116,80 €",,,,Não aplicável.,Não aplicável.,FALSE
Imobilizadores,Ajuste Direto Regime Geral,Aquisição de bens móveis,"33140000-3, Material médico de consumo","Centro Hospitalar de Leiria, E. P. E. (509822932)","GAMEIROS MATERIAL CLINICO, LDA (503326305)","519,20 €",09-06-2017,03-01-2017,180 dias,"Portugal, Leiria, Leiria","Artigo 20.º, n.º 1, alínea a) do Código dos Contratos Públicos",16-05-2017,"519,20 €",,,,Não aplicável.,Não aplicável.,FALSE
Preservativo para ecografia,Ajuste Direto Regime Geral,Aquisição de bens móveis,"33140000-3, Material médico de consumo","Centro Hospitalar de Leiria, E. P. E. (509822932)","EZEQUIEL PANAO JORGE, LDA (501412727)","204,36 €",09-06-2017,03-01-2017,180 dias,"Portugal, Leiria, Leiria","Artigo 20.º, n.º 1, alínea a) do Código dos Contratos Públicos",16-05-2017,"204,36 €",,,,Não aplicável.,Não aplicável.,FALSE
Dorsolombostato,Ajuste Direto Regime Geral,Aquisição de bens móveis,"33100000-1, Equipamento médico","Centro Hospitalar de Leiria, E. P. E. (509822932)","EXELMEDICA-PROD.MEDICO-CIRURGICOS,LDA (502263989)","6.037,40 €",09-06-2017,03-01-2017,180 dias,"Portugal, Leiria, Leiria","Artigo 20.º, n.º 1, alínea a) do Código dos Contratos Públicos",16-05-2017,"6.037,40 €",,,,Não aplicável.,Não aplicável.,FALSE
Especulo auricular,Ajuste Direto Regime Geral,Aquisição de bens móveis,"33140000-3, Material médico de consumo","Centro Hospitalar de Leiria, E. P. E. (509822932)","EPJMEDICA-ART.MEDICOS HOSPITALARES, LDA (506820513)","486,00 €",09-06-2017,03-01-2017,180 dias,"Portugal, Leiria, Leiria","Artigo 20.º, n.º 1, alínea a) do Código dos Contratos Públicos",16-05-2017,"486,00 €",,,,Não aplicável.,Não aplicável.,FALSE
"Consumíveis exclusivos """"Olympus""""",Ajuste Direto Regime Geral,Aquisição de bens móveis,"33140000-3, Material médico de consumo","Centro Hospitalar de Leiria, E. P. E. (509822932)","OLYMPUS IBERIA,S.A.U. (980474710)","41.436,60 €",09-06-2017,06-06-2017,365 dias,"Portugal, Leiria, Leiria","Artigo 24.º, n.º 1, alínea e) do Código dos Contratos Públicos","","",,,,Não aplicável.,Não aplicável.,FALSE
Reagentes para Biologia Molecular,Ajuste Direto Regime Geral,Aquisição de bens móveis,"33696000-5, Reagentes e meios de contraste","Centro Hospitalar de Leiria, E. P. E. (509822932)","Werfen Portugal, Ldª (501086110)","57.645,00 €",09-06-2017,29-05-2017,210 dias,"Portugal, Leiria, Leiria","Artigo 24.º, n.º 1, alínea e) do Código dos Contratos Públicos","","",,,,Não aplicável.,Não aplicável.,FALSE
Cabo bisturi eletrico,Ajuste Direto Regime Geral,Aquisição de bens móveis,"33140000-3, Material médico de consumo","Centro Hospitalar de Leiria, E. P. E. (509822932)","BACELAR E IRMAO EQUIP. MEDICOS, LDA. (500532818)","1.500,00 €",08-06-2017,03-01-2017,180 dias,"Portugal, Leiria, Leiria","Artigo 20.º, n.º 1, alínea a) do Código dos Contratos Públicos",16-05-2017,"1.500,00 €",,,,Não aplicável.,Não aplicável.,FALSE
Elástico vascular,Ajuste Direto Regime Geral,Aquisição de bens móveis,"33140000-3, Material médico de consumo","Centro Hospitalar de Leiria, E. P. E. (509822932)","B.BRAUN MEDICAL, LDA (501506543)","106,08 €",08-06-2017,03-01-2017,180 dias,"Portugal, Leiria, Leiria","Artigo 20.º, n.º 1, alínea a) do Código dos Contratos Públicos",16-05-2017,"106,08 €",,,,Não aplicável.,Não aplicável.,FALSE
Tubo garrote,Ajuste Direto Regime Geral,Aquisição de bens móveis,"33140000-3, Material médico de consumo","Centro Hospitalar de Leiria, E. P. E. (509822932)","TELEFLEX MEDICAL, S.A.U. (980249783)","104,25 €",08-06-2017,03-01-2017,180 dias,"Portugal, Leiria, Leiria","Artigo 20.º, n.º 1, alínea a) do Código dos Contratos Públicos",16-05-2017,"104,25 €",,,,Não aplicável.,Não aplicável.,FALSE
Ventosa extração fetal,Ajuste Direto Regime Geral,Aquisição de bens móveis,"33140000-3, Material médico de consumo","Centro Hospitalar de Leiria, E. P. E. (509822932)","SPECULUM-ARTIGOS MEDICOS, SA (502996323)","7.093,00 €",08-06-2017,03-01-2017,180 dias,"Portugal, Leiria, Leiria","Artigo 20.º, n.º 1, alínea a) do Código dos Contratos Públicos",16-05-2017,"7.093,00 €",,,,Não aplicável.,Não aplicável.,FALSE
Manta aquecimento,Ajuste Direto Regime Geral,Aquisição de bens móveis,"33100000-1, Equipamento médico","Centro Hospitalar de Leiria, E. P. E. (509822932)","P.M.H. PRODUTOS MEDICO HOSPITALARES, SA (502376899)","340,00 €",08-06-2017,03-01-2017,180 dias,"Portugal, Leiria, Leiria","Artigo 20.º, n.º 1, alínea a) do Código dos Contratos Públicos",16-05-2017,"340,00 €",,,,Não aplicável.,Não aplicável.,FALSE
Talas para dedos e ponta cabo bisturi,Ajuste Direto Regime Geral,Aquisição de bens móveis,"33140000-3, Material médico de consumo","Centro Hospitalar de Leiria, E. P. E. (509822932)","ANASTACIO SALDANHA UNIPESSOAL, LDA. (505804441)","389,10 €",08-06-2017,03-01-2017,180 dias,"Portugal, Leiria, Leiria","Artigo 20.º, n.º 1, alínea a) do Código dos Contratos Públicos",16-05-2017,"389,10 €",,,,Não aplicável.,Não aplicável.,FALSE
Obturadores,Ajuste Direto Regime Geral,Aquisição de bens móveis,"33140000-3, Material médico de consumo","Centro Hospitalar de Leiria, E. P. E. (509822932)","VYGON (PORTUGAL), LDA (503232785)","1.260,00 €",07-06-2017,03-01-2017,180 dias,"Portugal, Leiria, Leiria","Artigo 20.º, n.º 1, alínea a) do Código dos Contratos Públicos",15-05-2017,"1.260,00 €",,,,Não aplicável.,Não aplicável.,FALSE
Prolongadores,Ajuste Direto Regime Geral,Aquisição de bens móveis,"33140000-3, Material médico de consumo","Centro Hospitalar de Leiria, E. P. E. (509822932)","P.M.H. PRODUTOS MEDICO HOSPITALARES, SA (502376899)","1.130,00 €",07-06-2017,03-01-2017,180 dias,"Portugal, Leiria, Leiria","Artigo 20.º, n.º 1, alínea a) do Código dos Contratos Públicos",15-05-2017,"1.130,00 €",,,,Não aplicável.,Não aplicável.,FALSE
Máscaras de anestesia,Ajuste Direto Regime Geral,Aquisição de bens móveis,"33171110-3, Máscara de anestesia","Centro Hospitalar de Leiria, E. P. E. (509822932)","INTERSURGICAL PORTUGAL, LDA (503480045)","6.269,95 €",07-06-2017,03-01-2017,180 dias,"Portugal, Leiria, Leiria","Artigo 20.º, n.º 1, alínea a) do Código dos Contratos Públicos",15-05-2017,"6.269,95 €",,,,Não aplicável.,Não aplicável.,FALSE
Agulhas raqui,Ajuste Direto Regime Geral,Aquisição de bens móveis,"33141321-6, Agulhas de anestesia","Centro Hospitalar de Leiria, E. P. E. (509822932)","B.BRAUN MEDICAL, LDA (501506543)","692,10 €",07-06-2017,03-01-2017,180 dias,"Portugal, Leiria, Leiria","Artigo 20.º, n.º 1, alínea a) do Código dos Contratos Públicos",15-05-2017,"692,10 €",,,,Não aplicável.,Não aplicável.,FALSE
Trouxa extremidades e epidural,Ajuste Direto Regime Geral,Aquisição de bens móveis,"33140000-3, Material médico de consumo","Centro Hospitalar de Leiria, E. P. E. (509822932)","VYGON (PORTUGAL), LDA (503232785)","10.727,80 €",07-06-2017,15-05-2017,180 dias,"Portugal, Leiria, Leiria","Artigo 20.º, n.º 1, alínea a) do Código dos Contratos Públicos",15-05-2017,"10.727,80 €",,,,Não aplicável.,Não aplicável.,FALSE
Trouxa da anca,Ajuste Direto Regime Geral,Aquisição de bens móveis,"33140000-3, Material médico de consumo","Centro Hospitalar de Leiria, E. P. E. (509822932)","FACTOR PLUS-PROD.MEDIC.HOSPITALARES, SA (502810645)","2.412,00 €",07-06-2017,15-05-2017,180 dias,"Portugal, Leiria, Leiria","Artigo 20.º, n.º 1, alínea a) do Código dos Contratos Públicos",15-05-2017,"2.412,00 €",,,,Não aplicável.,Não aplicável.,FALSE
Trouxa cesariana,Ajuste Direto Regime Geral,Aquisição de bens móveis,"33140000-3, Material médico de consumo","Centro Hospitalar de Leiria, E. P. E. (509822932)","ANASTACIO SALDANHA UNIPESSOAL, LDA. (505804441)","2.155,68 €",07-06-2017,15-05-2017,180 dias,"Portugal, Leiria, Leiria","Artigo 20.º, n.º 1, alínea a) do Código dos Contratos Públicos",15-05-2017,"2.155,68 €",,,,Não aplicável.,Não aplicável.,FALSE
Faca micrótomo,Ajuste Direto Regime Geral,Aquisição de bens móveis,"33100000-1, Equipamento médico","Centro Hospitalar de Leiria, E. P. E. (509822932)","ZMWAY - LAB.SOLUTIONS, LDA. (508085349)","1.240,00 €",07-06-2017,19-01-2017,180 dias,"Portugal, Leiria, Leiria","Artigo 20.º, n.º 1, alínea a) do Código dos Contratos Públicos",30-03-2017,"1.240,00 €",,,,Não aplicável.,Não aplicável.,FALSE
Tubo segmentos,Ajuste Direto Regime Geral,Aquisição de bens móveis,"33140000-3, Material médico de consumo","Centro Hospitalar de Leiria, E. P. E. (509822932)","SARSTEDT, SA (503019461)","602,00 €",07-06-2017,19-01-2017,180 dias,"Portugal, Leiria, Leiria","Artigo 20.º, n.º 1, alínea a) do Código dos Contratos Públicos",30-03-2017,"602,00 €",,,,Não aplicável.,Não aplicável.,FALSE
Diverso material laboratório,Ajuste Direto Regime Geral,Aquisição de bens móveis,"33140000-3, Material médico de consumo","Centro Hospitalar de Leiria, E. P. E. (509822932)","NORMAX-FABRICA VIDROS CIENTIFICOS, LDA (500203130)","5.732,70 €",07-06-2017,19-01-2017,180 dias,"Portugal, Leiria, Leiria","Artigo 20.º, n.º 1, alínea a) do Código dos Contratos Públicos",19-05-2017,"5.732,70 €",,,,Não aplicável.,Não aplicável.,FALSE
Tubo para sangue,Ajuste Direto Regime Geral,Aquisição de bens móveis,"33140000-3, Material médico de consumo","Centro Hospitalar de Leiria, E. P. E. (509822932)","MENARINI DIAGNOSTICOS, LDA (502610069)","546,00 €",07-06-2017,19-01-2017,180 dias,"Portugal, Leiria, Leiria","Artigo 20.º, n.º 1, alínea a) do Código dos Contratos Públicos",30-03-2017,"546,00 €",,,,Não aplicável.,Não aplicável.,FALSE
Cassetes histológicas,Ajuste Direto Regime Geral,Aquisição de bens móveis,"33140000-3, Material médico de consumo","Centro Hospitalar de Leiria, E. P. E. (509822932)","GARAL-GABINETE TECNICO COMERCIAL, LDA (500777314)","324,00 €",07-06-2017,19-01-2017,180 dias,"Portugal, Leiria, Leiria","Artigo 20.º, n.º 1, alínea a) do Código dos Contratos Públicos",14-04-2017,"324,00 €",,,,Não aplicável.,Não aplicável.,FALSE
Diverso material de laboratório,Ajuste Direto Regime Geral,Aquisição de bens móveis,"33140000-3, Material médico de consumo","Centro Hospitalar de Leiria, E. P. E. (509822932)","EZEQUIEL PANAO JORGE, LDA (501412727)","752,82 €",07-06-2017,19-01-2017,180 dias,"Portugal, Leiria, Leiria","Artigo 20.º, n.º 1, alínea a) do Código dos Contratos Públicos",25-05-2017,"752,82 €",,,,Não aplicável.,Não aplicável.,FALSE
"Bolsa Nutritiva 1435 KCAL 8,6G N 1875 ML veia perif",Ao abrigo de acordo-quadro (art.º 259.º),Aquisição de bens móveis,"33600000-6, Produtos farmacêuticos","Centro Hospitalar de Leiria, E. P. E. (509822932)","FRESENIUS KABI PHARMA PORTUGAL, LDA (504293753)","1.766,00 €",06-06-2017,05-06-2017,210 dias,"Portugal, Leiria, Leiria",Artigo 259.º do Código dos Contratos Públicos,"","",,,,457058,"CONCURSO PÚBLICO PARA A CELEBRAÇÃO DE CONTRATOS PÚBLICOS DE APROVISIONAMENTO PARA A ÁREA DA SAÚDE, COM VISTA AO FORNECIMENTO DE MEDICAMENTOS PARA NUTRIÇÃO PARENTÉRICA, ÀS INSTITUIÇÕES E SERVIÇOS DO SERVIÇO NACIONAL DE SAÚDE",FALSE
"Medicamento Exclusivo Diclofenac 0,3 mg/0,3 ml - monodode",Ajuste Direto Regime Geral,Aquisição de bens móveis,"33600000-6, Produtos farmacêuticos","Centro Hospitalar de Leiria, E. P. E. (509822932)",Théa Portugal (507978358),"203,40 €",06-06-2017,05-06-2017,210 dias,"Portugal, Leiria, Leiria","Artigo 24.º, n.º 1, alínea e) do Código dos Contratos Públicos","","",,,,Não aplicável.,Não aplicável.,FALSE
"Medicamentos AUE - Propranolol, cloridrato - 1mg/ml",Ajuste Direto Regime Geral,Aquisição de bens móveis,"33600000-6, Produtos farmacêuticos","Centro Hospitalar de Leiria, E. P. E. (509822932)","Dux Pharma, Unipessoal Lda  (510803679)","319,00 €",06-06-2017,05-06-2017,210 dias,"Portugal, Leiria, Leiria","Artigo 24.º, n.º 1, alínea e) do Código dos Contratos Públicos","","",,,,Não aplicável.,Não aplicável.,FALSE
"Medicamento AUE - Isoprenalina, cloridrato 0,2 mg/ml",Ajuste Direto Regime Geral,Aquisição de bens móveis,"33600000-6, Produtos farmacêuticos","Centro Hospitalar de Leiria, E. P. E. (509822932)","Biojam, S.A. (513642749)","495,00 €",06-06-2017,05-06-2017,210 dias,"Portugal, Leiria, Leiria","Artigo 24.º, n.º 1, alínea e) do Código dos Contratos Públicos","","",,,,Não aplicável.,Não aplicável.,FALSE
Amoxicilina + Ácido Clavulânico 1.2 e 2.2 g,Ao abrigo de acordo-quadro (art.º 259.º),Aquisição de bens móveis,"33600000-6, Produtos farmacêuticos","Centro Hospitalar de Leiria, E. P. E. (509822932)","GENERIS-FARMACEUTICA,SA (508107997)","2.440,00 €",06-06-2017,05-06-2017,20 dias,"Portugal, Leiria, Leiria",Artigo 259.º do Código dos Contratos Públicos,"","",,,,156714,CONCURSO PÚBLICO PARA A CELEBRAÇÃO DE CONTRATOS PÚBLICOS DE APROVISIONAMENTO PARA AQUISIÇÃO DE MEDICAMENTOS ANTI-INFECCIOSOS,FALSE
Medicamentos Autorização Utilização Excecional - Dantroleno 20 mg,Ajuste Direto Regime Geral,Aquisição de bens móveis,"33600000-6, Produtos farmacêuticos","Centro Hospitalar de Leiria, E. P. E. (509822932)",IDIS LIMITED (000000000),"5.580,00 €",06-06-2017,05-06-2017,210 dias,"Portugal, Leiria, Leiria","Artigo 24.º, n.º 1, alínea e) do Código dos Contratos Públicos","","",,,,Não aplicável.,Não aplicável.,FALSE
Agregação Urgente SPMS - Infliximab Biossimilar,Ao abrigo de acordo-quadro (art.º 259.º),Aquisição de bens móveis,"33600000-6, Produtos farmacêuticos","Centro Hospitalar de Leiria, E. P. E. (509822932)","LABORATORIOS PFIZER, LDA (500162166)","4.489,60 €",06-06-2017,06-06-2017,30 dias,"Portugal, Leiria, Leiria",Artigo 259.º do Código dos Contratos Públicos,"","",,,,1771819,CP 2015/6 - Acordo quadro para o fornecimento de Medicamentos do Foro Oncológico,FALSE
"Timolol 5 mg/ml colírio - frascos 7,5 ml - CPA 2015/49",Ao abrigo de acordo-quadro (art.º 259.º),Aquisição de bens móveis,"33600000-6, Produtos farmacêuticos","Centro Hospitalar de Leiria, E. P. E. (509822932)","LABORATORIO EDOL-PROD.FARMACEUTICOS, SA (507072642)","111,13 €",06-06-2017,05-06-2017,210 dias,"Portugal, Leiria, Leiria",Artigo 259.º do Código dos Contratos Públicos,"","",,,,1377420,Acordo quadro para fornecimento de medicamentos usados nas afecções oculares e otorrinolaringologias às instituições e serviços do serviço nacional de saúde,FALSE
Imunoalergologia  - Alergenos Diversos,Ajuste Direto Regime Geral,Aquisição de bens móveis,"33600000-6, Produtos farmacêuticos","Centro Hospitalar de Leiria, E. P. E. (509822932)","BIAL-PORTELA E COMPANHIA, SA (500220913)","1.018,86 €",06-06-2017,05-06-2017,210 dias,"Portugal, Leiria, Leiria","Artigo 24.º, n.º 1, alínea e) do Código dos Contratos Públicos","","",,,,Não aplicável.,Não aplicável.,FALSE
Teste Rápido de Barbitúricos na Urina,Ajuste Direto Regime Geral,Aquisição de bens móveis,"33696500-0, Reagentes de laboratório","CENTRO HOSPITALAR DE LEIRIA, E.P.E. (509822932)","KNOW-HOW-SERVICOS MANUT.ASSIST.TECNICA,LDA. (509884296)","275,00 €",06-06-2017,05-06-2017,210 dias,"Portugal, Leiria, Leiria","Artigo 20.º, n.º 1, alínea a) do Código dos Contratos Públicos","","",,,,Não aplicável.,Não aplicável.,FALSE
Medicamentos Exclusivos BDR Pharma,Ajuste Direto Regime Geral,Aquisição de bens móveis,"33600000-6, Produtos farmacêuticos","Centro Hospitalar de Leiria, E. P. E. (509822932)","BDRPHARMA, LDA. (513077332)","7.961,12 €",05-06-2017,18-05-2017,210 dias,"Portugal, Leiria, Leiria","Artigo 24.º, n.º 1, alínea e) do Código dos Contratos Públicos","","",,,,Não aplicável.,Não aplicável.,FALSE
Medicamentos Exclusivos BDR Pharma,Ajuste Direto Regime Geral,Aquisição de bens móveis,"33600000-6, Produtos farmacêuticos","Centro Hospitalar de Leiria, E. P. E. (509822932)","BDRPHARMA, LDA. (513077332)","1.900,69 €",05-06-2017,01-01-2017,150 dias,"Portugal, Leiria, Leiria","Artigo 24.º, n.º 1, alínea e) do Código dos Contratos Públicos",17-05-2017,"1.900,69 €",,,,Não aplicável.,Não aplicável.,FALSE
Coloração Automática de Esfregaços de Sangue,Ajuste Direto Regime Geral,Aquisição de bens móveis,"33696000-5, Reagentes e meios de contraste","Centro Hospitalar de Leiria, E. P. E. (509822932)","BECKMAN COULTER PORTUGAL UNIPESSOAL,LDA. (509035167)","217,36 €",05-06-2017,05-06-2017,210 dias,"Portugal, Leiria, Leiria","Artigo 26.º, n.º 1, alínea a) do Código dos Contratos Públicos","","",,,,Não aplicável.,Não aplicável.,FALSE
Kit Antigenios Estreptococus B,Ajuste Direto Regime Geral,Aquisição de bens móveis,"33600000-6, Produtos farmacêuticos","Centro Hospitalar de Leiria, E. P. E. (509822932)","BIO-RAD LABORATORIES, LDA (501301321)","330,00 €",05-06-2017,30-05-2017,210 dias,"Portugal, Leiria, Leiria","Artigo 20.º, n.º 1, alínea a) do Código dos Contratos Públicos","","",,,,Não aplicável.,Não aplicável.,FALSE
Ahulhas huber,Ajuste Direto Regime Geral,Aquisição de bens móveis,"33141320-9, Agulhas para fins médicos","Centro Hospitalar de Leiria, E. P. E. (509822932)","SMITHS MEDICAL (PORTUGAL),UNIPESSOAL,LDA (507445937)","2.404,80 €",02-06-2017,02-01-2017,90 dias,"Portugal, Leiria, Leiria","Artigo 20.º, n.º 1, alínea a) do Código dos Contratos Públicos",07-03-2017,"2.404,80 €",,,,Não aplicável.,Não aplicável.,FALSE
Cateter implantável,Ajuste Direto Regime Geral,Aquisição de bens móveis,"33141200-2, Cateteres","Centro Hospitalar de Leiria, E. P. E. (509822932)","P.M.H. PRODUTOS MEDICO HOSPITALARES, SA (502376899)","2.880,00 €",02-06-2017,02-01-2017,90 dias,"Portugal, Leiria, Leiria","Artigo 20.º, n.º 1, alínea a) do Código dos Contratos Públicos",07-03-2017,"2.880,00 €",,,,Não aplicável.,Não aplicável.,FALSE
Sistemas administração,Ajuste Direto Regime Geral,Aquisição de bens móveis,"33140000-3, Material médico de consumo","Centro Hospitalar de Leiria, E. P. E. (509822932)","B.BRAUN MEDICAL, LDA (501506543)","3.630,00 €",02-06-2017,02-01-2017,90 dias,"Portugal, Leiria, Leiria","Artigo 20.º, n.º 1, alínea a) do Código dos Contratos Públicos",24-03-2017,"3.630,00 €",,,,Não aplicável.,Não aplicável.,FALSE
1011E17 Medicamento ENALAPRIL 20 MG,Ajuste Direto Regime Geral,Aquisição de bens móveis,"33600000-6, Produtos farmacêuticos","Centro Hospitalar de Leiria, E. P. E. (509822932)","LABESFAL-LABORATORIOS ALMIRO, SA (501169580)","336,00 €",02-06-2017,01-06-2017,240 dias,"Portugal, Leiria<BR/>Portugal, Leiria, Leiria","Artigo 20.º, n.º 1, alínea a) do Código dos Contratos Públicos","","",,,,Não aplicável.,Não aplicável.,FALSE
1021E17 MEDICAMENTO EXCLISIVO VIEKIRAX + EXVIERA - 1 doente em tratamento,Ajuste Direto Regime Geral,Aquisição de bens móveis,"33600000-6, Produtos farmacêuticos","Centro Hospitalar de Leiria, E. P. E. (509822932)","ABBVIE, LDA (510229050)","16.064,02 €",02-06-2017,08-05-2017,20 dias,"Portugal, Leiria, Leiria","Artigo 24.º, n.º 1, alínea e) do Código dos Contratos Públicos",02-06-2017,"16.064,02 €",,,,Não aplicável.,Não aplicável.,FALSE
1106O17 ANTITRIPSINA ALFA 1,Ao abrigo de acordo-quadro (art.º 259.º),Aquisição de bens móveis,"33600000-6, Produtos farmacêuticos","Centro Hospitalar de Leiria, E. P. E. (509822932)","GRIFOLS PORTUGAL-PROD.FARM.HOSPIT., LDA (502041285)","40.512,00 €",02-06-2017,18-05-2017,30 dias,"Portugal, Leiria, Leiria",Artigo 259.º do Código dos Contratos Públicos,"","",,,,1423488,ACORDO QUADRO PARA FORNECIMENTO DE DERIVADOS DO PLASMA HUMANO ÀS INSTITUIÇÕES E SERVIÇOS DO SERVIÇO NACIONAL DE SAÚDE CP 2015/9,FALSE
1096O16 IMUNOGLOBULINA 100 MG,Ao abrigo de acordo-quadro (art.º 259.º),Aquisição de bens móveis,"33600000-6, Produtos farmacêuticos","Centro Hospitalar de Leiria, E. P. E. (509822932)","CSL BEHRING, LDA. (503047201)","62.368,00 €",02-06-2017,18-05-2017,30 dias,"Portugal, Leiria, Leiria",Artigo 259.º do Código dos Contratos Públicos,"","",,,,2124520,CP 2016/55 - Medicamentos Diversos,FALSE
1096O16 IMUNOGLOBULINA 100 MG,Ao abrigo de acordo-quadro (art.º 259.º),Aquisição de bens móveis,"33600000-6, Produtos farmacêuticos","Centro Hospitalar de Leiria, E. P. E. (509822932)","CSL BEHRING, LDA. (503047201)","23.972,70 €",02-06-2017,18-05-2017,20 dias,"Portugal, Leiria, Leiria",Artigo 259.º do Código dos Contratos Públicos,02-06-2017,"23.972,70 €",,,,2124520,CP 2016/55 - Medicamentos Diversos,FALSE
1106O17 ANTITRIPSINA ALFA 1,Ao abrigo de acordo-quadro (art.º 259.º),Aquisição de bens móveis,"33600000-6, Produtos farmacêuticos","Centro Hospitalar de Leiria, E. P. E. (509822932)","GRIFOLS PORTUGAL-PROD.FARM.HOSPIT., LDA (502041285)","17.724,00 €",02-06-2017,18-05-2017,20 dias,"Portugal, Leiria, Leiria",Artigo 259.º do Código dos Contratos Públicos,02-06-2017,"17.724,00 €",,,,1423488,ACORDO QUADRO PARA FORNECIMENTO DE DERIVADOS DO PLASMA HUMANO ÀS INSTITUIÇÕES E SERVIÇOS DO SERVIÇO NACIONAL DE SAÚDE CP 2015/9,FALSE
1120O17 Agregação P259-AC-2017-64 Goserrelina,Ao abrigo de acordo-quadro (art.º 259.º),Aquisição de bens móveis,"33600000-6, Produtos farmacêuticos","Centro Hospitalar de Leiria, E. P. E. (509822932)","ASTRAZENECA-PRODUTOS FARMACEUTICOS,LDA (502942240)","18.136,80 €",01-06-2017,17-04-2017,240 dias,"Portugal, Leiria, Leiria",Artigo 259.º do Código dos Contratos Públicos,"","",,,,1771819,CP 2015/6 - Acordo quadro para o fornecimento de Medicamentos do Foro Oncológico,FALSE
