freguesia,acronym,validVotesPercentage,votes,dicofre
Fragosela,PPD/PSD,41.03,519,182315
Fragosela,PS,34.94,442,182315
Fragosela,B.E.,7.91,100,182315
Fragosela,CDS-PP,5.06,64,182315
Fragosela,PAN,2.69,34,182315
Fragosela,PCP-PEV,2.13,27,182315
Fragosela,CH,1.58,20,182315
Fragosela,IL,0.95,12,182315
Fragosela,A,0.87,11,182315
Fragosela,R.I.R.,0.87,11,182315
Fragosela,PNR,0.47,6,182315
Fragosela,PCTP/MRPP,0.32,4,182315
Fragosela,PURP,0.32,4,182315
Fragosela,L,0.24,3,182315
Fragosela,PDR,0.24,3,182315
Fragosela,PTP,0.16,2,182315
Fragosela,JPP,0.08,1,182315
Fragosela,MPT,0.08,1,182315
Fragosela,NC,0.08,1,182315
Fragosela,PPM,0,0,182315
