freguesia,acronym,validVotesPercentage,votes,dicofre
Telões,PS,42.39,156,171311
Telões,PPD/PSD.CDS-PP,39.67,146,171311
Telões,MPT,5.16,19,171311
Telões,PCP-PEV,4.35,16,171311
Telões,L,1.63,6,171311
Telões,B.E.,1.36,5,171311
Telões,PCTP/MRPP,1.36,5,171311
Telões,PND,1.36,5,171311
Telões,PAN,0.82,3,171311
Telões,MAS,0.54,2,171311
Telões,PTP,0.54,2,171311
Telões,POUS,0.27,1,171311
Telões,PPM,0.27,1,171311
Telões,PPV,0.27,1,171311
Telões,PDA,0,0,171311
Telões,PNR,0,0,171311
