Objeto do Contrato,Tipo de Procedimento,Tipo(s) de Contrato,CPVs,Entidade(s) Adjudicante(s),Entidade(s) Adjudicatária(s),Preço Contratual,Data de Publicação,Data de Celebração do Contrato,Prazo de Execução,Local de Execução,Fundamentação,Data de Fecho do Contrato,Preço Total Efetivo,Causas das Alterações ao Prazo,Causas das Alterações ao Preço,Estado,N.º registo do Acordo Quadro,Descrição do Acordo Quadro,Procedimento Centralizado
Reparação de 2 ventiladores da marca Dräger modelo Evita 4.,Ajuste Direto Regime Geral,Aquisição de serviços,"50400000-9, Serviços de reparação e manutenção de equipamento médico e de precisão",Serviço de Utilização Comum dos Hospitais (500900469),"DRÄGER PORTUGAL, LDA (508771323)","12.020,10 €",10-04-2017,10-04-2017,10 dias,"Portugal, Porto, Porto","Artigo 20.º, n.º 1, alínea a) do Código dos Contratos Públicos",,,,,,Não aplicável.,Não aplicável.,FALSE
Aquisição de quadros eléctricos,Ajuste Direto Regime Geral,Aquisição de bens móveis,"31200000-8, Aparelhos de controlo e distribuição de electricidade",Serviço de Utilização Comum dos Hospitais (500900469),"A.P. Freitas, Lda. (503502820)","7.169,37 €",06-04-2017,05-04-2017,10 dias,"Portugal, Porto, Porto","Artigo 20.º, n.º 1, alínea a) do Código dos Contratos Públicos",,,,,,Não aplicável.,Não aplicável.,FALSE
"Reparação de Ventilador da marca """"Maquet"""", modelo """"Servo i"""" ",Ajuste Direto Regime Geral,Aquisição de serviços,"50400000-9, Serviços de reparação e manutenção de equipamento médico e de precisão",Serviço de Utilização Comum dos Hospitais (500900469),"GETINGE GROUP PORTUGAL, UNIPESSOAL LDA (MAQUET) (506819698)","6.455,02 €",06-04-2017,06-04-2017,5 dias,"Portugal, Lisboa, Lisboa","Artigo 20.º, n.º 1, alínea a) do Código dos Contratos Públicos",,,,,,Não aplicável.,Não aplicável.,FALSE
"Serviço de Manutenção Preventiva e Curativa a TAC GE do Hosp. S. Francisco Xavier, com disponibilização de equipamento.",Ajuste Direto Regime Geral,Aquisição de serviços,"50400000-9, Serviços de reparação e manutenção de equipamento médico e de precisão",Serviço de Utilização Comum dos Hospitais (500900469),Tunemedix Lda (509653979),"19.500,00 €",05-04-2017,23-03-2017,18 dias,"Portugal, Lisboa, Lisboa","Artigo 20.º, n.º 1, alínea a) do Código dos Contratos Públicos",,,,,,Não aplicável.,Não aplicável.,FALSE
"Apoio ao processo de licenciamento, e controlo de qualidade, de 19 equipamentos emissores de radiação X da ARS Norte",Ajuste Direto Regime Geral,Aquisição de serviços,"79000000-4, Serviços a empresas: direito, comercialização, consultoria, recrutamento, impressão e segurança",Serviço de Utilização Comum dos Hospitais (500900469),"MedicalConsult, S.A (504092138)","6.000,00 €",05-04-2017,23-03-2017,281 dias,Portugal,"Artigo 20.º, n.º 1, alínea a) do Código dos Contratos Públicos",,,,,,Não aplicável.,Não aplicável.,FALSE
Elaboração do Projecto de Execução de Arquitectura para Plano Director do Hospital da Póvoa do Varzim/Vila do Conde,Ajuste Direto Regime Geral,Aquisição de serviços,"71245000-7, Planos para aprovação, peças desenhadas e especificações",Serviço de Utilização Comum dos Hospitais (500900469),Manuel Carlos Abreu Gomes da Silva (158043847),"6.000,00 €",05-04-2017,24-03-2017,30 dias,"Portugal, Portugal Continental","Artigo 20.º, n.º 1, alínea a) do Código dos Contratos Públicos",,,,,,Não aplicável.,Não aplicável.,FALSE
