Objeto do Contrato,Tipo de Procedimento,Tipo(s) de Contrato,CPVs,Entidade(s) Adjudicante(s),Entidade(s) Adjudicatária(s),Preço Contratual,Data de Publicação,Data de Celebração do Contrato,Prazo de Execução,Local de Execução,Fundamentação,Data de Fecho do Contrato,Preço Total Efetivo,Causas das Alterações ao Prazo,Causas das Alterações ao Preço,Estado,N.º registo do Acordo Quadro,Descrição do Acordo Quadro,Procedimento Centralizado
Ren.Contrato p/Substituição dos Filtros Absolutos,Ajuste Direto Regime Geral,Aquisição de serviços,"71356200-0, Serviços de assistência técnica","Unidade Local de Saúde de Castelo Branco, E. P. E. (509309844)","GIGABEIRA - INSTALAÇÕES ESPECIAIS, LDA (505057204)","12.090,00 €",06-06-2013,11-03-2013,365 dias,"Portugal, Castelo Branco, Castelo Branco","Artigo 20.º, n.º 1, alínea a) do Código dos Contratos Públicos",31-12-2013,"12.090,00 €",,,,Não aplicável.,Não aplicável.,
Ren.Contr.p/Realização de Ensaios p/Quantificação de gases anestésicosdas salas operatórias,Ajuste Direto Regime Geral,Aquisição de serviços,"90714500-0, Serviços de controlo da qualidade ambiental","Unidade Local de Saúde de Castelo Branco, E. P. E. (509309844)",SUCH - DIRECÇÃO REGIONAL DO CENTRO (500900469),"5.064,00 €",06-06-2013,11-03-2013,365 dias,"Portugal, Castelo Branco, Castelo Branco","Artigo 20.º, n.º 1, alínea a) do Código dos Contratos Públicos",31-12-2013,"5.064,00 €",,,,Não aplicável.,Não aplicável.,
Factor Anti hemofi. 1000 u. (factor Vlll) Factor VIII Octocog Alfa 2000U.I.- pó sol. inj. IV,Ajuste Direto Regime Geral,Aquisição de bens móveis,"33600000-6, Produtos farmacêuticos","Unidade Local de Saúde de Castelo Branco, E. P. E. (509309844)","BAXTER MEDICO-FARMACEUTICA,L (503347345)","26.760,00 €",03-06-2013,21-05-2013,30 dias,"Portugal, Castelo Branco, Castelo Branco","Artigo 26.º, n.º 1, alínea e) do Código dos Contratos Públicos",24-05-2013,"26.760,00 €",,,,Não aplicável.,Não aplicável.,
Interferao Beta 1 B - 8 milhoes -Serin.,Ajuste Direto Regime Geral,Aquisição de bens móveis,"33600000-6, Produtos farmacêuticos","Unidade Local de Saúde de Castelo Branco, E. P. E. (509309844)","NOVARTIS FARMA,S.A (500063524)","8.820,84 €",03-06-2013,17-05-2013,30 dias,"Portugal, Castelo Branco, Castelo Branco","Artigo 26.º, n.º 1, alínea e) do Código dos Contratos Públicos",20-05-2013,"8.820,84 €",,,,Não aplicável.,Não aplicável.,
"Golimumab 50 mg/0,5 ml sc",Ajuste Direto Regime Geral,Aquisição de bens móveis,"33600000-6, Produtos farmacêuticos","Unidade Local de Saúde de Castelo Branco, E. P. E. (509309844)","MERCK SHARP & DOHME,LDA (500191360)","6.571,98 €",03-06-2013,09-05-2013,30 dias,"Portugal, Castelo Branco, Castelo Branco","Artigo 24.º, n.º 1, alínea e) do Código dos Contratos Públicos",15-05-2013,"6.571,98 €",,,,Não aplicável.,Não aplicável.,
"Infliximab 100 mg, IV - Amp.",Ajuste Direto Regime Geral,Aquisição de bens móveis,"33600000-6, Produtos farmacêuticos","Unidade Local de Saúde de Castelo Branco, E. P. E. (509309844)","MERCK SHARP & DOHME,LDA (500191360)","14.759,20 €",03-06-2013,09-05-2013,30 dias,"Portugal, Castelo Branco, Castelo Branco","Artigo 24.º, n.º 1, alínea e) do Código dos Contratos Públicos",13-05-2013,"14.759,20 €",,,,Não aplicável.,Não aplicável.,
"Adalimumab 40 mg/0,8ml - Caneta",Ajuste Direto Regime Geral,Aquisição de bens móveis,"33600000-6, Produtos farmacêuticos","Unidade Local de Saúde de Castelo Branco, E. P. E. (509309844)","ABBVIE, LDA (510229050)","14.085,00 €",03-06-2013,02-05-2013,30 dias,"Portugal, Castelo Branco, Castelo Branco","Artigo 26.º, n.º 1, alínea e) do Código dos Contratos Públicos",07-05-2013,"14.085,00 €",,,,Não aplicável.,Não aplicável.,
"Silibinina 350 mg, IV. -Amp.",Ajuste Direto Regime Geral,Aquisição de bens móveis,"33600000-6, Produtos farmacêuticos","Unidade Local de Saúde de Castelo Branco, E. P. E. (509309844)",OVERPHARMA-PRO.MEDICOS E FARMA (505792362),"10.724,00 €",03-06-2013,10-04-2013,30 dias,"Portugal, Castelo Branco, Castelo Branco","Artigo 24.º, n.º 1, alínea e) do Código dos Contratos Públicos",10-04-2013,"10.724,00 €",,,,Não aplicável.,Não aplicável.,
"Silibinina 350 mg, IV. -Amp.",Ajuste Direto Regime Geral,Aquisição de bens móveis,"33600000-6, Produtos farmacêuticos","Unidade Local de Saúde de Castelo Branco, E. P. E. (509309844)",OVERPHARMA-PRO.MEDICOS E FARMA (505792362),"21.448,00 €",03-06-2013,10-04-2013,30 dias,"Portugal, Castelo Branco, Castelo Branco","Artigo 24.º, n.º 1, alínea e) do Código dos Contratos Públicos",10-04-2013,"21.448,00 €",,,,Não aplicável.,Não aplicável.,
Linezolida 600 mg/300ml sol inj saco 300 ml IV,Ajuste Direto Regime Geral,Aquisição de bens móveis,"33600000-6, Produtos farmacêuticos","Unidade Local de Saúde de Castelo Branco, E. P. E. (509309844)","LABORATORIOS PFIZER,LDA (500162166)","10.498,00 €",03-06-2013,08-04-2013,30 dias,"Portugal, Castelo Branco, Castelo Branco","Artigo 26.º, n.º 1, alínea e) do Código dos Contratos Públicos",09-04-2013,"10.498,00 €",,,,Não aplicável.,Não aplicável.,
"Adalimumab 40 mg/0,8ml - Caneta ",Ajuste Direto Regime Geral,Aquisição de bens móveis,"33600000-6, Produtos farmacêuticos","Unidade Local de Saúde de Castelo Branco, E. P. E. (509309844)","ABBVIE, LDA (510229050)","14.085,00 €",03-06-2013,08-04-2013,30 dias,"Portugal, Castelo Branco, Castelo Branco","Artigo 26.º, n.º 1, alínea e) do Código dos Contratos Públicos",18-04-2013,"14.085,00 €",,,,Não aplicável.,Não aplicável.,
