Objeto do Contrato,Tipo de Procedimento,Tipo(s) de Contrato,CPVs,Entidade(s) Adjudicante(s),Entidade(s) Adjudicatária(s),Preço Contratual,Data de Publicação,Data de Celebração do Contrato,Prazo de Execução,Local de Execução,Fundamentação,Data de Fecho do Contrato,Preço Total Efetivo,Causas das Alterações ao Prazo,Causas das Alterações ao Preço,Estado,N.º registo do Acordo Quadro,Descrição do Acordo Quadro,Procedimento Centralizado
AQUISIÇÃO DE SERVIÇOS PARA O DESENVOLVIMENTO DE PROCEDIMENTOS DE CONTRATAÇÃO PÚBLICA NA ÁREA DA SAÚDE,Concurso público,Aquisição de serviços,"71317210-8, Serviços de consultoria em matéria de saúde e segurança","SPMS - Serviços Partilhados do Ministério da Saúde, E. P. E. (509540716)","Solidnetworks Business Consulting, Lda. (508991579)","93.987,20 €",29-07-2016,01-04-2016,360 dias,Portugal,"Artigo 20.º, n.º 1, alínea b) do Código dos Contratos Públicos","","",,,,Não aplicável.,Não aplicável.,FALSE
Aquisição serviços de desenvolvimento e manutenção do conjunto de sites da ACSS,Ao abrigo de acordo-quadro (art.º 259.º),Aquisição de serviços,"72500000-0, Serviços relacionados com a informática","SPMS - Serviços Partilhados do Ministério da Saúde, E. P. E. (509540716)",Softventure (511252277),"94.617,60 €",28-07-2016,12-07-2016,365 dias,"Portugal, Lisboa, Lisboa",Artigo 259.º do Código dos Contratos Públicos,12-07-2017,"94.617,60 €",,,,425776,CONCURSO PÚBLICO n.º 20120117 -,FALSE
"Aquisição de serviços de manutenção evolutiva e corretiva do Sistema de Informação de Monitorização do SNS, SIM@",Ao abrigo de acordo-quadro (art.º 259.º),Aquisição de serviços,"72500000-0, Serviços relacionados com a informática","SPMS - Serviços Partilhados do Ministério da Saúde, E. P. E. (509540716)",Altranportugal S.A. (504272179),"384.172,80 €",28-07-2016,29-03-2016,365 dias,"Portugal, Lisboa, Lisboa",Artigo 259.º do Código dos Contratos Públicos,"","",,,,425776,CONCURSO PÚBLICO n.º 20120117 -,FALSE
Serviços de Cópia e Impressão em regime de outsourcing,Concurso público,Aquisição de serviços,"79810000-5, Serviços de impressão","SPMS - Serviços Partilhados do Ministério da Saúde, E. P. E. (509540716)","CANON PORTUGAL, SA (507477740)","1.858.436,07 €",27-07-2016,22-06-2016,1460 dias,Portugal,"Artigo 20.º, n.º 1, alínea b) do Código dos Contratos Públicos","","",,,,Não aplicável.,Não aplicável.,FALSE
Aquisição de serviços de suporte e manutenção da TEMS,Ajuste Direto Regime Geral,Aquisição de serviços,"72267100-0, Manutenção de software para as tecnologias da infomação","SPMS - Serviços Partilhados do Ministério da Saúde, E. P. E. (509540716)","Optimizer- Serviços e Consultadoria Informática, Lda (504775936)","9.875,00 €",27-07-2016,11-07-2016,90 dias,"Portugal, Lisboa, Lisboa","Artigo 20.º, n.º 1, alínea a) do Código dos Contratos Públicos",15-10-2016,"9.875,00 €",,,,Não aplicável.,Não aplicável.,FALSE
"Aquisição de serviços de custódia para a SPMS, EPE e gestão de arquivos",Ajuste Direto Regime Geral,Aquisição de serviços,"79995100-6, Serviços de arquivo","SPMS - Serviços Partilhados do Ministério da Saúde, E. P. E. (509540716)","Safebox- Gestão e custódia de arquivos, SA (506360717)","4.173,00 €",27-07-2016,20-07-2016,730 dias,"Portugal, Lisboa, Lisboa","Artigo 20.º, n.º 1, alínea a) do Código dos Contratos Públicos","","",,,,Não aplicável.,Não aplicável.,FALSE
Aquisição de serviços de implementação de registo de incidentes de segurança de notificação obrigatória,Ajuste Direto Regime Geral,Aquisição de serviços,"72220000-3, Serviços de consultoria técnica e em matéria de sistemas","SPMS - Serviços Partilhados do Ministério da Saúde, E. P. E. (509540716)","GFI Portugal- Tecnologias de Informação, SA (502726890)","20.000,00 €",27-07-2016,06-06-2016,198 dias,"Portugal, Lisboa, Lisboa","Artigo 20.º, n.º 1, alínea a) do Código dos Contratos Públicos",31-12-2016,"20.000,00 €",,,,Não aplicável.,Não aplicável.,FALSE
Aquisição de serviços de desenvolvimento da versão mobile do SICO,Ajuste Direto Regime Geral,Aquisição de serviços,"72500000-0, Serviços relacionados com a informática","SPMS - Serviços Partilhados do Ministério da Saúde, E. P. E. (509540716)",Altranportugal S.A. (504272179),"9.703,20 €",22-07-2016,13-07-2016,243 dias,"Portugal, Lisboa, Lisboa","Artigo 20.º, n.º 1, alínea a) do Código dos Contratos Públicos",12-03-2017,"9.703,20 €",,,,Não aplicável.,Não aplicável.,FALSE
Aquisição  de serviços de desenvolvimento de protótipo de análise de serviço critico,Ajuste Direto Regime Geral,Aquisição de serviços,"72212100-0, Serviços de desenvolvimento de software para sectores específicos","SPMS - Serviços Partilhados do Ministério da Saúde, E. P. E. (509540716)","Compta Business Solutions, SA (504982400)","61.950,00 €",22-07-2016,02-06-2016,212 dias,"Portugal, Lisboa, Lisboa","Artigo 20.º, n.º 1, alínea a) do Código dos Contratos Públicos","","",,,,Não aplicável.,Não aplicável.,FALSE
"Aquisição de Serviços de comunicações fixas e móveis para a SPMS, EPE",Ajuste Direto Regime Geral,Aquisição de serviços,"64200000-8, Serviços de telecomunicações","SPMS - Serviços Partilhados do Ministério da Saúde, E. P. E. (509540716)","Vodafone Portugal- Comunicações Pessoais, SA (502544180)","74.976,00 €",22-07-2016,30-05-2016,730 dias,"Portugal, Lisboa, Lisboa","Artigo 20.º, n.º 1, alínea a) do Código dos Contratos Públicos","","",,,,Não aplicável.,Não aplicável.,FALSE
Aquisição de serviços para gestão de projetos e programas,Ajuste Direto Regime Geral,Aquisição de serviços,"79632000-3, Serviços de formação de pessoal","SPMS - Serviços Partilhados do Ministério da Saúde, E. P. E. (509540716)","Winning- Management Consulting, Lda (510098711)","70.136,00 €",22-07-2016,01-07-2016,90 dias,"Portugal, Lisboa, Lisboa","Artigo 20.º, n.º 1, alínea a) do Código dos Contratos Públicos","","",,,,Não aplicável.,Não aplicável.,FALSE
Aquisição de serviços de consultoria em segurança para estabelecer orientações com os requisitos mínimos para politica de segurança de informação a adotar por todas as entidades do Ministério da Saúde.,Ajuste Direto Regime Geral,Aquisição de serviços,"72000000-5, Serviços de TI: consultoria, desenvolvimento de software, Internet e apoio","SPMS - Serviços Partilhados do Ministério da Saúde, E. P. E. (509540716)","GFI Portugal- Tecnologias de Informação, SA (502726890)","20.000,00 €",22-07-2016,28-06-2016,184 dias,"Portugal, Lisboa, Lisboa","Artigo 20.º, n.º 1, alínea a) do Código dos Contratos Públicos",31-12-2016,"20.000,00 €",,,,Não aplicável.,Não aplicável.,FALSE
Aquisição de serviços de desenvolvimento e manutenção aplicacional RHV,Ao abrigo de acordo-quadro (art.º 259.º),Aquisição de serviços,"72500000-0, Serviços relacionados com a informática","SPMS - Serviços Partilhados do Ministério da Saúde, E. P. E. (509540716)",Altranportugal S.A. (504272179),"34.670,40 €",22-07-2016,24-06-2016,365 dias,"Portugal, Lisboa, Lisboa",Artigo 259.º do Código dos Contratos Públicos,"","",,,,425776,CONCURSO PÚBLICO n.º 20120117 -,FALSE
Aquisição de Serviços de Desenvolvimento de Aplicação Mobile para o Sistema de Gestão de Transporte de Doentes (SGTD),Ajuste Direto Regime Geral,Aquisição de serviços,"72263000-6, Serviços de implementação de software","SPMS - Serviços Partilhados do Ministério da Saúde, E. P. E. (509540716)","Link Consulting Tecnologias de Informação, SA (504551221)","72.000,00 €",22-07-2016,17-06-2016,365 dias,"Portugal, Lisboa, Lisboa","Artigo 24.º, n.º 1, alínea e) do Código dos Contratos Públicos",19-06-2017,"72.000,00 €",,,,Não aplicável.,Não aplicável.,FALSE
