freguesia,acronym,validVotesPercentage,votes,dicofre
Lanhoso,PPD/PSD,42.57,86,030915
Lanhoso,PS,27.72,56,030915
Lanhoso,CDS-PP,13.86,28,030915
Lanhoso,B.E.,6.93,14,030915
Lanhoso,PAN,2.97,6,030915
Lanhoso,PPM.PPV/CDC,1.49,3,030915
Lanhoso,A,0.99,2,030915
Lanhoso,PDR,0.99,2,030915
Lanhoso,IL,0.5,1,030915
Lanhoso,L,0.5,1,030915
Lanhoso,NC,0.5,1,030915
Lanhoso,PCP-PEV,0.5,1,030915
Lanhoso,PNR,0.5,1,030915
Lanhoso,MAS,0,0,030915
Lanhoso,PCTP/MRPP,0,0,030915
Lanhoso,PTP,0,0,030915
Lanhoso,PURP,0,0,030915
