Objeto do Contrato,Tipo de Procedimento,Tipo(s) de Contrato,CPVs,Entidade(s) Adjudicante(s),Entidade(s) Adjudicatária(s),Preço Contratual,Data de Publicação,Data de Celebração do Contrato,Prazo de Execução,Local de Execução,Fundamentação,Data de Fecho do Contrato,Preço Total Efetivo,Causas das Alterações ao Prazo,Causas das Alterações ao Preço,Estado,N.º registo do Acordo Quadro,Descrição do Acordo Quadro,Procedimento Centralizado
Aquisição de Controller Assy ref. MU19231,Ajuste Direto Regime Geral,Aquisição de bens móveis,"33152000-0, Incubadoras","Centro Hospitalar do Tâmega e Sousa, E. P. E. (508318262)","DRÄGER PORTUGAL, LDA. (508771323)","5.679,00 €",11-07-2014,28-04-2014,5 dias,"Portugal, Porto, Penafiel","Artigo 20.º, n.º 1, alínea a) do Código dos Contratos Públicos",08-05-2014,"5.679,00 €",,,,Não aplicável.,Não aplicável.,FALSE
Sondas para ecografia,Ajuste Direto Regime Geral,Aquisição de bens móveis,"33112000-8, Equipamento de imagiologia por ecos, ultra-sons e doppler","Centro Hospitalar do Tâmega e Sousa, E.P.E. (508318262)",GENERAL ELECTRIC PORTUGUESA S.A. (500357129),"15.599,00 €",11-07-2014,11-02-2014,8 dias,"Portugal, Porto, Penafiel","Artigo 20.º, n.º 1, alínea a) do Código dos Contratos Públicos",24-03-2014,"15.599,00 €",,,,Não aplicável.,Não aplicável.,FALSE
Manutenção e assistência a UPS,Ajuste Direto Regime Geral,Aquisição de serviços,"50000000-5, Serviços de reparação e manutenção","Centro Hospitalar do Tâmega e Sousa, E. P. E. (508318262)","Lcpower - Luís Carneiro, Soluções de Energia S.A. (503074675)","1.071,00 €",02-07-2014,01-04-2014,270 dias,"Portugal, Porto, Amarante<BR/>Portugal, Porto, Penafiel","Artigo 20.º, n.º 1, alínea a) do Código dos Contratos Públicos",19-12-2014,"1.071,00 €",,,,Não aplicável.,Não aplicável.,FALSE
Manutenção e assistência a UPS,Ajuste Direto Regime Geral,Aquisição de serviços,"50000000-5, Serviços de reparação e manutenção","Centro Hospitalar do Tâmega e Sousa, E. P. E. (508318262)","EMERSON NETWORK POWER, LDA. (503322520)","3.883,00 €",02-07-2014,01-04-2014,270 dias,"Portugal, Porto, Penafiel<BR/>Portugal, Porto, Amarante","Artigo 20.º, n.º 1, alínea a) do Código dos Contratos Públicos",17-12-2014,"3.883,00 €",,,,Não aplicável.,Não aplicável.,FALSE
Manutenção de UPS's,Ajuste Direto Regime Geral,Aquisição de serviços,"50000000-5, Serviços de reparação e manutenção","Centro Hospitalar do Tâmega e Sousa, E. P. E. (508318262)","SCHNEIDER ELECTRIC PORTUGAL, LDA. (500281858)","16.500,00 €",02-07-2014,01-04-2014,270 dias,"Portugal, Porto, Penafiel<BR/>Portugal, Porto, Amarante","Artigo 20.º, n.º 1, alínea a) do Código dos Contratos Públicos",16-12-2014,"16.500,00 €",,,,Não aplicável.,Não aplicável.,FALSE
Próteses Totais da Anca,Concurso público,Aquisição de bens móveis,"33183200-8, Próteses ortopédicas","Centro Hospitalar do Tâmega e Sousa, E. P. E. (508318262)","STRYKER PORTUGAL - PRODUTOS MÉDICOS, UNIPESSOAL, LDA. (504594214)","37.800,00 €",02-07-2014,01-06-2014,365 dias,"Portugal, Porto, Penafiel<BR/>Portugal, Porto, Amarante","Artigo 20.º, n.º 1, alínea b) do Código dos Contratos Públicos","","",,,,Não aplicável.,Não aplicável.,FALSE
Próteses Totais da Anca,Concurso público,Aquisição de bens móveis,"33183200-8, Próteses ortopédicas","Centro Hospitalar do Tâmega e Sousa, E. P. E. (508318262)","Artur Salgado, S.A. (503612600)","128.030,00 €",02-07-2014,01-06-2014,365 dias,"Portugal, Porto, Penafiel<BR/>Portugal, Porto, Amarante","Artigo 20.º, n.º 1, alínea b) do Código dos Contratos Públicos","","",,,,Não aplicável.,Não aplicável.,FALSE
