freguesia,acronym,validVotesPercentage,votes,dicofre
"Caia, São Pedro e Alcáçova",PS,54.93,953,120713
"Caia, São Pedro e Alcáçova",PPD/PSD,12.33,214,120713
"Caia, São Pedro e Alcáçova",B.E.,9.97,173,120713
"Caia, São Pedro e Alcáçova",CH,5.24,91,120713
"Caia, São Pedro e Alcáçova",CDS-PP,5.01,87,120713
"Caia, São Pedro e Alcáçova",PCP-PEV,5.01,87,120713
"Caia, São Pedro e Alcáçova",PAN,2.48,43,120713
"Caia, São Pedro e Alcáçova",PCTP/MRPP,0.86,15,120713
"Caia, São Pedro e Alcáçova",PURP,0.86,15,120713
"Caia, São Pedro e Alcáçova",IL,0.81,14,120713
"Caia, São Pedro e Alcáçova",A,0.69,12,120713
"Caia, São Pedro e Alcáçova",L,0.52,9,120713
"Caia, São Pedro e Alcáçova",PNR,0.52,9,120713
"Caia, São Pedro e Alcáçova",R.I.R.,0.46,8,120713
"Caia, São Pedro e Alcáçova",PDR,0.17,3,120713
"Caia, São Pedro e Alcáçova",MPT,0.12,2,120713
"Caia, São Pedro e Alcáçova",PTP,0,0,120713
