freguesia,acronym,validVotesPercentage,votes,dicofre
"União das freguesias de Real, Dume e Semelhe",PS,37.21,2373,030379
"União das freguesias de Real, Dume e Semelhe",PPD/PSD,28.23,1800,030379
"União das freguesias de Real, Dume e Semelhe",B.E.,13.8,880,030379
"União das freguesias de Real, Dume e Semelhe",PCP-PEV,6.93,442,030379
"União das freguesias de Real, Dume e Semelhe",PAN,3.64,232,030379
"União das freguesias de Real, Dume e Semelhe",CDS-PP,3.07,196,030379
"União das freguesias de Real, Dume e Semelhe",CH,1.55,99,030379
"União das freguesias de Real, Dume e Semelhe",IL,1.4,89,030379
"União das freguesias de Real, Dume e Semelhe",L,1.03,66,030379
"União das freguesias de Real, Dume e Semelhe",R.I.R.,0.67,43,030379
"União das freguesias de Real, Dume e Semelhe",PCTP/MRPP,0.6,38,030379
"União das freguesias de Real, Dume e Semelhe",A,0.56,36,030379
"União das freguesias de Real, Dume e Semelhe",PNR,0.28,18,030379
"União das freguesias de Real, Dume e Semelhe",NC,0.27,17,030379
"União das freguesias de Real, Dume e Semelhe",MPT,0.19,12,030379
"União das freguesias de Real, Dume e Semelhe",PTP,0.17,11,030379
"União das freguesias de Real, Dume e Semelhe",PURP,0.13,8,030379
"União das freguesias de Real, Dume e Semelhe",PPM,0.11,7,030379
"União das freguesias de Real, Dume e Semelhe",MAS,0.09,6,030379
"União das freguesias de Real, Dume e Semelhe",JPP,0.03,2,030379
"União das freguesias de Real, Dume e Semelhe",PDR,0.03,2,030379
