freguesia,acronym,validVotesPercentage,votes,dicofre
Carvoeira,PPD/PSD.CDS-PP,31.07,165,110902
Carvoeira,PS,24.67,131,110902
Carvoeira,PCP-PEV,15.07,80,110902
Carvoeira,MPT,8.47,45,110902
Carvoeira,B.E.,5.84,31,110902
Carvoeira,L,5.08,27,110902
Carvoeira,PAN,4.14,22,110902
Carvoeira,PCTP/MRPP,2.64,14,110902
Carvoeira,PND,0.75,4,110902
Carvoeira,PTP,0.75,4,110902
Carvoeira,MAS,0.56,3,110902
Carvoeira,PNR,0.38,2,110902
Carvoeira,PDA,0.19,1,110902
Carvoeira,PPM,0.19,1,110902
Carvoeira,PPV,0.19,1,110902
Carvoeira,POUS,0,0,110902
