freguesia,acronym,validVotesPercentage,votes,dicofre
Minde,PPD/PSD,40.57,609,140206
Minde,PS,26.98,405,140206
Minde,CDS-PP,9.19,138,140206
Minde,B.E.,8.06,121,140206
Minde,PCP-PEV,4.33,65,140206
Minde,PAN,2.47,37,140206
Minde,A,1.67,25,140206
Minde,L,1.27,19,140206
Minde,IL,0.93,14,140206
Minde,R.I.R.,0.93,14,140206
Minde,CH,0.87,13,140206
Minde,PCTP/MRPP,0.73,11,140206
Minde,PNR,0.47,7,140206
Minde,NC,0.4,6,140206
Minde,PDR,0.4,6,140206
Minde,PURP,0.4,6,140206
Minde,MPT,0.13,2,140206
Minde,PPM,0.13,2,140206
Minde,PTP,0.07,1,140206
