Objeto do Contrato,Tipo de Procedimento,Tipo(s) de Contrato,CPVs,Entidade(s) Adjudicante(s),Entidade(s) Adjudicatária(s),Preço Contratual,Data de Publicação,Data de Celebração do Contrato,Prazo de Execução,Local de Execução,Fundamentação,Data de Fecho do Contrato,Preço Total Efetivo,Causas das Alterações ao Prazo,Causas das Alterações ao Preço,Estado,N.º registo do Acordo Quadro,Descrição do Acordo Quadro,Procedimento Centralizado
Aquisição de serviços para apoio e desenvolvimento de procedimentos de contratação pública,Concurso público,Aquisição de serviços,"71317210-8, Serviços de consultoria em matéria de saúde e segurança","SPMS - Serviços Partilhados do Ministério da Saúde, E. P. E. (509540716)","Solidnetworks - Business Consulting, Lda (508991579)","83.168,00 €",27-06-2016,17-03-2016,365 dias,Portugal,"Artigo 21.º, n.º 1, alínea b) do Código dos Contratos Públicos",27-03-2017,"83.168,00 €",,,,Não aplicável.,Não aplicável.,FALSE
Aquisição de serviços de implementação da solução de gestão administrativa e clinica de doentes no hospital da terceira (HSEIT) da Região Autónoma dos Açores,Ajuste Direto Regime Geral,Aquisição de serviços,"72500000-0, Serviços relacionados com a informática","SPMS - Serviços Partilhados do Ministério da Saúde, E. P. E. (509540716)","Capgemini Portugal- Serviços de Consultoria e Informática, SA (502829257)","74.760,00 €",23-06-2016,25-05-2016,188 dias,"Portugal, Lisboa, Lisboa<BR/>Portugal, Região Autónoma dos Açores, Angra do Heroismo","Artigo 20.º, n.º 1, alínea a) do Código dos Contratos Públicos",31-12-2016,"74.760,00 €",,,,Não aplicável.,Não aplicável.,FALSE
Aquisição de serviços para migração de dados no Hospital HH nos Açores,Ajuste Direto Regime Geral,Aquisição de serviços,"72500000-0, Serviços relacionados com a informática","SPMS - Serviços Partilhados do Ministério da Saúde, E. P. E. (509540716)","Capgemini Portugal- Serviços de Consultoria e Informática, SA (502829257)","74.250,00 €",23-06-2016,25-05-2016,188 dias,"Portugal, Lisboa, Lisboa","Artigo 20.º, n.º 1, alínea a) do Código dos Contratos Públicos",31-12-2016,"74.250,00 €",,,,Não aplicável.,Não aplicável.,FALSE
"Aquisição de serviços de apoio à elaboração de documentação na área de Coordenação de Sistemas de Informação Clínicos, Administrativos e Prescrições Eletrónicas, nomeadamente na aplicação SONHO",Ajuste Direto Regime Geral,Aquisição de serviços,"75112100-5, Serviços administrativos relacionados com projectos de desenvolvimento","SPMS - Serviços Partilhados do Ministério da Saúde, E. P. E. (509540716)",Optimizer – Serviços e Consultadoria Informática Lda (504775936),"20.000,00 €",23-06-2016,01-06-2016,365 dias,"Portugal, Porto, Porto","Artigo 20.º, n.º 1, alínea a) do Código dos Contratos Públicos","","",,,,Não aplicável.,Não aplicável.,FALSE
Aquisição de serviços de reparação dos elevadores da SPMS EPE sito no Porto,Ajuste Direto Regime Geral,Aquisição de serviços,"50750000-7, Serviços de manutenção de elevadores","SPMS - Serviços Partilhados do Ministério da Saúde, E. P. E. (509540716)","Pinto & Cruz, SA (500217904)","5.000,00 €",23-06-2016,03-06-2016,210 dias,Portugal,"Artigo 20.º, n.º 1, alínea a) do Código dos Contratos Públicos",31-12-2016,"5.000,00 €",,,,Não aplicável.,Não aplicável.,FALSE
Aquisição de serviços de higiene e limpeza com fornecimento de consumíveis,Ajuste Direto Regime Geral,Aquisição de serviços,"90911000-6, Serviços de limpeza de alojamentos, edifícios e janelas","SPMS - Serviços Partilhados do Ministério da Saúde, E. P. E. (509540716)","Garnica Facility Services, Lda (509909515)","13.550,00 €",23-06-2016,24-05-2016,30 dias,"Portugal, Lisboa, Lisboa","Artigo 20.º, n.º 1, alínea a) do Código dos Contratos Públicos",31-05-2016,"13.550,00 €",,,,Não aplicável.,Não aplicável.,FALSE
Aquisição de serviços para restruturação tecnológica e funcional do catálogo de aprovisionamento público da saúde,Ajuste Direto Regime Geral,Aquisição de serviços,"72222300-0, Serviços relacionados com as tecnologias da informação","SPMS- Serviços Partilhados do M. da Saúde, E.P.E. (509540716)","SVDI - Serviços e Tecnologias de Informação,lda (504308289)","50.000,00 €",23-06-2016,25-05-2016,180 dias,Portugal,"Artigo 20.º, n.º 1, alínea a) do Código dos Contratos Públicos",25-11-2016,"50.000,00 €",,,,Não aplicável.,Não aplicável.,FALSE
