freguesia,acronym,validVotesPercentage,votes,dicofre
Canas de Senhorim,PS,37.09,566,180901
Canas de Senhorim,PPD/PSD,27.52,420,180901
Canas de Senhorim,B.E.,14.48,221,180901
Canas de Senhorim,PCP-PEV,5.24,80,180901
Canas de Senhorim,CDS-PP,5.18,79,180901
Canas de Senhorim,PAN,4,61,180901
Canas de Senhorim,R.I.R.,1.18,18,180901
Canas de Senhorim,A,0.92,14,180901
Canas de Senhorim,CH,0.72,11,180901
Canas de Senhorim,L,0.66,10,180901
Canas de Senhorim,PCTP/MRPP,0.59,9,180901
Canas de Senhorim,NC,0.52,8,180901
Canas de Senhorim,PPM,0.52,8,180901
Canas de Senhorim,PDR,0.39,6,180901
Canas de Senhorim,IL,0.33,5,180901
Canas de Senhorim,PURP,0.26,4,180901
Canas de Senhorim,JPP,0.2,3,180901
Canas de Senhorim,PTP,0.2,3,180901
Canas de Senhorim,MPT,0,0,180901
Canas de Senhorim,PNR,0,0,180901
