Objeto do Contrato,Tipo de Procedimento,Tipo(s) de Contrato,CPVs,Entidade(s) Adjudicante(s),Entidade(s) Adjudicatária(s),Preço Contratual,Data de Publicação,Data de Celebração do Contrato,Prazo de Execução,Local de Execução,Fundamentação,Data de Fecho do Contrato,Preço Total Efetivo,Causas das Alterações ao Prazo,Causas das Alterações ao Preço,Estado,N.º registo do Acordo Quadro,Descrição do Acordo Quadro,Procedimento Centralizado
Aquisição de serviços de manutenção do Sistema de Informação para a Morbilidade Hospitalar (SIMH),Concurso público,Aquisição de serviços,"72500000-0, Serviços relacionados com a informática","SPMS - Serviços Partilhados do Ministério da Saúde, E. P. E. (509540716)","ALTRANPORTUGAL, S.A. (504272179)","157.120,00 €",13-12-2017,08-11-2017,365 dias,Portugal,"Artigo 21.º, n.º 1, alínea b) do Código dos Contratos Públicos","","",,,,Não aplicável.,Não aplicável.,FALSE
AQUISIÇÃO DE SERVIÇOS DE MANUTENÇÃO DE PURIFICADORES DE ÁGUA PARA O EDIFÍCIO DA SPMS NO PORTO,Ajuste Direto Regime Geral,Aquisição de serviços,"51514110-2, Serviços de instalação de máquinas e aparelhos para filtrar ou depurar água","SPMS - Serviços Partilhados do Ministério da Saúde, E. P. E. (SNCP) (509540716)",PMS (507441443),"675,00 €",13-12-2017,17-11-2017,273 dias,Portugal,"Artigo 20.º, n.º 1, alínea a) do Código dos Contratos Públicos","","",,,,Não aplicável.,Não aplicável.,FALSE
Aquisição de seguro de imobilizado para a SPMS,Ao abrigo de acordo-quadro (art.º 259.º),Aquisição de serviços,"66515200-5, Serviços de seguros de bens","SPMS - Serviços Partilhados do Ministério da Saúde, E. P. E. (509540716)","Willis - Corretores de Seguros, S.A. (500188629)","6.993,04 €",13-12-2017,17-10-2017,365 dias,Portugal,Artigo 259.º do Código dos Contratos Públicos,"","",,,,2607297,CONCURSO PÚBLICO COM PUBLICAÇÃO NO JOUE PARA A CELEBRAÇÃO DE ACORDO   QUADRO PARA A PRESTAÇÃO DE SERVIÇOS DE SEGUROS DE IMOBILIZADO NA SAÚDE,FALSE
AQUISIÇÃO DE SERVIÇOS DE BUSINESS INTELLIGENCE E DE MANUTENÇÃO DO SISTEMA DE INFORMAÇÃO MORBILIDADE HOSPITALAR,Concurso público,Aquisição de serviços,"72500000-0, Serviços relacionados com a informática","SPMS - Serviços Partilhados do Ministério da Saúde, E. P. E. (509540716)","ALTRANPORTUGAL, S.A. (504272179)","91.140,00 €",13-12-2017,08-11-2017,365 dias,Portugal,"Artigo 21.º, n.º 1, alínea b) do Código dos Contratos Públicos","","",,,,Não aplicável.,Não aplicável.,FALSE
AQUISIÇÃO DE SERVIÇOS NO ÂMBITO DO PROJETO TRANSFORMAÇÃO DIGITAL -SNS SEM PAPEL,Ajuste Direto Regime Geral,Aquisição de serviços,"72500000-0, Serviços relacionados com a informática","SPMS - Serviços Partilhados do Ministério da Saúde, E. P. E. (509540716)",BiQ Health Solutions Lda (504105337),"49.998,00 €",13-12-2017,08-11-2017,365 dias,Portugal,"Artigo 20.º, n.º 1, alínea a) do Código dos Contratos Públicos","","",,,,Não aplicável.,Não aplicável.,FALSE
"AQUISIÇÃO DE SERVIÇOS DE AUDITORIA PARA OBTENÇÃO DE PREÇOS DE REFERÊNCIA DE BENS E SERVIÇOS E DE AVALIAÇÃO DE RISCO A CONTRATOS E FORNECEDORES SPMS, EPE",Ajuste Direto Regime Geral,Aquisição de serviços,"79310000-0, Serviços de estudos de mercado","SPMS- Serviços Partilhados do M. da Saúde, E.P.E. (509540716)","Decidewell-Systems,Lda (514115297)","12.345,00 €",13-12-2017,17-10-2017,365 dias,Portugal,"Artigo 20.º, n.º 1, alínea a) do Código dos Contratos Públicos","","",,,,Não aplicável.,Não aplicável.,FALSE
AQUISIÇÃO DE SISTEMA E EQUIPAMENTO DE GESTÃO DE PRESENÇAS E SERVIÇOS DE MANUTENÇÃO,Ajuste Direto Regime Geral,Aquisição de bens móveis,"48218000-9, Pacote de software para gestão de licenças","SPMS - Serviços Partilhados do Ministério da Saúde, E. P. E. (SNCP) (509540716)","Sysnovare - Innovative Solutions, S.A. (508959152)","57.615,00 €",12-12-2017,11-10-2017,1095 dias,Portugal,"Artigo 24.º, n.º 1, alínea e) do Código dos Contratos Públicos","","",,,,Não aplicável.,Não aplicável.,FALSE
AQUISIÇÃO DE SERVIÇOS PARA ELABORAÇÃO DE MANUAL INTERNO E SDBOK,Ajuste Direto Regime Geral,Aquisição de serviços,"72500000-0, Serviços relacionados com a informática","SPMS- Serviços Partilhados do M. da Saúde, E.P.E. (509540716)","Infosistema - Sistemas Informação, S.A. (503585491)","9.733,50 €",12-12-2017,24-10-2017,90 dias,Portugal,"Artigo 20.º, n.º 1, alínea a) do Código dos Contratos Públicos",29-12-2017,"9.733,50 €",,,,Não aplicável.,Não aplicável.,FALSE
AQUISIÇÃO DE SERVIÇOS DE DESENVOLVIMENTO E MANUTENÇÃO PARA OS PORTAIS DO SNS (SERVIÇO NACIONAL DE SAÚDE),Concurso público,Aquisição de serviços,"72500000-0, Serviços relacionados com a informática","SPMS- Serviços Partilhados do M. da Saúde, E.P.E. (509540716)",SOFTVENTURE (511252277),"118.272,00 €",12-12-2017,30-10-2017,365 dias,Portugal,Artigo 28.º do Código dos Contratos Públicos,"","",,,,Não aplicável.,Não aplicável.,FALSE
AQUISIÇÃO DE MATERIAL INFORMÁTICO PARA UPGRADE DOS PCS,Concurso público,Aquisição de bens móveis,"30200000-1, Equipamento e material informático","SPMS - Serviços Partilhados do Ministério da Saúde, E. P. E. (509540716)","Cigest - Centro de Informática e Gestão, Lda (501321446)","11.998,00 €",12-12-2017,31-10-2017,30 dias,Portugal,Artigo 28.º do Código dos Contratos Públicos,30-11-2017,"11.998,00 €",,,,Não aplicável.,Não aplicável.,FALSE
AQUISIÇÃO DE SERVIÇOS DE DESENVOLVIMENTO DE MODELO DE GESTÃO DE SERVIÇO E SUPORTE,Ajuste Direto Regime Geral,Outros Tipos (Concessão de exploração de bens do domínio público),"72263000-6, Serviços de implementação de software","SPMS - Serviços Partilhados do Ministério da Saúde, E. P. E. (509540716)","Ahnfelt Consultores, Lda (508861438)","21.120,00 €",12-12-2017,11-10-2017,92 dias,Portugal,"Artigo 20.º, n.º 1, alínea a) do Código dos Contratos Públicos","","",,,,Não aplicável.,Não aplicável.,FALSE
Aquisição de Assessoria Mediática e Comunicação para Redes Sociais,Ajuste Direto Regime Geral,Aquisição de serviços,"79341100-7, Serviços de consultoria em matéria de publicidade","SPMS- Serviços Partilhados do M. da Saúde, E.P.E. (509540716)",The Loyal Advisory Company Lda. (513230980),"74.000,00 €",12-12-2017,26-10-2017,730 dias,Portugal,"Artigo 20.º, n.º 1, alínea a) do Código dos Contratos Públicos","","",,,,Não aplicável.,Não aplicável.,FALSE
AQUISIÇÃO DE SERVIÇOS DE MANUTENÇÃO PREVENTIVA DE ESGOTOS DOS EDIFICIOS DA SPMS,Ajuste Direto Regime Geral,Aquisição de serviços,"90470000-2, Serviços de limpeza de esgotos","SPMS- Serviços Partilhados do M. da Saúde, E.P.E. (509540716)","Contaritmo, Unipessoal, Lda (507981278)","4.500,00 €",12-12-2017,26-10-2017,1095 dias,Portugal,"Artigo 20.º, n.º 1, alínea a) do Código dos Contratos Públicos","","",,,,Não aplicável.,Não aplicável.,FALSE
