freguesia,acronym,validVotesPercentage,votes,dicofre
Vila Nova de Milfontes,PS,31.12,318,021111
Vila Nova de Milfontes,PCP-PEV,27.2,278,021111
Vila Nova de Milfontes,PPD/PSD.CDS-PP,18.98,194,021111
Vila Nova de Milfontes,MPT,6.36,65,021111
Vila Nova de Milfontes,B.E.,5.19,53,021111
Vila Nova de Milfontes,PCTP/MRPP,3.03,31,021111
Vila Nova de Milfontes,L,2.35,24,021111
Vila Nova de Milfontes,PAN,2.25,23,021111
Vila Nova de Milfontes,PND,0.88,9,021111
Vila Nova de Milfontes,PPM,0.68,7,021111
Vila Nova de Milfontes,MAS,0.49,5,021111
Vila Nova de Milfontes,PNR,0.49,5,021111
Vila Nova de Milfontes,PTP,0.49,5,021111
Vila Nova de Milfontes,PPV,0.29,3,021111
Vila Nova de Milfontes,PDA,0.2,2,021111
Vila Nova de Milfontes,POUS,0,0,021111
