freguesia,acronym,validVotesPercentage,votes,dicofre
Pessegueiro do Vouga,PPD/PSD,47.82,472,011704
Pessegueiro do Vouga,PS,21.99,217,011704
Pessegueiro do Vouga,B.E.,10.44,103,011704
Pessegueiro do Vouga,CDS-PP,10.13,100,011704
Pessegueiro do Vouga,PAN,1.82,18,011704
Pessegueiro do Vouga,PCP-PEV,1.52,15,011704
Pessegueiro do Vouga,CH,1.32,13,011704
Pessegueiro do Vouga,A,1.01,10,011704
Pessegueiro do Vouga,R.I.R.,0.81,8,011704
Pessegueiro do Vouga,IL,0.61,6,011704
Pessegueiro do Vouga,PCTP/MRPP,0.61,6,011704
Pessegueiro do Vouga,L,0.51,5,011704
Pessegueiro do Vouga,PURP,0.41,4,011704
Pessegueiro do Vouga,PTP,0.3,3,011704
Pessegueiro do Vouga,MPT,0.2,2,011704
Pessegueiro do Vouga,PDR,0.2,2,011704
Pessegueiro do Vouga,PNR,0.2,2,011704
Pessegueiro do Vouga,NC,0.1,1,011704
Pessegueiro do Vouga,JPP,0,0,011704
Pessegueiro do Vouga,PPM,0,0,011704
