Objeto do Contrato,Tipo de Procedimento,Tipo(s) de Contrato,CPVs,Entidade(s) Adjudicante(s),Entidade(s) Adjudicatária(s),Preço Contratual,Data de Publicação,Data de Celebração do Contrato,Prazo de Execução,Local de Execução,Fundamentação,Data de Fecho do Contrato,Preço Total Efetivo,Causas das Alterações ao Prazo,Causas das Alterações ao Preço,Estado,N.º registo do Acordo Quadro,Descrição do Acordo Quadro,Procedimento Centralizado
Aquisição Oxímetros Digitais Portáteis,Ajuste Direto Regime Geral,Aquisição de bens móveis,"33180000-5, Apoio funcional","Unidade Local de Saúde do Alto Minho, EPE (ULSAM) (508786193)","Elnor - Equipamentos Técnicos e de Laboratório, S. A. (144785170)","220,00 €",18-06-2014,16-06-2014,30 dias,"Portugal, Viana do Castelo, Viana do Castelo","Artigo 20.º, n.º 1, alínea a) do Código dos Contratos Públicos",,,,,,Não aplicável.,Não aplicável.,FALSE
Aquisição Oxímetros Digitais Portáteis,Ajuste Direto Regime Geral,Aquisição de bens móveis,"33180000-5, Apoio funcional","Unidade Local de Saúde do Alto Minho, EPE (ULSAM) (508786193)","Bacelar & Irmão, Lda. (500532818)","660,00 €",18-06-2014,16-06-2014,30 dias,"Portugal, Viana do Castelo, Viana do Castelo","Artigo 20.º, n.º 1, alínea a) do Código dos Contratos Públicos",,,,,,Não aplicável.,Não aplicável.,FALSE
Aquisição Oxímetros Digitais Portáteis,Ajuste Direto Regime Geral,Aquisição de bens móveis,"33180000-5, Apoio funcional","Unidade Local de Saúde do Alto Minho, EPE (ULSAM) (508786193)","Elnor - Equipamentos Técnicos e de Laboratório, S. A. (144785170)","220,00 €",18-06-2014,16-06-2014,30 dias,"Portugal, Viana do Castelo, Viana do Castelo","Artigo 20.º, n.º 1, alínea a) do Código dos Contratos Públicos",,,,,,Não aplicável.,Não aplicável.,FALSE
Aquisição de Craveiras,Ajuste Direto Regime Geral,Aquisição de bens móveis,"33180000-5, Apoio funcional","Unidade Local de Saúde do Alto Minho, EPE (ULSAM) (508786193)","Bacelar & Irmão, Lda. (500532818)","326,00 €",18-06-2014,16-06-2014,30 dias,"Portugal, Viana do Castelo","Artigo 20.º, n.º 1, alínea a) do Código dos Contratos Públicos",,,,,,Não aplicável.,Não aplicável.,FALSE
Aquisição de Craveiras,Ajuste Direto Regime Geral,Aquisição de bens móveis,"33180000-5, Apoio funcional","Unidade Local de Saúde do Alto Minho, EPE (ULSAM) (508786193)","Portosaúde Equipamentos Clínicos Laboratoriais e Hospitalares, Lda. (502927178)","245,00 €",18-06-2014,16-06-2014,30 dias,"Portugal, Viana do Castelo","Artigo 20.º, n.º 1, alínea a) do Código dos Contratos Públicos",,,,,,Não aplicável.,Não aplicável.,FALSE
Aquisição Balanças Pediátricas,Ajuste Direto Regime Geral,Aquisição de bens móveis,"33180000-5, Apoio funcional","Unidade Local de Saúde do Alto Minho, EPE (ULSAM) (508786193)","Iberdata - Equipamentos, S. A. (501904921)","2.208,42 €",18-06-2014,16-06-2014,30 dias,"Portugal, Viana do Castelo","Artigo 20.º, n.º 1, alínea a) do Código dos Contratos Públicos",,,,,,Não aplicável.,Não aplicável.,FALSE
