freguesia,acronym,validVotesPercentage,votes,dicofre
Carragosa,PPD/PSD,44,22,040206
Carragosa,PS,24,12,040206
Carragosa,CDS-PP,16,8,040206
Carragosa,B.E.,8,4,040206
Carragosa,PAN,2,1,040206
Carragosa,PCP-PEV,2,1,040206
Carragosa,PCTP/MRPP,2,1,040206
Carragosa,PPM.PPV/CDC,2,1,040206
Carragosa,A,0,0,040206
Carragosa,IL,0,0,040206
Carragosa,L,0,0,040206
Carragosa,MAS,0,0,040206
Carragosa,NC,0,0,040206
Carragosa,PDR,0,0,040206
Carragosa,PNR,0,0,040206
Carragosa,PTP,0,0,040206
Carragosa,PURP,0,0,040206
