freguesia,acronym,validVotesPercentage,votes,dicofre
Vila Nova da Barquinha,PS,38.45,423,142006
Vila Nova da Barquinha,PPD/PSD.CDS-PP,18.45,203,142006
Vila Nova da Barquinha,PCP-PEV,17.73,195,142006
Vila Nova da Barquinha,MPT,9.91,109,142006
Vila Nova da Barquinha,B.E.,5.91,65,142006
Vila Nova da Barquinha,PAN,2.09,23,142006
Vila Nova da Barquinha,PCTP/MRPP,2.09,23,142006
Vila Nova da Barquinha,L,1.45,16,142006
Vila Nova da Barquinha,PPM,1.09,12,142006
Vila Nova da Barquinha,PND,0.73,8,142006
Vila Nova da Barquinha,PTP,0.73,8,142006
Vila Nova da Barquinha,PPV,0.55,6,142006
Vila Nova da Barquinha,PNR,0.45,5,142006
Vila Nova da Barquinha,MAS,0.36,4,142006
Vila Nova da Barquinha,PDA,0,0,142006
Vila Nova da Barquinha,POUS,0,0,142006
