freguesia,acronym,validVotesPercentage,votes,dicofre
União das freguesias de Fataunços e Figueiredo das Donas,PS,38.98,122,182414
União das freguesias de Fataunços e Figueiredo das Donas,PPD/PSD,37.06,116,182414
União das freguesias de Fataunços e Figueiredo das Donas,CDS-PP,6.07,19,182414
União das freguesias de Fataunços e Figueiredo das Donas,B.E.,5.43,17,182414
União das freguesias de Fataunços e Figueiredo das Donas,PAN,3.83,12,182414
União das freguesias de Fataunços e Figueiredo das Donas,PCP-PEV,2.24,7,182414
União das freguesias de Fataunços e Figueiredo das Donas,PURP,1.28,4,182414
União das freguesias de Fataunços e Figueiredo das Donas,A,0.96,3,182414
União das freguesias de Fataunços e Figueiredo das Donas,IL,0.96,3,182414
União das freguesias de Fataunços e Figueiredo das Donas,PPM.PPV/CDC,0.96,3,182414
União das freguesias de Fataunços e Figueiredo das Donas,NC,0.64,2,182414
União das freguesias de Fataunços e Figueiredo das Donas,PCTP/MRPP,0.64,2,182414
União das freguesias de Fataunços e Figueiredo das Donas,L,0.32,1,182414
União das freguesias de Fataunços e Figueiredo das Donas,PDR,0.32,1,182414
União das freguesias de Fataunços e Figueiredo das Donas,PTP,0.32,1,182414
União das freguesias de Fataunços e Figueiredo das Donas,MAS,0,0,182414
União das freguesias de Fataunços e Figueiredo das Donas,PNR,0,0,182414
