Objeto do Contrato,Tipo de Procedimento,Tipo(s) de Contrato,CPVs,Entidade(s) Adjudicante(s),Entidade(s) Adjudicatária(s),Preço Contratual,Data de Publicação,Data de Celebração do Contrato,Prazo de Execução,Local de Execução,Fundamentação,Data de Fecho do Contrato,Preço Total Efetivo,Causas das Alterações ao Prazo,Causas das Alterações ao Preço,Estado,N.º registo do Acordo Quadro,Descrição do Acordo Quadro,Procedimento Centralizado
AD 75.6/2013 - Aquisição de Serviços de Formação para a ação Formativa de Apoio ao Sistema Integrado de Gestão e avaliação de Desempenho para a Carreira Médica,Ajuste Direto Regime Geral,Aquisição de serviços,"80000000-4, Serviços de ensino e formação","Administração Regional de Saúde do Alentejo, I. P. (503148768)","SINASE, Lda (502851791)","924,44 €",05-12-2013,17-09-2013,30 dias,"Portugal, Évora","Artigo 20.º, n.º 1, alínea a) do Código dos Contratos Públicos",05-12-2013,"924,44 €",,,,Não aplicável.,Não aplicável.,
"AM 104.6/2013 Aquisição de Serviços de Formação para Ação """"Diabetes e Obesidade""""",Ajuste Direto Regime Geral,Aquisição de serviços,"80000000-4, Serviços de ensino e formação","Administração Regional de Saúde do Alentejo, I. P. (503148768)",APDP - Associação Protectora dos Diabéticos de Portugal (500851875),"1.663,85 €",05-12-2013,29-11-2013,30 dias,"Portugal, Évora","Artigo 24.º, n.º 1, alínea e) do Código dos Contratos Públicos",16-12-2013,"1.663,85 €",,,,Não aplicável.,Não aplicável.,
AD 74.6/2013 Aluguer de equipamento para a Leitura de análises do rastreio do cancro do Colón e Reto,Ajuste Direto Regime Geral,Locação de bens móveis,"33000000-0, Equipamento médico, medicamentos e produtos para cuidados pessoais","Administração Regional de Saúde do Alentejo, I. P. (503148768)","Lusopalex - Sociedade Distribuição Produtos Hospitalares, Unipessoal, Lda. (503531588)","2.400,00 €",03-12-2013,01-09-2013,120 dias,"Portugal, Évora","Artigo 24.º, n.º 1, alínea e) do Código dos Contratos Públicos",16-01-2014,"2.400,00 €",,,,Não aplicável.,Não aplicável.,
AM87.6/2013 Contratação dos Serviços de Manutenção do software e hardware do modelo de logística ekanbam instalado no armazém da ARSA,Ajuste Direto Regime Geral,Aquisição de serviços,"72000000-5, Serviços de TI: consultoria, desenvolvimento de software, Internet e apoio","Administração Regional de Saúde do Alentejo, I. P. (503148768)","BIQ Consultores de Gestão e Engenharia Industrial, Lda. (504105337)","3.000,00 €",03-12-2013,23-10-2013,365 dias,"Portugal, Évora, Évora","Artigo 27.º, n.º 1, alínea f) do Código dos Contratos Públicos",09-01-2014,"3.000,00 €",,,,Não aplicável.,Não aplicável.,
"AM 101.6/2013 Aquisição de Serviços de Formação para os cursos """"suporte básico de vida"""" e """"suporte básico de vida e desfibrilhação automática externa""""",Ajuste Direto Regime Geral,Aquisição de serviços,"80000000-4, Serviços de ensino e formação","Administração Regional de Saúde do Alentejo, I. P. (503148768)","INEM, I.P. (501356126)","2.668,80 €",03-12-2013,13-11-2013,30 dias,"Portugal, Évora, Évora","Artigo 20.º, n.º 1, alínea a) do Código dos Contratos Públicos",27-12-2013,"2.668,80 €",,,,Não aplicável.,Não aplicável.,
AD 44.5/2013 Aquisição de Material de Farmácia –  Imunoglobina,Ajuste Direto Regime Geral,Aquisição de bens móveis,"33000000-0, Equipamento médico, medicamentos e produtos para cuidados pessoais","Administração Regional de Saúde do Alentejo, I. P. (503148768)","CSL Behring Unipessoal, Lda (503047201)","2.265,00 €",03-12-2013,02-05-2013,150 dias,"Portugal, Évora","Artigo 20.º, n.º 1, alínea a) do Código dos Contratos Públicos",31-12-2013,"2.265,00 €",,,,Não aplicável.,Não aplicável.,
"Aquisição de Material de Farmácia – Medicamento Usado no Tratamento de Intoxicação, Imunoglobina e Meios de Diagnostico - 2013",Ajuste Direto Regime Geral,Aquisição de bens móveis,"33000000-0, Equipamento médico, medicamentos e produtos para cuidados pessoais","Administração Regional de Saúde do Alentejo, I. P. (503148768)","CSL Behring Unipessoal, Lda (503047201)","3.020,00 €",03-12-2013,15-01-2013,365 dias,"Portugal, Évora","Artigo 20.º, n.º 1, alínea a) do Código dos Contratos Públicos",31-12-2013,"3.020,00 €",,,,Não aplicável.,Não aplicável.,
Aquisição de Material de Consumo Clínico - Outro para 2013,Ajuste Direto Regime Geral,Aquisição de bens móveis,"33000000-0, Equipamento médico, medicamentos e produtos para cuidados pessoais","Administração Regional de Saúde do Alentejo, I. P. (503148768)","SPECULUM, LDA (502996323)","787,30 €",02-12-2013,12-03-2013,294 dias,"Portugal, Évora","Artigo 20.º, n.º 1, alínea a) do Código dos Contratos Públicos",31-12-2013,"787,30 €",,,,Não aplicável.,Não aplicável.,
Aquisição de Material de Consumo Clínico - Outro para 2013,Ajuste Direto Regime Geral,Aquisição de bens móveis,"33000000-0, Equipamento médico, medicamentos e produtos para cuidados pessoais","Administração Regional de Saúde do Alentejo, I. P. (503148768)","Rocha Neves, Lda. (500233691)","549,58 €",02-12-2013,12-03-2013,294 dias,"Portugal, Évora","Artigo 20.º, n.º 1, alínea a) do Código dos Contratos Públicos",31-12-2013,"549,58 €",,,,Não aplicável.,Não aplicável.,
Aquisição de Material de Consumo Clínico - Outro para 2013,Ajuste Direto Regime Geral,Aquisição de bens móveis,"33000000-0, Equipamento médico, medicamentos e produtos para cuidados pessoais","Administração Regional de Saúde do Alentejo, I. P. (503148768)","PERGUT PORTUGAL, Lda (501799729)","3.261,20 €",02-12-2013,12-03-2013,294 dias,"Portugal, Évora","Artigo 20.º, n.º 1, alínea a) do Código dos Contratos Públicos",31-12-2013,"3.261,20 €",,,,Não aplicável.,Não aplicável.,
Aquisição de Material de Consumo Clínico - Outro para 2013,Ajuste Direto Regime Geral,Aquisição de bens móveis,"33000000-0, Equipamento médico, medicamentos e produtos para cuidados pessoais","Administração Regional de Saúde do Alentejo, I. P. (503148768)","Overpharma, Produtos Médicos e Farmacêuticos, Lda. (505792362)","36,60 €",02-12-2013,12-03-2013,294 dias,"Portugal, Évora","Artigo 20.º, n.º 1, alínea a) do Código dos Contratos Públicos",31-12-2013,"36,60 €",,,,Não aplicável.,Não aplicável.,
Aquisição de Material de Consumo Clínico - Outro para 2013,Ajuste Direto Regime Geral,Aquisição de bens móveis,"33000000-0, Equipamento médico, medicamentos e produtos para cuidados pessoais","Administração Regional de Saúde do Alentejo, I. P. (503148768)","INTERSURGICAL PORTUGAL, Comércio de Produtos HospitalaresLDA. (503480045)","4.534,35 €",02-12-2013,12-03-2013,294 dias,"Portugal, Évora","Artigo 20.º, n.º 1, alínea a) do Código dos Contratos Públicos",31-12-2013,"4.534,35 €",,,,Não aplicável.,Não aplicável.,
Aquisição de Material de Consumo Clínico - Outro para 2013,Ajuste Direto Regime Geral,Aquisição de bens móveis,"33000000-0, Equipamento médico, medicamentos e produtos para cuidados pessoais","Administração Regional de Saúde do Alentejo, I. P. (503148768)","H.R.PRODUTOS QUIMICOS,LDA (501895558)","335,40 €",02-12-2013,12-03-2013,294 dias,"Portugal, Évora","Artigo 20.º, n.º 1, alínea a) do Código dos Contratos Públicos",31-12-2013,"335,40 €",,,,Não aplicável.,Não aplicável.,
Aquisição de Material de Consumo Clínico - Outro para 2013,Ajuste Direto Regime Geral,Aquisição de bens móveis,"33000000-0, Equipamento médico, medicamentos e produtos para cuidados pessoais","Administração Regional de Saúde do Alentejo, I. P. (503148768)","FACTOR PLUS, S.A. (502810645)","540,00 €",02-12-2013,12-03-2013,294 dias,"Portugal, Évora","Artigo 20.º, n.º 1, alínea a) do Código dos Contratos Públicos",31-12-2013,"540,00 €",,,,Não aplicável.,Não aplicável.,
Aquisição de Material de Consumo Clínico - Outro para 2013,Ajuste Direto Regime Geral,Aquisição de bens móveis,"33000000-0, Equipamento médico, medicamentos e produtos para cuidados pessoais","Administração Regional de Saúde do Alentejo, I. P. (503148768)","EZEQUIEL PANAO JORGE, Lda. (501412727)","402,11 €",02-12-2013,12-03-2013,294 dias,"Portugal, Évora","Artigo 20.º, n.º 1, alínea a) do Código dos Contratos Públicos",31-12-2013,"402,11 €",,,,Não aplicável.,Não aplicável.,
Aquisição de Material de Consumo Clínico - Outro para 2013,Ajuste Direto Regime Geral,Aquisição de bens móveis,"33000000-0, Equipamento médico, medicamentos e produtos para cuidados pessoais","Administração Regional de Saúde do Alentejo, I. P. (503148768)","COVIDIEN PORTUGAL - PRODUTOS DE SAUDE, UNIPESSOAL, LDA. (503413410)","69,20 €",02-12-2013,12-03-2013,294 dias,"Portugal, Évora","Artigo 20.º, n.º 1, alínea a) do Código dos Contratos Públicos",31-12-2013,"69,20 €",,,,Não aplicável.,Não aplicável.,
Material de Consumo Clínico - Outro para 2013,Ajuste Direto Regime Geral,Aquisição de bens móveis,"33000000-0, Equipamento médico, medicamentos e produtos para cuidados pessoais","Administração Regional de Saúde do Alentejo, I. P. (503148768)","BASTOS VIEGAS, S.A. (500042772)","727,16 €",02-12-2013,12-03-2013,294 dias,"Portugal, Évora","Artigo 20.º, n.º 1, alínea a) do Código dos Contratos Públicos",31-12-2013,"727,16 €",,,,Não aplicável.,Não aplicável.,
Aquisição do Material de Consumo Clínico - Outro para 2013,Ajuste Direto Regime Geral,Aquisição de bens móveis,"33000000-0, Equipamento médico, medicamentos e produtos para cuidados pessoais","Administração Regional de Saúde do Alentejo, I. P. (503148768)","B. BRAUN MEDICAL, LDA (501506543)","1.440,00 €",02-12-2013,12-03-2013,294 dias,"Portugal, Évora","Artigo 20.º, n.º 1, alínea a) do Código dos Contratos Públicos",31-12-2013,"1.440,00 €",,,,Não aplicável.,Não aplicável.,
Aquisição Material de Consumo Clínico - Outro para 2013,Ajuste Direto Regime Geral,Aquisição de bens móveis,"33000000-0, Equipamento médico, medicamentos e produtos para cuidados pessoais","Administração Regional de Saúde do Alentejo, I. P. (503148768)","AVIQUIMICA, LDA - EUROGES, SA (500039720)","189,00 €",02-12-2013,12-03-2013,294 dias,"Portugal, Évora","Artigo 20.º, n.º 1, alínea a) do Código dos Contratos Públicos",31-12-2013,"189,00 €",,,,Não aplicável.,Não aplicável.,
