Objeto do Contrato,Tipo de Procedimento,Tipo(s) de Contrato,CPVs,Entidade(s) Adjudicante(s),Entidade(s) Adjudicatária(s),Preço Contratual,Data de Publicação,Data de Celebração do Contrato,Prazo de Execução,Local de Execução,Fundamentação,Data de Fecho do Contrato,Preço Total Efetivo,Causas das Alterações ao Prazo,Causas das Alterações ao Preço,Estado,N.º registo do Acordo Quadro,Descrição do Acordo Quadro,Procedimento Centralizado
"Contrato de Manutenção à Consola de Assistência Ventricular “Berlin Heart” do Serviço de Cirurgia Torácica, para o ano de 2018",Ajuste Direto Regime Geral,Aquisição de serviços,"50400000-9, Serviços de reparação e manutenção de equipamento médico e de precisão","Centro Hospitalar de São João, E. P. E. (509821197)",LUSOPALEX-SOC.DIT.PROD. HOSPITALARES UNIPESSOAL (503531588),"7.285,08 €",28-03-2018,28-03-2018,365 dias,"Portugal, Porto, Porto","Artigo 24.º, n.º 1, alínea e) do Código dos Contratos Públicos",,,,,,Não aplicável.,Não aplicável.,FALSE
"Aquisição de Mangas de Proteção para o Centro Hospitalar de S.João, E.P.E.",Ajuste Direto Regime Geral,Aquisição de bens móveis,"33140000-3, Material médico de consumo","Centro Hospitalar de São João, E. P. E. (509821197)","B. Braun Medical, Lda. (501506543)","27.232,00 €",28-03-2018,09-03-2018,297 dias,"Portugal, Porto, Porto","Artigo 24.º, n.º 1, alínea e) do Código dos Contratos Públicos",,,,,,Não aplicável.,Não aplicável.,FALSE
"Aquisição de 10 computadores e monitores, no âmbito do Plano Contingência Picos Afluência Serviço Urgência Geral do CHSJ, EPE",Ajuste Direto Regime Geral,Aquisição de bens móveis,"30200000-1, Equipamento e material informático","Centro Hospitalar de São João, E. P. E. (509821197)","Base2, Lda. (501333401)","6.500,00 €",28-03-2018,23-01-2018,10 dias,"Portugal, Porto, Porto","Artigo 24.º, n.º 1, alínea c) do Código dos Contratos Públicos",,,,,,Não aplicável.,Não aplicável.,FALSE
"Aquisição de 10 cadeiras rodadas sem braços, no âmbito do Plano Contingência Picos Afluência Serviço Urgência Geral do CHSJ, EPE",Ajuste Direto Regime Geral,Aquisição de bens móveis,"39100000-3, Mobiliário","Centro Hospitalar de São João, E. P. E. (509821197)","Veloso & Troca, Lda. (500802726)","730,00 €",28-03-2018,27-12-2017,10 dias,"Portugal, Porto, Porto","Artigo 24.º, n.º 1, alínea c) do Código dos Contratos Públicos",,,,,,Não aplicável.,Não aplicável.,FALSE
"Aquisição e 7 Macas Articuladas, no âmbito do Plano de Contingência Picos Afluência Serviço Urgência Geral do CHSJ, EPE",Ajuste Direto Regime Geral,Aquisição de bens móveis,"33192000-2, Mobiliário para fins médicos","Centro Hospitalar de São João, E. P. E. (509821197)","Mundinter, Lda. (500199906)","16.200,52 €",28-03-2018,27-12-2017,10 dias,"Portugal, Porto, Porto","Artigo 24.º, n.º 1, alínea c) do Código dos Contratos Públicos",,,,,,Não aplicável.,Não aplicável.,FALSE
"Aquisição de 4 Monitores de Sinais Vitais no âmbito do Plano de Contingência Picos Afluência ao Serviço de Urgência do CHSJ, EPE",Ajuste Direto Regime Geral,Aquisição de bens móveis,"33195000-3, Sistema de monitorização dos doentes","Centro Hospitalar de São João, E. P. E. (509821197)","General Eletric Healthcare Portugal, Unipessoal, Lda. (500357129)","3.900,00 €",28-03-2018,27-12-2017,25 dias,"Portugal, Porto, Porto","Artigo 24.º, n.º 1, alínea c) do Código dos Contratos Públicos",,,,,,Não aplicável.,Não aplicável.,FALSE
"Empreitada de Substituição dos Vãos e Montagem Estores Exteriores nas Enfermarias Serviço Traumatologia do CHSJ, EPE",Ajuste Direto Regime Geral,Empreitadas de obras públicas,"45215100-8, Obras de construção de edifícios relacionados com serviços de saúde","Centro Hospitalar São João, EPE (509821197)","Praiaco - Soc. Construções, Lda. (504970690)","24.607,52 €",28-03-2018,26-01-2018,28 dias,"Portugal, Porto, Porto","Artigo 19.º, alínea a) do Código dos Contratos Públicos",,,,,,Não aplicável.,Não aplicável.,FALSE
"Aquisição de Esponjas Impregnadas com ≥ 20ml de Clorohexidina ≥ 2% para o Centro Hospitalar de S. João, E.P.E.”",Ajuste Direto Regime Geral,Aquisição de bens móveis,"33700000-7, Produtos para cuidados pessoais","Centro Hospitalar de São João, E. P. E. (509821197)","FACTOR PLUS, SA (502810645)","13.500,00 €",28-03-2018,23-03-2018,283 dias,"Portugal, Porto, Porto","Artigo 24.º, n.º 1, alínea e) do Código dos Contratos Públicos",,,,,,Não aplicável.,Não aplicável.,FALSE
"Aquisição de 1 Ecógrafo para Centro de Diagnóstico Pré-Natal do Centro Hospitalar de São João, EPE.",Concurso público,Aquisição de bens móveis,"33110000-4, Equipamento de imagiologia para uso médico, dentário e veterinário","Centro Hospitalar São João, EPE (509821197)","General Eletric Healthcare, Unipessoal, Lda. (500357129)","79.900,00 €",28-03-2018,16-01-2018,27 dias,"Portugal, Porto, Porto","Artigo 20.º, n.º 1, alínea b) do Código dos Contratos Públicos",,,,,,Não aplicável.,Não aplicável.,FALSE
"Aquisição de Máscaras respiratórias de partículas CL3 para o Centro Hospitalar de S. João, E.P.E.”",Ajuste Direto Regime Geral,Aquisição de bens móveis,"33141000-0, Material médico não químico descartável e produtos hematológicos","Centro Hospitalar de São João, E. P. E. (509821197)",3 M PORTUGAL (500193940),"18.900,00 €",28-03-2018,17-03-2016,289 dias,"Portugal, Porto, Porto","Artigo 24.º, n.º 1, alínea e) do Código dos Contratos Públicos",,,,,,Não aplicável.,Não aplicável.,FALSE
"Aquisição de Sistema de Monitorização de Sinais Vitais para o Serviço de Neonatologia do CHSJ, EPE",Ajuste Direto Regime Geral,Aquisição de bens móveis,"33195000-3, Sistema de monitorização dos doentes","Centro Hospitalar de São João, E. P. E. (509821197)","Philips Portuguesa, SA (500216843)","65.000,00 €",28-03-2018,15-01-2018,45 dias,"Portugal, Porto, Porto","Artigo 24.º, n.º 1, alínea e) do Código dos Contratos Públicos",,,,,,Não aplicável.,Não aplicável.,FALSE
"Aquisição de Pontos de Rede para os Corpos nº 7 e 8 do Centro de Ambulatório do CHSJ, EPE.",Ajuste Direto Regime Geral,Aquisição de bens móveis,"32420000-3, Equipamento de rede","Centro Hospitalar São João, EPE (509821197)","Maxiglobal, SA (504320882)","27.860,03 €",28-03-2018,08-01-2018,40 dias,"Portugal, Porto, Porto","Artigo 20.º, n.º 1, alínea a) do Código dos Contratos Públicos",,,,,,Não aplicável.,Não aplicável.,FALSE
"Aquisição de 44 Bombas Volumétricas e 10 Seringas Perfusoras para substituição no CHSJ, EPE",Ajuste Direto Regime Geral,Aquisição de bens móveis,"33100000-1, Equipamento médico","Centro Hospitalar de São João, E. P. E. (509821197)","B. Braun Medical, Lda. (501506543)","38.640,00 €",28-03-2018,27-12-2017,10 dias,"Portugal, Porto, Porto","Artigo 24.º, n.º 1, alínea e) do Código dos Contratos Públicos",,,,,,Não aplicável.,Não aplicável.,FALSE
"Aquisição de Consumíveis para Máquinas Automáticas Enchimento Preparação Estéreis SFA para o Centro Hospitalar de S. João, E.P.E. (CHSJ, E.P.E.)",Ajuste Direto Regime Geral,Aquisição de bens móveis,"33140000-3, Material médico de consumo","Centro Hospitalar de São João, E. P. E. (509821197)","BAXTER MEDICO - FARMACEUTICO, LDA (503347345)","76.818,30 €",27-03-2018,21-03-2018,285 dias,"Portugal, Porto, Porto","Artigo 24.º, n.º 1, alínea e) do Código dos Contratos Públicos",,,,,,Não aplicável.,Não aplicável.,FALSE
"Aquisição de Mantas de Aquecimento com Colocação de Equipamentos ao Centro Hospitalar de S. João, E.P.E.",Ajuste Direto Regime Geral,Aquisição de bens móveis,"33140000-3, Material médico de consumo","Centro Hospitalar de São João, E. P. E. (509821197)","3M Espãna, S.L. Sucursal em Protugal (980560241)","37.894,00 €",27-03-2018,22-02-2018,312 dias,"Portugal, Porto, Porto","Artigo 24.º, n.º 1, alínea e) do Código dos Contratos Públicos",,,,,,Não aplicável.,Não aplicável.,FALSE
"Aquisição de Serviços de Manutenção ao Irradiador de Componentes Sanguíneos e aos Equipamentos Microm do CHSJ, EPE., para o ano de 2018",Ajuste Direto Regime Geral,Aquisição de serviços,"50400000-9, Serviços de reparação e manutenção de equipamento médico e de precisão","Centro Hospitalar de São João, E. P. E. (509821197)",LUSOPALEX-SOC.DIT.PROD. HOSPITALARES UNIPESSOAL (503531588),"8.415,23 €",27-03-2018,27-03-2018,365 dias,"Portugal, Porto, Porto","Artigo 24.º, n.º 1, alínea e) do Código dos Contratos Públicos",,,,,,Não aplicável.,Não aplicável.,FALSE
"Aquisição de Cateteres de Balão para Valvuloplastia Aórtica não Complacente, para o Centro Hospitalar de S. João, E.P.E. (CHSJ, E.P.E.)",Ajuste Direto Regime Geral,Aquisição de bens móveis,"33141200-2, Cateteres","Centro Hospitalar de São João, E. P. E. (509821197)","Endovascular, Lda. (505537494)","46.020,00 €",27-03-2018,07-03-2018,299 dias,"Portugal, Porto, Porto","Artigo 24.º, n.º 1, alínea e) do Código dos Contratos Públicos",,,,,,Não aplicável.,Não aplicável.,FALSE
"Contrato de Licenciamento e Assistência Técnica à Plataforma que suporta a solução de Email e Webmail e de Virtualização de Postos de Trabalho, durante o ano de 2018",Ajuste Direto Regime Geral,Aquisição de serviços,"50400000-9, Serviços de reparação e manutenção de equipamento médico e de precisão","Centro Hospitalar de São João, E. P. E. (509821197)","IPBRICK, S.A. (504837958)","9.228,00 €",27-03-2018,27-03-2018,365 dias,"Portugal, Porto, Porto","Artigo 24.º, n.º 1, alínea e) do Código dos Contratos Públicos",,,,,,Não aplicável.,Não aplicável.,FALSE
"Aquisição de Pinças para Laparoscopia com colocação de equipamento para o Centro Hospitalar de S. João, E.P.E.",Ajuste Direto Regime Geral,Aquisição de bens móveis,"33141000-0, Material médico não químico descartável e produtos hematológicos","Centro Hospitalar de São João, E. P. E. (509821197)","B BRAUN MEDICAL, LDA (501506543)","26.460,00 €",27-03-2018,09-03-2018,297 dias,"Portugal, Porto, Porto","Artigo 24.º, n.º 1, alínea e) do Código dos Contratos Públicos",,,,,,Não aplicável.,Não aplicável.,FALSE
"Aquisição de Cateteres para Sistema de Visualização Direta Endoscópica da Via Biliar para o Centro Hospitalar de S. João, E.P.E. (CHSJ, E.P.E.)",Ajuste Direto Regime Geral,Aquisição de bens móveis,"33141200-2, Cateteres","Centro Hospitalar de São João, E. P. E. (509821197)","BOSTON SCIENTIFIC PORTUGAL, LDA (504988964)","128.000,00 €",27-03-2018,07-03-2018,299 dias,"Portugal, Porto, Porto","Artigo 24.º, n.º 1, alínea e) do Código dos Contratos Públicos",,,,,,Não aplicável.,Não aplicável.,FALSE
"Aquisição de 10 computadores e respetivos monitores para Atrium Hospitalidade, Pediatria e  SIE do CHSJ, EPE",Ajuste Direto Regime Geral,Aquisição de bens móveis,"30200000-1, Equipamento e material informático","Centro Hospitalar de São João, E. P. E. (509821197)","Cloudigit, Lda. (509979386)","6.490,00 €",27-03-2018,12-01-2018,30 dias,"Portugal, Porto, Porto","Artigo 20.º, n.º 1, alínea a) do Código dos Contratos Públicos",,,,,,Não aplicável.,Não aplicável.,FALSE
"Aquisição de 1 Ventilador de Transporte para a UCI de Neurocriticos do CHSJ, EPE.",Ajuste Direto Regime Geral,Aquisição de bens móveis,"33100000-1, Equipamento médico","Centro Hospitalar São João, EPE (509821197)","Space Medical - Equip. Médicos, Lda (507662407)","6.825,00 €",27-03-2018,06-02-2018,30 dias,"Portugal, Porto, Porto","Artigo 20.º, n.º 1, alínea a) do Código dos Contratos Públicos",,,,,,Não aplicável.,Não aplicável.,FALSE
"Aquisição de Microcateter de Avaliação de Fluxo Cerebral para Monitor para o Centro Hospitalar de S. João, E.P.E.”",Ajuste Direto Regime Geral,Aquisição de bens móveis,"33141200-2, Cateteres","Centro Hospitalar de São João, E. P. E. (509821197)","ATN Medical, Lda (513360859)","14.400,00 €",27-03-2018,21-03-2018,285 dias,"Portugal, Porto, Porto","Artigo 24.º, n.º 1, alínea e) do Código dos Contratos Públicos",,,,,,Não aplicável.,Não aplicável.,FALSE
"Aquisição de Veículos Elétricos para Transporte de Mercadorias dos Serviços Farmacêuticos no CHSJ, EPE",Ajuste Direto Regime Geral,Aquisição de bens móveis,"34144750-0, Veículos para movimentação de carga","Centro Hospitalar São João, EPE (509821197)","Wellgreen, Unipessoal, Lda. (513236503)","11.000,00 €",27-03-2018,19-01-2018,45 dias,"Portugal, Porto, Porto","Artigo 20.º, n.º 1, alínea a) do Código dos Contratos Públicos",,,,,,Não aplicável.,Não aplicável.,FALSE
"Aquisição e Instalação de Barreiras de Acesso ao Parque de Estacionamento das Urgências Geral e Pediatria do CHSJ, EPE",Ajuste Direto Regime Geral,Aquisição de bens móveis,"42961100-1, Sistema de controlo de acessos","Centro Hospitalar de São João, E. P. E. (509821197)","Soltrafego, SA (506370836)","8.040,00 €",27-03-2018,30-11-2017,30 dias,"Portugal, Porto, Porto","Artigo 20.º, n.º 1, alínea a) do Código dos Contratos Públicos",,,,,,Não aplicável.,Não aplicável.,FALSE
"Aquisição de Carros de Enfermagem para o Serviço de Gastrenterologia - Centro de Endoscopia Digestiva do CHSJ, EPE ",Ajuste Direto Regime Geral,Aquisição de bens móveis,"33192000-2, Mobiliário para fins médicos","Centro Hospitalar de São João, E. P. E. (509821197)","Bacelar & Irmão, Lda. (500532818)","7.386,00 €",27-03-2018,22-01-2018,30 dias,"Portugal, Porto, Porto","Artigo 20.º, n.º 1, alínea a) do Código dos Contratos Públicos",,,,,,Não aplicável.,Não aplicável.,FALSE
"Aquisição de 1 Afastador para Cirurgia Abdominal Aberta para o Serviço de Cirurgia Geral do CHSJ, EPE",Ajuste Direto Regime Geral,Aquisição de bens móveis,"33100000-1, Equipamento médico","Centro Hospitalar São João, EPE (509821197)","Unicamostra, Unipessoal, Lda. (510584446)","9.996,25 €",27-03-2018,25-01-2018,15 dias,"Portugal, Porto, Porto","Artigo 20.º, n.º 1, alínea a) do Código dos Contratos Públicos",,,,,,Não aplicável.,Não aplicável.,FALSE
Aquisição de consumíveis para sistema de desbridamento cirúrgico de feridas e queimaduras para o CHSJ,Ajuste Direto Regime Geral,Aquisição de bens móveis,"33100000-1, Equipamento médico","Centro Hospitalar de São João, E. P. E. (509821197)","SMITH & NEPHEW - PROD. FARMACEUTICOS, LDA. (503552461)","10.300,00 €",27-03-2018,09-03-2018,365 dias,"Portugal, Porto, Porto","Artigo 24.º, n.º 1, alínea e) do Código dos Contratos Públicos",,,,,,Não aplicável.,Não aplicável.,FALSE
"Aquisição de 1 sistema de monitorização de impedância PH para o Serviço de Pediatria (Unidade de Gastro Pediátrica), para o CHSJ, EPE",Ajuste Direto Regime Geral,Aquisição de bens móveis,"33195000-3, Sistema de monitorização dos doentes","Centro Hospitalar de São João, E. P. E. (509821197)","Medtronic Portugal, Lda. (504223933)","8.500,00 €",27-03-2018,25-01-2018,10 dias,"Portugal, Porto, Porto","Artigo 20.º, n.º 1, alínea a) do Código dos Contratos Públicos",,,,,,Não aplicável.,Não aplicável.,FALSE
" Aquisição Clips para Tratamento Percutâneo de Insuficiência Mitral para o Centro Hospitalar de S. João, E.P.E. (CHSJ, E.P.E.)",Ajuste Direto Regime Geral,Aquisição de bens móveis,"33182220-7, Válvulas cardíacas","Centro Hospitalar de São João, E. P. E. (509821197)","Abbott Laboratórios, Lda (500006148)","200.000,00 €",26-03-2018,09-03-2018,297 dias,"Portugal, Porto, Porto","Artigo 24.º, n.º 1, alínea e) do Código dos Contratos Públicos",,,,,,Não aplicável.,Não aplicável.,FALSE
"Aquisição de Tabuleiros para Eletrofisiologia para o Centro Hospitalar de S. João, E.P.E.",Ajuste Direto Regime Geral,Aquisição de bens móveis<br/>Aquisição de serviços,"33169000-2, Material cirúrgico","Centro Hospitalar de São João, E. P. E. (509821197)","Bastos & Viegas,S.A. (500042772)","10.950,00 €",26-03-2018,23-03-2018,283 dias,"Portugal, Porto, Porto","Artigo 24.º, n.º 1, alínea e) do Código dos Contratos Públicos",,,,,,Não aplicável.,Não aplicável.,FALSE
"Aquisição de Estimuladores da Região Sagrada para o Centro Hospitalar de S. João, E.P.E. (CHSJ, E.P.E.)",Ajuste Direto Regime Geral,Aquisição de bens móveis,"33158210-7, Estimulador","Centro Hospitalar de São João, E. P. E. (509821197)",Medtronic Portugal; Lda (504223933),"73.750,00 €",26-03-2018,07-03-2018,299 dias,"Portugal, Porto, Porto","Artigo 24.º, n.º 1, alínea e) do Código dos Contratos Públicos",,,,,,Não aplicável.,Não aplicável.,FALSE
"Aquisição de Serviços de Manutenção e Assistência Técnica ao Equipamento Carestream DRX-1 e o duplo Detetor do Serviço de Radiologia do CHSJ,EPE, com a empresa Carestream Health, para o ano 2018",Ajuste Direto Regime Geral,Aquisição de serviços,"50400000-9, Serviços de reparação e manutenção de equipamento médico e de precisão","Centro Hospitalar de São João, E. P. E. (509821197)",CARESTREAM HEALTH PORTUGAL LDA (508054320),"26.700,00 €",26-03-2018,20-03-2018,365 dias,"Portugal, Porto, Porto","Artigo 24.º, n.º 1, alínea e) do Código dos Contratos Públicos",,,,,,Não aplicável.,Não aplicável.,FALSE
"Contrato de Aquisição de Serviços de Assistência Técnica aos sistemas wmQual, wmSmile e wmIntra instalados no CHSJ,EPE., para o ano de 2018",Ajuste Direto Regime Geral,Aquisição de serviços,"50000000-5, Serviços de reparação e manutenção","Centro Hospitalar de São João, E. P. E. (509821197)","WIREMAZE, SISTEMAS DE INFORMAÇÃO, S.A (505331187)","11.169,00 €",26-03-2018,12-03-2018,365 dias,"Portugal, Porto, Porto","Artigo 24.º, n.º 1, alínea e) do Código dos Contratos Públicos",,,,,,Não aplicável.,Não aplicável.,FALSE
"Aquisição de Serviços de Manutenção do Hardware e Software da Infraestrutura instalada no DataCenter do CHSJ, EPE. para o ano 2018",Ajuste Direto Regime Geral,Aquisição de serviços,"50000000-5, Serviços de reparação e manutenção","Centro Hospitalar de São João, E. P. E. (509821197)","Hewlett-Packard Portugal, Lda. (502407697)","194.647,08 €",26-03-2018,08-03-2018,365 dias,"Portugal, Porto, Porto","Artigo 24.º, n.º 1, alínea e) do Código dos Contratos Públicos",,,,,,Não aplicável.,Não aplicável.,FALSE
"Aquisição de Endopróteses para o Serviço de Cirurgia Vascular do Centro Hospitalar de S. João, E.P.E. (CHSJ, E.P.E.)",Ajuste Direto Regime Geral,Aquisição de bens móveis,"33184000-3, Próteses","Centro Hospitalar de São João, E. P. E. (509821197)","BIOSONDA - COMERCIO MAT. HOSPITALAR, LDA (501463313)","148.000,00 €",23-03-2018,21-03-2018,285 dias,"Portugal, Porto, Porto","Artigo 24.º, n.º 1, alínea e) do Código dos Contratos Públicos",,,,,,Não aplicável.,Não aplicável.,FALSE
"Aquisição de Endoprótese Aórtica Fenestrada para o Centro Hospitalar de S. João, E.P.E. (CHSJ, E.P.E.)",Ajuste Direto Regime Geral,Aquisição de bens móveis,"33184000-3, Próteses","Centro Hospitalar de São João, E. P. E. (509821197)","BIOSONDA - COMERCIO MAT. HOSPITALAR, LDA (501463313)","75.000,00 €",23-03-2018,22-11-2017,39 dias,"Portugal, Porto, Porto","Artigo 24.º, n.º 1, alínea e) do Código dos Contratos Públicos",,,,,,Não aplicável.,Não aplicável.,FALSE
"Aquisição de Stents Coronários Cónicos para o Centro Hospitalar de S. João, E.P.E. (CHSJ, E.P.E.)",Ajuste Direto Regime Geral,Aquisição de bens móveis,"33182000-9, Material de assistência à função cardíaca","Centro Hospitalar de São João, E. P. E. (509821197)","Medical Value, SA (509776531)","15.000,00 €",23-03-2018,07-03-2018,306 dias,"Portugal, Porto, Porto","Artigo 24.º, n.º 1, alínea e) do Código dos Contratos Públicos",,,,,,Não aplicável.,Não aplicável.,FALSE
" Aquisição de Stent Coronário Muito Baixo Perfil para o Centro Hospitalar de S. João, E.P.E. (CHSJ, E.P.E.)",Ajuste Direto Regime Geral,Aquisição de bens móveis,"33182000-9, Material de assistência à função cardíaca","Centro Hospitalar de São João, E. P. E. (509821197)","BIOTRONIK PORTUGAL, UNIPESSOAL LDA. (510726941)","60.000,00 €",23-03-2018,07-03-2018,299 dias,"Portugal, Porto, Porto","Artigo 24.º, n.º 1, alínea e) do Código dos Contratos Públicos",,,,,,Não aplicável.,Não aplicável.,FALSE
"Aquisição de Estimuladores do Nervo Vago para o Centro Hospitalar de S. João, E.P.E. (CHSJ, E.P.E.)",Ajuste Direto Regime Geral,Aquisição de bens móveis,"33158210-7, Estimulador","Centro Hospitalar de São João, E. P. E. (509821197)","LIVANOVA PORTUGAL, LDA. (505514010)","76.200,00 €",22-03-2018,13-03-2018,293 dias,"Portugal, Porto, Porto","Artigo 24.º, n.º 1, alínea e) do Código dos Contratos Públicos",,,,,,Não aplicável.,Não aplicável.,FALSE
"Aquisição Clips para Tratamento Percutâneo de Insuficiência Mitral para o Centro Hospitalar de S. João, E.P.E. ",Ajuste Direto Regime Geral,Aquisição de bens móveis,"33182220-7, Válvulas cardíacas","Centro Hospitalar de São João, E. P. E. (509821197)","ABBOTT LABORATORIOS, LDA (500006148)","400.000,00 €",22-03-2018,22-11-2017,39 dias,"Portugal, Porto, Porto","Artigo 24.º, n.º 1, alínea e) do Código dos Contratos Públicos",,,,,,Não aplicável.,Não aplicável.,FALSE
Aquisição de Marcador de Lesões Mamárias,Ajuste Direto Regime Geral,Aquisição de bens móveis,"33150000-6, Dispositivos de radioterapia, mecanoterapia, electroterapia e fisioterapia","Centro Hospitalar de São João, E. P. E. (509821197)","Leleman, SL  (B46193827)","59.895,00 €",22-03-2018,05-03-2018,365 dias,"Portugal, Porto, Porto","Artigo 20.º, n.º 1, alínea a) do Código dos Contratos Públicos",,,,,,Não aplicável.,Não aplicável.,FALSE
" Aquisição de Estimuladores do Nervo Vago para o Centro Hospitalar de S. João, E.P.E. (CHSJ, E.P.E.)",Ajuste Direto Regime Geral,Aquisição de bens móveis,"33158210-7, Estimulador","Centro Hospitalar de São João, E. P. E. (509821197)","LIVANOVA PORTUGAL, LDA. (505514010)","76.200,00 €",21-03-2018,04-09-2017,118 dias,"Portugal, Porto, Porto","Artigo 24.º, n.º 1, alínea e) do Código dos Contratos Públicos",,,,,,Não aplicável.,Não aplicável.,FALSE
