Objeto do Contrato,Tipo de Procedimento,Tipo(s) de Contrato,CPVs,Entidade(s) Adjudicante(s),Entidade(s) Adjudicatária(s),Preço Contratual,Data de Publicação,Data de Celebração do Contrato,Prazo de Execução,Local de Execução,Fundamentação,Data de Fecho do Contrato,Preço Total Efetivo,Causas das Alterações ao Prazo,Causas das Alterações ao Preço,Estado,N.º registo do Acordo Quadro,Descrição do Acordo Quadro,Procedimento Centralizado
"Aquisição de Próteses aórticas Percutâneas para o CHLO, no Ano de 2016",Concurso público,Aquisição de bens móveis,"33140000-3, Material médico de consumo","Centro Hospitalar de Lisboa Ocidental, E. P. E. (507618319)","Boston Scientific Portugal, Dispositivos Médicos, LDA (504988964)","196.800,00 €",19-09-2016,29-08-2016,365 dias,"Portugal, Lisboa, Lisboa","Artigo 20.º, n.º 1, alínea b) do Código dos Contratos Públicos",,,,,,Não aplicável.,Não aplicável.,FALSE
"Aquisição de Próteses Aórticas Percutâneas para o CHLO, no Ano de 2016",Concurso público,Aquisição de bens móveis,"33140000-3, Material médico de consumo","Centro Hospitalar de Lisboa Ocidental, E. P. E. (507618319)","St Jude Medical (Portugal) Distribuição Produtos Médicos, Lda.(504180746 (504180746)","180.000,00 €",19-09-2016,29-08-2016,365 dias,"Portugal, Lisboa, Lisboa","Artigo 20.º, n.º 1, alínea b) do Código dos Contratos Públicos",,,,,,Não aplicável.,Não aplicável.,FALSE
"Aquisição de Próteses Aórticas Percutâneas para o CHLO, no Ano de 2016",Concurso público,Aquisição de bens móveis,"33140000-3, Material médico de consumo","Centro Hospitalar de Lisboa Ocidental, E. P. E. (507618319)","Edwards Lifesciences (Portugal) Comércio e Distribuição de Dispositivos Médicos, Lda.(508014832) (508014832)","399.000,00 €",19-09-2016,29-08-2016,365 dias,"Portugal, Lisboa, Lisboa","Artigo 20.º, n.º 1, alínea b) do Código dos Contratos Públicos",,,,,,Não aplicável.,Não aplicável.,FALSE
"Aquisição de Próteses Aórticas Percutâneas para o CHLO, no Ano de 2016",Concurso público,Aquisição de bens móveis,"33140000-3, Material médico de consumo","Centro Hospitalar de Lisboa Ocidental, E. P. E. (507618319)","MEDTRONIC PORTUGAL, LDA(504223933) (504223933)","940.500,00 €",19-09-2016,29-08-2016,365 dias,"Portugal, Lisboa, Lisboa","Artigo 20.º, n.º 1, alínea b) do Código dos Contratos Públicos",,,,,,Não aplicável.,Não aplicável.,FALSE
