Jogador,Remate,Passe,Drible,Defesa,Físico,Velocidade
Cristiano Ronaldo Portugal,93,82,90,33,80,90
Bernardo Silva Portugal,80,83,89,45,61,90
João moutinho Portugal ,76,81,81,70,72,69
André Silva Portugal,75,62,77,44,76,81
Adrien Silva Portugal ,75,81,80,76,71,65
William Carvalho Portugal,57,77,74,80,83,53
João Mário Portugal ,69,79,82,66,69,75
Bruno Fernandes Portugal,77,83,82,63,71,78
Pepe Portugal,51,57,61,84,81,67
Ricardo Pereira Portugal,62,77,82,77,71,88
José Fonte Portugal,35,52,60,78,77,43
Raphael Guerreiro Portugal,75,82,82,74,63,77
Cédric Soares Portugal,66,71,76,74,72,82
Gelson Martins Portugal,69,75,86,44,60,94
Gonçalo Guedes Portugal,77,73,82,37,68,89
Ricardo Quaresma Portugal,71,81,88,18,60,83
Bruno Alves Portugal,69,66,66,71,84,49
Mário Rui Portugal,49,72,77,73,69,86
Rúben Dias Portugal ,34,47,56,75,79,63
Manuel Fernandes,76,79,83,66,72,79
Diego Gódin Uruguai,48,65,63,88,79,67
Sebastian Coates Uruguai,45,53,60,81,86,58
José Giménez Uruguai,45,51,52,84,81,70
Maxi Pereira Uruguai,62,71,76,76,75,73
Gastón Silva Uruguai,45,64,67,73,71,71
M. Cáceres Uruguai,51,64,65,79,75,78
G.Varela Uruguai,34,56,67,66,67,77
N. Nandéz Uruguai,62,66,71,69,76,77
Lucas Torreira Uruguai,61,77,80,69,75,80
M. Vecino Uruguai,67,76,77,72,77,71
R. Bentancur Uruguai ,54,71,77,65,71,70
C. Sanchéz Uruguai,72,72,75,55,72,88
J. Urretaviscaya Uruguai ,69,72,75,36,62,85
G. Arrascaeta Uruguai,70,74,75,44,49,72
D. Laxalt Uruguai ,65,73,78,58,71,88
C. Rodríguez Uruguai,69,74,78,55,70,71
C. Stuani Uruguai,77,67,72,47,79,69
E. Cavani Uruguai,84,72,80,42,82,77
M. Gómez Uruguai,79,62,70,27,75,66
Luis Suárez Uruguai,90,79,87,42,85,82