Objeto do Contrato,Tipo de Procedimento,Tipo(s) de Contrato,CPVs,Entidade(s) Adjudicante(s),Entidade(s) Adjudicatária(s),Preço Contratual,Data de Publicação,Data de Celebração do Contrato,Prazo de Execução,Local de Execução,Fundamentação,Data de Fecho do Contrato,Preço Total Efetivo,Causas das Alterações ao Prazo,Causas das Alterações ao Preço,Estado,N.º registo do Acordo Quadro,Descrição do Acordo Quadro,Procedimento Centralizado
"Prestação de serviços de Rx e Ecografia, durante o mes de Junho/2012",Ajuste Direto Regime Geral,Aquisição de serviços,"85150000-5, Serviços de imagiologia médica",Centro de Medicina de Reabilitação da Região Centro - Rovisco Pais (503767336),"Clinimagem-Clinica de Imagiologia, Ldª. (503619566)","1.054,30 €",10-08-2012,18-07-2012,30 dias,"Portugal, Coimbra, Cantanhede","Artigo 27.º, n.º 1, alínea a) do Código dos Contratos Públicos",,,,,,Não aplicável.,Não aplicável.,
Consumo de energia da Instituição,Ajuste Direto Regime Geral,Aquisição de serviços,"65310000-9, Distribuição de electricidade",Centro de Medicina de Reabilitação da Região Centro - Rovisco Pais (503767336),"EDP Comercial-Comercialização de Energia, SA (503504564)","32.520,32 €",10-08-2012,20-06-2012,60 dias,"Portugal, Coimbra, Cantanhede","Artigo 27.º, n.º 1, alínea a) do Código dos Contratos Públicos",,,,,,Não aplicável.,Não aplicável.,
Gas a granel e Gasoleo de aquecimento,Ajuste Direto Regime Geral,Aquisição de serviços,"65210000-8, Distribuição de gás",Centro de Medicina de Reabilitação da Região Centro - Rovisco Pais (503767336),"Galp Energia, Petroleos de Portugal-Petrogal, SA (500697370)","41.463,42 €",10-08-2012,13-06-2012,150 dias,"Portugal, Coimbra, Cantanhede","Artigo 27.º, n.º 1, alínea a) do Código dos Contratos Públicos",,,,,,Não aplicável.,Não aplicável.,
Analises Clinicas efetuadas na Instituição,Ajuste Direto Regime Geral,Aquisição de serviços,"85148000-8, Serviços de análises clínicas",Centro de Medicina de Reabilitação da Região Centro - Rovisco Pais (503767336),"Cavadas, Almeida e Companhia, Ldª. (500330077)","10.000,00 €",10-08-2012,20-06-2012,90 dias,"Portugal, Coimbra, Cantanhede","Artigo 27.º, n.º 1, alínea a) do Código dos Contratos Públicos",,,,,,Não aplicável.,Não aplicável.,
"Aquisição de Rivastigmina 1.5mg, 3mg, 4.6mg sistema transdermico; e Baclofeno 25mg",Ajuste Direto Regime Geral,Aquisição de bens móveis,"33600000-6, Produtos farmacêuticos",Centro de Medicina de Reabilitação da Região Centro - Rovisco Pais (503767336),"Novartis Farma, Produtos Farmaceuticos, S.A (500063524)","1.240,10 €",01-08-2012,24-07-2012,60 dias,"Portugal, Coimbra, Cantanhede","Artigo 26.º, n.º 1, alínea a) do Código dos Contratos Públicos",,,,,,Não aplicável.,Não aplicável.,
Aquisição de Reagente para Determinação Glicose no Sangue,Ajuste Direto Regime Geral,Aquisição de bens móveis,"33600000-6, Produtos farmacêuticos",Centro de Medicina de Reabilitação da Região Centro - Rovisco Pais (503767336),"Quilaban Quimica Laboratorial Analitica, Lda (500399670)","1.042,50 €",01-08-2012,20-07-2012,120 dias,"Portugal, Coimbra, Cantanhede","Artigo 26.º, n.º 1, alínea a) do Código dos Contratos Públicos",,,,,,Não aplicável.,Não aplicável.,
Aquisição de Baclofeno 10mg/5ml,Ajuste Direto Regime Geral,Aquisição de bens móveis,"33600000-6, Produtos farmacêuticos",Centro de Medicina de Reabilitação da Região Centro - Rovisco Pais (503767336),"Novartis farma, Produtos Farmaceuticos,S.A (500063524)","2.104,40 €",01-08-2012,20-07-2012,30 dias,"Portugal, Coimbra, Cantanhede","Artigo 26.º, n.º 1, alínea a) do Código dos Contratos Públicos",,,,,,Não aplicável.,Não aplicável.,
