freguesia,acronym,validVotesPercentage,votes,dicofre
União das freguesias de Colmeias e Memória,PPD/PSD,46.79,488,100932
União das freguesias de Colmeias e Memória,PS,24.64,257,100932
União das freguesias de Colmeias e Memória,CDS-PP,8.34,87,100932
União das freguesias de Colmeias e Memória,B.E.,5.56,58,100932
União das freguesias de Colmeias e Memória,PAN,4.6,48,100932
União das freguesias de Colmeias e Memória,A,2.01,21,100932
União das freguesias de Colmeias e Memória,L,1.44,15,100932
União das freguesias de Colmeias e Memória,NC,1.25,13,100932
União das freguesias de Colmeias e Memória,IL,1.05,11,100932
União das freguesias de Colmeias e Memória,PPM.PPV/CDC,1.05,11,100932
União das freguesias de Colmeias e Memória,PCP-PEV,0.86,9,100932
União das freguesias de Colmeias e Memória,PDR,0.86,9,100932
União das freguesias de Colmeias e Memória,PNR,0.48,5,100932
União das freguesias de Colmeias e Memória,PURP,0.48,5,100932
União das freguesias de Colmeias e Memória,MAS,0.29,3,100932
União das freguesias de Colmeias e Memória,PTP,0.19,2,100932
União das freguesias de Colmeias e Memória,PCTP/MRPP,0.1,1,100932
