Objeto do Contrato,Tipo de Procedimento,Tipo(s) de Contrato,CPVs,Entidade(s) Adjudicante(s),Entidade(s) Adjudicatária(s),Preço Contratual,Data de Publicação,Data de Celebração do Contrato,Prazo de Execução,Local de Execução,Fundamentação,Data de Fecho do Contrato,Preço Total Efetivo,Causas das Alterações ao Prazo,Causas das Alterações ao Preço,Estado,N.º registo do Acordo Quadro,Descrição do Acordo Quadro,Procedimento Centralizado
AD/0028/2014 - AQUISIÇÃO DE CONTENTORES DE ESTERILIZAÇÃO - INSTRUMENTAL CIRURGICO,Ajuste Direto Regime Geral,Aquisição de bens móveis,"33169400-6, Contentores cirúrgicos","Centro Hospitalar do Porto, E.P.E. (CHP) (508331471)","B. BRAUN MEDICAL, LDA (501506543)","14.609,48 €",11-09-2015,01-07-2015,5 dias,"Portugal, Porto, Porto","Artigo 20.º, n.º 1, alínea a) do Código dos Contratos Públicos",04-09-2015,"14.609,48 €","",,,Não aplicável.,Não aplicável.,FALSE
AD/0036/2014 - AQUISIÇÃO DE KITS PARA CIRURGIA LAPAROSCOPICA RENAL,Ajuste Direto Regime Geral,Aquisição de bens móveis,"33169000-2, Material cirúrgico","Centro Hospitalar do Porto, E.P.E. (CHP) (508331471)","B. BRAUN MEDICAL, LDA (501506543)","22.580,56 €",11-09-2015,01-07-2015,5 dias,"Portugal, Porto, Porto","Artigo 20.º, n.º 1, alínea a) do Código dos Contratos Públicos",14-07-2015,"22.580,56 €","",,,Não aplicável.,Não aplicável.,FALSE
AD/0043/2014 - AQUISIÇÃO DE HISTEROSCOPIOS E RESSECTOSCOPIOS PARA O CICA,Ajuste Direto Regime Geral,Aquisição de bens móveis,"33160000-9, Técnicas cirúrgicas","Centro Hospitalar do Porto, E.P.E. (CHP) (508331471)","TEPREL, LDA (502262184)","19.425,87 €",11-09-2015,04-03-2015,30 dias,"Portugal, Porto, Porto","Artigo 20.º, n.º 1, alínea a) do Código dos Contratos Públicos",27-05-2015,"19.425,87 €","",,,Não aplicável.,Não aplicável.,FALSE
AD/2062/2014 - AQUISIÇÃO DE KIT DE TUBOS PARA IRRIGAÇÃO EM HISTEROSCOPIA E RESSECTOSCOPIA COM COLOCAÇÃO DE EQUIPAMENTO,Ajuste Direto Regime Geral,Aquisição de bens móveis,"33140000-3, Material médico de consumo","Centro Hospitalar do Porto, E.P.E. (CHP) (508331471)","OLYMPUS IBERIA, SAU (980474710)","46.656,00 €",11-09-2015,03-03-2015,30 dias,"Portugal, Porto, Porto","Artigo 20.º, n.º 1, alínea a) do Código dos Contratos Públicos",03-04-2015,"46.656,00 €","",,,Não aplicável.,Não aplicável.,FALSE
AD/0075/2014 - AQUISIÇÃO DE PERNEIRAS COM SISTEMA HIDRAULICO,Ajuste Direto Regime Geral,Aquisição de bens móveis,"33180000-5, Apoio funcional","Centro Hospitalar do Porto, E.P.E. (CHP) (508331471)","MAQUET PORTUGAL, LDA (506819698)","9.200,00 €",11-09-2015,08-01-2015,30 dias,"Portugal, Porto, Porto","Artigo 20.º, n.º 1, alínea a) do Código dos Contratos Públicos",05-05-2015,"9.200,00 €","",,,Não aplicável.,Não aplicável.,FALSE
AD/0065/2014 - AQUISIÇÃO DE EQUIPAMENTO E CONSUMIVEIS PARA CIRURGIA DE GLAUCOMA MINIMAMENTE INVASIVA,Ajuste Direto Regime Geral,Aquisição de bens móveis,"33100000-1, Equipamento médico","Centro Hospitalar do Porto, E.P.E. (CHP) (508331471)","HEMICARE, LDA (506517080)","15.919,00 €",11-09-2015,11-02-2015,3 dias,"Portugal, Porto, Porto","Artigo 20.º, n.º 1, alínea a) do Código dos Contratos Públicos",30-03-2015,"15.919,00 €","",,,Não aplicável.,Não aplicável.,FALSE
AD/0082/2014 - AQUISIÇÃO DE FIBROSCOPIO DE INTUBAÇÃO PARA O BLOCO DE PEDIATRIA,Ajuste Direto Regime Geral,Aquisição de bens móveis,"33100000-1, Equipamento médico","Centro Hospitalar do Porto, E.P.E. (CHP) (508331471)","TEPREL, LDA (502262184)","4.536,00 €",11-09-2015,04-02-2015,30 dias,"Portugal, Porto, Porto","Artigo 20.º, n.º 1, alínea a) do Código dos Contratos Públicos",16-06-2015,"4.536,00 €","",,,Não aplicável.,Não aplicável.,FALSE
AD/0094/2014 - AQUISIÇÃO DE MONITORES DE SINAIS VITAIS PARA O CMIN,Ajuste Direto Regime Geral,Aquisição de bens móveis,"33123210-3, Aparelhos para monitorização cardíaca","Centro Hospitalar do Porto, E.P.E. (CHP) (508331471)","IBERDATA, SA (501904921)","11.200,00 €",11-09-2015,03-09-2014,30 dias,"Portugal, Porto, Porto","Artigo 20.º, n.º 1, alínea a) do Código dos Contratos Públicos",17-10-2014,"11.200,00 €","",,,Não aplicável.,Não aplicável.,FALSE
AD/0115/2014 - AQUISIÇÃO DE VIDEODUODENOSCOPIO E VIDEOGASTROSCOPIO,Ajuste Direto Regime Geral,Aquisição de bens móveis,"33100000-1, Equipamento médico","Centro Hospitalar do Porto, E.P.E. (CHP) (508331471)","OLYMPUS IBERIA, SAU (980474710)","53.300,00 €",11-09-2015,28-04-2015,30 dias,"Portugal, Porto, Porto","Artigo 20.º, n.º 1, alínea a) do Código dos Contratos Públicos",28-05-2015,"53.300,00 €","",,,Não aplicável.,Não aplicável.,FALSE
AD/0119/2014 - AQUISIÇÃO DE VIDEODUODENOSCOPIO E VIDEOCOLONOSCOPIO,Ajuste Direto Regime Geral,Aquisição de bens móveis,"33100000-1, Equipamento médico","Centro Hospitalar do Porto, E.P.E. (CHP) (508331471)","OLYMPUS IBERIA, SAU (980474710)","56.800,00 €",11-09-2015,28-04-2015,30 dias,"Portugal, Porto, Porto","Artigo 20.º, n.º 1, alínea a) do Código dos Contratos Públicos",28-05-2015,"56.800,00 €","",,,Não aplicável.,Não aplicável.,FALSE
AQUISIÇÃO DE 3 VIDEOGASTROSCOPIOS,Ajuste Direto Regime Geral,Aquisição de bens móveis,"33100000-1, Equipamento médico","Centro Hospitalar do Porto, E.P.E. (CHP) (508331471)","OLYMPUS, IBERIA (980474710)","58.500,00 €",10-09-2015,28-04-2015,30 dias,"Portugal, Porto, Porto","Artigo 20.º, n.º 1, alínea a) do Código dos Contratos Públicos",07-05-2015,"58.500,00 €","",,,Não aplicável.,Não aplicável.,FALSE
AQUISIÇÃO DE MACAS E MARQUESAS PARA O CMIN,Ajuste Direto Regime Geral,Aquisição de bens móveis,"33192000-2, Mobiliário para fins médicos","Centro Hospitalar do Porto, E.P.E. (CHP) (508331471)","PORTO SAÚDE, LDA (502927178)","1.900,00 €",10-09-2015,11-03-2015,15 dias,"Portugal, Porto, Porto","Artigo 20.º, n.º 1, alínea a) do Código dos Contratos Públicos",09-04-2015,"1.900,00 €","",,,Não aplicável.,Não aplicável.,FALSE
MODERNIZAÇÃO DOS ELEVADORES 17 E 18,Ajuste Direto Regime Geral,Empreitadas de obras públicas,"45200000-9, Obras de construção total ou parcial e de engenharia civil","Centro Hospitalar do Porto, E.P.E. (CHP) (508331471)","SCHMITT-ELEVADORES, LDA (500230757)","32.400,00 €",10-09-2015,04-02-2015,54 dias,"Portugal, Porto, Porto","Artigo 19.º, alínea a) do Código dos Contratos Públicos","","32.400,00 €",ATRASO NA EXECUÇÃO DA OBRA,,,Não aplicável.,Não aplicável.,FALSE
AQUISIÇÃO DE SISTEMA COMPLETO DE ALTA DEFINIÇÃO,Ajuste Direto Regime Geral,Aquisição de bens móveis,"33100000-1, Equipamento médico","Centro Hospitalar do Porto, E.P.E. (CHP) (508331471)","STRYKER PORTUGAL, LDA (504594214)","27.603,06 €",10-09-2015,08-01-2015,5 dias,"Portugal, Porto, Porto","Artigo 20.º, n.º 1, alínea a) do Código dos Contratos Públicos",10-03-2015,"27.603,06 €","",,,Não aplicável.,Não aplicável.,FALSE
FORNECIMENTO E MONTAGEM DE SISTEMA TRATAMENTO ÁGUA POR OSMOSE INVERSA,Ajuste Direto Regime Geral,Aquisição de bens móveis,"33190000-8, Dispositivos e produtos médicos variados","Centro Hospitalar do Porto, E.P.E. (CHP) (508331471)","FRESENIUS MEDICAL CARE, SA (503070220)","14.560,00 €",10-09-2015,18-02-2015,60 dias,"Portugal, Porto, Porto","Artigo 20.º, n.º 1, alínea a) do Código dos Contratos Públicos",10-03-2015,"14.560,00 €","",,,Não aplicável.,Não aplicável.,FALSE
AQUISIÇÃO DE ELECTROBISTURI COM ARGON,Ajuste Direto Regime Geral,Aquisição de bens móveis,"33000000-0, Equipamento médico, medicamentos e produtos para cuidados pessoais","Centro Hospitalar do Porto, E.P.E. (CHP) (508331471)","ANGO SAÚDE, SA (507016882)","16.685,02 €",10-09-2015,27-05-2015,30 dias,"Portugal, Porto, Porto","Artigo 20.º, n.º 1, alínea a) do Código dos Contratos Públicos",27-05-2015,"16.685,02 €","",,,Não aplicável.,Não aplicável.,FALSE
AQUISIÇÃO DE 5 CARROS TRANSPORTE MATERIAL PARA ESTERILIZAÇÃO,Ajuste Direto Regime Geral,Aquisição de bens móveis,"42671100-1, Carrinhos para transporte de instrumentos de laboratório","Centro Hospitalar do Porto, E.P.E. (CHP) (508331471)","BACELAR & IRMÃO, LDA (500532818)","5.595,50 €",10-09-2015,27-05-2015,45 dias,"Portugal, Porto, Porto","Artigo 20.º, n.º 1, alínea a) do Código dos Contratos Públicos",27-05-2015,"5.595,50 €","",,,Não aplicável.,Não aplicável.,FALSE
FORNECIMENTO E MONTAGEM DE EQUIPAMENTO PARA SALA DE RADIOLOGIA DIGITAL DIRETA (DDR),Concurso público,Aquisição de bens móveis,"33111000-1, Aparelhos para radiologia","Centro Hospitalar Porto, E. P. E. (508331471)",MED X RAY (506187071),"178.449,00 €",10-09-2015,11-03-2015,40 dias,"Portugal, Porto, Porto","Artigo 20.º, n.º 1, alínea b) do Código dos Contratos Públicos",11-03-2015,"178.449,00 €","",,,Não aplicável.,Não aplicável.,FALSE
SERVIÇOS DE DIGITALIZAÇÃO DO FUNDO HISTÓRICO DO CHP,Ajuste Direto Regime Geral,Aquisição de serviços,"98300000-6, Serviços diversos","Centro Hospitalar do Porto, E.P.E. (CHP) (508331471)","GADSA, SA (504595440)","4.050,00 €",09-09-2015,04-03-2015,40 dias,"Portugal, Porto, Porto","Artigo 20.º, n.º 1, alínea a) do Código dos Contratos Públicos",04-03-2015,"4.050,00 €","",,,Não aplicável.,Não aplicável.,FALSE
EQUIPAMENTO PARA CIRURGIA TRATAMENTO DE QUERATOCONE E ECTASIAS,Ajuste Direto Regime Geral,Aquisição de bens móveis,"33100000-1, Equipamento médico","Centro Hospitalar do Porto, E.P.E. (CHP) (508331471)","HEMICARE, LDA (506517080)","15.000,00 €",09-09-2015,18-03-2015,2 dias,"Portugal, Porto, Porto","Artigo 20.º, n.º 1, alínea a) do Código dos Contratos Públicos",18-03-2015,"15.000,00 €","",,,Não aplicável.,Não aplicável.,FALSE
SERVIÇOS DE MONITORIZAÇÃO INTRA OPERATÓRIA EM ORTOPEDIA E NEUROCIRURGIA,Ajuste Direto Regime Geral,Aquisição de serviços,"98300000-6, Serviços diversos","Centro Hospitalar do Porto, E.P.E. (CHP) (508331471)","NEURINBLOC, LDA (508420512)","29.221,50 €",09-09-2015,18-03-2015,365 dias,"Portugal, Porto, Porto","Artigo 20.º, n.º 1, alínea a) do Código dos Contratos Públicos",18-03-2015,"29.221,50 €","",,,Não aplicável.,Não aplicável.,FALSE
AQUISIÇÃO DE CONSUMÍVEIS INFORMÁTICA,Ajuste Direto Regime Geral,Aquisição de bens móveis,"30200000-1, Equipamento e material informático","Centro Hospitalar do Porto, E.P.E. (CHP) (508331471)","MEGABIT, LDA (513078371)","9.047,00 €",09-09-2015,28-08-2015,5 dias,"Portugal, Porto, Porto","Artigo 20.º, n.º 1, alínea a) do Código dos Contratos Públicos",28-08-2015,"9.047,00 €","",,,Não aplicável.,Não aplicável.,FALSE
"AQUISIÇÃO DE COMPUTADORES, MONITORES E IMPRESSORAS",Concurso público,Aquisição de bens móveis,"30200000-1, Equipamento e material informático","Centro Hospitalar Porto, E. P. E. (508331471)","PAMAFE, LDA (504099388)","77.745,00 €",09-09-2015,02-09-2015,6 dias,"Portugal, Porto, Porto","Artigo 20.º, n.º 1, alínea b) do Código dos Contratos Públicos",02-09-2015,"77.745,00 €","",,,Não aplicável.,Não aplicável.,FALSE
