freguesia,acronym,validVotesPercentage,votes,dicofre
Moreira de Rei,PS,67.24,78,091312
Moreira de Rei,PPD/PSD,22.41,26,091312
Moreira de Rei,B.E.,2.59,3,091312
Moreira de Rei,CDS-PP,2.59,3,091312
Moreira de Rei,A,1.72,2,091312
Moreira de Rei,PAN,0.86,1,091312
Moreira de Rei,PCP-PEV,0.86,1,091312
Moreira de Rei,PCTP/MRPP,0.86,1,091312
Moreira de Rei,PDR,0.86,1,091312
Moreira de Rei,IL,0,0,091312
Moreira de Rei,L,0,0,091312
Moreira de Rei,MAS,0,0,091312
Moreira de Rei,NC,0,0,091312
Moreira de Rei,PNR,0,0,091312
Moreira de Rei,PPM.PPV/CDC,0,0,091312
Moreira de Rei,PTP,0,0,091312
Moreira de Rei,PURP,0,0,091312
