freguesia,acronym,validVotesPercentage,votes,dicofre
União das freguesias de Mazarefes e Vila Fria,PS,45.01,614,160944
União das freguesias de Mazarefes e Vila Fria,PPD/PSD,26.76,365,160944
União das freguesias de Mazarefes e Vila Fria,B.E.,9.68,132,160944
União das freguesias de Mazarefes e Vila Fria,PCP-PEV,6.3,86,160944
União das freguesias de Mazarefes e Vila Fria,CDS-PP,3.15,43,160944
União das freguesias de Mazarefes e Vila Fria,PAN,2.93,40,160944
União das freguesias de Mazarefes e Vila Fria,R.I.R.,1.39,19,160944
União das freguesias de Mazarefes e Vila Fria,A,1.03,14,160944
União das freguesias de Mazarefes e Vila Fria,CH,0.88,12,160944
União das freguesias de Mazarefes e Vila Fria,JPP,0.59,8,160944
União das freguesias de Mazarefes e Vila Fria,L,0.44,6,160944
União das freguesias de Mazarefes e Vila Fria,PCTP/MRPP,0.44,6,160944
União das freguesias de Mazarefes e Vila Fria,NC,0.37,5,160944
União das freguesias de Mazarefes e Vila Fria,PDR,0.29,4,160944
União das freguesias de Mazarefes e Vila Fria,PTP,0.29,4,160944
União das freguesias de Mazarefes e Vila Fria,IL,0.15,2,160944
União das freguesias de Mazarefes e Vila Fria,PURP,0.15,2,160944
União das freguesias de Mazarefes e Vila Fria,PNR,0.07,1,160944
União das freguesias de Mazarefes e Vila Fria,PPM,0.07,1,160944
União das freguesias de Mazarefes e Vila Fria,MPT,0,0,160944
