freguesia,acronym,validVotesPercentage,votes,dicofre
Piódão,PPD/PSD,40,26,060111
Piódão,PS,32.31,21,060111
Piódão,CDS-PP,6.15,4,060111
Piódão,PCP-PEV,6.15,4,060111
Piódão,B.E.,4.62,3,060111
Piódão,PAN,3.08,2,060111
Piódão,R.I.R.,3.08,2,060111
Piódão,A,1.54,1,060111
Piódão,CH,1.54,1,060111
Piódão,PNR,1.54,1,060111
Piódão,IL,0,0,060111
Piódão,JPP,0,0,060111
Piódão,L,0,0,060111
Piódão,MAS,0,0,060111
Piódão,MPT,0,0,060111
Piódão,NC,0,0,060111
Piódão,PCTP/MRPP,0,0,060111
Piódão,PDR,0,0,060111
Piódão,PPM,0,0,060111
Piódão,PURP,0,0,060111
