freguesia,acronym,validVotesPercentage,votes,dicofre
Cabanelas,PPD/PSD,46.25,37,040709
Cabanelas,PS,36.25,29,040709
Cabanelas,CDS-PP,7.5,6,040709
Cabanelas,PPM.PPV/CDC,3.75,3,040709
Cabanelas,B.E.,2.5,2,040709
Cabanelas,PCP-PEV,1.25,1,040709
Cabanelas,PCTP/MRPP,1.25,1,040709
Cabanelas,PNR,1.25,1,040709
Cabanelas,A,0,0,040709
Cabanelas,IL,0,0,040709
Cabanelas,L,0,0,040709
Cabanelas,MAS,0,0,040709
Cabanelas,NC,0,0,040709
Cabanelas,PAN,0,0,040709
Cabanelas,PDR,0,0,040709
Cabanelas,PTP,0,0,040709
Cabanelas,PURP,0,0,040709
