freguesia,acronym,validVotesPercentage,votes,dicofre
Panoias de Cima,PS,38.42,68,090728
Panoias de Cima,PPD/PSD.CDS-PP,29.38,52,090728
Panoias de Cima,MPT,10.17,18,090728
Panoias de Cima,PCP-PEV,9.6,17,090728
Panoias de Cima,B.E.,5.08,9,090728
Panoias de Cima,PAN,2.26,4,090728
Panoias de Cima,PTP,1.69,3,090728
Panoias de Cima,PCTP/MRPP,1.13,2,090728
Panoias de Cima,PPM,1.13,2,090728
Panoias de Cima,L,0.56,1,090728
Panoias de Cima,PNR,0.56,1,090728
Panoias de Cima,MAS,0,0,090728
Panoias de Cima,PDA,0,0,090728
Panoias de Cima,PND,0,0,090728
Panoias de Cima,POUS,0,0,090728
Panoias de Cima,PPV,0,0,090728
