Objeto do Contrato,Tipo de Procedimento,Tipo(s) de Contrato,CPVs,Entidade(s) Adjudicante(s),Entidade(s) Adjudicatária(s),Preço Contratual,Data de Publicação,Data de Celebração do Contrato,Prazo de Execução,Local de Execução,Fundamentação,Data de Fecho do Contrato,Preço Total Efetivo,Causas das Alterações ao Prazo,Causas das Alterações ao Preço,Estado,N.º registo do Acordo Quadro,Descrição do Acordo Quadro,Procedimento Centralizado
"Serviços de Telerradiologia, de Janeiro a Dezembro de 2017",Concurso público,Aquisição de serviços,"85150000-5, Serviços de imagiologia médica","Centro Hospitalar de Setúbal, E. P. E. (507606787)","I.T.M. - Instituto de Telemedicina, Lda (506705641)","240.600,00 €",03-03-2017,15-02-2017,320 dias,"Portugal, Setúbal, Setúbal","Artigo 20.º, n.º 1, alínea b) do Código dos Contratos Públicos",,,,,,Não aplicável.,Não aplicável.,FALSE
"Serviços Gestão Integrada de Tratamento Resíduos Hospitalares, ano 2017",Ajuste Direto Regime Geral,Aquisição de serviços,"90000000-7, Serviços relativos a águas residuais, resíduos, limpeza e ambiente","Centro Hospitalar de Setúbal, E. P. E. (507606787)",such (500900469),"334.135,42 €",01-03-2017,21-12-2016,365 dias,"Portugal, Setúbal, Setúbal","Artigo 20.º, n.º 1, alínea a) do Código dos Contratos Públicos",,,,,,Não aplicável.,Não aplicável.,FALSE
Serviços médicos Neurologia ano 2017,Ajuste Direto Regime Geral,Aquisição de serviços,"85000000-9, Serviços de saúde e acção social","Centro Hospitalar de Setúbal, E. P. E. (507606787)","Rui Labrusco, Lda (506584828)","58.400,00 €",24-02-2017,27-01-2017,365 dias,"Portugal, Setúbal, Setúbal","Artigo 20.º, n.º 1, alínea a) do Código dos Contratos Públicos",,,,,,Não aplicável.,Não aplicável.,FALSE
"Serviços técnico juridico, regime prestação serviços",Ajuste Direto Regime Geral,Aquisição de serviços,"79000000-4, Serviços a empresas: direito, comercialização, consultoria, recrutamento, impressão e segurança","Centro Hospitalar de Setúbal, E. P. E. (507606787)",Carlos Rito (128996609),"31.067,28 €",24-02-2017,20-02-2017,365 dias,"Portugal, Setúbal, Setúbal","Artigo 20.º, n.º 1, alínea a) do Código dos Contratos Públicos",,,,,,Não aplicável.,Não aplicável.,FALSE
"Serviços médicos patologia clinica, ano 2017",Ajuste Direto Regime Geral,Aquisição de serviços,"85000000-9, Serviços de saúde e acção social","Centro Hospitalar de Setúbal, E. P. E. (507606787)",Ahmed Gany Unipessoal (508223237),"56.160,00 €",24-02-2017,07-02-2017,365 dias,"Portugal, Setúbal, Setúbal","Artigo 20.º, n.º 1, alínea a) do Código dos Contratos Públicos",,,,,,Não aplicável.,Não aplicável.,FALSE
serviços médicos triagem sug ano 2017,Ajuste Direto Regime Geral,Aquisição de serviços,"85000000-9, Serviços de saúde e acção social","Centro Hospitalar de Setúbal, E. P. E. (507606787)",victor  joao cardoso (134781724),"56.160,00 €",24-02-2017,02-02-2017,365 dias,"Portugal, Setúbal, Setúbal","Artigo 20.º, n.º 1, alínea a) do Código dos Contratos Públicos",,,,,,Não aplicável.,Não aplicável.,FALSE
"Serviços Médicos Cardiologia , ano 2017",Ajuste Direto Regime Geral,Aquisição de serviços,"85000000-9, Serviços de saúde e acção social","Centro Hospitalar de Setúbal, E. P. E. (507606787)",Artur duarte lopes (514032766),"56.160,00 €",24-02-2017,10-02-2017,365 dias,"Portugal, Setúbal, Setúbal","Artigo 20.º, n.º 1, alínea a) do Código dos Contratos Públicos",,,,,,Não aplicável.,Não aplicável.,FALSE
ESTIMULANTES ERITROPOIESE,Ao abrigo de acordo-quadro (art.º 259.º),Aquisição de bens móveis,"33600000-6, Produtos farmacêuticos","Centro Hospitalar de Setúbal, E. P. E. (507606787)","ROCHE FARMACEUTICA QUIMICA LD     (500233810), Pfizer (500162166)","55.228,50 €",24-02-2017,23-02-2017,365 dias,"Portugal, Setúbal, Setúbal",Artigo 259.º do Código dos Contratos Públicos,,,,,,463788,CP 2012/11 - Estimulantes da Eritropoiese,FALSE
OUTROS ANTIMICROBIANOS ANTIVIRICOS,Ajuste Direto Regime Geral,Aquisição de bens móveis,"33600000-6, Produtos farmacêuticos","Centro Hospitalar de Setúbal, E. P. E. (507606787)","Teva (507045491), LABORATORIOS ATRAL SA (500162085), Johnson & Johnson Medical (500153370), DILOFAR DISTRIBUICAO TRANSPORTES E LOGISTICA       (500563004), LABESFAL-LABORATORIOS ALMIRO, SA (501169580), Alfa Wassermann - Produtos Farmacêuticos, Lda. (502857722), Bial (500220913)","20.456,62 €",22-02-2017,08-02-2017,365 dias,"Portugal, Setúbal, Setúbal","Artigo 20.º, n.º 1, alínea a) do Código dos Contratos Públicos",,,,,,Não aplicável.,Não aplicável.,FALSE
"CPRES, para o Ano de 2017",Ajuste Direto Regime Geral,Aquisição de serviços,"85000000-9, Serviços de saúde e acção social","Centro Hospitalar de Setúbal, E. P. E. (507606787)","Hospor - Hospitais  Portugueses, S.A. (501245570)","13.900,00 €",21-02-2017,02-02-2017,365 dias,"Portugal, Setúbal, Setúbal","Artigo 20.º, n.º 1, alínea a) do Código dos Contratos Públicos",,,,,,Não aplicável.,Não aplicável.,FALSE
"Desenvolvimento de projeto de arquitetura e coordenação para a construção do novo edificio do serviço de urgência do Centro Hospitalar de Setubal, E.P.E.",Ajuste Direto Regime Geral,Aquisição de serviços,"71000000-8, Serviços de arquitectura, construção, engenharia e inspecção","Centro Hospitalar de Setúbal, E. P. E. (507606787)","Luis Narciso- Arquitetos, Lda (503413356)","73.975,00 €",21-02-2017,10-02-2017,60 dias,"Portugal, Setúbal, Setúbal","Artigo 20.º, n.º 1, alínea a) do Código dos Contratos Públicos",,,,,,Não aplicável.,Não aplicável.,FALSE
