freguesia,acronym,validVotesPercentage,votes,dicofre
Sobradelo da Goma,PS,43.56,88,030925
Sobradelo da Goma,PPD/PSD,40.59,82,030925
Sobradelo da Goma,B.E.,4.95,10,030925
Sobradelo da Goma,CDS-PP,3.47,7,030925
Sobradelo da Goma,PAN,3.47,7,030925
Sobradelo da Goma,PCTP/MRPP,1.49,3,030925
Sobradelo da Goma,PNR,0.99,2,030925
Sobradelo da Goma,PPM.PPV/CDC,0.99,2,030925
Sobradelo da Goma,PTP,0.5,1,030925
Sobradelo da Goma,A,0,0,030925
Sobradelo da Goma,IL,0,0,030925
Sobradelo da Goma,L,0,0,030925
Sobradelo da Goma,MAS,0,0,030925
Sobradelo da Goma,NC,0,0,030925
Sobradelo da Goma,PCP-PEV,0,0,030925
Sobradelo da Goma,PDR,0,0,030925
Sobradelo da Goma,PURP,0,0,030925
