freguesia,acronym,validVotesPercentage,votes,dicofre
Pavia,PS,34.85,138,070704
Pavia,PCP-PEV,30.56,121,070704
Pavia,PPD/PSD,17.68,70,070704
Pavia,B.E.,6.06,24,070704
Pavia,CDS-PP,4.29,17,070704
Pavia,PCTP/MRPP,2.78,11,070704
Pavia,PAN,1.52,6,070704
Pavia,A,0.76,3,070704
Pavia,L,0.51,2,070704
Pavia,CH,0.25,1,070704
Pavia,IL,0.25,1,070704
Pavia,PNR,0.25,1,070704
Pavia,R.I.R.,0.25,1,070704
Pavia,MPT,0,0,070704
Pavia,NC,0,0,070704
Pavia,PDR,0,0,070704
Pavia,PPM,0,0,070704
Pavia,PTP,0,0,070704
Pavia,PURP,0,0,070704
