freguesia,acronym,validVotesPercentage,votes,dicofre
Ferreira do Zêzere,PS,35.59,252,141106
Ferreira do Zêzere,PPD/PSD.CDS-PP,33.05,234,141106
Ferreira do Zêzere,MPT,9.04,64,141106
Ferreira do Zêzere,PCP-PEV,7.06,50,141106
Ferreira do Zêzere,B.E.,5.51,39,141106
Ferreira do Zêzere,PAN,2.68,19,141106
Ferreira do Zêzere,L,1.69,12,141106
Ferreira do Zêzere,PPM,1.27,9,141106
Ferreira do Zêzere,PND,1.13,8,141106
Ferreira do Zêzere,PTP,1.13,8,141106
Ferreira do Zêzere,MAS,0.71,5,141106
Ferreira do Zêzere,PCTP/MRPP,0.56,4,141106
Ferreira do Zêzere,POUS,0.28,2,141106
Ferreira do Zêzere,PNR,0.14,1,141106
Ferreira do Zêzere,PPV,0.14,1,141106
Ferreira do Zêzere,PDA,0,0,141106
