Objeto do Contrato,Tipo de Procedimento,Tipo(s) de Contrato,CPVs,Entidade(s) Adjudicante(s),Entidade(s) Adjudicatária(s),Preço Contratual,Data de Publicação,Data de Celebração do Contrato,Prazo de Execução,Local de Execução,Fundamentação,Data de Fecho do Contrato,Preço Total Efetivo,Causas das Alterações ao Prazo,Causas das Alterações ao Preço,Estado,N.º registo do Acordo Quadro,Descrição do Acordo Quadro,Procedimento Centralizado
72316714 - Artigos de Vitrectomia Posterior - Oftalmologia,Ajuste Direto Regime Geral,Aquisição de bens móveis,"33140000-3, Material médico de consumo","Centro Hospitalar do Algarve, E. P. E. (510745997)","ALCON PORTUGAL (501251685), OPTIFAR, LDA. (501609377), Bausch & Lomb (980218764)","3.385,10 €",21-10-2014,07-10-2014,90 dias,"Portugal, Faro, Portimão<BR/>Portugal, Faro, Lagos<BR/>Portugal, Faro, Faro","Artigo 20.º, n.º 1, alínea a) do Código dos Contratos Públicos","","",,"",,Não aplicável.,Não aplicável.,FALSE
Central Monitorização ( 7731002014),Ajuste Direto Regime Geral,Aquisição de bens móveis,"33100000-1, Equipamento médico","Centro Hospitalar do Algarve, E. P. E. (510745997)",Philips Portuguesa (500216843),"41.000,00 €",21-10-2014,26-09-2014,30 dias,"Portugal, Faro, Faro","Artigo 20.º, n.º 1, alínea a) do Código dos Contratos Públicos","","",,"",,Não aplicável.,Não aplicável.,FALSE
Serviços médicos de Imagiologia,Ajuste Direto Regime Geral,Aquisição de serviços,"85150000-5, Serviços de imagiologia médica","Centro Hospitalar do Algarve, E. P. E. (510745997)","Radiflower-Unipessoal, Lda (508643287)","21.600,00 €",21-10-2014,08-10-2014,360 dias,"Portugal, Faro, Portimão<BR/>Portugal, Faro, Faro","Artigo 20.º, n.º 1, alínea a) do Código dos Contratos Públicos","","",,"",,Não aplicável.,Não aplicável.,FALSE
"Prestação serviços médicos Urgência Geral, Cuidados Intermédios, Sala de Reanimação, decisão clínica e SO/OBS, Urgência Básica de Albufeira, Loulé e VRSA",Ajuste Direto Regime Geral,Aquisição de serviços,"85121100-4, Serviços de médicos de clínica geral","Centro Hospitalar do Algarve, E. P. E. (510745997)","Mistério ao Sol, Lda (509890717)","32.400,00 €",21-10-2014,07-10-2014,122 dias,"Portugal, Faro, Lagos<BR/>Portugal, Faro, Faro<BR/>Portugal, Faro, Portimão","Artigo 20.º, n.º 1, alínea a) do Código dos Contratos Públicos",31-12-2014,"27.937,50 €",,"O valor inicial do Contrato teve por base as necessidades estimadas para o período de 1 Setembro de 2014 a 31 Dezembro de 2014, o valor final reflecte as necessidades efectivas.",,Não aplicável.,Não aplicável.,FALSE
Serviços médicos Urgência Pediátrica,Ajuste Direto Regime Geral,Aquisição de serviços,"85121290-2, Serviços de pediatria ou urologia","Centro Hospitalar do Algarve, E. P. E. (510745997)","Babalau & Krastin - Serviços Médicos, Lda (513210199)","40.800,00 €",21-10-2014,03-10-2014,122 dias,"Portugal, Faro, Faro<BR/>Portugal, Faro, Portimão<BR/>Portugal, Faro, Lagos","Artigo 20.º, n.º 1, alínea a) do Código dos Contratos Públicos",31-12-2014,"38.381,67 €",,"O valor inicial do Contrato teve por base as necessidades estimadas para o período de 1 Setembro de 2014 a 31 Dezembro de 2014, o valor final reflecte as necessidades efectivas.",,Não aplicável.,Não aplicável.,FALSE
72310714 - Aquisição Material Consumo Clinico,Ajuste Direto Regime Geral,Aquisição de bens móveis,"33140000-3, Material médico de consumo","Centro Hospitalar do Algarve, E. P. E. (510745997)","MEDTRONIC PORTUGAL, LDA. (504223933)","830,00 €",21-10-2014,01-10-2014,92 dias,"Portugal, Faro, Lagos<BR/>Portugal, Faro, Portimão<BR/>Portugal, Faro, Faro","Artigo 20.º, n.º 1, alínea a) do Código dos Contratos Públicos","","",,"",,Não aplicável.,Não aplicável.,FALSE
72310714 - Aquisição Material Consumo Clinico,Ajuste Direto Regime Geral,Aquisição de bens móveis,"33140000-3, Material médico de consumo","Centro Hospitalar do Algarve, E. P. E. (510745997)","COVIDIEN PORTUGAL - PRODUTOS  DE SAUDE, UNIPESSOAL, LDA. (503413410)","540,00 €",21-10-2014,01-10-2014,92 dias,"Portugal, Faro, Faro<BR/>Portugal, Faro, Lagos<BR/>Portugal, Faro, Portimão","Artigo 20.º, n.º 1, alínea a) do Código dos Contratos Públicos","","",,"",,Não aplicável.,Não aplicável.,FALSE
72310714 - Aquisição Material Consumo Clinico,Ajuste Direto Regime Geral,Aquisição de bens móveis,"33140000-3, Material médico de consumo","Centro Hospitalar do Algarve, E. P. E. (510745997)","Stallpharma - Produtos farmacêuticos, Ldª (503732311)","305,80 €",21-10-2014,01-10-2014,92 dias,"Portugal, Faro, Lagos<BR/>Portugal, Faro, Faro<BR/>Portugal, Faro, Portimão","Artigo 20.º, n.º 1, alínea a) do Código dos Contratos Públicos","","",,"",,Não aplicável.,Não aplicável.,FALSE
72310714 - Aquisição Material Consumo Clinico,Ajuste Direto Regime Geral,Aquisição de bens móveis,"33140000-3, Material médico de consumo","Centro Hospitalar do Algarve, E. P. E. (510745997)",PMH-PROD.MEDICO-HOSPITALARES (502376899),"60,00 €",21-10-2014,01-10-2014,92 dias,"Portugal, Faro, Portimão<BR/>Portugal, Faro, Faro<BR/>Portugal, Faro, Lagos","Artigo 20.º, n.º 1, alínea a) do Código dos Contratos Públicos","","",,"",,Não aplicável.,Não aplicável.,FALSE
72310714 - Aquisição Material Consumo Clinico,Ajuste Direto Regime Geral,Aquisição de bens móveis,"33140000-3, Material médico de consumo","Centro Hospitalar do Algarve, E. P. E. (510745997)",JOHNSON & JOHNSON PROD.PROF. (500153370),"1.049,94 €",21-10-2014,01-10-2014,92 dias,"Portugal, Faro, Portimão<BR/>Portugal, Faro, Faro<BR/>Portugal, Faro, Lagos","Artigo 20.º, n.º 1, alínea a) do Código dos Contratos Públicos","","",,"",,Não aplicável.,Não aplicável.,FALSE
72310714 - Aquisição Material Consumo Clinico,Ajuste Direto Regime Geral,Aquisição de bens móveis,"33140000-3, Material médico de consumo","Centro Hospitalar do Algarve, E. P. E. (510745997)","HR  HOSPITALAR, LDA (501895558)","111,00 €",21-10-2014,01-10-2014,92 dias,"Portugal, Faro, Portimão<BR/>Portugal, Faro, Faro<BR/>Portugal, Faro, Lagos","Artigo 20.º, n.º 1, alínea a) do Código dos Contratos Públicos","","",,"",,Não aplicável.,Não aplicável.,FALSE
72310714 - Aquisição Material Consumo Clinico,Ajuste Direto Regime Geral,Aquisição de bens móveis,"33140000-3, Material médico de consumo","Centro Hospitalar do Algarve, E. P. E. (510745997)",BSN Medical (505385058),"1.000,00 €",21-10-2014,01-10-2014,92 dias,"Portugal, Faro, Faro<BR/>Portugal, Faro, Lagos<BR/>Portugal, Faro, Portimão","Artigo 20.º, n.º 1, alínea a) do Código dos Contratos Públicos","","",,"",,Não aplicável.,Não aplicável.,FALSE
72/3095/14 - Material de Consumo Clinico,Ajuste Direto Regime Geral,Aquisição de bens móveis,"33140000-3, Material médico de consumo","Centro Hospitalar do Algarve, E. P. E. (510745997)","COVIDIEN PORTUGAL - PRODUTOS  DE SAUDE, UNIPESSOAL, LDA. (503413410)","59,48 €",20-10-2014,02-10-2014,91 dias,"Portugal, Faro, Faro<BR/>Portugal, Faro, Lagos<BR/>Portugal, Faro, Portimão","Artigo 20.º, n.º 1, alínea a) do Código dos Contratos Públicos","","",,"",,Não aplicável.,Não aplicável.,FALSE
72/3095/14 - Material de Consumo Clinico,Ajuste Direto Regime Geral,Aquisição de bens móveis,"33140000-3, Material médico de consumo","Centro Hospitalar do Algarve, E. P. E. (510745997)","BIOSONDA,LDA. (501463313)","360,00 €",20-10-2014,02-10-2014,91 dias,"Portugal, Faro, Portimão<BR/>Portugal, Faro, Faro<BR/>Portugal, Faro, Lagos","Artigo 20.º, n.º 1, alínea a) do Código dos Contratos Públicos","","",,"",,Não aplicável.,Não aplicável.,FALSE
72/3095/14 - Material de Consumo Clinico,Ajuste Direto Regime Geral,Aquisição de bens móveis,"33140000-3, Material médico de consumo","Centro Hospitalar do Algarve, E. P. E. (510745997)","SPECULUM-ARTIGOS MEDICOS,S.A (502996323)","756,50 €",20-10-2014,02-10-2014,91 dias,"Portugal, Faro, Lagos<BR/>Portugal, Faro, Portimão<BR/>Portugal, Faro, Faro","Artigo 20.º, n.º 1, alínea a) do Código dos Contratos Públicos","","",,"",,Não aplicável.,Não aplicável.,FALSE
72/3095/14 - Material de Consumo Clinico,Ajuste Direto Regime Geral,Aquisição de bens móveis,"33140000-3, Material médico de consumo","Centro Hospitalar do Algarve, E. P. E. (510745997)","SPCARE, Especialidades Farmacêuticas, Ldª (508284872)","954,00 €",20-10-2014,02-10-2014,91 dias,"Portugal, Faro, Lagos<BR/>Portugal, Faro, Faro<BR/>Portugal, Faro, Portimão","Artigo 20.º, n.º 1, alínea a) do Código dos Contratos Públicos","","",,"",,Não aplicável.,Não aplicável.,FALSE
72/3095/14 - Material de Consumo Clinico,Ajuste Direto Regime Geral,Aquisição de bens móveis,"33140000-3, Material médico de consumo","Centro Hospitalar do Algarve, E. P. E. (510745997)",PMH-PROD.MEDICO-HOSPITALARES (502376899),"126,00 €",20-10-2014,02-10-2014,91 dias,"Portugal, Faro, Portimão<BR/>Portugal, Faro, Lagos<BR/>Portugal, Faro, Faro","Artigo 20.º, n.º 1, alínea a) do Código dos Contratos Públicos","","",,"",,Não aplicável.,Não aplicável.,FALSE
72/3095/14 - Material de Consumo Clinico,Ajuste Direto Regime Geral,Aquisição de bens móveis,"33140000-3, Material médico de consumo","Centro Hospitalar do Algarve, E. P. E. (510745997)","COLOPLAST PORTUGAL, SOCIEDADE UNIPESSOAL LDA. (503989037)","180,00 €",20-10-2014,02-10-2014,91 dias,"Portugal, Faro, Faro<BR/>Portugal, Faro, Lagos<BR/>Portugal, Faro, Portimão","Artigo 20.º, n.º 1, alínea a) do Código dos Contratos Públicos","","",,"",,Não aplicável.,Não aplicável.,FALSE
72/3095/14 - Material de Consumo Clinico,Ajuste Direto Regime Geral,Aquisição de bens móveis,"33140000-3, Material médico de consumo","Centro Hospitalar do Algarve, E. P. E. (510745997)","NORMAX,LDA. (500203130)","712,50 €",20-10-2014,02-10-2014,91 dias,"Portugal, Faro, Portimão<BR/>Portugal, Faro, Lagos<BR/>Portugal, Faro, Faro","Artigo 20.º, n.º 1, alínea a) do Código dos Contratos Públicos","","",,"",,Não aplicável.,Não aplicável.,FALSE
72/3095/14 - Material de Consumo Clinico,Ajuste Direto Regime Geral,Aquisição de bens móveis,"33140000-3, Material médico de consumo","Centro Hospitalar do Algarve, E. P. E. (510745997)","GRIFOLS PORTUGAL, LDA. (502041285)","94,00 €",20-10-2014,02-10-2014,91 dias,"Portugal, Faro, Lagos<BR/>Portugal, Faro, Faro<BR/>Portugal, Faro, Portimão","Artigo 20.º, n.º 1, alínea a) do Código dos Contratos Públicos","","",,"",,Não aplicável.,Não aplicável.,FALSE
72/3095/14 - Material de Consumo Clinico,Ajuste Direto Regime Geral,Aquisição de bens móveis,"33140000-3, Material médico de consumo","Centro Hospitalar do Algarve, E. P. E. (510745997)","B. BRAUN MEDICAL,LDA. (501506543)","3.011,95 €",20-10-2014,02-10-2014,91 dias,"Portugal, Faro, Faro<BR/>Portugal, Faro, Lagos<BR/>Portugal, Faro, Portimão","Artigo 20.º, n.º 1, alínea a) do Código dos Contratos Públicos","","",,"",,Não aplicável.,Não aplicável.,FALSE
72/3095/14 - Material de Consumo Clinico,Ajuste Direto Regime Geral,Aquisição de bens móveis,"33140000-3, Material médico de consumo","Centro Hospitalar do Algarve, E. P. E. (510745997)","INTERSURGICAL PORTUGAL,LDA. (503480045)","5,90 €",20-10-2014,02-10-2014,91 dias,"Portugal, Faro, Portimão<BR/>Portugal, Faro, Faro<BR/>Portugal, Faro, Lagos","Artigo 20.º, n.º 1, alínea a) do Código dos Contratos Públicos","","",,"",,Não aplicável.,Não aplicável.,FALSE
72/3095/14 - Material de Consumo Clinico,Ajuste Direto Regime Geral,Aquisição de bens móveis,"33140000-3, Material médico de consumo","Centro Hospitalar do Algarve, E. P. E. (510745997)","HR  HOSPITALAR, LDA (501895558)","200,00 €",20-10-2014,02-10-2014,91 dias,"Portugal, Faro, Lagos<BR/>Portugal, Faro, Portimão<BR/>Portugal, Faro, Faro","Artigo 20.º, n.º 1, alínea a) do Código dos Contratos Públicos","","",,"",,Não aplicável.,Não aplicável.,FALSE
72/3095/14 - Material de Consumo Clinico,Ajuste Direto Regime Geral,Aquisição de bens móveis,"33140000-3, Material médico de consumo","Centro Hospitalar do Algarve, E. P. E. (510745997)","MEDICINALIA - CORMEDICA,LDA. (500684324)","6.935,00 €",20-10-2014,02-10-2014,91 dias,"Portugal, Faro, Portimão<BR/>Portugal, Faro, Faro<BR/>Portugal, Faro, Lagos","Artigo 20.º, n.º 1, alínea a) do Código dos Contratos Públicos","","",,"",,Não aplicável.,Não aplicável.,FALSE
72/3095/14 - Material de Consumo Clinico,Ajuste Direto Regime Geral,Aquisição de bens móveis,"33140000-3, Material médico de consumo","Centro Hospitalar do Algarve, E. P. E. (510745997)",Bausch & Lomb (980218764),"1.800,00 €",20-10-2014,02-10-2014,91 dias,"Portugal, Faro, Lagos<BR/>Portugal, Faro, Faro<BR/>Portugal, Faro, Portimão","Artigo 20.º, n.º 1, alínea a) do Código dos Contratos Públicos","","",,"",,Não aplicável.,Não aplicável.,FALSE
72/3095/14 - Material de Consumo Clinico,Ajuste Direto Regime Geral,Aquisição de bens móveis,"33140000-3, Material médico de consumo","Centro Hospitalar do Algarve, E. P. E. (510745997)",AVIQUIMICA IMPORT E MANUFATURA (500039720),"948,00 €",20-10-2014,02-10-2014,91 dias,"Portugal, Faro, Lagos<BR/>Portugal, Faro, Faro<BR/>Portugal, Faro, Portimão","Artigo 20.º, n.º 1, alínea a) do Código dos Contratos Públicos","","",,"",,Não aplicável.,Não aplicável.,FALSE
72/3095/14 - Material de Consumo Clinico,Ajuste Direto Regime Geral,Aquisição de bens móveis,"33140000-3, Material médico de consumo","Centro Hospitalar do Algarve, E. P. E. (510745997)",TELEFLEX MEDICAL (980249783),"85,60 €",20-10-2014,02-10-2014,91 dias,"Portugal, Faro, Faro<BR/>Portugal, Faro, Lagos<BR/>Portugal, Faro, Portimão","Artigo 20.º, n.º 1, alínea a) do Código dos Contratos Públicos","","",,"",,Não aplicável.,Não aplicável.,FALSE
72/3095/14 - Material de Consumo Clinico,Ajuste Direto Regime Geral,Aquisição de bens móveis,"33140000-3, Material médico de consumo","Centro Hospitalar do Algarve, E. P. E. (510745997)",ALCON PORTUGAL (501251685),"500,00 €",20-10-2014,02-10-2014,91 dias,"Portugal, Faro, Lagos<BR/>Portugal, Faro, Faro<BR/>Portugal, Faro, Portimão","Artigo 20.º, n.º 1, alínea a) do Código dos Contratos Públicos","","",,"",,Não aplicável.,Não aplicável.,FALSE
72/3095/14 - Material de Consumo Clinico,Ajuste Direto Regime Geral,Aquisição de bens móveis,"33140000-3, Material médico de consumo","Centro Hospitalar do Algarve, E. P. E. (510745997)","AMBEX - EQUIPAMENTOS, LDA (507593111)","260,00 €",20-10-2014,02-10-2014,91 dias,"Portugal, Faro, Faro<BR/>Portugal, Faro, Portimão<BR/>Portugal, Faro, Lagos","Artigo 20.º, n.º 1, alínea a) do Código dos Contratos Públicos","","",,"",,Não aplicável.,Não aplicável.,FALSE
Opticas Bloco ORL (77318814),Ajuste Direto Regime Geral,Aquisição de bens móveis,"33100000-1, Equipamento médico","Centro Hospitalar do Algarve, E. P. E. (510745997)",Teprel Lda  (502262184),"6.280,00 €",16-10-2014,06-10-2014,30 dias,"Portugal, Faro, Portimão","Artigo 20.º, n.º 1, alínea a) do Código dos Contratos Públicos","","",,"",,Não aplicável.,Não aplicável.,FALSE
Prestação de Serviços de Realização de Exames PET TAC,Ajuste Direto Regime Geral,Aquisição de serviços,"85100000-0, Serviços de saúde","Centro Hospitalar do Algarve, E. P. E. (510745997)",Fernando Sancho Unipessoal Lda (500602522),"27.675,00 €",16-10-2014,13-10-2014,79 dias,"Portugal, Faro, Faro","Artigo 20.º, n.º 1, alínea a) do Código dos Contratos Públicos","","",,"",,Não aplicável.,Não aplicável.,FALSE
aquisição  Material Consumo Clinico,Ajuste Direto Regime Geral,Aquisição de bens móveis,"33140000-3, Material médico de consumo","Centro Hospitalar do Algarve, E. P. E. (510745997)","JOHNSON & JOHNSON PROD.PROF. (500153370), PAUL HARTMANN, LDA. (502271728), BOSTON SCIENTIFIC PORTUGAL-DISPOSITIVOS MÉDICOS, LDA. (504988964), A.MENDES DA SILVA LDA (502064080), EZEQUIEL PANAO JORGE,LDA (501412727), DIMOR LUSITANA, LDA (500730741), TEPREL-EQUIPAMENTOS MEDICOS, LDA. (502262184), CATETER-PROD.MEDICOS HOSP.LDA. (502914319), ANASTACIO SALDANHA UNIPESSOAL (505804441), Marcos de Azevedo Dias (108701476), AIR LIQUIDE MEDICINAL,S.A. (501576436), PROCTER & GAMBLE PORTUGALl - PRODUTOS de CCONSUMO, HIGIENE e SAÚDE (503037753), PMH-PROD.MEDICO-HOSPITALARES (502376899), 3M Portugal, Lda. (500193940), PARAMEDICA,LDA. (501393005), OASIPOR-IMPORTAÇÃO E EXPORTAÇÃO, S.A. (502260750), AVIQUIMICA IMPORT E MANUFATURA (500039720), B. BRAUN MEDICAL,LDA. (501506543), INTERSURGICAL PORTUGAL,LDA. (503480045), VYGON (PORTUGAL),LDA. (503232785), MAGNAMED-COMERC.PROD.MEDICOS (503640476), MUNDINTER,S.A. (500199906), BASTOS VIEGAS,SA (500042772), MEDICINALIA - CORMEDICA,LDA. (500684324), SMITHS MEDICAL(PORTUGAL),LDA. (507445937), OLYMPUS IBERIA, s.a.u. (980474710), COVIDIEN PORTUGAL - PRODUTOS  DE SAUDE, UNIPESSOAL, LDA. (503413410), IBERDATA-EQUIPAMENTOS, SA (501904921)","57.588,18 €",16-10-2014,20-06-2014,90 dias,"Portugal, Faro, Lagos<BR/>Portugal, Faro, Portimão<BR/>Portugal, Faro, Faro","Artigo 20.º, n.º 1, alínea a) do Código dos Contratos Públicos","","",,"",,Não aplicável.,Não aplicável.,FALSE
Aquisição de Material Consumo clínico,Ajuste Direto Regime Geral,Aquisição de bens móveis,"33140000-3, Material médico de consumo","Centro Hospitalar do Algarve, E. P. E. (510745997)","GARAL GABINETE TECNICO COM. LD (500777314), NORMAX,LDA. (500203130), Stallpharma - Produtos farmacêuticos, Ldª (503732311)","381,21 €",15-10-2014,12-09-2014,90 dias,"Portugal, Faro, Portimão<BR/>Portugal, Faro, Lagos<BR/>Portugal, Faro, Faro","Artigo 20.º, n.º 1, alínea a) do Código dos Contratos Públicos","","",,"",,Não aplicável.,Não aplicável.,FALSE
Material consumo Clínico,Ajuste Direto Regime Geral,Aquisição de bens móveis,"33140000-3, Material médico de consumo","Centro Hospitalar do Algarve, E. P. E. (510745997)","PMH-PROD.MEDICO-HOSPITALARES (502376899), CareFusion Portugal 332  (503898554), MEDINFAR - SEROLÓGICO PRODUTOS E EQUIPAMENTOS, S.A. (501197052), SMITHS MEDICAL(PORTUGAL),LDA. (507445937), COVIDIEN PORTUGAL - PRODUTOS  DE SAUDE, UNIPESSOAL, LDA. (503413410), BIOSONDA,LDA. (501463313), ALCON PORTUGAL (501251685), COLOPLAST PORTUGAL, SOCIEDADE UNIPESSOAL LDA. (503989037), Instrumedicir- Equipamentos Médico-Cirúrgicos, Lda (507754468), HR  HOSPITALAR, LDA (501895558), INTERSURGICAL PORTUGAL,LDA. (503480045), FRESENIUS MEDICAL CARE, S.A.. (503070220), B. BRAUN MEDICAL,LDA. (501506543), OLYMPUS IBERIA, s.a.u. (980474710), MUNDINTER,S.A. (500199906)","47.710,53 €",15-10-2014,10-09-2014,90 dias,"Portugal, Faro, Faro<BR/>Portugal, Faro, Lagos<BR/>Portugal, Faro, Portimão","Artigo 20.º, n.º 1, alínea a) do Código dos Contratos Públicos","","",,"",,Não aplicável.,Não aplicável.,FALSE
Ajudas de Custo-Certificação Legal de Contas a 30/06/2013-Unid.Hosp.Faro - Proc.68/2838/14,Ajuste Direto Regime Geral,Aquisição de serviços,"79212300-6, Serviços de revisão legal de contas","Centro Hospitalar do Algarve, E. P. E. (510745997)","Grant Thornton & Associados-SROC,Lda (502286784)","1.085,14 €",15-10-2014,04-08-2014,8 dias,"Portugal, Faro, Faro","Artigo 24.º, n.º 1, alínea e) do Código dos Contratos Públicos","","",,"",,Não aplicável.,Não aplicável.,FALSE
Reparação de Equipamento Medico-Cirurgico - Proc. 67/2815/14,Ajuste Direto Regime Geral,Aquisição de serviços,"50420000-5, Serviços de reparação e manutenção de equipamento médico e cirúrgico","Centro Hospitalar do Algarve, E. P. E. (510745997)","Philips Portuguesa,SA (500216843)","3.677,33 €",15-10-2014,08-08-2014,15 dias,"Portugal, Faro, Portimão","Artigo 24.º, n.º 1, alínea e) do Código dos Contratos Públicos","","",,"",,Não aplicável.,Não aplicável.,FALSE
"Torre de Laparoscopia Full HD,Bombas Infusoras, Seringas Infusoras,Suportes Rodados e Instrumental Cirurgico-Proc. 77/2798/14",Ajuste Direto Regime Geral,Aquisição de bens móveis,"33162000-3, Aparelhos e instrumentos para blocos operatórios","Centro Hospitalar do Algarve, E. P. E. (510745997)","B.Braun Medical, Lda (501506543)","52.965,62 €",15-10-2014,23-09-2014,60 dias,"Portugal, Faro, Faro","Artigo 20.º, n.º 1, alínea a) do Código dos Contratos Públicos","","",,"",,Não aplicável.,Não aplicável.,FALSE
72322314 - Consumo Clínico,Ajuste Direto Regime Geral,Aquisição de bens móveis,"33140000-3, Material médico de consumo","Centro Hospitalar do Algarve, E. P. E. (510745997)","AVIQUIMICA IMPORT E MANUFATURA (500039720), BASTOS VIEGAS,SA (500042772), ELNOR SA (500094403), MEDICINALIA - CORMEDICA,LDA. (500684324), FRILABO II, LDA (507958861), COVIDIEN PORTUGAL - PRODUTOS  DE SAUDE, UNIPESSOAL, LDA. (503413410)","2.587,58 €",15-10-2014,10-10-2014,90 dias,"Portugal, Faro, Lagos<BR/>Portugal, Faro, Faro<BR/>Portugal, Faro, Portimão","Artigo 20.º, n.º 1, alínea a) do Código dos Contratos Públicos","","",,"",,Não aplicável.,Não aplicável.,FALSE
Aluguer de Equipamentos  ( 78244914),Ajuste Direto Regime Geral,Aquisição de serviços,"98300000-6, Serviços diversos","Centro Hospitalar do Algarve, E. P. E. (510745997)",Linde Saúde (500125546),"18.478,80 €",14-10-2014,19-09-2014,120 dias,"Portugal, Faro, Faro<BR/>Portugal, Faro, Portimão","Artigo 20.º, n.º 1, alínea a) do Código dos Contratos Públicos","","",,"",,Não aplicável.,Não aplicável.,FALSE
Unidade de Endoscopia ( 67307914),Ajuste Direto Regime Geral,Aquisição de bens móveis,"33100000-1, Equipamento médico","Centro Hospitalar do Algarve, E. P. E. (510745997)",Olympus Iberia (980474710),"60.000,00 €",14-10-2014,19-09-2014,30 dias,"Portugal, Faro, Faro","Artigo 24.º, n.º 1, alínea e) do Código dos Contratos Públicos","","",,"",,Não aplicável.,Não aplicável.,FALSE
Unidade de Endoscopia ( 67307814),Ajuste Direto Regime Geral,Aquisição de bens móveis,"33100000-1, Equipamento médico","Centro Hospitalar do Algarve, E. P. E. (510745997)",Fujifilm (980456517),"52.000,00 €",14-10-2014,12-09-2014,30 dias,"Portugal, Faro, Faro","Artigo 24.º, n.º 1, alínea e) do Código dos Contratos Públicos","","",,"",,Não aplicável.,Não aplicável.,FALSE
Maquinas Lavar Endoscopios ( 77308014),Ajuste Direto Regime Geral,Aquisição de bens móveis,"33100000-1, Equipamento médico","Centro Hospitalar do Algarve, E. P. E. (510745997)",Olympus Iberia (980474710),"18.000,00 €",14-10-2014,19-09-2014,30 dias,"Portugal, Faro, Faro","Artigo 20.º, n.º 1, alínea a) do Código dos Contratos Públicos","","",,"",,Não aplicável.,Não aplicável.,FALSE
Equip Tratamento Água  ( 77314014),Ajuste Direto Regime Geral,Aquisição de bens móveis,"33100000-1, Equipamento médico","Centro Hospitalar do Algarve, E. P. E. (510745997)",Watercare (508804779),"8.250,00 €",14-10-2014,26-09-2014,10 dias,"Portugal, Faro, Portimão","Artigo 20.º, n.º 1, alínea a) do Código dos Contratos Públicos","","",,"",,Não aplicável.,Não aplicável.,FALSE
Processo n.º 31/3150/2014- Ceftriaxona 500 mg,Ajuste Direto Regime Geral,Aquisição de bens móveis,"33690000-3, Medicamentos vários","Centro Hospitalar do Algarve, E. P. E. (510745997)",Labesfal (501169580),"208,00 €",14-10-2014,02-10-2014,90 dias,"Portugal, Faro, Faro","Artigo 26.º, n.º 1, alínea e) do Código dos Contratos Públicos",02-10-2014,"208,00 €",,"",,Não aplicável.,Não aplicável.,FALSE
Processo n.º 31/3153/2014- Interferão beta,Ajuste Direto Regime Geral,Aquisição de bens móveis,"33690000-3, Medicamentos vários","Centro Hospitalar do Algarve, E. P. E. (510745997)",Biogen (506415740),"135.450,00 €",14-10-2014,02-10-2014,90 dias,"Portugal, Faro, Faro","Artigo 26.º, n.º 1, alínea e) do Código dos Contratos Públicos",02-10-2014,"135.450,00 €",,"",,Não aplicável.,Não aplicável.,FALSE
Processo n.º 31/3122/2014- Etanercept,Ao abrigo de acordo-quadro (art.º 258.º),Locação de bens móveis,"33690000-3, Medicamentos vários","Centro Hospitalar do Algarve, E. P. E. (510745997)",Pfizer (500162166),"131.425,50 €",14-10-2014,02-10-2014,30 dias,"Portugal, Faro, Faro","Artigo 26.º, n.º 1, alínea e) do Código dos Contratos Públicos",02-10-2014,"131.425,50 €",,"",,1119467,"CONCURSO PÚBLICO PARA A CELEBRAÇÃO DE CONTRATOS PÚBLICOS DE APROVISIONAMENTO PARA A ÁREA DA SAÚDE, COM VISTA AO FORNECIMENTO DE MEDICAMENTOS DO FORO ONCOLÓGICO, ÀS INSTITUIÇÕES E SERVIÇOS DO SERVIÇO NACIONAL DE SAÚDE",FALSE
Processo n.º 71/2630/2014- Reagentes para Tiras INR,Ajuste Direto Regime Geral,Aquisição de bens móveis,"33696000-5, Reagentes e meios de contraste","Centro Hospitalar do Algarve, E. P. E. (510745997)",Roche (504282921),"4.389,60 €",14-10-2014,08-08-2014,120 dias,"Portugal, Faro, Faro","Artigo 20.º, n.º 1, alínea a) do Código dos Contratos Públicos",08-08-2014,"4.389,60 €",,"",,Não aplicável.,Não aplicável.,FALSE
Aquisição de Material clínico,Ajuste Direto Regime Geral,Aquisição de bens móveis,"33140000-3, Material médico de consumo","Centro Hospitalar do Algarve, E. P. E. (510745997)","ALBINO DIAS ANDRADE LDA (500013810), MEDTRONIC PORTUGAL, LDA. (504223933), BSN Medical (505385058), 3M Portugal, Lda. (500193940), MICRO-MEDICA, LDA. (501904956), ANASTACIO SALDANHA UNIPESSOAL (505804441), Docworld – Dispositivos Médicos (508592909), BASTOS VIEGAS,SA (500042772)","5.536,43 €",13-10-2014,17-09-2014,90 dias,"Portugal, Faro, Lagos<BR/>Portugal, Faro, Portimão<BR/>Portugal, Faro, Faro","Artigo 20.º, n.º 1, alínea a) do Código dos Contratos Públicos","","",,"",,Não aplicável.,Não aplicável.,FALSE
aquisição de Material consumo clínico,Ajuste Direto Regime Geral,Aquisição de bens móveis,"33140000-3, Material médico de consumo","Centro Hospitalar do Algarve, E. P. E. (510745997)","EZEQUIEL PANAO JORGE,LDA (501412727), JMV-PRODUTOS HOSPITALARES (501887148), SMITH & NEPHEW, LDª (503552461), BSN Medical (505385058), 3M Portugal, Lda. (500193940), OVERPHARMA,LDA. (505792362), Docworld – Dispositivos Médicos (508592909), B. BRAUN MEDICAL,LDA. (501506543), ALBINO DIAS ANDRADE LDA (500013810)","8.773,03 €",13-10-2014,02-10-2014,90 dias,"Portugal, Faro, Faro<BR/>Portugal, Faro, Portimão<BR/>Portugal, Faro, Lagos","Artigo 20.º, n.º 1, alínea a) do Código dos Contratos Públicos","","",,"",,Não aplicável.,Não aplicável.,FALSE
Proteses Anca Biarticuladas não Cimentadas,Ajuste Direto Regime Geral,Aquisição de bens móveis,"33184100-4, Implantes cirúrgicos","Centro Hospitalar do Algarve, E. P. E. (510745997)",Ortoimplante (502654414),"8.000,00 €",13-10-2014,21-08-2014,150 dias,"Portugal, Faro, Faro<BR/>Portugal, Faro, Lagos<BR/>Portugal, Faro, Portimão","Artigo 20.º, n.º 1, alínea a) do Código dos Contratos Públicos","","",,"",,Não aplicável.,Não aplicável.,FALSE
Ajuste Direto n.º 2.736/2014 - Prestação de Serviços de Manutenção das Instalações,Ajuste Direto Regime Geral,Aquisição de serviços,"50000000-5, Serviços de reparação e manutenção","Centro Hospitalar do Algarve, E. P. E. (510745997)",Acciona Facility Services SA (503431397),"137.985,64 €",13-10-2014,01-09-2014,122 dias,"Portugal, Faro, Lagos<BR/>Portugal, Faro, Portimão<BR/>Portugal, Faro, Faro","Artigo 24.º, n.º 1, alínea b) do Código dos Contratos Públicos","","",,"",,Não aplicável.,Não aplicável.,FALSE
Processo n.º 41/1060/2014-Aquisição de soluções para diálise peritoneal,Ao abrigo de acordo-quadro (art.º 259.º),Aquisição de bens móveis,"33690000-3, Medicamentos vários","Centro Hospitalar do Algarve, E. P. E. (510745997)","Fresenius (503070220), Baxter (503347345)","494.119,20 €",13-10-2014,05-06-2014,240 dias,"Portugal, Faro, Faro",Artigo 259.º do Código dos Contratos Públicos,05-06-2014,"494.119,20 €",,"",,601978,"CONCURSO PÚBLICO PARA A CELEBRAÇÃO DE CONTRATOS PÚBLICOS DE APROVISIONAMENTO PARA A ÁREA DA SAÚDE, COM VISTA AO FORNECIMENTO DE BENS DE DÁLISE PERITONEAL ÀS INSTITUIÇÕES E SERVIÇOS DO SERVIÇO NACIONAL DE SAÚDE",FALSE
Prestação de Serviços de Fornecimento de Gás Natural,Concurso público,Aquisição de serviços,"76000000-3, Serviços relacionados com as indústrias do gás e do petróleo","Centro Hospitalar do Algarve, E. P. E. (510745997)","Goldenergy - Comercializadores de Energia, SA (507857542)","115.554,40 €",13-10-2014,18-08-2014,30 dias,"Portugal, Faro, Portimão<BR/>Portugal, Faro, Faro","Artigo 155.º, alínea b) do Código dos Contratos Públicos","","",,"",,Não aplicável.,Não aplicável.,FALSE
Processo n.º41/2382/2014-Atropina,Ao abrigo de acordo-quadro (art.º 259.º),Aquisição de bens móveis,"33690000-3, Medicamentos vários","Centro Hospitalar do Algarve, E. P. E. (510745997)",B.Braun (501506543),"12.330,00 €",13-10-2014,25-08-2014,180 dias,"Portugal, Faro, Faro",Artigo 259.º do Código dos Contratos Públicos,25-08-2014,"12.330,00 €",,"",,613285,"CONCURSO PÚBLICO PARA A CELEBRAÇÃO DE CONTRATOS PÚBLICOS DE APROVISIONAMENTO PARA A ÁREA DA SAÚDE, COM VISTA AO FORNECIMENTO DE MEDICAMENTOS ANALGÉSICOS, ANTIPIRÉTICOS E ANTIDEPRESSORES, ÀS INSTITUIÇÕES E SERVIÇOS DO SERVIÇO NACIONAL DE SAÚDE",FALSE
Processo n.º61/15502014-Reagentes para Microbiologia,Ajuste Direto Regime Geral,Aquisição de bens móveis,"33696000-5, Reagentes e meios de contraste","Centro Hospitalar do Algarve, E. P. E. (510745997)",Quilaban (500399670),"12.113,50 €",13-10-2014,29-09-2014,90 dias,"Portugal, Faro, Faro","Artigo 24.º, n.º 1, alínea e) do Código dos Contratos Públicos",29-09-2014,"12.113,50 €",,"",,Não aplicável.,Não aplicável.,FALSE
Processo n.º31/31212014-Medicamento Darunavir,Ajuste Direto Regime Geral,Aquisição de bens móveis,"33690000-3, Medicamentos vários","Centro Hospitalar do Algarve, E. P. E. (510745997)",Janssen cilag (500189412),"56.302,29 €",13-10-2014,02-10-2014,30 dias,"Portugal, Faro, Faro","Artigo 26.º, n.º 1, alínea e) do Código dos Contratos Públicos",02-10-2014,"56.302,29 €",,"",,Não aplicável.,Não aplicável.,FALSE
Processo n.º61/29852014-Medicamento Lenalidomida,Ajuste Direto Regime Geral,Aquisição de bens móveis,"33690000-3, Medicamentos vários","Centro Hospitalar do Algarve, E. P. E. (510745997)",Celgene (507791690),"27.085,70 €",13-10-2014,12-09-2014,120 dias,"Portugal, Faro, Faro","Artigo 24.º, n.º 1, alínea e) do Código dos Contratos Públicos",12-09-2014,"27.085,70 €",,"",,Não aplicável.,Não aplicável.,FALSE
Processo n.º71/3138/2014-Reagentes para coagulação,Ajuste Direto Regime Geral,Aquisição de bens móveis,"33696000-5, Reagentes e meios de contraste","Centro Hospitalar do Algarve, E. P. E. (510745997)",Izasa (501086110),"5.218,00 €",13-10-2014,02-10-2014,30 dias,"Portugal, Faro, Faro","Artigo 20.º, n.º 1, alínea a) do Código dos Contratos Públicos",02-10-2014,"5.218,00 €",,"",,Não aplicável.,Não aplicável.,FALSE
Prestação de Serviços de Realização de Exames Imagiológicos,Concurso público,Aquisição de serviços,"85100000-0, Serviços de saúde","Centro Hospitalar do Algarve, E. P. E. (510745997)","Fernando Sancho Unipessoal, LDA (500602522)","83.060,00 €",13-10-2014,01-09-2014,122 dias,"Portugal, Faro, Lagos<BR/>Portugal, Faro, Portimão<BR/>Portugal, Faro, Faro","Artigo 155.º, alínea b) do Código dos Contratos Públicos","","",,"",,Não aplicável.,Não aplicável.,FALSE
Processo n. 61/2096/2014-Reagentes para Microbiologia,Ajuste Direto Regime Geral,Aquisição de bens móveis,"33696000-5, Reagentes e meios de contraste","Centro Hospitalar do Algarve, E. P. E. (510745997)",Biomerieux (501524177),"23.712,93 €",13-10-2014,30-07-2014,90 dias,"Portugal, Faro, Faro","Artigo 24.º, n.º 1, alínea e) do Código dos Contratos Públicos",30-07-2014,"23.712,93 €",,"",,Não aplicável.,Não aplicável.,FALSE
Prestação de Serviços de Higiene e Limpeza,Concurso público,Aquisição de serviços,"90910000-9, Serviços de limpeza","Centro Hospitalar do Algarve, E. P. E. (510745997)","CLECE, S.A. - Sucursal em Portugal (980359759)","191.656,00 €",13-10-2014,01-05-2014,245 dias,"Portugal, Faro, Portimão<BR/>Portugal, Faro, Lagos<BR/>Portugal, Faro, Faro","Artigo 20.º, n.º 1, alínea b) do Código dos Contratos Públicos","","",,"",,Não aplicável.,Não aplicável.,FALSE
CP n.º 14/2014 - Prestação de Serviços de Vigilância e Segurança,Concurso público,Aquisição de serviços,"79710000-4, Serviços de segurança","Centro Hospitalar do Algarve, E. P. E. (510745997)","VIGIEXPERT - Prevenção e Vigilância Privada, Lda (506807266)","254.985,00 €",13-10-2014,01-09-2014,122 dias,"Portugal, Faro, Faro<BR/>Portugal, Faro, Lagos<BR/>Portugal, Faro, Portimão","Artigo 20.º, n.º 1, alínea b) do Código dos Contratos Públicos","","",,"",,Não aplicável.,Não aplicável.,FALSE
