freguesia,acronym,validVotesPercentage,votes,dicofre
União das freguesias de Semide e Rio Vide,PS,49.6,753,060906
União das freguesias de Semide e Rio Vide,PPD/PSD,26.61,404,060906
União das freguesias de Semide e Rio Vide,B.E.,10.08,153,060906
União das freguesias de Semide e Rio Vide,PCP-PEV,3.95,60,060906
União das freguesias de Semide e Rio Vide,CDS-PP,2.96,45,060906
União das freguesias de Semide e Rio Vide,PAN,2.44,37,060906
União das freguesias de Semide e Rio Vide,L,0.86,13,060906
União das freguesias de Semide e Rio Vide,A,0.53,8,060906
União das freguesias de Semide e Rio Vide,CH,0.53,8,060906
União das freguesias de Semide e Rio Vide,PNR,0.53,8,060906
União das freguesias de Semide e Rio Vide,R.I.R.,0.53,8,060906
União das freguesias de Semide e Rio Vide,IL,0.33,5,060906
União das freguesias de Semide e Rio Vide,PDR,0.26,4,060906
União das freguesias de Semide e Rio Vide,PURP,0.26,4,060906
União das freguesias de Semide e Rio Vide,PCTP/MRPP,0.2,3,060906
União das freguesias de Semide e Rio Vide,MPT,0.13,2,060906
União das freguesias de Semide e Rio Vide,MAS,0.07,1,060906
União das freguesias de Semide e Rio Vide,NC,0.07,1,060906
União das freguesias de Semide e Rio Vide,PPM,0.07,1,060906
União das freguesias de Semide e Rio Vide,JPP,0,0,060906
