freguesia,acronym,validVotesPercentage,votes,dicofre
São Miguel de Poiares,PS,45.44,249,061704
São Miguel de Poiares,PPD/PSD,29.56,162,061704
São Miguel de Poiares,B.E.,8.58,47,061704
São Miguel de Poiares,CDS-PP,4.01,22,061704
São Miguel de Poiares,PCP-PEV,3.28,18,061704
São Miguel de Poiares,PAN,2.37,13,061704
São Miguel de Poiares,R.I.R.,1.82,10,061704
São Miguel de Poiares,PCTP/MRPP,1.09,6,061704
São Miguel de Poiares,CH,0.91,5,061704
São Miguel de Poiares,A,0.55,3,061704
São Miguel de Poiares,PDR,0.55,3,061704
São Miguel de Poiares,PURP,0.55,3,061704
São Miguel de Poiares,IL,0.36,2,061704
São Miguel de Poiares,L,0.36,2,061704
São Miguel de Poiares,MPT,0.18,1,061704
São Miguel de Poiares,NC,0.18,1,061704
São Miguel de Poiares,PPM,0.18,1,061704
São Miguel de Poiares,JPP,0,0,061704
São Miguel de Poiares,MAS,0,0,061704
São Miguel de Poiares,PNR,0,0,061704
