Objeto do Contrato,Tipo de Procedimento,Tipo(s) de Contrato,CPVs,Entidade(s) Adjudicante(s),Entidade(s) Adjudicatária(s),Preço Contratual,Data de Publicação,Data de Celebração do Contrato,Prazo de Execução,Local de Execução,Fundamentação,Data de Fecho do Contrato,Preço Total Efetivo,Causas das Alterações ao Prazo,Causas das Alterações ao Preço,Estado,N.º registo do Acordo Quadro,Descrição do Acordo Quadro,Procedimento Centralizado
"0-2.0053/18 -Diverso Material para o Serviço de Anatomia Patológica, Lotes desertos no AD42002118",Consulta Prévia,Aquisição de bens móveis,"33140000-3, Material médico de consumo","Centro Hospitalar de Lisboa Central, E. P. E. (508080142)",zmway (508085349),"136,60 €",10-04-2018,10-04-2018,265 dias,"Portugal, Lisboa, Lisboa","Artigo 20.º, n.º 1, alínea c) do Código dos Contratos Públicos",,,,,,Não aplicável.,Não aplicável.,FALSE
"1-2.0021/18 - Algálias, Dispositivos Urinários e Sacos de Urina para o ano de 2018",Concurso público,Aquisição de bens móveis,"33140000-3, Material médico de consumo","Centro Hospitalar de Lisboa Central, E. P. E. (508080142)","OVERPHARMA-PROD.MEDICOS FARMACEUTICOS (505792362), AVIQUIMICA IMPORT E MANUFATURA (500039720), PMH PRODUTOS MEDIC. HOSPITAL, SA (502376899), C. R. BARD PORTUGAL PROD E ARTIGOS MEDICOS, LDA (502438274), HOSPITEX MATERIAL HOSPITALAR, LDA (501909842), H.R. - HOSPITALAR, LDA (501895558), COLOPLAST PORTUGAL SOC. UNIP., LDA (EX PORGES) (503989037), Ezequiel Panão Jorge Lda. (501412727), DOCWORLD (508592909), B.BRAUN MEDICAL, LDA (501506543)","136.707,85 €",10-04-2018,07-03-2018,299 dias,"Portugal, Lisboa, Lisboa","Artigo 20.º, n.º 1, alínea b) do Código dos Contratos Públicos",,,,,,Não aplicável.,Não aplicável.,FALSE
Manípulo para campo operatório para 2018,Ajuste Direto Regime Geral,Aquisição de bens móveis,"33140000-3, Material médico de consumo","Centro Hospitalar de Lisboa Central, E. P. E. (508080142)","JMV PRODUTOS HOSPITALARES, LDA (501887148)","5.820,00 €",06-04-2018,06-04-2018,269 dias,"Portugal, Lisboa, Lisboa","Artigo 20.º, n.º 1, alínea a) do Código dos Contratos Públicos",,,,,,Não aplicável.,Não aplicável.,FALSE
0-2.0018/18 - Pulseiras de identificação de doente,Consulta Prévia,Aquisição de bens móveis,"33140000-3, Material médico de consumo","Centro Hospitalar de Lisboa Central, E. P. E. (508080142)","GRIFOLS PORTUGAL - PROD. FARMACÊUTICOS E HOSP., LDA. (502041285)","37.680,00 €",06-04-2018,29-03-2018,277 dias,"Portugal, Lisboa, Lisboa","Artigo 20.º, n.º 1, alínea c) do Código dos Contratos Públicos",,,,,,Não aplicável.,Não aplicável.,FALSE
0-2.0018/18 - Pulseiras de identificação de doente,Consulta Prévia,Aquisição de bens móveis,"33140000-3, Material médico de consumo","Centro Hospitalar de Lisboa Central, E. P. E. (508080142)",Ezequiel Panão Jorge Lda. (501412727),"105,00 €",06-04-2018,29-03-2018,277 dias,"Portugal, Lisboa, Lisboa","Artigo 20.º, n.º 1, alínea c) do Código dos Contratos Públicos",,,,,,Não aplicável.,Não aplicável.,FALSE
0-2.0018/18 - Pulseiras de identificação de doente,Consulta Prévia,Aquisição de bens móveis,"33140000-3, Material médico de consumo","Centro Hospitalar de Lisboa Central, E. P. E. (508080142)",AVIQUIMICA (500039720),"262,45 €",06-04-2018,29-03-2018,277 dias,"Portugal, Lisboa, Lisboa","Artigo 20.º, n.º 1, alínea c) do Código dos Contratos Públicos",,,,,,Não aplicável.,Não aplicável.,FALSE
Termocautérios para 2018,Ajuste Direto Regime Geral,Aquisição de bens móveis,"33100000-1, Equipamento médico","Centro Hospitalar de Lisboa Central, E.P.E. (CHLC) (508080142)",Oftaldata (504887459),"31.752,00 €",06-04-2018,29-03-2018,277 dias,"Portugal, Lisboa, Lisboa","Artigo 20.º, n.º 1, alínea a) do Código dos Contratos Públicos",,,,,,Não aplicável.,Não aplicável.,FALSE
"Prestação de serviços de fornecimento de alimentação a doentes e pessoal do CHLC, EPE - Pólos HDE e MAC, para o mês de fevereiro renovável mensalmente até ao limite de 31 de maio de 2018",Ajuste Direto Regime Geral,Aquisição de serviços,"55500000-5, Serviços de cantinas e de fornecimento de refeições (catering)","Centro Hospitalar de Lisboa Central, E. P. E. (508080142)","ITAU - Instituto Técnico de Alimentação Humana, S.A. (500142858)","341.175,52 €",06-04-2018,01-02-2018,120 dias,"Portugal, Lisboa, Lisboa","Artigo 27.º, n.º 1, alínea a) do Código dos Contratos Públicos",,,,,,Não aplicável.,Não aplicável.,FALSE
Aquisição de biopsia hepática para 2018,Ajuste Direto Regime Geral,Aquisição de bens móveis,"33140000-3, Material médico de consumo","Centro Hospitalar de Lisboa Central, E.P.E. (CHLC) (508080142)","B BRAUN MEDICAL, LDA. (501506543)","2.205,00 €",06-04-2018,06-04-2018,269 dias,"Portugal, Lisboa, Lisboa","Artigo 20.º, n.º 1, alínea a) do Código dos Contratos Públicos",,,,,,Não aplicável.,Não aplicável.,FALSE
"PRESTAÇÃO DE SERVIÇOS DE FORNECIMENTO DE ALIMENTAÇÃO A DOENTES E PESSOAL DO CHLC, EPE - PÓLO HSM, PARA O PERÍODO DE FEVEREIRO A DEZEMBRO DE 2018",Ajuste Direto Regime Geral,Aquisição de serviços,"55500000-5, Serviços de cantinas e de fornecimento de refeições (catering)","Centro Hospitalar de Lisboa Central, E. P. E. (508080142)",UNISELF SA (501323325),"792.297,88 €",05-04-2018,01-02-2018,334 dias,"Portugal, Lisboa, Lisboa","Artigo 27.º, n.º 1, alínea a) do Código dos Contratos Públicos",,,,,,Não aplicável.,Não aplicável.,FALSE
TROMBOELASTOGRAMA (CONJ. REAGENTES),Concurso público,Aquisição de bens móveis,"33696500-0, Reagentes de laboratório","Centro Hospitalar de Lisboa Central, E.P.E. (CHLC) (508080142)",BIOMETA (A33553645),"112.440,00 €",05-04-2018,26-02-2018,365 dias,"Portugal, Lisboa, Lisboa","Artigo 20.º, n.º 1, alínea b) do Código dos Contratos Públicos",,,,,,Não aplicável.,Não aplicável.,FALSE
Próteses Biliares e Pancreáticas,Concurso público,Aquisição de bens móveis,"33140000-3, Material médico de consumo","Centro Hospitalar de Lisboa Central, E. P. E. (508080142)","BIOSONDA-COMERCIO MATERIAL HOSPITALAR,LD (501463313), Endotecnica - Material Cirurgico, Lda (503818348)","59.693,00 €",04-04-2018,27-02-2018,365 dias,"Portugal, Lisboa, Lisboa","Artigo 20.º, n.º 1, alínea b) do Código dos Contratos Públicos",,,,,,Não aplicável.,Não aplicável.,FALSE
1-2.0042/18 - Diverso Material de Esterilização,Concurso público,Locação de bens móveis,"33140000-3, Material médico de consumo","Centro Hospitalar de Lisboa Central, E. P. E. (508080142)","JOHNSON & JOHNSON, LDA (500153370), HTMD - High Technology Medical Devices, Lda. (507654919), PROMEICENTRO-COMP.VENDA MONT.ASSIST.TEC.EQUIP.HOSP (506470113), Dimor Lusitana (500730741), Bastos Viegas, S.A. (500042772), A. Mendes da Silva, Lda (502064080), EUROCASMEDICA - PROD. HOSPITALARES, S.A. (503322105), AVIQUIMICA (500039720), HELDER GONCALVES-ASSISTENCIA TECNICA EQUIP., LDA (503855421)","129.092,48 €",03-04-2018,02-02-2018,330 dias,"Portugal, Lisboa, Lisboa","Artigo 20.º, n.º 1, alínea b) do Código dos Contratos Públicos",,,,,,Não aplicável.,Não aplicável.,FALSE
"Aquisição de Nebulizador Ultra-Sónico - Medicina Fisica e Reabilitação - Hospital de Santa marta - Centro Hospitalar de Lisboa Central, EPE",Ajuste Direto Regime Geral,Aquisição de bens móveis,"33100000-1, Equipamento médico","Centro Hospitalar de Lisboa Central, E. P. E. (508080142)",Artifofo  (506226352),"960,00 €",03-04-2018,03-04-2018,10 dias,"Portugal, Lisboa, Lisboa","Artigo 20.º, n.º 1, alínea a) do Código dos Contratos Públicos",,,,,,Não aplicável.,Não aplicável.,FALSE
0-2.0014/18 - Material Acist,Consulta Prévia,Aquisição de bens móveis,"33140000-3, Material médico de consumo","Centro Hospitalar de Lisboa Central, E. P. E. (508080142)",Med X-Ray - Sistemas Médicos Lda (506187071),"52.340,00 €",03-04-2018,23-02-2018,311 dias,"Portugal, Lisboa, Lisboa","Artigo 20.º, n.º 1, alínea c) do Código dos Contratos Públicos",,,,,,Não aplicável.,Não aplicável.,FALSE
4-2.0047/18 - Extirpador venoso para 2018,Ajuste Direto Regime Geral,Aquisição de bens móveis,"33140000-3, Material médico de consumo","Centro Hospitalar de Lisboa Central, E.P.E. (CHLC) (508080142)",B Braun Medical Lda (501506543),"5.830,00 €",03-04-2018,02-04-2018,273 dias,"Portugal, Lisboa, Lisboa","Artigo 20.º, n.º 1, alínea a) do Código dos Contratos Públicos",,,,,,Não aplicável.,Não aplicável.,FALSE
1-2.0001/18 - Consumíveis que se adaptem aos equipamentos de marca ultracision existentes nos Blocos Operatórios para 2018,Concurso público,Aquisição de bens móveis,"33140000-3, Material médico de consumo","Centro Hospitalar de Lisboa Central, E. P. E. (508080142)","Johnson & Johnson, Lda (500153370)","343.892,00 €",03-04-2018,21-02-2018,313 dias,"Portugal, Lisboa, Lisboa","Artigo 20.º, n.º 1, alínea b) do Código dos Contratos Públicos",,,,,,Não aplicável.,Não aplicável.,FALSE
1-2.0034/18 - Microespira para Angiografia,Concurso público,Aquisição de bens móveis,"33140000-3, Material médico de consumo","Centro Hospitalar de Lisboa Central, E. P. E. (508080142)","World Médica S.L. (ESB82612599), Johnson & Johnson, Lda (500153370)","248.200,00 €",03-04-2018,20-02-2018,314 dias,"Portugal, Lisboa, Lisboa","Artigo 20.º, n.º 1, alínea b) do Código dos Contratos Públicos",,,,,,Não aplicável.,Não aplicável.,FALSE
MONTELUCASTE,Ao abrigo de acordo-quadro (art.º 259.º),Aquisição de bens móveis,"33000000-0, Equipamento médico, medicamentos e produtos para cuidados pessoais","Centro Hospitalar de Lisboa Central, E. P. E. (508080142)","GENERIS-FARMACEUTICA,SA (508107997)","349,89 €",03-04-2018,26-02-2018,365 dias,"Portugal, Lisboa, Lisboa",Artigo 259.º do Código dos Contratos Públicos,,,,,,1638654,CP 2015/12 - Acordo quadro para fornecimento de Medicamentos do Aparelho Respiratório às Instituições e Serviços do Serviço Nacional de Saúde,FALSE
1-2.0040/18 - Aquisição de Campos Cirúrgicos para 2018,Concurso público,Aquisição de bens móveis,"33140000-3, Material médico de consumo","Centro Hospitalar de Lisboa Central, E. P. E. (508080142)","Paul Hartmann, Lda (502271728), bastos viegas (500042772), BARNA IMPORT MEDICA PORTUGAL-UNIPESSOAL, LDA (513468994), VYGON (PORTUGAL), LDA (503232785), Molnlycke (511101066), MEDLINE INTERNATIONAL UNIPESSOAL, LDA (510533515), DOCWORLD (508592909)","88.088,57 €",03-04-2018,13-03-2018,296 dias,"Portugal, Lisboa, Lisboa","Artigo 20.º, n.º 1, alínea b) do Código dos Contratos Públicos",,,,,,Não aplicável.,Não aplicável.,FALSE
PERMETRINA,Ajuste Direto Regime Geral,Aquisição de bens móveis,"33000000-0, Equipamento médico, medicamentos e produtos para cuidados pessoais","Centro Hospitalar de Lisboa Central, E. P. E. (508080142)",Omega Pharma (506112233),"2.622,00 €",03-04-2018,26-03-2018,365 dias,"Portugal, Lisboa, Lisboa","Artigo 24.º, n.º 1, alínea e) do Código dos Contratos Públicos",,,,,,Não aplicável.,Não aplicável.,FALSE
4-2.0158/18 - Kit's e Máscaras de Anestesia,Ajuste Direto Regime Geral,Aquisição de bens móveis,"33140000-3, Material médico de consumo","Centro Hospitalar de Lisboa Central, E. P. E. (508080142)","VYGON (PORTUGAL), LDA (503232785)","2.937,00 €",02-04-2018,29-03-2018,277 dias,"Portugal, Lisboa, Lisboa","Artigo 20.º, n.º 1, alínea a) do Código dos Contratos Públicos",,,,,,Não aplicável.,Não aplicável.,FALSE
4-2.0158/18 - Kit's e Máscaras de Anestesia,Ajuste Direto Regime Geral,Aquisição de bens móveis,"33140000-3, Material médico de consumo","Centro Hospitalar de Lisboa Central, E. P. E. (508080142)",Intersurgical (503480045),"9.413,28 €",02-04-2018,29-03-2018,277 dias,"Portugal, Lisboa, Lisboa","Artigo 20.º, n.º 1, alínea a) do Código dos Contratos Públicos",,,,,,Não aplicável.,Não aplicável.,FALSE
4-2.0158/18 - Kit's e Máscaras de Anestesia,Ajuste Direto Regime Geral,Aquisição de bens móveis,"33140000-3, Material médico de consumo","Centro Hospitalar de Lisboa Central, E. P. E. (508080142)","TELEFLEX MEDICAL, SAU (EX-ARROW IBÉRICA,  SA) (980249783)","876,00 €",02-04-2018,29-03-2018,277 dias,"Portugal, Lisboa, Lisboa","Artigo 20.º, n.º 1, alínea a) do Código dos Contratos Públicos",,,,,,Não aplicável.,Não aplicável.,FALSE
4-2.0158/18 - Kit's e Máscaras de Anestesia,Ajuste Direto Regime Geral,Aquisição de bens móveis,"33140000-3, Material médico de consumo","Centro Hospitalar de Lisboa Central, E. P. E. (508080142)","H.R. - HOSPITALAR, LDA (501895558)","93,30 €",02-04-2018,29-03-2018,277 dias,"Portugal, Lisboa, Lisboa","Artigo 20.º, n.º 1, alínea a) do Código dos Contratos Públicos",,,,,,Não aplicável.,Não aplicável.,FALSE
"0-2.0015/18 - Cânulas, cateteres de cardeoplogia e outros",Consulta Prévia,Aquisição de bens móveis,"33140000-3, Material médico de consumo","Centro Hospitalar de Lisboa Central, E. P. E. (508080142)",LUSOPALEX-SOC.DIT.PROD. HOSPITALARES UNIPESSOAL (503531588),"1.700,00 €",02-04-2018,14-03-2018,292 dias,"Portugal, Lisboa, Lisboa","Artigo 20.º, n.º 1, alínea c) do Código dos Contratos Públicos",,,,,,Não aplicável.,Não aplicável.,FALSE
"0-2.0015/18 - Cânulas, cateteres de cardeoplogia e outros",Consulta Prévia,Aquisição de bens móveis,"33140000-3, Material médico de consumo","Centro Hospitalar de Lisboa Central, E. P. E. (508080142)",Medtronic Portugal; Lda (504223933),"1.755,00 €",02-04-2018,14-03-2018,292 dias,"Portugal, Lisboa, Lisboa","Artigo 20.º, n.º 1, alínea c) do Código dos Contratos Públicos",,,,,,Não aplicável.,Não aplicável.,FALSE
"0-2.0052/18 - Protetor auricular e pulseiras roxas, lotes desertos e não adjudicados no ajuste direto n.º 4-2.0058/18",Consulta Prévia,Aquisição de bens móveis,"33140000-3, Material médico de consumo","Centro Hospitalar de Lisboa Central, E. P. E. (508080142)",AVIQUIMICA (500039720),"20,00 €",02-04-2018,21-03-2018,285 dias,"Portugal, Lisboa, Lisboa","Artigo 20.º, n.º 1, alínea c) do Código dos Contratos Públicos",,,,,,Não aplicável.,Não aplicável.,FALSE
"0-2.0045/18 - Sondas, lotes desertos no ajuste direto n.º 4-2.0071/18",Consulta Prévia,Aquisição de bens móveis,"33140000-3, Material médico de consumo","Centro Hospitalar de Lisboa Central, E. P. E. (508080142)",DOCWORLD (508592909),"742,20 €",02-04-2018,21-03-2018,286 dias,"Portugal, Lisboa, Lisboa","Artigo 20.º, n.º 1, alínea c) do Código dos Contratos Públicos",,,,,,Não aplicável.,Não aplicável.,FALSE
