freguesia,acronym,validVotesPercentage,votes,dicofre
"Alpendorada, Várzea e Torrão",PPD/PSD.CDS-PP,50.39,980,130732
"Alpendorada, Várzea e Torrão",PS,28.64,557,130732
"Alpendorada, Várzea e Torrão",MPT,9.25,180,130732
"Alpendorada, Várzea e Torrão",PCP-PEV,3.75,73,130732
"Alpendorada, Várzea e Torrão",B.E.,1.9,37,130732
"Alpendorada, Várzea e Torrão",PCTP/MRPP,1.29,25,130732
"Alpendorada, Várzea e Torrão",L,1.08,21,130732
"Alpendorada, Várzea e Torrão",PAN,0.82,16,130732
"Alpendorada, Várzea e Torrão",PND,0.57,11,130732
"Alpendorada, Várzea e Torrão",PPM,0.51,10,130732
"Alpendorada, Várzea e Torrão",PTP,0.51,10,130732
"Alpendorada, Várzea e Torrão",MAS,0.41,8,130732
"Alpendorada, Várzea e Torrão",PPV,0.26,5,130732
"Alpendorada, Várzea e Torrão",PDA,0.21,4,130732
"Alpendorada, Várzea e Torrão",PNR,0.21,4,130732
"Alpendorada, Várzea e Torrão",POUS,0.21,4,130732
