freguesia,acronym,validVotesPercentage,votes,dicofre
Vilar de Ossos,PPD/PSD,45.87,50,041232
Vilar de Ossos,PS,34.86,38,041232
Vilar de Ossos,B.E.,5.5,6,041232
Vilar de Ossos,CDS-PP,3.67,4,041232
Vilar de Ossos,R.I.R.,2.75,3,041232
Vilar de Ossos,PCP-PEV,1.83,2,041232
Vilar de Ossos,PCTP/MRPP,1.83,2,041232
Vilar de Ossos,A,0.92,1,041232
Vilar de Ossos,IL,0.92,1,041232
Vilar de Ossos,NC,0.92,1,041232
Vilar de Ossos,PURP,0.92,1,041232
Vilar de Ossos,CH,0,0,041232
Vilar de Ossos,L,0,0,041232
Vilar de Ossos,PAN,0,0,041232
Vilar de Ossos,PDR,0,0,041232
Vilar de Ossos,PNR,0,0,041232
Vilar de Ossos,PPM,0,0,041232
Vilar de Ossos,PTP,0,0,041232
