freguesia,acronym,validVotesPercentage,votes,dicofre
Castelões,PS,41.75,220,131107
Castelões,PPD/PSD.CDS-PP,37.19,196,131107
Castelões,MPT,6.45,34,131107
Castelões,PCP-PEV,5.5,29,131107
Castelões,B.E.,2.85,15,131107
Castelões,L,1.33,7,131107
Castelões,PND,1.33,7,131107
Castelões,PAN,0.95,5,131107
Castelões,PCTP/MRPP,0.57,3,131107
Castelões,PNR,0.57,3,131107
Castelões,PPM,0.57,3,131107
Castelões,PPV,0.38,2,131107
Castelões,PTP,0.38,2,131107
Castelões,MAS,0.19,1,131107
Castelões,PDA,0,0,131107
Castelões,POUS,0,0,131107
