Objeto do Contrato,Tipo de Procedimento,Tipo(s) de Contrato,CPVs,Entidade(s) Adjudicante(s),Entidade(s) Adjudicatária(s),Preço Contratual,Data de Publicação,Data de Celebração do Contrato,Prazo de Execução,Local de Execução,Fundamentação,Data de Fecho do Contrato,Preço Total Efetivo,Causas das Alterações ao Prazo,Causas das Alterações ao Preço,Estado,N.º registo do Acordo Quadro,Descrição do Acordo Quadro,Procedimento Centralizado
"Material Administrativo, Modelos",Ajuste Direto Regime Geral,Aquisição de bens móveis,"30194700-2, Modelos gráficos",Centro de Medicina de Reabilitação da Região Centro - Rovisco Pais (503767336),Jose Augusto Pessoa Baptista (509797741),"1.284,00 €",10-04-2012,07-03-2012,30 dias,"Portugal, Coimbra, Cantanhede","Artigo 26.º, n.º 1, alínea a) do Código dos Contratos Públicos",,,,,,Não aplicável.,Não aplicável.,
"Serviços prestados p/ ACSS á Instituição, Janeiro a Junho/2012",Ajuste Direto Regime Geral,Aquisição de serviços,"72500000-0, Serviços relacionados com a informática",Centro de Medicina de Reabilitação da Região Centro - Rovisco Pais (503767336),"ACSS-Administração Central do Sistema de Saude, IP (508188423)","2.700,00 €",10-04-2012,24-01-2012,180 dias,"Portugal, Coimbra, Cantanhede","Artigo 27.º, n.º 1, alínea a) do Código dos Contratos Públicos",,,,,,Não aplicável.,Não aplicável.,
Aquissição de fraldas para 2012,Ajuste Direto Regime Geral,Aquisição de bens móveis,"33751000-9, Fraldas descartáveis",Centro de Medicina de Reabilitação da Região Centro - Rovisco Pais (503767336),"Indas Portugal, Lda (503505196)","15.701,57 €",05-04-2012,24-01-2012,365 dias,"Portugal, Coimbra, Cantanhede","Artigo 26.º, n.º 1, alínea a) do Código dos Contratos Públicos",,,,,,Não aplicável.,Não aplicável.,
Aquisição de resguardops para 2012,Ajuste Direto Regime Geral,Aquisição de bens móveis,"33772000-2, Artigos de papel descartáveis",Centro de Medicina de Reabilitação da Região Centro - Rovisco Pais (503767336),"Indas Portuigal, Lda (503505196)","7.950,00 €",05-04-2012,24-01-2012,365 dias,"Portugal, Coimbra, Cantanhede","Artigo 26.º, n.º 1, alínea a) do Código dos Contratos Públicos",,,,,,Não aplicável.,Não aplicável.,
