Objeto do Contrato,Tipo de Procedimento,Tipo(s) de Contrato,CPVs,Entidade(s) Adjudicante(s),Entidade(s) Adjudicatária(s),Preço Contratual,Data de Publicação,Data de Celebração do Contrato,Prazo de Execução,Local de Execução,Fundamentação,Data de Fecho do Contrato,Preço Total Efetivo,Causas das Alterações ao Prazo,Causas das Alterações ao Preço,Estado,N.º registo do Acordo Quadro,Descrição do Acordo Quadro,Procedimento Centralizado
"Prestação de serviços medicos, Abril/12",Ajuste Direto Regime Geral,Aquisição de serviços,"85121100-4, Serviços de médicos de clínica geral",Centro de Medicina de Reabilitação da Região Centro - Rovisco Pais (503767336),"Tratacura, Ldª. (509000428)","1.200,00 €",18-06-2012,17-05-2012,30 dias,"Portugal, Coimbra, Cantanhede","Artigo 27.º, n.º 1, alínea a) do Código dos Contratos Públicos",,,,,,Não aplicável.,Não aplicável.,
"Prestação de serviços medicos, Maio/12",Ajuste Direto Regime Geral,Aquisição de serviços,"85121100-4, Serviços de médicos de clínica geral",Centro de Medicina de Reabilitação da Região Centro - Rovisco Pais (503767336),"Tratacura, Ldª. (509000428)","1.200,00 €",18-06-2012,11-06-2012,31 dias,"Portugal, Coimbra, Coimbra","Artigo 27.º, n.º 1, alínea a) do Código dos Contratos Públicos",,,,,,Não aplicável.,Não aplicável.,
Fornecimento de protese endosqueletica,Ajuste Direto Regime Geral,Aquisição de bens móveis,"33183200-8, Próteses ortopédicas",Centro de Medicina de Reabilitação da Região Centro - Rovisco Pais (503767336),Centro de Reabilitação Profissional de Gaia (504791834),"1.999,40 €",18-06-2012,25-01-2012,365 dias,"Portugal, Coimbra, Cantanhede","Artigo 26.º, n.º 1, alínea a) do Código dos Contratos Públicos",,,,,,Não aplicável.,Não aplicável.,
"Prestação de serviços medicos de eletromiografia/fisiatria, Maio/2012",Ajuste Direto Regime Geral,Aquisição de serviços,"85121200-5, Serviços de medicina especializada",Centro de Medicina de Reabilitação da Região Centro - Rovisco Pais (503767336),"Medibest-Medicina e Bem Estar, Ldª. (508373786)","4.740,00 €",18-06-2012,11-06-2012,31 dias,"Portugal, Coimbra, Cantanhede","Artigo 27.º, n.º 1, alínea a) do Código dos Contratos Públicos",,,,,,Não aplicável.,Não aplicável.,
Prestação de serviços medicos/Maio/2012,Ajuste Direto Regime Geral,Aquisição de serviços,"85121100-4, Serviços de médicos de clínica geral",Centro de Medicina de Reabilitação da Região Centro - Rovisco Pais (503767336),"Requicha & Ferreira-Medicos, Ldª. (503613746)","1.200,00 €",12-06-2012,29-05-2012,31 dias,"Portugal, Coimbra, Cantanhede","Artigo 27.º, n.º 1, alínea a) do Código dos Contratos Públicos",,,,,,Não aplicável.,Não aplicável.,
Aquisição de toxina Botulinica A,Ajuste Direto Regime Geral,Aquisição de bens móveis,"33600000-6, Produtos farmacêuticos",Centro de Medicina de Reabilitação da Região Centro - Rovisco Pais (503767336),"Profarin - Distribuidora de Produtos Farmaceuticos Industriais, Lda (500223238)","2.881,80 €",12-06-2012,01-06-2012,30 dias,"Portugal, Coimbra, Cantanhede","Artigo 26.º, n.º 1, alínea a) do Código dos Contratos Públicos",,,,,,Não aplicável.,Não aplicável.,
Aquisição de Toxina A 500U,Ajuste Direto Regime Geral,Aquisição de bens móveis,"33600000-6, Produtos farmacêuticos",Centro de Medicina de Reabilitação da Região Centro - Rovisco Pais (503767336),Ipsen Portugal - Produtos Farmacêuticos S.A. (502609800),"5.904,60 €",12-06-2012,01-06-2012,30 dias,"Portugal, Coimbra, Cantanhede","Artigo 26.º, n.º 1, alínea a) do Código dos Contratos Públicos",,,,,,Não aplicável.,Não aplicável.,
