Objeto do Contrato,Tipo de Procedimento,Tipo(s) de Contrato,CPVs,Entidade(s) Adjudicante(s),Entidade(s) Adjudicatária(s),Preço Contratual,Data de Publicação,Data de Celebração do Contrato,Prazo de Execução,Local de Execução,Fundamentação,Data de Fecho do Contrato,Preço Total Efetivo,Causas das Alterações ao Prazo,Causas das Alterações ao Preço,Estado,N.º registo do Acordo Quadro,Descrição do Acordo Quadro,Procedimento Centralizado
Aquisição Monitores Sinais Vitais,Ajuste Direto Regime Geral,Aquisição de bens móveis,"33120000-7, Sistemas de registo e dispositivos de exploração","Unidade Local de Saúde do Alto Minho, EPE (ULSAM) (508786193)","Sano-Tecnica, Lda. (500239819)","880,00 €",10-02-2014,07-02-2014,30 dias,"Portugal, Viana do Castelo, Viana do Castelo","Artigo 20.º, n.º 1, alínea a) do Código dos Contratos Públicos",,,,,,Não aplicável.,Não aplicável.,FALSE
Aquisição de MCC - Sacos para colheita de sangue,Ajuste Direto Regime Geral,Aquisição de bens móveis,"33140000-3, Material médico de consumo","Unidade Local de Saúde do Alto Minho, EPE (ULSAM) (508786193)",Izasa Portugal - Distribuições Técnicas Lda. (501086110),"96.174,00 €",06-02-2014,23-01-2014,365 dias,Portugal,"Artigo 24.º, n.º 1, alínea e) do Código dos Contratos Públicos",,,,,,Não aplicável.,Não aplicável.,FALSE
Aquisição Monitores Modulares e respetiva Central,Ajuste Direto Regime Geral,Aquisição de bens móveis,"33120000-7, Sistemas de registo e dispositivos de exploração","Unidade Local de Saúde do Alto Minho, EPE (ULSAM) (508786193)","Clinifar - Produtos Clínicos e Farmacêuticos, S. A. (503281115)","65.085,08 €",31-01-2014,17-01-2014,30 dias,"Portugal, Viana do Castelo, Viana do Castelo","Artigo 20.º, n.º 1, alínea a) do Código dos Contratos Públicos",,,,,,Não aplicável.,Não aplicável.,FALSE
