Objeto do Contrato,Tipo de Procedimento,Tipo(s) de Contrato,CPVs,Entidade(s) Adjudicante(s),Entidade(s) Adjudicatária(s),Preço Contratual,Data de Publicação,Data de Celebração do Contrato,Prazo de Execução,Local de Execução,Fundamentação,Data de Fecho do Contrato,Preço Total Efetivo,Causas das Alterações ao Prazo,Causas das Alterações ao Preço,Estado,N.º registo do Acordo Quadro,Descrição do Acordo Quadro,Procedimento Centralizado
"AQUISIÇÃO DE PRESTAÇÃO DE SERVIÇOS DE LAVAGEM, TRATAMENTO E FORNECIMENTO DE ROUPA HOSPITALAR EM REGIME ALUGUER",Concurso público,Aquisição de serviços,"98131000-0, Serviços prestados por organizações religiosas","Hospital Distrital de Santarém, E. P. E. (506361462)",SUCH | Serviço de Utilização Comum dos Hospitais (500900469),"371.330,00 €",04-05-2016,20-01-2016,365 dias,"Portugal, Santarém, Santarém","Artigo 20.º, n.º 1, alínea b) do Código dos Contratos Públicos",,,,,,Não aplicável.,Não aplicável.,FALSE
"PRESTAÇÃO SERVIÇOS ALIMENTAÇÃO, ANO 2016",Concurso público,Aquisição de serviços,"55000000-0, Serviços de hotelaria, restauração e comércio a retalho","Hospital Distrital de Santarém, E. P. E. (506361462)",Gertal – Companhia Geral de Restaurantes e Alimentação SA (500126623),"848.193,00 €",04-05-2016,29-12-2015,365 dias,"Portugal, Santarém, Santarém","Artigo 20.º, n.º 1, alínea b) do Código dos Contratos Públicos",,,,,,Não aplicável.,Não aplicável.,FALSE
PRESTAÇÃO SERVIÇOS PROTECÇÃO RADIOLOGIA E DO SIMETRIA INDIVIDUAL,Ajuste Direto Regime Geral,Aquisição de serviços,"98113000-8, Serviços prestados por organizações especializadas","Hospital Distrital de Santarém, EPE (506361462)","Medicalconsult, S.A. (504092138)","8.349,50 €",04-05-2016,01-01-2016,365 dias,"Portugal, Santarém, Santarém","Artigo 20.º, n.º 1, alínea a) do Código dos Contratos Públicos",,,,,,Não aplicável.,Não aplicável.,FALSE
PRESTAÇÃO SERVIÇOS FORNECIMENTO E LIMPEZA TAPETES ANO 2016,Ajuste Direto Regime Geral,Aquisição de serviços,"98300000-6, Serviços diversos","Hospital Distrital de Santarém, EPE (506361462)","SPAST - Soc. Portuguesa de Aluguer e Serviço de Têxteis, S.A. (502095857)","2.965,80 €",04-05-2016,01-01-2016,365 dias,"Portugal, Santarém, Santarém","Artigo 20.º, n.º 1, alínea a) do Código dos Contratos Públicos",,,,,,Não aplicável.,Não aplicável.,FALSE
"EMPREITADA DE MELHORIA UNIDADE DE GASTRENTEROLOGIA DO HDS, EPE",Concurso público,Empreitadas de obras públicas,"45215000-7, Obras de construção de edifícios relacionados com serviços de saúde ou sociais, crematórios e instalações sanitárias públicas","Hospital Distrital de Santarém, E. P. E. (506361462)","SECAL - ENGENHARIA E CONSTRUÇÕES, S.A. (501982248)","14.212,37 €",04-05-2016,27-04-2016,30 dias,"Portugal, Santarém, Santarém","Artigo 19.º, alínea b) do Código dos Contratos Públicos",,,,,,Não aplicável.,Não aplicável.,FALSE
CONCURSO PUBLICO 170004/2016 - EMPREITADA POR SERIE PREÇOS ANO 2016,Concurso público,Empreitadas de obras públicas,"45215000-7, Obras de construção de edifícios relacionados com serviços de saúde ou sociais, crematórios e instalações sanitárias públicas","Hospital Distrital de Santarém, E. P. E. (506361462)",SECAL - ENGENHARIA E CONSTRUÇOES S.A (501982248),"84.560,71 €",04-05-2016,27-04-2016,270 dias,"Portugal, Santarém, Santarém","Artigo 19.º, alínea b) do Código dos Contratos Públicos",,,,,,Não aplicável.,Não aplicável.,FALSE
AQUISIÇÃO SOFTWARE DE GESTÃO DE ASSISTENCIA/MANUTENÇÃO EQUIPAMENTOS - MACEWB,Ajuste Direto Regime Geral,Aquisição de bens móveis,"48100000-9, Pacote de software para sectores específicos","Hospital Distrital de Santarém, EPE (506361462)","Glintt - Healthcare Solutions, S.A. (502479418)","9.250,00 €",02-05-2016,21-04-2016,66 dias,"Portugal, Santarém, Santarém","Artigo 20.º, n.º 1, alínea a) do Código dos Contratos Públicos",,,,,,Não aplicável.,Não aplicável.,FALSE
