freguesia,acronym,validVotesPercentage,votes,dicofre
"União das freguesias de Mangualde, Mesquitela e Cunha Alta",PS,42.3,1044,180619
"União das freguesias de Mangualde, Mesquitela e Cunha Alta",PPD/PSD.CDS-PP,31.12,768,180619
"União das freguesias de Mangualde, Mesquitela e Cunha Alta",MPT,8.43,208,180619
"União das freguesias de Mangualde, Mesquitela e Cunha Alta",PCP-PEV,7.13,176,180619
"União das freguesias de Mangualde, Mesquitela e Cunha Alta",B.E.,3.61,89,180619
"União das freguesias de Mangualde, Mesquitela e Cunha Alta",L,2.03,50,180619
"União das freguesias de Mangualde, Mesquitela e Cunha Alta",PAN,1.66,41,180619
"União das freguesias de Mangualde, Mesquitela e Cunha Alta",PCTP/MRPP,1.09,27,180619
"União das freguesias de Mangualde, Mesquitela e Cunha Alta",PTP,0.69,17,180619
"União das freguesias de Mangualde, Mesquitela e Cunha Alta",PPM,0.49,12,180619
"União das freguesias de Mangualde, Mesquitela e Cunha Alta",MAS,0.41,10,180619
"União das freguesias de Mangualde, Mesquitela e Cunha Alta",PND,0.36,9,180619
"União das freguesias de Mangualde, Mesquitela e Cunha Alta",PNR,0.28,7,180619
"União das freguesias de Mangualde, Mesquitela e Cunha Alta",PDA,0.2,5,180619
"União das freguesias de Mangualde, Mesquitela e Cunha Alta",PPV,0.16,4,180619
"União das freguesias de Mangualde, Mesquitela e Cunha Alta",POUS,0.04,1,180619
