freguesia,acronym,validVotesPercentage,votes,dicofre
Adorigo,PS,42.86,48,181901
Adorigo,PPD/PSD,33.04,37,181901
Adorigo,CDS-PP,10.71,12,181901
Adorigo,B.E.,8.93,10,181901
Adorigo,PCP-PEV,1.79,2,181901
Adorigo,R.I.R.,1.79,2,181901
Adorigo,PAN,0.89,1,181901
Adorigo,A,0,0,181901
Adorigo,CH,0,0,181901
Adorigo,IL,0,0,181901
Adorigo,JPP,0,0,181901
Adorigo,L,0,0,181901
Adorigo,MPT,0,0,181901
Adorigo,NC,0,0,181901
Adorigo,PCTP/MRPP,0,0,181901
Adorigo,PDR,0,0,181901
Adorigo,PNR,0,0,181901
Adorigo,PPM,0,0,181901
Adorigo,PTP,0,0,181901
Adorigo,PURP,0,0,181901
