freguesia,acronym,validVotesPercentage,votes,dicofre
Atei,PS,45.69,233,170501
Atei,PPD/PSD,32.35,165,170501
Atei,CDS-PP,8.82,45,170501
Atei,B.E.,3.53,18,170501
Atei,PCP-PEV,2.35,12,170501
Atei,PAN,1.96,10,170501
Atei,R.I.R.,1.37,7,170501
Atei,NC,0.98,5,170501
Atei,L,0.78,4,170501
Atei,A,0.39,2,170501
Atei,CH,0.39,2,170501
Atei,PCTP/MRPP,0.39,2,170501
Atei,PDR,0.39,2,170501
Atei,PPM,0.39,2,170501
Atei,PNR,0.2,1,170501
Atei,IL,0,0,170501
