freguesia,acronym,validVotesPercentage,votes,dicofre
Mondim da Beira,PPD/PSD,35.33,65,182004
Mondim da Beira,PS,29.35,54,182004
Mondim da Beira,PCP-PEV,10.87,20,182004
Mondim da Beira,B.E.,8.7,16,182004
Mondim da Beira,CDS-PP,8.15,15,182004
Mondim da Beira,PAN,2.72,5,182004
Mondim da Beira,PCTP/MRPP,1.63,3,182004
Mondim da Beira,A,1.09,2,182004
Mondim da Beira,PPM.PPV/CDC,1.09,2,182004
Mondim da Beira,PDR,0.54,1,182004
Mondim da Beira,PTP,0.54,1,182004
Mondim da Beira,IL,0,0,182004
Mondim da Beira,L,0,0,182004
Mondim da Beira,MAS,0,0,182004
Mondim da Beira,NC,0,0,182004
Mondim da Beira,PNR,0,0,182004
Mondim da Beira,PURP,0,0,182004
