freguesia,acronym,validVotesPercentage,votes,dicofre
Castelo,PPD/PSD.CDS-PP,40.25,128,050903
Castelo,PS,35.85,114,050903
Castelo,MPT,11.01,35,050903
Castelo,PCP-PEV,2.52,8,050903
Castelo,PCTP/MRPP,2.52,8,050903
Castelo,B.E.,2.2,7,050903
Castelo,L,1.26,4,050903
Castelo,MAS,1.26,4,050903
Castelo,PAN,0.94,3,050903
Castelo,POUS,0.63,2,050903
Castelo,PPV,0.63,2,050903
Castelo,PDA,0.31,1,050903
Castelo,PND,0.31,1,050903
Castelo,PPM,0.31,1,050903
Castelo,PNR,0,0,050903
Castelo,PTP,0,0,050903
