freguesia,acronym,validVotesPercentage,votes,dicofre
Recezinhos (São Mamede),PS,53.79,369,131132
Recezinhos (São Mamede),PPD/PSD,27.84,191,131132
Recezinhos (São Mamede),B.E.,5.1,35,131132
Recezinhos (São Mamede),R.I.R.,3.5,24,131132
Recezinhos (São Mamede),PAN,2.77,19,131132
Recezinhos (São Mamede),CDS-PP,2.04,14,131132
Recezinhos (São Mamede),L,1.31,9,131132
Recezinhos (São Mamede),PCP-PEV,1.02,7,131132
Recezinhos (São Mamede),PTP,0.58,4,131132
Recezinhos (São Mamede),PCTP/MRPP,0.44,3,131132
Recezinhos (São Mamede),IL,0.29,2,131132
Recezinhos (São Mamede),MPT,0.29,2,131132
Recezinhos (São Mamede),NC,0.29,2,131132
Recezinhos (São Mamede),PURP,0.29,2,131132
Recezinhos (São Mamede),A,0.15,1,131132
Recezinhos (São Mamede),CH,0.15,1,131132
Recezinhos (São Mamede),PNR,0.15,1,131132
Recezinhos (São Mamede),JPP,0,0,131132
Recezinhos (São Mamede),MAS,0,0,131132
Recezinhos (São Mamede),PDR,0,0,131132
Recezinhos (São Mamede),PPM,0,0,131132
