freguesia,acronym,validVotesPercentage,votes,dicofre
Vila Chã,PS,47.06,64,170116
Vila Chã,PPD/PSD,36.03,49,170116
Vila Chã,B.E.,3.68,5,170116
Vila Chã,CDS-PP,3.68,5,170116
Vila Chã,A,2.94,4,170116
Vila Chã,PDR,1.47,2,170116
Vila Chã,L,0.74,1,170116
Vila Chã,PAN,0.74,1,170116
Vila Chã,PCP-PEV,0.74,1,170116
Vila Chã,PCTP/MRPP,0.74,1,170116
Vila Chã,PNR,0.74,1,170116
Vila Chã,PPM.PPV/CDC,0.74,1,170116
Vila Chã,PTP,0.74,1,170116
Vila Chã,IL,0,0,170116
Vila Chã,MAS,0,0,170116
Vila Chã,NC,0,0,170116
Vila Chã,PURP,0,0,170116
