Objeto do Contrato,Tipo de Procedimento,Tipo(s) de Contrato,CPVs,Entidade(s) Adjudicante(s),Entidade(s) Adjudicatária(s),Preço Contratual,Data de Publicação,Data de Celebração do Contrato,Prazo de Execução,Local de Execução,Fundamentação,Data de Fecho do Contrato,Preço Total Efetivo,Causas das Alterações ao Prazo,Causas das Alterações ao Preço,Estado,N.º registo do Acordo Quadro,Descrição do Acordo Quadro,Procedimento Centralizado
Substituição das portas automáticas do BO HOSO,Ajuste Direto Regime Geral,Aquisição de bens móveis,"35100000-5, Equipamento de emergência e de segurança","Centro Hospitalar de Setúbal, E. P. E. (507606787)","Hemer - Serviços, Lda (502318929)","36.110,00 €",11-09-2018,10-09-2018,30 dias,"Portugal, Setúbal, Setúbal","Artigo 24.º, n.º 1, alínea e), subalínea ii) do Código dos Contratos Públicos",,,,,,Não aplicável.,Não aplicável.,FALSE
aparelho para otoemissões,Ajuste Direto Regime Geral,Aquisição de bens móveis,"33000000-0, Equipamento médico, medicamentos e produtos para cuidados pessoais","Centro Hospitalar de Setúbal, E. P. E. (507606787)","Coselgi Portugal, S.A. (509230598)","8.200,00 €",10-09-2018,06-09-2018,30 dias,"Portugal, Setúbal, Setúbal","Artigo 20.º, n.º 1, alínea d) do Código dos Contratos Públicos",,,,,,Não aplicável.,Não aplicável.,FALSE
kit penso para hemodialise,Ajuste Direto Regime Geral,Aquisição de bens móveis,"33000000-0, Equipamento médico, medicamentos e produtos para cuidados pessoais","Centro Hospitalar de Setúbal, E. P. E. (507606787)","Bastos Viegas, S.A. (500042772)","11.088,00 €",06-09-2018,21-12-2017,365 dias,"Portugal, Setúbal, Setúbal","Artigo 20.º, n.º 1, alínea a) do Código dos Contratos Públicos",,,,,,Não aplicável.,Não aplicável.,FALSE
Fardamento AOS e Enfermeiros,Ajuste Direto Regime Geral,Aquisição de bens móveis,"18000000-9, Vestuário, calçado, malas e artigos de viagem, acessórios","Centro Hospitalar de Setúbal, E. P. E. (507606787)","Lintexport Internacional Textil, Lda (500316899)","13.166,20 €",03-09-2018,01-09-2018,30 dias,"Portugal, Setúbal, Setúbal","Artigo 20.º, n.º 1, alínea d) do Código dos Contratos Públicos",,,,,,Não aplicável.,Não aplicável.,FALSE
"Conjunto videoendoscopia, lingwaves set e aparelho de potenciais evocados",Concurso público,Aquisição de bens móveis,"33000000-0, Equipamento médico, medicamentos e produtos para cuidados pessoais",CENTRO HOSPITALAR DE SETÚBAL E.P.E. (507606787),"Teprel - Equipamentos Médicos, SA (502262184)","32.539,50 €",03-09-2018,01-08-2018,30 dias,"Portugal, Setúbal, Setúbal","Artigo 20.º, n.º 1, alínea b) do Código dos Contratos Públicos",,,,,,Não aplicável.,Não aplicável.,FALSE
Remodelação/beneficiação do ascensor nº. 3 da ala nova,Ajuste Direto Regime Geral,Empreitadas de obras públicas,"45000000-7, Construção","Centro Hospitalar de Setúbal, E. P. E. (507606787)","Scmitt-Elevadores, Lda (500230757)","19.748,00 €",03-09-2018,31-08-2018,30 dias,"Portugal, Setúbal, Setúbal","Artigo 19.º, alínea d) do Código dos Contratos Públicos",,,,,,Não aplicável.,Não aplicável.,FALSE
