freguesia,acronym,validVotesPercentage,votes,dicofre
Tavarede,PS,29.78,707,060512
Tavarede,PPD/PSD.CDS-PP,23.13,549,060512
Tavarede,PCP-PEV,16.81,399,060512
Tavarede,MPT,11.46,272,060512
Tavarede,B.E.,8.17,194,060512
Tavarede,L,3.07,73,060512
Tavarede,PAN,2.44,58,060512
Tavarede,PCTP/MRPP,2.11,50,060512
Tavarede,MAS,0.84,20,060512
Tavarede,PPM,0.51,12,060512
Tavarede,PNR,0.42,10,060512
Tavarede,PTP,0.42,10,060512
Tavarede,PND,0.29,7,060512
Tavarede,PPV,0.29,7,060512
Tavarede,PDA,0.13,3,060512
Tavarede,POUS,0.13,3,060512
