freguesia,acronym,validVotesPercentage,votes,dicofre
União das freguesias de Baixa da Banheira e Vale da Amoreira,PS,41.36,5047,150607
União das freguesias de Baixa da Banheira e Vale da Amoreira,PCP-PEV,25.16,3070,150607
União das freguesias de Baixa da Banheira e Vale da Amoreira,B.E.,12.33,1505,150607
União das freguesias de Baixa da Banheira e Vale da Amoreira,PPD/PSD,7.92,967,150607
União das freguesias de Baixa da Banheira e Vale da Amoreira,PAN,3.76,459,150607
União das freguesias de Baixa da Banheira e Vale da Amoreira,CDS-PP,2.08,254,150607
União das freguesias de Baixa da Banheira e Vale da Amoreira,CH,1.92,234,150607
União das freguesias de Baixa da Banheira e Vale da Amoreira,PCTP/MRPP,1.1,134,150607
União das freguesias de Baixa da Banheira e Vale da Amoreira,L,0.96,117,150607
União das freguesias de Baixa da Banheira e Vale da Amoreira,PNR,0.62,76,150607
União das freguesias de Baixa da Banheira e Vale da Amoreira,IL,0.56,68,150607
União das freguesias de Baixa da Banheira e Vale da Amoreira,A,0.47,57,150607
União das freguesias de Baixa da Banheira e Vale da Amoreira,R.I.R.,0.34,41,150607
União das freguesias de Baixa da Banheira e Vale da Amoreira,PURP,0.3,37,150607
União das freguesias de Baixa da Banheira e Vale da Amoreira,MPT,0.25,30,150607
União das freguesias de Baixa da Banheira e Vale da Amoreira,PTP,0.23,28,150607
União das freguesias de Baixa da Banheira e Vale da Amoreira,NC,0.22,27,150607
União das freguesias de Baixa da Banheira e Vale da Amoreira,PPM,0.2,24,150607
União das freguesias de Baixa da Banheira e Vale da Amoreira,PDR,0.13,16,150607
União das freguesias de Baixa da Banheira e Vale da Amoreira,MAS,0.09,11,150607
