freguesia,acronym,validVotesPercentage,votes,dicofre
União das freguesias de Marrazes e Barosa,PPD/PSD.CDS-PP,31.11,1714,100934
União das freguesias de Marrazes e Barosa,PS,30.5,1680,100934
União das freguesias de Marrazes e Barosa,PCP-PEV,10.02,552,100934
União das freguesias de Marrazes e Barosa,MPT,8.71,480,100934
União das freguesias de Marrazes e Barosa,B.E.,7.21,397,100934
União das freguesias de Marrazes e Barosa,L,3.41,188,100934
União das freguesias de Marrazes e Barosa,PAN,2.96,163,100934
União das freguesias de Marrazes e Barosa,PCTP/MRPP,1.62,89,100934
União das freguesias de Marrazes e Barosa,PND,1.36,75,100934
União das freguesias de Marrazes e Barosa,PTP,0.8,44,100934
União das freguesias de Marrazes e Barosa,PPM,0.6,33,100934
União das freguesias de Marrazes e Barosa,PPV,0.53,29,100934
União das freguesias de Marrazes e Barosa,PNR,0.44,24,100934
União das freguesias de Marrazes e Barosa,MAS,0.42,23,100934
União das freguesias de Marrazes e Barosa,PDA,0.2,11,100934
União das freguesias de Marrazes e Barosa,POUS,0.13,7,100934
