freguesia,acronym,validVotesPercentage,votes,dicofre
Urgezes,PS,38.33,708,030871
Urgezes,PPD/PSD.CDS-PP,31.56,583,030871
Urgezes,MPT,9.37,173,030871
Urgezes,PCP-PEV,8.88,164,030871
Urgezes,B.E.,3.47,64,030871
Urgezes,L,2.38,44,030871
Urgezes,PCTP/MRPP,1.41,26,030871
Urgezes,PAN,1.3,24,030871
Urgezes,PNR,0.76,14,030871
Urgezes,PND,0.65,12,030871
Urgezes,MAS,0.6,11,030871
Urgezes,PPM,0.54,10,030871
Urgezes,PTP,0.38,7,030871
Urgezes,PPV,0.27,5,030871
Urgezes,PDA,0.05,1,030871
Urgezes,POUS,0.05,1,030871
