Objeto do Contrato,Tipo de Procedimento,Tipo(s) de Contrato,CPVs,Entidade(s) Adjudicante(s),Entidade(s) Adjudicatária(s),Preço Contratual,Data de Publicação,Data de Celebração do Contrato,Prazo de Execução,Local de Execução,Fundamentação,Data de Fecho do Contrato,Preço Total Efetivo,Causas das Alterações ao Prazo,Causas das Alterações ao Preço,Estado,N.º registo do Acordo Quadro,Descrição do Acordo Quadro,Procedimento Centralizado
FENTIL PASTIHAS,Ajuste Direto Regime Geral,Aquisição de bens móveis,"33690000-3, Medicamentos vários","Administração Regional de Saúde do Algarve, I.P. (503148709)",DLA FARMACEUTICA S.A (503894427),"1.773,03 €",18-07-2012,12-07-2012,159 dias,"Portugal, Faro, Faro","Artigo 24.º, n.º 1, alínea e) do Código dos Contratos Públicos","","",,"",,Não aplicável.,Não aplicável.,
ISONIAZIDA 20MG/ML XAROPE,Ajuste Direto Regime Geral,Aquisição de bens móveis,"33000000-0, Equipamento médico, medicamentos e produtos para cuidados pessoais","Administração Regional de Saúde do Algarve, I.P. (503148709)",Laboratório Militar de Produtos Químicos e Farmacêuticos (600019675),"840,00 €",18-07-2012,06-07-2012,5 dias,"Portugal, Faro, Faro","Artigo 24.º, n.º 1, alínea e) do Código dos Contratos Públicos",22-10-2012,"560,00 €",,Quantidades adquiridas,,Não aplicável.,Não aplicável.,
Permetrim 1% creme /espuma antiparasitário,Ajuste Direto Regime Geral,Aquisição de bens móveis,"33691000-0, Produtos antiparasitários, insecticidas e repelentes","Administração Regional de Saúde do Algarve, I.P. (503148709)","Omega Pharma Portuguesa, Unipessoal (506112233)","13.080,00 €",16-07-2012,11-07-2012,165 dias,"Portugal, Faro, Faro","Artigo 24.º, n.º 1, alínea e) do Código dos Contratos Públicos","","",,"",,Não aplicável.,Não aplicável.,
Hidroxizina Ampolas e xarope,Ajuste Direto Regime Geral,Aquisição de bens móveis,"33000000-0, Equipamento médico, medicamentos e produtos para cuidados pessoais","Administração Regional de Saúde do Algarve, I.P. (503148709)",UCB Pharma Produtos farmaceuticos Lda (500291322),"93,00 €",13-07-2012,11-07-2012,150 dias,"Portugal, Faro, Faro","Artigo 24.º, n.º 1, alínea e) do Código dos Contratos Públicos","","",,"",,Não aplicável.,Não aplicável.,
