freguesia,acronym,validVotesPercentage,votes,dicofre
Tinalhas,PS,39.62,103,050225
Tinalhas,PPD/PSD,28.46,74,050225
Tinalhas,B.E.,11.54,30,050225
Tinalhas,CDS-PP,5.38,14,050225
Tinalhas,PAN,4.23,11,050225
Tinalhas,PURP,2.31,6,050225
Tinalhas,CH,1.92,5,050225
Tinalhas,A,1.54,4,050225
Tinalhas,L,1.15,3,050225
Tinalhas,PCP-PEV,1.15,3,050225
Tinalhas,PCTP/MRPP,1.15,3,050225
Tinalhas,IL,0.38,1,050225
Tinalhas,MPT,0.38,1,050225
Tinalhas,PNR,0.38,1,050225
Tinalhas,R.I.R.,0.38,1,050225
Tinalhas,PDR,0,0,050225
Tinalhas,PPM,0,0,050225
Tinalhas,PTP,0,0,050225
