freguesia,acronym,validVotesPercentage,votes,dicofre
"União das freguesias de Soeira, Fresulfe e Mofreita",PS,53.61,52,041241
"União das freguesias de Soeira, Fresulfe e Mofreita",PPD/PSD,30.93,30,041241
"União das freguesias de Soeira, Fresulfe e Mofreita",B.E.,5.15,5,041241
"União das freguesias de Soeira, Fresulfe e Mofreita",PCP-PEV,4.12,4,041241
"União das freguesias de Soeira, Fresulfe e Mofreita",PDR,2.06,2,041241
"União das freguesias de Soeira, Fresulfe e Mofreita",PNR,2.06,2,041241
"União das freguesias de Soeira, Fresulfe e Mofreita",CDS-PP,1.03,1,041241
"União das freguesias de Soeira, Fresulfe e Mofreita",PURP,1.03,1,041241
"União das freguesias de Soeira, Fresulfe e Mofreita",A,0,0,041241
"União das freguesias de Soeira, Fresulfe e Mofreita",CH,0,0,041241
"União das freguesias de Soeira, Fresulfe e Mofreita",IL,0,0,041241
"União das freguesias de Soeira, Fresulfe e Mofreita",L,0,0,041241
"União das freguesias de Soeira, Fresulfe e Mofreita",NC,0,0,041241
"União das freguesias de Soeira, Fresulfe e Mofreita",PAN,0,0,041241
"União das freguesias de Soeira, Fresulfe e Mofreita",PCTP/MRPP,0,0,041241
"União das freguesias de Soeira, Fresulfe e Mofreita",PPM,0,0,041241
"União das freguesias de Soeira, Fresulfe e Mofreita",PTP,0,0,041241
"União das freguesias de Soeira, Fresulfe e Mofreita",R.I.R.,0,0,041241
