Objeto do Contrato,Tipo de Procedimento,Tipo(s) de Contrato,CPVs,Entidade(s) Adjudicante(s),Entidade(s) Adjudicatária(s),Preço Contratual,Data de Publicação,Data de Celebração do Contrato,Prazo de Execução,Local de Execução,Fundamentação,Data de Fecho do Contrato,Preço Total Efetivo,Causas das Alterações ao Prazo,Causas das Alterações ao Preço,Estado,N.º registo do Acordo Quadro,Descrição do Acordo Quadro,Procedimento Centralizado
"Aquisição de Videocolonoscopio e Processador para a Unidade de Endoscopias da ULSNA, EPE",Ajuste Direto Regime Geral,Aquisição de bens móveis,"33000000-0, Equipamento médico, medicamentos e produtos para cuidados pessoais","Unidade Local de Saúde do Norte Alentejano, E. P. E. (508094461)",Olympus (980474710),"37.500,00 €",11-03-2014,22-01-2014,1 dias,"Portugal, Portalegre, Portalegre","Artigo 20.º, n.º 1, alínea a) do Código dos Contratos Públicos",22-01-2014,"37.500,00 €",,,,Não aplicável.,Não aplicável.,FALSE
prestação de serviços de manutenção de 5 servidores SUN V240,Ajuste Direto Regime Geral,Aquisição de serviços,"72000000-5, Serviços de TI: consultoria, desenvolvimento de software, Internet e apoio","Unidade Local de Saúde do Norte Alentejano, E. P. E. (508094461)","ITEN Solutions - Sistemas de Informação, S.A (510728189)","5.595,00 €",10-03-2014,15-01-2014,365 dias,"Portugal, Portalegre, Portalegre","Artigo 20.º, n.º 1, alínea a) do Código dos Contratos Públicos",15-01-2014,"5.595,00 €",,,,Não aplicável.,Não aplicável.,FALSE
AQUISIÇÃO MEDICAMENTOS,Ajuste Direto Regime Geral,Aquisição de bens móveis,"33000000-0, Equipamento médico, medicamentos e produtos para cuidados pessoais","Unidade Local de Saúde do Norte Alentejano, E. P. E. (508094461)",CELGENE - SOCIEDADE UNIPESSOAL (507791690),"28.800,00 €",10-03-2014,17-02-2014,300 dias,"Portugal, Portalegre, Portalegre<BR/>Portugal, Portalegre, Elvas","Artigo 24.º, n.º 1, alínea e) do Código dos Contratos Públicos",31-12-2014,"28.800,00 €",,,,Não aplicável.,Não aplicável.,FALSE
PRESTAÇAO DE SERVIÇOS DE ALOJAMENTO E APOIO RESIDENCIAL A 5 DOENTES DE EVOLUÇÃO PROLONGADA,Ajuste Direto Regime Geral,Aquisição de serviços,"85311200-4, Serviços de assistência social a pessoas com deficiência","Unidade Local de Saúde do Norte Alentejano, E. P. E. (508094461)","SulHotel, Lda (501229981)","45.000,00 €",10-03-2014,19-12-2013,365 dias,"Portugal, Portalegre, Portalegre","Artigo 20.º, n.º 1, alínea a) do Código dos Contratos Públicos",19-12-2013,"45.000,00 €",,,,Não aplicável.,Não aplicável.,FALSE
Aquisição de Medicamentos Exclusivos,Ajuste Direto Regime Geral,Aquisição de bens móveis,"33000000-0, Equipamento médico, medicamentos e produtos para cuidados pessoais","Unidade Local de Saúde do Norte Alentejano, E. P. E. (508094461)",Fresenius Medical Care (503070220),"9.574,80 €",10-03-2014,10-03-2014,300 dias,"Portugal, Portalegre, Portalegre","Artigo 24.º, n.º 1, alínea e) do Código dos Contratos Públicos",31-12-2014,"9.574,80 €",,,,Não aplicável.,Não aplicável.,FALSE
Aquisição de Produtos Farmacêuticos Exclusivos,Ajuste Direto Regime Geral,Aquisição de bens móveis,"33000000-0, Equipamento médico, medicamentos e produtos para cuidados pessoais","Unidade Local de Saúde do Norte Alentejano, E. P. E. (508094461)",Covidien Portugal (503413410),"9.720,00 €",07-03-2014,05-03-2014,300 dias,"Portugal, Portalegre, Portalegre","Artigo 24.º, n.º 1, alínea e) do Código dos Contratos Públicos",31-12-2014,"9.720,00 €",,,,Não aplicável.,Não aplicável.,FALSE
"Prestação de Serviços Médicos, na Especialidade de Anestesiologia, na Ulsna, EPE (1 de Janeiro a 30 de Junho de 2014)",Ajuste Direto Regime Geral,Aquisição de serviços,"85100000-0, Serviços de saúde","Unidade Local de Saúde do Norte Alentejano, E. P. E. (508094461)","Ciclipolis - Serviços Médicos, Unipessoal, Lda (508320526)","98.028,00 €",07-03-2014,06-02-2014,181 dias,"Portugal, Portalegre, Portalegre","Artigo 24.º, n.º 1, alínea c) do Código dos Contratos Públicos",30-06-2014,"98.028,00 €",,,,Não aplicável.,Não aplicável.,FALSE
"Prestação de Serviços de Limpeza e Manutenção das Zonas Jardinadas e Áreas Circundantes, na Unidade Local de Saúde do Norte Alentejano, EPE, para o ano 2014",Ajuste Direto Regime Geral,Aquisição de serviços,"50000000-5, Serviços de reparação e manutenção","Unidade Local de Saúde do Norte Alentejano, E. P. E. (508094461)","VMLS- SERVICES UNIPESSOAL, LDA. (510212921)","11.371,20 €",07-03-2014,18-12-2013,365 dias,"Portugal, Portalegre, Portalegre","Artigo 20.º, n.º 1, alínea a) do Código dos Contratos Públicos",31-12-2013,"11.371,20 €",,,,Não aplicável.,Não aplicável.,FALSE
Aquisição de Medicamentos Exclusivos,Ajuste Direto Regime Geral,Aquisição de bens móveis,"33000000-0, Equipamento médico, medicamentos e produtos para cuidados pessoais","Unidade Local de Saúde do Norte Alentejano, E. P. E. (508094461)","Shire Pharmaceuticals Portugal, Lda (509264662)","5.011,20 €",07-03-2014,07-03-2014,300 dias,"Portugal, Portalegre, Portalegre","Artigo 24.º, n.º 1, alínea e) do Código dos Contratos Públicos",31-12-2014,"5.011,20 €",,,,Não aplicável.,Não aplicável.,FALSE
Aquisição de Medicamentos Exclusivos,Ajuste Direto Regime Geral,Aquisição de bens móveis,"33000000-0, Equipamento médico, medicamentos e produtos para cuidados pessoais","Unidade Local de Saúde do Norte Alentejano, E. P. E. (508094461)","Laboratório Pfizer, Lda. (500162166)","5.048,65 €",07-03-2014,07-03-2014,300 dias,"Portugal, Portalegre, Portalegre","Artigo 24.º, n.º 1, alínea e) do Código dos Contratos Públicos",31-12-2014,"5.048,65 €",,,,Não aplicável.,Não aplicável.,FALSE
PRESTAÇÃO DE SERVIÇOS PARA FORMAÇÃO EM CIRURGIA LAPARSCÓPICA,Ajuste Direto Regime Geral,Aquisição de serviços,"85100000-0, Serviços de saúde","Unidade Local de Saúde do Norte Alentejano, E. P. E. (508094461)","SsRua, Serviços Médicos, Lda (510708480)","5.130,00 €",07-03-2014,26-02-2014,365 dias,"Portugal, Portalegre, Portalegre","Artigo 20.º, n.º 1, alínea a) do Código dos Contratos Públicos",26-02-2014,"5.130,00 €",,,,Não aplicável.,Não aplicável.,FALSE
Aquisição de medicamentos exclusivos,Ajuste Direto Regime Geral,Aquisição de bens móveis,"33000000-0, Equipamento médico, medicamentos e produtos para cuidados pessoais","Unidade Local de Saúde do Norte Alentejano, E. P. E. (508094461)",Roche Farmaceutica Quimica Lda (500233810),"9.240,40 €",07-03-2014,07-03-2014,300 dias,"Portugal, Portalegre, Elvas<BR/>Portugal, Portalegre, Portalegre","Artigo 24.º, n.º 1, alínea e) do Código dos Contratos Públicos",31-12-2014,"9.240,40 €",,,,Não aplicável.,Não aplicável.,FALSE
"Fornecimento de Combustíveis Rodoviários para a ULSNA, EPE",Ao abrigo de acordo-quadro (art.º 259.º),Aquisição de bens móveis,"09000000-3, Produtos petrolíferos, combustíveis, electricidade e outras fontes de energia","Unidade Local de Saúde do Norte Alentejano, E. P. E. (508094461)","Petróleos de Portugal - Petrogal, S.A (500697370)","156.513,75 €",07-03-2014,06-01-2014,334 dias,"Portugal, Portalegre",Artigo 259.º do Código dos Contratos Públicos,06-01-2014,"156.513,75 €",,,,400324,Acordo quadro de fornecimento de combustíveis rodoviários,FALSE
AQUISIÇÃO DE ETIQUETAS,Ajuste Direto Regime Geral,Aquisição de bens móveis,"30000000-9, Máquinas, equipamento e material de escritório e de informática, excepto mobiliário e pacotes de programas (software)","Unidade Local de Saúde do Norte Alentejano, E. P. E. (508094461)",DATA LABEL PORTUGAL (506448967),"4.482,00 €",06-03-2014,29-01-2014,365 dias,"Portugal, Portalegre, Portalegre<BR/>Portugal, Portalegre, Elvas","Artigo 20.º, n.º 1, alínea a) do Código dos Contratos Públicos","","",,,,Não aplicável.,Não aplicável.,FALSE
AQUISIÇÃO DE ETIQUETAS,Ajuste Direto Regime Geral,Aquisição de bens móveis,"30000000-9, Máquinas, equipamento e material de escritório e de informática, excepto mobiliário e pacotes de programas (software)","Unidade Local de Saúde do Norte Alentejano, E. P. E. (508094461)",ZETES BUROTICA SA (501178503),"2.289,55 €",06-03-2014,29-01-2014,365 dias,"Portugal, Portalegre, Elvas<BR/>Portugal, Portalegre, Portalegre","Artigo 20.º, n.º 1, alínea a) do Código dos Contratos Públicos","","",,,,Não aplicável.,Não aplicável.,FALSE
"AQUISIÇÃO DE IMPRESSOS E MODELOS PARA A ULSNA, EPE",Ajuste Direto Regime Geral,Aquisição de bens móveis,"22000000-0, Material impresso e afins","Unidade Local de Saúde do Norte Alentejano, E. P. E. (508094461)",ENVELOPRINTER-FERNANDO ANTSBENTO (179870866),"5.302,55 €",06-03-2014,12-02-2014,365 dias,"Portugal, Portalegre, Portalegre<BR/>Portugal, Portalegre, Elvas","Artigo 20.º, n.º 1, alínea a) do Código dos Contratos Públicos","","",,,,Não aplicável.,Não aplicável.,FALSE
AQUISIÇÃO DE CONSUMIVEIS INFORMÁTICOS,Ajuste Direto Regime Geral,Aquisição de bens móveis,"30000000-9, Máquinas, equipamento e material de escritório e de informática, excepto mobiliário e pacotes de programas (software)","Unidade Local de Saúde do Norte Alentejano, E. P. E. (508094461)",TopToner-Reciclagem e Comercialização de Consumive (504242644),"6.348,21 €",06-03-2014,05-02-2014,365 dias,"Portugal, Portalegre, Portalegre<BR/>Portugal, Portalegre, Elvas","Artigo 20.º, n.º 1, alínea a) do Código dos Contratos Públicos","","",,,,Não aplicável.,Não aplicável.,FALSE
AQUISIÇÃO DE CONSUMIVEIS INFORMÁTICOS,Ajuste Direto Regime Geral,Aquisição de bens móveis,"30000000-9, Máquinas, equipamento e material de escritório e de informática, excepto mobiliário e pacotes de programas (software)","Unidade Local de Saúde do Norte Alentejano, E. P. E. (508094461)",NOVABIT (503411302),"6.944,56 €",06-03-2014,05-02-2014,365 dias,"Portugal, Portalegre, Portalegre<BR/>Portugal, Portalegre, Elvas","Artigo 20.º, n.º 1, alínea a) do Código dos Contratos Públicos","","",,,,Não aplicável.,Não aplicável.,FALSE
AQUISIÇÃO DE CONSUMIVEIS INFORMÁTICOS,Ajuste Direto Regime Geral,Aquisição de bens móveis,"30000000-9, Máquinas, equipamento e material de escritório e de informática, excepto mobiliário e pacotes de programas (software)","Unidade Local de Saúde do Norte Alentejano, E. P. E. (508094461)",FLUIR-Consumíveis Equip.Informático Unipessoal Lda (506212424),"6.087,55 €",06-03-2014,05-02-2014,365 dias,"Portugal, Portalegre, Portalegre<BR/>Portugal, Portalegre, Elvas","Artigo 20.º, n.º 1, alínea a) do Código dos Contratos Públicos","","",,,,Não aplicável.,Não aplicável.,FALSE
Fornecimento de Gás Propano a Granel para o CS de Castelo de Castelo de Vide,Ajuste Direto Regime Geral,Aquisição de serviços,"65200000-5, Serviços de distribuição de gás e serviços conexos","Unidade Local de Saúde do Norte Alentejano, E. P. E. (508094461)",Petróleos de Portugal (500697370),"9.000,00 €",05-03-2014,23-10-2013,60 dias,"Portugal, Portalegre, Castelo de Vide","Artigo 24.º, n.º 1, alínea c) do Código dos Contratos Públicos",23-10-2013,"9.000,00 €",,,,Não aplicável.,Não aplicável.,FALSE
Fornecimento de Energia Eléctrica Baixa Tensão Normal  (Ano 2014),Ajuste Direto Regime Geral,Aquisição de serviços,"65300000-6, Serviços de distribuição de electricidade e serviços conexos","Unidade Local de Saúde do Norte Alentejano, E. P. E. (508094461)",EDP (507846044),"5.750,00 €",05-03-2014,19-02-2014,365 dias,"Portugal, Portalegre, Portalegre","Artigo 20.º, n.º 1, alínea a) do Código dos Contratos Públicos",19-02-2014,"5.750,00 €",,,,Não aplicável.,Não aplicável.,FALSE
Fornecimento de Energia Eléctrica Baixa Tensão (janeiro e fevereiro de 2014),Ajuste Direto Regime Geral,Aquisição de serviços,"65300000-6, Serviços de distribuição de electricidade e serviços conexos","Unidade Local de Saúde do Norte Alentejano, E. P. E. (508094461)",EDP (507846044),"8.500,00 €",05-03-2014,26-02-2014,59 dias,"Portugal, Portalegre, Portalegre","Artigo 24.º, n.º 1, alínea c) do Código dos Contratos Públicos",28-02-2014,"8.500,00 €",,,,Não aplicável.,Não aplicável.,FALSE
"Aquisição de Videocolonoscopio e Processador para a ULSNA, EPE",Ajuste Direto Regime Geral,Aquisição de bens móveis,"33000000-0, Equipamento médico, medicamentos e produtos para cuidados pessoais","Unidade Local de Saúde do Norte Alentejano, E. P. E. (508094461)",Olympus Portugal (980474710),"37.500,00 €",03-03-2014,22-01-2014,30 dias,"Portugal, Portalegre, Portalegre","Artigo 20.º, n.º 1, alínea a) do Código dos Contratos Públicos",22-02-2014,"37.500,00 €",,,,Não aplicável.,Não aplicável.,FALSE
