Objeto do Contrato,Tipo de Procedimento,Tipo(s) de Contrato,CPVs,Entidade(s) Adjudicante(s),Entidade(s) Adjudicatária(s),Preço Contratual,Data de Publicação,Data de Celebração do Contrato,Prazo de Execução,Local de Execução,Fundamentação,Data de Fecho do Contrato,Preço Total Efetivo,Causas das Alterações ao Prazo,Causas das Alterações ao Preço,Estado,N.º registo do Acordo Quadro,Descrição do Acordo Quadro,Procedimento Centralizado
MCC Agulhas e Seringas,Ao abrigo de acordo-quadro (art.º 258.º),Aquisição de bens móveis,"33600000-6, Produtos farmacêuticos",Administração Regional de Saúde do Alentejo (ARSA) (503148768),PERGUT PORTUGAL-C.P.HOSP.MED (501799729),"645,00 €",21-06-2018,14-02-2018,330 dias,"Portugal, Évora","Artigo 32.º, n.º 3, alínea b) do Código dos Contratos Públicos",19-09-2018,"301,00 €","",Não forneceu a totalidade,,1341769,"ACORDO QUADRO PARA FORNECIMENTO DE SERINGAS, AGULHAS E CONTENTORES ÀS INSTITUIÇÕES E SERVIÇOS DO SERVIÇO NACIONAL DE SAÚDE PROGRAMA DE CONCURSO",FALSE
MCC Agulhas e Seringas,Ao abrigo de acordo-quadro (art.º 258.º),Aquisição de bens móveis,"33600000-6, Produtos farmacêuticos",Administração Regional de Saúde do Alentejo (ARSA) (503148768),"B BRAUN MEDICAL, LDA (501506543)","1.097,86 €",21-06-2018,30-04-2018,330 dias,"Portugal, Évora",Artigo 258.º do Código dos Contratos Públicos,25-09-2018,"1.097,86 €","","",,1341769,"ACORDO QUADRO PARA FORNECIMENTO DE SERINGAS, AGULHAS E CONTENTORES ÀS INSTITUIÇÕES E SERVIÇOS DO SERVIÇO NACIONAL DE SAÚDE PROGRAMA DE CONCURSO",FALSE
MCC Agulhas e Seringas,Ao abrigo de acordo-quadro (art.º 258.º),Aquisição de bens móveis,"33600000-6, Produtos farmacêuticos",Administração Regional de Saúde do Alentejo (ARSA) (503148768),"BECTON DICKINSON PORTUGAL UNIPESSOAL, LDA (514239743)","242,04 €",21-06-2018,14-02-2018,330 dias,"Portugal, Évora",Artigo 258.º do Código dos Contratos Públicos,12-10-2018,"242,04 €","","",,1341769,"ACORDO QUADRO PARA FORNECIMENTO DE SERINGAS, AGULHAS E CONTENTORES ÀS INSTITUIÇÕES E SERVIÇOS DO SERVIÇO NACIONAL DE SAÚDE PROGRAMA DE CONCURSO",FALSE
MCC Agulhas e Seringas,Ao abrigo de acordo-quadro (art.º 258.º),Aquisição de bens móveis,"33600000-6, Produtos farmacêuticos",Administração Regional de Saúde do Alentejo (ARSA) (503148768),"CLINIFAR - PROD. CLINICOS E FARMACEUTICOS, S.A. (503281115)","263,20 €",21-06-2018,14-02-2018,330 dias,"Portugal, Évora",Artigo 258.º do Código dos Contratos Públicos,23-05-2018,"274,05 €","",Acerto das quantidades com as embalagens fornecidas,,1341769,"ACORDO QUADRO PARA FORNECIMENTO DE SERINGAS, AGULHAS E CONTENTORES ÀS INSTITUIÇÕES E SERVIÇOS DO SERVIÇO NACIONAL DE SAÚDE PROGRAMA DE CONCURSO",FALSE
MCC Agulhas e Seringas,Ao abrigo de acordo-quadro (art.º 258.º),Aquisição de bens móveis,"33600000-6, Produtos farmacêuticos",Administração Regional de Saúde do Alentejo (ARSA) (503148768),"ANASTACIO SALDANHA,  UNIPESSOAL  LDA (505804441)","70,05 €",21-06-2018,21-06-2018,330 dias,"Portugal, Évora",Artigo 258.º do Código dos Contratos Públicos,11-09-2018,"70,05 €","","",,1341769,"ACORDO QUADRO PARA FORNECIMENTO DE SERINGAS, AGULHAS E CONTENTORES ÀS INSTITUIÇÕES E SERVIÇOS DO SERVIÇO NACIONAL DE SAÚDE PROGRAMA DE CONCURSO",FALSE
MCC Agulhas e Seringas,Ao abrigo de acordo-quadro (art.º 258.º),Aquisição de bens móveis,"33600000-6, Produtos farmacêuticos",Administração Regional de Saúde do Alentejo (ARSA) (503148768),"QUILABAN - QUIMICA LABORATORIAL ANALITICA, SA (500399670)","476,80 €",21-06-2018,05-06-2018,330 dias,"Portugal, Évora",Artigo 258.º do Código dos Contratos Públicos,29-11-2018,"196,68 €","",Não forneceu a totalidade,,1341769,"ACORDO QUADRO PARA FORNECIMENTO DE SERINGAS, AGULHAS E CONTENTORES ÀS INSTITUIÇÕES E SERVIÇOS DO SERVIÇO NACIONAL DE SAÚDE PROGRAMA DE CONCURSO",FALSE
MCC Agulhas e Seringas,Ao abrigo de acordo-quadro (art.º 258.º),Aquisição de bens móveis,"33600000-6, Produtos farmacêuticos",Administração Regional de Saúde do Alentejo (ARSA) (503148768),"OVERPHARMA-PRODUTOS MÉDICOS E FARMACÉUTICOS,LDA (505792362)","25,22 €",21-06-2018,21-06-2018,330 dias,"Portugal, Évora",Artigo 258.º do Código dos Contratos Públicos,10-09-2018,"25,22 €","","",,1341769,"ACORDO QUADRO PARA FORNECIMENTO DE SERINGAS, AGULHAS E CONTENTORES ÀS INSTITUIÇÕES E SERVIÇOS DO SERVIÇO NACIONAL DE SAÚDE PROGRAMA DE CONCURSO",FALSE
MCC Agulhas e Seringas,Ao abrigo de acordo-quadro (art.º 258.º),Aquisição de bens móveis,"33600000-6, Produtos farmacêuticos",Administração Regional de Saúde do Alentejo (ARSA) (503148768),"DOCWORLD, LDA (508592909)","238,20 €",21-06-2018,30-04-2018,330 dias,"Portugal, Évora",Artigo 258.º do Código dos Contratos Públicos,10-09-2018,"238,20 €","","",,1341769,"ACORDO QUADRO PARA FORNECIMENTO DE SERINGAS, AGULHAS E CONTENTORES ÀS INSTITUIÇÕES E SERVIÇOS DO SERVIÇO NACIONAL DE SAÚDE PROGRAMA DE CONCURSO",FALSE
Ensaios (químicos) de aptidão de águas naturais e de consumo humano _ LSP Alentejo,Ajuste Direto Regime Geral,Aquisição de serviços,"90000000-7, Serviços relativos a águas residuais, resíduos, limpeza e ambiente","Administração Regional de Saúde do Alentejo, I. P. (503148768)",Relacre Associação de Laboratórios Acreditados de Portugal (502578874),"1.770,00 €",21-06-2018,28-06-2017,30 dias,"Portugal, Portalegre, Portalegre<BR/>Portugal, Beja, Beja<BR/>Portugal, Évora, Évora<BR/>Portugal","Artigo 24.º, n.º 1, alínea e) do Código dos Contratos Públicos",14-09-2017,"795,00 €","",Anulação de valores faturados pela 2ª distribuição do EAp,,Não aplicável.,Não aplicável.,FALSE
Aquisição de Garrotes,Ao abrigo de acordo-quadro (art.º 259.º),Aquisição de bens móveis,"33600000-6, Produtos farmacêuticos",Administração Regional de Saúde do Alentejo (ARSA) (503148768),"P.M.H. - PROD. MEDICOS HOSPITALARES, LDA. (502376899)","1.115,60 €",21-06-2018,30-10-2017,150 dias,"Portugal, Évora",Artigo 259.º do Código dos Contratos Públicos,07-11-2017,"1.119,50 €","",acerto das quantidades com a embalagem fornecida,,1212278,"CONCURSO PÚBLICO PARA A CELEBRAÇÃO DE CONTRATOS PÚBLICOS DE APROVISIONAMENTO PARA A ÁREA DA SAÚDE, COM VISTA AO FORNECIMENTO DE CATETERES, ÀS INSTITUIÇÕES E SERVIÇOS DO SERVIÇO NACIONAL DE SAÚDE",FALSE
Aquisição de Garrotes,Ao abrigo de acordo-quadro (art.º 259.º),Aquisição de bens móveis,"33600000-6, Produtos farmacêuticos",Administração Regional de Saúde do Alentejo (ARSA) (503148768),"B BRAUN MEDICAL, LDA (501506543)","4,19 €",21-06-2018,11-11-2017,150 dias,"Portugal, Évora",Artigo 259.º do Código dos Contratos Públicos,24-11-2017,"13,97 €","","Adjudicou-se 30 unidades, mas a empresa só tinha embalagens com 100 unidades",,1212278,"CONCURSO PÚBLICO PARA A CELEBRAÇÃO DE CONTRATOS PÚBLICOS DE APROVISIONAMENTO PARA A ÁREA DA SAÚDE, COM VISTA AO FORNECIMENTO DE CATETERES, ÀS INSTITUIÇÕES E SERVIÇOS DO SERVIÇO NACIONAL DE SAÚDE",FALSE
Aquisição de Garrotes,Ao abrigo de acordo-quadro (art.º 259.º),Aquisição de bens móveis,"33600000-6, Produtos farmacêuticos",Administração Regional de Saúde do Alentejo (ARSA) (503148768),"OVERPHARMA-PRODUTOS MÉDICOS E FARMACÉUTICOS,LDA (505792362)","1.026,00 €",21-06-2018,25-08-2017,150 dias,"Portugal, Évora",Artigo 259.º do Código dos Contratos Públicos,16-11-2017,"1.023,37 €","",acerto das quantidades fornecidas com as embalagens,,1212278,"CONCURSO PÚBLICO PARA A CELEBRAÇÃO DE CONTRATOS PÚBLICOS DE APROVISIONAMENTO PARA A ÁREA DA SAÚDE, COM VISTA AO FORNECIMENTO DE CATETERES, ÀS INSTITUIÇÕES E SERVIÇOS DO SERVIÇO NACIONAL DE SAÚDE",FALSE
Aquisição de Garrotes,Ao abrigo de acordo-quadro (art.º 259.º),Aquisição de bens móveis,"33600000-6, Produtos farmacêuticos",Administração Regional de Saúde do Alentejo (ARSA) (503148768),"Becton Diskinson, S.A.-Suc. em Portugal (980245214)","5,60 €",21-06-2018,08-11-2017,180 dias,"Portugal, Évora",Artigo 259.º do Código dos Contratos Públicos,31-12-2017,"160,13 €","","O preço contratual era por caixa, mas no concurso adjudicou-se 25 caixas ",,1350003,Acordo Quadro para fornecimento de sistemas fechados e material diverso de recolha de sangue às instituições do SNS,FALSE
"Aquisição de Material de Consumo Clínico - Aventais e Laminas de Bisturi, ao abrigo de Contratos Públicos de Aprovisionamento (CPA's) dos SPMS, com consulta ao Catalogo de Aprov. Público de Saúde ",Ao abrigo de acordo-quadro (art.º 259.º),Aquisição de bens móveis,"33100000-1, Equipamento médico",Administração Regional de Saúde do Alentejo (ARSA) (503148768),"H.R. -  HOSPITALAR, LDA (501895558)","557,50 €",21-06-2018,21-08-2017,150 dias,"Portugal, Évora",Artigo 259.º do Código dos Contratos Públicos,16-11-2017,"528,33 €","",Não forneceu a totalidade das Laminas de Bisturi 22,,2102851,CP 2016/74 - Acordo quadro para fornecimento de Material disposable de bloco operatório - Parte I-B às Instituições e Serviços do Serviço Nacional de Saúde,FALSE
"Aquisição de Material de Consumo Clínico - Aventais e Laminas de Bisturi, ao abrigo de Contratos Públicos de Aprovisionamento (CPA's) dos SPMS, com consulta ao Catalogo de Aprov. Público de Saúde ",Ao abrigo de acordo-quadro (art.º 259.º),Aquisição de bens móveis,"33100000-1, Equipamento médico",Administração Regional de Saúde do Alentejo (ARSA) (503148768),"QUILABAN - QUIMICA LABORATORIAL ANALITICA, SA (500399670)","0,47 €",21-06-2018,07-11-2017,150 dias,"Portugal, Évora",Artigo 259.º do Código dos Contratos Públicos,12-12-2017,"47,00 €","","Considerou-se o preço base da unidade, mas no concurso adjudicou-se 100 unidades",,2102851,CP 2016/74 - Acordo quadro para fornecimento de Material disposable de bloco operatório - Parte I-B às Instituições e Serviços do Serviço Nacional de Saúde,FALSE
"Testes de Deteção de Drogas na Urina, ao abrigo do AQ 2015/73",Ao abrigo de acordo-quadro (art.º 259.º),Aquisição de bens móveis,"33600000-6, Produtos farmacêuticos",Administração Regional de Saúde do Alentejo (ARSA) (503148768),"NORMAX FABRICA VIDROS CIENTIFICOS, LDA (500203130)","245,40 €",21-06-2018,13-11-2017,210 dias,"Portugal, Évora",Artigo 259.º do Código dos Contratos Públicos,20-12-2017,"245,40 €","","",,1555404,CP 2015/73 - Acordo quadro para fornecimento de Reagentes - Testes Rápidos às Instituições e Serviços do Serviço Nacional de Saúde,FALSE
"Testes de Deteção de Drogas na Urina, ao abrigo do AQ 2015/73",Ao abrigo de acordo-quadro (art.º 259.º),Aquisição de bens móveis,"33600000-6, Produtos farmacêuticos",Administração Regional de Saúde do Alentejo (ARSA) (503148768),"QUILABAN - QUIMICA LABORATORIAL ANALITICA, SA (500399670)","8.446,55 €",21-06-2018,05-07-2017,210 dias,"Portugal, Évora",Artigo 259.º do Código dos Contratos Públicos,31-12-2017,"8.446,55 €","","",,1555404,CP 2015/73 - Acordo quadro para fornecimento de Reagentes - Testes Rápidos às Instituições e Serviços do Serviço Nacional de Saúde,FALSE
Kit para determinação cilindrospermopsina LSP Portalegre,Ajuste Direto Regime Geral,Aquisição de bens móveis,"33696500-0, Reagentes de laboratório",Administração Regional de Saúde do Alentejo (ARSA) (503148768),"GOMENSORO POTENCIAL ZERO - INSTRUMENTAÇÃO CIENTIFICA, LDA (506704017)","675,00 €",20-06-2018,06-07-2017,90 dias,"Portugal, Portalegre, Portalegre","Artigo 20.º, n.º 1, alínea a) do Código dos Contratos Públicos",19-07-2017,"675,00 €","","",,Não aplicável.,Não aplicável.,FALSE
Componentes de hardware,Ajuste Direto Regime Geral,Aquisição de bens móveis,"30200000-1, Equipamento e material informático",Administração Regional de Saúde do Alentejo (ARSA) (503148768),"NOVABIT - Informática Unipessoal, Lda (503411302)","2.281,78 €",20-06-2018,10-11-2017,90 dias,"Portugal, Évora","Artigo 20.º, n.º 1, alínea a) do Código dos Contratos Públicos",20-11-2017,"2.281,78 €","","",,Não aplicável.,Não aplicável.,FALSE
Aquisição kit para pesquisa Legionella LSP Évora,Ajuste Direto Regime Geral,Aquisição de bens móveis,"33696500-0, Reagentes de laboratório","Administração Regional de Saúde do Alentejo, I. P. (503148768)","Bio-Rad Laboratories, Ldª (501301321)","3.080,00 €",20-06-2018,06-06-2017,90 dias,"Portugal, Évora, Évora","Artigo 20.º, n.º 1, alínea a) do Código dos Contratos Públicos",28-06-2017,"3.080,00 €","","",,Não aplicável.,Não aplicável.,FALSE
Kits PCR legionella pneumophila,Ajuste Direto Regime Geral,Aquisição de bens móveis,"33696500-0, Reagentes de laboratório","Administração Regional de Saúde do Alentejo, I. P. (503148768)","Bio-Rad Laboratories, Ldª (501301321)","3.040,00 €",20-06-2018,09-02-2018,120 dias,"Portugal, Évora, Évora","Artigo 20.º, n.º 1, alínea a) do Código dos Contratos Públicos",22-02-2018,"3.040,00 €","","",,Não aplicável.,Não aplicável.,FALSE
Ensaios de Aptidão - Águas de Piscina LSP Alentejo,Ajuste Direto Regime Geral,Aquisição de serviços,"90000000-7, Serviços relativos a águas residuais, resíduos, limpeza e ambiente","Administração Regional de Saúde do Alentejo, I. P. (503148768)",Relacre (502578874),"840,00 €",20-06-2018,24-10-2017,90 dias,"Portugal, Beja, Beja<BR/>Portugal, Portalegre, Portalegre<BR/>Portugal, Évora, Évora","Artigo 24.º, n.º 1, alínea e) do Código dos Contratos Públicos",27-11-2017,"840,00 €","","",,Não aplicável.,Não aplicável.,FALSE
Meio CCA para LSP Évora,Ajuste Direto Regime Geral,Aquisição de bens móveis,"33696500-0, Reagentes de laboratório","Administração Regional de Saúde do Alentejo, I. P. (503148768)","Type Solution, S.A. (508400317)","561,20 €",20-06-2018,15-12-2017,30 dias,"Portugal, Évora, Évora","Artigo 20.º, n.º 1, alínea a) do Código dos Contratos Públicos",20-12-2017,"561,20 €","","",,Não aplicável.,Não aplicável.,FALSE
Aquisição de material de hotelaria,Ajuste Direto Regime Geral,Aquisição de bens móveis,"19500000-1, Materiais de plástico e de borracha","Administração Regional de Saúde do Alentejo, I. P. (503148768)",CSH - Comércio Serviço Higiene Lda (504346091),"1.718,40 €",20-06-2018,15-12-2017,60 dias,"Portugal, Évora","Artigo 20.º, n.º 1, alínea a) do Código dos Contratos Públicos",27-12-2017,"1.718,40 €","","",,Não aplicável.,Não aplicável.,FALSE
Desenvolvimento aplicação Innux Time e Webtime,Ajuste Direto Regime Geral,Aquisição de serviços,"72260000-5, Serviços relacionados com software",Administração Regional de Saúde do Alentejo (ARSA) (503148768),"Projecttime - Distribuição de Equipamentos Electronicos, Lda. (506882918)","1.950,00 €",20-06-2018,10-11-2017,90 dias,"Portugal, Évora","Artigo 20.º, n.º 1, alínea a) do Código dos Contratos Públicos",05-12-2017,"1.950,00 €","","",,Não aplicável.,Não aplicável.,FALSE
Tubos Grafite - LSP Portalegre,Ajuste Direto Regime Geral,Aquisição de bens móveis,"33696500-0, Reagentes de laboratório",Administração Regional de Saúde do Alentejo (ARSA) (503148768),"I.L.C. SERVICOS - MANUT, ASSIST e CONTROLO (504721410)","1.682,10 €",19-06-2018,23-10-2017,90 dias,"Portugal, Portalegre, Portalegre","Artigo 20.º, n.º 1, alínea a) do Código dos Contratos Públicos",08-11-2017,"1.682,10 €","","",,Não aplicável.,Não aplicável.,FALSE
Aquisição de Imunoglobulina Humana,Ao abrigo de acordo-quadro (art.º 259.º),Aquisição de bens móveis,"33600000-6, Produtos farmacêuticos","Administração Regional de Saúde do Alentejo, I. P. (503148768)","CSL BEHRING, Lda. (503047201)","1.647,00 €",19-06-2018,05-06-2018,183 dias,"Portugal, Évora",Artigo 259.º do Código dos Contratos Públicos,07-06-2018,"1.647,00 €","","",,2800702,CP 2017/9 - Acordo quadro para fornecimento de Derivados do Plasma Humano às Instituições e Serviços do Serviço Nacional de Saúde,FALSE
Reparação desmineralizador LSP Évora,Ajuste Direto Regime Geral,Aquisição de serviços,"50400000-9, Serviços de reparação e manutenção de equipamento médico e de precisão",Administração Regional de Saúde do Alentejo (ARSA) (503148768),Enkrott (500103461),"333,60 €",19-06-2018,23-10-2017,90 dias,"Portugal, Évora, Évora","Artigo 20.º, n.º 1, alínea a) do Código dos Contratos Públicos",28-12-2017,"333,60 €","","",,Não aplicável.,Não aplicável.,FALSE
Material de Saúde Oral,Ajuste Direto Regime Geral,Aquisição de bens móveis,"33000000-0, Equipamento médico, medicamentos e produtos para cuidados pessoais","Administração Regional de Saúde do Alentejo, I. P. (503148768)","Speculum - Artigos Médicos, S.A. (502996323)","195,88 €",19-06-2018,10-07-2017,183 dias,"Portugal, Évora, Portel<BR/>Portugal, Évora, Estremoz<BR/>Portugal, Évora, Évora<BR/>Portugal, Évora, Montemor-o-Novo","Artigo 20.º, n.º 1, alínea a) do Código dos Contratos Públicos",28-11-2017,"195,88 €","","",,Não aplicável.,Não aplicável.,FALSE
Aquisição de Material de Saúde Oral,Ajuste Direto Regime Geral,Aquisição de bens móveis,"33000000-0, Equipamento médico, medicamentos e produtos para cuidados pessoais","Administração Regional de Saúde do Alentejo, I. P. (503148768)","EZEQUIEL PANAO JORGE, LDA (501412727)","67,25 €",19-06-2018,09-10-2017,183 dias,"Portugal, Évora, Portel<BR/>Portugal, Évora, Montemor-o-Novo<BR/>Portugal, Évora, Estremoz<BR/>Portugal, Évora, Évora","Artigo 20.º, n.º 1, alínea a) do Código dos Contratos Públicos",09-10-2017,"67,25 €","","",,Não aplicável.,Não aplicável.,FALSE
Material de Saúde Oral,Ajuste Direto Regime Geral,Aquisição de bens móveis,"33000000-0, Equipamento médico, medicamentos e produtos para cuidados pessoais","Administração Regional de Saúde do Alentejo, I. P. (503148768)","Compañia Dental de Venta Direta, SA (980187036)","5.841,43 €",19-06-2018,10-07-2017,183 dias,"Portugal, Évora, Montemor-o-Novo<BR/>Portugal, Évora, Évora<BR/>Portugal, Évora, Portel<BR/>Portugal, Évora, Estremoz","Artigo 20.º, n.º 1, alínea a) do Código dos Contratos Públicos",29-12-2017,"5.336,97 €","",As peças de mão foram substituídas por outras de valor inferior,,Não aplicável.,Não aplicável.,FALSE
Aquisição de Material de Saúde Oral,Ajuste Direto Regime Geral,Aquisição de bens móveis,"33000000-0, Equipamento médico, medicamentos e produtos para cuidados pessoais","Administração Regional de Saúde do Alentejo, I. P. (503148768)",Casa Schmidt Portugal Lda (503206261),"5.529,47 €",19-06-2018,10-07-2017,183 dias,"Portugal, Évora, Portel<BR/>Portugal, Évora, Estremoz<BR/>Portugal, Évora, Évora<BR/>Portugal, Évora, Montemor-o-Novo","Artigo 20.º, n.º 1, alínea a) do Código dos Contratos Públicos",19-09-2017,"5.334,96 €","",Acerto das quantidades com as embalagens fornecidas,,Não aplicável.,Não aplicável.,FALSE
TESTES DE DETEÇÃO DE DROGAS E OUTRO MATERIAL PARA OS CRI'S DO DICAD,Ajuste Direto Regime Geral,Aquisição de bens móveis,"33600000-6, Produtos farmacêuticos","Administração Regional de Saúde do Alentejo, I. P. (503148768)","TECNIQUITEL-Sociedade Equipamentos Técnicos, Lda (500663300)","390,00 €",18-06-2018,08-11-2017,230 dias,"Portugal, Évora","Artigo 20.º, n.º 1, alínea a) do Código dos Contratos Públicos","","","","",,Não aplicável.,Não aplicável.,FALSE
TESTES DE DETEÇÃO DE DROGAS E OUTRO MATERIAL PARA OS CRI'S DO DICAD,Ajuste Direto Regime Geral,Aquisição de bens móveis,"33600000-6, Produtos farmacêuticos","Administração Regional de Saúde do Alentejo, I. P. (503148768)","EZEQUIEL PANAO JORGE, LDA (501412727)","75,57 €",18-06-2018,08-11-2017,230 dias,"Portugal, Évora","Artigo 20.º, n.º 1, alínea a) do Código dos Contratos Públicos","","","","",,Não aplicável.,Não aplicável.,FALSE
TESTES DE DETEÇÃO DE DROGAS E OUTRO MATERIAL PARA OS CRI'S DO DICAD,Ajuste Direto Regime Geral,Aquisição de bens móveis,"33600000-6, Produtos farmacêuticos","Administração Regional de Saúde do Alentejo, I. P. (503148768)","MADIL, Lda. (502907363)","3.348,00 €",18-06-2018,08-11-2017,230 dias,"Portugal, Évora","Artigo 20.º, n.º 1, alínea a) do Código dos Contratos Públicos","","","","",,Não aplicável.,Não aplicável.,FALSE
TESTES DE DETEÇÃO DE DROGAS E OUTRO MATERIAL PARA OS CRI'S DO DICAD,Ajuste Direto Regime Geral,Aquisição de bens móveis,"33600000-6, Produtos farmacêuticos",Administração Regional de Saúde do Alentejo (ARSA) (503148768),"QUILABAN - QUIMICA LABORATORIAL ANALITICA, SA (500399670)","4.927,09 €",18-06-2018,05-07-2017,230 dias,"Portugal, Évora","Artigo 20.º, n.º 1, alínea a) do Código dos Contratos Públicos",29-12-2017,"4.927,09 €","","",,Não aplicável.,Não aplicável.,FALSE
Aquisição de gás para absorção atómica - LSP Portalegre,Ajuste Direto Regime Geral,Aquisição de serviços,"65200000-5, Serviços de distribuição de gás e serviços conexos","Administração Regional de Saúde do Alentejo, I. P. (503148768)","AIR LIQUIDE MEDICINAL, SA (501576436)","1.979,46 €",14-06-2018,06-07-2017,214 dias,"Portugal, Portalegre, Portalegre","Artigo 20.º, n.º 1, alínea a) do Código dos Contratos Públicos",31-12-2017,"1.319,64 €","",Não foi necessário a aquisição de todo o gás inicialmente adjudicado,,Não aplicável.,Não aplicável.,FALSE
Contratação de serviços para substituição de membrana osmose e das sondas de qualidade do equipamento de purificação de água do LSP Alentejo - Pólo de Évora,Ajuste Direto Regime Geral,Aquisição de serviços,"50400000-9, Serviços de reparação e manutenção de equipamento médico e de precisão",Administração Regional de Saúde do Alentejo (ARSA) (503148768),Enkrott (500103461),"887,53 €",14-06-2018,19-05-2017,60 dias,"Portugal, Évora, Évora","Artigo 20.º, n.º 1, alínea a) do Código dos Contratos Públicos",31-05-2017,"887,53 €","","",,Não aplicável.,Não aplicável.,FALSE
Aquisição frascos de colheita água LSP Évora,Ajuste Direto Regime Geral,Aquisição de bens móveis,"33793000-5, Artigos de vidro para laboratório",Administração Regional de Saúde do Alentejo (ARSA) (503148768),"Normax - Fabrica de Vidros Cientificos, Lda. (500203130)","276,00 €",14-06-2018,30-05-2017,60 dias,"Portugal, Évora, Évora","Artigo 20.º, n.º 1, alínea a) do Código dos Contratos Públicos",05-06-2017,"276,00 €","","",,Não aplicável.,Não aplicável.,FALSE
Manutenção do equipamento de purificação de água e aquisição de consumíveis para o seu funcionamento,Ajuste Direto Regime Geral,Aquisição de serviços,"50000000-5, Serviços de reparação e manutenção","Administração Regional de Saúde do Alentejo, I. P. (503148768)",Millipore S.A.S. (59434691192),"1.635,79 €",14-06-2018,17-01-2018,90 dias,"Portugal, Portalegre, Portalegre","Artigo 24.º, n.º 1, alínea e) do Código dos Contratos Públicos",24-01-2018,"1.635,79 €","","",,Não aplicável.,Não aplicável.,FALSE
Manutenção Espectrofotómetro de absorção atómica,Ajuste Direto Regime Geral,Aquisição de serviços,"50400000-9, Serviços de reparação e manutenção de equipamento médico e de precisão",Administração Regional de Saúde do Alentejo (ARSA) (503148768),"I.L.C. SERVICOS - MANUT, ASSIST e CONTROLO (504721410)","1.388,00 €",14-06-2018,30-05-2017,214 dias,"Portugal, Portalegre, Portalegre","Artigo 20.º, n.º 1, alínea a) do Código dos Contratos Públicos",31-05-2017,"1.388,00 €","","",,Não aplicável.,Não aplicável.,FALSE
Manutenção Desmineralizador LSP Évora,Ajuste Direto Regime Geral,Aquisição de serviços,"50400000-9, Serviços de reparação e manutenção de equipamento médico e de precisão",Administração Regional de Saúde do Alentejo (ARSA) (503148768),Enkrott (500103461),"3.639,61 €",14-06-2018,30-05-2017,214 dias,"Portugal, Évora, Évora","Artigo 24.º, n.º 1, alínea e) do Código dos Contratos Públicos",28-12-2017,"2.062,77 €","",Não foi necessário aquisição de todos os consumíveis para o funcionamento do Desmineralizador,,Não aplicável.,Não aplicável.,FALSE
Manutenção espectrofotómetros de absorção molecular,Ajuste Direto Regime Geral,Aquisição de serviços,"50400000-9, Serviços de reparação e manutenção de equipamento médico e de precisão",Administração Regional de Saúde do Alentejo (ARSA) (503148768),"Unicam-Sistemas Analíticos, Lda (502614625)","1.760,00 €",13-06-2018,30-05-2017,60 dias,"Portugal, Portalegre, Portalegre<BR/>Portugal, Évora, Évora","Artigo 24.º, n.º 1, alínea e) do Código dos Contratos Públicos",23-06-2017,"1.760,00 €","","",,Não aplicável.,Não aplicável.,FALSE
Manutenção autoclaves,Ajuste Direto Regime Geral,Aquisição de serviços,"50400000-9, Serviços de reparação e manutenção de equipamento médico e de precisão",Administração Regional de Saúde do Alentejo (ARSA) (503148768),"A.J.Costa (Irmãos), Lda (500002576)","5.202,00 €",13-06-2018,19-05-2017,214 dias,"Portugal, Portalegre<BR/>Portugal, Évora","Artigo 20.º, n.º 1, alínea a) do Código dos Contratos Públicos",31-07-2017,"5.202,00 €","","",,Não aplicável.,Não aplicável.,FALSE
Aquisição de 6 computador portátil com ecrã destacável,Ao abrigo de acordo-quadro (art.º 259.º),Aquisição de bens móveis,"30236000-2, Equipamento informático diverso","Administração Regional de Saúde do Alentejo, I. P. (503148768)","BASEDOIS - Informática e Telecomunicações, Lda. (501333401)","4.800,00 €",13-06-2018,22-12-2017,120 dias,"Portugal, Évora, Évora",Artigo 259.º do Código dos Contratos Públicos,23-03-2018,"4.800,00 €","","",,1196657,Acordo Quadro para aquisição e aluguer operacional de equipamento informático,FALSE
Manutenção câmaras fluxo laminar e Hotte,Ajuste Direto Regime Geral,Aquisição de serviços,"50400000-9, Serviços de reparação e manutenção de equipamento médico e de precisão",Administração Regional de Saúde do Alentejo (ARSA) (503148768),"INTERFACE - EQUIPAMENTO  E TECNICA , LDA (501379860)","1.795,00 €",13-06-2018,29-05-2017,60 dias,"Portugal, Évora<BR/>Portugal, Portalegre","Artigo 20.º, n.º 1, alínea a) do Código dos Contratos Públicos",20-12-2017,"1.795,00 €",Lapso na inserção do prazo de execução do contrato; Correctamente seria 214 dias,"",,Não aplicável.,Não aplicável.,FALSE
Material de referência,Ajuste Direto Regime Geral,Aquisição de bens móveis,"33696300-8, Reagentes químicos","Administração Regional de Saúde do Alentejo, I. P. (503148768)","NORMAX FABRICA VIDROS CIENTIFICOS, LDA (500203130)","2.688,00 €",12-06-2018,05-05-2017,60 dias,"Portugal, Évora<BR/>Portugal, Portalegre","Artigo 20.º, n.º 1, alínea a) do Código dos Contratos Públicos",29-05-2017,"2.688,00 €","","",,Não aplicável.,Não aplicável.,FALSE
Reparação do Hott do Sector da Química de Águas,Ajuste Direto Regime Geral,Aquisição de serviços,"50400000-9, Serviços de reparação e manutenção de equipamento médico e de precisão",Administração Regional de Saúde do Alentejo (ARSA) (503148768),"INTERFACE - EQUIPAMENTO  E TECNICA , LDA (501379860)","1.018,00 €",12-06-2018,23-03-2017,60 dias,"Portugal, Portalegre","Artigo 20.º, n.º 1, alínea a) do Código dos Contratos Públicos",06-06-2017,"599,00 €","",Não foi necessário reparar ou substituir todos os filtros de carvão,,Não aplicável.,Não aplicável.,FALSE
Aquisição Centralizada de Material de Penso de efeito terapêutico para 2017 - SPMS,Ao abrigo de acordo-quadro (art.º 259.º),Aquisição de bens móveis,"33600000-6, Produtos farmacêuticos","Administração Regional de Saúde do Alentejo, I. P. (503148768)","KVTECH PORTUGAL - PROD. MEDICOS UNIP., LDA (508671531)","17.808,00 €",12-06-2018,08-08-2017,304 dias,"Portugal, Évora",Artigo 259.º do Código dos Contratos Públicos,19-12-2017,"17.808,00 €","","",,1315192,Acordo Quadro para fornecimento de material de penso de efeito terapêutico às Instituições e Serviços do Serviço Nacional de Saúde,FALSE
Aquisição Centralizada de Material de Penso de efeito terapêutico para 2017 - SPMS,Ao abrigo de acordo-quadro (art.º 259.º),Aquisição de bens móveis,"33600000-6, Produtos farmacêuticos","Administração Regional de Saúde do Alentejo, I. P. (503148768)","JOHNSON & JOHNSON, LDA (500153370)","514,00 €",12-06-2018,10-11-2017,304 dias,"Portugal, Évora",Artigo 259.º do Código dos Contratos Públicos,29-12-2017,"","",Os Bens não foram fornecidos,,1315192,Acordo Quadro para fornecimento de material de penso de efeito terapêutico às Instituições e Serviços do Serviço Nacional de Saúde,FALSE
Aquisição Centralizada de Material de Penso de efeito terapêutico para 2017 - SPMS,Ao abrigo de acordo-quadro (art.º 259.º),Aquisição de bens móveis,"33600000-6, Produtos farmacêuticos","Administração Regional de Saúde do Alentejo, I. P. (503148768)","MEDICINALIA-CORMEDICA, LDA (500684324)","2.630,00 €",12-06-2018,13-09-2017,304 dias,"Portugal, Évora",Artigo 259.º do Código dos Contratos Públicos,19-12-2017,"2.630,00 €","","",,1315192,Acordo Quadro para fornecimento de material de penso de efeito terapêutico às Instituições e Serviços do Serviço Nacional de Saúde,FALSE
Aquisição Centralizada de Material de Penso de efeito Terapêutico para 2017 - SPMS,Ao abrigo de acordo-quadro (art.º 259.º),Aquisição de bens móveis,"33600000-6, Produtos farmacêuticos","Administração Regional de Saúde do Alentejo, I. P. (503148768)","CLINIFAR - PROD. CLINICOS E FARMACEUTICOS, S.A. (503281115)","5.244,71 €",12-06-2018,08-08-2017,304 dias,"Portugal, Évora",Artigo 259.º do Código dos Contratos Públicos,31-12-2017,"5.172,16 €","",Acerto às quantidades das Embalagens fornecidas,,1315192,Acordo Quadro para fornecimento de material de penso de efeito terapêutico às Instituições e Serviços do Serviço Nacional de Saúde,FALSE
