freguesia,acronym,validVotesPercentage,votes,dicofre
Lanheses,PPD/PSD,43.22,354,160915
Lanheses,PS,32.72,268,160915
Lanheses,B.E.,9.4,77,160915
Lanheses,CDS-PP,4.88,40,160915
Lanheses,PCP-PEV,1.83,15,160915
Lanheses,PAN,1.59,13,160915
Lanheses,JPP,0.98,8,160915
Lanheses,A,0.85,7,160915
Lanheses,L,0.85,7,160915
Lanheses,CH,0.73,6,160915
Lanheses,IL,0.73,6,160915
Lanheses,R.I.R.,0.73,6,160915
Lanheses,PDR,0.49,4,160915
Lanheses,NC,0.24,2,160915
Lanheses,PURP,0.24,2,160915
Lanheses,MPT,0.12,1,160915
Lanheses,PCTP/MRPP,0.12,1,160915
Lanheses,PNR,0.12,1,160915
Lanheses,PTP,0.12,1,160915
Lanheses,PPM,0,0,160915
