Objeto do Contrato,Tipo de Procedimento,Tipo(s) de Contrato,CPVs,Entidade(s) Adjudicante(s),Entidade(s) Adjudicatária(s),Preço Contratual,Data de Publicação,Data de Celebração do Contrato,Prazo de Execução,Local de Execução,Fundamentação,Data de Fecho do Contrato,Preço Total Efetivo,Causas das Alterações ao Prazo,Causas das Alterações ao Preço,Estado,N.º registo do Acordo Quadro,Descrição do Acordo Quadro,Procedimento Centralizado
DM Infusores p/ citostáticos Cópia,Ajuste Direto Regime Geral,Aquisição de bens móveis,"33000000-0, Equipamento médico, medicamentos e produtos para cuidados pessoais","Centro Hospitalar Barreiro Montijo, E. P. E. (509186998)","B. BRAUN MEDICAL, LDA (501506543)","9.219,50 €",02-03-2016,31-12-2014,365 dias,"Portugal, Setúbal, Barreiro","Artigo 20.º, n.º 1, alínea a) do Código dos Contratos Públicos",31-12-2015,"5.812,00 €",,redução de consumos,,Não aplicável.,Não aplicável.,FALSE
Filtros de ar para citostáticos,Ao abrigo de acordo-quadro (art.º 259.º),Aquisição de bens móveis,"33000000-0, Equipamento médico, medicamentos e produtos para cuidados pessoais","Centro Hospitalar Barreiro Montijo, E. P. E. (509186998)","CODAN 11, S.A. PORTUGAL (504923471)","393,00 €",02-03-2016,07-04-2015,365 dias,"Portugal<BR/>Portugal, Setúbal, Barreiro","Artigo 20.º, n.º 1, alínea b) do Código dos Contratos Públicos",31-12-2015,"393,00 €",,"",,552526,"CONCURSO PÚBLICO PARA A CELEBRAÇÃO DE CONTRATOS PÚBLICOS DE APROVISIONAMENTO PARA A ÁREA DA SAÚDE, COM VISTA AO FORNECIMENTO DE DISPOSITIVOS MÉDICOS DIVERSOS",FALSE
Luvas para citostáticos,Ao abrigo de acordo-quadro (art.º 259.º),Aquisição de bens móveis,"33000000-0, Equipamento médico, medicamentos e produtos para cuidados pessoais","Centro Hospitalar Barreiro Montijo, E. P. E. (509186998)",PERGUT PORTUGAL (501799729),"2.500,00 €",02-03-2016,07-04-2015,365 dias,"Portugal, Setúbal, Barreiro","Artigo 20.º, n.º 1, alínea b) do Código dos Contratos Públicos",31-12-2015,"1.400,00 €",,redução de consumos,,178091,CONCURSO PÚBLICO PARA A CELEBRAÇÃO DE CONTRATOS PÚBLICOS DE APROVISIONAMENTO PARA AQUISIÇÃO DE LUVAS PARA USO MÉDICO,FALSE
4SI0022/2015 PREST SERV MED ANESTESIA P MES MARÇO (P COLMATAR FALHAS),Ao abrigo de acordo-quadro (art.º 259.º),Aquisição de serviços,"85000000-9, Serviços de saúde e acção social","Centro Hospitalar Barreiro Montijo, E. P. E. (509186998)","GS24 - HEALTHCARE SOLUTIONS, SA (507824652)","1.020,00 €",02-03-2016,09-04-2015,30 dias,"Portugal, Setúbal, Barreiro",Artigo 259.º do Código dos Contratos Públicos,27-05-2015,"1.020,00 €",,"",,454020,"CONCURSO PÚBLICO PARA A CELEBRAÇÃO DE CONTRATOS PÚBLICOS DE APROVISIONAMENTO PARA A ÁREA DA SAÚDE, COM VISTA À PRESTAÇÃO DE SERVIÇOS MÉDICOS ÀS INSTITUIÇÕES E SERVIÇOS DO SERVIÇO NACIONAL DE SAÚDE",FALSE
Dispositivos médicos de cardiologia,Ajuste Direto Regime Geral,Aquisição de bens móveis,"33000000-0, Equipamento médico, medicamentos e produtos para cuidados pessoais","CHBM - Centro Hospital Barreiro Montijo, EPE (509186998)",ST. JUDE MEDICAL (504180746),"6.220,50 €",02-03-2016,08-05-2015,365 dias,"Portugal, Setúbal, Barreiro","Artigo 20.º, n.º 1, alínea a) do Código dos Contratos Públicos",31-12-2015,"",,não necessario,,Não aplicável.,Não aplicável.,FALSE
Dispositivos medico de cardiologia,Ajuste Direto Regime Geral,Aquisição de bens móveis,"33000000-0, Equipamento médico, medicamentos e produtos para cuidados pessoais","CHBM - Centro Hospital Barreiro Montijo, EPE (509186998)","CLINIFAR - PROD. CLINICOS E FARMACEUTICOS, S.A. (503281115)","2.899,00 €",02-03-2016,08-05-2015,365 dias,"Portugal, Setúbal, Barreiro","Artigo 20.º, n.º 1, alínea a) do Código dos Contratos Públicos",31-12-2015,"",,não necessário,,Não aplicável.,Não aplicável.,FALSE
40020/2015 Dm Para Cardiologia,Ajuste Direto Regime Geral,Aquisição de bens móveis,"33000000-0, Equipamento médico, medicamentos e produtos para cuidados pessoais","CHBM - Centro Hospital Barreiro Montijo, EPE (509186998)","TELEFLEX MEDICAL, S.A. (980249783)","1.627,75 €",02-03-2016,08-05-2015,365 dias,"Portugal, Setúbal, Barreiro","Artigo 20.º, n.º 1, alínea a) do Código dos Contratos Públicos",31-12-2015,"",,não necessario,,Não aplicável.,Não aplicável.,FALSE
Dm Para Cardiologia,Ajuste Direto Regime Geral,Aquisição de bens móveis,"33000000-0, Equipamento médico, medicamentos e produtos para cuidados pessoais","CHBM - Centro Hospital Barreiro Montijo, EPE (509186998)",ST. JUDE MEDICAL (504180746),"600,00 €",02-03-2016,08-05-2015,365 dias,"Portugal, Setúbal, Barreiro","Artigo 20.º, n.º 1, alínea a) do Código dos Contratos Públicos",31-12-2015,"600,00 €",,redução de consumos,,Não aplicável.,Não aplicável.,FALSE
4D0232-2015 SENSORES,Ajuste Direto Regime Geral,Aquisição de bens móveis,"33000000-0, Equipamento médico, medicamentos e produtos para cuidados pessoais","Centro Hospitalar Barreiro Montijo, E. P. E. (509186998)",MASIMO INTERNATIONAL SARL (FILIAL NEDERLAND) (NL821023548B),"4.180,00 €",02-03-2016,31-12-2015,365 dias,"Portugal, Setúbal, Barreiro","Artigo 20.º, n.º 1, alínea a) do Código dos Contratos Públicos",31-12-2015,"4.180,00 €",,"",,Não aplicável.,Não aplicável.,FALSE
"Sondas, tubos endotraqueais e agulhas de esclerose",Ajuste Direto Regime Geral,Aquisição de bens móveis,"33000000-0, Equipamento médico, medicamentos e produtos para cuidados pessoais","Centro Hospitalar Barreiro Montijo, E. P. E. (509186998)","ENDOTÉCNICA - MATERIAL CIRURGICO, LDA. (503818348)","7.575,72 €",01-03-2016,15-05-2015,365 dias,"Portugal, Setúbal, Barreiro","Artigo 20.º, n.º 1, alínea a) do Código dos Contratos Públicos",31-12-2015,"2.546,00 €",,não necessidade de alguns artigos,,Não aplicável.,Não aplicável.,FALSE
S10006/2015 Fornecimento de Serviços Médicos de Cirurgia Pediatrica,Concurso público,Aquisição de serviços,"85100000-0, Serviços de saúde","Centro Hospitalar Barreiro Montijo, E. P. E. (509186998)","ALONBER - CONSULTA E SERVIÇOS, LDA (503783862)","15.500,00 €",01-03-2016,14-09-2015,220 dias,"Portugal, Setúbal, Barreiro","Artigo 20.º, n.º 1, alínea b) do Código dos Contratos Públicos",31-12-2015,"14.630,00 €",,Nº de atos realizados inferior ao inicialmente previsto,,Não aplicável.,Não aplicável.,FALSE
Mascaras para ventiladores e bipap,Ajuste Direto Regime Geral,Aquisição de bens móveis,"33000000-0, Equipamento médico, medicamentos e produtos para cuidados pessoais","CHBM - Centro Hospital Barreiro Montijo, EPE (509186998)","LINDE SAUDE, LDA. (500125546)","7.551,00 €",01-03-2016,28-05-2015,365 dias,"Portugal, Setúbal, Barreiro","Artigo 20.º, n.º 1, alínea a) do Código dos Contratos Públicos",31-12-2015,"7.551,00 €",,redução de consumos,,Não aplicável.,Não aplicável.,FALSE
Kits para bomba de insulina,Ao abrigo de acordo-quadro (art.º 259.º),Aquisição de bens móveis,"33000000-0, Equipamento médico, medicamentos e produtos para cuidados pessoais","Centro Hospitalar Barreiro Montijo, E. P. E. (509186998)","ROCHE SISTEMAS DE DIAGNOSTICO-SOC. UNIPESSOAL, Lda (504282921)","16.614,00 €",01-03-2016,26-02-2015,365 dias,"Portugal, Setúbal, Barreiro","Artigo 20.º, n.º 1, alínea b) do Código dos Contratos Públicos",31-12-2015,"14.451,57 €",,redução de consumo,,382570,CONCURSO PÚBLICO PARA A CELEBRAÇÃO DE CONTRATOS PÚBLICOS DE APROVISIONAMENTO PARA AQUISIÇÃO BOMBAS DE PERFUSÃO SUBCUTANEA CONTINUA DE INSULINA E RESPECTIVOS CONSUMÍVEIS,FALSE
Bombas de perfusão de insulina e consumiveis,Ao abrigo de acordo-quadro (art.º 259.º),Aquisição de bens móveis,"33000000-0, Equipamento médico, medicamentos e produtos para cuidados pessoais","Centro Hospitalar Barreiro Montijo, E. P. E. (509186998)","ROCHE SISTEMAS DE DIAGNOSTICO-SOC. UNIPESSOAL, Lda (504282921)","8.901,65 €",01-03-2016,28-05-2015,365 dias,"Portugal, Setúbal, Barreiro","Artigo 20.º, n.º 1, alínea b) do Código dos Contratos Públicos",31-12-2015,"8.901,65 €",,"",,382570,CONCURSO PÚBLICO PARA A CELEBRAÇÃO DE CONTRATOS PÚBLICOS DE APROVISIONAMENTO PARA AQUISIÇÃO BOMBAS DE PERFUSÃO SUBCUTANEA CONTINUA DE INSULINA E RESPECTIVOS CONSUMÍVEIS,FALSE
4CPS0001/2015 Serviços Médicos de Gastrenterologia - MCDT para ano 2015,Ajuste Direto Regime Geral,Aquisição de serviços,"85000000-9, Serviços de saúde e acção social","Centro Hospitalar Barreiro Montijo, E. P. E. (509186998)","FOCO POSITIVO - ACTIVIDADES MÉDICAS, LDA (509620426)","14.882,50 €",01-03-2016,09-09-2015,220 dias,"Portugal, Setúbal, Barreiro","Artigo 27.º, n.º 1, alínea a) do Código dos Contratos Públicos",31-12-2015,"10.629,00 €",,Nº exames realizados inferior ao inicialmente estimado,,Não aplicável.,Não aplicável.,FALSE
40003-2015 SISTEMAS-PROLONGAMENTOS,Ajuste Direto Regime Geral,Aquisição de bens móveis,"33194120-3, Material de infusão","CHBM - Centro Hospital Barreiro Montijo, EPE (509186998)","MUNDINTER (500199906), COVIDIEN PORTUGAL-PROD. SAÚDE, UNIP., LDA (503413410), H.R. - HOSPITALAR, UNIPESSOAL, LDA. (501895558), P.M.H. - PROD. MEDICOS HOSPITALARES, LDA. (502376899), AVIQUIMICA-IMPORT. E MANUF., L (500039720), CAREFUSION PORTUGAL 332 (503898554), B. BRAUN MEDICAL, LDA (501506543)","14.205,06 €",01-03-2016,19-01-2015,365 dias,"Portugal, Setúbal, Barreiro","Artigo 20.º, n.º 1, alínea a) do Código dos Contratos Públicos",31-12-2015,"14.205,06 €",,"",,Não aplicável.,Não aplicável.,FALSE
40079-2016 SISTEMA GESTAO ARMAZENAMENTO DE INFORMAÇAO,Ajuste Direto Regime Geral,Aquisição de bens móveis,"48800000-6, Sistemas de informação e servidores","CHBM - Centro Hospital Barreiro Montijo, EPE (509186998)","ITEN SOLUTIONS -SISTEMAS INFORMAÇÃO,S.A (EX CPC.IS (510728189)","9.995,14 €",29-02-2016,28-01-2016,30 dias,"Portugal, Setúbal, Barreiro","Artigo 20.º, n.º 1, alínea a) do Código dos Contratos Públicos","","",,"",,Não aplicável.,Não aplicável.,FALSE
40078-2016 SISTEMA DE GESTAO DE BECKUPS,Ajuste Direto Regime Geral,Aquisição de bens móveis,"48800000-6, Sistemas de informação e servidores","CHBM - Centro Hospital Barreiro Montijo, EPE (509186998)","ITEN SOLUTIONS -SISTEMAS INFORMAÇÃO,S.A (EX CPC.IS (510728189)","9.998,00 €",29-02-2016,28-01-2016,30 dias,"Portugal, Setúbal, Barreiro","Artigo 20.º, n.º 1, alínea a) do Código dos Contratos Públicos",28-01-2016,"9.998,00 €",,"",,Não aplicável.,Não aplicável.,FALSE
4I0025-2016 FRALDAS DE ADULTO,Ajuste Direto Regime Geral,Aquisição de bens móveis,"33000000-0, Equipamento médico, medicamentos e produtos para cuidados pessoais","Centro Hospitalar Barreiro Montijo, E. P. E. (509186998)","ALBINO DIAS DE ANDRADE, LDA (500013810)","2.424,00 €",29-02-2016,27-01-2016,20 dias,"Portugal, Setúbal, Barreiro","Artigo 20.º, n.º 1, alínea a) do Código dos Contratos Públicos",27-01-2016,"2.424,00 €",,"",,Não aplicável.,Não aplicável.,FALSE
4I0025-2016 CATETER JUGULAR,Ajuste Direto Regime Geral,Aquisição de bens móveis,"33000000-0, Equipamento médico, medicamentos e produtos para cuidados pessoais","Centro Hospitalar Barreiro Montijo, E. P. E. (509186998)","VYGON (PORTUGAL), LDA. (503232785)","159,60 €",29-02-2016,26-01-2016,20 dias,"Portugal, Setúbal, Barreiro","Artigo 20.º, n.º 1, alínea a) do Código dos Contratos Públicos",26-01-2016,"159,60 €",,"",,Não aplicável.,Não aplicável.,FALSE
4I0025-2016 AGULHAS C ALETAS,Ajuste Direto Regime Geral,Aquisição de bens móveis,"33000000-0, Equipamento médico, medicamentos e produtos para cuidados pessoais","Centro Hospitalar Barreiro Montijo, E. P. E. (509186998)","OVERPHARMA - PROD. MÉDICOS E FARMACÊUTICOS, LDA. (505792362)","391,79 €",29-02-2016,25-01-2016,20 dias,"Portugal, Setúbal, Barreiro","Artigo 20.º, n.º 1, alínea a) do Código dos Contratos Públicos",25-01-2016,"391,79 €",,"",,Não aplicável.,Não aplicável.,FALSE
"S10012/2015 Fornecimento de Serviços de Transporte de Doentes ao CHBM, EPE",Concurso público,Aquisição de serviços,"85143000-3, Serviços de ambulâncias","CHBM - Centro Hospital Barreiro Montijo, EPE (509186998)","Palvidas - Transporte de doentes, Lda. (503253227)","197.600,00 €",29-02-2016,07-09-2015,140 dias,"Portugal, Setúbal, Barreiro","Artigo 20.º, n.º 1, alínea b) do Código dos Contratos Públicos",31-12-2015,"196.970,58 €",,Consumo real inferior ao inicialmente estimado,,Não aplicável.,Não aplicável.,FALSE
4I0025-2016 CATERTER C AGULHA E SERINGAS,Ajuste Direto Regime Geral,Aquisição de bens móveis,"33000000-0, Equipamento médico, medicamentos e produtos para cuidados pessoais","Centro Hospitalar Barreiro Montijo, E. P. E. (509186998)","B. BRAUN MEDICAL, LDA (501506543)","5.714,57 €",29-02-2016,25-01-2016,20 dias,"Portugal, Setúbal, Barreiro","Artigo 20.º, n.º 1, alínea a) do Código dos Contratos Públicos",25-01-2016,"5.714,57 €",,"",,Não aplicável.,Não aplicável.,FALSE
4S0038/2015 Serviço de Transporte de Doentes,Ajuste Direto Regime Geral,Aquisição de serviços,"85143000-3, Serviços de ambulâncias","Centro Hospitalar Barreiro Montijo, E. P. E. (509186998)","Palvidas - Transporte de Doentes, Lda. (503253227)","48.000,00 €",29-02-2016,26-08-2015,30 dias,"Portugal, Setúbal, Barreiro","Artigo 20.º, n.º 1, alínea a) do Código dos Contratos Públicos",31-08-2015,"47.975,48 €",,Quantidades consumidas inferiores às quantidades inicialmente estimadas,,Não aplicável.,Não aplicável.,FALSE
4I0025-2016 BATAS E AVENTAIS DESCARTAVEIS,Ajuste Direto Regime Geral,Aquisição de bens móveis,"33000000-0, Equipamento médico, medicamentos e produtos para cuidados pessoais","Centro Hospitalar Barreiro Montijo, E. P. E. (509186998)","BASTOS VIEGAS, S.A. (500042772)","592,20 €",29-02-2016,27-01-2016,20 dias,"Portugal, Setúbal, Barreiro","Artigo 20.º, n.º 1, alínea a) do Código dos Contratos Públicos",27-01-2016,"592,20 €",,"",,Não aplicável.,Não aplicável.,FALSE
4I0025-2016 LANCETAS P DIABETES,Ajuste Direto Regime Geral,Aquisição de bens móveis,"33000000-0, Equipamento médico, medicamentos e produtos para cuidados pessoais","Centro Hospitalar Barreiro Montijo, E. P. E. (509186998)","ROCHE SISTEMAS DE DIAGNOSTICO-SOC. UNIPESSOAL, Lda (504282921)","772,00 €",29-02-2016,26-01-2016,30 dias,"Portugal, Setúbal, Barreiro","Artigo 20.º, n.º 1, alínea a) do Código dos Contratos Públicos",26-01-2016,"772,00 €",,"",,Não aplicável.,Não aplicável.,FALSE
4I0025-2016 BATA CIRURGICA,Ajuste Direto Regime Geral,Aquisição de bens móveis,"33000000-0, Equipamento médico, medicamentos e produtos para cuidados pessoais","Centro Hospitalar Barreiro Montijo, E. P. E. (509186998)","OASIPOR - IMPORT. E EXPORT., SA (502260750)","623,00 €",29-02-2016,26-01-2016,30 dias,"Portugal, Setúbal, Barreiro","Artigo 20.º, n.º 1, alínea a) do Código dos Contratos Públicos",26-01-2016,"623,00 €",,"",,Não aplicável.,Não aplicável.,FALSE
4I0025-2016  CONTENTOR 2 LTS,Ajuste Direto Regime Geral,Aquisição de bens móveis,"33000000-0, Equipamento médico, medicamentos e produtos para cuidados pessoais","Centro Hospitalar Barreiro Montijo, E. P. E. (509186998)","CLINIFAR - PROD. CLINICOS E FARMACEUTICOS, S.A. (503281115)","275,00 €",29-02-2016,29-01-2016,30 dias,"Portugal, Setúbal, Barreiro","Artigo 20.º, n.º 1, alínea a) do Código dos Contratos Públicos",29-01-2016,"275,00 €",,"",,Não aplicável.,Não aplicável.,FALSE
4I0025-2016 SERINGAS DE 3 PÇAS,Ajuste Direto Regime Geral,Aquisição de bens móveis,"33000000-0, Equipamento médico, medicamentos e produtos para cuidados pessoais","Centro Hospitalar Barreiro Montijo, E. P. E. (509186998)",PERGUT PORTUGAL (501799729),"673,32 €",29-02-2016,27-01-2016,30 dias,"Portugal, Setúbal, Barreiro","Artigo 20.º, n.º 1, alínea a) do Código dos Contratos Públicos",27-01-2016,"673,32 €",,"",,Não aplicável.,Não aplicável.,FALSE
4I0025-2016 BOINAS E BARRETES CIRURGICOS,Ajuste Direto Regime Geral,Aquisição de bens móveis,"33000000-0, Equipamento médico, medicamentos e produtos para cuidados pessoais","Centro Hospitalar Barreiro Montijo, E. P. E. (509186998)","ANASTACIO SALDANHA UNIPESSOAL, LDA. (505804441)","74,07 €",29-02-2016,25-01-2016,30 dias,"Portugal, Setúbal, Barreiro","Artigo 20.º, n.º 1, alínea a) do Código dos Contratos Públicos",25-01-2016,"74,07 €",,"",,Não aplicável.,Não aplicável.,FALSE
4I0025-2016 CONTROLADORES DE FLUXO,Ajuste Direto Regime Geral,Aquisição de bens móveis,"33000000-0, Equipamento médico, medicamentos e produtos para cuidados pessoais","Centro Hospitalar Barreiro Montijo, E. P. E. (509186998)","P.M.H. - PROD. MEDICOS HOSPITALARES, LDA. (502376899)","478,75 €",29-02-2016,25-01-2016,30 dias,"Portugal, Setúbal, Barreiro","Artigo 20.º, n.º 1, alínea a) do Código dos Contratos Públicos",25-01-2016,"478,75 €",,"",,Não aplicável.,Não aplicável.,FALSE
S10005/2015 - Serviços para Apoio aos Serviços Gerais do CHBM EPE,Concurso público,Aquisição de serviços,"85140000-2, Serviços de saúde diversos","Centro Hospitalar Barreiro Montijo, E. P. E. (509186998)","HELPED, Prestação de Serviços de Saúde, Lda (506069010)","42.624,00 €",29-02-2016,29-05-2015,290 dias,"Portugal, Setúbal, Barreiro","Artigo 20.º, n.º 1, alínea b) do Código dos Contratos Públicos",31-12-2015,"35.697,12 €",,Horas realizadas inferiores às inicialmente previstas,,Não aplicável.,Não aplicável.,FALSE
4I0025-2016 SERINGA DE 2 PEÇAS,Ajuste Direto Regime Geral,Aquisição de bens móveis,"33000000-0, Equipamento médico, medicamentos e produtos para cuidados pessoais","Centro Hospitalar Barreiro Montijo, E. P. E. (509186998)","NORMAX-FAB VIDROS CIENTIFICOS, (500203130)","874,00 €",29-02-2016,27-01-2016,30 dias,"Portugal, Setúbal, Barreiro","Artigo 20.º, n.º 1, alínea a) do Código dos Contratos Públicos",27-01-2016,"874,00 €",,"",,Não aplicável.,Não aplicável.,FALSE
4I0025-2016 CONTENTORES P AGULHAS,Ajuste Direto Regime Geral,Aquisição de bens móveis,"33000000-0, Equipamento médico, medicamentos e produtos para cuidados pessoais","Centro Hospitalar Barreiro Montijo, E. P. E. (509186998)","AMBIMED - GESTÃO AMBIENTAL, LDA (503593427)","87,00 €",29-02-2016,27-01-2016,30 dias,"Portugal, Setúbal, Barreiro","Artigo 20.º, n.º 1, alínea a) do Código dos Contratos Públicos",27-01-2016,"87,00 €",,"",,Não aplicável.,Não aplicável.,FALSE
40044-2016 SISTEMA DE GESTAO DE BECKUPS,Ajuste Direto Regime Geral,Aquisição de bens móveis,"48000000-8, Pacotes de software e sistemas de informação","Centro Hospitalar Barreiro Montijo, E. P. E. (509186998)","ITEN SOLUTIONS -SISTEMAS INFORMAÇÃO,S.A (EX  (510728189)","9.998,00 €",26-02-2016,27-01-2016,60 dias,"Portugal, Setúbal, Barreiro","Artigo 20.º, n.º 1, alínea a) do Código dos Contratos Públicos",28-01-2016,"9.998,00 €",,"",,Não aplicável.,Não aplicável.,FALSE
40034-2016 EQUIPAMENTO P GANGLIO SENTINELA,Ajuste Direto Regime Geral,Aquisição de bens móveis,"33000000-0, Equipamento médico, medicamentos e produtos para cuidados pessoais","Centro Hospitalar Barreiro Montijo, E. P. E. (509186998)","ISODER, LDA. (502241594)","18.500,00 €",26-02-2016,29-01-2016,60 dias,"Portugal, Setúbal, Barreiro","Artigo 20.º, n.º 1, alínea a) do Código dos Contratos Públicos",11-02-2016,"18.500,00 €",,"",,Não aplicável.,Não aplicável.,FALSE
40045-2016 SISTEMA DE GESTAO DE ARMAZENAMENTO DE INFRMAÇAO,Ajuste Direto Regime Geral,Aquisição de bens móveis,"48000000-8, Pacotes de software e sistemas de informação","Centro Hospitalar Barreiro Montijo, E. P. E. (509186998)","ITEN SOLUTIONS -SISTEMAS INFORMAÇÃO,S.A (EX CPC.IS (510728189)","9.995,14 €",26-02-2016,28-01-2016,60 dias,"Portugal, Setúbal, Barreiro","Artigo 20.º, n.º 1, alínea a) do Código dos Contratos Públicos",28-01-2016,"9.995,14 €",,"",,Não aplicável.,Não aplicável.,FALSE
