freguesia,acronym,validVotesPercentage,votes,dicofre
"Codessoso, Curros e Fiães do Tâmega",PPD/PSD,79.91,175,170220
"Codessoso, Curros e Fiães do Tâmega",PS,12.79,28,170220
"Codessoso, Curros e Fiães do Tâmega",PCP-PEV,2.74,6,170220
"Codessoso, Curros e Fiães do Tâmega",B.E.,2.28,5,170220
"Codessoso, Curros e Fiães do Tâmega",PNR,0.91,2,170220
"Codessoso, Curros e Fiães do Tâmega",CDS-PP,0.46,1,170220
"Codessoso, Curros e Fiães do Tâmega",PAN,0.46,1,170220
"Codessoso, Curros e Fiães do Tâmega",PCTP/MRPP,0.46,1,170220
"Codessoso, Curros e Fiães do Tâmega",A,0,0,170220
"Codessoso, Curros e Fiães do Tâmega",CH,0,0,170220
"Codessoso, Curros e Fiães do Tâmega",IL,0,0,170220
"Codessoso, Curros e Fiães do Tâmega",L,0,0,170220
"Codessoso, Curros e Fiães do Tâmega",NC,0,0,170220
"Codessoso, Curros e Fiães do Tâmega",PDR,0,0,170220
"Codessoso, Curros e Fiães do Tâmega",PPM,0,0,170220
"Codessoso, Curros e Fiães do Tâmega",R.I.R.,0,0,170220
