Objeto do Contrato,Tipo de Procedimento,Tipo(s) de Contrato,CPVs,Entidade(s) Adjudicante(s),Entidade(s) Adjudicatária(s),Preço Contratual,Data de Publicação,Data de Celebração do Contrato,Prazo de Execução,Local de Execução,Fundamentação,Data de Fecho do Contrato,Preço Total Efetivo,Causas das Alterações ao Prazo,Causas das Alterações ao Preço,Estado,N.º registo do Acordo Quadro,Descrição do Acordo Quadro,Procedimento Centralizado
SISTEMA FILTRAÇÃO/RECUPERADOR SANGUE INTER OPERATÓRIO,Ajuste Direto Regime Geral,Aquisição de bens móveis,"33162200-5, Instrumentos para blocos operatórios","Centro Hospitalar Tondela-Viseu, E. P. E. (509822940)",STRYKER PORTUGAL-PROD.M.UNIP.L (504594214),"9.600,00 €",11-02-2016,07-10-2015,1 dias,"Portugal, Viseu, Viseu","Artigo 24.º, n.º 1, alínea c) do Código dos Contratos Públicos",,,,,,Não aplicável.,Não aplicável.,FALSE
AGULHA HIPIDERMICA,Ajuste Direto Regime Geral,Aquisição de bens móveis,"33141320-9, Agulhas para fins médicos","Centro Hospitalar Tondela-Viseu, E. P. E. (509822940)","IBERLAB & IMUNOREAGE Soluções para Laboratórios, Lda (503406694)","9.796,00 €",11-02-2016,23-12-2015,1 dias,"Portugal, Viseu, Viseu","Artigo 24.º, n.º 1, alínea c) do Código dos Contratos Públicos",,,,,,Não aplicável.,Não aplicável.,FALSE
AGULHA C/ ALETA PRE-ACOPLADA SEGURANÇA SIST. FECHADO,Ajuste Direto Regime Geral,Aquisição de bens móveis,"33141320-9, Agulhas para fins médicos","Centro Hospitalar Tondela-Viseu, E. P. E. (509822940)","SARSTEDT, S.A. (502659955)","9.120,00 €",11-02-2016,12-10-2015,1 dias,"Portugal, Viseu, Viseu","Artigo 24.º, n.º 1, alínea c) do Código dos Contratos Públicos",,,,,,Não aplicável.,Não aplicável.,FALSE
PRÓTESE FONATORIA,Ajuste Direto Regime Geral,Aquisição de bens móveis,"33184000-3, Próteses","Centro Hospitalar Tondela-Viseu, E. P. E. (509822940)",ATOS MEDICAL (980435978),"9.750,00 €",11-02-2016,24-11-2015,1 dias,"Portugal, Viseu, Viseu","Artigo 20.º, n.º 1, alínea a) do Código dos Contratos Públicos",,,,,,Não aplicável.,Não aplicável.,FALSE
CATETER ENDOVASCULAR ABLAÇÃO VEIA SAFENA,Ajuste Direto Regime Geral,Aquisição de bens móveis,"33141200-2, Cateteres","Centro Hospitalar Tondela-Viseu, E. P. E. (509822940)","COVIDIEN PORTUGAL-PRODUTOS DE SAÚDE UNIPESSOAL,LDA (503413410)","5.250,00 €",10-02-2016,27-10-2015,1 dias,"Portugal, Viseu, Viseu","Artigo 24.º, n.º 1, alínea e) do Código dos Contratos Públicos",,,,,,Não aplicável.,Não aplicável.,FALSE
REDE HERNIA REDONDA UMBILICAL,Ajuste Direto Regime Geral,Aquisição de bens móveis,"33184100-4, Implantes cirúrgicos","Centro Hospitalar Tondela-Viseu, E. P. E. (509822940)","C.R. BARD PORTUGAL, LDA. (502438274)","5.400,00 €",10-02-2016,07-10-2015,1 dias,"Portugal, Viseu, Viseu","Artigo 20.º, n.º 1, alínea a) do Código dos Contratos Públicos",,,,,,Não aplicável.,Não aplicável.,FALSE
CLIP HEMOSTATICO PARA ENDOSCOPIA PONTA ABERTA,Ajuste Direto Regime Geral,Aquisição de bens móveis,"33141120-7, Clipes, suturas, ligaduras","Centro Hospitalar Tondela-Viseu, E. P. E. (509822940)","BIOSONDA-COM.MAT.HOSPITALAR, (501463313)","9.500,00 €",10-02-2016,23-12-2015,1 dias,"Portugal, Viseu, Viseu","Artigo 20.º, n.º 1, alínea a) do Código dos Contratos Públicos",,,,,,Não aplicável.,Não aplicável.,FALSE
POLIURETANOS ESPUMA E POLIURETANOS FINOS,Ajuste Direto Regime Geral,Aquisição de bens móveis,"33600000-6, Produtos farmacêuticos","Centro Hospitalar Tondela-Viseu, E. P. E. (509822940)","SMITH & NEPHEW, LDA (503552461)","9.981,00 €",10-02-2016,02-02-2016,1 dias,"Portugal, Viseu, Viseu","Artigo 20.º, n.º 1, alínea a) do Código dos Contratos Públicos",,,,,,Não aplicável.,Não aplicável.,FALSE
CLIP HEMOSTATICO PARA ENDOSCOPIA PONTA ABERTA,Ajuste Direto Regime Geral,Aquisição de bens móveis,"33141120-7, Clipes, suturas, ligaduras","Centro Hospitalar Tondela-Viseu, E. P. E. (509822940)","BIOSONDA-COM.MAT.HOSPITALAR, (501463313)","9.500,00 €",08-02-2016,16-10-2015,1 dias,"Portugal, Viseu, Viseu","Artigo 20.º, n.º 1, alínea a) do Código dos Contratos Públicos",,,,,,Não aplicável.,Não aplicável.,FALSE
REDE HERNIA UMBILICAL,Ajuste Direto Regime Geral,Aquisição de bens móveis,"33184100-4, Implantes cirúrgicos","Centro Hospitalar Tondela-Viseu, E. P. E. (509822940)","C.R. BARD PORTUGAL, LDA (502438274)","7.200,00 €",08-02-2016,25-11-2015,1 dias,"Portugal, Viseu, Viseu","Artigo 24.º, n.º 1, alínea c) do Código dos Contratos Públicos",,,,,,Não aplicável.,Não aplicável.,FALSE
TROUXA ESTERILIZADA PARA EXTREMIDADE INFERIOR,Ajuste Direto Regime Geral,Aquisição de bens móveis,"33140000-3, Material médico de consumo","Centro Hospitalar Tondela-Viseu, E. P. E. (509822940)","BASTOS VIEGAS, SA (500042772)","9.478,08 €",08-02-2016,27-11-2015,1 dias,"Portugal, Viseu, Viseu","Artigo 20.º, n.º 1, alínea a) do Código dos Contratos Públicos",,,,,,Não aplicável.,Não aplicável.,FALSE
PRÓTESES PARA AMPUTADOS,Ajuste Direto Regime Geral,Aquisição de bens móveis,"33184000-3, Próteses","Centro Hospitalar Tondela-Viseu, E. P. E. (509822940)","MEDICAL PLUS-PROD.MED.HOSP.,LD (506658066)","7.190,00 €",08-02-2016,25-11-2015,1 dias,"Portugal, Viseu, Viseu","Artigo 24.º, n.º 1, alínea e) do Código dos Contratos Públicos",,,,,,Não aplicável.,Não aplicável.,FALSE
DETERGENTE NEUTRO ABRILHANTADOR DE PAVIM VINIL,Ajuste Direto Regime Geral,Aquisição de bens móveis,"39831200-8, Detergentes","Centro Hospitalar Tondela-Viseu, E. P. E. (509822940)","PAPELIQUIDOS, LDA (503527580)","11.200,00 €",04-02-2016,12-11-2015,1 dias,"Portugal, Viseu, Viseu","Artigo 20.º, n.º 1, alínea a) do Código dos Contratos Públicos",,,,,,Não aplicável.,Não aplicável.,FALSE
MIFEPRISTONA 200MG COMP,Ajuste Direto Regime Geral,Aquisição de bens móveis,"33600000-6, Produtos farmacêuticos","Centro Hospitalar Tondela-Viseu, E. P. E. (509822940)",DISTRIFARMA-CIA DIST.FARMAC. (502948663),"9.600,00 €",04-02-2016,22-12-2015,1 dias,"Portugal, Viseu, Viseu","Artigo 24.º, n.º 1, alínea e) do Código dos Contratos Públicos",,,,,,Não aplicável.,Não aplicável.,FALSE
DESINFETANTE PARA SUPERFÍCIES ELEVADAS (ANIOS DDSH),Ajuste Direto Regime Geral,Aquisição de bens móveis,"33600000-6, Produtos farmacêuticos","Centro Hospitalar Tondela-Viseu, E. P. E. (509822940)","AIR LIQUIDE MEDICINAL, SA (501576436)","8.310,24 €",04-02-2016,15-01-2016,1 dias,"Portugal, Viseu, Viseu","Artigo 20.º, n.º 1, alínea a) do Código dos Contratos Públicos",,,,,,Não aplicável.,Não aplicável.,FALSE
BENZIDAMINA COLUTORIO FR,Ajuste Direto Regime Geral,Aquisição de bens móveis,"33600000-6, Produtos farmacêuticos","Centro Hospitalar Tondela-Viseu, E. P. E. (509822940)",ANGELINI FARMACEUTICOS GENERIC (500583650),"11.250,00 €",04-02-2016,18-12-2015,1 dias,"Portugal, Viseu, Viseu","Artigo 24.º, n.º 1, alínea e) do Código dos Contratos Públicos",,,,,,Não aplicável.,Não aplicável.,FALSE
DETERGENTE PARA LAVAGEM PAV CERAMICO/SANITARIOS,Ajuste Direto Regime Geral,Aquisição de bens móveis,"39831200-8, Detergentes","Centro Hospitalar Tondela-Viseu, E. P. E. (509822940)","A.J.OLIVEIRA, LDA (502293748)","7.466,40 €",03-02-2016,02-06-2015,1 dias,"Portugal, Viseu, Viseu","Artigo 20.º, n.º 1, alínea a) do Código dos Contratos Públicos",,,,,,Não aplicável.,Não aplicável.,FALSE
TONER P/ IMPRESSORA HP LASER JET PRO,Ajuste Direto Regime Geral,Aquisição de bens móveis,"30125100-2, Cartuchos de tinta (toner)","Centro Hospitalar Tondela-Viseu, E. P. E. (509822940)","FLUIR UNIPESSOAL, LDA (506212424)","11.456,00 €",03-02-2016,21-10-2015,1 dias,"Portugal, Viseu, Viseu","Artigo 20.º, n.º 1, alínea a) do Código dos Contratos Públicos",,,,,,Não aplicável.,Não aplicável.,FALSE
PRÓTESE TOTAL DA ANCA NÃO CIMENTADA,Ajuste Direto Regime Geral,Aquisição de bens móveis,"33183200-8, Próteses ortopédicas","Centro Hospitalar Tondela-Viseu, E. P. E. (509822940)","LIMA IMPLANTES PORTUGAL s.u., Lda. (508634784)","30.000,00 €",03-02-2016,24-11-2015,1 dias,"Portugal, Viseu, Viseu","Artigo 24.º, n.º 1, alínea c) do Código dos Contratos Públicos",,,,,,Não aplicável.,Não aplicável.,FALSE
FIO SUTURA SINTÉTICO,Ajuste Direto Regime Geral,Aquisição de bens móveis,"33141120-7, Clipes, suturas, ligaduras","Centro Hospitalar Tondela-Viseu, E. P. E. (509822940)","JOHNSON & JOHNSON, MEDICAL (500153370)","9.938,88 €",03-02-2016,26-11-2015,1 dias,"Portugal, Viseu, Viseu","Artigo 20.º, n.º 1, alínea a) do Código dos Contratos Públicos",,,,,,Não aplicável.,Não aplicável.,FALSE
LENTE MONOBLOCO ACRILICA HIDROFOBICA C/ FILTRO,Ajuste Direto Regime Geral,Aquisição de bens móveis,"33731110-7, Lentes intraoculares","Centro Hospitalar Tondela-Viseu, E. P. E. (509822940)","ALCON PORTUGAL-PROD.EQUIP.OFTL,LDA (501251685)","42.000,00 €",03-02-2016,26-10-2015,1 dias,"Portugal, Viseu, Viseu","Artigo 24.º, n.º 1, alínea c) do Código dos Contratos Públicos",,,,,,Não aplicável.,Não aplicável.,FALSE
DIALISADOR COM MEMBRANA SINTÉTICA ALTO FLUXO,Ajuste Direto Regime Geral,Aquisição de bens móveis,"33181520-3, Produtos de consumo para hemodiálise renal","Centro Hospitalar Tondela-Viseu, E. P. E. (509822940)","BAXTER MEDICO FARMACEUTICA,LD (503347345)","5.994,00 €",03-02-2016,05-11-2015,1 dias,"Portugal, Viseu, Viseu","Artigo 24.º, n.º 1, alínea c) do Código dos Contratos Públicos",,,,,,Não aplicável.,Não aplicável.,FALSE
PINÇA APLICAÇÃO CLIPS LAPAROSCOPICO,Ajuste Direto Regime Geral,Aquisição de bens móveis,"33169000-2, Material cirúrgico","Centro Hospitalar Tondela-Viseu, E. P. E. (509822940)","COVIDIEN PORTUGAL-PRODUTOS DE SAÚDE UNIPESSOAL,LDA (503413410)","6.600,00 €",02-02-2016,26-11-2015,1 dias,"Portugal, Viseu, Viseu","Artigo 20.º, n.º 1, alínea a) do Código dos Contratos Públicos",,,,,,Não aplicável.,Não aplicável.,FALSE
VENTOSA DESCARTÁVEL OMNICUP,Ajuste Direto Regime Geral,Aquisição de bens móveis,"33141000-0, Material médico não químico descartável e produtos hematológicos","Centro Hospitalar Tondela-Viseu, E. P. E. (509822940)","SPECULUM - ARTIGOS MEDICOS, S.A. (502996323)","9.975,00 €",02-02-2016,24-11-2015,1 dias,"Portugal, Viseu, Viseu","Artigo 24.º, n.º 1, alínea c) do Código dos Contratos Públicos",,,,,,Não aplicável.,Não aplicável.,FALSE
REAG.P/DET.GLICOSE NO SANGUE,Ajuste Direto Regime Geral,Aquisição de bens móveis,"33600000-6, Produtos farmacêuticos","Centro Hospitalar Tondela-Viseu, E. P. E. (509822940)","ABBOTT LABORATÓRIOS, LDA (500006148)","70.890,00 €",02-02-2016,21-01-2016,1 dias,"Portugal, Viseu, Viseu","Artigo 20.º, n.º 1, alínea a) do Código dos Contratos Públicos",,,,,,Não aplicável.,Não aplicável.,FALSE
CLAMP PARA CRANIO ESTERILIZADO,Ajuste Direto Regime Geral,Aquisição de bens móveis,"33169000-2, Material cirúrgico","Centro Hospitalar Tondela-Viseu, E. P. E. (509822940)","B.BRAUN MEDICAL, LDA (501506543)","9.180,00 €",02-02-2016,24-11-2015,1 dias,"Portugal, Viseu, Viseu","Artigo 24.º, n.º 1, alínea e) do Código dos Contratos Públicos",,,,,,Não aplicável.,Não aplicável.,FALSE
KIT ALGALIAÇÃO ESTERILIZADO,Ajuste Direto Regime Geral,Aquisição de bens móveis,"33141600-6, Tubos e sacos de drenagem e respectivos kits","Centro Hospitalar Tondela-Viseu, E. P. E. (509822940)","LINEAMEDICA,S.A (505148676)","8.453,52 €",02-02-2016,25-11-2015,1 dias,"Portugal, Viseu, Viseu","Artigo 20.º, n.º 1, alínea a) do Código dos Contratos Públicos",,,,,,Não aplicável.,Não aplicável.,FALSE
AGULHA C/ ALETA PRE-ACOPLADA,Ajuste Direto Regime Geral,Aquisição de bens móveis,"33141320-9, Agulhas para fins médicos","Centro Hospitalar Tondela-Viseu, E. P. E. (509822940)","SARSTEDT, S.A. (502659955)","9.804,00 €",02-02-2016,25-11-2015,1 dias,"Portugal, Viseu, Viseu","Artigo 24.º, n.º 1, alínea c) do Código dos Contratos Públicos",,,,,,Não aplicável.,Não aplicável.,FALSE
PROTESE ANCA NÃO CIMENTADA,Ajuste Direto Regime Geral,Aquisição de bens móveis,"33183200-8, Próteses ortopédicas","Centro Hospitalar Tondela-Viseu, E. P. E. (509822940)","ARTUR SALGADO, LDA (503612600)","29.250,00 €",01-02-2016,24-11-2015,1 dias,"Portugal, Viseu, Viseu","Artigo 24.º, n.º 1, alínea c) do Código dos Contratos Públicos",,,,,,Não aplicável.,Não aplicável.,FALSE
CAPSULA DE OBSERVAÇÃO DO INTESTINO DELGADO,Ajuste Direto Regime Geral,Aquisição de bens móveis,"33124130-5, Material para diagnóstico","Centro Hospitalar Tondela-Viseu, E. P. E. (509822940)","COVIDIEN PORTUGAL-PRODUTOS DE SAÚDE UNIPESSOAL,LDA (503413410)","5.500,00 €",01-02-2016,28-10-2015,1 dias,"Portugal, Viseu, Viseu","Artigo 24.º, n.º 1, alínea e) do Código dos Contratos Públicos",,,,,,Não aplicável.,Não aplicável.,FALSE
DIALISADOR COM MEMBRANA SINTÉTICA,Ajuste Direto Regime Geral,Aquisição de bens móveis,"33181520-3, Produtos de consumo para hemodiálise renal","Centro Hospitalar Tondela-Viseu, E. P. E. (509822940)","FRESENIUS MEDICAL CARE PORTUGAL, SA (503070220)","7.110,00 €",01-02-2016,20-10-2015,1 dias,"Portugal, Viseu, Viseu","Artigo 24.º, n.º 1, alínea c) do Código dos Contratos Públicos",,,,,,Não aplicável.,Não aplicável.,FALSE
PINÇA LAPAROSCOPICA,Ajuste Direto Regime Geral,Aquisição de bens móveis,"33169000-2, Material cirúrgico","Centro Hospitalar Tondela-Viseu, E. P. E. (509822940)","COVIDIEN PORTUGAL-PRODUTOS DE SAÚDE UNIPESSOAL,LDA (503413410)","8.380,80 €",01-02-2016,20-10-2015,1 dias,"Portugal, Viseu, Viseu","Artigo 24.º, n.º 1, alínea c) do Código dos Contratos Públicos",,,,,,Não aplicável.,Não aplicável.,FALSE
ENDOPROTESE VASCULAR AUTO EXPANSIVA,Ajuste Direto Regime Geral,Aquisição de bens móveis,"33184200-5, Próteses vasculares","Centro Hospitalar Tondela-Viseu, E. P. E. (509822940)","MEDTRONIC PORTUGAL, LDA (504223933)","9.900,00 €",01-02-2016,20-10-2015,1 dias,"Portugal, Viseu, Viseu","Artigo 24.º, n.º 1, alínea c) do Código dos Contratos Públicos",,,,,,Não aplicável.,Não aplicável.,FALSE
BALÃO ANGIOPLASTINA ARTERIAL COM FARMACO,Ajuste Direto Regime Geral,Aquisição de bens móveis,"33111730-7, Material para angioplastia","Centro Hospitalar Tondela-Viseu, E. P. E. (509822940)","MEDTRONIC PORTUGAL, LDA (504223933)","6.300,00 €",01-02-2016,23-10-2015,1 dias,"Portugal, Viseu, Viseu","Artigo 24.º, n.º 1, alínea c) do Código dos Contratos Públicos",,,,,,Não aplicável.,Não aplicável.,FALSE
DISPOSITIVO COM FITA POLIPROPILENO,Ajuste Direto Regime Geral,Aquisição de bens móveis,"33190000-8, Dispositivos e produtos médicos variados","Centro Hospitalar Tondela-Viseu, E. P. E. (509822940)","JOHNSON & JOHNSON, MEDICAL (500153370)","9.877,77 €",01-02-2016,21-10-2015,1 dias,"Portugal, Viseu, Viseu","Artigo 20.º, n.º 1, alínea a) do Código dos Contratos Públicos",,,,,,Não aplicável.,Não aplicável.,FALSE
