freguesia,acronym,validVotesPercentage,votes,dicofre
Chão de Couce,PPD/PSD,46.18,278,100304
Chão de Couce,PS,30.9,186,100304
Chão de Couce,CDS-PP,4.98,30,100304
Chão de Couce,B.E.,4.65,28,100304
Chão de Couce,PAN,2.49,15,100304
Chão de Couce,A,1.99,12,100304
Chão de Couce,PCP-PEV,1.99,12,100304
Chão de Couce,L,1.66,10,100304
Chão de Couce,PPM.PPV/CDC,1.5,9,100304
Chão de Couce,PNR,1,6,100304
Chão de Couce,NC,0.66,4,100304
Chão de Couce,PCTP/MRPP,0.66,4,100304
Chão de Couce,PTP,0.66,4,100304
Chão de Couce,IL,0.33,2,100304
Chão de Couce,PDR,0.17,1,100304
Chão de Couce,PURP,0.17,1,100304
Chão de Couce,MAS,0,0,100304
