freguesia,acronym,validVotesPercentage,votes,dicofre
Murtede,PS,39.36,159,060208
Murtede,PPD/PSD.CDS-PP,31.93,129,060208
Murtede,MPT,8.66,35,060208
Murtede,PCP-PEV,6.19,25,060208
Murtede,B.E.,5.69,23,060208
Murtede,PND,2.23,9,060208
Murtede,PCTP/MRPP,1.98,8,060208
Murtede,PAN,1.49,6,060208
Murtede,L,0.74,3,060208
Murtede,PTP,0.74,3,060208
Murtede,PPM,0.5,2,060208
Murtede,MAS,0.25,1,060208
Murtede,PPV,0.25,1,060208
Murtede,PDA,0,0,060208
Murtede,PNR,0,0,060208
Murtede,POUS,0,0,060208
