freguesia,acronym,validVotesPercentage,votes,dicofre
Penafiel,PS,37.96,1871,131139
Penafiel,PPD/PSD,27.23,1342,131139
Penafiel,B.E.,10.53,519,131139
Penafiel,CDS-PP,6.72,331,131139
Penafiel,PAN,5.84,288,131139
Penafiel,PCP-PEV,3.1,153,131139
Penafiel,L,1.72,85,131139
Penafiel,A,1.42,70,131139
Penafiel,NC,1.3,64,131139
Penafiel,PPM.PPV/CDC,1.03,51,131139
Penafiel,PCTP/MRPP,0.71,35,131139
Penafiel,IL,0.69,34,131139
Penafiel,PDR,0.61,30,131139
Penafiel,PNR,0.34,17,131139
Penafiel,PTP,0.3,15,131139
Penafiel,PURP,0.28,14,131139
Penafiel,MAS,0.2,10,131139
