Objeto do Contrato,Tipo de Procedimento,Tipo(s) de Contrato,CPVs,Entidade(s) Adjudicante(s),Entidade(s) Adjudicatária(s),Preço Contratual,Data de Publicação,Data de Celebração do Contrato,Prazo de Execução,Local de Execução,Fundamentação,Data de Fecho do Contrato,Preço Total Efetivo,Causas das Alterações ao Prazo,Causas das Alterações ao Preço,Estado,N.º registo do Acordo Quadro,Descrição do Acordo Quadro,Procedimento Centralizado
Aquisição DM para selagem de vasos,Ajuste Direto Regime Geral,Aquisição de bens móveis,"33100000-1, Equipamento médico","Centro Hospitalar do Médio Tejo, E.P.E. (CHMT) (506361608)",MEDTRONIC PORTUGAL LDA (504223933),"70.000,00 €",31-01-2018,12-01-2018,365 dias,"Portugal, Santarém, Abrantes<BR/>Portugal, Santarém, Tomar","Artigo 20.º, n.º 1, alínea a) do Código dos Contratos Públicos",,,,,,Não aplicável.,Não aplicável.,FALSE
Aquisição de sacos de sangue e leucofiltros,Concurso público,Aquisição de bens móveis,"33100000-1, Equipamento médico","Centro Hospitalar do Médio Tejo, E. P. E. (506361608)","FRESENIUS KABI PHARMA PORTUGAL, LDA. (504293753)","111.828,40 €",30-01-2018,12-01-2018,365 dias,"Portugal, Santarém, Tomar<BR/>Portugal, Santarém, Abrantes<BR/>Portugal, Santarém, Torres Novas","Artigo 20.º, n.º 1, alínea b) do Código dos Contratos Públicos",,,,,,Não aplicável.,Não aplicável.,FALSE
Serviços de manutenção e conservação de espaços verdes,Ajuste Direto Regime Geral,Aquisição de serviços,"50000000-5, Serviços de reparação e manutenção","Centro Hospitalar do Médio Tejo, E. P. E. (506361608)","VIBEIRAS – Sociedade Comercial de Plantas, S.A (502050942)","14.160,00 €",30-01-2018,16-11-2017,365 dias,"Portugal, Santarém, Torres Novas","Artigo 20.º, n.º 1, alínea a) do Código dos Contratos Públicos",,,,,,Não aplicável.,Não aplicável.,FALSE
Serviços de Seguros de Acidentes de Trabalho,Ajuste Direto Regime Geral,Aquisição de serviços,"66512100-3, Serviços de seguros de acidentes","Centro Hospitalar do Médio Tejo, E. P. E. (506361608)",Corbroker (503239470),"258.211,39 €",30-01-2018,19-12-2017,365 dias,"Portugal, Santarém, Torres Novas","Artigo 27.º, n.º 1, alínea a) do Código dos Contratos Públicos",,,,,,Não aplicável.,Não aplicável.,FALSE
Aquisição de equipamento de anestesia (38003417),Ajuste Direto Regime Geral,Aquisição de bens móveis,"33100000-1, Equipamento médico","Centro Hospitalar do Médio Tejo, E.P.E. (CHMT) (506361608)","Drager Portugal, Lda (508771323)","30.900,00 €",23-01-2018,14-12-2017,30 dias,"Portugal, Santarém, Abrantes","Artigo 20.º, n.º 1, alínea a) do Código dos Contratos Públicos",,,,,,Não aplicável.,Não aplicável.,FALSE
Suturas Mecanicas,Concurso público,Aquisição de bens móveis,"33100000-1, Equipamento médico","Centro Hospitalar do Médio Tejo, E. P. E. (506361608)","MEDTRONIC PORTUGAL, LDA (504223933)","66.379,00 €",22-01-2018,08-01-2018,365 dias,"Portugal, Santarém, Torres Novas<BR/>Portugal, Santarém, Tomar<BR/>Portugal, Santarém, Abrantes","Artigo 20.º, n.º 1, alínea b) do Código dos Contratos Públicos",,,,,,Não aplicável.,Não aplicável.,FALSE
