freguesia,acronym,validVotesPercentage,votes,dicofre
União das freguesias de A dos Cunhados e Maceira,PPD/PSD.CDS-PP,35.68,917,111321
União das freguesias de A dos Cunhados e Maceira,PS,28.72,738,111321
União das freguesias de A dos Cunhados e Maceira,PCP-PEV,10.82,278,111321
União das freguesias de A dos Cunhados e Maceira,MPT,9.14,235,111321
União das freguesias de A dos Cunhados e Maceira,B.E.,4.9,126,111321
União das freguesias de A dos Cunhados e Maceira,L,2.45,63,111321
União das freguesias de A dos Cunhados e Maceira,PCTP/MRPP,2.14,55,111321
União das freguesias de A dos Cunhados e Maceira,PAN,2.02,52,111321
União das freguesias de A dos Cunhados e Maceira,PNR,0.93,24,111321
União das freguesias de A dos Cunhados e Maceira,PND,0.62,16,111321
União das freguesias de A dos Cunhados e Maceira,PPM,0.58,15,111321
União das freguesias de A dos Cunhados e Maceira,PPV,0.58,15,111321
União das freguesias de A dos Cunhados e Maceira,PTP,0.54,14,111321
União das freguesias de A dos Cunhados e Maceira,MAS,0.47,12,111321
União das freguesias de A dos Cunhados e Maceira,PDA,0.23,6,111321
União das freguesias de A dos Cunhados e Maceira,POUS,0.16,4,111321
