freguesia,acronym,validVotesPercentage,votes,dicofre
Montalvão,PS,57.94,62,121205
Montalvão,PCP-PEV,18.69,20,121205
Montalvão,PPD/PSD,11.21,12,121205
Montalvão,B.E.,3.74,4,121205
Montalvão,PAN,2.8,3,121205
Montalvão,PPM.PPV/CDC,2.8,3,121205
Montalvão,CDS-PP,1.87,2,121205
Montalvão,PCTP/MRPP,0.93,1,121205
Montalvão,A,0,0,121205
Montalvão,IL,0,0,121205
Montalvão,L,0,0,121205
Montalvão,MAS,0,0,121205
Montalvão,NC,0,0,121205
Montalvão,PDR,0,0,121205
Montalvão,PNR,0,0,121205
Montalvão,PTP,0,0,121205
Montalvão,PURP,0,0,121205
