freguesia,acronym,validVotesPercentage,votes,dicofre
Alfarela de Jales,PPD/PSD.CDS-PP,61.64,90,171302
Alfarela de Jales,PS,26.03,38,171302
Alfarela de Jales,PCP-PEV,3.42,5,171302
Alfarela de Jales,PND,2.74,4,171302
Alfarela de Jales,PTP,2.05,3,171302
Alfarela de Jales,B.E.,1.37,2,171302
Alfarela de Jales,L,0.68,1,171302
Alfarela de Jales,PAN,0.68,1,171302
Alfarela de Jales,PCTP/MRPP,0.68,1,171302
Alfarela de Jales,PPM,0.68,1,171302
Alfarela de Jales,MAS,0,0,171302
Alfarela de Jales,MPT,0,0,171302
Alfarela de Jales,PDA,0,0,171302
Alfarela de Jales,PNR,0,0,171302
Alfarela de Jales,POUS,0,0,171302
Alfarela de Jales,PPV,0,0,171302
