Objeto do Contrato,Tipo de Procedimento,Tipo(s) de Contrato,CPVs,Entidade(s) Adjudicante(s),Entidade(s) Adjudicatária(s),Preço Contratual,Data de Publicação,Data de Celebração do Contrato,Prazo de Execução,Local de Execução,Fundamentação,Data de Fecho do Contrato,Preço Total Efetivo,Causas das Alterações ao Prazo,Causas das Alterações ao Preço,Estado,N.º registo do Acordo Quadro,Descrição do Acordo Quadro,Procedimento Centralizado
"Empreitada - Substituição do Pavimento do 4.º Piso do Hospital Amato Lusitano (Serviços de Cirurgia Homens, Cirurgia Mulheres e Hall)",Ajuste Direto Regime Geral,Empreitadas de obras públicas,"45432110-8, Obras de pavimentação","Unidade Local de Saúde de Castelo Branco, E. P. E. (509309844)","TECNAT-TECNOLOGIAS DE ACABAMENTOS, LDA (503187682)","19.388,64 €",24-09-2015,11-09-2015,30 dias,"Portugal, Castelo Branco, Castelo Branco","Artigo 19.º, alínea a) do Código dos Contratos Públicos","","19.388,64 €",.,,,Não aplicável.,Não aplicável.,FALSE
Prestação de Serviços de Medicina de Trabalho,Ajuste Direto Regime Geral,Aquisição de serviços,"85147000-1, Serviços de medicina do trabalho","Unidade Local de Saúde de Castelo Branco, E. P. E. (509309844)","CRUZ BRANCA-SEGUR., HIGIENE E SAÚDE TRABALHO, LDA (503903841)","6.117,96 €",23-09-2015,18-09-2015,92 dias,"Portugal, Castelo Branco, Castelo Branco","Artigo 20.º, n.º 1, alínea a) do Código dos Contratos Públicos",31-12-2015,"6.117,96 €","",,,Não aplicável.,Não aplicável.,FALSE
