freguesia,acronym,validVotesPercentage,votes,dicofre
Horta (Conceição),PS,42.27,186,470107
Horta (Conceição),PPD/PSD,34.09,150,470107
Horta (Conceição),B.E.,7.27,32,470107
Horta (Conceição),CDS-PP,5.45,24,470107
Horta (Conceição),PCP-PEV,4.77,21,470107
Horta (Conceição),PAN,2.73,12,470107
Horta (Conceição),CH,0.91,4,470107
Horta (Conceição),A,0.68,3,470107
Horta (Conceição),IL,0.68,3,470107
Horta (Conceição),MPT,0.45,2,470107
Horta (Conceição),PCTP/MRPP,0.23,1,470107
Horta (Conceição),PNR,0.23,1,470107
Horta (Conceição),PPM,0.23,1,470107
Horta (Conceição),L,0,0,470107
Horta (Conceição),MAS,0,0,470107
Horta (Conceição),PDR,0,0,470107
Horta (Conceição),PTP,0,0,470107
