freguesia,acronym,validVotesPercentage,votes,dicofre
Ribeirinha,PS,42.68,236,430112
Ribeirinha,PPD/PSD,32.73,181,430112
Ribeirinha,CDS-PP,13.02,72,430112
Ribeirinha,B.E.,4.52,25,430112
Ribeirinha,A,1.45,8,430112
Ribeirinha,PPM.PPV/CDC,1.27,7,430112
Ribeirinha,NC,1.08,6,430112
Ribeirinha,PAN,0.54,3,430112
Ribeirinha,PCP-PEV,0.54,3,430112
Ribeirinha,IL,0.36,2,430112
Ribeirinha,PCTP/MRPP,0.36,2,430112
Ribeirinha,PDR,0.36,2,430112
Ribeirinha,PNR,0.36,2,430112
Ribeirinha,PURP,0.36,2,430112
Ribeirinha,L,0.18,1,430112
Ribeirinha,MAS,0.18,1,430112
Ribeirinha,PTP,0,0,430112
