Objeto do Contrato,Tipo de Procedimento,Tipo(s) de Contrato,CPVs,Entidade(s) Adjudicante(s),Entidade(s) Adjudicatária(s),Preço Contratual,Data de Publicação,Data de Celebração do Contrato,Prazo de Execução,Local de Execução,Fundamentação,Data de Fecho do Contrato,Preço Total Efetivo,Causas das Alterações ao Prazo,Causas das Alterações ao Preço,Estado,N.º registo do Acordo Quadro,Descrição do Acordo Quadro,Procedimento Centralizado
"Fornecimento de Diverso Material de Penso, para a ULSNA, EPE, para 2016",Ajuste Direto Regime Geral,Aquisição de bens móveis,"33140000-3, Material médico de consumo","Unidade Local de Saúde do Norte Alentejano, E. P. E. (508094461)",ALBINO DIAS DE ANDRADE (500013810),"12.015,12 €",26-10-2015,02-07-2015,180 dias,"Portugal, Portalegre","Artigo 20.º, n.º 1, alínea a) do Código dos Contratos Públicos",26-10-2015,"12.015,12 €",,,,Não aplicável.,Não aplicável.,FALSE
Aquisição de Pinças de Selagem,Ajuste Direto Regime Geral,Aquisição de bens móveis,"33140000-3, Material médico de consumo","Unidade Local de Saúde do Norte Alentejano, E. P. E. (508094461)",Covidien Portugal (503413410),"7.680,00 €",26-10-2015,07-10-2015,90 dias,"Portugal, Portalegre, Portalegre","Artigo 24.º, n.º 1, alínea e) do Código dos Contratos Públicos",26-10-2015,"7.680,00 €",,,,Não aplicável.,Não aplicável.,FALSE
Prestação de Serviços de Reembolso de Energia- Contratos de Compra de Energia Eléctrica - Unidades de Microprodução (Ano 2014),Ajuste Direto Regime Geral,Aquisição de serviços,"65300000-6, Serviços de distribuição de electricidade e serviços conexos","Unidade Local de Saúde do Norte Alentejano, E. P. E. (508094461)",SUCH (500900469),"63.000,00 €",23-10-2015,19-02-2014,365 dias,"Portugal, Portalegre, Portalegre","Artigo 24.º, n.º 1, alínea e) do Código dos Contratos Públicos","","",,,,Não aplicável.,Não aplicável.,FALSE
"Prestação de Serviços Médicos, na Especialidade de Ginecologia/Obstetrícia em Urgência, na ULSNA, EPE (Outubro a Dezembro/2015)",Ajuste Direto Regime Geral,Aquisição de serviços,"85000000-9, Serviços de saúde e acção social","Unidade Local de Saúde do Norte Alentejano, E. P. E. (508094461)",Marta Isabel Marchão Palmeiro Durão (223141747),"8.400,00 €",22-10-2015,30-09-2015,92 dias,"Portugal, Portalegre, Portalegre","Artigo 24.º, n.º 1, alínea c) do Código dos Contratos Públicos",30-09-2015,"8.400,00 €",,,,Não aplicável.,Não aplicável.,FALSE
"Prestação de Serviços Médicos, na Especialidade de Ginecologia/Obstetrícia em Urgência, na ULSNA, EPE (Outubro a Dezembro/2015)",Ajuste Direto Regime Geral,Aquisição de serviços,"85100000-0, Serviços de saúde","Unidade Local de Saúde do Norte Alentejano, E. P. E. (508094461)",Renato Alessandre Silva Martins (223982024),"8.400,00 €",22-10-2015,30-09-2015,92 dias,"Portugal, Portalegre, Portalegre","Artigo 24.º, n.º 1, alínea c) do Código dos Contratos Públicos",30-09-2015,"8.400,00 €",,,,Não aplicável.,Não aplicável.,FALSE
