Objeto do Contrato,Tipo de Procedimento,Tipo(s) de Contrato,CPVs,Entidade(s) Adjudicante(s),Entidade(s) Adjudicatária(s),Preço Contratual,Data de Publicação,Data de Celebração do Contrato,Prazo de Execução,Local de Execução,Fundamentação,Data de Fecho do Contrato,Preço Total Efetivo,Causas das Alterações ao Prazo,Causas das Alterações ao Preço,Estado,N.º registo do Acordo Quadro,Descrição do Acordo Quadro,Procedimento Centralizado
Obras de Beneficiação do Pav. 21  C -R/C Ala Direita,Ajuste Direto Regime Geral,Empreitadas de obras públicas,"45215100-8, Obras de construção de edifícios relacionados com serviços de saúde",Centro Hospitalar Psiquiátrico de Lisboa (CHPL) (508338476),"ACTIA - Engenharia e Construções, Lda. (509064930)","43.288,32 €",21-09-2016,16-06-2016,60 dias,"Portugal, Lisboa, Lisboa","Artigo 19.º, alínea a) do Código dos Contratos Públicos","","43.288,32 €",s/ informação,,,Não aplicável.,Não aplicável.,FALSE
Substituição da Caixilharia de Madeira das janelas do Pav. 21 C 1º,Ajuste Direto Regime Geral,Empreitadas de obras públicas,"45210000-2, Construção de edifícios",Centro Hospitalar Psiquiátrico de Lisboa (CHPL) (508338476),Portnorma - Janelas em PVC (502475587),"83.845,78 €",21-09-2016,05-05-2016,30 dias,"Portugal, Lisboa, Lisboa","Artigo 19.º, alínea a) do Código dos Contratos Públicos","","83.845,78 €",está dentro do prazo,,,Não aplicável.,Não aplicável.,FALSE
Remodelação de Pavilhões 38/39 (lavandaria) do CHPL,Ajuste Direto Regime Geral,Empreitadas de obras públicas,"45200000-9, Obras de construção total ou parcial e de engenharia civil",Centro Hospitalar Psiquiátrico de Lisboa (CHPL) (508338476),Rascunho Fácil (509005586),"16.998,16 €",20-09-2016,20-01-2016,10 dias,"Portugal, Lisboa, Lisboa","Artigo 19.º, alínea a) do Código dos Contratos Públicos","","16.998,16 €","",,,Não aplicável.,Não aplicável.,FALSE
Fornecimento e Montagem de um Grupo de Gerador de Suporte ao Centro de Dados,Ajuste Direto Regime Geral,Aquisição de bens móveis<br/>Aquisição de serviços,"30000000-9, Máquinas, equipamento e material de escritório e de informática, excepto mobiliário e pacotes de programas (software)",Centro Hospitalar Psiquiátrico de Lisboa (508338476),Maxiglobal - Eq. e Serv. de Informática (504320882),"23.275,00 €",20-09-2016,15-01-2016,30 dias,"Portugal, Lisboa, Lisboa","Artigo 20.º, n.º 1, alínea a) do Código dos Contratos Públicos",29-01-2016,"23.275,00 €","",,,Não aplicável.,Não aplicável.,FALSE
Messalazina 500 mg comp,Ajuste Direto Regime Geral,Aquisição de bens móveis,"33000000-0, Equipamento médico, medicamentos e produtos para cuidados pessoais",Centro Hospitalar Psiquiátrico de Lisboa (508338476),Dr Falk Pharma  (506171612),"73,72 €",19-09-2016,13-04-2016,1 dias,"Portugal, Lisboa, Lisboa","Artigo 24.º, n.º 1, alínea e) do Código dos Contratos Públicos",13-04-2016,"73,72 €","",,,Não aplicável.,Não aplicável.,FALSE
Budesonida 400 ug po inal caps blist,Ajuste Direto Regime Geral,Aquisição de bens móveis,"33000000-0, Equipamento médico, medicamentos e produtos para cuidados pessoais",Centro Hospitalar Psiquiátrico de Lisboa (508338476),Novartis (500063524),"135,17 €",19-09-2016,16-03-2016,1 dias,"Portugal, Lisboa, Lisboa","Artigo 24.º, n.º 1, alínea e) do Código dos Contratos Públicos",16-03-2016,"135,17 €","",,,Não aplicável.,Não aplicável.,FALSE
Software Gesmanth para o CHPL 2016,Ajuste Direto Regime Geral,Aquisição de bens móveis,"48000000-8, Pacotes de software e sistemas de informação",Centro Hospitalar Psiquiátrico de Lisboa (508338476),ADMINSAUDE (507243250),"9.500,00 €",14-09-2016,21-01-2016,365 dias,"Portugal, Lisboa, Lisboa","Artigo 20.º, n.º 1, alínea a) do Código dos Contratos Públicos",31-12-2016,"9.500,00 €","",,,Não aplicável.,Não aplicável.,FALSE
