freguesia,acronym,validVotesPercentage,votes,dicofre
União das freguesias de Vila Cova de Alva e Anseriz,PS,48,96,060122
União das freguesias de Vila Cova de Alva e Anseriz,PPD/PSD.CDS-PP,33.5,67,060122
União das freguesias de Vila Cova de Alva e Anseriz,PCP-PEV,7,14,060122
União das freguesias de Vila Cova de Alva e Anseriz,MPT,4,8,060122
União das freguesias de Vila Cova de Alva e Anseriz,PAN,2,4,060122
União das freguesias de Vila Cova de Alva e Anseriz,PCTP/MRPP,2,4,060122
União das freguesias de Vila Cova de Alva e Anseriz,B.E.,1.5,3,060122
União das freguesias de Vila Cova de Alva e Anseriz,MAS,1,2,060122
União das freguesias de Vila Cova de Alva e Anseriz,PPM,0.5,1,060122
União das freguesias de Vila Cova de Alva e Anseriz,PTP,0.5,1,060122
União das freguesias de Vila Cova de Alva e Anseriz,L,0,0,060122
União das freguesias de Vila Cova de Alva e Anseriz,PDA,0,0,060122
União das freguesias de Vila Cova de Alva e Anseriz,PND,0,0,060122
União das freguesias de Vila Cova de Alva e Anseriz,PNR,0,0,060122
União das freguesias de Vila Cova de Alva e Anseriz,POUS,0,0,060122
União das freguesias de Vila Cova de Alva e Anseriz,PPV,0,0,060122
