freguesia,acronym,validVotesPercentage,votes,dicofre
Meirinhos,PS,63.23,98,040809
Meirinhos,PPD/PSD,27.74,43,040809
Meirinhos,B.E.,2.58,4,040809
Meirinhos,CDS-PP,1.94,3,040809
Meirinhos,L,1.94,3,040809
Meirinhos,R.I.R.,1.94,3,040809
Meirinhos,CH,0.65,1,040809
Meirinhos,A,0,0,040809
Meirinhos,IL,0,0,040809
Meirinhos,NC,0,0,040809
Meirinhos,PAN,0,0,040809
Meirinhos,PCP-PEV,0,0,040809
Meirinhos,PCTP/MRPP,0,0,040809
Meirinhos,PDR,0,0,040809
Meirinhos,PNR,0,0,040809
Meirinhos,PPM,0,0,040809
Meirinhos,PTP,0,0,040809
Meirinhos,PURP,0,0,040809
