freguesia,acronym,validVotesPercentage,votes,dicofre
Fiães,PS,41.53,1523,010907
Fiães,PPD/PSD,31.47,1154,010907
Fiães,B.E.,12.14,445,010907
Fiães,PCP-PEV,4.23,155,010907
Fiães,CDS-PP,2.86,105,010907
Fiães,PAN,2.86,105,010907
Fiães,IL,1.28,47,010907
Fiães,PCTP/MRPP,0.68,25,010907
Fiães,CH,0.57,21,010907
Fiães,A,0.49,18,010907
Fiães,R.I.R.,0.49,18,010907
Fiães,L,0.38,14,010907
Fiães,MPT,0.27,10,010907
Fiães,PNR,0.19,7,010907
Fiães,PTP,0.16,6,010907
Fiães,NC,0.14,5,010907
Fiães,PURP,0.14,5,010907
Fiães,JPP,0.05,2,010907
Fiães,PDR,0.03,1,010907
Fiães,PPM,0.03,1,010907
