freguesia,acronym,validVotesPercentage,votes,dicofre
"União das freguesias de Coimbra (Sé Nova, Santa Cruz, Almedina e São Bartolomeu)",PS,28.21,1340,060334
"União das freguesias de Coimbra (Sé Nova, Santa Cruz, Almedina e São Bartolomeu)",PPD/PSD,23.81,1131,060334
"União das freguesias de Coimbra (Sé Nova, Santa Cruz, Almedina e São Bartolomeu)",B.E.,16.21,770,060334
"União das freguesias de Coimbra (Sé Nova, Santa Cruz, Almedina e São Bartolomeu)",CDS-PP,8.57,407,060334
"União das freguesias de Coimbra (Sé Nova, Santa Cruz, Almedina e São Bartolomeu)",PCP-PEV,7.47,355,060334
"União das freguesias de Coimbra (Sé Nova, Santa Cruz, Almedina e São Bartolomeu)",PAN,4.38,208,060334
"União das freguesias de Coimbra (Sé Nova, Santa Cruz, Almedina e São Bartolomeu)",L,3.31,157,060334
"União das freguesias de Coimbra (Sé Nova, Santa Cruz, Almedina e São Bartolomeu)",A,2.32,110,060334
"União das freguesias de Coimbra (Sé Nova, Santa Cruz, Almedina e São Bartolomeu)",NC,1.35,64,060334
"União das freguesias de Coimbra (Sé Nova, Santa Cruz, Almedina e São Bartolomeu)",IL,1.24,59,060334
"União das freguesias de Coimbra (Sé Nova, Santa Cruz, Almedina e São Bartolomeu)",PDR,0.67,32,060334
"União das freguesias de Coimbra (Sé Nova, Santa Cruz, Almedina e São Bartolomeu)",PPM.PPV/CDC,0.67,32,060334
"União das freguesias de Coimbra (Sé Nova, Santa Cruz, Almedina e São Bartolomeu)",PCTP/MRPP,0.53,25,060334
"União das freguesias de Coimbra (Sé Nova, Santa Cruz, Almedina e São Bartolomeu)",PNR,0.53,25,060334
"União das freguesias de Coimbra (Sé Nova, Santa Cruz, Almedina e São Bartolomeu)",MAS,0.34,16,060334
"União das freguesias de Coimbra (Sé Nova, Santa Cruz, Almedina e São Bartolomeu)",PURP,0.25,12,060334
"União das freguesias de Coimbra (Sé Nova, Santa Cruz, Almedina e São Bartolomeu)",PTP,0.15,7,060334
