Objeto do Contrato,Tipo de Procedimento,Tipo(s) de Contrato,CPVs,Entidade(s) Adjudicante(s),Entidade(s) Adjudicatária(s),Preço Contratual,Data de Publicação,Data de Celebração do Contrato,Prazo de Execução,Local de Execução,Fundamentação,Data de Fecho do Contrato,Preço Total Efetivo,Causas das Alterações ao Prazo,Causas das Alterações ao Preço,Estado,N.º registo do Acordo Quadro,Descrição do Acordo Quadro,Procedimento Centralizado
Procedimento nº30/2018/CRI Porto Ocidental/DICAD/ARSN - Aquisição de serviços médicos com especialidade em pedopsiquiatria - Nuno Pangaio,Ajuste Direto Regime Geral,Aquisição de serviços,"85121270-6, Serviços de psiquiatria ou psicologia","Administração Regional de Saúde do Norte, I. P. (503135593)",Nuno Miguel Soares Pangaio (237081210),"17.940,00 €",28-11-2018,01-08-2018,152 dias,"Portugal, Porto, Porto","Artigo 20.º, n.º 1, alínea d) do Código dos Contratos Públicos",31-12-2018,"14.300,00 €",,Numero de horas realizadas inferiores ao numero de horas contratadas,,Não aplicável.,Não aplicável.,FALSE
Contratação de Serviços Médicos – da Especialidade de Pedopsiquiatria,Ajuste Direto Regime Geral,Aquisição de serviços,"85141000-9, Serviços prestados pelo pessoal médico","Unidade Local de Saúde de Matosinhos, E. P. E. (506361390)",Nuno Pangaio (237081210),"12.865,60 €",26-06-2018,17-10-2016,75 dias,"Portugal, Porto, Matosinhos","Artigo 20.º, n.º 1, alínea a) do Código dos Contratos Públicos","","",,"",,Não aplicável.,Não aplicável.,FALSE
roc 507/2017- Contratação Serviços Médicos Pedopsiquiatria,Ajuste Direto Regime Geral,Aquisição de serviços,"85100000-0, Serviços de saúde","Unidade Local de Saúde de Matosinhos, E. P. E. (506361390)",Nuno Pangaio (237081210),"21.052,80 €",09-06-2018,27-02-2017,307 dias,"Portugal, Porto, Matosinhos","Artigo 20.º, n.º 1, alínea a) do Código dos Contratos Públicos","","",,"",,Não aplicável.,Não aplicável.,FALSE
