freguesia,acronym,validVotesPercentage,votes,dicofre
União das freguesias de São Miguel do Outeiro e Sabugosa,PS,36.6,127,182131
União das freguesias de São Miguel do Outeiro e Sabugosa,PPD/PSD,29.11,101,182131
União das freguesias de São Miguel do Outeiro e Sabugosa,B.E.,12.39,43,182131
União das freguesias de São Miguel do Outeiro e Sabugosa,CDS-PP,8.36,29,182131
União das freguesias de São Miguel do Outeiro e Sabugosa,PAN,3.17,11,182131
União das freguesias de São Miguel do Outeiro e Sabugosa,PCP-PEV,2.88,10,182131
União das freguesias de São Miguel do Outeiro e Sabugosa,PPM.PPV/CDC,1.44,5,182131
União das freguesias de São Miguel do Outeiro e Sabugosa,A,1.15,4,182131
União das freguesias de São Miguel do Outeiro e Sabugosa,PDR,1.15,4,182131
União das freguesias de São Miguel do Outeiro e Sabugosa,PURP,1.15,4,182131
União das freguesias de São Miguel do Outeiro e Sabugosa,L,0.86,3,182131
União das freguesias de São Miguel do Outeiro e Sabugosa,PCTP/MRPP,0.86,3,182131
União das freguesias de São Miguel do Outeiro e Sabugosa,MAS,0.29,1,182131
União das freguesias de São Miguel do Outeiro e Sabugosa,NC,0.29,1,182131
União das freguesias de São Miguel do Outeiro e Sabugosa,PNR,0.29,1,182131
União das freguesias de São Miguel do Outeiro e Sabugosa,IL,0,0,182131
União das freguesias de São Miguel do Outeiro e Sabugosa,PTP,0,0,182131
