freguesia,acronym,validVotesPercentage,votes,dicofre
União das freguesias de Almodôvar e Graça dos Padrões,PS,47.36,842,020209
União das freguesias de Almodôvar e Graça dos Padrões,PPD/PSD,19.8,352,020209
União das freguesias de Almodôvar e Graça dos Padrões,B.E.,13.84,246,020209
União das freguesias de Almodôvar e Graça dos Padrões,PCP-PEV,9.17,163,020209
União das freguesias de Almodôvar e Graça dos Padrões,CDS-PP,2.76,49,020209
União das freguesias de Almodôvar e Graça dos Padrões,PAN,2.14,38,020209
União das freguesias de Almodôvar e Graça dos Padrões,CH,0.96,17,020209
União das freguesias de Almodôvar e Graça dos Padrões,PCTP/MRPP,0.96,17,020209
União das freguesias de Almodôvar e Graça dos Padrões,L,0.67,12,020209
União das freguesias de Almodôvar e Graça dos Padrões,A,0.45,8,020209
União das freguesias de Almodôvar e Graça dos Padrões,MPT,0.39,7,020209
União das freguesias de Almodôvar e Graça dos Padrões,PNR,0.39,7,020209
União das freguesias de Almodôvar e Graça dos Padrões,PTP,0.39,7,020209
União das freguesias de Almodôvar e Graça dos Padrões,IL,0.34,6,020209
União das freguesias de Almodôvar e Graça dos Padrões,NC,0.17,3,020209
União das freguesias de Almodôvar e Graça dos Padrões,PDR,0.11,2,020209
União das freguesias de Almodôvar e Graça dos Padrões,PPM,0.11,2,020209
