freguesia,acronym,validVotesPercentage,votes,dicofre
União das freguesias de Vila Nova de Famalicão e Calendário,PS,32.04,2157,031260
União das freguesias de Vila Nova de Famalicão e Calendário,PPD/PSD,24.6,1656,031260
União das freguesias de Vila Nova de Famalicão e Calendário,CDS-PP,15.67,1055,031260
União das freguesias de Vila Nova de Famalicão e Calendário,B.E.,9.97,671,031260
União das freguesias de Vila Nova de Famalicão e Calendário,PAN,5.72,385,031260
União das freguesias de Vila Nova de Famalicão e Calendário,PCP-PEV,4.02,271,031260
União das freguesias de Vila Nova de Famalicão e Calendário,L,1.6,108,031260
União das freguesias de Vila Nova de Famalicão e Calendário,PPM.PPV/CDC,1.22,82,031260
União das freguesias de Vila Nova de Famalicão e Calendário,A,1.2,81,031260
União das freguesias de Vila Nova de Famalicão e Calendário,NC,0.98,66,031260
União das freguesias de Vila Nova de Famalicão e Calendário,IL,0.94,63,031260
União das freguesias de Vila Nova de Famalicão e Calendário,PCTP/MRPP,0.59,40,031260
União das freguesias de Vila Nova de Famalicão e Calendário,PURP,0.37,25,031260
União das freguesias de Vila Nova de Famalicão e Calendário,PDR,0.34,23,031260
União das freguesias de Vila Nova de Famalicão e Calendário,PNR,0.31,21,031260
União das freguesias de Vila Nova de Famalicão e Calendário,MAS,0.22,15,031260
União das freguesias de Vila Nova de Famalicão e Calendário,PTP,0.21,14,031260
