Objeto do Contrato,Tipo de Procedimento,Tipo(s) de Contrato,CPVs,Entidade(s) Adjudicante(s),Entidade(s) Adjudicatária(s),Preço Contratual,Data de Publicação,Data de Celebração do Contrato,Prazo de Execução,Local de Execução,Fundamentação,Data de Fecho do Contrato,Preço Total Efetivo,Causas das Alterações ao Prazo,Causas das Alterações ao Preço,Estado,N.º registo do Acordo Quadro,Descrição do Acordo Quadro,Procedimento Centralizado
Processo 17150091-Aquisição de medicamentos,Ao abrigo de acordo-quadro (art.º 259.º),Aquisição de bens móveis,"33661000-1, Medicamentos para o sistema nervoso","Administração Regional de Saúde do Centro,IP(ARSC) (503122165)",LABESFAL (501169580),"2.200,00 €",28-04-2017,05-04-2017,360 dias,"Portugal, Coimbra, Coimbra",Artigo 259.º do Código dos Contratos Públicos,03-08-2017,"2.200,00 €",,"",,2211341,Medicamentos anestésicos e relaxantes musculares,FALSE
Limpeza e higienização do sistema AVAC do Centro de Saúde da Lousã (USF Trevim Sol e Serra da Lousã).,Ajuste Direto Regime Geral,Aquisição de serviços,"50000000-5, Serviços de reparação e manutenção","Administração Regional de Saúde do Centro, I. P. (503122165)","Climacare - Climatização, manutenação e energias alternativas, Lda (510269710)","9.870,00 €",26-04-2017,27-12-2016,5 dias,"Portugal, Coimbra, Lousã","Artigo 20.º, n.º 1, alínea a) do Código dos Contratos Públicos",26-04-2017,"9.870,00 €",,"",,Não aplicável.,Não aplicável.,FALSE
Processo 17150098-Aquisição de medicamentos,Ao abrigo de acordo-quadro (art.º 259.º),Aquisição de bens móveis,"33000000-0, Equipamento médico, medicamentos e produtos para cuidados pessoais","Administração Regional de Saúde do Centro, I. P. (503122165)",B BRAUN MEDICAL (501506543),"66.272,00 €",24-04-2017,31-03-2017,360 dias,"Portugal, Coimbra, Coimbra",Artigo 259.º do Código dos Contratos Públicos,02-11-2017,"66.272,00 €",,"",,1415642,CP 2015/36,FALSE
17150081-Aquisição de imunoglobulina,Ao abrigo de acordo-quadro (art.º 259.º),Aquisição de bens móveis,"33000000-0, Equipamento médico, medicamentos e produtos para cuidados pessoais","Administração Regional de Saúde do Centro, I. P. (503122165)","CSL Behring, Lda                                (503047201)","37.780,40 €",21-04-2017,06-04-2017,360 dias,"Portugal, Coimbra, Coimbra",Artigo 259.º do Código dos Contratos Públicos,26-09-2017,"37.780,40 €",,"",,1471198,"ACORDO QUADRO PARA FORNECIMENTO DE FACTORES VIII E IX DA COAGULAÇÃO HUMANA, FACTOR VIII DA COAGULAÇÃO HUMANA + FACTOR DE VON WILLEBRAND HUMANO E FACTOR DE VON WILLEBRAND HUMANO ÀS INSTITUIÇÕES E SERVIÇOS DO SERVIÇO NACIONAL DE SAÚDE CP 2015/9A",FALSE
Processo 17150088-Aquisição de reagentes,Ao abrigo de acordo-quadro (art.º 259.º),Aquisição de bens móveis,"33000000-0, Equipamento médico, medicamentos e produtos para cuidados pessoais","Administração Regional de Saúde do Centro, I. P. (503122165)","QUILABAN - Quimica Laboratorial Analítica, S.A. (500399670)","4.506,18 €",21-04-2017,30-03-2017,360 dias,"Portugal, Coimbra, Coimbra",Artigo 259.º do Código dos Contratos Públicos,21-12-2017,"4.506,18 €",,"",,1555404,CP 2015/73 - Acordo quadro para fornecimento de Reagentes - Testes Rápidos às Instituições e Serviços do Serviço Nacional de Saúde,FALSE
Processo 17150090-Aquisição de medicamentos,Ao abrigo de acordo-quadro (art.º 259.º),Aquisição de bens móveis,"33000000-0, Equipamento médico, medicamentos e produtos para cuidados pessoais","Administração Regional de Saúde do Centro, I. P. (503122165)","ANGELINI FARMACEUTICA, LDA (500583650)","156,45 €",21-04-2017,12-04-2017,360 dias,"Portugal, Coimbra, Coimbra",Artigo 259.º do Código dos Contratos Públicos,16-05-2017,"156,45 €",,"",,1974985,"Medicamentos Analgésicos, Antipiréticos e Antidepressivos",FALSE
Processo 17150090-Aquisição de medicamentos,Ao abrigo de acordo-quadro (art.º 259.º),Aquisição de bens móveis,"33000000-0, Equipamento médico, medicamentos e produtos para cuidados pessoais","Administração Regional de Saúde do Centro, I. P. (503122165)","Farmoz - Sociedade Técnico - Medicinal, SA (501505334)","75,70 €",21-04-2017,12-04-2017,360 dias,"Portugal, Coimbra, Coimbra",Artigo 259.º do Código dos Contratos Públicos,21-12-2017,"72,00 €",,acerto enbalagem,,1974985,"Medicamentos Analgésicos, Antipiréticos e Antidepressivos",FALSE
Processo 17150090-Aquisição de medicamentos,Ao abrigo de acordo-quadro (art.º 259.º),Aquisição de bens móveis,"33000000-0, Equipamento médico, medicamentos e produtos para cuidados pessoais","Administração Regional de Saúde do Centro, I. P. (503122165)","GENERIS-FARMACEUTICA,SA (508107997)","214,40 €",21-04-2017,12-04-2017,360 dias,"Portugal, Coimbra, Coimbra",Artigo 259.º do Código dos Contratos Públicos,28-12-2017,"213,06 €",,acerto embalagem,,1974985,"Medicamentos Analgésicos, Antipiréticos e Antidepressivos",FALSE
Processo 17150090-Aquisição de medicamentos,Ao abrigo de acordo-quadro (art.º 259.º),Aquisição de bens móveis,"33000000-0, Equipamento médico, medicamentos e produtos para cuidados pessoais","Administração Regional de Saúde do Centro, I. P. (503122165)",SANDOZ (506985261),"64,83 €",21-04-2017,12-04-2017,360 dias,"Portugal, Coimbra, Coimbra",Artigo 259.º do Código dos Contratos Públicos,28-12-2017,"64,76 €",,acerto embalagem,,1974985,"Medicamentos Analgésicos, Antipiréticos e Antidepressivos",FALSE
Processo 17150090-Aquisição de medicamentos,Ao abrigo de acordo-quadro (art.º 259.º),Aquisição de bens móveis,"33000000-0, Equipamento médico, medicamentos e produtos para cuidados pessoais","Administração Regional de Saúde do Centro, I. P. (503122165)",PHARMAKERN PORTUGAL (507002571),"449,79 €",21-04-2017,12-04-2017,360 dias,"Portugal, Coimbra, Coimbra",Artigo 259.º do Código dos Contratos Públicos,28-12-2017,"449,79 €",,"",,1974985,"Medicamentos Analgésicos, Antipiréticos e Antidepressivos",FALSE
Processo 17150090-Aquisição de medicamentos,Ao abrigo de acordo-quadro (art.º 259.º),Aquisição de bens móveis,"33000000-0, Equipamento médico, medicamentos e produtos para cuidados pessoais","Administração Regional de Saúde do Centro, I. P. (503122165)",OVERPHARMA-PROD.MEDICOS FARMACEUTICOS (505792362),"360,96 €",21-04-2017,12-04-2017,360 dias,"Portugal, Coimbra, Coimbra",Artigo 259.º do Código dos Contratos Públicos,28-12-2017,"360,96 €",,"",,1974985,"Medicamentos Analgésicos, Antipiréticos e Antidepressivos",FALSE
Processo 17150090-Aquisição de medicamentos,Ao abrigo de acordo-quadro (art.º 259.º),Aquisição de bens móveis,"33000000-0, Equipamento médico, medicamentos e produtos para cuidados pessoais","Administração Regional de Saúde do Centro, I. P. (503122165)","FRESENIUS KABI PHARMA PORTUGAL, LDA (504293753)","108,20 €",21-04-2017,12-04-2017,360 dias,"Portugal, Coimbra, Coimbra",Artigo 259.º do Código dos Contratos Públicos,28-12-2017,"108,20 €",,"",,1974985,"Medicamentos Analgésicos, Antipiréticos e Antidepressivos",FALSE
Processo 17150090-Aquisição de medicamentos,Ao abrigo de acordo-quadro (art.º 259.º),Aquisição de bens móveis,"33000000-0, Equipamento médico, medicamentos e produtos para cuidados pessoais","Administração Regional de Saúde do Centro, I. P. (503122165)","B.BRAUN MEDICAL, LDA (501506543)","412,50 €",21-04-2017,12-04-2017,360 dias,"Portugal, Coimbra, Coimbra",Artigo 259.º do Código dos Contratos Públicos,28-12-2017,"412,50 €",,"",,1974985,"Medicamentos Analgésicos, Antipiréticos e Antidepressivos",FALSE
Processo 17150090-Aquisição de medicamentos,Ao abrigo de acordo-quadro (art.º 259.º),Aquisição de bens móveis,"33000000-0, Equipamento médico, medicamentos e produtos para cuidados pessoais","Administração Regional de Saúde do Centro, I. P. (503122165)","Aurovitas Unipessoal, Lda (513053239)","488,80 €",21-04-2017,12-04-2017,360 dias,"Portugal, Coimbra, Coimbra",Artigo 259.º do Código dos Contratos Públicos,28-12-2017,"488,80 €",,"",,1974985,"Medicamentos Analgésicos, Antipiréticos e Antidepressivos",FALSE
Processo 17150090-Aquisição de medicamentos,Ao abrigo de acordo-quadro (art.º 259.º),Aquisição de bens móveis,"33000000-0, Equipamento médico, medicamentos e produtos para cuidados pessoais","Administração Regional de Saúde do Centro, I. P. (503122165)","UNILFARMA, LDA (500293023)","107,87 €",21-04-2017,12-04-2017,360 dias,"Portugal, Coimbra, Coimbra",Artigo 259.º do Código dos Contratos Públicos,28-12-2017,"107,87 €",,"",,1974985,"Medicamentos Analgésicos, Antipiréticos e Antidepressivos",FALSE
Aquisição de medicamentos,Ao abrigo de acordo-quadro (art.º 259.º),Aquisição de bens móveis,"33000000-0, Equipamento médico, medicamentos e produtos para cuidados pessoais","Administração Regional de Saúde do Centro, I. P. (503122165)","LUSOMEDICAMENTA , Sociedade Técnica Farmacêutica, SA     (507150473)","84,10 €",21-04-2017,12-04-2017,360 dias,"Portugal, Coimbra, Coimbra",Artigo 259.º do Código dos Contratos Públicos,28-12-2017,"84,10 €",,"",,1974985,"Medicamentos Analgésicos, Antipiréticos e Antidepressivos",FALSE
Aquisição de medicamentos,Ao abrigo de acordo-quadro (art.º 259.º),Aquisição de bens móveis,"33000000-0, Equipamento médico, medicamentos e produtos para cuidados pessoais","Administração Regional de Saúde do Centro, I. P. (503122165)","LABESFAL - LABORATÓRIOS ALMIRO, SA (501169580)","1.267,72 €",21-04-2017,12-04-2017,360 dias,"Portugal, Coimbra, Coimbra",Artigo 259.º do Código dos Contratos Públicos,28-12-2017,"765,72 €",,houve um medicamento que não foi entregue,,1974985,"Medicamentos Analgésicos, Antipiréticos e Antidepressivos",FALSE
