Objeto do Contrato,Tipo de Procedimento,Tipo(s) de Contrato,CPVs,Entidade(s) Adjudicante(s),Entidade(s) Adjudicatária(s),Preço Contratual,Data de Publicação,Data de Celebração do Contrato,Prazo de Execução,Local de Execução,Fundamentação,Data de Fecho do Contrato,Preço Total Efetivo,Causas das Alterações ao Prazo,Causas das Alterações ao Preço,Estado,N.º registo do Acordo Quadro,Descrição do Acordo Quadro,Procedimento Centralizado
Aquisição de bens e serviços para dotar a Entidade Reguladora da Saúde (ERS) com uma solução de Networking que contemple as seguintes componentes: a)	Infraestrutura Networking LAN (CORE e ACESSO); b)	Implementação da solução. ,Ajuste Direto Regime Geral,Aquisição de serviços<br/>Aquisição de bens móveis,"30200000-1, Equipamento e material informático<BR/>72265000-0, Serviços de configuração de software<BR/>50312000-5, Manutenção e reparação de equipamento informático",Entidade Reguladora da Saúde (507021266),"Gonksys, S.A. (510874169)","67.292,00 €",14-04-2016,15-03-2016,21 dias,"Portugal, Porto, Porto","Artigo 20.º, n.º 1, alínea a) do Código dos Contratos Públicos",,,,,,Não aplicável.,Não aplicável.,FALSE
"Aquisição de serviços para o desenvolvimento necessário à adequação do software do sistema informático, denominado SRER, para alteração da caraterização dos estabelecimentos sujeitos a registo e licenciamento, bem como do fluxo de licenciamento, para que possa ser possível a tramitação legalmente prevista e a criação da base de dados de entidades externas, prevista na alínea d) do n.º 3 do artigo 5.º e no artigo 6.º do Decreto-lei n.º 127/2014, de 22 de agosto.",Ajuste Direto Regime Geral,Aquisição de serviços,"72230000-6, Serviços de desenvolvimento de software à medida",Entidade Reguladora da Saúde (507021266),"Change Tomorrow, Lda. (513104640)","73.995,00 €",14-04-2016,03-02-2016,105 dias,"Portugal, Porto, Porto","Artigo 20.º, n.º 1, alínea a) do Código dos Contratos Públicos",,,,,,Não aplicável.,Não aplicável.,FALSE
