Objeto do Contrato,Tipo de Procedimento,Tipo(s) de Contrato,CPVs,Entidade(s) Adjudicante(s),Entidade(s) Adjudicatária(s),Preço Contratual,Data de Publicação,Data de Celebração do Contrato,Prazo de Execução,Local de Execução,Fundamentação,Data de Fecho do Contrato,Preço Total Efetivo,Causas das Alterações ao Prazo,Causas das Alterações ao Preço,Estado,N.º registo do Acordo Quadro,Descrição do Acordo Quadro,Procedimento Centralizado
Aminoacidos 7 gn/l + gluco 140 g/l + lip 40 g/l,Ajuste Direto Regime Geral,Aquisição de bens móveis,"33690000-3, Medicamentos vários","Centro Hospitalar Lisboa Norte, E. P. E. (508481287)","Baxter médicos farmaceutico, lda (503347345)","5.004,00 €",08-11-2013,08-11-2013,2 dias,"Portugal, Lisboa, Lisboa","Artigo 24.º, n.º 1, alínea e) do Código dos Contratos Públicos",,,,,,Não aplicável.,Não aplicável.,
consumiveis de ortopedia,Ajuste Direto Regime Geral,Aquisição de bens móveis,"33140000-3, Material médico de consumo","Centro Hospitalar Lisboa Norte, E. P. E. (508481287)",synthes comercialização dispositivos medicos lda (501212191),"6.012,13 €",08-11-2013,08-11-2013,2 dias,"Portugal, Lisboa, Lisboa","Artigo 20.º, n.º 1, alínea a) do Código dos Contratos Públicos",,,,,,Não aplicável.,Não aplicável.,
prosete peniana,Ajuste Direto Regime Geral,Aquisição de bens móveis,"33184000-3, Próteses","Centro Hospitalar Lisboa Norte, E. P. E. (508481287)","american medical systems iberica, sa (980223598)","6.200,00 €",08-11-2013,08-11-2013,2 dias,"Portugal, Lisboa, Lisboa","Artigo 20.º, n.º 1, alínea a) do Código dos Contratos Públicos",,,,,,Não aplicável.,Não aplicável.,
substituição de 2 cortinados,Ajuste Direto Regime Geral,Aquisição de bens móveis,"19244000-8, Tecidos para cortinados","Centro Hospitalar Lisboa Norte, E. P. E. (508481287)",promei centro - compra e venda montagem assist. tecnica de equipamento (506470113),"381,90 €",06-11-2013,06-11-2013,10 dias,"Portugal, Lisboa, Lisboa","Artigo 20.º, n.º 1, alínea a) do Código dos Contratos Públicos",,,,,,Não aplicável.,Não aplicável.,
protamina sol. inj. 10 mg/ml amp 5 ml,Ajuste Direto Regime Geral,Aquisição de bens móveis,"33690000-3, Medicamentos vários",Centro Hospitalar Lisboa Norte EPE (508481287),"leo farmaceuticos, lda (503932680)","7.560,00 €",06-11-2013,06-11-2013,2 dias,"Portugal, Lisboa, Lisboa","Artigo 24.º, n.º 1, alínea e) do Código dos Contratos Públicos",,,,,,Não aplicável.,Não aplicável.,
mlpa teste 100 t,Ajuste Direto Regime Geral,Aquisição de bens móveis,"33690000-3, Medicamentos vários",Centro Hospitalar Lisboa Norte EPE (508481287),"alfagene, lda (503387398)","4.542,00 €",06-11-2013,06-11-2013,2 dias,"Portugal, Lisboa, Lisboa","Artigo 24.º, n.º 1, alínea e) do Código dos Contratos Públicos",,,,,,Não aplicável.,Não aplicável.,
Valganciclovir 50 mg/ml sol oral fr 100,Ajuste Direto Regime Geral,Aquisição de bens móveis,"33690000-3, Medicamentos vários",Centro Hospitalar Lisboa Norte EPE (508481287),roche farmaceutica quimica lda (500233810),"9.668,70 €",06-11-2013,06-11-2013,2 dias,"Portugal, Lisboa, Lisboa","Artigo 24.º, n.º 1, alínea e) do Código dos Contratos Públicos",,,,,,Não aplicável.,Não aplicável.,
Prod. entericos compl. normalizado polimeri,Ajuste Direto Regime Geral,Aquisição de bens móveis,"33690000-3, Medicamentos vários",Centro Hospitalar Lisboa Norte EPE (508481287),"fresenius kabi pharma portugal, lda (504293753)","6.894,00 €",06-11-2013,06-11-2013,2 dias,"Portugal, Lisboa, Lisboa","Artigo 24.º, n.º 1, alínea e) do Código dos Contratos Públicos",,,,,,Não aplicável.,Não aplicável.,
aquisição de polielectrolitico sol. p/filtração 2 MEQ l saco 5 l,Ajuste Direto Regime Geral,Aquisição de bens móveis,"33690000-3, Medicamentos vários",Centro Hospitalar Lisboa Norte EPE (508481287),gambro lundia ab sucursal em lisboa (980367751),"8.400,00 €",06-11-2013,06-11-2013,2 dias,"Portugal, Lisboa, Lisboa","Artigo 24.º, n.º 1, alínea e) do Código dos Contratos Públicos",,,,,,Não aplicável.,Não aplicável.,
hilano gf 20 seringa 6 ml,Ajuste Direto Regime Geral,Aquisição de bens móveis,"33690000-3, Medicamentos vários","Centro Hospitalar Lisboa Norte, E. P. E. (508481287)","sanofi - produtos farmaceuticos, lda (500134960)","7.238,40 €",06-11-2013,06-11-2013,2 dias,"Portugal, Lisboa, Lisboa","Artigo 24.º, n.º 1, alínea e) do Código dos Contratos Públicos",,,,,,Não aplicável.,Não aplicável.,
aquisição de stent intrcr semi com nitinol 4.0 x20 mm,Ajuste Direto Regime Geral,Aquisição de bens móveis,"33190000-8, Dispositivos e produtos médicos variados","Centro Hospitalar Lisboa Norte, E. P. E. (508481287)","biomedica sociedade de produtos medicos, lda (501745459)","9.500,00 €",05-11-2013,05-11-2013,2 dias,"Portugal, Lisboa, Lisboa","Artigo 20.º, n.º 1, alínea a) do Código dos Contratos Públicos",,,,,,Não aplicável.,Não aplicável.,
CDI VR,Ajuste Direto Regime Geral,Aquisição de bens móveis,"33182100-0, Desfibrilhador","Centro Hospitalar Lisboa Norte, E. P. E. (508481287)","st jude medical, lda (504180746)","9.775,00 €",05-11-2013,05-11-2013,2 dias,"Portugal, Lisboa, Lisboa","Artigo 20.º, n.º 1, alínea a) do Código dos Contratos Públicos",,,,,,Não aplicável.,Não aplicável.,
realização de serviços de instalação de componentes de rede,Ajuste Direto Regime Geral,Aquisição de serviços,"72500000-0, Serviços relacionados com a informática","Centro Hospitalar Lisboa Norte, E. P. E. (508481287)","isinet  - integração e serviços informaticos, lda (503255777)","6.988,80 €",05-11-2013,05-11-2013,120 dias,"Portugal, Lisboa, Lisboa","Artigo 20.º, n.º 1, alínea a) do Código dos Contratos Públicos",,,,,,Não aplicável.,Não aplicável.,
aquisição de equipamentos passivos,Ajuste Direto Regime Geral,Aquisição de bens móveis,"30200000-1, Equipamento e material informático","Centro Hospitalar Lisboa Norte, E. P. E. (508481287)","isinet integração serv. informaticos, lda (503255777)","4.998,50 €",05-11-2013,05-11-2013,45 dias,"Portugal, Lisboa, Lisboa","Artigo 20.º, n.º 1, alínea a) do Código dos Contratos Públicos",,,,,,Não aplicável.,Não aplicável.,
estofar cadeira rodada,Ajuste Direto Regime Geral,Aquisição de serviços,"50850000-8, Serviços de reparação e manutenção de mobiliário","Centro Hospitalar Lisboa Norte, E. P. E. (508481287)",carlos alberto cordeiro serralha (117612928),"25,00 €",05-11-2013,05-11-2013,10 dias,"Portugal, Lisboa, Lisboa","Artigo 20.º, n.º 1, alínea a) do Código dos Contratos Públicos",,,,,,Não aplicável.,Não aplicável.,
Aquisição de impressoras,Ajuste Direto Regime Geral,Aquisição de bens móveis,"30100000-0, Máquinas, equipamento e material de escritório, excepto computadores, impressoras e mobiliário","Centro Hospitalar Lisboa Norte, E. P. E. (508481287)",iten solutions sa (510728189),"9.934,50 €",05-11-2013,05-11-2013,2 dias,"Portugal, Lisboa, Lisboa","Artigo 20.º, n.º 1, alínea a) do Código dos Contratos Públicos",,,,,,Não aplicável.,Não aplicável.,
alopurinol comp 300 mg,Ajuste Direto Regime Geral,Aquisição de bens móveis,"33690000-3, Medicamentos vários","Centro Hospitalar Lisboa Norte, E. P. E. (508481287)","laboratorios atral, sa (500162085)","273,60 €",01-11-2013,01-11-2013,2 dias,"Portugal, Lisboa, Lisboa","Artigo 20.º, n.º 1, alínea a) do Código dos Contratos Públicos",,,,,,Não aplicável.,Não aplicável.,
aquisição de diversos reagentes,Ajuste Direto Regime Geral,Aquisição de bens móveis,"33696000-5, Reagentes e meios de contraste","Centro Hospitalar Lisboa Norte, E. P. E. (508481287)","izasa portugal - distribuições tecnicas, lda (501086110)","5.040,00 €",01-11-2013,01-11-2013,2 dias,"Portugal, Lisboa, Lisboa","Artigo 24.º, n.º 1, alínea e) do Código dos Contratos Públicos",,,,,,Não aplicável.,Não aplicável.,
aquisição de suplmento multivitaminico e zinco caps,Ajuste Direto Regime Geral,Aquisição de bens móveis,"33690000-3, Medicamentos vários","Centro Hospitalar Lisboa Norte, E. P. E. (508481287)","prx +harma produtos farmaceuticos unipessoal, lda (507991796)","7.349,99 €",31-10-2013,31-10-2013,2 dias,"Portugal, Lisboa, Lisboa","Artigo 24.º, n.º 1, alínea e) do Código dos Contratos Públicos",,,,,,Não aplicável.,Não aplicável.,
aquisição de ibuprofeno comp. 200 mg,Ajuste Direto Regime Geral,Aquisição de bens móveis,"33690000-3, Medicamentos vários","Centro Hospitalar Lisboa Norte, E. P. E. (508481287)","farmoz soc. tecnico medicinal, sa (501505334)","486,00 €",31-10-2013,31-10-2013,2 dias,"Portugal, Lisboa, Lisboa","Artigo 20.º, n.º 1, alínea a) do Código dos Contratos Públicos",,,,,,Não aplicável.,Não aplicável.,
Aquisição de somatropina inj. 6 mg,Ajuste Direto Regime Geral,Aquisição de bens móveis,"33690000-3, Medicamentos vários","Centro Hospitalar Lisboa Norte, E. P. E. (508481287)","lilly - portugal produtos farmaceuticos, lda (500165602)","8.817,75 €",31-10-2013,31-10-2013,2 dias,"Portugal, Lisboa, Lisboa","Artigo 24.º, n.º 1, alínea d) do Código dos Contratos Públicos",,,,,,Não aplicável.,Não aplicável.,
Aquisição de Paracetamol sup 1 g,Ajuste Direto Regime Geral,Aquisição de bens móveis,"33661200-3, Analgésicos","Centro Hospitalar Lisboa Norte, E. P. E. (508481287)","Bene Farmacêutica, Lda.  (508735696)","6,30 €",31-10-2013,24-10-2013,15 dias,"Portugal, Lisboa, Lisboa","Artigo 20.º, n.º 1, alínea a) do Código dos Contratos Públicos",,,,,,Não aplicável.,Não aplicável.,
"   Aquisição de Diclofenac sol. inj. 37,5 mg/ml amp 2 ml",Ajuste Direto Regime Geral,Aquisição de bens móveis,"33652000-5, Antineoplásicos e imunomoduladores","Centro Hospitalar Lisboa Norte, E. P. E. (508481287)","Labesfal, SA. (501169580)","561,24 €",31-10-2013,24-10-2013,5 dias,"Portugal, Lisboa, Lisboa","Artigo 20.º, n.º 1, alínea a) do Código dos Contratos Públicos",,,,,,Não aplicável.,Não aplicável.,
"Reparação da central de incendio do posto de transformação do CHLN, EPE",Ajuste Direto Regime Geral,Aquisição de serviços,"51100000-3, Serviços de instalação de equipamento eléctrico e mecânico","Centro Hospitalar Lisboa Norte, E. P. E. (508481287)","paulo jesus  costa, unipessoal, lda (510167780)","5.942,51 €",31-10-2013,31-10-2013,120 dias,"Portugal, Lisboa, Lisboa","Artigo 20.º, n.º 1, alínea a) do Código dos Contratos Públicos",,,,,,Não aplicável.,Não aplicável.,
Aquisição de suporte de arrastadeiras,Ajuste Direto Regime Geral,Aquisição de bens móveis,"33140000-3, Material médico de consumo","Centro Hospitalar Lisboa Norte, E. P. E. (508481287)","eugenio pereira, lda (503989525)","392,00 €",31-10-2013,31-10-2013,2 dias,"Portugal, Lisboa, Lisboa","Artigo 20.º, n.º 1, alínea a) do Código dos Contratos Públicos",,,,,,Não aplicável.,Não aplicável.,
Aquisição de autoclave de bancada,Ajuste Direto Regime Geral,Aquisição de bens móveis,"33191110-9, Autoclaves","Centro Hospitalar Lisboa Norte, E. P. E. (508481287)","A.J.Costa, lda (500002576)","6.206,00 €",31-10-2013,31-10-2013,50 dias,"Portugal, Lisboa, Lisboa","Artigo 20.º, n.º 1, alínea a) do Código dos Contratos Públicos",,,,,,Não aplicável.,Não aplicável.,
consumiveis p/serviço de medicina interna,Ajuste Direto Regime Geral,Aquisição de bens móveis,"33140000-3, Material médico de consumo","Centro Hospitalar Lisboa Norte, E. P. E. (508481287)","maquet portugal comercio equipamentos hospitalares unipessoal, lda (506819698)","8.736,00 €",31-10-2013,31-10-2013,2 dias,"Portugal, Lisboa, Lisboa","Artigo 20.º, n.º 1, alínea a) do Código dos Contratos Públicos",,,,,,Não aplicável.,Não aplicável.,
epoetina beta inj. 30.000 UI,Ajuste Direto Regime Geral,Aquisição de bens móveis,"33690000-3, Medicamentos vários","Centro Hospitalar Lisboa Norte, E. P. E. (508481287)","Roche farmaceutica quimica, lda (500233810)","9.000,00 €",31-10-2013,31-10-2013,2 dias,"Portugal, Lisboa, Lisboa","Artigo 24.º, n.º 1, alínea e) do Código dos Contratos Públicos",,,,,,Não aplicável.,Não aplicável.,
