freguesia,acronym,validVotesPercentage,votes,dicofre
Porto Santo,PS,51.95,1382,320101
Porto Santo,PPD/PSD,32.26,858,320101
Porto Santo,B.E.,4.02,107,320101
Porto Santo,CDS-PP,3.46,92,320101
Porto Santo,CH,1.65,44,320101
Porto Santo,PAN,1.32,35,320101
Porto Santo,PCP-PEV,1.05,28,320101
Porto Santo,JPP,0.86,23,320101
Porto Santo,PTP,0.83,22,320101
Porto Santo,IL,0.71,19,320101
Porto Santo,PURP,0.34,9,320101
Porto Santo,A,0.3,8,320101
Porto Santo,MPT,0.3,8,320101
Porto Santo,L,0.23,6,320101
Porto Santo,PPM,0.19,5,320101
Porto Santo,R.I.R.,0.19,5,320101
Porto Santo,PCTP/MRPP,0.15,4,320101
Porto Santo,PNR,0.11,3,320101
Porto Santo,NC,0.08,2,320101
Porto Santo,PDR,0,0,320101
