freguesia,acronym,validVotesPercentage,votes,dicofre
Leomil,PPD/PSD.CDS-PP,48.2,134,180709
Leomil,PS,29.14,81,180709
Leomil,MPT,6.47,18,180709
Leomil,PCP-PEV,5.76,16,180709
Leomil,B.E.,2.88,8,180709
Leomil,PCTP/MRPP,1.8,5,180709
Leomil,L,1.44,4,180709
Leomil,PND,1.08,3,180709
Leomil,PAN,0.72,2,180709
Leomil,PPM,0.72,2,180709
Leomil,PTP,0.72,2,180709
Leomil,MAS,0.36,1,180709
Leomil,PNR,0.36,1,180709
Leomil,PPV,0.36,1,180709
Leomil,PDA,0,0,180709
Leomil,POUS,0,0,180709
