freguesia,acronym,validVotesPercentage,votes,dicofre
São Mamede,PPD/PSD,57.85,1069,100403
São Mamede,PS,16.77,310,100403
São Mamede,CDS-PP,9.2,170,100403
São Mamede,B.E.,5.09,94,100403
São Mamede,PAN,2,37,100403
São Mamede,CH,1.41,26,100403
São Mamede,A,1.08,20,100403
São Mamede,IL,1.03,19,100403
São Mamede,PCP-PEV,0.97,18,100403
São Mamede,R.I.R.,0.97,18,100403
São Mamede,L,0.81,15,100403
São Mamede,PCTP/MRPP,0.6,11,100403
São Mamede,PDR,0.43,8,100403
São Mamede,PTP,0.38,7,100403
São Mamede,MPT,0.32,6,100403
São Mamede,PURP,0.27,5,100403
São Mamede,JPP,0.22,4,100403
São Mamede,NC,0.22,4,100403
São Mamede,PPM,0.22,4,100403
São Mamede,PNR,0.16,3,100403
São Mamede,MAS,0,0,100403
