Objeto do Contrato,Tipo de Procedimento,Tipo(s) de Contrato,CPVs,Entidade(s) Adjudicante(s),Entidade(s) Adjudicatária(s),Preço Contratual,Data de Publicação,Data de Celebração do Contrato,Prazo de Execução,Local de Execução,Fundamentação,Data de Fecho do Contrato,Preço Total Efetivo,Causas das Alterações ao Prazo,Causas das Alterações ao Preço,Estado,N.º registo do Acordo Quadro,Descrição do Acordo Quadro,Procedimento Centralizado
40077/2016 Enteroscopia por Videocapsula,Ajuste Direto Regime Geral,Aquisição de bens móveis,"33110000-4, Equipamento de imagiologia para uso médico, dentário e veterinário","CHBM - Centro Hospital Barreiro Montijo, EPE (509186998)","ALVES & CO (IRMAOS), LDA (500310068)","5.985,00 €",10-11-2016,03-10-2016,365 dias,"Portugal, Setúbal, Barreiro","Artigo 20.º, n.º 1, alínea a) do Código dos Contratos Públicos",03-11-2016,"5.985,00 €",,"",,Não aplicável.,Não aplicável.,FALSE
4SI0026/2016 SERV MÉD DE PSIQUIATRIA,Ao abrigo de acordo-quadro (art.º 259.º),Aquisição de serviços,"85141000-9, Serviços prestados pelo pessoal médico","Centro Hospitalar Barreiro Montijo, E. P. E. (509186998)","HELPED, PRESTAÇÃO SERVIÇOS SAÚDE LDA. (506069010)","22.880,00 €",09-11-2016,04-05-2016,275 dias,"Portugal, Setúbal, Barreiro",Artigo 259.º do Código dos Contratos Públicos,31-12-2016,"13.860,00 €",,Consumo efetivo inferior ao inicialmente estimado,,1490434,ACORDO QUADRO PARA PRESTAÇÃO DE SERVIÇOS MÉDICOS ÀS INSTITUIÇÕES E SERVIÇOS DO SERVIÇO NACIONAL DE SAÚDE,FALSE
4SI0025/2016 SERV MÉD DE CIRURGIA,Ao abrigo de acordo-quadro (art.º 259.º),Aquisição de serviços,"85141000-9, Serviços prestados pelo pessoal médico","Centro Hospitalar Barreiro Montijo, E. P. E. (509186998)","Talenter 24 - Serviços de Saúde, Lda. (510359698)","39.151,84 €",09-11-2016,24-05-2016,215 dias,"Portugal, Setúbal, Barreiro",Artigo 259.º do Código dos Contratos Públicos,31-12-2016,"46.143,24 €",,Consumo efetivo superior ao inicialmente estimado,,1490434,ACORDO QUADRO PARA PRESTAÇÃO DE SERVIÇOS MÉDICOS ÀS INSTITUIÇÕES E SERVIÇOS DO SERVIÇO NACIONAL DE SAÚDE,FALSE
4SI0020/2016 SERV MÉD NÃO ESPECIALISTAS P URG PEDIATRICA,Ao abrigo de acordo-quadro (art.º 259.º),Aquisição de serviços,"85141000-9, Serviços prestados pelo pessoal médico","Centro Hospitalar Barreiro Montijo, E. P. E. (509186998)","Talenter 24 - Serviços de Saúde, Lda. (510359698)","21.840,00 €",09-11-2016,20-06-2016,275 dias,"Portugal, Setúbal, Barreiro",Artigo 259.º do Código dos Contratos Públicos,31-12-2016,"4.020,00 €",,Consumo efetivo inferior ao inicialmente estimado,,1490434,ACORDO QUADRO PARA PRESTAÇÃO DE SERVIÇOS MÉDICOS ÀS INSTITUIÇÕES E SERVIÇOS DO SERVIÇO NACIONAL DE SAÚDE,FALSE
4SI0024/2016 SERV MÉD DE OBSTETRICIA,Ao abrigo de acordo-quadro (art.º 259.º),Aquisição de serviços,"85141000-9, Serviços prestados pelo pessoal médico","Centro Hospitalar Barreiro Montijo, E. P. E. (509186998)","HELPED, PRESTAÇÃO SERVIÇOS SAÚDE LDA. (506069010)","102.620,70 €",09-11-2016,02-06-2016,275 dias,"Portugal, Setúbal, Barreiro",Artigo 259.º do Código dos Contratos Públicos,31-12-2016,"40.950,00 €",,Consumo efetivo inferior ao inicialmente estimado,,1490434,ACORDO QUADRO PARA PRESTAÇÃO DE SERVIÇOS MÉDICOS ÀS INSTITUIÇÕES E SERVIÇOS DO SERVIÇO NACIONAL DE SAÚDE,FALSE
4SI0023/2016 SERV MÉD DE MEDICINA INTERNA,Ao abrigo de acordo-quadro (art.º 259.º),Aquisição de serviços,"85141000-9, Serviços prestados pelo pessoal médico","Centro Hospitalar Barreiro Montijo, E. P. E. (509186998)","Kelly Services, Lda (510723691)","127.545,60 €",09-11-2016,06-05-2016,214 dias,"Portugal, Setúbal, Barreiro",Artigo 259.º do Código dos Contratos Públicos,31-12-2016,"103.981,20 €",,Consumo efetivo inferior ao inicialmente estimado,,1490434,ACORDO QUADRO PARA PRESTAÇÃO DE SERVIÇOS MÉDICOS ÀS INSTITUIÇÕES E SERVIÇOS DO SERVIÇO NACIONAL DE SAÚDE,FALSE
4SI0013/2016 SERV MÉD OFTALMOLOGIA P ANO 2016 (ACORDO QUADRO DOS SPMS Nº 2012/102),Ao abrigo de acordo-quadro (art.º 259.º),Aquisição de serviços,"85141000-9, Serviços prestados pelo pessoal médico","Centro Hospitalar Barreiro Montijo, E. P. E. (509186998)",Randstad II - Prestação de Serviços (503298999),"6.240,00 €",09-11-2016,18-01-2016,60 dias,"Portugal, Setúbal, Barreiro",Artigo 259.º do Código dos Contratos Públicos,31-03-2016,"6.855,00 €",,Houve necessidade de prolongar o procedimentos por mais 1 mes,,454020,"CONCURSO PÚBLICO PARA A CELEBRAÇÃO DE CONTRATOS PÚBLICOS DE APROVISIONAMENTO PARA A ÁREA DA SAÚDE, COM VISTA À PRESTAÇÃO DE SERVIÇOS MÉDICOS ÀS INSTITUIÇÕES E SERVIÇOS DO SERVIÇO NACIONAL DE SAÚDE",FALSE
4SI0011/2016 PREST SERV MÉD UROLOGIA P ANO 2016 (ACORDO QUADRO DOS SPMS Nº 2012/102),Ao abrigo de acordo-quadro (art.º 259.º),Aquisição de serviços,"85141000-9, Serviços prestados pelo pessoal médico","Centro Hospitalar Barreiro Montijo, E. P. E. (509186998)","Kelly Services, Lda (510723691)","9.173,00 €",09-11-2016,18-01-2016,60 dias,"Portugal, Setúbal, Barreiro",Artigo 259.º do Código dos Contratos Públicos,31-03-2016,"10.819,20 €",,Houve necessidade de prolongar o procedimento por mais meses,,454020,"CONCURSO PÚBLICO PARA A CELEBRAÇÃO DE CONTRATOS PÚBLICOS DE APROVISIONAMENTO PARA A ÁREA DA SAÚDE, COM VISTA À PRESTAÇÃO DE SERVIÇOS MÉDICOS ÀS INSTITUIÇÕES E SERVIÇOS DO SERVIÇO NACIONAL DE SAÚDE",FALSE
4SI0010/2016 PREST SERV MÉD CARDIOLOGIA P ANO 2016 (ACORDO QUADRO DOS SPMS Nº 2012/102),Ao abrigo de acordo-quadro (art.º 259.º),Aquisição de serviços,"85141000-9, Serviços prestados pelo pessoal médico","Centro Hospitalar Barreiro Montijo, E. P. E. (509186998)",Randstad II - Prestação de Serviços (503298999),"12.347,00 €",09-11-2016,18-01-2016,60 dias,"Portugal, Setúbal, Barreiro",Artigo 259.º do Código dos Contratos Públicos,01-07-2016,"15.626,52 €",,Houve necessidade de prolongar o procedimento por mais meses,,454020,"CONCURSO PÚBLICO PARA A CELEBRAÇÃO DE CONTRATOS PÚBLICOS DE APROVISIONAMENTO PARA A ÁREA DA SAÚDE, COM VISTA À PRESTAÇÃO DE SERVIÇOS MÉDICOS ÀS INSTITUIÇÕES E SERVIÇOS DO SERVIÇO NACIONAL DE SAÚDE",FALSE
4SI0009/2016 PREST SERV MÉD PSIQUIATRIA P ANO 2016 (ACORDO QUADRO DOS SPMS Nº 2012/102),Ao abrigo de acordo-quadro (art.º 259.º),Aquisição de serviços,"85141000-9, Serviços prestados pelo pessoal médico","Centro Hospitalar Barreiro Montijo, E. P. E. (509186998)","GS24 - Healthcare Solutions, Lda (507824652)","5.718,00 €",09-11-2016,25-01-2016,60 dias,"Portugal, Setúbal, Barreiro",Artigo 259.º do Código dos Contratos Públicos,30-04-2016,"5.607,96 €",,Consumo real inferior ao estimado,,454020,"CONCURSO PÚBLICO PARA A CELEBRAÇÃO DE CONTRATOS PÚBLICOS DE APROVISIONAMENTO PARA A ÁREA DA SAÚDE, COM VISTA À PRESTAÇÃO DE SERVIÇOS MÉDICOS ÀS INSTITUIÇÕES E SERVIÇOS DO SERVIÇO NACIONAL DE SAÚDE",FALSE
4SI0008/2016 PREST SERV MÉD CIRURGIA GERAL P ANO 2016 (ACORDO QUADRO DOS SPMS Nº 2012/102),Ao abrigo de acordo-quadro (art.º 259.º),Aquisição de serviços,"85141000-9, Serviços prestados pelo pessoal médico","Centro Hospitalar Barreiro Montijo, E. P. E. (509186998)","GS24 - Healthcare Solutions, Lda (507824652)","11.332,00 €",09-11-2016,25-01-2016,60 dias,"Portugal, Setúbal, Barreiro",Artigo 259.º do Código dos Contratos Públicos,31-05-2016,"6.183,48 €",,Consumo real inferior ao estimado,,454020,"CONCURSO PÚBLICO PARA A CELEBRAÇÃO DE CONTRATOS PÚBLICOS DE APROVISIONAMENTO PARA A ÁREA DA SAÚDE, COM VISTA À PRESTAÇÃO DE SERVIÇOS MÉDICOS ÀS INSTITUIÇÕES E SERVIÇOS DO SERVIÇO NACIONAL DE SAÚDE",FALSE
4SI0007/2016 PREST SERV MÉD GINECOLOGIA/OBSTETRICIA P ANO 2016 (ACORDO QUADRO DOS SPMS Nº 2012/102),Ao abrigo de acordo-quadro (art.º 259.º),Aquisição de serviços,"85141000-9, Serviços prestados pelo pessoal médico","Centro Hospitalar Barreiro Montijo, E. P. E. (509186998)","HELPED, PRESTAÇÃO SERVIÇOS SAÚDE LDA. (506069010)","19.440,00 €",09-11-2016,27-01-2016,60 dias,"Portugal, Setúbal, Barreiro",Artigo 259.º do Código dos Contratos Públicos,31-05-2016,"39.810,52 €",,Necessidade de reforço por prolongamento de 3 meses,,454020,"CONCURSO PÚBLICO PARA A CELEBRAÇÃO DE CONTRATOS PÚBLICOS DE APROVISIONAMENTO PARA A ÁREA DA SAÚDE, COM VISTA À PRESTAÇÃO DE SERVIÇOS MÉDICOS ÀS INSTITUIÇÕES E SERVIÇOS DO SERVIÇO NACIONAL DE SAÚDE",FALSE
4SI0006/2016 PREST SERV MÉD MEDICINA P ANO 2016 (ACORDO QUADRO DOS SPMS Nº 2012/102),Ao abrigo de acordo-quadro (art.º 259.º),Aquisição de serviços,"85141000-9, Serviços prestados pelo pessoal médico","Centro Hospitalar Barreiro Montijo, E. P. E. (509186998)","Kelly Services, Lda (510723691)","36.442,00 €",09-11-2016,18-01-2016,60 dias,"Portugal, Setúbal, Barreiro",Artigo 259.º do Código dos Contratos Públicos,31-05-2016,"54.034,60 €",,Houve necessidade de reforço por mais 3 meses,,454020,"CONCURSO PÚBLICO PARA A CELEBRAÇÃO DE CONTRATOS PÚBLICOS DE APROVISIONAMENTO PARA A ÁREA DA SAÚDE, COM VISTA À PRESTAÇÃO DE SERVIÇOS MÉDICOS ÀS INSTITUIÇÕES E SERVIÇOS DO SERVIÇO NACIONAL DE SAÚDE",FALSE
4SI0003/2016 PREST SERV MÉD NÃO ESPECIALISTAS P URG PEDIATRICA P ANO 2016 (ACORDO QUADRO DOS SPMS Nº 2012/102),Ao abrigo de acordo-quadro (art.º 259.º),Aquisição de serviços,"85141000-9, Serviços prestados pelo pessoal médico","Centro Hospitalar Barreiro Montijo, E. P. E. (509186998)","HELPED, PRESTAÇÃO SERVIÇOS SAÚDE LDA. (506069010)","3.700,00 €",09-11-2016,18-01-2016,60 dias,"Portugal, Setúbal, Barreiro",Artigo 259.º do Código dos Contratos Públicos,24-02-2016,"444,00 €",,Total executado inferior ao inicialmente estimado,,454020,"CONCURSO PÚBLICO PARA A CELEBRAÇÃO DE CONTRATOS PÚBLICOS DE APROVISIONAMENTO PARA A ÁREA DA SAÚDE, COM VISTA À PRESTAÇÃO DE SERVIÇOS MÉDICOS ÀS INSTITUIÇÕES E SERVIÇOS DO SERVIÇO NACIONAL DE SAÚDE",FALSE
4SI0002/2016 PREST SERV MÉD NÃO ESPECIALISTAS P URG GERAL DO CHBM P ANO 2016 (ACORDO QUADRO DOS SPMS Nº 2012/102),Ao abrigo de acordo-quadro (art.º 259.º),Aquisição de serviços,"85141000-9, Serviços prestados pelo pessoal médico","Centro Hospitalar Barreiro Montijo, E. P. E. (509186998)",Randstad II - Prestação de Serviços (503298999),"80.197,50 €",09-11-2016,24-02-2016,60 dias,"Portugal, Setúbal, Barreiro",Artigo 259.º do Código dos Contratos Públicos,31-12-2016,"370.129,50 €",,Consumo efetivo superior ao inicialmente estimado,,454020,"CONCURSO PÚBLICO PARA A CELEBRAÇÃO DE CONTRATOS PÚBLICOS DE APROVISIONAMENTO PARA A ÁREA DA SAÚDE, COM VISTA À PRESTAÇÃO DE SERVIÇOS MÉDICOS ÀS INSTITUIÇÕES E SERVIÇOS DO SERVIÇO NACIONAL DE SAÚDE",FALSE
4S0102/2016 SERV MED NÃO ESP. URG. GERAL - DR. RUI BADJANA - RECIBO VERDE,Ajuste Direto Regime Geral,Aquisição de serviços,"85141000-9, Serviços prestados pelo pessoal médico","Centro Hospitalar Barreiro Montijo, E. P. E. (509186998)",Rui Badjana (237308932),"12.000,00 €",09-11-2016,21-10-2016,61 dias,"Portugal, Setúbal, Barreiro","Artigo 20.º, n.º 1, alínea a) do Código dos Contratos Públicos",31-12-2016,"6.397,50 €",,Total efetivo inferior ao incialmente estimado,,Não aplicável.,Não aplicável.,FALSE
4S0101/2016 SERV MED NÃO ESP. URG. GERAL - DRA. ANTONIETA PEREIRA - RECIBO VERDE,Ajuste Direto Regime Geral,Aquisição de serviços,"85141000-9, Serviços prestados pelo pessoal médico","Centro Hospitalar Barreiro Montijo, E. P. E. (509186998)",Maria Antonieta Pereira (207887535),"9.600,00 €",09-11-2016,20-10-2016,61 dias,"Portugal, Setúbal, Barreiro","Artigo 20.º, n.º 1, alínea a) do Código dos Contratos Públicos",31-12-2016,"5.535,00 €",,Total efetivo inferior ao incialmente estimado,,Não aplicável.,Não aplicável.,FALSE
4S0099/2016 SERV MED URG. PED. - DRA. CÁTIA ALCOBIA - RECIBO VERDE,Ajuste Direto Regime Geral,Aquisição de serviços,"85141000-9, Serviços prestados pelo pessoal médico","Centro Hospitalar Barreiro Montijo, E. P. E. (509186998)",Cátia Sofia Alcobia (226509672),"1.440,00 €",09-11-2016,19-10-2016,92 dias,"Portugal, Setúbal, Barreiro","Artigo 20.º, n.º 1, alínea a) do Código dos Contratos Públicos",31-12-2016,"885,00 €",,Total efetivo inferior ao incialmente estimado,,Não aplicável.,Não aplicável.,FALSE
4S0096/2016 SERV MÉDICOS DE MEDICINA INTERNA - UCI - DRA CECILIA BEATRIZ AMARAL - RECIBO VERDE,Ajuste Direto Regime Geral,Aquisição de serviços,"85141000-9, Serviços prestados pelo pessoal médico","Centro Hospitalar Barreiro Montijo, E. P. E. (509186998)",Cecília Beatriz Alves Amaral (221021558),"6.480,00 €",09-11-2016,17-10-2016,92 dias,"Portugal, Setúbal, Barreiro","Artigo 20.º, n.º 1, alínea a) do Código dos Contratos Públicos",31-12-2016,"1.620,00 €",,Total efetivo inferior ao incialmente estimado,,Não aplicável.,Não aplicável.,FALSE
4S0095/2016 SERV MED OFTALMOLOGIA - DRA. BÁRBARA ISABEL BORGES - RECIBO VERDE,Ajuste Direto Regime Geral,Aquisição de serviços,"85141000-9, Serviços prestados pelo pessoal médico","Centro Hospitalar Barreiro Montijo, E. P. E. (509186998)",Bárbara Isabel Correia Coelho Jardim Borges (234285001),"7.800,00 €",08-11-2016,10-10-2016,92 dias,"Portugal, Setúbal, Barreiro","Artigo 20.º, n.º 1, alínea a) do Código dos Contratos Públicos",31-12-2016,"4.320,00 €",,Total efetivo inferior ao incialmente estimado,,Não aplicável.,Não aplicável.,FALSE
4S0088/2016 SERV MED OFTALMOLOGIA - DRA. ANA RAQUEL BRITO - RECIBO VERDE,Ajuste Direto Regime Geral,Aquisição de serviços,"85141000-9, Serviços prestados pelo pessoal médico","Centro Hospitalar Barreiro Montijo, E. P. E. (509186998)",Raquel Claro Brito (250856476),"6.300,00 €",08-11-2016,10-10-2016,92 dias,"Portugal, Setúbal, Barreiro","Artigo 20.º, n.º 1, alínea a) do Código dos Contratos Públicos",31-12-2016,"3.906,09 €",,Total efetivo inferior ao incialmente estimado,,Não aplicável.,Não aplicável.,FALSE
4S0081/2016 SERV MÉDICOS DE MEDICINA INTERNA - UCI - DRA ZÉLIA NEVES - RECIBO VERDE,Ajuste Direto Regime Geral,Aquisição de serviços,"85141000-9, Serviços prestados pelo pessoal médico","Centro Hospitalar Barreiro Montijo, E. P. E. (509186998)",Zélia Catarina Rodrigues Neves (243339810),"4.320,00 €",08-11-2016,29-07-2016,184 dias,"Portugal, Setúbal, Barreiro","Artigo 20.º, n.º 1, alínea a) do Código dos Contratos Públicos",31-12-2016,"2.970,00 €",,Consumo efetivo inferior ao inicialmente estimado,,Não aplicável.,Não aplicável.,FALSE
4S0075/2016 SERVIÇOS MÉDICOS NO AMBITO DA VMER - DR. PEDRO CENTEIO FERRAZ GAMEIRO,Ajuste Direto Regime Geral,Aquisição de serviços,"85141000-9, Serviços prestados pelo pessoal médico","Centro Hospitalar Barreiro Montijo, E. P. E. (509186998)",Pedro Centeio Ferraz Gameiro (230527922),"17.280,00 €",08-11-2016,29-07-2016,214 dias,"Portugal, Setúbal, Barreiro","Artigo 20.º, n.º 1, alínea a) do Código dos Contratos Públicos",31-12-2016,"7.088,61 €",,Consumo efetivo inferior ao inicialmente estimado,,Não aplicável.,Não aplicável.,FALSE
S10006/2016 Fornecimento de Serviços e Exames Anátomo-Patológicos ao CHBM EPE,Concurso público,Aquisição de serviços,"85145000-7, Serviços prestados por laboratórios médicos","Centro Hospitalar Barreiro Montijo, E. P. E. (509186998)",CEDAP - CENTRO DIAGNOSTICO ANATOMO-PATOLOGICO LDA (504494562),"89.606,82 €",08-11-2016,12-05-2016,366 dias,"Portugal, Setúbal, Barreiro","Artigo 20.º, n.º 1, alínea b) do Código dos Contratos Públicos",31-12-2016,"56.775,00 €",,consumo efetivo inferior ao inicialmente estimado,,Não aplicável.,Não aplicável.,FALSE
4CPS0010/2016 SERVIÇOS DE ANATOMIA PATOLÓGICA P/ MES JANEIRO E FEVEREIRO 2016,Ajuste Direto Regime Geral,Aquisição de serviços,"85141000-9, Serviços prestados pelo pessoal médico","Centro Hospitalar Barreiro Montijo, E. P. E. (509186998)",CEDAP - CENTRO DIAGNOSTICO ANATOMO-PATOLOGICO LDA (504494562),"14.964,00 €",08-11-2016,17-02-2016,60 dias,"Portugal, Setúbal, Barreiro","Artigo 20.º, n.º 1, alínea a) do Código dos Contratos Públicos",31-03-2016,"19.204,50 €",,Houve necessidade de reforçar por mais 1 mes,,Não aplicável.,Não aplicável.,FALSE
C.P. S10005/2016 Serviços Médicos de Gastrenterologia ao CHBM EPE,Concurso público,Aquisição de serviços,"85121251-7, Serviços de gastroenterologia","Centro Hospitalar Barreiro Montijo, E. P. E. (509186998)","FOCO POSITIVO - ACTIVIDADES MÉDICAS, LDA (509620426)","29.620,00 €",08-11-2016,02-02-2016,366 dias,"Portugal, Setúbal, Barreiro","Artigo 20.º, n.º 1, alínea b) do Código dos Contratos Públicos",31-03-2016,"5.661,00 €",,Houve rescisão de contato,,Não aplicável.,Não aplicável.,FALSE
"4CPS0006/2016 SERV MÉD DE CIRURGIA PEDIATRICA (1ª RENOVAÇÃO, AO ABRIGO CP S10006/2015)",Ajuste Direto Regime Geral,Aquisição de serviços,"85000000-9, Serviços de saúde e acção social","Centro Hospitalar Barreiro Montijo, E. P. E. (509186998)","ALONBER - CONSULTA E SERVIÇOS, LDA (503783862)","34.100,00 €",08-11-2016,20-01-2016,366 dias,"Portugal, Setúbal, Barreiro","Artigo 27.º, n.º 1, alínea a) e n.º 2 do Código dos Contratos Públicos",31-12-2016,"40.020,00 €",,consumo efetivo superior ao inicialmente estimado,,Não aplicável.,Não aplicável.,FALSE
4S0010/2016 Serviços Médicos de MCDT - Electromiogramas e Electroencefalogramas para ano 2016,Ajuste Direto Regime Geral,Aquisição de serviços,"85150000-5, Serviços de imagiologia médica","CHBM - Centro Hospital Barreiro Montijo, EPE (509186998)","Clínica Radiológica do Rosário, Lda (502711604)","27.993,75 €",07-11-2016,27-01-2016,366 dias,"Portugal, Setúbal, Barreiro","Artigo 20.º, n.º 1, alínea a) do Código dos Contratos Públicos",31-12-2016,"18.110,65 €",,consumo efetivo inferior ao inicialmente estimado,,Não aplicável.,Não aplicável.,FALSE
4S0030/2016 MCDT - ECOS OBSTETRICAS E GINECOLGICAS,Ajuste Direto Regime Geral,Aquisição de serviços,"85141000-9, Serviços prestados pelo pessoal médico","Centro Hospitalar Barreiro Montijo, E. P. E. (509186998)",FETUS VITAE - SERVIÇOS MEDICOS LDA (505896702),"32.340,00 €",07-11-2016,02-02-2016,366 dias,"Portugal, Setúbal, Barreiro","Artigo 20.º, n.º 1, alínea a) do Código dos Contratos Públicos",31-12-2016,"20.904,50 €",,Consumo efetivo inferior ao inicialmente estimado,,Não aplicável.,Não aplicável.,FALSE
"S10008/2016 Serviços de Telerradiologia ao CHBM, EPE",Concurso público,Aquisição de serviços,"85150000-5, Serviços de imagiologia médica","Centro Hospitalar Barreiro Montijo, E. P. E. (509186998)",ITM- INSTITUTO DE TELEMEDICINA LDA (506705641),"88.852,00 €",07-11-2016,30-06-2016,184 dias,"Portugal, Setúbal, Barreiro","Artigo 20.º, n.º 1, alínea b) do Código dos Contratos Públicos",31-12-2016,"83.644,00 €",,"Consumo efetivo, abaixo ao inicialmente estimado",,Não aplicável.,Não aplicável.,FALSE
4SI0014/2016 SERV MED PEDIATRIA - ESPECIALISTAS,Ao abrigo de acordo-quadro (art.º 259.º),Aquisição de serviços,"79625000-1, Serviços de fornecimento de pessoal médico","Centro Hospitalar Barreiro Montijo, E. P. E. (509186998)","MediPeople - Soluções de Saúde e Educação, Lda. (508543436)","707,76 €",07-11-2016,26-01-2016,30 dias,"Portugal, Setúbal, Barreiro",Artigo 259.º do Código dos Contratos Públicos,02-02-2016,"707,76 €",,"",,454020,"CONCURSO PÚBLICO PARA A CELEBRAÇÃO DE CONTRATOS PÚBLICOS DE APROVISIONAMENTO PARA A ÁREA DA SAÚDE, COM VISTA À PRESTAÇÃO DE SERVIÇOS MÉDICOS ÀS INSTITUIÇÕES E SERVIÇOS DO SERVIÇO NACIONAL DE SAÚDE",FALSE
4S0031/2016 SERVIÇOS DE TELERRADIOLOGIA P MESES JANEIRO E FEVEREIRO 2016,Ajuste Direto Regime Geral,Aquisição de serviços,"85150000-5, Serviços de imagiologia médica","Centro Hospitalar Barreiro Montijo, E. P. E. (509186998)",ITM- INSTITUTO DE TELEMEDICINA LDA (506705641),"15.236,50 €",04-11-2016,15-02-2016,60 dias,"Portugal, Setúbal, Barreiro","Artigo 20.º, n.º 1, alínea a) do Código dos Contratos Públicos",30-06-2016,"53.333,00 €",,Reforço da despesa face à necessidade de prolongar o periodo contratual,,Não aplicável.,Não aplicável.,FALSE
4SI0018/2016 SERV MED CIRURGIA E PSIQUIATRIA,Ao abrigo de acordo-quadro (art.º 259.º),Aquisição de serviços,"79625000-1, Serviços de fornecimento de pessoal médico","Centro Hospitalar Barreiro Montijo, E. P. E. (509186998)","GS24 - Healthcare Solutions, Lda (507824652)","2.627,04 €",04-11-2016,23-02-2016,30 dias,"Portugal, Setúbal, Barreiro",Artigo 259.º do Código dos Contratos Públicos,15-03-2016,"2.627,04 €",,"",,454020,"CONCURSO PÚBLICO PARA A CELEBRAÇÃO DE CONTRATOS PÚBLICOS DE APROVISIONAMENTO PARA A ÁREA DA SAÚDE, COM VISTA À PRESTAÇÃO DE SERVIÇOS MÉDICOS ÀS INSTITUIÇÕES E SERVIÇOS DO SERVIÇO NACIONAL DE SAÚDE",FALSE
4SEX0048/2016 - REP APARELHO DE INCLUSÃO - HISTOPATOLOGIA,Ajuste Direto Regime Geral,Aquisição de serviços,"50000000-5, Serviços de reparação e manutenção","Centro Hospitalar Barreiro Montijo, E. P. E. (509186998)","OLYMPUS IBERIA,S.A.U. (980474710)","4.033,00 €",04-11-2016,19-02-2016,90 dias,"Portugal, Setúbal, Barreiro","Artigo 24.º, n.º 1, alínea e) do Código dos Contratos Públicos",19-04-2016,"4.033,00 €",,"",,Não aplicável.,Não aplicável.,FALSE
4SEX0030/2016 - REP 2 VENTILADORES DA UCI,Ajuste Direto Regime Geral,Aquisição de serviços,"50000000-5, Serviços de reparação e manutenção","Centro Hospitalar Barreiro Montijo, E. P. E. (509186998)","MAQUET PORTUGAL - COMÉRCIO DE EQUIPAMENTOS HOSPITALARES, UNIPESSOAL LDA (506819698)","4.302,93 €",04-11-2016,17-02-2016,90 dias,"Portugal, Setúbal, Barreiro","Artigo 24.º, n.º 1, alínea e) do Código dos Contratos Públicos",22-03-2016,"4.302,93 €",,"",,Não aplicável.,Não aplicável.,FALSE
4SEX0046/2016 - REP VENTILADORES DA UCI,Ajuste Direto Regime Geral,Aquisição de serviços,"50000000-5, Serviços de reparação e manutenção","Centro Hospitalar Barreiro Montijo, E. P. E. (509186998)","MAQUET PORTUGAL - COMÉRCIO DE EQUIPAMENTOS HOSPITALARES, UNIPESSOAL LDA (506819698)","1.459,81 €",04-11-2016,17-02-2016,90 dias,"Portugal, Setúbal, Barreiro","Artigo 24.º, n.º 1, alínea e) do Código dos Contratos Públicos",06-04-2016,"1.459,81 €",,"",,Não aplicável.,Não aplicável.,FALSE
4EXC0029/2016 AMPOLA P RX,Ajuste Direto Regime Geral,Aquisição de bens móveis,"33000000-0, Equipamento médico, medicamentos e produtos para cuidados pessoais","Centro Hospitalar Barreiro Montijo, E. P. E. (509186998)",CARESTREAM HEALTH PORTUGAL (508054320),"12.116,00 €",03-11-2016,02-06-2016,21 dias,"Portugal, Setúbal, Barreiro","Artigo 24.º, n.º 1, alínea e) do Código dos Contratos Públicos",04-10-2016,"12.116,00 €",,"",,Não aplicável.,Não aplicável.,FALSE
