Objeto do Contrato,Tipo de Procedimento,Tipo(s) de Contrato,CPVs,Entidade(s) Adjudicante(s),Entidade(s) Adjudicatária(s),Preço Contratual,Data de Publicação,Data de Celebração do Contrato,Prazo de Execução,Local de Execução,Fundamentação,Data de Fecho do Contrato,Preço Total Efetivo,Causas das Alterações ao Prazo,Causas das Alterações ao Preço,Estado,N.º registo do Acordo Quadro,Descrição do Acordo Quadro,Procedimento Centralizado
Aquisição de Pantoprazol,Ao abrigo de acordo-quadro (art.º 259.º),Aquisição de bens móveis,"33600000-6, Produtos farmacêuticos","Centro Hospitalar Vila Nova de Gaia - Espinho, E. P. E. (508142156)","Aurovitas, Unipessoal, Lda (513053239)","2.019,42 €",16-04-2015,16-04-2015,260 dias,"Portugal, Porto, Vila Nova de Gaia",Artigo 259.º do Código dos Contratos Públicos,,,,,,1194708,"CONCURSO PÚBLICO PARA A CELEBRAÇÃO DE CONTRATOS PÚBLICOS DE APROVISIONAMENTO PARA A ÁREA DA SAÚDE, MEDICAMENTOS DO APARELHO DIGESTIVO, ÀS INSTITUIÇÕES E SERVIÇOS DO SERVIÇO NACIONAL DE SAÚDE",FALSE
Aquisição de Material de Penso,Concurso público,Aquisição de bens móveis,"33141100-1, Pensos; clipes, suturas, ligaduras","Centro Hospitalar Vila Nova de Gaia - Espinho, E. P. E. (508142156)","SPCare - Especialidades Farmacêuticas, Lda. (508284872)","286,18 €",13-04-2015,29-01-2015,258 dias,"Portugal, Porto, Vila Nova de Gaia","Artigo 20.º, n.º 1, alínea b) do Código dos Contratos Públicos",,,,,,Não aplicável.,Não aplicável.,FALSE
CP n.º 2009714 - Aquisição de Material de Penso,Concurso público,Aquisição de bens móveis,"33141100-1, Pensos; clipes, suturas, ligaduras","Centro Hospitalar Vila Nova de Gaia - Espinho, E. P. E. (508142156)","Factor Plus - Produtos Médicos e Hospitalares, S.A. (502810645)","3.905,70 €",13-04-2015,29-01-2015,258 dias,"Portugal, Porto, Vila Nova de Gaia","Artigo 20.º, n.º 1, alínea b) do Código dos Contratos Públicos",,,,,,Não aplicável.,Não aplicável.,FALSE
Aquisição de Material de Penso,Concurso público,Aquisição de bens móveis,"33141100-1, Pensos; clipes, suturas, ligaduras","Centro Hospitalar Vila Nova de Gaia - Espinho, E. P. E. (508142156)","BSN Medical, S.A. (505385058)","6.235,58 €",13-04-2015,29-01-2015,258 dias,"Portugal, Porto, Vila Nova de Gaia","Artigo 20.º, n.º 1, alínea b) do Código dos Contratos Públicos",,,,,,Não aplicável.,Não aplicável.,FALSE
Aquisição de Material de Penso,Concurso público,Aquisição de bens móveis,"33141100-1, Pensos; clipes, suturas, ligaduras","Centro Hospitalar Vila Nova de Gaia - Espinho, E. P. E. (508142156)","Docworld, Lda. (508592909)","5.706,93 €",13-04-2015,29-01-2015,258 dias,"Portugal, Porto, Vila Nova de Gaia","Artigo 20.º, n.º 1, alínea b) do Código dos Contratos Públicos",,,,,,Não aplicável.,Não aplicável.,FALSE
Aquisição de Material de Penso,Concurso público,Aquisição de bens móveis,"33141100-1, Pensos; clipes, suturas, ligaduras","Centro Hospitalar Vila Nova de Gaia - Espinho, E. P. E. (508142156)","Abílio Freire, Lda. (500432600)","12.508,96 €",13-04-2015,16-02-2015,258 dias,"Portugal, Porto, Vila Nova de Gaia","Artigo 20.º, n.º 1, alínea b) do Código dos Contratos Públicos",,,,,,Não aplicável.,Não aplicável.,FALSE
Aquisição de Material de Penso,Concurso público,Aquisição de bens móveis,"33141100-1, Pensos; clipes, suturas, ligaduras","Centro Hospitalar Vila Nova de Gaia - Espinho, E. P. E. (508142156)","Albino Dias de Andrade, Lda. (500013810)","24.039,04 €",13-04-2015,16-02-2015,258 dias,"Portugal, Porto, Vila Nova de Gaia","Artigo 20.º, n.º 1, alínea b) do Código dos Contratos Públicos",,,,,,Não aplicável.,Não aplicável.,FALSE
Aquisição de Material de Penso,Concurso público,Aquisição de bens móveis,"33141100-1, Pensos; clipes, suturas, ligaduras","Centro Hospitalar Vila Nova de Gaia - Espinho, E. P. E. (508142156)","Virtuoso, Lda. (510113923)","30,91 €",13-04-2015,29-01-2015,258 dias,"Portugal, Porto, Vila Nova de Gaia","Artigo 20.º, n.º 1, alínea b) do Código dos Contratos Públicos",,,,,,Não aplicável.,Não aplicável.,FALSE
Aquisição de Material de Penso,Concurso público,Aquisição de bens móveis,"33141100-1, Pensos; clipes, suturas, ligaduras","Centro Hospitalar Vila Nova de Gaia - Espinho, E. P. E. (508142156)","Bastos e Viegas, S.A. (500042772)","14.145,36 €",13-04-2015,16-02-2015,258 dias,"Portugal, Porto, Vila Nova de Gaia","Artigo 20.º, n.º 1, alínea b) do Código dos Contratos Públicos",,,,,,Não aplicável.,Não aplicável.,FALSE
Aquisição de Material de Penso,Concurso público,Aquisição de bens móveis,"33141100-1, Pensos; clipes, suturas, ligaduras","Centro Hospitalar Vila Nova de Gaia - Espinho, E. P. E. (508142156)","Medtronic Portugal, Lda. (504223933)","7.999,27 €",13-04-2015,29-01-2015,258 dias,"Portugal, Porto, Vila Nova de Gaia","Artigo 20.º, n.º 1, alínea b) do Código dos Contratos Públicos",,,,,,Não aplicável.,Não aplicável.,FALSE
Aquisição de Material de Penso,Concurso público,Aquisição de bens móveis,"33141100-1, Pensos; clipes, suturas, ligaduras","Centro Hospitalar Vila Nova de Gaia - Espinho, E. P. E. (508142156)","Ezequiel Panão Jorge, Lda. (501412727)","1.583,39 €",13-04-2015,29-01-2015,258 dias,"Portugal, Porto, Vila Nova de Gaia","Artigo 20.º, n.º 1, alínea b) do Código dos Contratos Públicos",,,,,,Não aplicável.,Não aplicável.,FALSE
