freguesia,acronym,validVotesPercentage,votes,dicofre
Penha de França,PS,32.83,3147,110663
Penha de França,B.E.,16.12,1545,110663
Penha de França,PPD/PSD,14.57,1397,110663
Penha de França,PCP-PEV,9.32,893,110663
Penha de França,PAN,8.38,803,110663
Penha de França,L,4.85,465,110663
Penha de França,CDS-PP,4.79,459,110663
Penha de França,A,3.09,296,110663
Penha de França,PPM.PPV/CDC,1.69,162,110663
Penha de França,IL,1.17,112,110663
Penha de França,NC,0.82,79,110663
Penha de França,PCTP/MRPP,0.78,75,110663
Penha de França,PNR,0.47,45,110663
Penha de França,PDR,0.4,38,110663
Penha de França,PURP,0.39,37,110663
Penha de França,MAS,0.18,17,110663
Penha de França,PTP,0.16,15,110663
