freguesia,acronym,validVotesPercentage,votes,dicofre
União das freguesias de Agrela e Serafão,PS,46.9,212,030738
União das freguesias de Agrela e Serafão,PPD/PSD.CDS-PP,30.97,140,030738
União das freguesias de Agrela e Serafão,MPT,7.52,34,030738
União das freguesias de Agrela e Serafão,PCP-PEV,3.54,16,030738
União das freguesias de Agrela e Serafão,B.E.,2.88,13,030738
União das freguesias de Agrela e Serafão,PND,2.21,10,030738
União das freguesias de Agrela e Serafão,PCTP/MRPP,1.77,8,030738
União das freguesias de Agrela e Serafão,L,1.11,5,030738
União das freguesias de Agrela e Serafão,PNR,1.11,5,030738
União das freguesias de Agrela e Serafão,PPM,0.66,3,030738
União das freguesias de Agrela e Serafão,PPV,0.66,3,030738
União das freguesias de Agrela e Serafão,MAS,0.22,1,030738
União das freguesias de Agrela e Serafão,PAN,0.22,1,030738
União das freguesias de Agrela e Serafão,PTP,0.22,1,030738
União das freguesias de Agrela e Serafão,PDA,0,0,030738
União das freguesias de Agrela e Serafão,POUS,0,0,030738
