Objeto do Contrato,Tipo de Procedimento,Tipo(s) de Contrato,CPVs,Entidade(s) Adjudicante(s),Entidade(s) Adjudicatária(s),Preço Contratual,Data de Publicação,Data de Celebração do Contrato,Prazo de Execução,Local de Execução,Fundamentação,Data de Fecho do Contrato,Preço Total Efetivo,Causas das Alterações ao Prazo,Causas das Alterações ao Preço,Estado,N.º registo do Acordo Quadro,Descrição do Acordo Quadro,Procedimento Centralizado
Prestação de serviços de limpeza das instalações do Hospital Arcebispo João Crisóstomo,Concurso público,Aquisição de serviços,"90910000-9, Serviços de limpeza",Hospital Arcebispo João Crisóstomo (501626123),"Euromex-Facility Services, Lda. (502629428)","49.445,00 €",06-03-2014,01-02-2012,334 dias,"Portugal, Coimbra, Cantanhede","Artigo 20.º, n.º 1, alínea b) do Código dos Contratos Públicos",,,,,,Não aplicável.,Não aplicável.,FALSE
"Prestação de serviços de para recolha, transporte e tratamento de resíduos hospitalares do grupo III e IV",Ajuste Direto Regime Geral,Aquisição de serviços,"90000000-7, Serviços relativos a águas residuais, resíduos, limpeza e ambiente",Hospital Arcebispo João Crisóstomo (501626123),Administração do Serviço de Utilização Comum dos Hospitais (500900469),"1.804,17 €",06-03-2014,03-12-2013,365 dias,"Portugal, Coimbra, Cantanhede","Artigo 20.º, n.º 1, alínea a) do Código dos Contratos Públicos",,,,,,Não aplicável.,Não aplicável.,FALSE
