freguesia,acronym,validVotesPercentage,votes,dicofre
Gralhas,PS,64.65,64,170612
Gralhas,PPD/PSD,29.29,29,170612
Gralhas,B.E.,2.02,2,170612
Gralhas,L,1.01,1,170612
Gralhas,NC,1.01,1,170612
Gralhas,PPM.PPV/CDC,1.01,1,170612
Gralhas,PURP,1.01,1,170612
Gralhas,A,0,0,170612
Gralhas,CDS-PP,0,0,170612
Gralhas,IL,0,0,170612
Gralhas,MAS,0,0,170612
Gralhas,PAN,0,0,170612
Gralhas,PCP-PEV,0,0,170612
Gralhas,PCTP/MRPP,0,0,170612
Gralhas,PDR,0,0,170612
Gralhas,PNR,0,0,170612
Gralhas,PTP,0,0,170612
