freguesia,acronym,validVotesPercentage,votes,dicofre
Canelas,PS,40.7,1474,131703
Canelas,PPD/PSD.CDS-PP,20.71,750,131703
Canelas,PCP-PEV,11.71,424,131703
Canelas,MPT,10.6,384,131703
Canelas,B.E.,5.91,214,131703
Canelas,PCTP/MRPP,2.37,86,131703
Canelas,PAN,2.29,83,131703
Canelas,L,2.18,79,131703
Canelas,PND,0.86,31,131703
Canelas,PTP,0.77,28,131703
Canelas,MAS,0.52,19,131703
Canelas,PPM,0.5,18,131703
Canelas,PNR,0.36,13,131703
Canelas,PPV,0.3,11,131703
Canelas,PDA,0.14,5,131703
Canelas,POUS,0.08,3,131703
