freguesia,acronym,validVotesPercentage,votes,dicofre
"União das freguesias de Achete, Azoia de Baixo e Póvoa de Santarém",PS,42.92,509,141629
"União das freguesias de Achete, Azoia de Baixo e Póvoa de Santarém",PPD/PSD,26.56,315,141629
"União das freguesias de Achete, Azoia de Baixo e Póvoa de Santarém",B.E.,8.94,106,141629
"União das freguesias de Achete, Azoia de Baixo e Póvoa de Santarém",CDS-PP,6.16,73,141629
"União das freguesias de Achete, Azoia de Baixo e Póvoa de Santarém",PCP-PEV,5.99,71,141629
"União das freguesias de Achete, Azoia de Baixo e Póvoa de Santarém",PAN,2.28,27,141629
"União das freguesias de Achete, Azoia de Baixo e Póvoa de Santarém",CH,2.11,25,141629
"União das freguesias de Achete, Azoia de Baixo e Póvoa de Santarém",A,0.84,10,141629
"União das freguesias de Achete, Azoia de Baixo e Póvoa de Santarém",IL,0.84,10,141629
"União das freguesias de Achete, Azoia de Baixo e Póvoa de Santarém",L,0.84,10,141629
"União das freguesias de Achete, Azoia de Baixo e Póvoa de Santarém",NC,0.42,5,141629
"União das freguesias de Achete, Azoia de Baixo e Póvoa de Santarém",PCTP/MRPP,0.42,5,141629
"União das freguesias de Achete, Azoia de Baixo e Póvoa de Santarém",PNR,0.42,5,141629
"União das freguesias de Achete, Azoia de Baixo e Póvoa de Santarém",PPM,0.42,5,141629
"União das freguesias de Achete, Azoia de Baixo e Póvoa de Santarém",R.I.R.,0.25,3,141629
"União das freguesias de Achete, Azoia de Baixo e Póvoa de Santarém",MPT,0.17,2,141629
"União das freguesias de Achete, Azoia de Baixo e Póvoa de Santarém",PDR,0.17,2,141629
"União das freguesias de Achete, Azoia de Baixo e Póvoa de Santarém",PURP,0.17,2,141629
"União das freguesias de Achete, Azoia de Baixo e Póvoa de Santarém",PTP,0.08,1,141629
