freguesia,acronym,validVotesPercentage,votes,dicofre
Santa Comba,PS,42.57,146,091213
Santa Comba,PPD/PSD,30.61,105,091213
Santa Comba,B.E.,7.58,26,091213
Santa Comba,PCP-PEV,4.37,15,091213
Santa Comba,CDS-PP,3.5,12,091213
Santa Comba,CH,2.92,10,091213
Santa Comba,IL,2.62,9,091213
Santa Comba,PAN,2.04,7,091213
Santa Comba,L,1.46,5,091213
Santa Comba,A,0.58,2,091213
Santa Comba,R.I.R.,0.58,2,091213
Santa Comba,MPT,0.29,1,091213
Santa Comba,NC,0.29,1,091213
Santa Comba,PCTP/MRPP,0.29,1,091213
Santa Comba,PDR,0.29,1,091213
Santa Comba,PNR,0,0,091213
Santa Comba,PPM,0,0,091213
Santa Comba,PTP,0,0,091213
Santa Comba,PURP,0,0,091213
