Objeto do Contrato,Tipo de Procedimento,Tipo(s) de Contrato,CPVs,Entidade(s) Adjudicante(s),Entidade(s) Adjudicatária(s),Preço Contratual,Data de Publicação,Data de Celebração do Contrato,Prazo de Execução,Local de Execução,Fundamentação,Data de Fecho do Contrato,Preço Total Efetivo,Causas das Alterações ao Prazo,Causas das Alterações ao Preço,Estado,N.º registo do Acordo Quadro,Descrição do Acordo Quadro,Procedimento Centralizado
REPARAÇÃO DE CRANEOTOMO DE AESCULAP,Ajuste Direto Regime Geral,Aquisição de serviços,"50000000-5, Serviços de reparação e manutenção","Centro Hospitalar de São João, E. P. E. (509821197)","B. Braun Medical, Lda. (501506543)","5.101,18 €",20-12-2017,03-11-2017,60 dias,"Portugal, Porto, Porto","Artigo 24.º, n.º 1, alínea c) do Código dos Contratos Públicos",,,,,,Não aplicável.,Não aplicável.,FALSE
Renovação da Licença de Licenciamento CISCO ASA5555,Ajuste Direto Regime Geral,Aquisição de serviços,"50000000-5, Serviços de reparação e manutenção","Centro Hospitalar de São João, E. P. E. (509821197)","GONKSYS, S.A. (510874169)","9.978,76 €",19-12-2017,15-12-2017,30 dias,"Portugal, Porto, Porto","Artigo 24.º, n.º 1, alínea c) do Código dos Contratos Públicos",,,,,,Não aplicável.,Não aplicável.,FALSE
"AQUISIÇÃO DE MEDICAMENTOS DESENCADEADA PELA SPMS, EPE NO ÂMBITO DO DESPACHO 1571/B DE 2016 AO ABRIGO DO ACORDO QUADRO 2016/40 P259-AC-2017-15",Ao abrigo de acordo-quadro (art.º 259.º),Aquisição de bens móveis,"33600000-6, Produtos farmacêuticos","Centro Hospitalar de São João, E. P. E. (509821197)","GILEAD SCIENCES, LDA (503604704)","1.866.715,20 €",13-12-2017,16-03-2017,290 dias,"Portugal, Porto, Porto",Artigo 259.º do Código dos Contratos Públicos,,,,,,2183729,Medicamentos antirretrovíricos para o tratamento da infeção por VIH,FALSE
"AQUISIÇÃO DO MEDICAMENTO P837-PLERIXAFOR [20 MG/ML; 1,2 ML; F/AMP] DESENCADEADA PELA SPMS, EPE NO ÂMBITO DO DESPACHO 1571/B DE 2016",Ajuste Direto Regime Geral,Aquisição de bens móveis,"33600000-6, Produtos farmacêuticos","Centro Hospitalar de São João, E. P. E. (509821197)","Sanofi - Produtos Farmacêuticos, Lda. (500134960)","82.558,95 €",13-12-2017,25-09-2017,97 dias,"Portugal, Porto, Porto","Artigo 20.º, n.º 1, alínea a) do Código dos Contratos Públicos",,,,,,Não aplicável.,Não aplicável.,FALSE
"AQUISIÇÃO DE MEDICAMENTOS DESENCADEADA PELA SPMS, EPE NO ÂMBITO DO DESPACHO 1571/B DE 2016 AO ABRIGO DOS ACORDOS QUADRO 2015/6, 2016/40, 2016/55, 2015/41-  P259-AC-2017-65 ",Ao abrigo de acordo-quadro (art.º 259.º),Aquisição de bens móveis,"33600000-6, Produtos farmacêuticos","Centro Hospitalar de São João, E. P. E. (509821197)",BRISTOL - MYERS SQUIBB SA. (500048193),"659.463,66 €",13-12-2017,22-06-2017,192 dias,"Portugal, Porto, Porto",Artigo 259.º do Código dos Contratos Públicos,,,,,,1771819,CP 2015/6 - Acordo quadro para o fornecimento de Medicamentos do Foro Oncológico,FALSE
Aquisição de Marcador de Lesões Mamárias,Ajuste Direto Regime Geral,Aquisição de bens móveis,"33141000-0, Material médico não químico descartável e produtos hematológicos","Centro Hospitalar de São João, E. P. E. (509821197)","Leleman, SL  (B46193827)","16.830,00 €",13-12-2017,12-12-2017,122 dias,"Portugal, Porto, Porto","Artigo 20.º, n.º 1, alínea a) do Código dos Contratos Públicos",,,,,,Não aplicável.,Não aplicável.,FALSE
"AQUISIÇÃO DE MEDICAMENTOS DESENCADEADA PELA SPMS, EPE NO ÂMBITO DO DESPACHO 1571/B DE 2016 AO ABRIGO DO ACORDO QUADRO 2015/6 E DO ACORDO QUADRO 2015/7 - P259-AC-2017-66 ",Ao abrigo de acordo-quadro (art.º 259.º),Aquisição de bens móveis,"33600000-6, Produtos farmacêuticos","Centro Hospitalar de São João, E. P. E. (509821197)","Merck, SA. (500650870)","169.576,00 €",13-12-2017,23-05-2017,222 dias,"Portugal, Porto, Porto",Artigo 259.º do Código dos Contratos Públicos,,,,,,1771819,CP 2015/6 - Acordo quadro para o fornecimento de Medicamentos do Foro Oncológico,FALSE
"Aquisição de Pensos Absorventes Estéreis para o Centro Hospitalar de S. João, E.P.E",Concurso público,Aquisição de bens móveis,"33141110-4, Pensos","Centro Hospitalar de São João, E. P. E. (509821197)","BASTOS VIEGAS,S.A. (500042772)","29.375,60 €",12-12-2017,08-06-2017,206 dias,"Portugal, Porto, Porto","Artigo 20.º, n.º 1, alínea b) do Código dos Contratos Públicos",,,,,,Não aplicável.,Não aplicável.,FALSE
"AQUISIÇÃO DE MEDICAMENTOS DESENCADEADA PELA SPMS, EPE NO ÂMBITO DO DESPACHO 1571/B DE 2016 AO ABRIGO DO ACORDO QUADRO 2014/18 – MEDICAMENTOS DO GRUPO 4: SANGUE, ACORDO QUADRO 2015/6 - MEDICAMENTOS DO FORO ONCOLÓGICO, ACORDO QUADRO 2015/7 - HORMONAS E OUTROS MEDICAMENTOS USADOS NO TRATAMENTO DE DOENÇAS ENDÓCRINAS E ACORDO QUADRO 2015/49 – MEDICAMENTOS USADOS NAS AFEÇÕES OCULARES E OTORRINOLARINGOLÓGICO - P259-AC-2017-48 ",Ao abrigo de acordo-quadro (art.º 259.º),Aquisição de bens móveis,"33600000-6, Produtos farmacêuticos","Centro Hospitalar de São João, E. P. E. (509821197)","NOVARTIS FARMA-PRODUT.FARMACEUTICOS, SA (500063524)","2.731.340,57 €",11-12-2017,11-05-2017,234 dias,"Portugal, Porto, Porto",Artigo 259.º do Código dos Contratos Públicos,,,,,,1771819,CP 2015/6 - Acordo quadro para o fornecimento de Medicamentos do Foro Oncológico,FALSE
Aquisição de Nutrição Entérica,Concurso público,Aquisição de bens móveis,"33692300-0, Alimentos enterais","Centro Hospitalar de São João, E. P. E. (509821197)","FRESENIUS KABI PHARMA PORTUGAL, LDA (504293753)","45.002,97 €",11-12-2017,25-05-2017,220 dias,"Portugal, Porto, Porto","Artigo 20.º, n.º 1, alínea b) do Código dos Contratos Públicos",,,,,,Não aplicável.,Não aplicável.,FALSE
