Objeto do Contrato,Tipo de Procedimento,Tipo(s) de Contrato,CPVs,Entidade(s) Adjudicante(s),Entidade(s) Adjudicatária(s),Preço Contratual,Data de Publicação,Data de Celebração do Contrato,Prazo de Execução,Local de Execução,Fundamentação,Data de Fecho do Contrato,Preço Total Efetivo,Causas das Alterações ao Prazo,Causas das Alterações ao Preço,Estado,N.º registo do Acordo Quadro,Descrição do Acordo Quadro,Procedimento Centralizado
Aquisição de reagentes,Ajuste Direto Regime Geral,Aquisição de bens móveis,"33696500-0, Reagentes de laboratório","Centro Hospitalar Barreiro Montijo, E. P. E. (509186998)","ABBOTT LABORATORIOS, LDA (500006148)","17.269,00 €",21-07-2016,01-04-2016,20 dias,"Portugal, Setúbal, Barreiro","Artigo 20.º, n.º 1, alínea a) do Código dos Contratos Públicos",07-04-2016,"17.269,00 €",,,,Não aplicável.,Não aplicável.,FALSE
Aquisição de Reagentes,Ajuste Direto Regime Geral,Aquisição de bens móveis,"33696500-0, Reagentes de laboratório","Centro Hospitalar Barreiro Montijo, E. P. E. (509186998)","ABBOTT LABORATORIOS, LDA (500006148)","17.512,36 €",21-07-2016,01-04-2016,20 dias,"Portugal, Setúbal, Barreiro","Artigo 20.º, n.º 1, alínea a) do Código dos Contratos Públicos",07-04-2016,"17.512,36 €",,,,Não aplicável.,Não aplicável.,FALSE
"4IEX0003/2016 Cateter com tubo de infusão, cartucho e agulha para infusão bombas de insulina",Ao abrigo de acordo-quadro (art.º 258.º),Aquisição de bens móveis,"33000000-0, Equipamento médico, medicamentos e produtos para cuidados pessoais","Centro Hospitalar Barreiro Montijo, E. P. E. (509186998)","ROCHE SISTEMAS DE DIAGNOSTICO-SOC. UNIPESSOAL, Lda (504282921)","1.395,00 €",21-07-2016,22-06-2016,150 dias,"Portugal, Setúbal, Barreiro","Artigo 20.º, n.º 1, alínea a) do Código dos Contratos Públicos",22-06-2016,"1.395,00 €",,,,1442148,ACORDO QUADRO PARA FORNECIMENTO DE BOMBAS DE PERFUSÃO SUBCUTANEA CONTINUA DE INSULINA E RESPETIVOS CONSUMÍVEIS ÀS INSTITUIÇÕES E SERVIÇOS DO SERVIÇO NACIONAL DE SAÚDE. CP 2015/29,FALSE
"4IEX0004/2016 Agulhas de infusão, cateteres e cartuchos para bombas insulina  ",Ao abrigo de acordo-quadro (art.º 258.º),Aquisição de bens móveis,"33000000-0, Equipamento médico, medicamentos e produtos para cuidados pessoais","Centro Hospitalar Barreiro Montijo, E. P. E. (509186998)","ROCHE SISTEMAS DE DIAGNOSTICO-SOC. UNIPESSOAL, Lda (504282921)","1.240,00 €",21-07-2016,11-07-2016,150 dias,"Portugal, Setúbal, Barreiro","Artigo 20.º, n.º 1, alínea a) do Código dos Contratos Públicos",11-07-2016,"1.240,00 €",,,,1442148,ACORDO QUADRO PARA FORNECIMENTO DE BOMBAS DE PERFUSÃO SUBCUTANEA CONTINUA DE INSULINA E RESPETIVOS CONSUMÍVEIS ÀS INSTITUIÇÕES E SERVIÇOS DO SERVIÇO NACIONAL DE SAÚDE. CP 2015/29,FALSE
Consumíveis para bombas de insulina,Ao abrigo de acordo-quadro (art.º 258.º),Aquisição de bens móveis,"33000000-0, Equipamento médico, medicamentos e produtos para cuidados pessoais","Centro Hospitalar Barreiro Montijo, E. P. E. (509186998)","ROCHE SISTEMAS DE DIAGNOSTICO-SOC. UNIPESSOAL, Lda (504282921)","3.570,00 €",21-07-2016,12-07-2016,150 dias,"Portugal, Setúbal, Barreiro","Artigo 20.º, n.º 1, alínea a) do Código dos Contratos Públicos",12-07-2016,"3.570,00 €",,,,1442148,ACORDO QUADRO PARA FORNECIMENTO DE BOMBAS DE PERFUSÃO SUBCUTANEA CONTINUA DE INSULINA E RESPETIVOS CONSUMÍVEIS ÀS INSTITUIÇÕES E SERVIÇOS DO SERVIÇO NACIONAL DE SAÚDE. CP 2015/29,FALSE
FEXC0160/2016 - SOFOSBUVIR 400 MG COMP REVES,Ajuste Direto Regime Geral,Aquisição de bens móveis,"33600000-6, Produtos farmacêuticos","Centro Hospitalar Barreiro Montijo, E. P. E. (509186998)","GILEAD SCIENCES, LDA. (503604704)","41.164,83 €",21-07-2016,20-07-2016,5 dias,"Portugal, Setúbal, Barreiro","Artigo 24.º, n.º 1, alínea e) do Código dos Contratos Públicos",21-07-2016,"41.164,83 €",,,,Não aplicável.,Não aplicável.,FALSE
"FEXC0161/2016 - LEDIPASVIR 90MG + SOFOSBUVIR 400MG COMP """"MECANISMO COMPENSAÇÃO""""",Ajuste Direto Regime Geral,Aquisição de bens móveis,"33600000-6, Produtos farmacêuticos","Centro Hospitalar Barreiro Montijo, E. P. E. (509186998)","GILEAD SCIENCES, LDA. (503604704)","46.183,83 €",20-07-2016,20-07-2016,20 dias,"Portugal, Setúbal, Barreiro","Artigo 24.º, n.º 1, alínea e) do Código dos Contratos Públicos",20-07-2016,"46.183,83 €",,,,Não aplicável.,Não aplicável.,FALSE
FI0401/2016 - FACTORES DE COAGULAÇÃO DE SANGUE COLA TECIDO SER 2 ML,Ao abrigo de acordo-quadro (art.º 259.º),Aquisição de bens móveis,"33600000-6, Produtos farmacêuticos","Centro Hospitalar Barreiro Montijo, E. P. E. (509186998)","BAXTER MEDICO - FARMACEUTICA, LDA. (503347345)","728,00 €",20-07-2016,20-07-2016,5 dias,"Portugal, Setúbal, Barreiro",Artigo 259.º do Código dos Contratos Públicos,20-07-2016,"728,00 €",,,,535788,"CONCURSO PÚBLICO PARA A CELEBRAÇÃO DE CONTRATOSPÚBLICOS DE APROVISIONAMENTO PARA A ÁREA DA SAÚDE, COM VISTA AO FORNECIMENTO DE DERIVADOS DO PLASMA HUMANOÀS INSTITUIÇÕES E SERVIÇOS DO SERVIÇO NACIONAL DE SAÚDE",FALSE
Aquisição de reagentes,Ajuste Direto Regime Geral,Aquisição de bens móveis,"33696500-0, Reagentes de laboratório","Centro Hospitalar Barreiro Montijo, E. P. E. (509186998)","ABBOTT LABORATORIOS, LDA (500006148)","5.311,48 €",20-07-2016,01-04-2016,20 dias,"Portugal, Setúbal, Barreiro","Artigo 20.º, n.º 1, alínea a) do Código dos Contratos Públicos",07-04-2016,"5.311,48 €",,,,Não aplicável.,Não aplicável.,FALSE
Aquisição de reagentes,Ajuste Direto Regime Geral,Aquisição de bens móveis,"33696500-0, Reagentes de laboratório","Centro Hospitalar Barreiro Montijo, E. P. E. (509186998)","ABBOTT LABORATORIOS, LDA (500006148)","17.512,36 €",20-07-2016,01-04-2016,20 dias,"Portugal, Setúbal, Barreiro","Artigo 20.º, n.º 1, alínea a) do Código dos Contratos Públicos",07-04-2016,"17.512,36 €",,,,Não aplicável.,Não aplicável.,FALSE
FEXC0159/2016 - COLQUICINA 1 MG COMP,Ajuste Direto Regime Geral,Aquisição de bens móveis,"33600000-6, Produtos farmacêuticos","Centro Hospitalar Barreiro Montijo, E. P. E. (509186998)","JABA RECORDATI, S.A (500492867)","65,20 €",18-07-2016,15-07-2016,5 dias,"Portugal, Setúbal, Barreiro","Artigo 24.º, n.º 1, alínea e) do Código dos Contratos Públicos",18-07-2016,"65,20 €",,,,Não aplicável.,Não aplicável.,FALSE
FI0400/2016 - OLIGOELEMENTOS AMP 10 ML SOL INJ,Ao abrigo de acordo-quadro (art.º 259.º),Aquisição de bens móveis,"33600000-6, Produtos farmacêuticos","Centro Hospitalar Barreiro Montijo, E. P. E. (509186998)","B. BRAUN MEDICAL, LDA (501506543)","1.060,00 €",14-07-2016,14-07-2016,5 dias,"Portugal, Setúbal, Barreiro",Artigo 259.º do Código dos Contratos Públicos,14-07-2016,"1.060,00 €",,,,457058,"CONCURSO PÚBLICO PARA A CELEBRAÇÃO DE CONTRATOS PÚBLICOS DE APROVISIONAMENTO PARA A ÁREA DA SAÚDE, COM VISTA AO FORNECIMENTO DE MEDICAMENTOS PARA NUTRIÇÃO PARENTÉRICA, ÀS INSTITUIÇÕES E SERVIÇOS DO SERVIÇO NACIONAL DE SAÚDE",FALSE
FI0399/2016 - FLUCONAZOL 40 MG/ML (200 MG / 5ML ) FRS SUSP ORAL,Ao abrigo de acordo-quadro (art.º 259.º),Aquisição de bens móveis,"33600000-6, Produtos farmacêuticos","Centro Hospitalar Barreiro Montijo, E. P. E. (509186998)","LABORATORIOS PFIZER, S.A. (500162166)","133,11 €",13-07-2016,13-07-2016,5 dias,"Portugal, Setúbal, Barreiro",Artigo 259.º do Código dos Contratos Públicos,13-07-2016,"133,11 €",,,,455180,"CONCURSO PÚBLICO PARA A CELEBRAÇÃO DE CONTRATOS PÚBLICOS DE APROVISIONAMENTO PARA A ÁREA DA SAÚDE, COM VISTA AO FORNECIMENTO DE MEDICAMENTOS ANTI-INFECIOSOS: ANTIVÍRICOS E ANTIFÚNGICOS, ÀS INSTITUIÇÕES E SERVIÇOS DO SERVIÇO NACIONAL DE SAÚDE  ",FALSE
