Objeto do Contrato,Tipo de Procedimento,Tipo(s) de Contrato,CPVs,Entidade(s) Adjudicante(s),Entidade(s) Adjudicatária(s),Preço Contratual,Data de Publicação,Data de Celebração do Contrato,Prazo de Execução,Local de Execução,Fundamentação,Data de Fecho do Contrato,Preço Total Efetivo,Causas das Alterações ao Prazo,Causas das Alterações ao Preço,Estado,N.º registo do Acordo Quadro,Descrição do Acordo Quadro,Procedimento Centralizado
"Fornecimento e Instalação de Um Sistema de Prova de Esforço e Um Desfibrilhador Portátil, com retoma do tapete existente",Ajuste Direto Regime Geral,Aquisição de bens móveis,"33123000-8, Aparelhos para fins cardiovasculares","Unidade Local de Saúde de Castelo Branco, E. P. E. (509309844)","BTL PORTUGAL, LDA (508192943)","12.516,00 €",13-06-2016,08-06-2016,19 dias,"Portugal, Castelo Branco, Castelo Branco","Artigo 20.º, n.º 1, alínea a) do Código dos Contratos Públicos",08-03-2017,"12.516,00 €",,,,Não aplicável.,Não aplicável.,FALSE
CONTRATO PARA AQUISIÇÃO DE SERVIÇOS DE ASSISTÊNCIA PÓS VENDA DO SOFTWARE APLICACIONAL ALERT – HEALTHCARE SOLUTIONS NO ANO 2016,Ajuste Direto Regime Geral,Aquisição de serviços,"72267000-4, Serviços de manutenção e reparação de software","Unidade Local de Saúde de Castelo Branco, E. P. E. (509309844)","ALERT LIFE SCIENCES COMPUTING, S.A. (507567455)","38.084,00 €",13-06-2016,13-06-2016,365 dias,"Portugal, Castelo Branco, Castelo Branco","Artigo 24.º, n.º 1, alínea e) do Código dos Contratos Públicos",31-12-2016,"38.084,00 €",,,,Não aplicável.,Não aplicável.,FALSE
