freguesia,acronym,validVotesPercentage,votes,dicofre
São Romão de Neiva,PPD/PSD.CDS-PP,39.46,146,160923
São Romão de Neiva,PS,33.78,125,160923
São Romão de Neiva,MPT,6.49,24,160923
São Romão de Neiva,PCP-PEV,6.22,23,160923
São Romão de Neiva,B.E.,4.86,18,160923
São Romão de Neiva,PAN,2.7,10,160923
São Romão de Neiva,PND,1.89,7,160923
São Romão de Neiva,PCTP/MRPP,1.08,4,160923
São Romão de Neiva,L,0.81,3,160923
São Romão de Neiva,PNR,0.81,3,160923
São Romão de Neiva,PDA,0.54,2,160923
São Romão de Neiva,POUS,0.54,2,160923
São Romão de Neiva,PPM,0.27,1,160923
São Romão de Neiva,PPV,0.27,1,160923
São Romão de Neiva,PTP,0.27,1,160923
São Romão de Neiva,MAS,0,0,160923
