Objeto do Contrato,Tipo de Procedimento,Tipo(s) de Contrato,CPVs,Entidade(s) Adjudicante(s),Entidade(s) Adjudicatária(s),Preço Contratual,Data de Publicação,Data de Celebração do Contrato,Prazo de Execução,Local de Execução,Fundamentação,Data de Fecho do Contrato,Preço Total Efetivo,Causas das Alterações ao Prazo,Causas das Alterações ao Preço,Estado,N.º registo do Acordo Quadro,Descrição do Acordo Quadro,Procedimento Centralizado
Centro de Saúde de Sines - Elaboração do Reconhecimento Geotécnico,Ajuste Direto Regime Geral,Aquisição de serviços,"71351000-3, Serviços de prospecção geológica e geofísica e outros serviços de prospecção científica","Administração Regional de Saúde do Alentejo, IP (503148768)","Geoteste Consultores Geotécnicos  e Estruturais, Ldª (500926603)","4.995,00 €",11-03-2011,30-08-2010,30 dias,"Portugal, Setúbal, Sines","Artigo 1.º do Decreto-Lei n.º 48/2008, de 13.03",22-10-2010,"5.114,50 €",,aumento da profundidade dos furos das sondagens,,Não aplicável.,Não aplicável.,
Elaboração do Projecto de Execução do Novo Centro de Saúde de Sines,Ajuste Direto Regime Geral,Aquisição de serviços,"71221000-3, Serviços de arquitectura para edifícios","Administração Regional de Saúde do Alentejo, IP (503148768)","Arquitecto José Quaresma Arquitecto Unipessoal, Ldª (507819730)","59.895,00 €",10-03-2011,15-07-2010,180 dias,"Portugal, Setúbal, Sines","Artigo 1.º do Decreto-Lei n.º 48/2008, de 13.03","","",,"",,Não aplicável.,Não aplicável.,
