freguesia,acronym,validVotesPercentage,votes,dicofre
União das freguesias de Carreira e Fonte Coberta,PS,38.88,215,030295
União das freguesias de Carreira e Fonte Coberta,PPD/PSD.CDS-PP,37.07,205,030295
União das freguesias de Carreira e Fonte Coberta,MPT,9.22,51,030295
União das freguesias de Carreira e Fonte Coberta,PCP-PEV,7.05,39,030295
União das freguesias de Carreira e Fonte Coberta,B.E.,1.63,9,030295
União das freguesias de Carreira e Fonte Coberta,PCTP/MRPP,1.45,8,030295
União das freguesias de Carreira e Fonte Coberta,PND,0.9,5,030295
União das freguesias de Carreira e Fonte Coberta,MAS,0.72,4,030295
União das freguesias de Carreira e Fonte Coberta,PNR,0.72,4,030295
União das freguesias de Carreira e Fonte Coberta,L,0.54,3,030295
União das freguesias de Carreira e Fonte Coberta,PTP,0.54,3,030295
União das freguesias de Carreira e Fonte Coberta,PAN,0.36,2,030295
União das freguesias de Carreira e Fonte Coberta,PDA,0.36,2,030295
União das freguesias de Carreira e Fonte Coberta,PPV,0.36,2,030295
União das freguesias de Carreira e Fonte Coberta,POUS,0.18,1,030295
União das freguesias de Carreira e Fonte Coberta,PPM,0,0,030295
