freguesia,acronym,validVotesPercentage,votes,dicofre
Branca,PS,49.48,288,140905
Branca,PPD/PSD,18.56,108,140905
Branca,PCP-PEV,12.03,70,140905
Branca,B.E.,6.7,39,140905
Branca,CDS-PP,4.81,28,140905
Branca,PAN,1.55,9,140905
Branca,R.I.R.,1.37,8,140905
Branca,PCTP/MRPP,1.2,7,140905
Branca,L,1.03,6,140905
Branca,CH,0.86,5,140905
Branca,NC,0.52,3,140905
Branca,PDR,0.52,3,140905
Branca,A,0.34,2,140905
Branca,PNR,0.34,2,140905
Branca,PURP,0.34,2,140905
Branca,IL,0.17,1,140905
Branca,PTP,0.17,1,140905
Branca,MPT,0,0,140905
Branca,PPM,0,0,140905
