freguesia,acronym,validVotesPercentage,votes,dicofre
Curalha,PS,36.5,50,170310
Curalha,PPD/PSD,35.04,48,170310
Curalha,CDS-PP,8.76,12,170310
Curalha,B.E.,5.84,8,170310
Curalha,PCP-PEV,5.11,7,170310
Curalha,PCTP/MRPP,3.65,5,170310
Curalha,A,1.46,2,170310
Curalha,PAN,0.73,1,170310
Curalha,PNR,0.73,1,170310
Curalha,PPM.PPV/CDC,0.73,1,170310
Curalha,PTP,0.73,1,170310
Curalha,PURP,0.73,1,170310
Curalha,IL,0,0,170310
Curalha,L,0,0,170310
Curalha,MAS,0,0,170310
Curalha,NC,0,0,170310
Curalha,PDR,0,0,170310
