Objeto do Contrato,Tipo de Procedimento,Tipo(s) de Contrato,CPVs,Entidade(s) Adjudicante(s),Entidade(s) Adjudicatária(s),Preço Contratual,Data de Publicação,Data de Celebração do Contrato,Prazo de Execução,Local de Execução,Fundamentação,Data de Fecho do Contrato,Preço Total Efetivo,Causas das Alterações ao Prazo,Causas das Alterações ao Preço,Estado,N.º registo do Acordo Quadro,Descrição do Acordo Quadro,Procedimento Centralizado
Contrato de Manutenção do Ar Condicionado para o ano de 2016,Ajuste Direto Regime Geral,Aquisição de serviços,"50000000-5, Serviços de reparação e manutenção","Hospital de Magalhães Lemos, E. P. E. (502828790)","PROAVAC, LDA. (507719875)","5.415,01 €",05-08-2016,29-01-2016,330 dias,"Portugal, Porto, Porto","Artigo 20.º, n.º 1, alínea a) do Código dos Contratos Públicos",,,,,,Não aplicável.,Não aplicável.,FALSE
Material de Consumo Clínico - Outros - Luvas na SPMS para o ano de 2016,Ajuste Direto Regime Geral,Aquisição de bens móveis,"33000000-0, Equipamento médico, medicamentos e produtos para cuidados pessoais","Hospital de Magalhães Lemos, E. P. E. (502828790)",EZEQUIEL PANÄO JORGE (501412727),"11.226,80 €",01-08-2016,04-01-2016,360 dias,"Portugal, Porto, Porto","Artigo 20.º, n.º 1, alínea a) do Código dos Contratos Públicos",,,,,,Não aplicável.,Não aplicável.,FALSE
Material de Consumo Clínico - Outros - Luvas na SPMS para o ano de 2016,Ajuste Direto Regime Geral,Aquisição de bens móveis,"33000000-0, Equipamento médico, medicamentos e produtos para cuidados pessoais","Hospital de Magalhães Lemos, E. P. E. (502828790)",PERGUT PORTUGAL (501799729),"24,00 €",01-08-2016,04-01-2016,360 dias,"Portugal, Porto, Porto","Artigo 20.º, n.º 1, alínea a) do Código dos Contratos Públicos",,,,,,Não aplicável.,Não aplicável.,FALSE
Material de Consumo Hoteleiro - Sabão Líquido na SPMS para o ano de 2016,Ajuste Direto Regime Geral,Aquisição de bens móveis,"33000000-0, Equipamento médico, medicamentos e produtos para cuidados pessoais","Hospital de Magalhães Lemos, E. P. E. (502828790)",B. BRAUN  (501506543),"4.200,00 €",01-08-2016,01-03-2016,300 dias,"Portugal, Porto, Porto","Artigo 20.º, n.º 1, alínea a) do Código dos Contratos Públicos",,,,,,Não aplicável.,Não aplicável.,FALSE
Serviços de Medicina no Trabalho para o ano de 2016,Ajuste Direto Regime Geral,Aquisição de serviços,"85000000-9, Serviços de saúde e acção social","Hospital de Magalhães Lemos, E. P. E. (502828790)","Soclafe - Prestação de Serviços de Saúde, Lda (508717566)","6.799,20 €",01-08-2016,22-01-2016,360 dias,"Portugal, Porto, Porto","Artigo 20.º, n.º 1, alínea a) do Código dos Contratos Públicos",,,,,,Não aplicável.,Não aplicável.,FALSE
"Material de Consumo Clínico - Fraldas, cuecas, chinelos e babetes na SPMS para o ano de 2016",Ajuste Direto Regime Geral,Aquisição de bens móveis,"33000000-0, Equipamento médico, medicamentos e produtos para cuidados pessoais","Hospital de Magalhães Lemos, E. P. E. (502828790)","SCA HYGIENE PRODUCTS,LDA (503237612)","6.217,00 €",01-08-2016,04-01-2016,365 dias,"Portugal, Porto, Porto","Artigo 20.º, n.º 1, alínea a) do Código dos Contratos Públicos",,,,,,Não aplicável.,Não aplicável.,FALSE
"Material de Consumo Clínico - Fraldas, cuecas, chinelos e babetes na SPMS para o ano de 2016",Ajuste Direto Regime Geral,Aquisição de bens móveis,"33000000-0, Equipamento médico, medicamentos e produtos para cuidados pessoais","Hospital de Magalhães Lemos, E. P. E. (502828790)","Procter & Gamble Portugal - Produtos de Consumo Higiene e Saúde, SA (503037753)","8.718,00 €",01-08-2016,04-01-2016,365 dias,"Portugal, Porto, Porto","Artigo 20.º, n.º 1, alínea a) do Código dos Contratos Públicos",,,,,,Não aplicável.,Não aplicável.,FALSE
"Material de Consumo Clínico - Fraldas, cuecas, chinelos e babetes na SPMS para o ano de 2016",Ajuste Direto Regime Geral,Aquisição de bens móveis,"33000000-0, Equipamento médico, medicamentos e produtos para cuidados pessoais","Hospital de Magalhães Lemos, E. P. E. (502828790)",PAUL HARTMANN (502271728),"101,78 €",01-08-2016,04-01-2016,365 dias,"Portugal, Porto, Porto","Artigo 20.º, n.º 1, alínea a) do Código dos Contratos Públicos",,,,,,Não aplicável.,Não aplicável.,FALSE
"Material de Consumo Clínico - Fraldas, cuecas, chinelos e babetes na SPMS para o ano de 2016",Ajuste Direto Regime Geral,Aquisição de bens móveis,"33000000-0, Equipamento médico, medicamentos e produtos para cuidados pessoais","Hospital de Magalhães Lemos, E. P. E. (502828790)","Docworld, Lda. (508592909)","345,00 €",01-08-2016,04-01-2016,365 dias,"Portugal, Porto, Porto","Artigo 20.º, n.º 1, alínea a) do Código dos Contratos Públicos",,,,,,Não aplicável.,Não aplicável.,FALSE
"IG 4/2016 - Material de Consumo Clínico - Fraldas, cuecas, chinelos e babetes na SPMS para o ano de 2016",Ajuste Direto Regime Geral,Aquisição de bens móveis,"33000000-0, Equipamento médico, medicamentos e produtos para cuidados pessoais","Hospital de Magalhães Lemos, E. P. E. (502828790)","BASTOS VIEGAS,S.A. (500042772)","873,50 €",01-08-2016,04-01-2016,365 dias,"Portugal, Porto, Porto","Artigo 20.º, n.º 1, alínea a) do Código dos Contratos Públicos",,,,,,Não aplicável.,Não aplicável.,FALSE
Aquisição de material informático para o pavilhão D,Ajuste Direto Regime Geral,Aquisição de bens móveis,"30000000-9, Máquinas, equipamento e material de escritório e de informática, excepto mobiliário e pacotes de programas (software)","Hospital de Magalhães Lemos, E. P. E. (502828790)","TYTEC - Tecnologias de Integração, Comunicação e Segurança, S.A. (508781590)","4.301,49 €",01-08-2016,15-02-2016,5 dias,"Portugal, Porto, Porto","Artigo 20.º, n.º 1, alínea a) do Código dos Contratos Públicos",,,,,,Não aplicável.,Não aplicável.,FALSE
Aquisição de combustíveis rodoviários - 2016_UMC_CR_LOTE2 para 2016,Ajuste Direto Regime Geral,Aquisição de bens móveis,"09000000-3, Produtos petrolíferos, combustíveis, electricidade e outras fontes de energia","Hospital de Magalhães Lemos, E. P. E. (502828790)",Petróleos de Portugal - Petrogal SA (500697370),"11.908,76 €",01-08-2016,10-02-2016,365 dias,"Portugal, Porto, Porto","Artigo 20.º, n.º 1, alínea a) do Código dos Contratos Públicos",,,,,,Não aplicável.,Não aplicável.,FALSE
"Fornecimento de frutas, produtos hortícolas e produtos de 4.ª gama para o ano de 2016",Ajuste Direto Regime Geral,Aquisição de bens móveis,"15000000-8, Produtos alimentares, bebidas, tabaco e produtos afins","Hospital de Magalhães Lemos, E. P. E. (502828790)",FreshSabor (508879760),"18.458,30 €",01-08-2016,29-04-2016,210 dias,"Portugal, Porto, Porto","Artigo 20.º, n.º 1, alínea a) do Código dos Contratos Públicos",,,,,,Não aplicável.,Não aplicável.,FALSE
Aquisição de papel fotocópia e impressão para o ano de 2016,Ajuste Direto Regime Geral,Aquisição de bens móveis,"22000000-0, Material impresso e afins","Hospital de Magalhães Lemos, E. P. E. (502828790)","OHM Técnica - Representações de Marcas, Lda  (504059521)","6.050,30 €",01-08-2016,04-01-2016,365 dias,"Portugal, Porto, Porto","Artigo 20.º, n.º 1, alínea a) do Código dos Contratos Públicos",,,,,,Não aplicável.,Não aplicável.,FALSE
Fornecimento de Gás Natural ao abrigo da UMC para o ano de 2016,Ajuste Direto Regime Geral,Aquisição de serviços,"76000000-3, Serviços relacionados com as indústrias do gás e do petróleo","Hospital de Magalhães Lemos, E. P. E. (502828790)","Galp Power, SA (504723456)","66.261,71 €",01-08-2016,05-02-2016,330 dias,"Portugal, Porto, Porto","Artigo 20.º, n.º 1, alínea a) do Código dos Contratos Públicos",,,,,,Não aplicável.,Não aplicável.,FALSE
"Fornecimento de frutas, produtos hortícolas e produtos de 4.ª gama – 1.º Semestre de 2015",Ajuste Direto Regime Geral,Aquisição de bens móveis,"15000000-8, Produtos alimentares, bebidas, tabaco e produtos afins","Hospital de Magalhães Lemos, E. P. E. (502828790)","Madiguima - Comércio de Frutas, Lda (503301205)","23.763,90 €",01-08-2016,17-04-2015,90 dias,"Portugal, Porto, Porto","Artigo 20.º, n.º 1, alínea a) do Código dos Contratos Públicos",,,,,,Não aplicável.,Não aplicável.,FALSE
Contrato de manutenção da HP para o ano de 2016,Ajuste Direto Regime Geral,Aquisição de serviços,"50000000-5, Serviços de reparação e manutenção","Hospital de Magalhães Lemos, E. P. E. (502828790)",HP - HEWLETT PACKARD PORTUGAL (502407697),"9.840,48 €",01-08-2016,01-02-2016,330 dias,"Portugal, Porto, Porto","Artigo 20.º, n.º 1, alínea a) do Código dos Contratos Públicos",,,,,,Não aplicável.,Não aplicável.,FALSE
Obras de Fornecimento e Instalação de Circuito Fechado de um Sistema de CCTV no Edifício D – 1.º Piso Esq.º,Ajuste Direto Regime Geral,Aquisição de serviços,"51000000-9, Serviços de instalação (excepto software)","Hospital de Magalhães Lemos, E. P. E. (502828790)","ET - Empresa de Export-Import e Cooperação Industrial, Lda (500701490)","8.161,00 €",01-08-2016,10-11-2015,30 dias,"Portugal, Porto, Porto","Artigo 20.º, n.º 1, alínea a) do Código dos Contratos Públicos",,,,,,Não aplicável.,Não aplicável.,FALSE
Fornecimento e Instalação de Sistema de Deteção de Alarme de Incêndios no Edifício D – 1.º e 2.º Pisos Direito e 2.º Piso Esq.º,Ajuste Direto Regime Geral,Aquisição de bens móveis,"35000000-4, Equipamento de segurança, combate a incêndios, polícia e defesa","Hospital de Magalhães Lemos, E.P.E. (502828790)","ALCANÇATANGENTE ELECTRICIDADE UNIPESSOAL, LDA (513117903)","15.817,80 €",01-08-2016,21-10-2015,60 dias,"Portugal, Porto, Porto","Artigo 20.º, n.º 1, alínea a) do Código dos Contratos Públicos",,,,,,Não aplicável.,Não aplicável.,FALSE
