Objeto do Contrato,Tipo de Procedimento,Tipo(s) de Contrato,CPVs,Entidade(s) Adjudicante(s),Entidade(s) Adjudicatária(s),Preço Contratual,Data de Publicação,Data de Celebração do Contrato,Prazo de Execução,Local de Execução,Fundamentação,Data de Fecho do Contrato,Preço Total Efetivo,Causas das Alterações ao Prazo,Causas das Alterações ao Preço,Estado,N.º registo do Acordo Quadro,Descrição do Acordo Quadro,Procedimento Centralizado
Actualização do Sistema de Informação da ARS (SIARS) da Administração Regional de Saúde do Algarve,Ajuste Direto Regime Geral,Aquisição de bens móveis,"48900000-7, Pacote de software e sistemas informáticos diversos","Administração Regional de Saúde do Algarve, I.P. (503148709)","Agilletm Serviços e Cons. de Gestão, S.A (506403343)","45.000,00 €",31-03-2011,31-03-2011,19 dias,"Portugal, Faro, Faro","Artigo 20.º, n.º 1, alínea a) do Código dos Contratos Públicos",19-04-2011,"45.000,00 €",,,,Não aplicável.,Não aplicável.,
"Fornecimento e instalação de sistemas rotativos para automatização do armazenamento, distribuição e gestão de medicamentos, dispositivos médicos, material de consumo clínico e material diverso",Ajuste Direto Regime Geral,Aquisição de bens móveis,"42933000-5, Distribuidores automáticos","Administração Regional de Saúde do Algarve, I.P. (503148709)",Grifols Portugal - Produtos Farmacêuticos e Hospitalares Lda. (507987349),"74.900,00 €",30-03-2011,30-03-2011,90 dias,"Portugal, Faro, Faro","Artigo 20.º, n.º 1, alínea a) do Código dos Contratos Públicos","","",,,,Não aplicável.,Não aplicável.,
Aquisição de Reagentes para o Serviço de Análises Clínicas para o LRSP,Ajuste Direto Regime Geral,Aquisição de bens móveis,"33696500-0, Reagentes de laboratório","Administração Regional de Saúde do Algarve, I.P. (503148709)","BioMerieux Portugal-Aparelhos e Reagentes de Laboratório,Lda (501524177)","46.291,60 €",29-03-2011,29-03-2011,270 dias,"Portugal, Faro, Faro","Artigo 24.º, n.º 1, alínea e) do Código dos Contratos Públicos","","",,,,Não aplicável.,Não aplicável.,
VACINAS,Ajuste Direto Regime Geral,Aquisição de serviços,"33651600-4, Vacinas","Administração Regional de Saúde do Algarve, I.P. (503148709)",J.M.farmacêutica (503550558),"135.936,00 €",29-03-2011,29-03-2011,270 dias,"Portugal, Faro, Faro<BR/>Portugal, Faro, Faro","Artigo 26.º, n.º 1, alínea e) do Código dos Contratos Públicos","","",,,,Não aplicável.,Não aplicável.,
Aquisição de Consumíveis Millipore para o Laboratório Regional de Saúde Pública,Ajuste Direto Regime Geral,Aquisição de bens móveis,"33696500-0, Reagentes de laboratório","Administração Regional de Saúde do Algarve, I.P. (503148709)",Type Solution SA (508400317),"4.072,77 €",24-03-2011,22-03-2011,270 dias,"Portugal, Faro, Faro","Artigo 20.º, n.º 1, alínea a) do Código dos Contratos Públicos","","",,,,Não aplicável.,Não aplicável.,
Aquisição de Consumíveis Millipore para o Laboratório Regional de Saúde Pública,Ajuste Direto Regime Geral,Aquisição de bens móveis,"33696500-0, Reagentes de laboratório","Administração Regional de Saúde do Algarve, I.P. (503148709)",Interface Equipamento e Técnica Lda (501379860),"2.992,88 €",24-03-2011,22-03-2011,270 dias,"Portugal, Faro, Faro","Artigo 20.º, n.º 1, alínea a) do Código dos Contratos Públicos","","",,,,Não aplicável.,Não aplicável.,
"AQUISIÇÃO DE VIDEOPROJECTORES, MÁQUINAS FOTOGRÁFICAS DIGITAIS E CÂMARAS DE VÍDEO, PARA OS SERVIÇOS DA ARS ALGARVE, I.P.",Ajuste Direto Regime Geral,Aquisição de bens móveis,"38651000-3, Máquinas fotográficas<BR/>38652120-7, Videoprojectores<BR/>32333200-8, Câmaras de vídeo","Administração Regional de Saúde do Algarve, I.P. (503148709)","Algardata Sistemas Informáticos, S.A. (502420227)","9.446,00 €",22-03-2011,22-03-2011,14 dias,"Portugal, Faro","Artigo 20.º, n.º 1, alínea a) do Código dos Contratos Públicos","","",,,,Não aplicável.,Não aplicável.,
Aquisição de Reagentes para o LRSP,Ajuste Direto Regime Geral,Aquisição de bens móveis,"33696500-0, Reagentes de laboratório","Administração Regional de Saúde do Algarve, I.P. (503148709)","BioMérieux Portugal - Aparelhos e Reagentes de Laboratório, Lda. (501524177)","6.562,75 €",21-03-2011,15-03-2011,2 dias,"Portugal, Faro, Faro","Artigo 24.º, n.º 1, alínea e) do Código dos Contratos Públicos","","",,,,Não aplicável.,Não aplicável.,
