Objeto do Contrato,Tipo de Procedimento,Tipo(s) de Contrato,CPVs,Entidade(s) Adjudicante(s),Entidade(s) Adjudicatária(s),Preço Contratual,Data de Publicação,Data de Celebração do Contrato,Prazo de Execução,Local de Execução,Fundamentação,Data de Fecho do Contrato,Preço Total Efetivo,Causas das Alterações ao Prazo,Causas das Alterações ao Preço,Estado,N.º registo do Acordo Quadro,Descrição do Acordo Quadro,Procedimento Centralizado
Aquisição de reagentes para a realização de testes de gasimetria de janeiro a março,Ajuste Direto Regime Geral,Aquisição de bens móveis,"33000000-0, Equipamento médico, medicamentos e produtos para cuidados pessoais","Unidade Local de Saúde do Norte Alentejano, E. P. E. (508094461)","Roche, Sistemas de Diagnósticos, Sociedade Unipessoal, Lda (504282921)","16.568,00 €",10-02-2015,10-02-2015,90 dias,"Portugal, Portalegre, Elvas<BR/>Portugal, Portalegre, Portalegre","Artigo 24.º, n.º 1, alínea c) do Código dos Contratos Públicos",31-12-2015,"4.360,00 €",,Não foram adquiridas todas as quantidades estimadas.,,Não aplicável.,Não aplicável.,FALSE
Aquisição de Modelos Exclusivos da INCM.,Ajuste Direto Regime Geral,Aquisição de bens móveis,"22800000-8, Livros de registo e de contabilidade, capas, formulários e outros artigos de papelaria impressos, de papel ou cartão","Unidade Local de Saúde do Norte Alentejano, E. P. E. (508094461)",IMPRENSA NACIONAL - CASA DA MOEDA SA (500792887),"2.344,74 €",06-02-2015,16-01-2015,365 dias,"Portugal, Portalegre, Portalegre","Artigo 24.º, n.º 1, alínea e) do Código dos Contratos Públicos","","",,"",,Não aplicável.,Não aplicável.,FALSE
"AQUISIÇÃO DE REAGENTES DE URIANALISE PARA A ULSNA, EPE PARA 36 MESES",Concurso público,Aquisição de bens móveis,"33000000-0, Equipamento médico, medicamentos e produtos para cuidados pessoais","Unidade Local de Saúde do Norte Alentejano, E. P. E. (508094461)","A. MENARINI DIAGNÓSTICOS - MATERIAL DE LABORATÓRIO, LDA (502610069)","38.100,00 €",06-02-2015,05-02-2015,13140 dias,"Portugal, Portalegre, Elvas<BR/>Portugal, Portalegre, Portalegre","Artigo 20.º, n.º 1, alínea b) do Código dos Contratos Públicos","","",,"",,Não aplicável.,Não aplicável.,FALSE
"Aquisição de Exames de Ressonância Magnética para a ULSNA, EPE",Concurso público,Aquisição de serviços,"85150000-5, Serviços de imagiologia médica","Unidade Local de Saúde do Norte Alentejano, E. P. E. (508094461)","Remagna, Lda. (508563682)","116.900,00 €",05-02-2015,19-01-2015,365 dias,"Portugal, Portalegre, Portalegre","Artigo 20.º, n.º 1, alínea b) do Código dos Contratos Públicos",05-02-2015,"116.900,00 €",,"",,Não aplicável.,Não aplicável.,FALSE
Aquisição Medicamentos Exclusivos,Ajuste Direto Regime Geral,Aquisição de bens móveis,"33000000-0, Equipamento médico, medicamentos e produtos para cuidados pessoais","Unidade Local de Saúde do Norte Alentejano, E. P. E. (508094461)",Dilofar Distribuição Transportes e Logística (500563004),"6.089,00 €",04-02-2015,03-02-2015,365 dias,"Portugal, Portalegre, Portalegre","Artigo 24.º, n.º 1, alínea e) do Código dos Contratos Públicos",03-02-2015,"6.089,00 €",,"",,Não aplicável.,Não aplicável.,FALSE
"Aquisição de Próteses Ortopédicas da Anca e do Joelho para a ULSNA, EPE",Concurso público,Aquisição de bens móveis,"33183200-8, Próteses ortopédicas","Unidade Local de Saúde do Norte Alentejano, E. P. E. (508094461)",JOHNSON JOHNSON MEDICAL (500153370),"567.600,00 €",04-02-2015,27-08-2014,1080 dias,"Portugal, Portalegre, Portalegre","Artigo 20.º, n.º 1, alínea b) do Código dos Contratos Públicos","","",,"",,Não aplicável.,Não aplicável.,FALSE
Aquisição de Produtos Farmacêuticos Exclusivos,Ajuste Direto Regime Geral,Aquisição de bens móveis,"33000000-0, Equipamento médico, medicamentos e produtos para cuidados pessoais","Unidade Local de Saúde do Norte Alentejano, E. P. E. (508094461)","Laboratórios Inibsa, SA (500139571)","5.100,00 €",04-02-2015,03-02-2015,365 dias,"Portugal, Portalegre, Portalegre<BR/>Portugal, Portalegre, Elvas","Artigo 24.º, n.º 1, alínea e) do Código dos Contratos Públicos","","",,"",,Não aplicável.,Não aplicável.,FALSE
Aquisição de Medicamentos Exclusivos,Ajuste Direto Regime Geral,Aquisição de bens móveis,"33000000-0, Equipamento médico, medicamentos e produtos para cuidados pessoais","Unidade Local de Saúde do Norte Alentejano, E. P. E. (508094461)",Gilead Sciences Lda (503604704),"29.208,80 €",03-02-2015,26-01-2015,365 dias,"Portugal, Portalegre, Elvas<BR/>Portugal, Portalegre, Portalegre","Artigo 24.º, n.º 1, alínea e) do Código dos Contratos Públicos",31-12-2015,"29.208,50 €",,Não existem.,,Não aplicável.,Não aplicável.,FALSE
