Objeto do Contrato,Tipo de Procedimento,Tipo(s) de Contrato,CPVs,Entidade(s) Adjudicante(s),Entidade(s) Adjudicatária(s),Preço Contratual,Data de Publicação,Data de Celebração do Contrato,Prazo de Execução,Local de Execução,Fundamentação,Data de Fecho do Contrato,Preço Total Efetivo,Causas das Alterações ao Prazo,Causas das Alterações ao Preço,Estado,N.º registo do Acordo Quadro,Descrição do Acordo Quadro,Procedimento Centralizado
AD802175 - ARMÁRIOS - CIRURGIA GERAL DO HSFX,Ajuste Direto Regime Geral,Aquisição de bens móveis,"33000000-0, Equipamento médico, medicamentos e produtos para cuidados pessoais","Centro Hospitalar de Lisboa Ocidental, EPE (CHLO) (507618319)",INDUSTRIAL LABORUM (506692027),"11.078,00 €",18-12-2015,30-09-2015,66 dias,"Portugal, Lisboa, Lisboa","Artigo 20.º, n.º 1, alínea a) do Código dos Contratos Públicos",,,,,,Não aplicável.,Não aplicável.,FALSE
Fornecimento e Colocação de Monosplits no Piso 3 do HEM,Ajuste Direto Regime Geral,Aquisição de bens móveis,"42512000-8, Instalações de ar condicionado","Centro Hospitalar de Lisboa Ocidental, EPE (CHLO) (507618319)","CERTIFILTRA  - MANUTENÇÃO DE AR CONDICIONADO, LDA (504185861)","32.065,00 €",15-12-2015,15-12-2015,15 dias,"Portugal, Lisboa, Lisboa","Artigo 20.º, n.º 1, alínea a) do Código dos Contratos Públicos",,,,,,Não aplicável.,Não aplicável.,FALSE
"Aquisição de 100 camas para o CHLO, EPE",Concurso público,Aquisição de bens móveis,"33192120-9, Camas de hospital","Centro Hospitalar de Lisboa Ocidental, E. P. E. (507618319)",FILSAT LDA (506708616),"121.000,00 €",11-12-2015,07-09-2015,66 dias,"Portugal, Lisboa, Lisboa","Artigo 20.º, n.º 1, alínea b) do Código dos Contratos Públicos",,,,,,Não aplicável.,Não aplicável.,FALSE
"Aquisição de Artigos de Rouparia para o CHLO, EPE",Concurso público,Aquisição de bens móveis,"18000000-9, Vestuário, calçado, malas e artigos de viagem, acessórios","Centro Hospitalar de Lisboa Ocidental, E. P. E. (507618319)",MUNDIFATO LDA (502383542),"79.001,90 €",11-12-2015,16-11-2015,66 dias,"Portugal, Lisboa, Lisboa","Artigo 20.º, n.º 1, alínea b) do Código dos Contratos Públicos",,,,,,Não aplicável.,Não aplicável.,FALSE
