freguesia,acronym,validVotesPercentage,votes,dicofre
Lomba de São Pedro,PS,54.02,47,420504
Lomba de São Pedro,PPD/PSD.CDS-PP,31.03,27,420504
Lomba de São Pedro,B.E.,3.45,3,420504
Lomba de São Pedro,L,2.3,2,420504
Lomba de São Pedro,MAS,2.3,2,420504
Lomba de São Pedro,MPT,2.3,2,420504
Lomba de São Pedro,PAN,1.15,1,420504
Lomba de São Pedro,PND,1.15,1,420504
Lomba de São Pedro,PPV,1.15,1,420504
Lomba de São Pedro,PTP,1.15,1,420504
Lomba de São Pedro,PCP-PEV,0,0,420504
Lomba de São Pedro,PCTP/MRPP,0,0,420504
Lomba de São Pedro,PDA,0,0,420504
Lomba de São Pedro,PNR,0,0,420504
Lomba de São Pedro,POUS,0,0,420504
Lomba de São Pedro,PPM,0,0,420504
