freguesia,acronym,validVotesPercentage,votes,dicofre
União das freguesias de Alcoutim e Pereiro,PS,53.49,207,080206
União das freguesias de Alcoutim e Pereiro,PPD/PSD.CDS-PP,23,89,080206
União das freguesias de Alcoutim e Pereiro,PCP-PEV,11.11,43,080206
União das freguesias de Alcoutim e Pereiro,MPT,4.13,16,080206
União das freguesias de Alcoutim e Pereiro,B.E.,2.07,8,080206
União das freguesias de Alcoutim e Pereiro,PCTP/MRPP,1.81,7,080206
União das freguesias de Alcoutim e Pereiro,L,1.03,4,080206
União das freguesias de Alcoutim e Pereiro,PND,0.78,3,080206
União das freguesias de Alcoutim e Pereiro,PPV,0.78,3,080206
União das freguesias de Alcoutim e Pereiro,MAS,0.52,2,080206
União das freguesias de Alcoutim e Pereiro,PAN,0.52,2,080206
União das freguesias de Alcoutim e Pereiro,PPM,0.52,2,080206
União das freguesias de Alcoutim e Pereiro,PTP,0.26,1,080206
União das freguesias de Alcoutim e Pereiro,PDA,0,0,080206
União das freguesias de Alcoutim e Pereiro,PNR,0,0,080206
União das freguesias de Alcoutim e Pereiro,POUS,0,0,080206
