freguesia,acronym,validVotesPercentage,votes,dicofre
"Mêda, Outeiro de Gatos e Fonte Longa",PS,34.62,242,090917
"Mêda, Outeiro de Gatos e Fonte Longa",PPD/PSD,25.18,176,090917
"Mêda, Outeiro de Gatos e Fonte Longa",CDS-PP,19.6,137,090917
"Mêda, Outeiro de Gatos e Fonte Longa",B.E.,8.01,56,090917
"Mêda, Outeiro de Gatos e Fonte Longa",PAN,2.29,16,090917
"Mêda, Outeiro de Gatos e Fonte Longa",PCP-PEV,1.86,13,090917
"Mêda, Outeiro de Gatos e Fonte Longa",PPM.PPV/CDC,1.72,12,090917
"Mêda, Outeiro de Gatos e Fonte Longa",A,1.57,11,090917
"Mêda, Outeiro de Gatos e Fonte Longa",L,1.57,11,090917
"Mêda, Outeiro de Gatos e Fonte Longa",PCTP/MRPP,1.14,8,090917
"Mêda, Outeiro de Gatos e Fonte Longa",PDR,0.86,6,090917
"Mêda, Outeiro de Gatos e Fonte Longa",NC,0.57,4,090917
"Mêda, Outeiro de Gatos e Fonte Longa",MAS,0.43,3,090917
"Mêda, Outeiro de Gatos e Fonte Longa",IL,0.29,2,090917
"Mêda, Outeiro de Gatos e Fonte Longa",PNR,0.14,1,090917
"Mêda, Outeiro de Gatos e Fonte Longa",PURP,0.14,1,090917
"Mêda, Outeiro de Gatos e Fonte Longa",PTP,0,0,090917
