freguesia,acronym,validVotesPercentage,votes,dicofre
Santa Cruz do Lima,PPD/PSD,42.18,62,160743
Santa Cruz do Lima,PS,26.53,39,160743
Santa Cruz do Lima,CDS-PP,16.33,24,160743
Santa Cruz do Lima,B.E.,4.08,6,160743
Santa Cruz do Lima,NC,2.72,4,160743
Santa Cruz do Lima,PCTP/MRPP,2.04,3,160743
Santa Cruz do Lima,PPM.PPV/CDC,2.04,3,160743
Santa Cruz do Lima,PAN,1.36,2,160743
Santa Cruz do Lima,PDR,1.36,2,160743
Santa Cruz do Lima,A,0.68,1,160743
Santa Cruz do Lima,PURP,0.68,1,160743
Santa Cruz do Lima,IL,0,0,160743
Santa Cruz do Lima,L,0,0,160743
Santa Cruz do Lima,MAS,0,0,160743
Santa Cruz do Lima,PCP-PEV,0,0,160743
Santa Cruz do Lima,PNR,0,0,160743
Santa Cruz do Lima,PTP,0,0,160743
