freguesia,acronym,validVotesPercentage,votes,dicofre
União das freguesias de Amedo e Zedes,PPD/PSD,45.16,56,040320
União das freguesias de Amedo e Zedes,PS,27.42,34,040320
União das freguesias de Amedo e Zedes,B.E.,9.68,12,040320
União das freguesias de Amedo e Zedes,CDS-PP,8.87,11,040320
União das freguesias de Amedo e Zedes,PCTP/MRPP,3.23,4,040320
União das freguesias de Amedo e Zedes,NC,2.42,3,040320
União das freguesias de Amedo e Zedes,PCP-PEV,2.42,3,040320
União das freguesias de Amedo e Zedes,PURP,0.81,1,040320
União das freguesias de Amedo e Zedes,A,0,0,040320
União das freguesias de Amedo e Zedes,IL,0,0,040320
União das freguesias de Amedo e Zedes,L,0,0,040320
União das freguesias de Amedo e Zedes,MAS,0,0,040320
União das freguesias de Amedo e Zedes,PAN,0,0,040320
União das freguesias de Amedo e Zedes,PDR,0,0,040320
União das freguesias de Amedo e Zedes,PNR,0,0,040320
União das freguesias de Amedo e Zedes,PPM.PPV/CDC,0,0,040320
União das freguesias de Amedo e Zedes,PTP,0,0,040320
