freguesia,acronym,validVotesPercentage,votes,dicofre
União das freguesias de Alvito (São Pedro e São Martinho) e Couto,PPD/PSD.CDS-PP,47.02,197,030291
União das freguesias de Alvito (São Pedro e São Martinho) e Couto,PS,25.54,107,030291
União das freguesias de Alvito (São Pedro e São Martinho) e Couto,MPT,11.46,48,030291
União das freguesias de Alvito (São Pedro e São Martinho) e Couto,B.E.,6.68,28,030291
União das freguesias de Alvito (São Pedro e São Martinho) e Couto,PCP-PEV,2.86,12,030291
União das freguesias de Alvito (São Pedro e São Martinho) e Couto,PAN,2.15,9,030291
União das freguesias de Alvito (São Pedro e São Martinho) e Couto,PCTP/MRPP,1.91,8,030291
União das freguesias de Alvito (São Pedro e São Martinho) e Couto,L,0.95,4,030291
União das freguesias de Alvito (São Pedro e São Martinho) e Couto,MAS,0.48,2,030291
União das freguesias de Alvito (São Pedro e São Martinho) e Couto,PND,0.48,2,030291
União das freguesias de Alvito (São Pedro e São Martinho) e Couto,PPM,0.24,1,030291
União das freguesias de Alvito (São Pedro e São Martinho) e Couto,PTP,0.24,1,030291
União das freguesias de Alvito (São Pedro e São Martinho) e Couto,PDA,0,0,030291
União das freguesias de Alvito (São Pedro e São Martinho) e Couto,PNR,0,0,030291
União das freguesias de Alvito (São Pedro e São Martinho) e Couto,POUS,0,0,030291
União das freguesias de Alvito (São Pedro e São Martinho) e Couto,PPV,0,0,030291
