Objeto do Contrato,Tipo de Procedimento,Tipo(s) de Contrato,CPVs,Entidade(s) Adjudicante(s),Entidade(s) Adjudicatária(s),Preço Contratual,Data de Publicação,Data de Celebração do Contrato,Prazo de Execução,Local de Execução,Fundamentação,Data de Fecho do Contrato,Preço Total Efetivo,Causas das Alterações ao Prazo,Causas das Alterações ao Preço,Estado,N.º registo do Acordo Quadro,Descrição do Acordo Quadro,Procedimento Centralizado
AD143-2018CONTRATO DE ASSISTENCIA TÉCNICA,Ajuste Direto Regime Geral,Aquisição de serviços,"50400000-9, Serviços de reparação e manutenção de equipamento médico e de precisão","Instituto Português de Oncologia de Lisboa Francisco Gentil, E. P. E. (506361616)","AIR LIQUIDE MEDICINAL, S.A. (501576436)","6.709,92 €",19-01-2018,16-01-2018,365 dias,"Portugal, Lisboa, Lisboa","Artigo 24.º, n.º 1, alínea e) do Código dos Contratos Públicos",,,,,,Não aplicável.,Não aplicável.,FALSE
AD364-2018DASATINIB 50 MG CP,Ao abrigo de acordo-quadro (art.º 259.º),Aquisição de bens móveis,"33600000-6, Produtos farmacêuticos","Instituto Português de Oncologia de Lisboa Francisco Gentil, E. P. E. (506361616)",BRISTOL-MYERS SQUIBB (500048193),"66.106,73 €",18-01-2018,12-01-2018,365 dias,"Portugal, Lisboa, Lisboa",Artigo 259.º do Código dos Contratos Públicos,,,,,,1771819,CP 2015/6 - Acordo quadro para o fornecimento de Medicamentos do Foro Oncológico,FALSE
"AD331-2018 P-259-AC2017 CICLOFOSFAMIDA,IFOSFAMIDA",Ao abrigo de acordo-quadro (art.º 259.º),Aquisição de bens móveis,"33600000-6, Produtos farmacêuticos","Instituto Português de Oncologia de Lisboa Francisco Gentil, E. P. E. (506361616)",BAXTER MÉDICO FARMACEUTICA LDA (503347345),"206.439,55 €",18-01-2018,15-01-2018,365 dias,"Portugal, Lisboa, Lisboa",Artigo 259.º do Código dos Contratos Públicos,,,,,,1771819,CP 2015/6 - Acordo quadro para o fornecimento de Medicamentos do Foro Oncológico,FALSE
AD358-2018 SUNITINIB 25 MG CP,Ao abrigo de acordo-quadro (art.º 259.º),Aquisição de bens móveis,"33600000-6, Produtos farmacêuticos","Instituto Português de Oncologia de Lisboa Francisco Gentil, E. P. E. (506361616)",PFIZER BIOFARMACEUTICA LDA (513300376),"17.387,82 €",18-01-2018,12-01-2018,30 dias,"Portugal, Lisboa, Lisboa",Artigo 259.º do Código dos Contratos Públicos,,,,,,1771819,CP 2015/6 - Acordo quadro para o fornecimento de Medicamentos do Foro Oncológico,FALSE
AD134-2018 PRESTAÇÃO DE SERVIÇOS DE APOIO GERAL NA AREA DA LOGISTICA,Ajuste Direto Regime Geral,Aquisição de serviços,"79600000-0, Serviços de recrutamento","Instituto Português de Oncologia de Lisboa FG, E.P.E. (506361616)",EGOR OUTSOURCING-PRESTAÇÃO DE SERVIÇOS ORGANIZAÇÃO E ADMINISTRAÇÃO DE PESSOAL LDA (504136992),"52.560,00 €",18-01-2018,08-01-2018,180 dias,"Portugal, Lisboa, Lisboa","Artigo 24.º, n.º 1, alínea c) do Código dos Contratos Públicos",,,,,,Não aplicável.,Não aplicável.,FALSE
AD60-2018-PRESTAÇÃO DE SERVIÇOS MÉDICOS NA ÁREA DE NEUROPATOLOGIA ONCOLÓGICA,Ajuste Direto Regime Geral,Aquisição de serviços,"85111200-2, Serviços hospitalares de medicina","Instituto Português de Oncologia de Lisboa FG, E.P.E. (506361616)","ANATOMIS PATOLÓGICA, LDA (504114131)","10.080,00 €",17-01-2018,05-12-2017,365 dias,"Portugal, Lisboa, Lisboa","Artigo 20.º, n.º 1, alínea a) do Código dos Contratos Públicos",,,,,,Não aplicável.,Não aplicável.,FALSE
AD12-2018EFEDRINA SULFATO 50 MG/ML INJ-10 ML,Ao abrigo de acordo-quadro (art.º 259.º),Aquisição de bens móveis,"33600000-6, Produtos farmacêuticos","Instituto Português de Oncologia de Lisboa Francisco Gentil, E. P. E. (506361616)","LABESFAL-LABORATÓRIOS ALMIRO, S.A. (501169580)","1.520,70 €",17-01-2018,12-01-2018,30 dias,"Portugal, Lisboa, Lisboa",Artigo 259.º do Código dos Contratos Públicos,,,,,,1638654,CP 2015/12 - Acordo quadro para fornecimento de Medicamentos do Aparelho Respiratório às Instituições e Serviços do Serviço Nacional de Saúde,FALSE
AD211-2018-P259-AC2017-151,Ao abrigo de acordo-quadro (art.º 259.º),Aquisição de bens móveis,"33600000-6, Produtos farmacêuticos","Instituto Português de Oncologia de Lisboa Francisco Gentil, E. P. E. (506361616)","ASTRAZENECA PRODUTOS FARMACEUTICOS, LDA (502942240)","11.335,50 €",12-01-2018,12-01-2018,365 dias,"Portugal, Lisboa, Lisboa",Artigo 259.º do Código dos Contratos Públicos,,,,,,1771819,CP 2015/6 - Acordo quadro para o fornecimento de Medicamentos do Foro Oncológico,FALSE
AD206-2018 P259-AC2017-145,Ao abrigo de acordo-quadro (art.º 259.º),Aquisição de bens móveis,"33600000-6, Produtos farmacêuticos","Instituto Português de Oncologia de Lisboa Francisco Gentil, E. P. E. (506361616)","ABBVIE, LDA (510229050)","9.086,52 €",12-01-2018,03-01-2018,365 dias,"Portugal, Lisboa, Lisboa",Artigo 259.º do Código dos Contratos Públicos,,,,,,1771819,CP 2015/6 - Acordo quadro para o fornecimento de Medicamentos do Foro Oncológico,FALSE
AD203-2018 P259-AC-2017-170,Ao abrigo de acordo-quadro (art.º 259.º),Aquisição de bens móveis,"33600000-6, Produtos farmacêuticos","Instituto Português de Oncologia de Lisboa Francisco Gentil, E. P. E. (506361616)",GENERIS FARMACEUTICA S.A. (508107997),"900,00 €",12-01-2018,11-01-2018,365 dias,"Portugal, Lisboa, Lisboa",Artigo 259.º do Código dos Contratos Públicos,,,,,,1771819,CP 2015/6 - Acordo quadro para o fornecimento de Medicamentos do Foro Oncológico,FALSE
AD158-2018 P259-AC2017-158,Ao abrigo de acordo-quadro (art.º 259.º),Aquisição de bens móveis,"33600000-6, Produtos farmacêuticos","Instituto Português de Oncologia de Lisboa Francisco Gentil, E. P. E. (506361616)","JANSSEN-CILAG FARMACEUTICA, LDA (500189412)","37.869,14 €",11-01-2018,04-01-2018,365 dias,"Portugal, Lisboa, Lisboa",Artigo 259.º do Código dos Contratos Públicos,,,,,,1771819,CP 2015/6 - Acordo quadro para o fornecimento de Medicamentos do Foro Oncológico,FALSE
Aquisição de Serviços de Desenvolvimento de Um Módulo E-learning para o Novo Registo Oncológico Nacional,Ajuste Direto Regime Geral,Aquisição de serviços,"72230000-6, Serviços de desenvolvimento de software à medida","Instituto Português de Oncologia de Lisboa Francisco Gentil, E. P. E. (506361616)","PRÓS - PROMOÇÕES E SERVIÇOS PUBLICITÁRIOS, LDA. (505248565)","37.800,00 €",11-01-2018,28-12-2017,30 dias,"Portugal, Lisboa, Lisboa","Artigo 20.º, n.º 1, alínea a) do Código dos Contratos Públicos",,,,,,Não aplicável.,Não aplicável.,FALSE
