Objeto do Contrato,Tipo de Procedimento,Tipo(s) de Contrato,CPVs,Entidade(s) Adjudicante(s),Entidade(s) Adjudicatária(s),Preço Contratual,Data de Publicação,Data de Celebração do Contrato,Prazo de Execução,Local de Execução,Fundamentação,Data de Fecho do Contrato,Preço Total Efetivo,Causas das Alterações ao Prazo,Causas das Alterações ao Preço,Estado,N.º registo do Acordo Quadro,Descrição do Acordo Quadro,Procedimento Centralizado
MATERIAL CONSUMO CLINICO,Ajuste Direto Regime Geral,Aquisição de bens móveis,"33140000-3, Material médico de consumo",Hospital Dr. Francisco Zagalo (501510150),NUTRICIA (507558286),"942,00 €",10-11-2015,30-05-2014,231 dias,"Portugal, Aveiro, Ovar","Artigo 20.º, n.º 1, alínea a) do Código dos Contratos Públicos",04-01-2015,"942,00 €",,,,Não aplicável.,Não aplicável.,FALSE
MATERIAL CONSUMO CLINICO,Ajuste Direto Regime Geral,Aquisição de bens móveis,"33140000-3, Material médico de consumo",Hospital Dr. Francisco Zagalo (501510150),IBERDATA (501904921),"129,00 €",10-11-2015,30-05-2014,231 dias,"Portugal, Aveiro, Ovar","Artigo 20.º, n.º 1, alínea a) do Código dos Contratos Públicos",31-12-2014,"129,00 €",,,,Não aplicável.,Não aplicável.,FALSE
MATERIAL CONSUMO CLINICO,Ajuste Direto Regime Geral,Aquisição de bens móveis,"33140000-3, Material médico de consumo",Hospital Dr. Francisco Zagalo (501510150),"B BRAUN, LDA. (501506543)","164,00 €",10-11-2015,30-05-2014,231 dias,"Portugal, Aveiro, Ovar","Artigo 20.º, n.º 1, alínea a) do Código dos Contratos Públicos",31-12-2014,"164,00 €",,,,Não aplicável.,Não aplicável.,FALSE
consumo clinico,Ajuste Direto Regime Geral,Aquisição de bens móveis,"33140000-3, Material médico de consumo",Hospital Dr. Francisco Zagalo (501510150),TELEFLEX MEDICAL (980249783),"80,00 €",10-11-2015,07-05-2014,30 dias,"Portugal, Aveiro, Ovar","Artigo 20.º, n.º 1, alínea a) do Código dos Contratos Públicos",31-05-2014,"80,00 €",,,,Não aplicável.,Não aplicável.,FALSE
consumo clinico,Ajuste Direto Regime Geral,Aquisição de bens móveis,"33140000-3, Material médico de consumo",Hospital Dr. Francisco Zagalo (501510150),"INTERSURGICAL PORTUGAL,LDA. (503480045)","90,00 €",10-11-2015,07-05-2014,30 dias,"Portugal, Aveiro, Ovar","Artigo 20.º, n.º 1, alínea a) do Código dos Contratos Públicos",31-05-2014,"90,00 €",,,,Não aplicável.,Não aplicável.,FALSE
MATERIAL CONSUMO CLINICO,Ajuste Direto Regime Geral,Aquisição de bens móveis,"33140000-3, Material médico de consumo",Hospital Dr. Francisco Zagalo (501510150),"C R BARD, LDA (502438274)","275,00 €",10-11-2015,30-05-2014,231 dias,"Portugal, Aveiro, Ovar","Artigo 20.º, n.º 1, alínea a) do Código dos Contratos Públicos",31-12-2014,"275,00 €",,,,Não aplicável.,Não aplicável.,FALSE
consumo clinico,Ajuste Direto Regime Geral,Aquisição de bens móveis,"33140000-3, Material médico de consumo",Hospital Dr. Francisco Zagalo (501510150),"B.BRAUN MEDICAL, LDA. (501506543)","549,00 €",10-11-2015,07-05-2014,30 dias,"Portugal, Aveiro, Ovar","Artigo 20.º, n.º 1, alínea a) do Código dos Contratos Públicos",31-05-2014,"549,00 €",,,,Não aplicável.,Não aplicável.,FALSE
AQUISIÇÃO MATERIAL CLINICO,Ajuste Direto Regime Geral,Aquisição de bens móveis,"33140000-3, Material médico de consumo",Hospital Dr. Francisco Zagalo (501510150),PMH LDA (502376899),"148,00 €",10-11-2015,30-05-2014,231 dias,"Portugal, Aveiro, Ovar","Artigo 20.º, n.º 1, alínea a) do Código dos Contratos Públicos",31-12-2014,"148,00 €",,,,Não aplicável.,Não aplicável.,FALSE
consumo clinico,Ajuste Direto Regime Geral,Aquisição de bens móveis,"33140000-3, Material médico de consumo",Hospital Dr. Francisco Zagalo (501510150),EZEQUIEL PANAO JORGE LDA. (501412727),"69,00 €",10-11-2015,07-05-2014,30 dias,"Portugal, Aveiro, Ovar","Artigo 20.º, n.º 1, alínea a) do Código dos Contratos Públicos",31-05-2014,"69,00 €",,,,Não aplicável.,Não aplicável.,FALSE
MATERIAL CONSUMO CLINICO,Ajuste Direto Regime Geral,Aquisição de bens móveis,"33140000-3, Material médico de consumo",Hospital Dr. Francisco Zagalo (501510150),MUNDINTER (500199906),"11,00 €",10-11-2015,30-05-2014,231 dias,"Portugal, Aveiro, Ovar","Artigo 20.º, n.º 1, alínea a) do Código dos Contratos Públicos",31-12-2014,"11,00 €",,,,Não aplicável.,Não aplicável.,FALSE
consumo clinico,Ajuste Direto Regime Geral,Aquisição de bens móveis,"33140000-3, Material médico de consumo",Hospital Dr. Francisco Zagalo (501510150),"COVIDIEN PORTUGAL-PROD.DE SAÚDE UNIP, LDA. (503413410)","750,00 €",10-11-2015,08-05-2014,30 dias,"Portugal, Aveiro, Ovar","Artigo 20.º, n.º 1, alínea a) do Código dos Contratos Públicos",31-05-2014,"750,00 €",,,,Não aplicável.,Não aplicável.,FALSE
consumo clinico,Ajuste Direto Regime Geral,Aquisição de bens móveis,"33140000-3, Material médico de consumo",Hospital Dr. Francisco Zagalo (501510150),"EUROCASMEDICA, SA (503322105)","160,00 €",10-11-2015,08-05-2014,30 dias,"Portugal, Aveiro, Ovar","Artigo 20.º, n.º 1, alínea a) do Código dos Contratos Públicos",31-05-2014,"160,00 €",,,,Não aplicável.,Não aplicável.,FALSE
consumo clinico,Ajuste Direto Regime Geral,Aquisição de bens móveis,"33140000-3, Material médico de consumo",Hospital Dr. Francisco Zagalo (501510150),"B.BRAUN MEDICAL, LDA. (501506543)","984,00 €",10-11-2015,08-05-2014,30 dias,"Portugal, Aveiro, Ovar","Artigo 20.º, n.º 1, alínea a) do Código dos Contratos Públicos",31-05-2014,"984,00 €",,,,Não aplicável.,Não aplicável.,FALSE
Material de consumo clínico,Ajuste Direto Regime Geral,Aquisição de bens móveis,"33140000-3, Material médico de consumo",Hospital Dr. Francisco Zagalo (501510150),TELEFLEX MEDICAL (980249783),"80,00 €",10-11-2015,06-06-2014,240 dias,"Portugal, Aveiro, Ovar","Artigo 20.º, n.º 1, alínea a) do Código dos Contratos Públicos",31-12-2014,"80,00 €",,,,Não aplicável.,Não aplicável.,FALSE
Aquisição de material de consumo clinico,Ajuste Direto Regime Geral,Aquisição de bens móveis,"33140000-3, Material médico de consumo",Hospital Dr. Francisco Zagalo (501510150),"EPJMEDICA,ART.MEDICOS HOSP,LDA (506820513)","57,60 €",10-11-2015,06-06-2014,240 dias,"Portugal, Aveiro, Ovar","Artigo 20.º, n.º 1, alínea a) do Código dos Contratos Públicos",31-12-2014,"57,60 €",,,,Não aplicável.,Não aplicável.,FALSE
Aquisição de material de consumo clinico,Ajuste Direto Regime Geral,Aquisição de bens móveis,"33140000-3, Material médico de consumo",Hospital Dr. Francisco Zagalo (501510150),"COLOPLAST PORTUGAL, SOC.UNIP.LDA (503989037)","63,60 €",10-11-2015,06-06-2014,240 dias,"Portugal, Aveiro, Ovar","Artigo 20.º, n.º 1, alínea a) do Código dos Contratos Públicos",06-06-2014,"63,60 €",,,,Não aplicável.,Não aplicável.,FALSE
Aquisição de material de consumo clinico,Ajuste Direto Regime Geral,Aquisição de bens móveis,"33140000-3, Material médico de consumo",Hospital Dr. Francisco Zagalo (501510150),"SMITH E NEPHEW, LDA. (503552461)","81,60 €",10-11-2015,06-06-2014,240 dias,"Portugal, Aveiro, Ovar","Artigo 20.º, n.º 1, alínea a) do Código dos Contratos Públicos",31-12-2014,"81,60 €",,,,Não aplicável.,Não aplicável.,FALSE
Aquisição de material de consumo clínico,Ajuste Direto Regime Geral,Aquisição de bens móveis,"33140000-3, Material médico de consumo",Hospital Dr. Francisco Zagalo (501510150),"EUROCASMEDICA, SA (503322105)","55,00 €",10-11-2015,06-06-2014,240 dias,"Portugal, Aveiro, Ovar","Artigo 20.º, n.º 1, alínea a) do Código dos Contratos Públicos",06-06-2014,"55,00 €",,,,Não aplicável.,Não aplicável.,FALSE
Aquisição de material de consumo clinico,Ajuste Direto Regime Geral,Aquisição de bens móveis,"33140000-3, Material médico de consumo",Hospital Dr. Francisco Zagalo (501510150),CLINIFAR (503281115),"172,00 €",10-11-2015,06-06-2014,240 dias,"Portugal, Aveiro, Ovar","Artigo 20.º, n.º 1, alínea a) do Código dos Contratos Públicos",06-06-2014,"172,00 €",,,,Não aplicável.,Não aplicável.,FALSE
Aquisição de material de consumo clinico,Ajuste Direto Regime Geral,Aquisição de bens móveis,"33140000-3, Material médico de consumo",Hospital Dr. Francisco Zagalo (501510150),B.BRAUN (501506543),"96,60 €",10-11-2015,06-06-2014,240 dias,"Portugal, Aveiro, Ovar","Artigo 20.º, n.º 1, alínea a) do Código dos Contratos Públicos",06-06-2014,"96,60 €",,,,Não aplicável.,Não aplicável.,FALSE
Aquisição de material de consumo clinico,Ajuste Direto Regime Geral,Aquisição de bens móveis,"33140000-3, Material médico de consumo",Hospital Dr. Francisco Zagalo (501510150),VYGON PORTUGAL LDA (503232785),"338,20 €",10-11-2015,06-06-2014,240 dias,"Portugal, Aveiro, Ovar","Artigo 20.º, n.º 1, alínea a) do Código dos Contratos Públicos",31-12-2014,"338,20 €",,,,Não aplicável.,Não aplicável.,FALSE
consumo clinico,Ajuste Direto Regime Geral,Aquisição de bens móveis,"33140000-3, Material médico de consumo",Hospital Dr. Francisco Zagalo (501510150),"ARTUR SALGADO, S.A. (503612600)","4.753,50 €",10-11-2015,20-05-2014,30 dias,"Portugal, Aveiro, Ovar","Artigo 20.º, n.º 1, alínea a) do Código dos Contratos Públicos",31-05-2014,"4.753,50 €",,,,Não aplicável.,Não aplicável.,FALSE
MATERIAL CONSUMO CLINICO,Ajuste Direto Regime Geral,Aquisição de bens móveis,"33140000-3, Material médico de consumo",Hospital Dr. Francisco Zagalo (501510150),COVIDIEN (503413410),"960,00 €",10-11-2015,07-05-2014,238 dias,"Portugal, Aveiro, Ovar","Artigo 20.º, n.º 1, alínea a) do Código dos Contratos Públicos",31-12-2014,"960,00 €",,,,Não aplicável.,Não aplicável.,FALSE
MATERIAL CONSUMO CLINICO,Ajuste Direto Regime Geral,Aquisição de bens móveis,"33140000-3, Material médico de consumo",Hospital Dr. Francisco Zagalo (501510150),B. BRAUN (501506543),"2.088,00 €",10-11-2015,07-05-2014,238 dias,"Portugal, Aveiro, Ovar","Artigo 20.º, n.º 1, alínea a) do Código dos Contratos Públicos",31-12-2014,"2.088,00 €",,,,Não aplicável.,Não aplicável.,FALSE
consumo clinico,Ajuste Direto Regime Geral,Aquisição de bens móveis,"33140000-3, Material médico de consumo",Hospital Dr. Francisco Zagalo (501510150),"BIOTRAUMA-INOV.E CRIATIVIDADE EM TRAUM., LDA (509486835)","321,27 €",10-11-2015,20-05-2014,30 dias,"Portugal, Aveiro, Ovar","Artigo 20.º, n.º 1, alínea a) do Código dos Contratos Públicos",31-05-2014,"321,27 €",,,,Não aplicável.,Não aplicável.,FALSE
consumo clinico,Ajuste Direto Regime Geral,Aquisição de bens móveis,"33140000-3, Material médico de consumo",Hospital Dr. Francisco Zagalo (501510150),"SMITH E NEPHEW, LDA. (503552461)","792,00 €",10-11-2015,20-05-2014,30 dias,"Portugal, Aveiro, Ovar","Artigo 20.º, n.º 1, alínea a) do Código dos Contratos Públicos",31-05-2014,"792,00 €",,,,Não aplicável.,Não aplicável.,FALSE
Aquisição de material de consumo clinico,Ajuste Direto Regime Geral,Aquisição de bens móveis,"33140000-3, Material médico de consumo",Hospital Dr. Francisco Zagalo (501510150),"CLININVEST-CLÍNICA MÉD. INV.NA SAÚDE,LDA (506337820)","150,00 €",10-11-2015,08-05-2014,237 dias,"Portugal, Aveiro, Ovar","Artigo 20.º, n.º 1, alínea a) do Código dos Contratos Públicos",31-12-2014,"150,00 €",,,,Não aplicável.,Não aplicável.,FALSE
Aquisição de material de consumo clínico,Ajuste Direto Regime Geral,Aquisição de bens móveis,"33140000-3, Material médico de consumo",Hospital Dr. Francisco Zagalo (501510150),"COVIDIEN PORTUGAL-PROD.DE SAÚDE UNIP, LDA. (503413410)","170,00 €",10-11-2015,08-05-2014,237 dias,"Portugal, Aveiro, Ovar","Artigo 20.º, n.º 1, alínea a) do Código dos Contratos Públicos",31-12-2014,"170,00 €",,,,Não aplicável.,Não aplicável.,FALSE
Aquisição de material de consumo clínico,Ajuste Direto Regime Geral,Aquisição de bens móveis,"33140000-3, Material médico de consumo",Hospital Dr. Francisco Zagalo (501510150),"SARSTEDT, LDA (503019461)","1.128,70 €",10-11-2015,08-05-2014,237 dias,"Portugal, Aveiro, Ovar","Artigo 20.º, n.º 1, alínea a) do Código dos Contratos Públicos",31-12-2014,"1.128,70 €",,,,Não aplicável.,Não aplicável.,FALSE
Aquisição de material de consumo clínico,Ajuste Direto Regime Geral,Aquisição de bens móveis,"33140000-3, Material médico de consumo",Hospital Dr. Francisco Zagalo (501510150),"C.R.BARD PORTUGAL, LDA. (502438274)","90,00 €",10-11-2015,08-05-2014,237 dias,"Portugal, Aveiro, Ovar","Artigo 20.º, n.º 1, alínea a) do Código dos Contratos Públicos",31-12-2014,"90,00 €",,,,Não aplicável.,Não aplicável.,FALSE
aAquisição de material de consumo clinico,Ajuste Direto Regime Geral,Aquisição de bens móveis,"33140000-3, Material médico de consumo",Hospital Dr. Francisco Zagalo (501510150),vygon portugal lda (503232785),"165,00 €",10-11-2015,08-05-2014,237 dias,"Portugal, Aveiro, Ovar","Artigo 20.º, n.º 1, alínea a) do Código dos Contratos Públicos",31-12-2014,"165,00 €",,,,Não aplicável.,Não aplicável.,FALSE
CONSUMO CLINICO,Ajuste Direto Regime Geral,Aquisição de bens móveis,"33140000-3, Material médico de consumo",Hospital Dr. Francisco Zagalo (501510150),BSN MEDICAL S.A. (505385058),"20,40 €",10-11-2015,07-05-2014,210 dias,"Portugal, Aveiro, Ovar","Artigo 20.º, n.º 1, alínea a) do Código dos Contratos Públicos",31-12-2014,"20,40 €",,,,Não aplicável.,Não aplicável.,FALSE
consumo clinico,Ajuste Direto Regime Geral,Aquisição de bens móveis,"33140000-3, Material médico de consumo",Hospital Dr. Francisco Zagalo (501510150),"SARSTEDT, LDA (503019461)","149,50 €",10-11-2015,07-05-2014,210 dias,"Portugal, Aveiro, Ovar","Artigo 20.º, n.º 1, alínea a) do Código dos Contratos Públicos",31-12-2014,"149,50 €",,,,Não aplicável.,Não aplicável.,FALSE
consumo clinico,Ajuste Direto Regime Geral,Aquisição de bens móveis,"33140000-3, Material médico de consumo",Hospital Dr. Francisco Zagalo (501510150),"INTERSURGICAL PORTUGAL,LDA. (503480045)","364,00 €",10-11-2015,07-05-2014,210 dias,"Portugal, Aveiro, Ovar","Artigo 20.º, n.º 1, alínea a) do Código dos Contratos Públicos",31-12-2014,"364,00 €",,,,Não aplicável.,Não aplicável.,FALSE
consumo clinico,Ajuste Direto Regime Geral,Aquisição de bens móveis,"33140000-3, Material médico de consumo",Hospital Dr. Francisco Zagalo (501510150),"SMITH E NEPHEW, LDA. (503552461)","102,00 €",10-11-2015,07-05-2014,210 dias,"Portugal, Aveiro, Ovar","Artigo 20.º, n.º 1, alínea a) do Código dos Contratos Públicos",31-12-2014,"102,00 €",,,,Não aplicável.,Não aplicável.,FALSE
consumo clinico,Ajuste Direto Regime Geral,Aquisição de bens móveis,"33140000-3, Material médico de consumo",Hospital Dr. Francisco Zagalo (501510150),VYGON (PORTUGAL) LDA. (503232785),"470,40 €",10-11-2015,07-05-2014,210 dias,"Portugal, Aveiro, Ovar","Artigo 20.º, n.º 1, alínea a) do Código dos Contratos Públicos",31-12-2014,"470,40 €",,,,Não aplicável.,Não aplicável.,FALSE
Proteses para ortopedia,Ajuste Direto Regime Geral,Aquisição de bens móveis,"33140000-3, Material médico de consumo",Hospital Dr. Francisco Zagalo (501510150),"ARTUR SALGADO, S.A. (503612600)","4.835,00 €",10-11-2015,04-06-2014,30 dias,"Portugal, Aveiro, Ovar","Artigo 20.º, n.º 1, alínea a) do Código dos Contratos Públicos",30-06-2014,"4.835,00 €",,,,Não aplicável.,Não aplicável.,FALSE
Aquisição de material de consumo clinico,Ajuste Direto Regime Geral,Aquisição de bens móveis,"33140000-3, Material médico de consumo",Hospital Dr. Francisco Zagalo (501510150),COVIDIEN PORTUGAL LDA (503413410),"240,00 €",10-11-2015,21-04-2014,315 dias,"Portugal, Aveiro, Ovar","Artigo 20.º, n.º 1, alínea a) do Código dos Contratos Públicos",31-12-2014,"240,00 €",,,,Não aplicável.,Não aplicável.,FALSE
Aquisição de material de consumo clinico,Ajuste Direto Regime Geral,Aquisição de bens móveis,"33140000-3, Material médico de consumo",Hospital Dr. Francisco Zagalo (501510150),B.BRAUN (501506543),"552,00 €",10-11-2015,21-04-2014,315 dias,"Portugal, Aveiro, Ovar","Artigo 20.º, n.º 1, alínea a) do Código dos Contratos Públicos",31-12-2014,"552,00 €",,,,Não aplicável.,Não aplicável.,FALSE
Consumo clinico,Ajuste Direto Regime Geral,Aquisição de bens móveis,"33140000-3, Material médico de consumo",Hospital Dr. Francisco Zagalo (501510150),Nutricia Advanced Nutrition Unipessoal Lda (507558286),"252,00 €",10-11-2015,14-04-2014,270 dias,"Portugal, Aveiro, Ovar","Artigo 20.º, n.º 1, alínea a) do Código dos Contratos Públicos",31-12-2014,"252,00 €",,,,Não aplicável.,Não aplicável.,FALSE
consumo clinico,Ajuste Direto Regime Geral,Aquisição de bens móveis,"33140000-3, Material médico de consumo",Hospital Dr. Francisco Zagalo (501510150),"COVIDIEN PORTUGAL-PROD.DE SAÚDE UNIP, LDA. (503413410)","170,00 €",09-11-2015,14-04-2014,270 dias,"Portugal, Aveiro, Ovar","Artigo 20.º, n.º 1, alínea a) do Código dos Contratos Públicos",31-12-2014,"170,00 €",,,,Não aplicável.,Não aplicável.,FALSE
consumo clinico,Ajuste Direto Regime Geral,Aquisição de bens móveis,"33140000-3, Material médico de consumo",Hospital Dr. Francisco Zagalo (501510150),TEPREL-EQUIPAMENTOS TÉCNICOS S.A. (502262184),"532,80 €",09-11-2015,14-04-2014,270 dias,"Portugal, Aveiro, Ovar","Artigo 20.º, n.º 1, alínea a) do Código dos Contratos Públicos",31-12-2014,"532,80 €",,,,Não aplicável.,Não aplicável.,FALSE
consumo clinico,Ajuste Direto Regime Geral,Aquisição de bens móveis,"33140000-3, Material médico de consumo",Hospital Dr. Francisco Zagalo (501510150),"FRESENIUS KABI PHARMA PORTUGAL, LDA (504293753)","92,91 €",09-11-2015,14-04-2014,270 dias,"Portugal, Aveiro, Ovar","Artigo 20.º, n.º 1, alínea a) do Código dos Contratos Públicos",31-12-2014,"92,91 €",,,,Não aplicável.,Não aplicável.,FALSE
consumo clinico,Ajuste Direto Regime Geral,Aquisição de bens móveis,"33140000-3, Material médico de consumo",Hospital Dr. Francisco Zagalo (501510150),"COLOPLAST PORTUGAL, SOC.UNIP.LDA (503989037)","63,60 €",09-11-2015,14-04-2014,270 dias,"Portugal, Aveiro, Ovar","Artigo 20.º, n.º 1, alínea a) do Código dos Contratos Públicos",31-12-2014,"63,60 €",,,,Não aplicável.,Não aplicável.,FALSE
Aquisição de material de consumo clinico,Ajuste Direto Regime Geral,Aquisição de bens móveis,"33140000-3, Material médico de consumo",Hospital Dr. Francisco Zagalo (501510150),INSTRUMEDICIR - EQUIP.MEDICO-CIRURG. LDA (507754468),"9,00 €",09-11-2015,18-04-2014,260 dias,"Portugal, Aveiro, Ovar","Artigo 20.º, n.º 1, alínea a) do Código dos Contratos Públicos",31-12-2014,"9,00 €",,,,Não aplicável.,Não aplicável.,FALSE
Aquisição de material de consumo clínico,Ajuste Direto Regime Geral,Aquisição de bens móveis,"33140000-3, Material médico de consumo",Hospital Dr. Francisco Zagalo (501510150),"VISIONAL UNIPESSOAL,LDA (508798280)","380,00 €",09-11-2015,18-04-2014,260 dias,"Portugal, Aveiro, Ovar","Artigo 20.º, n.º 1, alínea a) do Código dos Contratos Públicos",31-12-2014,"380,00 €",,,,Não aplicável.,Não aplicável.,FALSE
consumo clinico,Ajuste Direto Regime Geral,Aquisição de bens móveis,"33140000-3, Material médico de consumo",Hospital Dr. Francisco Zagalo (501510150),"SARSTEDT, LDA (503019461)","71,40 €",09-11-2015,14-04-2014,270 dias,"Portugal, Aveiro, Ovar","Artigo 20.º, n.º 1, alínea a) do Código dos Contratos Públicos",31-12-2014,"71,40 €",,,,Não aplicável.,Não aplicável.,FALSE
Aquisição de material de consumo clínico,Ajuste Direto Regime Geral,Aquisição de bens móveis,"33140000-3, Material médico de consumo",Hospital Dr. Francisco Zagalo (501510150),HELDER GONÇALVES-ASSIST.TECN.EQUIP.LDA (503855421),"80,60 €",09-11-2015,18-04-2014,260 dias,"Portugal, Aveiro, Ovar","Artigo 20.º, n.º 1, alínea a) do Código dos Contratos Públicos",31-12-2014,"80,60 €",,,,Não aplicável.,Não aplicável.,FALSE
Aquisição de material de consumo clínico,Ajuste Direto Regime Geral,Aquisição de bens móveis,"33140000-3, Material médico de consumo",Hospital Dr. Francisco Zagalo (501510150),LINEAMÉDICA-DISP.MEDICO-CIRURG. S.A. (505148676),"68,00 €",09-11-2015,18-04-2014,260 dias,"Portugal, Aveiro, Ovar","Artigo 20.º, n.º 1, alínea a) do Código dos Contratos Públicos",31-12-2014,"68,00 €",,,,Não aplicável.,Não aplicável.,FALSE
Aquisição de material de consumo clínico,Ajuste Direto Regime Geral,Aquisição de bens móveis,"33140000-3, Material médico de consumo",Hospital Dr. Francisco Zagalo (501510150),"NORDIPAK, LDA (507157974)","102,50 €",09-11-2015,18-04-2014,260 dias,"Portugal, Aveiro, Ovar","Artigo 20.º, n.º 1, alínea a) do Código dos Contratos Públicos",31-12-2014,"102,50 €",,,,Não aplicável.,Não aplicável.,FALSE
consumo clinico,Ajuste Direto Regime Geral,Aquisição de bens móveis,"33140000-3, Material médico de consumo",Hospital Dr. Francisco Zagalo (501510150),"INTERSURGICAL PORTUGAL,LDA. (503480045)","30,00 €",09-11-2015,14-04-2014,270 dias,"Portugal, Aveiro, Ovar","Artigo 20.º, n.º 1, alínea a) do Código dos Contratos Públicos",31-12-2014,"30,00 €",,,,Não aplicável.,Não aplicável.,FALSE
Aquisição de material de consumo clínico,Ajuste Direto Regime Geral,Aquisição de bens móveis,"33140000-3, Material médico de consumo",Hospital Dr. Francisco Zagalo (501510150),MEILEX LDA (501759441),"160,00 €",09-11-2015,18-04-2014,260 dias,"Portugal, Aveiro, Ovar","Artigo 20.º, n.º 1, alínea a) do Código dos Contratos Públicos",31-12-2014,"160,00 €",,,,Não aplicável.,Não aplicável.,FALSE
Aquisição de material de consumo clínico,Ajuste Direto Regime Geral,Aquisição de bens móveis,"33140000-3, Material médico de consumo",Hospital Dr. Francisco Zagalo (501510150),"FILSAT, EQUIP.MEDICO CIRURG.LDA (506708616)","270,00 €",09-11-2015,18-04-2014,260 dias,"Portugal, Aveiro, Ovar","Artigo 20.º, n.º 1, alínea a) do Código dos Contratos Públicos",31-12-2014,"270,00 €",,,,Não aplicável.,Não aplicável.,FALSE
consumo clinico,Ajuste Direto Regime Geral,Aquisição de bens móveis,"33140000-3, Material médico de consumo",Hospital Dr. Francisco Zagalo (501510150),"EUROCASMEDICA, SA (503322105)","71,10 €",09-11-2015,14-04-2014,270 dias,"Portugal, Aveiro, Ovar","Artigo 20.º, n.º 1, alínea a) do Código dos Contratos Públicos",31-12-2014,"71,10 €",,,,Não aplicável.,Não aplicável.,FALSE
Aquisição de material de consumo clínico,Ajuste Direto Regime Geral,Aquisição de bens móveis,"33140000-3, Material médico de consumo",Hospital Dr. Francisco Zagalo (501510150),"COVIDIEN PORTUGAL-PROD.DE SAÚDE UNIP, LDA. (503413410)","720,00 €",09-11-2015,18-04-2014,260 dias,"Portugal, Aveiro, Ovar","Artigo 20.º, n.º 1, alínea a) do Código dos Contratos Públicos",31-12-2014,"720,00 €",,,,Não aplicável.,Não aplicável.,FALSE
Aquisição de material de consumo clínico,Ajuste Direto Regime Geral,Aquisição de bens móveis,"33140000-3, Material médico de consumo",Hospital Dr. Francisco Zagalo (501510150),"LABLAD-TITO & FIDALGOS,LDA (502629703)","12,41 €",09-11-2015,18-04-2014,260 dias,"Portugal, Aveiro, Ovar","Artigo 20.º, n.º 1, alínea a) do Código dos Contratos Públicos",31-12-2014,"12,41 €",,,,Não aplicável.,Não aplicável.,FALSE
consumo clinico,Ajuste Direto Regime Geral,Aquisição de bens móveis,"33140000-3, Material médico de consumo",Hospital Dr. Francisco Zagalo (501510150),"B.BRAUN MEDICAL, LDA. (501506543)","152,20 €",09-11-2015,14-04-2014,270 dias,"Portugal, Aveiro, Ovar","Artigo 20.º, n.º 1, alínea a) do Código dos Contratos Públicos",31-12-2014,"152,20 €",,,,Não aplicável.,Não aplicável.,FALSE
Aquisição de material de consumo clínico,Ajuste Direto Regime Geral,Aquisição de bens móveis,"33140000-3, Material médico de consumo",Hospital Dr. Francisco Zagalo (501510150),"LINDE SAUDE, SOCIEDADE UNIPESSOAL,LDA (500125546)","270,00 €",09-11-2015,18-04-2014,260 dias,"Portugal, Aveiro, Ovar","Artigo 20.º, n.º 1, alínea a) do Código dos Contratos Públicos",31-12-2014,"270,00 €",,,,Não aplicável.,Não aplicável.,FALSE
Aquisição de material de consumo clínico,Ajuste Direto Regime Geral,Aquisição de bens móveis,"33140000-3, Material médico de consumo",Hospital Dr. Francisco Zagalo (501510150),"SARSTEDT, LDA (503019461)","191,80 €",09-11-2015,18-04-2014,260 dias,"Portugal, Aveiro, Ovar","Artigo 20.º, n.º 1, alínea a) do Código dos Contratos Públicos",31-12-2014,"191,80 €",,,,Não aplicável.,Não aplicável.,FALSE
consumo clinico,Ajuste Direto Regime Geral,Aquisição de bens móveis,"33140000-3, Material médico de consumo",Hospital Dr. Francisco Zagalo (501510150),P.M.H.-PRODUTOS MED.HOSPIT.LDA (502376899),"148,00 €",09-11-2015,14-04-2014,270 dias,"Portugal, Aveiro, Ovar","Artigo 20.º, n.º 1, alínea a) do Código dos Contratos Públicos",31-12-2014,"148,00 €",,,,Não aplicável.,Não aplicável.,FALSE
Aquisição de material de consumo clínico,Ajuste Direto Regime Geral,Aquisição de bens móveis,"33140000-3, Material médico de consumo",Hospital Dr. Francisco Zagalo (501510150),"INTERSURGICAL PORTUGAL,LDA (503480045)","160,60 €",09-11-2015,18-04-2014,260 dias,"Portugal, Aveiro, Ovar","Artigo 20.º, n.º 1, alínea a) do Código dos Contratos Públicos",31-12-2014,"160,60 €",,,,Não aplicável.,Não aplicável.,FALSE
consumo clinico,Ajuste Direto Regime Geral,Aquisição de bens móveis,"33140000-3, Material médico de consumo",Hospital Dr. Francisco Zagalo (501510150),"BASTOS E VIEGAS, S.A. (500042772)","252,00 €",09-11-2015,14-04-2014,270 dias,"Portugal, Aveiro, Ovar","Artigo 20.º, n.º 1, alínea a) do Código dos Contratos Públicos",31-12-2014,"252,00 €",,,,Não aplicável.,Não aplicável.,FALSE
Aquisição de material de consumo clínico,Ajuste Direto Regime Geral,Aquisição de bens móveis,"33140000-3, Material médico de consumo",Hospital Dr. Francisco Zagalo (501510150),EUROCASMÉDICA SA (503322105),"270,00 €",09-11-2015,18-04-2014,260 dias,"Portugal, Aveiro, Ovar","Artigo 20.º, n.º 1, alínea a) do Código dos Contratos Públicos",31-12-2014,"270,00 €",,,,Não aplicável.,Não aplicável.,FALSE
Aquisição de material de consumo clínico,Ajuste Direto Regime Geral,Aquisição de bens móveis,"33140000-3, Material médico de consumo",Hospital Dr. Francisco Zagalo (501510150),B.BRAUN MEDICAL LDA (500042772),"216,00 €",09-11-2015,18-04-2014,260 dias,"Portugal, Aveiro, Ovar","Artigo 20.º, n.º 1, alínea a) do Código dos Contratos Públicos",31-12-2014,"216,00 €",,,,Não aplicável.,Não aplicável.,FALSE
consumo clinico,Ajuste Direto Regime Geral,Aquisição de bens móveis,"33140000-3, Material médico de consumo",Hospital Dr. Francisco Zagalo (501510150),MUNDINTER - INTERCAMBIO MUNDIAL DE COMERCIO S.A. (500199906),"33,00 €",09-11-2015,14-04-2014,270 dias,"Portugal, Aveiro, Ovar","Artigo 20.º, n.º 1, alínea a) do Código dos Contratos Públicos",31-12-2014,"33,00 €",,,,Não aplicável.,Não aplicável.,FALSE
consumo clinico,Ajuste Direto Regime Geral,Aquisição de bens móveis,"33140000-3, Material médico de consumo",Hospital Dr. Francisco Zagalo (501510150),VYGON (PORTUGAL) LDA. (503232785),"377,10 €",09-11-2015,14-04-2014,270 dias,"Portugal, Aveiro, Ovar","Artigo 20.º, n.º 1, alínea a) do Código dos Contratos Públicos",31-12-2014,"377,10 €",,,,Não aplicável.,Não aplicável.,FALSE
Aquisição material de consumo clínico,Ajuste Direto Regime Geral,Aquisição de bens móveis,"33140000-3, Material médico de consumo",Hospital Dr. Francisco Zagalo (501510150),BASTOS E VIEGAS SA (500042772),"330,90 €",09-11-2015,18-04-2014,260 dias,"Portugal, Aveiro, Ovar","Artigo 20.º, n.º 1, alínea a) do Código dos Contratos Públicos",31-12-2014,"330,90 €",,,,Não aplicável.,Não aplicável.,FALSE
Hardware,Ajuste Direto Regime Geral,Aquisição de bens móveis,"30200000-1, Equipamento e material informático",Hospital Dr. Francisco Zagalo (501510150),"Maincapital-Infrastructures & Managed Services,S.A (510093833)","9.900,00 €",09-11-2015,17-12-2014,30 dias,"Portugal, Aveiro, Ovar","Artigo 20.º, n.º 1, alínea a) do Código dos Contratos Públicos",31-12-2014,"9.900,00 €",,,,Não aplicável.,Não aplicável.,FALSE
Aquisição de medicamentos c/CHNM,Ajuste Direto Regime Geral,Aquisição de bens móveis,"33600000-6, Produtos farmacêuticos",Hospital Dr. Francisco Zagalo (501510150),"Servier Portugal, Lda (502177420)","26,10 €",09-11-2015,28-01-2015,2 dias,"Portugal, Aveiro, Ovar","Artigo 20.º, n.º 1, alínea a) do Código dos Contratos Públicos",30-01-2015,"26,10 €",,,,Não aplicável.,Não aplicável.,FALSE
Aquisição de medicamentos c/CHNM,Ajuste Direto Regime Geral,Aquisição de bens móveis,"33600000-6, Produtos farmacêuticos",Hospital Dr. Francisco Zagalo (501510150),"Angelini Farmacêutica, Lda (500583650)","67,50 €",09-11-2015,28-01-2015,2 dias,"Portugal, Aveiro, Ovar","Artigo 20.º, n.º 1, alínea a) do Código dos Contratos Públicos",30-01-2015,"67,50 €",,,,Não aplicável.,Não aplicável.,FALSE
Aquisição de medicamentos c/CHNM,Ajuste Direto Regime Geral,Aquisição de bens móveis,"33600000-6, Produtos farmacêuticos",Hospital Dr. Francisco Zagalo (501510150),"Merck Sharp & Dohme, Lda (500191360)","85,40 €",09-11-2015,28-01-2015,2 dias,"Portugal, Aveiro, Ovar","Artigo 20.º, n.º 1, alínea a) do Código dos Contratos Públicos",30-01-2015,"85,40 €",,,,Não aplicável.,Não aplicável.,FALSE
Aquisição de medicamentos c/CHNM,Ajuste Direto Regime Geral,Aquisição de bens móveis,"33600000-6, Produtos farmacêuticos",Hospital Dr. Francisco Zagalo (501510150),"Labesfal, Laboratório Almiro. S.A. (501169580)","26,60 €",09-11-2015,28-01-2015,2 dias,"Portugal, Aveiro, Ovar","Artigo 20.º, n.º 1, alínea a) do Código dos Contratos Públicos",30-01-2015,"26,60 €",,,,Não aplicável.,Não aplicável.,FALSE
Aquisição de Reagentes,Ajuste Direto Regime Geral,Aquisição de bens móveis,"33600000-6, Produtos farmacêuticos",Hospital Dr. Francisco Zagalo (501510150),"WERFEN  PORTUGAL UNIPESSOAL, LDA (501086110)","269,00 €",06-11-2015,24-09-2015,4 dias,"Portugal, Aveiro, Ovar","Artigo 20.º, n.º 1, alínea a) do Código dos Contratos Públicos",28-09-2015,"269,00 €",,,,Não aplicável.,Não aplicável.,FALSE
Aquisição de Reagentes,Ajuste Direto Regime Geral,Aquisição de bens móveis,"33600000-6, Produtos farmacêuticos",Hospital Dr. Francisco Zagalo (501510150),BIOMERIEUX PORTUGAL (501524177),"35,00 €",06-11-2015,24-09-2015,4 dias,"Portugal, Aveiro, Ovar","Artigo 20.º, n.º 1, alínea a) do Código dos Contratos Públicos",28-09-2015,"35,00 €",,,,Não aplicável.,Não aplicável.,FALSE
consumo clinico,Ajuste Direto Regime Geral,Aquisição de bens móveis,"33140000-3, Material médico de consumo",Hospital Dr. Francisco Zagalo (501510150),BSN MEDICAL S.A. (505385058),"30,24 €",06-11-2015,02-03-2014,30 dias,"Portugal, Aveiro, Ovar","Artigo 20.º, n.º 1, alínea a) do Código dos Contratos Públicos",30-04-2014,"30,24 €",,,,Não aplicável.,Não aplicável.,FALSE
consumo clinico,Ajuste Direto Regime Geral,Aquisição de bens móveis,"33140000-3, Material médico de consumo",Hospital Dr. Francisco Zagalo (501510150),"MICROMÉDICA-EQUIP. MÉDICO HOSPIT.,LDA (501904956)","800,00 €",06-11-2015,02-03-2014,30 dias,"Portugal, Aveiro, Ovar","Artigo 20.º, n.º 1, alínea a) do Código dos Contratos Públicos",30-04-2014,"800,00 €",,,,Não aplicável.,Não aplicável.,FALSE
consumo clinico,Ajuste Direto Regime Geral,Aquisição de bens móveis,"33140000-3, Material médico de consumo",Hospital Dr. Francisco Zagalo (501510150),TEPREL-EQUIPAMENTOS TÉCNICOS S.A. (502262184),"266,40 €",06-11-2015,13-03-2014,30 dias,"Portugal, Aveiro, Ovar","Artigo 20.º, n.º 1, alínea a) do Código dos Contratos Públicos",30-04-2014,"266,40 €",,,,Não aplicável.,Não aplicável.,FALSE
consumo clinico,Ajuste Direto Regime Geral,Aquisição de bens móveis,"33140000-3, Material médico de consumo",Hospital Dr. Francisco Zagalo (501510150),"COLOPLAST PORTUGAL, SOC.UNIP.LDA (503989037)","74,80 €",06-11-2015,13-03-2014,30 dias,"Portugal, Aveiro, Ovar","Artigo 20.º, n.º 1, alínea a) do Código dos Contratos Públicos",30-04-2014,"74,80 €",,,,Não aplicável.,Não aplicável.,FALSE
consumo clinico,Ajuste Direto Regime Geral,Aquisição de bens móveis,"33140000-3, Material médico de consumo",Hospital Dr. Francisco Zagalo (501510150),"SARSTEDT, LDA (503019461)","85,00 €",06-11-2015,13-03-2014,30 dias,"Portugal, Aveiro, Ovar","Artigo 20.º, n.º 1, alínea a) do Código dos Contratos Públicos",30-04-2014,"85,00 €",,,,Não aplicável.,Não aplicável.,FALSE
consumo clinico,Ajuste Direto Regime Geral,Aquisição de bens móveis,"33140000-3, Material médico de consumo",Hospital Dr. Francisco Zagalo (501510150),"EUROCASMEDICA, SA (503322105)","100,80 €",06-11-2015,13-03-2014,30 dias,"Portugal, Aveiro, Ovar","Artigo 20.º, n.º 1, alínea a) do Código dos Contratos Públicos",30-04-2014,"100,80 €",,,,Não aplicável.,Não aplicável.,FALSE
consumo clinico,Ajuste Direto Regime Geral,Aquisição de bens móveis,"33140000-3, Material médico de consumo",Hospital Dr. Francisco Zagalo (501510150),VYGON (PORTUGAL) LDA. (503232785),"529,30 €",06-11-2015,13-03-2014,30 dias,"Portugal, Aveiro, Ovar","Artigo 20.º, n.º 1, alínea a) do Código dos Contratos Públicos",30-04-2014,"529,30 €",,,,Não aplicável.,Não aplicável.,FALSE
consumo clinico,Ajuste Direto Regime Geral,Aquisição de bens móveis,"33140000-3, Material médico de consumo",Hospital Dr. Francisco Zagalo (501510150),"INTERSURGICAL PORTUGAL,LDA. (503480045)","160,60 €",06-11-2015,13-03-2014,30 dias,"Portugal, Aveiro, Ovar","Artigo 20.º, n.º 1, alínea a) do Código dos Contratos Públicos",30-04-2014,"160,60 €",,,,Não aplicável.,Não aplicável.,FALSE
consumo clinico,Ajuste Direto Regime Geral,Aquisição de bens móveis,"33140000-3, Material médico de consumo",Hospital Dr. Francisco Zagalo (501510150),"IBERDATA EQUIPAMENTOS,SA (501904921)","120,00 €",06-11-2015,13-03-2014,30 dias,"Portugal, Aveiro, Ovar","Artigo 20.º, n.º 1, alínea a) do Código dos Contratos Públicos",30-04-2014,"120,00 €",,,,Não aplicável.,Não aplicável.,FALSE
consumo clinico,Ajuste Direto Regime Geral,Aquisição de bens móveis,"33140000-3, Material médico de consumo",Hospital Dr. Francisco Zagalo (501510150),"BASTOS E VIEGAS, S.A. (500042772)","36,60 €",05-11-2015,13-03-2014,30 dias,"Portugal, Aveiro, Ovar","Artigo 20.º, n.º 1, alínea a) do Código dos Contratos Públicos",30-04-2014,"36,60 €",,,,Não aplicável.,Não aplicável.,FALSE
consumo clinico,Ajuste Direto Regime Geral,Aquisição de bens móveis,"33140000-3, Material médico de consumo",Hospital Dr. Francisco Zagalo (501510150),GRUPO VITALINO (513083162),"8,82 €",05-11-2015,13-03-2014,270 dias,"Portugal, Aveiro, Ovar","Artigo 20.º, n.º 1, alínea a) do Código dos Contratos Públicos",31-12-2014,"8,82 €",,,,Não aplicável.,Não aplicável.,FALSE
Consumo clinico,Ajuste Direto Regime Geral,Aquisição de bens móveis,"33140000-3, Material médico de consumo",Hospital Dr. Francisco Zagalo (501510150),"SIGMA CARE, LDA. (508890284)","30,50 €",05-11-2015,13-03-2014,270 dias,"Portugal, Aveiro, Ovar","Artigo 20.º, n.º 1, alínea a) do Código dos Contratos Públicos",31-12-2014,"30,50 €",,,,Não aplicável.,Não aplicável.,FALSE
Consumo clinico,Ajuste Direto Regime Geral,Aquisição de bens móveis,"33140000-3, Material médico de consumo",Hospital Dr. Francisco Zagalo (501510150),"EUROCASMEDICA, SA (503322105)","200,00 €",05-11-2015,13-03-2014,270 dias,"Portugal, Aveiro, Ovar","Artigo 20.º, n.º 1, alínea a) do Código dos Contratos Públicos",31-12-2014,"200,00 €",,,,Não aplicável.,Não aplicável.,FALSE
Aquisição de Reagentes,Ajuste Direto Regime Geral,Aquisição de bens móveis,"33600000-6, Produtos farmacêuticos",Hospital Dr. Francisco Zagalo (501510150),"WERFEN  PORTUGAL UNIPESSOAL, LDA (501086110)","248,92 €",03-11-2015,09-09-2015,2 dias,"Portugal, Aveiro, Ovar","Artigo 20.º, n.º 1, alínea a) do Código dos Contratos Públicos",11-09-2015,"248,92 €",,,,Não aplicável.,Não aplicável.,FALSE
Aquisição de Reagentes,Ajuste Direto Regime Geral,Aquisição de bens móveis,"33600000-6, Produtos farmacêuticos",Hospital Dr. Francisco Zagalo (501510150),BIOMERIEUX PORTUGAL (501524177),"126,60 €",03-11-2015,09-09-2015,2 dias,"Portugal, Aveiro, Ovar","Artigo 20.º, n.º 1, alínea a) do Código dos Contratos Públicos",11-09-2015,"126,60 €",,,,Não aplicável.,Não aplicável.,FALSE
Aquisição de Reagentes,Ajuste Direto Regime Geral,Aquisição de bens móveis,"33600000-6, Produtos farmacêuticos",Hospital Dr. Francisco Zagalo (501510150),"WERFEN  PORTUGAL UNIPESSOAL, LDA (501086110)","300,00 €",02-11-2015,24-04-2015,4 dias,"Portugal, Aveiro, Ovar","Artigo 20.º, n.º 1, alínea a) do Código dos Contratos Públicos",28-04-2015,"300,00 €",,,,Não aplicável.,Não aplicável.,FALSE
Aquisição de Reagentes,Ajuste Direto Regime Geral,Aquisição de bens móveis,"33600000-6, Produtos farmacêuticos",Hospital Dr. Francisco Zagalo (501510150),BIOMERIEUX PORTUGAL (501524177),"100,60 €",02-11-2015,24-04-2015,4 dias,"Portugal, Aveiro, Ovar","Artigo 20.º, n.º 1, alínea a) do Código dos Contratos Públicos",28-04-2015,"100,60 €",,,,Não aplicável.,Não aplicável.,FALSE
Aquisição de Reagentes,Ajuste Direto Regime Geral,Aquisição de bens móveis,"33600000-6, Produtos farmacêuticos",Hospital Dr. Francisco Zagalo (501510150),"A.MENARINI DIAGNOSTICOS, LDA (502610069)","66,00 €",02-11-2015,04-02-2015,2 dias,"Portugal, Aveiro, Ovar","Artigo 20.º, n.º 1, alínea a) do Código dos Contratos Públicos",06-02-2015,"66,00 €",,,,Não aplicável.,Não aplicável.,FALSE
Aquisição de Reagentes,Ajuste Direto Regime Geral,Aquisição de bens móveis,"33600000-6, Produtos farmacêuticos",Hospital Dr. Francisco Zagalo (501510150),BIOMERIEUX PORTUGAL (501524177),"75,30 €",02-11-2015,04-02-2015,2 dias,"Portugal, Aveiro, Ovar","Artigo 20.º, n.º 1, alínea a) do Código dos Contratos Públicos",06-02-2015,"75,30 €",,,,Não aplicável.,Não aplicável.,FALSE
