freguesia,acronym,validVotesPercentage,votes,dicofre
Cardosas,PS,36.72,94,110203
Cardosas,PPD/PSD,19.53,50,110203
Cardosas,PCP-PEV,11.72,30,110203
Cardosas,PAN,8.98,23,110203
Cardosas,B.E.,8.2,21,110203
Cardosas,CDS-PP,5.08,13,110203
Cardosas,PPM.PPV/CDC,2.34,6,110203
Cardosas,PCTP/MRPP,1.56,4,110203
Cardosas,PNR,1.17,3,110203
Cardosas,PURP,1.17,3,110203
Cardosas,A,0.78,2,110203
Cardosas,NC,0.78,2,110203
Cardosas,PDR,0.78,2,110203
Cardosas,IL,0.39,1,110203
Cardosas,L,0.39,1,110203
Cardosas,PTP,0.39,1,110203
Cardosas,MAS,0,0,110203
