freguesia,acronym,validVotesPercentage,votes,dicofre
Prova e Casteição,PS,42.98,52,090918
Prova e Casteição,PPD/PSD,30.58,37,090918
Prova e Casteição,CDS-PP,10.74,13,090918
Prova e Casteição,B.E.,7.44,9,090918
Prova e Casteição,PDR,3.31,4,090918
Prova e Casteição,PAN,2.48,3,090918
Prova e Casteição,PPM.PPV/CDC,1.65,2,090918
Prova e Casteição,NC,0.83,1,090918
Prova e Casteição,A,0,0,090918
Prova e Casteição,IL,0,0,090918
Prova e Casteição,L,0,0,090918
Prova e Casteição,MAS,0,0,090918
Prova e Casteição,PCP-PEV,0,0,090918
Prova e Casteição,PCTP/MRPP,0,0,090918
Prova e Casteição,PNR,0,0,090918
Prova e Casteição,PTP,0,0,090918
Prova e Casteição,PURP,0,0,090918
