Objeto do Contrato,Tipo de Procedimento,Tipo(s) de Contrato,CPVs,Entidade(s) Adjudicante(s),Entidade(s) Adjudicatária(s),Preço Contratual,Data de Publicação,Data de Celebração do Contrato,Prazo de Execução,Local de Execução,Fundamentação,Data de Fecho do Contrato,Preço Total Efetivo,Causas das Alterações ao Prazo,Causas das Alterações ao Preço,Estado,N.º registo do Acordo Quadro,Descrição do Acordo Quadro,Procedimento Centralizado
Aquisição de Dietas e Suplementos,Ajuste Direto Regime Geral,Aquisição de bens móveis,"33692300-0, Alimentos enterais",Hospital Dr. Francisco Zagalo (501510150),"Palmeiro Foods, SA (506951049)","40,88 €",10-10-2014,19-09-2014,104 dias,"Portugal, Aveiro, Ovar","Artigo 20.º, n.º 1, alínea a) do Código dos Contratos Públicos",31-12-2014,"",,Valor não utilizado,,Não aplicável.,Não aplicável.,FALSE
Aquisição de Dietas e Suplementos,Ajuste Direto Regime Geral,Aquisição de bens móveis,"33692300-0, Alimentos enterais",Hospital Dr. Francisco Zagalo (501510150),"FRESENIUS KABI PHARMA ,LDA (504293753)","416,85 €",10-10-2014,19-09-2014,104 dias,"Portugal, Aveiro, Ovar","Artigo 20.º, n.º 1, alínea a) do Código dos Contratos Públicos",31-12-2014,"175,20 €",,Valor a baixo previsto,,Não aplicável.,Não aplicável.,FALSE
Aquisição de Dietas e Suplementos Dietéticos,Ajuste Direto Regime Geral,Aquisição de bens móveis,"33692300-0, Alimentos enterais",Hospital Dr. Francisco Zagalo (501510150),Nutricia Advanced Nutrition Unipessoal Lda (507558286),"1.557,60 €",10-10-2014,19-09-2014,104 dias,"Portugal, Aveiro, Ovar","Artigo 20.º, n.º 1, alínea a) do Código dos Contratos Públicos",31-12-2014,"1.060,80 €",,Valor a baixo do previsto,,Não aplicável.,Não aplicável.,FALSE
Serviços medicos de Imagiologia,Ajuste Direto Regime Geral,Aquisição de serviços,"85150000-5, Serviços de imagiologia médica",Hospital Dr. Francisco Zagalo (501510150),"Amadeu Campos Costa-Soc. Unipessoal, Lda. (506794547)","9.790,50 €",09-10-2014,09-10-2014,120 dias,"Portugal, Aveiro, Ovar","Artigo 20.º, n.º 1, alínea a) do Código dos Contratos Públicos",31-12-2014,"12.201,64 €",,serviços efectuados acima do previsto,,Não aplicável.,Não aplicável.,FALSE
Serviços medicos de Urologia,Ajuste Direto Regime Geral,Aquisição de serviços,"79620000-6, Serviços de fornecimento de pessoal, inclusive temporário",Hospital Dr. Francisco Zagalo (501510150),"Dr.Teresa Bragança & Dr. Ulisses Ribau, Med.Esp.  (508476143)","8.150,00 €",06-10-2014,06-10-2014,30 dias,"Portugal, Aveiro, Ovar","Artigo 20.º, n.º 1, alínea a) do Código dos Contratos Públicos",31-10-2014,"5.860,80 €",,Serviços medicos efectuados abaixo do previsto,,Não aplicável.,Não aplicável.,FALSE
Serviços medicos na area de Otorrinolaringologia,Ajuste Direto Regime Geral,Aquisição de serviços,"79620000-6, Serviços de fornecimento de pessoal, inclusive temporário",Hospital Dr. Francisco Zagalo (501510150),"Clinica Medica - Cirurgia Dr. Rui Pratas, Lda. (505914832)","9.905,00 €",06-10-2014,06-10-2014,30 dias,"Portugal, Aveiro, Ovar","Artigo 20.º, n.º 1, alínea a) do Código dos Contratos Públicos",31-10-2014,"11.834,24 €",,Serviços medicos de Otorrinolaringologia efectuados acima do previsto,,Não aplicável.,Não aplicável.,FALSE
Serviços de Tec. Diag. e Terapeutico,Ajuste Direto Regime Geral,Aquisição de serviços,"79620000-6, Serviços de fornecimento de pessoal, inclusive temporário",Hospital Dr. Francisco Zagalo (501510150),Tonus Global Unipessoal Lda. (509622976),"6.960,00 €",06-10-2014,06-10-2014,30 dias,"Portugal, Aveiro, Ovar","Artigo 20.º, n.º 1, alínea a) do Código dos Contratos Públicos",31-10-2014,"6.611,03 €",,serviços efectuados abaixo do previsto,,Não aplicável.,Não aplicável.,FALSE
Trabalho Temporario de Tec. Informatico ; Tec. Superior e Serralheiro,Ajuste Direto Regime Geral,Aquisição de serviços,"79620000-6, Serviços de fornecimento de pessoal, inclusive temporário",Hospital Dr. Francisco Zagalo (501510150),"Tonus-Trabalho Temporario, Lda. (508986460)","7.460,00 €",06-10-2014,06-10-2014,30 dias,"Portugal, Aveiro, Ovar","Artigo 20.º, n.º 1, alínea a) do Código dos Contratos Públicos",31-10-2014,"4.994,17 €",,trabalho temporario efectuado abaixo do previsto,,Não aplicável.,Não aplicável.,FALSE
Trabalho Temporario de Assistentes Operacionais,Ajuste Direto Regime Geral,Aquisição de serviços,"79620000-6, Serviços de fornecimento de pessoal, inclusive temporário",Hospital Dr. Francisco Zagalo (501510150),"Tonus-Trabalho Temporario, Lda. (508986460)","16.530,00 €",06-10-2014,06-10-2014,30 dias,"Portugal, Aveiro, Ovar","Artigo 20.º, n.º 1, alínea a) do Código dos Contratos Públicos",31-10-2014,"15.633,72 €",,trabalho temporario abaixo do previsto,,Não aplicável.,Não aplicável.,FALSE
Trabalho temporario de assistentes tecnicos,Ajuste Direto Regime Geral,Aquisição de serviços,"79620000-6, Serviços de fornecimento de pessoal, inclusive temporário",Hospital Dr. Francisco Zagalo (501510150),"Tonus-Trabalho Temporario, Lda.   (508986460)","16.320,00 €",06-10-2014,06-10-2014,30 dias,"Portugal, Aveiro, Ovar","Artigo 20.º, n.º 1, alínea a) do Código dos Contratos Públicos",31-10-2014,"14.457,84 €",,trabalho temporario efectuado abaixo do previsto,,Não aplicável.,Não aplicável.,FALSE
Aquisição de próteses ortopédicas,Ajuste Direto Regime Geral,Aquisição de bens móveis,"33183200-8, Próteses ortopédicas",Hospital Dr. Francisco Zagalo (501510150),"Heraeus Kulzer Portugal, Lda (508322227)","330,00 €",06-10-2014,01-10-2014,30 dias,"Portugal, Aveiro, Ovar","Artigo 20.º, n.º 1, alínea a) do Código dos Contratos Públicos",01-10-2014,"330,00 €",,"",,Não aplicável.,Não aplicável.,FALSE
Aquisição de próteses ortopédicas,Ajuste Direto Regime Geral,Aquisição de bens móveis,"33183200-8, Próteses ortopédicas",Hospital Dr. Francisco Zagalo (501510150),Artur Salgado (503612600),"7.689,25 €",06-10-2014,01-10-2014,30 dias,"Portugal, Aveiro, Ovar","Artigo 20.º, n.º 1, alínea a) do Código dos Contratos Públicos",01-10-2014,"7.689,25 €",,"",,Não aplicável.,Não aplicável.,FALSE
Prestação de serviços medicos na area de urologia,Ajuste Direto Regime Geral,Aquisição de serviços,"85100000-0, Serviços de saúde",Hospital Dr. Francisco Zagalo (501510150),"Drª.Teresa Bragança & Dr. Ulisses Ribau, Med. Esp. Lda. (508476143)","6.956,40 €",01-10-2014,30-09-2014,30 dias,"Portugal, Aveiro, Ovar","Artigo 20.º, n.º 1, alínea a) do Código dos Contratos Públicos",30-09-2014,"6.956,40 €",,"",,Não aplicável.,Não aplicável.,FALSE
Prestação de serviços medicos na area de urologia,Ajuste Direto Regime Geral,Aquisição de serviços,"85100000-0, Serviços de saúde",Hospital Dr. Francisco Zagalo (501510150),"DrªTeresa Bragança & DrUlissesRibau, Med. Espec. Lda. (508476143)","6.591,20 €",01-10-2014,30-09-2014,30 dias,"Portugal, Aveiro, Ovar","Artigo 20.º, n.º 1, alínea a) do Código dos Contratos Públicos",30-09-2014,"6.591,20 €",,"",,Não aplicável.,Não aplicável.,FALSE
Prestação de Serviços medicos na area de urologia,Ajuste Direto Regime Geral,Aquisição de serviços,"85100000-0, Serviços de saúde",Hospital Dr. Francisco Zagalo (501510150),"DrªTeresa Bragança & DrªUlisses Ribau, Med.Esp.Lda. (508476143)","7.634,00 €",01-10-2014,30-09-2014,30 dias,"Portugal, Aveiro, Ovar","Artigo 20.º, n.º 1, alínea a) do Código dos Contratos Públicos",30-09-2014,"7.634,00 €",,"",,Não aplicável.,Não aplicável.,FALSE
