Objeto do Contrato,Tipo de Procedimento,Tipo(s) de Contrato,CPVs,Entidade(s) Adjudicante(s),Entidade(s) Adjudicatária(s),Preço Contratual,Data de Publicação,Data de Celebração do Contrato,Prazo de Execução,Local de Execução,Fundamentação,Data de Fecho do Contrato,Preço Total Efetivo,Causas das Alterações ao Prazo,Causas das Alterações ao Preço,Estado,N.º registo do Acordo Quadro,Descrição do Acordo Quadro,Procedimento Centralizado
"AJ/58/2017 Aquisição de serviços de gestão de resíduos dos grupos III, IV e líquidos ",Ajuste Direto Regime Geral,Aquisição de serviços,"90000000-7, Serviços relativos a águas residuais, resíduos, limpeza e ambiente","Hospital de Magalhães Lemos, E. P. E. (502828790)",AMBIMED (503593427),"479,82 €",10-11-2017,13-07-2017,30 dias,"Portugal, Porto, Porto","Artigo 20.º, n.º 1, alínea a) do Código dos Contratos Públicos",,,,,,Não aplicável.,Não aplicável.,FALSE
IG/7/2017 Aquisição de gás natural na SPMS para o ano de 2017,Ajuste Direto Regime Geral,Aquisição de serviços,"76000000-3, Serviços relacionados com as indústrias do gás e do petróleo","Hospital de Magalhães Lemos, E. P. E. (502828790)","Galp Power, SA (504723456)","541,55 €",10-11-2017,02-01-2017,30 dias,"Portugal, Porto, Porto","Artigo 20.º, n.º 1, alínea a) do Código dos Contratos Públicos",,,,,,Não aplicável.,Não aplicável.,FALSE
IG/7/2017 Aquisição de gás natural na SPMS para o ano de 2017,Ajuste Direto Regime Geral,Aquisição de serviços,"76000000-3, Serviços relacionados com as indústrias do gás e do petróleo","Hospital de Magalhães Lemos, E. P. E. (502828790)","Galp Power, SA (504723456)","242,98 €",10-11-2017,02-01-2017,20 dias,"Portugal, Porto, Porto","Artigo 20.º, n.º 1, alínea a) do Código dos Contratos Públicos",,,,,,Não aplicável.,Não aplicável.,FALSE
IG/199/2017 - Consumo de energia até inicio do novo contrato,Ajuste Direto Regime Geral,Aquisição de serviços,"65200000-5, Serviços de distribuição de gás e serviços conexos","Hospital de Magalhães Lemos, E. P. E. (502828790)",EDP COMERCIAL (503504564),"851,33 €",10-11-2017,13-02-2017,30 dias,"Portugal, Porto, Porto","Artigo 20.º, n.º 1, alínea a) do Código dos Contratos Públicos",,,,,,Não aplicável.,Não aplicável.,FALSE
AJ/37/2017 Aquisição de Material de Consumo Hoteleiro para o ano de 2017,Ajuste Direto Regime Geral,Aquisição de bens móveis,"39000000-2, Mobiliário (incl. de escritório), acessórios, aparelhos domésticos (excl. iluminação) e produtos de limpeza","Hospital de Magalhães Lemos, E. P. E. (502828790)",A.J.OLIVEIRA (502293748),"124,25 €",03-11-2017,06-07-2017,30 dias,"Portugal, Porto, Porto","Artigo 20.º, n.º 1, alínea a) do Código dos Contratos Públicos",,,,,,Não aplicável.,Não aplicável.,FALSE
AJ/36/2017 Aquisição de sacos plásticos e papel para o ano de 2017,Ajuste Direto Regime Geral,Aquisição de bens móveis,"19640000-4, Sacos de polietileno para recolha de lixo e resíduos","Hospital de Magalhães Lemos, E. P. E. (502828790)",A.J.OLIVEIRA (502293748),"87,80 €",03-11-2017,22-05-2017,30 dias,"Portugal, Porto, Porto","Artigo 20.º, n.º 1, alínea a) do Código dos Contratos Públicos",,,,,,Não aplicável.,Não aplicável.,FALSE
AJ/37/2017 Aquisição de Material de Consumo Hoteleiro para o ano de 2017,Ajuste Direto Regime Geral,Aquisição de bens móveis,"39000000-2, Mobiliário (incl. de escritório), acessórios, aparelhos domésticos (excl. iluminação) e produtos de limpeza","Hospital de Magalhães Lemos, E. P. E. (502828790)",A.J.OLIVEIRA (502293748),"1.122,59 €",02-11-2017,06-07-2017,30 dias,"Portugal, Porto, Porto","Artigo 20.º, n.º 1, alínea a) do Código dos Contratos Públicos",,,,,,Não aplicável.,Não aplicável.,FALSE
AJ/36/2017 Aquisição de sacos plásticos e papel para o ano de 2017,Ajuste Direto Regime Geral,Aquisição de bens móveis,"39000000-2, Mobiliário (incl. de escritório), acessórios, aparelhos domésticos (excl. iluminação) e produtos de limpeza","Hospital de Magalhães Lemos, E. P. E. (502828790)","SCVINHAS, LDA. (509658857)","38,10 €",02-11-2017,22-05-2017,30 dias,"Portugal, Porto, Porto","Artigo 20.º, n.º 1, alínea a) do Código dos Contratos Públicos",,,,,,Não aplicável.,Não aplicável.,FALSE
AJ/37/2017 Aquisição de Material de Consumo Hoteleiro para o ano de 2017,Ajuste Direto Regime Geral,Aquisição de bens móveis,"39000000-2, Mobiliário (incl. de escritório), acessórios, aparelhos domésticos (excl. iluminação) e produtos de limpeza","Hospital de Magalhães Lemos, E. P. E. (502828790)","SCVINHAS, LDA. (509658857)","555,03 €",02-11-2017,06-07-2017,30 dias,"Portugal, Porto, Porto","Artigo 20.º, n.º 1, alínea a) do Código dos Contratos Públicos",,,,,,Não aplicável.,Não aplicável.,FALSE
AJ/39/2017 Aquisição de serviços de transporte de doentes em ambulância para o ano de 2017,Ajuste Direto Regime Geral,Aquisição de serviços,"60000000-8, Serviços de transporte (excl. transporte de resíduos)","Hospital de Magalhães Lemos, E. P. E. (502828790)","SALVAVIDA Transporte de Doentes, Lda (506532160)","2.364,99 €",02-11-2017,02-01-2017,30 dias,"Portugal, Porto, Porto","Artigo 20.º, n.º 1, alínea a) do Código dos Contratos Públicos",,,,,,Não aplicável.,Não aplicável.,FALSE
