Objeto do Contrato,Tipo de Procedimento,Tipo(s) de Contrato,CPVs,Entidade(s) Adjudicante(s),Entidade(s) Adjudicatária(s),Preço Contratual,Data de Publicação,Data de Celebração do Contrato,Prazo de Execução,Local de Execução,Fundamentação,Data de Fecho do Contrato,Preço Total Efetivo,Causas das Alterações ao Prazo,Causas das Alterações ao Preço,Estado,N.º registo do Acordo Quadro,Descrição do Acordo Quadro,Procedimento Centralizado
Aluguer de Módulos Pré-Fabricados do Piso Inferior e r/c do Centro de Saúde de Viana do Castelo,Ajuste Direto Regime Geral,Aquisição de serviços,"55250000-7, Serviços de aluguer de alojamentos mobilados de curta duração","Unidade Local de Saúde do Alto Minho, EPE (ULSAM) (508786193)",U.E.M. - unidade de Estruturas Metálicas SA (502505729),"48.809,95 €",02-06-2017,24-04-2017,210 dias,"Portugal, Viana do Castelo, Viana do Castelo","Artigo 20.º, n.º 1, alínea a) do Código dos Contratos Públicos",,,,,,Não aplicável.,Não aplicável.,FALSE
Aquisição e Implementação de Sun Switches,Ajuste Direto Regime Geral,Aquisição de bens móveis,"30210000-4, Máquinas de processamento de dados (hardware)","Unidade Local de Saúde do Alto Minho, EPE (ULSAM) (508786193)","GONKSYS, SA (510874169)","47.894,18 €",02-06-2017,25-05-2017,20 dias,"Portugal, Viana do Castelo, Viana do Castelo","Artigo 20.º, n.º 1, alínea a) do Código dos Contratos Públicos",,,,,,Não aplicável.,Não aplicável.,FALSE
