freguesia,acronym,validVotesPercentage,votes,dicofre
Ourentã,PPD/PSD.CDS-PP,42.76,121,060209
Ourentã,PS,34.98,99,060209
Ourentã,MPT,8.48,24,060209
Ourentã,PCP-PEV,3.53,10,060209
Ourentã,B.E.,3.18,9,060209
Ourentã,L,1.77,5,060209
Ourentã,PND,1.77,5,060209
Ourentã,MAS,0.71,2,060209
Ourentã,PAN,0.71,2,060209
Ourentã,PCTP/MRPP,0.71,2,060209
Ourentã,PTP,0.71,2,060209
Ourentã,PPM,0.35,1,060209
Ourentã,PPV,0.35,1,060209
Ourentã,PDA,0,0,060209
Ourentã,PNR,0,0,060209
Ourentã,POUS,0,0,060209
