freguesia,acronym,validVotesPercentage,votes,dicofre
Negrelos (São Tomé),PS,48.43,970,131430
Negrelos (São Tomé),PPD/PSD,25.66,514,131430
Negrelos (São Tomé),B.E.,9.94,199,131430
Negrelos (São Tomé),PCP-PEV,4.39,88,131430
Negrelos (São Tomé),PAN,3.3,66,131430
Negrelos (São Tomé),CDS-PP,3,60,131430
Negrelos (São Tomé),R.I.R.,1,20,131430
Negrelos (São Tomé),IL,0.75,15,131430
Negrelos (São Tomé),PCTP/MRPP,0.75,15,131430
Negrelos (São Tomé),CH,0.5,10,131430
Negrelos (São Tomé),PDR,0.5,10,131430
Negrelos (São Tomé),L,0.4,8,131430
Negrelos (São Tomé),PURP,0.3,6,131430
Negrelos (São Tomé),JPP,0.2,4,131430
Negrelos (São Tomé),PPM,0.2,4,131430
Negrelos (São Tomé),PTP,0.2,4,131430
Negrelos (São Tomé),PNR,0.15,3,131430
Negrelos (São Tomé),A,0.1,2,131430
Negrelos (São Tomé),MPT,0.1,2,131430
Negrelos (São Tomé),NC,0.1,2,131430
Negrelos (São Tomé),MAS,0.05,1,131430
