freguesia,acronym,validVotesPercentage,votes,dicofre
Forno Telheiro,PS,35.04,48,090306
Forno Telheiro,PPD/PSD,33.58,46,090306
Forno Telheiro,A,6.57,9,090306
Forno Telheiro,B.E.,6.57,9,090306
Forno Telheiro,CDS-PP,3.65,5,090306
Forno Telheiro,PPM.PPV/CDC,3.65,5,090306
Forno Telheiro,L,2.92,4,090306
Forno Telheiro,PTP,2.92,4,090306
Forno Telheiro,PAN,2.19,3,090306
Forno Telheiro,PCP-PEV,2.19,3,090306
Forno Telheiro,NC,0.73,1,090306
Forno Telheiro,IL,0,0,090306
Forno Telheiro,MAS,0,0,090306
Forno Telheiro,PCTP/MRPP,0,0,090306
Forno Telheiro,PDR,0,0,090306
Forno Telheiro,PNR,0,0,090306
Forno Telheiro,PURP,0,0,090306
