Objeto do Contrato,Tipo de Procedimento,Tipo(s) de Contrato,CPVs,Entidade(s) Adjudicante(s),Entidade(s) Adjudicatária(s),Preço Contratual,Data de Publicação,Data de Celebração do Contrato,Prazo de Execução,Local de Execução,Fundamentação,Data de Fecho do Contrato,Preço Total Efetivo,Causas das Alterações ao Prazo,Causas das Alterações ao Preço,Estado,N.º registo do Acordo Quadro,Descrição do Acordo Quadro,Procedimento Centralizado
Aquisição de Serviços de Consultoria Especializada para Certificação de SGQ -Norma ISO 9001:2015,Ajuste Direto Regime Geral,Aquisição de serviços,"80510000-2, Serviços de formação especializada",Unidade Local de Saúde do Litoral Alentejano EPE (510445152),BiQ Health Solutions Lda (504105337),"9.700,00 €",16-11-2017,20-10-2017,120 dias,"Portugal, Setúbal, Santiago do Cacém","Artigo 20.º, n.º 1, alínea a) do Código dos Contratos Públicos",,,,,,Não aplicável.,Não aplicável.,FALSE
Aquisição de Bolsa de Horas para apoio nas atividades de Gestão das Candidaturas SAMA,Ajuste Direto Regime Geral,Aquisição de serviços,"72000000-5, Serviços de TI: consultoria, desenvolvimento de software, Internet e apoio","Unidade Local de Saúde do Litoral Alentejano, E. P. E. (510445152)",GFI Portugal -Tecnologias da Informação SA (502726890),"19.800,00 €",15-11-2017,26-09-2016,90 dias,"Portugal, Setúbal, Santiago do Cacém","Artigo 20.º, n.º 1, alínea a) do Código dos Contratos Públicos",,,,,,Não aplicável.,Não aplicável.,FALSE
Prestação Serviços Aquisição do Sistema PACS,Ajuste Direto Regime Geral,Aquisição de serviços,"72000000-5, Serviços de TI: consultoria, desenvolvimento de software, Internet e apoio","Unidade Local de Saúde do Litoral Alentejano, E. P. E. (510445152)",Carestream Health Portugal Lda (508054320),"30.000,00 €",13-11-2017,23-12-2016,60 dias,"Portugal, Setúbal, Santiago do Cacém","Artigo 20.º, n.º 1, alínea a) do Código dos Contratos Públicos",,,,,,Não aplicável.,Não aplicável.,FALSE
Obra no Centro de Dados da ULSLA EPE,Ajuste Direto Regime Geral,Empreitadas de obras públicas,"45200000-9, Obras de construção total ou parcial e de engenharia civil",Unidade Local de Saúde do Litoral Alentejano EPE (510445152),Guiatel Serviços de Telecomunicações SA (505368102),"79.956,15 €",13-11-2017,06-07-2017,60 dias,"Portugal, Setúbal, Santiago do Cacém","Artigo 19.º, alínea a) do Código dos Contratos Públicos",,,,,,Não aplicável.,Não aplicável.,FALSE
Aquisição de Solução de Gestão de Frota Automóvel,Ajuste Direto Regime Geral,Aquisição de serviços,"50111100-7, Serviços de gestão de frotas de veículos","Unidade Local de Saúde do Litoral Alentejano, E. P. E. (510445152)",Cartrack - Sistema Controlo Identificação Veiculos SA (505464713),"6.000,00 €",13-11-2017,24-05-2017,360 dias,"Portugal, Setúbal, Santiago do Cacém","Artigo 20.º, n.º 1, alínea a) do Código dos Contratos Públicos",,,,,,Não aplicável.,Não aplicável.,FALSE
