Objeto do Contrato,Tipo de Procedimento,Tipo(s) de Contrato,CPVs,Entidade(s) Adjudicante(s),Entidade(s) Adjudicatária(s),Preço Contratual,Data de Publicação,Data de Celebração do Contrato,Prazo de Execução,Local de Execução,Fundamentação,Data de Fecho do Contrato,Preço Total Efetivo,Causas das Alterações ao Prazo,Causas das Alterações ao Preço,Estado,N.º registo do Acordo Quadro,Descrição do Acordo Quadro,Procedimento Centralizado
CAT - ANALISADORES,Ajuste Direto Regime Geral,Aquisição de serviços,"50000000-5, Serviços de reparação e manutenção","Instituto Nacional de Saúde Dr. Ricardo Jorge, I. P. (501427511)",GOMENSORO (A-28060283),"8.350,20 €",18-12-2013,07-06-2013,150 dias,"Portugal, Lisboa, Lisboa","Artigo 20.º, n.º 1, alínea a) do Código dos Contratos Públicos",,,,,,Não aplicável.,Não aplicável.,
Manutenção do potenciometro,Ajuste Direto Regime Geral,Aquisição de serviços,"50430000-8, Serviços de reparação e manutenção de equipamento de precisão","Instituto Nacional de Saúde Dr. Ricardo Jorge, I. P. (501427511)",Radiometer Ibérica S.L. (980201667),"3.350,21 €",18-12-2013,28-10-2013,64 dias,"Portugal, Lisboa, Lisboa","Artigo 20.º, n.º 1, alínea a) do Código dos Contratos Públicos",,,,,,Não aplicável.,Não aplicável.,
20130623 Aquisição de reagentes,Ajuste Direto Regime Geral,Aquisição de bens móveis,"33696500-0, Reagentes de laboratório",Instituto Nacional de Saúde Dr.Ricardo Jorge(INSA) (501427511),"QUILABAN (500399670), BIOMÉRIEUX (501524177)","14.689,32 €",18-12-2013,13-09-2013,150 dias,"Portugal, Lisboa, Lisboa","Artigo 20.º, n.º 1, alínea a) do Código dos Contratos Públicos",,,,,,Não aplicável.,Não aplicável.,
Manutenção do sistema software Labway Lims,Ajuste Direto Regime Geral,Aquisição de serviços,"50000000-5, Serviços de reparação e manutenção",Instituto Nacional de Saúde Dr.Ricardo Jorge(INSA) (501427511),AMBIDATA- Difital Innovation Solutions & Cons. Ldª (504673734),"4.145,00 €",17-12-2013,20-09-2013,102 dias,"Portugal, Lisboa, Lisboa","Artigo 24.º, n.º 1, alínea e) do Código dos Contratos Públicos",,,,,,Não aplicável.,Não aplicável.,
Aquisição de serviços de actualização e assistência do software Clinidata,Ajuste Direto Regime Geral,Aquisição de serviços,"72260000-5, Serviços relacionados com software","Instituto Nacional de Saúde Dr. Ricardo Jorge, I. P. (501427511)",MAXDATA-Informática Ldª (502250259),"6.705,36 €",16-12-2013,21-05-2013,223 dias,"Portugal, Lisboa, Lisboa","Artigo 24.º, n.º 1, alínea e) do Código dos Contratos Públicos",,,,,,Não aplicável.,Não aplicável.,
Aquisição de reagentes,Ajuste Direto Regime Geral,Aquisição de bens móveis,"33696000-5, Reagentes e meios de contraste","Instituto Nacional de Saúde Dr. Ricardo Jorge, I. P. (501427511)","Enzifarma -Diagnostica e Farmacêutica, S.A. (503636975)","2.878,00 €",16-12-2013,04-06-2013,185 dias,"Portugal, Lisboa, Lisboa","Artigo 20.º, n.º 1, alínea a) do Código dos Contratos Públicos",,,,,,Não aplicável.,Não aplicável.,
"20130757 - Aquisição de reagentes Lenticules NCTC775, NCTC 13170 e NTCC9001e10",Ajuste Direto Regime Geral,Aquisição de bens móveis,"33140000-3, Material médico de consumo","Instituto Nacional de Saúde Dr. Ricardo Jorge, I. P. (501427511)","Fisher Scientifc, Lda (506429210)","710,74 €",16-12-2013,27-11-2013,30 dias,"Portugal, Lisboa, Lisboa","Artigo 20.º, n.º 1, alínea a) do Código dos Contratos Públicos",,,,,,Não aplicável.,Não aplicável.,
Aquisição serviços p/sistema Monitorização da Infraestrutura SI/TI,Ajuste Direto Regime Geral,Aquisição de serviços,"72700000-7, Serviços de rede informática","Instituto Nacional de Saúde Dr. Ricardo Jorge, I. P. (501427511)","CPC.IS - Companhia Portuguesa de Computadores, Informàtica e Sistemas, S.A. (501267255)","8.780,00 €",13-12-2013,28-05-2013,212 dias,"Portugal, Lisboa, Lisboa","Artigo 20.º, n.º 1, alínea a) do Código dos Contratos Públicos",,,,,,Não aplicável.,Não aplicável.,
20130759 - Aquisição de reagentes de doenças infecciosas,Ajuste Direto Regime Geral,Aquisição de bens móveis,"33696500-0, Reagentes de laboratório","Instituto Nacional de Saúde Dr. Ricardo Jorge, I. P. (501427511)",Magnamed Comercialização de Produtos Medicos Lda (503640476),"7.841,20 €",13-12-2013,01-11-2013,70 dias,"Portugal, Lisboa, Lisboa","Artigo 20.º, n.º 1, alínea a) do Código dos Contratos Públicos",,,,,,Não aplicável.,Não aplicável.,
Aquisição de reagentes,Ajuste Direto Regime Geral,Aquisição de bens móveis,"33696500-0, Reagentes de laboratório","Instituto Nacional de Saúde Dr. Ricardo Jorge, I. P. (501427511)",AMBIFOOD (505400057),"3.999,25 €",13-12-2013,08-11-2013,60 dias,"Portugal, Lisboa, Lisboa","Artigo 24.º, n.º 1, alínea e) do Código dos Contratos Públicos",,,,,,Não aplicável.,Não aplicável.,
Aquisição de serviços de manutenção e reparação de fotocopiadoras,Ajuste Direto Regime Geral,Aquisição de serviços,"50313200-4, Serviços de manutenção de fotocopiadoras","Instituto Nacional de Saúde Dr. Ricardo Jorge, I. P. (501427511)",CANON PORTUGAL S.A. (507477740),"10.362,93 €",12-12-2013,13-05-2013,230 dias,"Portugal, Lisboa, Lisboa","Artigo 24.º, n.º 1, alínea e) do Código dos Contratos Públicos",,,,,,Não aplicável.,Não aplicável.,
Prestação de Serviços na Área da Contabilidade,Ajuste Direto Regime Geral,Aquisição de serviços,"75000000-6, Serviços relacionados com a administração pública, a defesa e a segurança social","Instituto Nacional de Saúde Dr. Ricardo Jorge, I. P. (501427511)",Argumentos e Fórmulas (509986064),"11.880,00 €",11-12-2013,30-07-2013,365 dias,"Portugal, Lisboa, Lisboa","Artigo 20.º, n.º 1, alínea a) do Código dos Contratos Públicos",,,,,,Não aplicável.,Não aplicável.,
