Objeto do Contrato,Tipo de Procedimento,Tipo(s) de Contrato,CPVs,Entidade(s) Adjudicante(s),Entidade(s) Adjudicatária(s),Preço Contratual,Data de Publicação,Data de Celebração do Contrato,Prazo de Execução,Local de Execução,Fundamentação,Data de Fecho do Contrato,Preço Total Efetivo,Causas das Alterações ao Prazo,Causas das Alterações ao Preço,Estado,N.º registo do Acordo Quadro,Descrição do Acordo Quadro,Procedimento Centralizado
49004517-Contrato Plataforma VORTAL,Ajuste Direto Regime Geral,Aquisição de serviços,"50000000-5, Serviços de reparação e manutenção",Hospital Dr. Francisco Zagalo (501510150),VORTAL COMP ELECTRONICO CONSULTA E MULTIMEDIA SA (505141019),"2.237,50 €",31-07-2017,02-06-2017,180 dias,"Portugal, Aveiro, Ovar","Artigo 20.º, n.º 1, alínea a) do Código dos Contratos Públicos",11-09-2017,"2.237,00 €",,Acerto no arredondamento,,Não aplicável.,Não aplicável.,FALSE
49002217-Serviços medicos de Urologia,Ajuste Direto Regime Geral,Aquisição de serviços,"85100000-0, Serviços de saúde",Hospital Dr. Francisco Zagalo (501510150),"DRªTERESA BRAGANÇA & DR.ULISSES RIBAU, MED ESP.LD (508476143)","68.530,00 €",26-07-2017,03-02-2017,365 dias,"Portugal, Aveiro, Ovar","Artigo 20.º, n.º 1, alínea a) do Código dos Contratos Públicos",31-10-2017,"73.345,00 €",,serviços efetuados acima do previsto,,Não aplicável.,Não aplicável.,FALSE
49002717-Serviços de Transporte de Doentes em Ambulancia,Ajuste Direto Regime Geral,Aquisição de serviços,"85143000-3, Serviços de ambulâncias",Hospital Dr. Francisco Zagalo - Ovar (501510150),ASSOCIACAO HUMANITARIA BOMBEIROS VOLUNT OVAR (501287566),"17.000,00 €",26-07-2017,04-04-2017,240 dias,"Portugal, Aveiro, Ovar","Artigo 20.º, n.º 1, alínea a) do Código dos Contratos Públicos",30-11-2017,"9.348,20 €",,Serviços abaixo do previsto,,Não aplicável.,Não aplicável.,FALSE
49005317-Fornecimento de Eletricidade,Ajuste Direto Regime Geral,Aquisição de bens móveis,"09300000-2, Electricidade, aquecimento, energia solar e nuclear",Hospital Dr. Francisco Zagalo (501510150),"EDP COMERCIAL-Comercialização de Energia,S.A. (503504564)","35.019,95 €",26-07-2017,12-06-2017,210 dias,"Portugal, Aveiro, Ovar","Artigo 20.º, n.º 1, alínea a) do Código dos Contratos Públicos",30-11-2017,"33.406,36 €",,Serviços abaixo do previsto,,Não aplicável.,Não aplicável.,FALSE
49005417-Exames MCDT-Imagiologia,Ajuste Direto Regime Geral,Aquisição de serviços,"85150000-5, Serviços de imagiologia médica",Hospital Dr. Francisco Zagalo (501510150),"CENTRO HOSPITALAR V.N.GAIA/ESPINHO, EPE (508142156)","1.500,00 €",26-07-2017,19-06-2017,180 dias,"Portugal, Aveiro, Ovar","Artigo 20.º, n.º 1, alínea a) do Código dos Contratos Públicos",31-07-2017,"622,80 €",,Exames abaixo de previsto,,Não aplicável.,Não aplicável.,FALSE
