Objeto do Contrato,Tipo de Procedimento,Tipo(s) de Contrato,CPVs,Entidade(s) Adjudicante(s),Entidade(s) Adjudicatária(s),Preço Contratual,Data de Publicação,Data de Celebração do Contrato,Prazo de Execução,Local de Execução,Fundamentação,Data de Fecho do Contrato,Preço Total Efetivo,Causas das Alterações ao Prazo,Causas das Alterações ao Preço,Estado,N.º registo do Acordo Quadro,Descrição do Acordo Quadro,Procedimento Centralizado
Aquisição de Vacinas,Ajuste Direto Regime Geral,Aquisição de bens móveis,"33651600-4, Vacinas","Administração Regional de Saúde do Algarve, I.P. (503148709)","CSL - Behring, Unipessoal Lda. (503047201)","45.300,00 €",01-07-2011,01-07-2011,180 dias,"Portugal, Faro, Faro","Artigo 20.º, n.º 1, alínea a) do Código dos Contratos Públicos",,,,,,Não aplicável.,Não aplicável.,
Mobiliário Hospitalar para ACES Sotavento,Ajuste Direto Regime Geral,Aquisição de bens móveis,"33192000-2, Mobiliário para fins médicos","Administração Regional de Saúde do Algarve, I.P. (503148709)",Ambistore Instalações Mecanicas Electricas Lda. (504644831),"62.536,36 €",01-07-2011,01-07-2011,30 dias,"Portugal, Faro, Faro","Artigo 20.º, n.º 1, alínea a) do Código dos Contratos Públicos",,,,,,Não aplicável.,Não aplicável.,
Aquisição de Material de Via Aérea para 2011,Ajuste Direto Regime Geral,Aquisição de bens móveis,"33140000-3, Material médico de consumo","Administração Regional de Saúde do Algarve, I.P. (503148709)","Rocha Neves, LDA (500233691)","715,20 €",01-07-2011,30-06-2011,3 dias,"Portugal, Faro, Faro","Artigo 24.º, n.º 1, alínea e) do Código dos Contratos Públicos",,,,,,Não aplicável.,Não aplicável.,
Aquisição de Vacinas,Ajuste Direto Regime Geral,Aquisição de bens móveis,"33651600-4, Vacinas","Administração Regional de Saúde do Algarve, I.P. (503148709)",RV Raul Vieira Biotecnologia S.A. (506249956),"3.600,00 €",30-06-2011,21-06-2011,180 dias,"Portugal, Faro, Faro","Artigo 20.º, n.º 1, alínea a) do Código dos Contratos Públicos",,,,,,Não aplicável.,Não aplicável.,
Aquisição de Vacinas,Ajuste Direto Regime Geral,Aquisição de bens móveis,"33651600-4, Vacinas","Administração Regional de Saúde do Algarve, I.P. (503148709)",Grifols Portugal Produtos Farmacêuticos Hospitalares Lda. (502041285),"4.895,00 €",30-06-2011,21-06-2011,180 dias,"Portugal, Faro, Faro","Artigo 20.º, n.º 1, alínea a) do Código dos Contratos Públicos",,,,,,Não aplicável.,Não aplicável.,
Aquisição de Material de Ostomia para Armazém,Ajuste Direto Regime Geral,Aquisição de bens móveis,"33140000-3, Material médico de consumo","Administração Regional de Saúde do Algarve, I.P. (503148709)",Coloplast Portugal Sociedade Unipessoal Lda. (503989037),"196,00 €",29-06-2011,21-06-2011,2 dias,"Portugal, Faro, Faro","Artigo 24.º, n.º 1, alínea e) do Código dos Contratos Públicos",,,,,,Não aplicável.,Não aplicável.,
Material de Tratamento para Armazém,Ajuste Direto Regime Geral,Aquisição de bens móveis,"33140000-3, Material médico de consumo","Administração Regional de Saúde do Algarve, I.P. (503148709)","Coloplast Portugal Sociedade Unipessoal, Lda. (503989037)","306,00 €",29-06-2011,21-06-2011,2 dias,"Portugal, Faro, Faro","Artigo 24.º, n.º 1, alínea e) do Código dos Contratos Públicos",,,,,,Não aplicável.,Não aplicável.,
Aquisição de Serviços para o Alojamento de Médicos,Ajuste Direto Regime Geral,Aquisição de serviços,"55110000-4, Serviços de alojamento em hotéis","Administração Regional de Saúde do Algarve, I.P. (503148709)","Residencial D. Payo-Alojamentos Hoteleiros, Unipessoal Lda. (509528376)","16.200,00 €",24-06-2011,06-06-2011,365 dias,"Portugal, Faro, Faro","Artigo 20.º, n.º 1, alínea a) do Código dos Contratos Públicos",,,,,,Não aplicável.,Não aplicável.,
