freguesia,acronym,validVotesPercentage,votes,dicofre
Cavez,PS,46.27,285,030407
Cavez,PPD/PSD,37.99,234,030407
Cavez,B.E.,6.66,41,030407
Cavez,CDS-PP,2.6,16,030407
Cavez,PCP-PEV,1.62,10,030407
Cavez,NC,0.81,5,030407
Cavez,PAN,0.81,5,030407
Cavez,PCTP/MRPP,0.81,5,030407
Cavez,IL,0.65,4,030407
Cavez,R.I.R.,0.49,3,030407
Cavez,A,0.32,2,030407
Cavez,L,0.32,2,030407
Cavez,PTP,0.32,2,030407
Cavez,CH,0.16,1,030407
Cavez,MPT,0.16,1,030407
Cavez,JPP,0,0,030407
Cavez,MAS,0,0,030407
Cavez,PDR,0,0,030407
Cavez,PNR,0,0,030407
Cavez,PPM,0,0,030407
Cavez,PURP,0,0,030407
