Objeto do Contrato,Tipo de Procedimento,Tipo(s) de Contrato,CPVs,Entidade(s) Adjudicante(s),Entidade(s) Adjudicatária(s),Preço Contratual,Data de Publicação,Data de Celebração do Contrato,Prazo de Execução,Local de Execução,Fundamentação,Data de Fecho do Contrato,Preço Total Efetivo,Causas das Alterações ao Prazo,Causas das Alterações ao Preço,Estado,N.º registo do Acordo Quadro,Descrição do Acordo Quadro,Procedimento Centralizado
Aquisição urgente de reagentes para diagnóstico de Tuberculose,Ajuste Direto Regime Geral,Aquisição de bens móveis,"33696500-0, Reagentes de laboratório",Instituto Nacional de Saúde Dr.Ricardo Jorge(INSA) (501427511),"QUILABAN-QUIM.LABORATOR.ANALITICA, SA (500399670)","32.208,68 €",10-11-2017,10-02-2017,300 dias,"Portugal, Lisboa, Lisboa","Artigo 24.º, n.º 1, alínea c) do Código dos Contratos Públicos",29-03-2017,"32.208,68 €",,"",,Não aplicável.,Não aplicável.,FALSE
"20170788- Aquisição de reagentes para o Diagnóstico de Doenças Infecciosas de Natureza V iral do Departamento de Doenças Infecciosas do INSA, I.P.",Ajuste Direto Regime Geral,Aquisição de bens móveis,"33696500-0, Reagentes de laboratório","Instituto Nacional de Saúde Doutor Ricardo Jorge, I. P. (501427511)",BIOMERIEUX PORTUGAL                                (501524177),"2.395,40 €",10-11-2017,09-11-2017,30 dias,"Portugal, Lisboa, Lisboa","Artigo 26.º, n.º 1, alínea a) do Código dos Contratos Públicos",24-11-2017,"2.395,40 €",,"",,Não aplicável.,Não aplicável.,FALSE
"20170748-Aquisição de  reagentes para diagnóstico de Hepatites Virais e Treponemas para utilização no Departamento de Doenças Infecciosas do INSA, I.P.",Ajuste Direto Regime Geral,Aquisição de bens móveis,"33696500-0, Reagentes de laboratório","Instituto Nacional de Saúde Doutor Ricardo Jorge, I. P. (501427511)","ABBOTT LABORATORIOS, LDA (500006148)","420,00 €",08-11-2017,02-11-2017,30 dias,"Portugal, Lisboa, Lisboa","Artigo 26.º, n.º 1, alínea a) do Código dos Contratos Públicos",28-12-2017,"419,99 €",,acerto do IVA,,Não aplicável.,Não aplicável.,FALSE
20170753 - Aquisição de reagentes para diagnóstico de Hepatite C,Ajuste Direto Regime Geral,Aquisição de bens móveis,"33696500-0, Reagentes de laboratório","Instituto Nacional de Saúde Doutor Ricardo Jorge, I. P. (501427511)",ARIUM (502501880),"1.140,00 €",06-11-2017,02-11-2017,20 dias,"Portugal, Porto, Porto<BR/>Portugal, Setúbal, Setúbal<BR/>Portugal, Lisboa, Lisboa","Artigo 26.º, n.º 1, alínea a) do Código dos Contratos Públicos",05-01-2018,"1.140,00 €",,"",,Não aplicável.,Não aplicável.,FALSE
20170757 - Aquisição de discos de antibióticos para diagnóstico de doenças infeciosas,Ajuste Direto Regime Geral,Aquisição de bens móveis,"33696500-0, Reagentes de laboratório","Instituto Nacional de Saúde Doutor Ricardo Jorge, I. P. (501427511)","BIO-RAD LABORATORIES, LDA. (501301321)","504,00 €",03-11-2017,02-11-2017,20 dias,"Portugal, Lisboa, Lisboa","Artigo 26.º, n.º 1, alínea a) do Código dos Contratos Públicos",17-11-2017,"504,00 €",,"",,Não aplicável.,Não aplicável.,FALSE
