freguesia,acronym,validVotesPercentage,votes,dicofre
Pombalinho,PS,43.2,54,141203
Pombalinho,PCP-PEV,23.2,29,141203
Pombalinho,PPD/PSD,12.8,16,141203
Pombalinho,B.E.,8,10,141203
Pombalinho,CDS-PP,4.8,6,141203
Pombalinho,A,1.6,2,141203
Pombalinho,L,1.6,2,141203
Pombalinho,PCTP/MRPP,1.6,2,141203
Pombalinho,PPM.PPV/CDC,1.6,2,141203
Pombalinho,NC,0.8,1,141203
Pombalinho,PAN,0.8,1,141203
Pombalinho,IL,0,0,141203
Pombalinho,MAS,0,0,141203
Pombalinho,PDR,0,0,141203
Pombalinho,PNR,0,0,141203
Pombalinho,PTP,0,0,141203
Pombalinho,PURP,0,0,141203
