Objeto do Contrato,Tipo de Procedimento,Tipo(s) de Contrato,CPVs,Entidade(s) Adjudicante(s),Entidade(s) Adjudicatária(s),Preço Contratual,Data de Publicação,Data de Celebração do Contrato,Prazo de Execução,Local de Execução,Fundamentação,Data de Fecho do Contrato,Preço Total Efetivo,Causas das Alterações ao Prazo,Causas das Alterações ao Preço,Estado,N.º registo do Acordo Quadro,Descrição do Acordo Quadro,Procedimento Centralizado
"Avaliação de imóveis propriedade do INEM, I.P., sitos na cidade de Lisboa. ",Ajuste Direto Regime Geral,Aquisição de serviços,"79000000-4, Serviços a empresas: direito, comercialização, consultoria, recrutamento, impressão e segurança","Instituto Nacional de Emergência Médica, I. P. (501356126)","CPU - CONSULTORES DE AVALIAÇÃO, LDA (502827505)","2.100,00 €",28-06-2017,30-01-2017,10 dias,"Portugal, Lisboa, Lisboa","Artigo 20.º, n.º 1, alínea a) do Código dos Contratos Públicos",,,,,,Não aplicável.,Não aplicável.,FALSE
"AQUISIÇÃO DE BROMETO IPRATRÓPIO+SALBUTAMOL, CLOPIDOGREL E BROMETO DE IPRATRÓPIO",Ajuste Direto Regime Geral,Aquisição de bens móveis,"33600000-6, Produtos farmacêuticos","Instituto Nacional de Emergência Médica, I. P. (501356126)",TEVA PHARMA (507045491),"0,00 €",27-06-2017,23-06-2017,1 dias,"Portugal, Lisboa, Lisboa","Artigo 26.º, n.º 1, alínea e) do Código dos Contratos Públicos",,,,,,2812486,"AQUISIÇÃO DE BROMETO IPRATRÓPIO+SALBUTAMOL, CLOPIDOGREL E BROMETO DE IPRATRÓPIO",FALSE
AQUISIÇÃO DE LANCETAS DE USO ÚNICO ESTÉRIL,Ajuste Direto Regime Geral,Aquisição de bens móveis,"33000000-0, Equipamento médico, medicamentos e produtos para cuidados pessoais","Instituto Nacional de Emergência Médica, I. P. (501356126)",VACUETTE PORTUGAL (505348470),"0,00 €",27-06-2017,20-06-2017,5 dias,"Portugal, Lisboa, Lisboa","Artigo 26.º, n.º 1, alínea e) do Código dos Contratos Públicos",,,,,,2812454,AQUISIÇÃO DE LANCETAS DE USO ÚNICO ESTÉRIL,FALSE
Serviço de desinfestação nas diversas instalações do INEM - Ano 2017,Ajuste Direto Regime Geral,Aquisição de serviços,"90000000-7, Serviços relativos a águas residuais, resíduos, limpeza e ambiente","Instituto Nacional de Emergência Médica, I. P. (501356126)","Ambinorma II, Lda (507583698)","2.792,10 €",27-06-2017,24-02-2017,365 dias,"Portugal, Lisboa, Lisboa","Artigo 20.º, n.º 1, alínea a) do Código dos Contratos Públicos",,,,,,Não aplicável.,Não aplicável.,FALSE
"Prestação de serviço de higiene e limpeza, com fornecimento de consumíveis de casa de banho, para todo o território nacional.",Ajuste Direto Regime Geral,Aquisição de serviços,"90000000-7, Serviços relativos a águas residuais, resíduos, limpeza e ambiente","Instituto Nacional de Emergência Médica, I. P. (501356126)",Interlimpe (502611057),"23.201,39 €",27-06-2017,06-06-2017,30 dias,"Portugal, Faro, Faro<BR/>Portugal, Lisboa, Lisboa<BR/>Portugal, Coimbra, Coimbra<BR/>Portugal, Porto, Vila Nova de Gaia<BR/>Portugal, Porto, Porto","Artigo 24.º, n.º 1, alínea c) do Código dos Contratos Públicos",,,,,,Não aplicável.,Não aplicável.,FALSE
Manutenção da aplicação Navision,Ajuste Direto Regime Geral,Aquisição de serviços,"72600000-6, Serviços de consultoria e assistência informáticas","Instituto Nacional de Emergência Médica, I. P. (501356126)","Meta Estratégica - Soluções Tecnológicas, Lda. (509740782)","24.997,00 €",22-06-2017,23-05-2017,180 dias,"Portugal, Lisboa, Lisboa","Artigo 27.º, n.º 1, alínea h) do Código dos Contratos Públicos",,,,,,Não aplicável.,Não aplicável.,FALSE
