Objeto do Contrato,Tipo de Procedimento,Tipo(s) de Contrato,CPVs,Entidade(s) Adjudicante(s),Entidade(s) Adjudicatária(s),Preço Contratual,Data de Publicação,Data de Celebração do Contrato,Prazo de Execução,Local de Execução,Fundamentação,Data de Fecho do Contrato,Preço Total Efetivo,Causas das Alterações ao Prazo,Causas das Alterações ao Preço,Estado,N.º registo do Acordo Quadro,Descrição do Acordo Quadro,Procedimento Centralizado
Alterações Electricas USF S.Felix da Marinha,Ajuste Direto Regime Geral,Empreitadas de obras públicas,"45311000-0, Instalação de cabos e acessórios eléctricos","Administração Regional de Saúde do Norte, I.P. (503135593)","Electrobelomonte, Lda (508434912)","7.047,22 €",21-02-2011,04-02-2011,7 dias,"Portugal, Porto, Vila Nova de Gaia","Artigo 19.º, alínea a) do Código dos Contratos Públicos",31-03-2011,"7.047,22 €",,,,Não aplicável.,Não aplicável.,
Contrato de manutenção e assistencia tecnica -Equipamento informatico /central dos serviços da sede.,Ajuste Direto Regime Geral,Aquisição de serviços,"50312000-5, Manutenção e reparação de equipamento informático","Administração Regional de Saúde do Norte, I.P. (503135593)",ATM Informatica (504062859),"24.485,01 €",21-02-2011,27-05-2010,365 dias,"Portugal, Porto, Porto","Artigo 27.º, n.º 1, alínea f) do Código dos Contratos Públicos",15-06-2010,"24.485,01 €",,,,Não aplicável.,Não aplicável.,
"Contrato de manutenção e assistencia tecnica - Unidades de alimentação de servidores, rack e bastidores de comunicação",Ajuste Direto Regime Geral,Aquisição de serviços,"50312000-5, Manutenção e reparação de equipamento informático","Administração Regional de Saúde do Norte, I.P. (503135593)",ATM Informática (504062859),"39.755,83 €",21-02-2011,28-10-2010,365 dias,"Portugal, Porto, Porto","Artigo 27.º, n.º 1, alínea f) do Código dos Contratos Públicos",10-11-2010,"39.755,83 €",,,,Não aplicável.,Não aplicável.,
Contrato de manutenção e assistencia técnica de equipamento informático,Ajuste Direto Regime Geral,Aquisição de serviços,"50312000-5, Manutenção e reparação de equipamento informático","Administração Regional de Saúde do Norte, I.P. (503135593)",ATM Informatica (504062859),"192.741,61 €",21-02-2011,28-05-2010,365 dias,"Portugal, Porto, Porto","Artigo 27.º, n.º 1, alínea f) do Código dos Contratos Públicos",15-06-2010,"192.741,61 €",,,,Não aplicável.,Não aplicável.,
Sistemas de Informação de suporte à logistica,Ajuste Direto Regime Geral,Aquisição de serviços,"79414000-9, Serviços de consultoria em matéria de gestão de recursos humanos","Administração Regional de Saúde do Norte, I.P. (503135593)","Logiberica Sistemas de Informação, Lda. (503340022)","135.000,00 €",18-02-2011,02-06-2010,180 dias,"Portugal, Porto, Porto","Artigo 27.º, n.º 1, alínea f) do Código dos Contratos Públicos",30-09-2010,"135.000,00 €",,,,Não aplicável.,Não aplicável.,
Serviços de Desenvolvimento e Implementação de novas funcionalidades na Intranet da ARS Norte,Ajuste Direto Regime Geral,Aquisição de serviços,"72212220-7, Serviços de desenvolvimento de software para Internet e intranet","Administração Regional de Saúde do Norte, I.P. (503135593)","Logibérica Sistemas de Informação, Lda (503340022)","150.000,00 €",18-02-2011,21-12-2010,180 dias,"Portugal, Porto, Porto","Artigo 27.º, n.º 1, alínea f) do Código dos Contratos Públicos",31-12-2010,"150.000,00 €",,,,Não aplicável.,Não aplicável.,
Fornecimento de Serviços de Suporte à Plataforma Tecnologica,Ajuste Direto Regime Geral,Aquisição de serviços,"72260000-5, Serviços relacionados com software","Administração Regional de Saúde do Norte, I.P. (503135593)",Microsoft (502586745),"74.100,00 €",18-02-2011,25-06-2010,365 dias,"Portugal, Porto, Porto","Artigo 27.º, n.º 1, alínea f) do Código dos Contratos Públicos",30-12-2010,"74.100,00 €",,,,Não aplicável.,Não aplicável.,
Recuperação de Dados de Base de Dados,Ajuste Direto Regime Geral,Aquisição de serviços,"72320000-4, Serviços relacionados com bases de dados","Administração Regional de Saúde do Norte, I.P. (503135593)",ATM Informatica (504062859),"35.500,00 €",17-02-2011,23-11-2010,30 dias,"Portugal, Porto","Artigo 24.º, n.º 1, alínea c) do Código dos Contratos Públicos",29-11-2011,"35.500,00 €",,,,Não aplicável.,Não aplicável.,
Sistema de Informação DocBASE e DocBWEB,Ajuste Direto Regime Geral,Aquisição de bens móveis,"72212160-8, Serviços de desenvolvimento de software para bibliotecas","Administração Regional de Saúde do Norte, I.P. (503135593)","DID -Documentação, Informatica e Desenvolvimento Lda (502563770)","12.314,14 €",17-02-2011,19-01-2010,30 dias,"Portugal, Porto, Porto","Artigo 24.º, n.º 1, alínea e) do Código dos Contratos Públicos","","",,,,Não aplicável.,Não aplicável.,
