freguesia,acronym,validVotesPercentage,votes,dicofre
Sarilhos Grandes,PS,40.2,318,150704
Sarilhos Grandes,PCP-PEV,19.22,152,150704
Sarilhos Grandes,PPD/PSD,9.73,77,150704
Sarilhos Grandes,B.E.,9.36,74,150704
Sarilhos Grandes,PAN,5.94,47,150704
Sarilhos Grandes,CDS-PP,4.17,33,150704
Sarilhos Grandes,PPM.PPV/CDC,3.16,25,150704
Sarilhos Grandes,NC,1.52,12,150704
Sarilhos Grandes,A,1.39,11,150704
Sarilhos Grandes,IL,1.14,9,150704
Sarilhos Grandes,PCTP/MRPP,1.14,9,150704
Sarilhos Grandes,L,0.76,6,150704
Sarilhos Grandes,PDR,0.76,6,150704
Sarilhos Grandes,PURP,0.63,5,150704
Sarilhos Grandes,PNR,0.51,4,150704
Sarilhos Grandes,PTP,0.25,2,150704
Sarilhos Grandes,MAS,0.13,1,150704
