Objeto do Contrato,Tipo de Procedimento,Tipo(s) de Contrato,CPVs,Entidade(s) Adjudicante(s),Entidade(s) Adjudicatária(s),Preço Contratual,Data de Publicação,Data de Celebração do Contrato,Prazo de Execução,Local de Execução,Fundamentação,Data de Fecho do Contrato,Preço Total Efetivo,Causas das Alterações ao Prazo,Causas das Alterações ao Preço,Estado,N.º registo do Acordo Quadro,Descrição do Acordo Quadro,Procedimento Centralizado
Diversos US Meinedo,Ajuste Direto Regime Geral,Empreitadas de obras públicas,"45453000-7, Obras de revisão e recuperação","Administração Regional de Saúde do Norte, I.P. (503135593)","Raposo & João Gomes, SA (501189602)","25.031,03 €",02-06-2011,16-05-2011,15 dias,"Portugal, Porto, Lousada","Artigo 19.º, alínea a) do Código dos Contratos Públicos",14-06-2011,"25.031,03 €",,,,Não aplicável.,Não aplicável.,
Trabalhos Complementares USF Modivas,Ajuste Direto Regime Geral,Empreitadas de obras públicas,"45453100-8, Obras de recuperação","Administração Regional de Saúde do Norte, I.P. (503135593)","Construções Ezequiel Pinho moreira, Lda (503320455)","31.250,80 €",02-06-2011,18-05-2011,60 dias,"Portugal, Porto, Vila do Conde","Artigo 19.º, alínea a) do Código dos Contratos Públicos",11-07-2011,"31.250,80 €",,,,Não aplicável.,Não aplicável.,
Reparações UCC Vale de Cambra,Ajuste Direto Regime Geral,Empreitadas de obras públicas,"45453100-8, Obras de recuperação","Administração Regional de Saúde do Norte, I.P. (503135593)","Anorte, Construção e Engenharia, Lda (506891950)","17.513,36 €",02-06-2011,27-04-2011,21 dias,"Portugal, Aveiro, Vale de Cambra","Artigo 19.º, alínea a) do Código dos Contratos Públicos",21-09-2011,"17.513,36 €",,,,Não aplicável.,Não aplicável.,
