Objeto do Contrato,Tipo de Procedimento,Tipo(s) de Contrato,CPVs,Entidade(s) Adjudicante(s),Entidade(s) Adjudicatária(s),Preço Contratual,Data de Publicação,Data de Celebração do Contrato,Prazo de Execução,Local de Execução,Fundamentação,Data de Fecho do Contrato,Preço Total Efetivo,Causas das Alterações ao Prazo,Causas das Alterações ao Preço,Estado,N.º registo do Acordo Quadro,Descrição do Acordo Quadro,Procedimento Centralizado
20170104 - Serviço Manutenção e suporte para a Rede Informação e Observação em Saúde-RIOS,Ajuste Direto Regime Geral,Aquisição de serviços,"72611000-6, Serviços de assistência técnica informática","Instituto Nacional de Saúde Doutor Ricardo Jorge, I. P. (501427511)",ByValue Sistemas fe Informaçao (508124948),"7.920,00 €",27-02-2017,15-02-2017,320 dias,"Portugal, Lisboa, Lisboa","Artigo 24.º, n.º 1, alínea e) do Código dos Contratos Públicos",31-12-2017,"7.920,00 €",,"",,Não aplicável.,Não aplicável.,FALSE
20170069 - Peças com colocação para HPLC,Ajuste Direto Regime Geral,Aquisição de bens móveis,"38432200-4, Cromatógrafos","Instituto Nacional de Saúde Doutor Ricardo Jorge, I. P. (501427511)",Waters (510433669),"5.491,00 €",27-02-2017,06-02-2017,329 dias,"Portugal, Lisboa, Lisboa","Artigo 20.º, n.º 1, alínea a) do Código dos Contratos Públicos",14-12-2017,"5.491,00 €",,"",,Não aplicável.,Não aplicável.,FALSE
20170015 - aquisição de meios de cultura,Ajuste Direto Regime Geral,Aquisição de bens móveis,"33696500-0, Reagentes de laboratório","Instituto Nacional de Saúde Doutor Ricardo Jorge, I. P. (501427511)","PVL - PRODUTOS PARA LABORATORIO, LDA. (501411852)","2.778,00 €",27-02-2017,31-01-2017,333 dias,"Portugal, Lisboa, Lisboa","Artigo 20.º, n.º 1, alínea a) do Código dos Contratos Públicos",26-06-2017,"2.586,00 €",,Não foram adquiridas as quantidades inicialmente previstas,,Não aplicável.,Não aplicável.,FALSE
20170062 - aquisição de reagentes (kits de latex para legionella),Ajuste Direto Regime Geral,Aquisição de bens móveis,"33696500-0, Reagentes de laboratório","Instituto Nacional de Saúde Doutor Ricardo Jorge, I. P. (501427511)",BIOPORTUGAL (502380543),"620,00 €",27-02-2017,09-02-2017,325 dias,"Portugal, Lisboa, Lisboa","Artigo 20.º, n.º 1, alínea a) do Código dos Contratos Públicos",13-02-2017,"620,00 €",,"",,Não aplicável.,Não aplicável.,FALSE
20170071 - Aquisição urgente de reagentes para diagnóstico de doenças evitáveis por vacinação,Ajuste Direto Regime Geral,Aquisição de bens móveis,"33696500-0, Reagentes de laboratório",Instituto Nacional de Saúde Dr.Ricardo Jorge(INSA) (501427511),Biomerieux Portuguesa (501524177),"8.968,79 €",27-02-2017,10-02-2017,90 dias,"Portugal, Lisboa, Lisboa","Artigo 24.º, n.º 1, alínea c) do Código dos Contratos Públicos",07-06-2017,"8.968,79 €",,"",,Não aplicável.,Não aplicável.,FALSE
20170013 - Aquisição de material para o Rastreio Neonatal,Ajuste Direto Regime Geral,Aquisição de bens móveis,"33140000-3, Material médico de consumo",Instituto Nacional de Saúde Dr.Ricardo Jorge(INSA) (501427511),"VWR International - Material de Laboratório, Lda. (503842770)","6.214,69 €",27-02-2017,17-02-2017,90 dias,"Portugal, Lisboa, Lisboa","Artigo 20.º, n.º 1, alínea a) do Código dos Contratos Públicos",03-03-2017,"6.214,69 €",,"",,Não aplicável.,Não aplicável.,FALSE
20170088 - Aquisição de amostras para AEQ's,Ajuste Direto Regime Geral,Aquisição de bens móveis,"33696500-0, Reagentes de laboratório","Instituto Nacional de Saúde Doutor Ricardo Jorge, I. P. (501427511)","IRLANDOX LABORATORIOS, LDA               (502515619)","2.419,97 €",27-02-2017,13-02-2017,300 dias,"Portugal, Lisboa, Lisboa","Artigo 24.º, n.º 1, alínea e) do Código dos Contratos Públicos",21-06-2017,"2.419,97 €",,"",,Não aplicável.,Não aplicável.,FALSE
20170133 - Aquisição de amostras de controlo de qualidade,Ajuste Direto Regime Geral,Aquisição de bens móveis,"33696500-0, Reagentes de laboratório","Instituto Nacional de Saúde Doutor Ricardo Jorge, I. P. (501427511)",Referenzinstitut fur Bloanalytik (DE268787733),"3.542,00 €",27-02-2017,17-02-2017,300 dias,"Portugal, Lisboa, Lisboa","Artigo 24.º, n.º 1, alínea e) do Código dos Contratos Públicos",21-02-2017,"3.542,00 €",,"",,Não aplicável.,Não aplicável.,FALSE
20170134 - Aquisição de amostras para PNAEQ,Ajuste Direto Regime Geral,Aquisição de bens móveis,"33696500-0, Reagentes de laboratório","Instituto Nacional de Saúde Doutor Ricardo Jorge, I. P. (501427511)",STREEKZIEKENHUIS KONING BEATRIX (NL003846039B01),"2.025,00 €",27-02-2017,17-02-2017,300 dias,"Portugal, Lisboa, Lisboa","Artigo 24.º, n.º 1, alínea e) do Código dos Contratos Públicos",09-03-2017,"2.025,00 €",,"",,Não aplicável.,Não aplicável.,FALSE
20170159 - Aquisição de meios de cultura,Ajuste Direto Regime Geral,Aquisição de bens móveis,"33000000-0, Equipamento médico, medicamentos e produtos para cuidados pessoais","Instituto Nacional de Saúde Doutor Ricardo Jorge, I. P. (501427511)","PVL - PRODUTOS PARA LABORATORIO, LDA. (501411852)","498,00 €",24-02-2017,20-02-2017,90 dias,"Portugal, Lisboa, Lisboa","Artigo 20.º, n.º 1, alínea a) do Código dos Contratos Públicos",08-05-2017,"498,00 €",,"",,Não aplicável.,Não aplicável.,FALSE
20170158 - Aquisição de meios de cultura,Ajuste Direto Regime Geral,Aquisição de bens móveis,"33000000-0, Equipamento médico, medicamentos e produtos para cuidados pessoais","Instituto Nacional de Saúde Doutor Ricardo Jorge, I. P. (501427511)","Biomerieux Portugal, Lda (501524177)","4.935,60 €",24-02-2017,23-02-2017,90 dias,"Portugal, Lisboa, Lisboa","Artigo 20.º, n.º 1, alínea a) do Código dos Contratos Públicos",18-12-2017,"4.733,60 €",,produtos não solicitados para entrega pelo adjudicante,,Não aplicável.,Não aplicável.,FALSE
20150798-Aquisição de serviços de para fins exclusivos de investigação .Projeto Mycomix,Ajuste Direto Regime Geral,Aquisição de serviços,"72000000-5, Serviços de TI: consultoria, desenvolvimento de software, Internet e apoio","Instituto Nacional de Saúde Doutor Ricardo Jorge, I. P. (501427511)",Ana Luisa Calmeiro Pereira (223650625),"740,00 €",24-02-2017,29-12-2015,15 dias,"Portugal, Lisboa, Lisboa","Artigo 26.º, n.º 1, alínea b) do Código dos Contratos Públicos","","",,"",,Não aplicável.,Não aplicável.,FALSE
