freguesia,acronym,validVotesPercentage,votes,dicofre
União das freguesias de Vila Cova da Lixa e Borba de Godim,PS,36.69,568,130339
União das freguesias de Vila Cova da Lixa e Borba de Godim,PPD/PSD,35.72,553,130339
União das freguesias de Vila Cova da Lixa e Borba de Godim,CDS-PP,7.3,113,130339
União das freguesias de Vila Cova da Lixa e Borba de Godim,B.E.,6.33,98,130339
União das freguesias de Vila Cova da Lixa e Borba de Godim,PAN,3.68,57,130339
União das freguesias de Vila Cova da Lixa e Borba de Godim,L,2.07,32,130339
União das freguesias de Vila Cova da Lixa e Borba de Godim,PCP-PEV,2,31,130339
União das freguesias de Vila Cova da Lixa e Borba de Godim,A,1.23,19,130339
União das freguesias de Vila Cova da Lixa e Borba de Godim,NC,0.97,15,130339
União das freguesias de Vila Cova da Lixa e Borba de Godim,IL,0.78,12,130339
União das freguesias de Vila Cova da Lixa e Borba de Godim,PDR,0.78,12,130339
União das freguesias de Vila Cova da Lixa e Borba de Godim,PPM.PPV/CDC,0.78,12,130339
União das freguesias de Vila Cova da Lixa e Borba de Godim,PNR,0.58,9,130339
União das freguesias de Vila Cova da Lixa e Borba de Godim,PTP,0.52,8,130339
União das freguesias de Vila Cova da Lixa e Borba de Godim,PCTP/MRPP,0.26,4,130339
União das freguesias de Vila Cova da Lixa e Borba de Godim,MAS,0.19,3,130339
União das freguesias de Vila Cova da Lixa e Borba de Godim,PURP,0.13,2,130339
