Objeto do Contrato,Tipo de Procedimento,Tipo(s) de Contrato,CPVs,Entidade(s) Adjudicante(s),Entidade(s) Adjudicatária(s),Preço Contratual,Data de Publicação,Data de Celebração do Contrato,Prazo de Execução,Local de Execução,Fundamentação,Data de Fecho do Contrato,Preço Total Efetivo,Causas das Alterações ao Prazo,Causas das Alterações ao Preço,Estado,N.º registo do Acordo Quadro,Descrição do Acordo Quadro,Procedimento Centralizado
Prestação de Serviços de Vigilância e Segurança - Ano 2017,Concurso público,Aquisição de serviços,"79710000-4, Serviços de segurança","Centro Hospitalar Vila Nova de Gaia - Espinho, E. P. E. (508142156)","Ronsegur, Lda. (507011724)","217.560,00 €",11-02-2018,13-06-2017,365 dias,"Portugal, Porto, Vila Nova de Gaia","Artigo 20.º, n.º 1, alínea b) do Código dos Contratos Públicos",,,,,,Não aplicável.,Não aplicável.,FALSE
Aquisição de Serviços de Manutenção de Equipamentos Ativos de Rede do CHVNG- Ano 2017,Ajuste Direto Regime Geral,Aquisição de serviços,"50334400-9, Serviços de manutenção de sistemas de comunicações","Centro Hospitalar Vila Nova de Gaia - Espinho, E. P. E. (508142156)","Pamafe - Informática, Lda. (504099388)","29.940,00 €",11-02-2018,31-08-2017,365 dias,"Portugal, Porto, Vila Nova de Gaia","Artigo 24.º, n.º 1, alínea e) do Código dos Contratos Públicos",,,,,,Não aplicável.,Não aplicável.,FALSE
Celebração de Contrato de Assistência Técnica aos Equipamentos de Imagiologia - Ano 2017,Ajuste Direto Regime Geral,Aquisição de serviços,"50421000-2, Serviços de reparação e manutenção de equipamento médico",Centro Hospitalar Vila Nova de Gaia (CHNVG) (508142156),SIEMENS HEALTHCARE DIAGNOSTICS LDA (507925173),"138.824,76 €",11-02-2018,31-08-2017,365 dias,"Portugal, Porto, Vila Nova de Gaia","Artigo 24.º, n.º 1, alínea e) do Código dos Contratos Públicos",,,,,,Não aplicável.,Não aplicável.,FALSE
Prestação de Serviços Técnicos para Elaboração de  Proposta de Alterações Acompanhamento de Empreitada - Fase B Novo Edifício,Ajuste Direto Regime Geral,Outros Tipos (Concessão de exploração de bens do domínio público),"71200000-0, Serviços de arquitectura e afins","Centro Hospitalar Vila Nova de Gaia - Espinho, E. P. E. (508142156)","Vitor Hugo - Coordenação e Gestão de Projectos, SA (503040630)","56.887,50 €",11-02-2018,31-08-2017,45 dias,"Portugal, Porto, Vila Nova de Gaia","Artigo 24.º, n.º 1, alínea e) do Código dos Contratos Públicos",,,,,,Não aplicável.,Não aplicável.,FALSE
Celebração de Contrato de Assistência Técnica ao Equipamento de Assistência Ventricular IKUS 2000 do Serviço de Cirurgia Torácica - Ano 2017,Ajuste Direto Regime Geral,Aquisição de serviços,"50421000-2, Serviços de reparação e manutenção de equipamento médico",Centro Hospitalar Vila Nova de Gaia (CHNVG) (508142156),"Lusopalex, Lda (503531588)","7.040,00 €",11-02-2018,31-08-2017,365 dias,"Portugal, Porto, Vila Nova de Gaia","Artigo 24.º, n.º 1, alínea e) do Código dos Contratos Públicos",,,,,,Não aplicável.,Não aplicável.,FALSE
"Aquisição de Serviços de Análise Externa da Instituição para Efeitos de Definição de Estratégia do CHVNG/E,EPE",Ajuste Direto Regime Geral,Aquisição de serviços,"72221000-0, Serviços de consultoria em matéria de análise de gestão","Centro Hospitalar Vila Nova de Gaia - Espinho, E. P. E. (508142156)",Deloitte Consultores SA (502310090),"4.000,00 €",11-02-2018,12-09-2017,10 dias,"Portugal, Porto, Vila Nova de Gaia","Artigo 20.º, n.º 1, alínea a) do Código dos Contratos Públicos",,,,,,Não aplicável.,Não aplicável.,FALSE
"Aquisição de Serviços de Apoio Técnico de Projeto, Fiscalização,Controlo de Qualidade e Ambiente e Coordenação de Segurança e Saúde - 2017",Ajuste Direto Regime Geral,Locação de bens móveis<br/>Aquisição de serviços,"71247000-1, Supervisão de trabalhos de construção","Centro Hospitalar Vila Nova de Gaia - Espinho, E. P. E. (508142156)","Vitor Hugo - Coordenação e Gestão de Projectos, SA (503040630)","80.000,04 €",11-02-2018,30-10-2017,365 dias,"Portugal, Porto, Vila Nova de Gaia","Artigo 27.º, n.º 1, alínea a) do Código dos Contratos Públicos",,,,,,Não aplicável.,Não aplicável.,FALSE
Aquisição de 2 Monitores de Sinais Vitais- PCGripe,Ajuste Direto Regime Geral,Aquisição de bens móveis,"33000000-0, Equipamento médico, medicamentos e produtos para cuidados pessoais","Centro Hospitalar Vila Nova de Gaia - Espinho, E. P. E. (508142156)","General Electric Healthcare Portugal, Sociedade Unipessoal (500357129)","6.060,00 €",10-02-2018,02-11-2016,20 dias,"Portugal, Porto, Vila Nova de Gaia","Artigo 24.º, n.º 1, alínea c) do Código dos Contratos Públicos",,,,,,Não aplicável.,Não aplicável.,FALSE
Aquisição de 28 Mesas de cabeceira -PCGripe,Ajuste Direto Regime Geral,Aquisição de bens móveis,"39143123-4, Mesas de cabeceira","Centro Hospitalar Vila Nova de Gaia - Espinho, E. P. E. (508142156)","MUNDINTER INTERC. MUNDIAL COMERC., SA (500199906)","11.725,00 €",10-02-2018,13-12-2016,19 dias,"Portugal, Porto, Vila Nova de Gaia","Artigo 24.º, n.º 1, alínea c) do Código dos Contratos Públicos",,,,,,Não aplicável.,Não aplicável.,FALSE
Aquisição de 18 Camas Hospitalares -PCGripe,Ajuste Direto Regime Geral,Aquisição de bens móveis,"33192120-9, Camas de hospital","Centro Hospitalar Vila Nova de Gaia - Espinho, E. P. E. (508142156)","STRYKER PORTUGAL PRODUTOS MEDICOS, LDA (504594214)","27.000,00 €",10-02-2018,24-11-2016,8 dias,"Portugal, Porto, Vila Nova de Gaia","Artigo 24.º, n.º 1, alínea c) do Código dos Contratos Públicos",,,,,,Não aplicável.,Não aplicável.,FALSE
Aquisição de Sensores Ambientais - Diversos Serviços,Ajuste Direto Regime Geral,Aquisição de bens móveis,"35125100-7, Sensores","Centro Hospitalar Vila Nova de Gaia - Espinho, E. P. E. (508142156)","ViGIE Solutions, Lda. (509041108)","9.968,52 €",10-02-2018,03-10-2017,10 dias,"Portugal, Porto, Vila Nova de Gaia","Artigo 24.º, n.º 1, alínea e) do Código dos Contratos Públicos",,,,,,Não aplicável.,Não aplicável.,FALSE
Aquisição de Ultra Centrifuga - Imunohemoterapia,Ajuste Direto Regime Geral,Aquisição de bens móveis,"42931120-8, Centrifugadoras de mesa","Centro Hospitalar Vila Nova de Gaia - Espinho, E. P. E. (508142156)","Certilab, Lda. (505403013)","1.692,00 €",10-02-2018,02-02-2018,10 dias,"Portugal, Porto, Vila Nova de Gaia","Artigo 20.º, n.º 1, alínea a) do Código dos Contratos Públicos",,,,,,Não aplicável.,Não aplicável.,FALSE
Aquisição de eletrocardiógrafo -,Ajuste Direto Regime Geral,Aquisição de bens móveis,"33123200-0, Aparelhos para electrocardiografia","Centro Hospitalar Vila Nova de Gaia - Espinho, E. P. E. (508142156)",CARDIO SOLUCIONS (507158865),"9.530,00 €",10-02-2018,26-04-2017,1 dias,"Portugal, Porto, Vila Nova de Gaia","Artigo 24.º, n.º 1, alínea e) do Código dos Contratos Públicos",,,,,,Não aplicável.,Não aplicável.,FALSE
Aquisição de Videocistoscópio - Cta Ext Urologia,Ajuste Direto Regime Geral,Aquisição de bens móveis,"33000000-0, Equipamento médico, medicamentos e produtos para cuidados pessoais","Centro Hospitalar Vila Nova de Gaia - Espinho, E. P. E. (508142156)","OLYMPUS IBERIA, S.A.U. (980474710)","10.900,00 €",10-02-2018,26-04-2017,10 dias,"Portugal, Porto, Vila Nova de Gaia","Artigo 24.º, n.º 1, alínea e) do Código dos Contratos Públicos",,,,,,Não aplicável.,Não aplicável.,FALSE
Aquisição de Eletrobisturi,Ajuste Direto Regime Geral,Aquisição de bens móveis,"33141411-4, Bisturis e lâminas","Centro Hospitalar Vila Nova de Gaia - Espinho, E. P. E. (508142156)","BACELAR E IRMÃO, LDA (500532818)","4.265,75 €",10-02-2018,15-03-2017,20 dias,"Portugal, Porto, Vila Nova de Gaia","Artigo 24.º, n.º 1, alínea e) do Código dos Contratos Públicos",,,,,,Não aplicável.,Não aplicável.,FALSE
Aquisição de 3 Purificadores de Ar - Neonatologia,Ajuste Direto Regime Geral,Aquisição de bens móveis,"39811100-1, Purificadores do ar","Centro Hospitalar Vila Nova de Gaia - Espinho, E. P. E. (508142156)","CLIFILTRA CLIMATIZAÇÃO E TRATAMENTO DE AR, LDA (503011959)","16.155,00 €",10-02-2018,06-02-2017,60 dias,"Portugal, Porto, Vila Nova de Gaia","Artigo 24.º, n.º 1, alínea c) do Código dos Contratos Públicos",,,,,,Não aplicável.,Não aplicável.,FALSE
Aquisição de Injetor de Contraste Cardíaco -UDIC,Ajuste Direto Regime Geral,Aquisição de bens móveis,"33100000-1, Equipamento médico",Centro Hospitalar Vila Nova de Gaia (CHNVG) (508142156),"Med X Ray, Lda (506187071)","17.392,50 €",10-02-2018,18-12-2017,10 dias,"Portugal, Porto, Vila Nova de Gaia","Artigo 24.º, n.º 1, alínea c) do Código dos Contratos Públicos",,,,,,Não aplicável.,Não aplicável.,FALSE
Aquisição de 10 Postos de Trabalho,Ajuste Direto Regime Geral,Aquisição de bens móveis,"30214000-2, Estações de trabalho",Centro Hospitalar Vila Nova de Gaia (CHNVG) (508142156),Linkcom - Sistemas de Informação (505046547),"6.960,00 €",10-02-2018,07-11-2017,20 dias,"Portugal, Porto, Vila Nova de Gaia","Artigo 20.º, n.º 1, alínea a) do Código dos Contratos Públicos",,,,,,Não aplicável.,Não aplicável.,FALSE
Aquisição de 4 Camas de Parto com Colchão - Ginecologia/Obstetricia,Ajuste Direto Regime Geral,Aquisição de bens móveis,"33192120-9, Camas de hospital",Centro Hospitalar Vila Nova de Gaia (CHNVG) (508142156),"IBERDATA - Equipamentos, SA (501904921)","21.600,00 €",10-02-2018,15-03-2017,45 dias,"Portugal, Porto, Vila Nova de Gaia","Artigo 20.º, n.º 1, alínea a) do Código dos Contratos Públicos",,,,,,Não aplicável.,Não aplicável.,FALSE
Aquisição de Videocolposcópio com Registo Digital - Ginecologia/Obstetricia,Ajuste Direto Regime Geral,Aquisição de bens móveis,"33164100-8, Colposcópio",Centro Hospitalar Vila Nova de Gaia (CHNVG) (508142156),"OLYMPUS IBERIA, S.A.U. (980474710)","19.607,40 €",10-02-2018,15-03-2017,30 dias,"Portugal, Porto, Vila Nova de Gaia","Artigo 20.º, n.º 1, alínea a) do Código dos Contratos Públicos",,,,,,Não aplicável.,Não aplicável.,FALSE
Reparação por Substituição de Gastrofibroscópio,Ajuste Direto Regime Geral,Aquisição de bens móveis,"33168100-6, Endoscópios",Centro Hospitalar Vila Nova de Gaia (CHNVG) (508142156),"OLYMPUS IBERIA, S.A.U. (980474710)","14.625,00 €",10-02-2018,15-11-2017,15 dias,"Portugal, Porto, Vila Nova de Gaia","Artigo 24.º, n.º 1, alínea e) do Código dos Contratos Públicos",,,,,,Não aplicável.,Não aplicável.,FALSE
Software Terapy Monitor,Ajuste Direto Regime Geral,Aquisição de bens móveis,"48180000-3, Pacote de software para medicina","Centro Hospitalar Vila Nova de Gaia - Espinho, E. P. E. (508142156)","FRESENIUS MEDICAL CARE PORTUGAL, SA (503070220)","9.361,25 €",10-02-2018,21-09-2017,10 dias,"Portugal, Porto, Porto","Artigo 24.º, n.º 1, alínea e) do Código dos Contratos Públicos",,,,,,Não aplicável.,Não aplicável.,FALSE
Aquisição de Servidor Dell Enclosure,Ajuste Direto Regime Geral,Aquisição de bens móveis,"32420000-3, Equipamento de rede","Centro Hospitalar Vila Nova de Gaia - Espinho, E. P. E. (508142156)","Pamafe - Informática, Lda. (504099388)","9.826,00 €",10-02-2018,03-10-2017,30 dias,"Portugal, Porto, Vila Nova de Gaia","Artigo 20.º, n.º 1, alínea a) do Código dos Contratos Públicos",,,,,,Não aplicável.,Não aplicável.,FALSE
Aquisição de Licenças Nuance,Ajuste Direto Regime Geral,Aquisição de bens móveis,"48180000-3, Pacote de software para medicina","Centro Hospitalar Vila Nova de Gaia - Espinho, E. P. E. (508142156)",ART CES UNIPESSOAL (513270396),"55.748,00 €",10-02-2018,05-09-2017,10 dias,"Portugal, Porto, Vila Nova de Gaia","Artigo 24.º, n.º 1, alínea e) do Código dos Contratos Públicos",,,,,,Não aplicável.,Não aplicável.,FALSE
Aquisição de licenças para Central Omniview,Ajuste Direto Regime Geral,Aquisição de bens móveis,"22456000-1, Licenças","Centro Hospitalar Vila Nova de Gaia - Espinho, E. P. E. (508142156)",SPECULUM ARTIGOS MEDICOS SA (502996323),"2.320,00 €",10-02-2018,19-10-2017,20 dias,"Portugal, Porto, Vila do Conde","Artigo 24.º, n.º 1, alínea e) do Código dos Contratos Públicos",,,,,,Não aplicável.,Não aplicável.,FALSE
Central de Intrusão c/bateria interna - Hospital de Dia,Ajuste Direto Regime Geral,Aquisição de bens móveis,"35100000-5, Equipamento de emergência e de segurança","Centro Hospitalar Vila Nova de Gaia - Espinho, E. P. E. (508142156)","PRESTIBEL -  Empresa de Segurança,  SA (501326456)","4.007,00 €",10-02-2018,20-12-2017,10 dias,"Portugal, Porto, Vila Nova de Gaia","Artigo 24.º, n.º 1, alínea c) do Código dos Contratos Públicos",,,,,,Não aplicável.,Não aplicável.,FALSE
Reestruturação de Espaços -Plano Contingência Gripe,Ajuste Direto Regime Geral,Empreitadas de obras públicas,"45453100-8, Obras de recuperação","Centro Hospitalar Vila Nova de Gaia - Espinho, E. P. E. (508142156)","JJ Construções, Lda (509254934)","43.528,50 €",10-02-2018,28-11-2017,30 dias,"Portugal, Porto, Vila Nova de Gaia","Artigo 24.º, n.º 1, alínea c) do Código dos Contratos Públicos",,,,,,Não aplicável.,Não aplicável.,FALSE
Procedimento 1016618- - Aquisição de Dispositivos Médicos Diversos (2017/36),Ao abrigo de acordo-quadro (art.º 259.º),Aquisição de bens móveis,"33600000-6, Produtos farmacêuticos","Centro Hospitalar Vila Nova de Gaia - Espinho, E. P. E. (508142156)","Johnson & Johnson, Lda. (500153370)","12.806,64 €",09-02-2018,10-01-2018,365 dias,"Portugal, Porto, Vila Nova de Gaia",Artigo 259.º do Código dos Contratos Públicos,,,,,,2414255,CP 2017/36 - Acordo Quadro para fornecimento de material de dispositivos médicos diversos às Instituições e Serviços do Serviço Nacional de Saúde,FALSE
"Aquisição de Reagentes Para Monitorização da carga Viral Utilizados no Equipamento """"COBAS"""", Instalado no Serviço de Imunnnnnohemoterapia-2018",Ajuste Direto Regime Geral,Aquisição de bens móveis,"33696000-5, Reagentes e meios de contraste","Centro Hospitalar Vila Nova de Gaia - Espinho, E. P. E. (508142156)","Roche - Sistermas de Diagnóstico, Ldª (504282921)","166.476,18 €",08-02-2018,26-01-2018,90 dias,"Portugal, Porto, Vila Nova de Gaia","Artigo 24.º, n.º 1, alínea e) do Código dos Contratos Públicos",,,,,,Não aplicável.,Não aplicável.,FALSE
Aquisição de Peróxido de Hidrogénio Vaporizado,Ajuste Direto Regime Geral,Aquisição de bens móveis,"33696000-5, Reagentes e meios de contraste","Centro Hospitalar Vila Nova de Gaia - Espinho, E. P. E. (508142156)","VITATECH-EQUIPAMENTOS E CONSUMIVEIS HOSPITALARES, LDA (510693660)","24.656,26 €",08-02-2018,02-01-2018,365 dias,"Portugal, Porto, Vila Nova de Gaia","Artigo 24.º, n.º 1, alínea e) do Código dos Contratos Públicos",,,,,,Não aplicável.,Não aplicável.,FALSE
Aquisição de Gas p/Laser 217 Z 100,Ajuste Direto Regime Geral,Aquisição de bens móveis,"33696000-5, Reagentes e meios de contraste","Centro Hospitalar Vila Nova de Gaia - Espinho, E. P. E. (508142156)","OFTALTEC, LDA. (503197149)","20.850,00 €",08-02-2018,01-01-2018,365 dias,"Portugal, Porto, Vila Nova de Gaia","Artigo 24.º, n.º 1, alínea e) do Código dos Contratos Públicos",,,,,,Não aplicável.,Não aplicável.,FALSE
Aquisição de Controlo de Qualidade Externos (Patologia Clinica),Ajuste Direto Regime Geral,Aquisição de bens móveis,"33696000-5, Reagentes e meios de contraste","Centro Hospitalar Vila Nova de Gaia - Espinho, E. P. E. (508142156)",BIOGNOSTICA DISTRIB. DE PROD. E EQUIP. TECNICOS (504441256),"34.919,50 €",08-02-2018,05-02-2018,365 dias,"Portugal, Porto, Vila Nova de Gaia","Artigo 24.º, n.º 1, alínea e) do Código dos Contratos Públicos",,,,,,Não aplicável.,Não aplicável.,FALSE
Reparação do muro exterior do hospital,Ajuste Direto Regime Geral,Empreitadas de obras públicas,"45453100-8, Obras de recuperação","Centro Hospitalar Vila Nova de Gaia - Espinho, E. P. E. (508142156)","SINICEL - SOCIEDADE DE INVESTIMENTOS IMOBILIÁRIOS E CONSTRUÇÕES DE ESMORIZ, LDA (501197273)","5.250,00 €",07-02-2018,13-02-2017,15 dias,"Portugal, Porto, Vila Nova de Gaia","Artigo 19.º, alínea a) do Código dos Contratos Públicos",,,,,,Não aplicável.,Não aplicável.,FALSE
Aquisição de Palonossetrom 0.25 mg/ 5 ml sol inj fr 5 ml IV,Ajuste Direto Regime Geral,Aquisição de bens móveis,"33600000-6, Produtos farmacêuticos",Centro Hospitalar Vila Nova de Gaia (CHNVG) (508142156),"Accord Healthcare, Lda. (508622263)","15.768,90 €",07-02-2018,03-01-2018,365 dias,"Portugal, Porto, Vila Nova de Gaia",Artigo 258.º do Código dos Contratos Públicos,,,,,,Não aplicável.,Não aplicável.,FALSE
1058018 - Ceftazidima 2000 mg + Avibactam 500 mg Pó conc sol inj Fr IV - clinigen,Ajuste Direto Regime Geral,Aquisição de bens móveis,"33600000-6, Produtos farmacêuticos","Centro Hospitalar Vila Nova de Gaia - Espinho, E. P. E. (508142156)",Clinigen Healthcare Ltd (100125104),"7.049,00 €",07-02-2018,07-02-2018,360 dias,"Portugal, Porto, Vila Nova de Gaia","Artigo 24.º, n.º 1, alínea e) do Código dos Contratos Públicos",,,,,,Não aplicável.,Não aplicável.,FALSE
AD 1008318 - Aquisição  de Medicamentos Exclusivos - Empresa Dr. Falk,Ajuste Direto Regime Geral,Aquisição de bens móveis,"33600000-6, Produtos farmacêuticos","Centro Hospitalar Vila Nova de Gaia - Espinho, E. P. E. (508142156)",DR. FALK PHARMA PORTUGAL (506171612),"793,75 €",07-02-2018,05-01-2018,365 dias,"Portugal, Porto, Vila Nova de Gaia","Artigo 24.º, n.º 1, alínea e) do Código dos Contratos Públicos",,,,,,Não aplicável.,Não aplicável.,FALSE
AD 1008818 - Aquisição de Medicamentos Exclusivos Pierre Fabre Desmosmetique,Ajuste Direto Regime Geral,Aquisição de bens móveis,"33600000-6, Produtos farmacêuticos","Centro Hospitalar Vila Nova de Gaia - Espinho, E. P. E. (508142156)",Pierre Fabre Dermo-cosmétique Portugal (501757635),"2.373,00 €",07-02-2018,08-01-2018,365 dias,"Portugal, Porto, Vila Nova de Gaia","Artigo 24.º, n.º 1, alínea e) do Código dos Contratos Públicos",,,,,,Não aplicável.,Não aplicável.,FALSE
AD 1019218 - Aquisição de Medicamentos Exclusivos - Empresa Laboratório Militar - Suc.Porto,Ajuste Direto Regime Geral,Aquisição de bens móveis,"33600000-6, Produtos farmacêuticos","Centro Hospitalar Vila Nova de Gaia - Espinho, E. P. E. (508142156)",Labratório Militar (600019675),"1.764,00 €",07-02-2018,11-01-2018,365 dias,"Portugal, Porto, Vila Nova de Gaia","Artigo 24.º, n.º 1, alínea e) do Código dos Contratos Públicos",,,,,,Não aplicável.,Não aplicável.,FALSE
AD 1025418 - Aquisição de Medicamentos Exclusicos da Empresa Dr. Falk,Ajuste Direto Regime Geral,Aquisição de bens móveis,"33600000-6, Produtos farmacêuticos","Centro Hospitalar Vila Nova de Gaia - Espinho, E. P. E. (508142156)",DR. FALK PHARMA PORTUGAL (506171612),"163,98 €",07-02-2018,10-01-2018,365 dias,"Portugal, Porto, Vila Nova de Gaia","Artigo 24.º, n.º 1, alínea e) do Código dos Contratos Públicos",,,,,,Não aplicável.,Não aplicável.,FALSE
AD 1011518 - Aquisição de Medicamentos Exclusivos da Firma 3M Espana,Ajuste Direto Regime Geral,Aquisição de bens móveis,"33600000-6, Produtos farmacêuticos",Centro Hospitalar Vila Nova de Gaia (CHNVG) (508142156),3M Espana SL (980560241),"6.300,00 €",06-02-2018,02-01-2018,365 dias,"Portugal, Porto, Vila Nova de Gaia","Artigo 24.º, n.º 1, alínea e) do Código dos Contratos Públicos",,,,,,Não aplicável.,Não aplicável.,FALSE
Medicamentos Exclusivos B. Braun,Ajuste Direto Regime Geral,Aquisição de bens móveis,"33600000-6, Produtos farmacêuticos","Centro Hospitalar Vila Nova de Gaia - Espinho, E. P. E. (508142156)","B. Braun Medical, Lda. (501506543)","17.680,46 €",06-02-2018,18-01-2018,365 dias,"Portugal, Porto, Vila Nova de Gaia","Artigo 24.º, n.º 1, alínea e) do Código dos Contratos Públicos",,,,,,Não aplicável.,Não aplicável.,FALSE
1056418 - Fosfomicina 1G pó sol inj IV - AUE 1887 - Wepclinical,Ajuste Direto Regime Geral,Aquisição de bens móveis,"33600000-6, Produtos farmacêuticos","Centro Hospitalar Vila Nova de Gaia - Espinho, E. P. E. (508142156)",WEP Clinical (944893866),"9.360,00 €",06-02-2018,05-02-2018,360 dias,"Portugal, Porto, Vila Nova de Gaia","Artigo 24.º, n.º 1, alínea e) do Código dos Contratos Públicos",,,,,,Não aplicável.,Não aplicável.,FALSE
AD 1011018 - Aquisição de Medicamentos Exclusivos Labesfal,Ajuste Direto Regime Geral,Aquisição de bens móveis,"33600000-6, Produtos farmacêuticos","Centro Hospitalar Vila Nova de Gaia - Espinho, E. P. E. (508142156)","Labesfal - Laboratórios Almiro, S.A. (501169580)","90.837,80 €",06-02-2018,18-01-2018,365 dias,"Portugal, Porto, Vila Nova de Gaia","Artigo 24.º, n.º 1, alínea e) do Código dos Contratos Públicos",,,,,,Não aplicável.,Não aplicável.,FALSE
1013818- Medicamentos Exclusivos de Empresa Zanbom,Ajuste Direto Regime Geral,Aquisição de bens móveis,"33600000-6, Produtos farmacêuticos",Centro Hospitalar Vila Nova de Gaia (CHNVG) (508142156),"Zanbom - Produtos Farmacêuticos, Lda. (502155930)","16.617,50 €",06-02-2018,18-01-2018,365 dias,"Portugal, Porto, Vila Nova de Gaia","Artigo 24.º, n.º 1, alínea e) do Código dos Contratos Públicos",,,,,,Não aplicável.,Não aplicável.,FALSE
AD 2014818/ 1014918 - Aquisição do Consumíveis Clínicos e Produtos de Farmácia (Não Medicamentos) e Assistência Técnica para Equipamentos de Hemodiálise,Ajuste Direto Regime Geral,Aquisição de bens móveis,"33000000-0, Equipamento médico, medicamentos e produtos para cuidados pessoais","Centro Hospitalar Vila Nova de Gaia - Espinho, E. P. E. (508142156)","Fresenius Medical Care Portugal, S.A. (503070220)","158.620,62 €",05-02-2018,18-01-2018,365 dias,"Portugal, Porto, Vila Nova de Gaia","Artigo 24.º, n.º 1, alínea e) do Código dos Contratos Públicos",,,,,,Não aplicável.,Não aplicável.,FALSE
Medicamentos Exclusivos Johnson,Ajuste Direto Regime Geral,Aquisição de bens móveis,"33600000-6, Produtos farmacêuticos","Centro Hospitalar Vila Nova de Gaia - Espinho, E. P. E. (508142156)","Johnson & Johnson, Lda (501506543)","40.860,00 €",05-02-2018,18-01-2018,365 dias,"Portugal, Porto, Vila Nova de Gaia","Artigo 24.º, n.º 1, alínea e) do Código dos Contratos Públicos",,,,,,Não aplicável.,Não aplicável.,FALSE
Medicamentos Exclusivos Olympus,Ajuste Direto Regime Geral,Aquisição de bens móveis,"33600000-6, Produtos farmacêuticos","Centro Hospitalar Vila Nova de Gaia - Espinho, E. P. E. (508142156)",Olympus Iberia SAL - Sucursal em Portugal (980474710),"10.274,15 €",05-02-2018,18-01-2018,365 dias,"Portugal, Porto, Vila Nova de Gaia","Artigo 24.º, n.º 1, alínea e) do Código dos Contratos Públicos",,,,,,Não aplicável.,Não aplicável.,FALSE
Medicamentos Exclusivos Lusopalex,Ajuste Direto Regime Geral,Aquisição de bens móveis,"33600000-6, Produtos farmacêuticos","Centro Hospitalar Vila Nova de Gaia - Espinho, E. P. E. (508142156)","Lusopalex, Lda. (503531588)","30.290,00 €",05-02-2018,18-01-2018,365 dias,"Portugal, Porto, Vila Nova de Gaia","Artigo 24.º, n.º 1, alínea e) do Código dos Contratos Públicos",,,,,,Não aplicável.,Não aplicável.,FALSE
AD 1010618 - Aquisição de Medicamentos Exclusivos da Empresa Ef Eisai,Ajuste Direto Regime Geral,Aquisição de bens móveis,"33600000-6, Produtos farmacêuticos","Centro Hospitalar Vila Nova de Gaia - Espinho, E. P. E. (508142156)","Eisai Farmacêutica Unipessoal, Lda. (507847660)","41.415,00 €",05-02-2018,18-01-2018,365 dias,"Portugal, Porto, Vila Nova de Gaia","Artigo 24.º, n.º 1, alínea e) do Código dos Contratos Públicos",,,,,,Não aplicável.,Não aplicável.,FALSE
Aquisição de Serviços de manutenção software GIAF - umc ref. 00166_2017,Ajuste Direto Regime Geral,Aquisição de serviços,"50000000-5, Serviços de reparação e manutenção","Centro Hospitalar Vila Nova de Gaia - Espinho, E. P. E. (508142156)",Indra Sistemas Portugal S.A. (506176142),"2.392,13 €",05-02-2018,01-02-2018,365 dias,"Portugal, Porto, Vila Nova de Gaia","Artigo 24.º, n.º 1, alínea e) do Código dos Contratos Públicos",,,,,,Não aplicável.,Não aplicável.,FALSE
