freguesia,acronym,validVotesPercentage,votes,dicofre
Biscoitos,PS,44.58,107,430202
Biscoitos,PPD/PSD.CDS-PP,36.67,88,430202
Biscoitos,L,3.75,9,430202
Biscoitos,B.E.,3.33,8,430202
Biscoitos,PCP-PEV,3.33,8,430202
Biscoitos,MPT,2.5,6,430202
Biscoitos,PCTP/MRPP,1.67,4,430202
Biscoitos,PAN,1.25,3,430202
Biscoitos,PDA,0.83,2,430202
Biscoitos,PTP,0.83,2,430202
Biscoitos,PND,0.42,1,430202
Biscoitos,PPM,0.42,1,430202
Biscoitos,PPV,0.42,1,430202
Biscoitos,MAS,0,0,430202
Biscoitos,PNR,0,0,430202
Biscoitos,POUS,0,0,430202
