freguesia,acronym,validVotesPercentage,votes,dicofre
Carregal do Sal,PPD/PSD,38.61,532,180208
Carregal do Sal,PS,36.28,500,180208
Carregal do Sal,B.E.,10.89,150,180208
Carregal do Sal,CDS-PP,4.79,66,180208
Carregal do Sal,PAN,2.39,33,180208
Carregal do Sal,CH,1.45,20,180208
Carregal do Sal,PCP-PEV,1.31,18,180208
Carregal do Sal,PURP,0.65,9,180208
Carregal do Sal,L,0.58,8,180208
Carregal do Sal,PCTP/MRPP,0.51,7,180208
Carregal do Sal,A,0.44,6,180208
Carregal do Sal,IL,0.44,6,180208
Carregal do Sal,PPM,0.44,6,180208
Carregal do Sal,PDR,0.36,5,180208
Carregal do Sal,R.I.R.,0.29,4,180208
Carregal do Sal,NC,0.22,3,180208
Carregal do Sal,PNR,0.15,2,180208
Carregal do Sal,PTP,0.15,2,180208
Carregal do Sal,JPP,0.07,1,180208
Carregal do Sal,MPT,0,0,180208
