Objeto do Contrato,Tipo de Procedimento,Tipo(s) de Contrato,CPVs,Entidade(s) Adjudicante(s),Entidade(s) Adjudicatária(s),Preço Contratual,Data de Publicação,Data de Celebração do Contrato,Prazo de Execução,Local de Execução,Fundamentação,Data de Fecho do Contrato,Preço Total Efetivo,Causas das Alterações ao Prazo,Causas das Alterações ao Preço,Estado,N.º registo do Acordo Quadro,Descrição do Acordo Quadro,Procedimento Centralizado
SISTEMA DE INFORMAÇÃO DE DESCOMISSIONAMENTO DE MEDICAMENTOS,Ajuste Direto Regime Geral,Aquisição de bens móveis,"48000000-8, Pacotes de software e sistemas de informação","Centro Hospitalar de Setúbal, E. P. E. (507606787)",BIQ. CONSULT DE ENG E GESTÃO IND (504105337),"9.980,00 €",05-02-2019,05-02-2019,30 dias,"Portugal, Setúbal, Setúbal","Artigo 26.º, n.º 1, alínea a) do Código dos Contratos Públicos",,,,,,Não aplicável.,Não aplicável.,FALSE
"BENZIDAMINA 1,5MGml SOL LAV BOCA FR 240 ML BISACODILO,10MG,SUP. BISACODILO,5MG,COMP BUTILESCOPOLAMINA,10MG,COMP BUTILESCOPOLAMINA,20MG/1 ML SOL INJ FR 1ML IM IV CARVAO ACTIVADO,emb DOMPERIDONA 1 MG/ML SUSP ORAL FR 200ML DOMPERIDONA,10MG,COMP ESOMEPRAZOLE 20 MG CAP ESOMEPRAZOLE 40 MG PO SOL INJ FR IV GELATINA  78MG/6,5+GLICEROL5532MG/6,5G GEL RECTCÂNULA 6,5G HIDROXIDO ALUMINIO COLOIDAL,240MG,COMP LACTULOSE 500MG/ML XAR FR 200ML LACTULOSE 7500MG/15ML XAR SAQ LOPERAMIDA (CLORIDRATO) 2 MG COMP MESSALAZINA  500MG,COMP GR MICONAZOL 20  MG/G GEL ORAL BISN 30 GR MISOPROSTOL 0,2 mg«»200mcg comp. PICOSS.SOD.7,5 MG/ML SOL ORAL FR 30 ML PREDNISOLONA 1,9 MG/G + CHINCHOCAÍNA 5 MG /G POM RECT BISN 30 G RANITIDINA 50 MG / 2 ML SOL INJ FR 2 ML IM IV SOLUCAO ELEC. LAV. GASTROINT. SOL ORAL SAQ. SUCRALFATO 1000 MG / 5 ML SUP ORAL SAQ",Ao abrigo de acordo-quadro (art.º 259.º),Aquisição de bens móveis,"33600000-6, Produtos farmacêuticos","Centro Hospitalar de Setúbal, E. P. E. (507606787)","JOHNSON JOHNSON MEDICAL (500153370), Bayer Portugal SA (500043256), FERRING PORTUGUESA-PROD. FARMAC.SOC.UNIP.,LDA. (502034831), SANOFI - PRODUTOS FARMACÊUTICOS, LDA. (500134960), Laboratórios Normon, SA (505654156), angelini (500583650), Mylan, Lda (502248793), LAB. MEDINFAR- PROD.FARMACEUT.  SA (500384045), FERRAZ LYNCE SA (500113270), Overpharma, Lda. (505792362), DLA - Farmacêutica, S.A. (503894427), GENERIS - FARMACEUTICA SA (508107997), RATIOPHARM- COM.IND.PROD.FARMAC., L (502414910), Labesfal- laboratórios Almiro SA (501169580), LAB. PFIZER, LDA (500162166)","55.458,73 €",05-02-2019,31-01-2019,365 dias,"Portugal, Setúbal, Setúbal",Artigo 259.º do Código dos Contratos Públicos,,,,,,2222779,Medicamentos do aparelho digestivo,FALSE
"AGUA DESTILADA,0,FR.CAN. 1000ML AGUA ESTERELIZADA P.P.I.,0,FR 100ML CLORETO SODIO 9 MG/ML SOL INJ .FR 1000ML CLORETO SODIO 9MG/ML SOL INJ  FR. 100ML CLORETO SODIO 9MG/ML SOL INJ  FR. 500ML CLORETO SODIO 9MG/ML SOL INJ FR. 250ML GLUCOSE 5% CL.SODIO 0,45%,0,FR. 500ML GLUCOSE 5% CL.SODIO 0,9%,0,FR. 1000ML POLIELECTROLITICO,0,FR. 1000ML CEFAZOLINA 1000 MG PÓ SOL INJ FR IV CLORETO SODIO 9 MG/ML SOL INJ FR 10ML IV GENTAMICINA,80MG,/2ML SOL INJ FR 2MLIM IV PROPOFOL,10 MG/ ML EMIUL INJ FR 20 ML IV RISPERIDONA 1 MG/ML SOL ORAL FR 30 ML HALOPERIDOL 10 MG COMP Paliperidona 3 mg Comp LP FLUCONAZOL 2MG/ML SOL INJ ,FR 50ML IV ATOSIBANO   6,75 MG  / 0,9ML SOL INJ FR 0,9ML IV ATOSIBANO  37,5 MG /    5ML   SOL INJ FR 5ML IV CLORETO POTASSIO 750MG/10 MLSOL INJ  - 1MEQ=1ML=75MG ENOXAPARINA SODICA ,60MG/0.6/ML,SOL. INJ. SER 0.6ML, SC",Ao abrigo de acordo-quadro (art.º 259.º),Aquisição de bens móveis,"33600000-6, Produtos farmacêuticos","Centro Hospitalar de Setúbal, E. P. E. (507606787)","FERRING PORTUGUESA-PROD. FARMAC.SOC.UNIP.,LDA. (502034831), Labesfal- laboratórios Almiro SA (501169580), PHARMAKERN PORTUGAL, Produtos Farmacêuticos Soc. Unipessoal Lda (507002571), Baxter Médico Farmacêutica, Lda. (503347345), SANOFI - PRODUTOS FARMACÊUTICOS, LDA. (500134960), JANSSEN-CILAG FARMACEUTICA LDA (500189412), HIKMA Farmacêutica (Portugal), S.A. (502266791), Overpharma, Lda. (505792362)","15.006,20 €",05-02-2019,16-01-2019,10 dias,"Portugal, Setúbal, Setúbal",Artigo 259.º do Código dos Contratos Públicos,,,,,,3430281,CP 2018/55,FALSE
"Citrato de sódio 38 mg/ml Sol inj Fr 1500 ml IV DINITRATO ISOSSORBIDO,10MG/10ML SOL INJ FR 10ML IV",Ajuste Direto Regime Geral,Aquisição de bens móveis,"33600000-6, Produtos farmacêuticos","Centro Hospitalar de Setúbal, E. P. E. (507606787)","SPCARE (508284872), FRESENIUS MEDICAL CARE PORTUGAL, S.A. (503070220)","10.790,40 €",04-02-2019,21-01-2019,10 dias,"Portugal, Setúbal, Setúbal","Artigo 21.º, n.º 1, alínea c) do Código dos Contratos Públicos",,,,,,Não aplicável.,Não aplicável.,FALSE
"Emtricitabina 200 mg + Tenofovir alafenamida 25 mg Comp GLUCONATO DE CÁLCIO  97 MG/MLSOL INJ FR 10ML IV PARACETAMOL 10 MG/ML SOL INJ FR 100 ML IV MEROPENEM 1000 MG PÓ SOL INJ FR IV PROPOFOL,10 MG/ ML EMIUL INJ FR 50 ML IV",Ao abrigo de acordo-quadro (art.º 259.º),Aquisição de bens móveis,"33600000-6, Produtos farmacêuticos","Centro Hospitalar de Setúbal, E. P. E. (507606787)","FRESENIUS KABI PHARMA PORTUGAL,LDA (504293753), GILEAD SCIENCES, LDA (503604704), B BRAUN MEDICAL LDA (501506543)","11.615,20 €",04-02-2019,21-01-2019,10 dias,"Portugal, Setúbal, Setúbal",Artigo 259.º do Código dos Contratos Públicos,,,,,,2545980,CP 2017/61 - Acordo quadro para fornecimento de Medicamentos Diversos   às Instituições e Serviços do Serviço Nacional de Saúde,FALSE
"Dolutegravir 50 mg + Abacavir 600 mg + Lamivudina 300 mg Comp Emtricitabina 200 mg + Rilpivirina 25 mg + Tenofovir alafenamida 25 mg Comp LAMIVUDINA,150MG,COMP.",Ao abrigo de acordo-quadro (art.º 259.º),Aquisição de bens móveis,"33600000-6, Produtos farmacêuticos","Centro Hospitalar de Setúbal, E. P. E. (507606787)","GILEAD SCIENCES, LDA (503604704), TECNIMEDE, SOC TECNICO-MED, SA (500626413), VIIVHIV HEALTHCARE, UNIPESSOAL, LDA (509117961)","178.727,40 €",04-02-2019,14-01-2019,10 dias,"Portugal, Setúbal, Setúbal",Artigo 259.º do Código dos Contratos Públicos,,,,,,2545980,CP 2017/61 - Acordo quadro para fornecimento de Medicamentos Diversos   às Instituições e Serviços do Serviço Nacional de Saúde,FALSE
"CLONAZEPAM,2MG,COMP Paliperidona 525 mg Susp inj LP Ser 2.625 ml IM Acetato de cálcio 435 mg + Carbonato de magnésio 235 mg Comp Dasatinib 80 mg Comp Lenalidomida 10 mg Cáps Mepolizumab 100 mg Pó sol inj Fr SC ALBUMINA HUMANA 200MG /ML SOL INJ FR 50ML IV TRASTUZUMAB EMTANSINA 100 MG Trastuzumab emtansina 160 mg Pó conc sol inj Fr IV ",Ao abrigo de acordo-quadro (art.º 259.º),Aquisição de bens móveis,"33600000-6, Produtos farmacêuticos","Centro Hospitalar de Setúbal, E. P. E. (507606787)","FRESENIUS MEDICAL CARE PORTUGAL, S.A. (503070220), BRISTOL - MYERS SQUIBB SA. (500048193), ROCHE Farmacêutica Química, Lda. (500233810), GlaxoSmithKline -Prod.Farm .Ldª (500139962), CSL BEHRING, LDA. (503047201), Celgene Sociedade Unipessoal, Lda. (507791690), JANSSEN-CILAG FARMACEUTICA LDA (500189412)","44.508,18 €",04-02-2019,24-01-2019,10 dias,"Portugal, Setúbal, Setúbal",Artigo 259.º do Código dos Contratos Públicos,,,,,,2969238,"CP 2017/6 - Acordo Quadro para fornecimento de Medicamentos do Foro Oncológico e Imunomoduladores, às Instituições e Serviços do Serviço Nacional de Saúde",FALSE
Material de consumo hoteleiro para o ano de 2019,Consulta Prévia,Aquisição de bens móveis,"39800000-0, Produtos de limpeza e polimento","Centro Hospitalar de Setúbal, E. P. E. (507606787)",Mundinter - Inter. Mundial Com. S.A. (500199906),"1.309,00 €",01-02-2019,24-01-2019,365 dias,"Portugal, Setúbal, Setúbal","Artigo 20.º, n.º 1, alínea c) do Código dos Contratos Públicos",,,,,,Não aplicável.,Não aplicável.,FALSE
Material de consumo hoteleiro para o ano de 2019,Consulta Prévia,Aquisição de bens móveis,"39830000-9, Produtos de limpeza","Centro Hospitalar de Setúbal, E. P. E. (507606787)","João Antunes Amaro, Lda (500149003)","11.142,91 €",01-02-2019,24-01-2019,365 dias,"Portugal, Setúbal, Setúbal","Artigo 20.º, n.º 1, alínea c) do Código dos Contratos Públicos",,,,,,Não aplicável.,Não aplicável.,FALSE
Material de consumo hoteleiro para o ano de 2019,Consulta Prévia,Aquisição de bens móveis,"33180000-5, Apoio funcional","Centro Hospitalar de Setúbal, E. P. E. (507606787)","Hr- Hospitalar, Lda (501895558)","1.504,15 €",01-02-2019,24-01-2019,365 dias,"Portugal, Setúbal, Setúbal","Artigo 20.º, n.º 1, alínea c) do Código dos Contratos Públicos",,,,,,Não aplicável.,Não aplicável.,FALSE
Material de consumo hoteleiro para o ano de 2019,Consulta Prévia,Aquisição de bens móveis,"33700000-7, Produtos para cuidados pessoais","Centro Hospitalar de Setúbal, E. P. E. (507606787)","Exaclean, Lda (508758190)","1.974,88 €",01-02-2019,24-01-2019,365 dias,"Portugal, Setúbal, Setúbal","Artigo 20.º, n.º 1, alínea c) do Código dos Contratos Públicos",,,,,,Não aplicável.,Não aplicável.,FALSE
Material de consumo hoteleiro para o ano de 2019,Consulta Prévia,Aquisição de bens móveis,"33000000-0, Equipamento médico, medicamentos e produtos para cuidados pessoais","Centro Hospitalar de Setúbal, E. P. E. (507606787)","Eugénio Pereira, Lda (503989525)","2.156,00 €",01-02-2019,24-01-2019,365 dias,"Portugal, Setúbal, Setúbal","Artigo 20.º, n.º 1, alínea c) do Código dos Contratos Públicos",,,,,,Não aplicável.,Não aplicável.,FALSE
material laboratório - anatomia,Consulta Prévia,Aquisição de bens móveis,"33700000-7, Produtos para cuidados pessoais","Centro Hospitalar de Setúbal, E. P. E. (507606787)",VWR INTERNATIONAL (503842770),"6.489,62 €",31-01-2019,28-01-2019,365 dias,"Portugal, Setúbal, Setúbal","Artigo 20.º, n.º 1, alínea c) do Código dos Contratos Públicos",,,,,,Não aplicável.,Não aplicável.,FALSE
material laboratório - anatomia,Consulta Prévia,Aquisição de bens móveis,"33160000-9, Técnicas cirúrgicas","Centro Hospitalar de Setúbal, E. P. E. (507606787)",Normax (500203130),"951,30 €",31-01-2019,28-01-2019,365 dias,"Portugal, Setúbal, Setúbal","Artigo 20.º, n.º 1, alínea c) do Código dos Contratos Públicos",,,,,,Não aplicável.,Não aplicável.,FALSE
material laboratório - anatomia,Consulta Prévia,Aquisição de bens móveis,"33141000-0, Material médico não químico descartável e produtos hematológicos","Centro Hospitalar de Setúbal, E. P. E. (507606787)",j.m. -imp.rep.lda (504855107),"158,32 €",31-01-2019,28-01-2019,365 dias,"Portugal, Setúbal, Setúbal","Artigo 20.º, n.º 1, alínea c) do Código dos Contratos Públicos",,,,,,Não aplicável.,Não aplicável.,FALSE
material laboratório - anatomia,Consulta Prévia,Aquisição de bens móveis,"33000000-0, Equipamento médico, medicamentos e produtos para cuidados pessoais","Centro Hospitalar de Setúbal, E. P. E. (507606787)","Enzifarma-Diagnostica e Farmaceutica, SA (503636975)","270,00 €",31-01-2019,28-01-2019,365 dias,"Portugal, Setúbal, Setúbal","Artigo 20.º, n.º 1, alínea c) do Código dos Contratos Públicos",,,,,,Não aplicável.,Não aplicável.,FALSE
material laboratório - anatomia,Consulta Prévia,Aquisição de bens móveis,"33140000-3, Material médico de consumo","Centro Hospitalar de Setúbal, E. P. E. (507606787)",AZOLAB-COM.MAT.LAB.LDA (506332918),"62,11 €",31-01-2019,28-01-2019,365 dias,"Portugal, Setúbal, Setúbal","Artigo 20.º, n.º 1, alínea c) do Código dos Contratos Públicos",,,,,,Não aplicável.,Não aplicável.,FALSE
