Objeto do Contrato,Tipo de Procedimento,Tipo(s) de Contrato,CPVs,Entidade(s) Adjudicante(s),Entidade(s) Adjudicatária(s),Preço Contratual,Data de Publicação,Data de Celebração do Contrato,Prazo de Execução,Local de Execução,Fundamentação,Data de Fecho do Contrato,Preço Total Efetivo,Causas das Alterações ao Prazo,Causas das Alterações ao Preço,Estado,N.º registo do Acordo Quadro,Descrição do Acordo Quadro,Procedimento Centralizado
RITUXIMAB 1400 MG SC,Ajuste Direto Regime Geral,Aquisição de bens móveis,"33690000-3, Medicamentos vários","Centro Hospitalar de Setúbal, E. P. E. (507606787)",ROCHE FARMACÊUTICA QUIMICA (500233810),"384.217,60 €",12-03-2016,24-02-2016,365 dias,"Portugal, Setúbal, Setúbal","Artigo 24.º, n.º 1, alínea e) do Código dos Contratos Públicos","","",,"",,Não aplicável.,Não aplicável.,FALSE
Concurso Público 110001/2015 Fornecimento Sacos de Sangue,Concurso público,Aquisição de bens móveis,"33000000-0, Equipamento médico, medicamentos e produtos para cuidados pessoais","Hospital Garcia de Orta, E. P. E. (506361470), Centro Hospitalar Barreiro Montijo, E. P. E. (509186998), Centro Hospitalar de Setúbal, E. P. E. (507606787)","FRESENIUS KABI PHARMA PORTUGAL, LDA. (504293753)","36.729,00 €",11-03-2016,29-12-2014,365 dias,"Portugal, Setúbal, Barreiro","Artigo 20.º, n.º 1, alínea b) do Código dos Contratos Públicos",31-12-2015,"36.279,00 €",,"redução de consumos e artigos do CHBM, EPE; HGO, EPE e CHS, EPE   ",,Não aplicável.,Não aplicável.,TRUE
14 equipamentos Philips,Ajuste Direto Regime Geral,Aquisição de serviços,"50000000-5, Serviços de reparação e manutenção","Centro Hospitalar de Setúbal, E. P. E. (507606787)","Philips Portuguesa, SA (500216843)","83.852,64 €",10-03-2016,27-01-2015,365 dias,"Portugal, Setúbal, Setúbal","Artigo 24.º, n.º 1, alínea e) do Código dos Contratos Públicos","","",,"",,Não aplicável.,Não aplicável.,FALSE
Serviços Médicos Anestesia - ano 2016,Ajuste Direto Regime Geral,Aquisição de serviços,"85000000-9, Serviços de saúde e acção social","Centro Hospitalar de Setúbal, E. P. E. (507606787)",Carvalho Araujo Lda (507606671),"23.040,00 €",08-03-2016,17-02-2016,366 dias,"Portugal, Setúbal, Setúbal","Artigo 20.º, n.º 1, alínea a) do Código dos Contratos Públicos","","",,"",,Não aplicável.,Não aplicável.,FALSE
ELVITEGRAVIR 150MG+COBICISTATE 150MG+EMTRICITABINA 200MG+TENOFOVIR 245MG,Ajuste Direto Regime Geral,Aquisição de bens móveis,"33690000-3, Medicamentos vários","Centro Hospitalar de Setúbal, E. P. E. (507606787)",GILEAD SCIENCES LDA (503604704),"947.484,00 €",08-03-2016,12-02-2016,365 dias,"Portugal, Setúbal, Setúbal","Artigo 24.º, n.º 1, alínea e) do Código dos Contratos Públicos","","",,"",,Não aplicável.,Não aplicável.,FALSE
TENOFOVIR 245 MG COMP,Ajuste Direto Regime Geral,Aquisição de bens móveis,"33690000-3, Medicamentos vários","Centro Hospitalar de Setúbal, E. P. E. (507606787)",GILEAD SCIENCES LDA (503604704),"204.019,20 €",08-03-2016,11-02-2016,365 dias,"Portugal, Setúbal, Setúbal","Artigo 24.º, n.º 1, alínea e) do Código dos Contratos Públicos","","",,"",,Não aplicável.,Não aplicável.,FALSE
Serviços Vigilância e Segurança ano 2016,Ajuste Direto Regime Geral,Aquisição de serviços,"98000000-3, Outros serviços comunitários, sociais e pessoais","Centro Hospitalar de Setúbal, E. P. E. (507606787)",Prestibel (501326456),"455.832,36 €",07-03-2016,28-01-2016,366 dias,"Portugal, Setúbal, Setúbal","Artigo 20.º, n.º 1, alínea a) do Código dos Contratos Públicos","","",,"",,Não aplicável.,Não aplicável.,FALSE
Aquisição de Gas Natural para o CHPL Ano 2015-(UMC-SG),Concurso público,Aquisição de bens móveis,"09123000-7, Gás natural","SUCH - Serviço de Utilização Comum dos Hospitais (500900469), Administração Regional de Saúde do Centro, I. P. (503122165), Instituto Nacional de Saúde Dr. Ricardo Jorge, I. P. (501427511), Hospital do Espírito Santo de Évora, E. P. E. (508085888), Secretaria-Geral do Ministério da Saúde (600080684), Hospital Arcebispo João Crisóstomo (501626123), Centro Hospitalar do Médio Tejo, E. P. E. (506361608), Instituto Português de Oncologia do Porto Francisco Gentil, E. P. E. (506362299), Centro Hospitalar Psiquiátrico de Lisboa (508338476), Centro Hospitalar Póvoa de Varzim - Vila do Conde, E. P. E. (508741823), Hospital Santa Maria Maior, E. P. E. (506361381), Administração Regional de Saúde de Lisboa e Vale do Tejo, I. P. (503148776), Centro Hospitalar do Oeste (510412009), Serviço de Intervenção nos Comportamentos Aditivos e nas Dependências (600084884), Centro Hospitalar Vila Nova de Gaia - Espinho, E. P. E. (508142156), Centro Hospitalar do Alto Ave, E. P. E. (508080827), Centro Hospitalar do Tâmega e Sousa, E. P. E. (508318262), Centro Hospitalar Tondela-Viseu, E. P. E. (509822940), Hospital de Magalhães Lemos, E. P. E. (502828790), Centro Hospitalar do Baixo Vouga, E. P. E (CHBV, E. P. E.) (510123210), Hospital Distrital de Santarém, E. P. E. (506361462), Unidade Local de Saúde do Alto Minho, E. P. E. (508786193), Centro Hospitalar de Setúbal, E. P. E. (507606787), Centro Hospitalar do Algarve, E. P. E. (510745997), Hospital Garcia de Orta, E. P. E. (506361470), Administração Regional de Saúde do Norte, I. P. (503135593), Hospital Dr. Francisco Zagalo (501510150), Instituto Nacional de Emergência Médica, I. P. (501356126), Centro Hospitalar e Universitário de Coimbra, E. P. E. (510103448), Centro Hospitalar de Lisboa Central, E. P. E. (508080142), Centro Hospitalar de Lisboa Ocidental, E. P. E. (507618319), Instituto Português de Oncologia de Lisboa Francisco Gentil, E. P. E. (506361616), Centro Hospitalar de Entre o Douro e Vouga, E.P.E. (508878462), Hospital de José Luciano de Castro (501613021), Instituto Português do Sangue e da Transplantação, I. P. (502423943), Centro Hospitalar Cova da Beira, E. P. E. (506361659), Direcção-Geral da Saúde (600037100), Centro Hospitalar de Leiria, E. P. E. (509822932), Centro Hospitalar de Trás-os-Montes e Alto Douro, E. P. E. (508100496), Centro Hospitalar Barreiro Montijo, E. P. E. (509186998), Centro Hospitalar Porto, E. P. E. (508331471), Instituto de Oftalmologia Dr. Gama Pinto (600000052), Unidade Local de Saúde de Castelo Branco, E. P. E. (509309844), Centro Hospitalar Lisboa Norte, E. P. E. (508481287), Unidade Local de Saúde da Guarda, E. P. E. (508752000), Centro Hospitalar de São João, E. P. E. (509821197), Centro Hospitalar do Médio Ave, E. P. E. (508093937), Instituto Português de Oncologia de Coimbra Francisco Gentil, E. P. E. (506361438), Unidade Local de Saúde do Nordeste, E. P. E (509932584)","EDP Comercial, S.A (503504564)","579.733,88 €",07-03-2016,30-01-2015,365 dias,"Portugal, Lisboa, Lisboa",Artigo 259.º do Código dos Contratos Públicos,31-12-2015,"525.715,02 €",,Valor corresponde ao Faturado (inferior ao estimado),,Não aplicável.,Não aplicável.,TRUE
Prestação Cuidados aos doentes de evolução prolongada do departamento psiquiatria no CHS,Ajuste Direto Regime Geral,Aquisição de serviços,"98000000-3, Outros serviços comunitários, sociais e pessoais","Centro Hospitalar de Setúbal, E. P. E. (507606787)",Associação saúde Mental Fernando Ilharco (501262040),"40.768,00 €",04-03-2016,26-02-2016,182 dias,"Portugal, Setúbal, Setúbal","Artigo 20.º, n.º 1, alínea a) do Código dos Contratos Públicos","","",,"",,Não aplicável.,Não aplicável.,FALSE
Serviços Médicos Imagiologia,Ajuste Direto Regime Geral,Aquisição de serviços,"85000000-9, Serviços de saúde e acção social","Centro Hospitalar de Setúbal, E. P. E. (507606787)",IMAPALAS (510889352),"17.280,00 €",03-03-2016,25-02-2016,366 dias,"Portugal, Setúbal, Setúbal","Artigo 20.º, n.º 1, alínea a) do Código dos Contratos Públicos","","",,"",,Não aplicável.,Não aplicável.,FALSE
Renovação da assinatura anual - Clinicalkey,Ajuste Direto Regime Geral,Aquisição de serviços,"72000000-5, Serviços de TI: consultoria, desenvolvimento de software, Internet e apoio","Centro Hospitalar de Setúbal, E. P. E. (507606787)",Lusodoc (502609982),"28.400,06 €",02-03-2016,17-02-2016,349 dias,"Portugal, Setúbal, Setúbal","Artigo 20.º, n.º 1, alínea a) do Código dos Contratos Públicos","","",,"",,Não aplicável.,Não aplicável.,FALSE
SERVIÇOS ESPECIALIZADOS MANUTENÇÃO - TECNICO AVAC,Ajuste Direto Regime Geral,Aquisição de serviços,"50000000-5, Serviços de reparação e manutenção","Centro Hospitalar de Setúbal, E. P. E. (507606787)",such (500900469),"38.200,00 €",02-03-2016,16-02-2016,366 dias,"Portugal, Setúbal, Setúbal","Artigo 20.º, n.º 1, alínea a) do Código dos Contratos Públicos","","",,"",,Não aplicável.,Não aplicável.,FALSE
obras de beneficiação do chão do serviço de esterilização,Ajuste Direto Regime Geral,Empreitadas de obras públicas,"45000000-7, Construção","Centro Hospitalar de Setúbal, E. P. E. (507606787)","Construções V. Repolho  Cruz, Lda (506286380)","10.410,00 €",02-03-2016,24-02-2016,30 dias,"Portugal, Setúbal, Setúbal","Artigo 19.º, alínea a) do Código dos Contratos Públicos","","",,"",,Não aplicável.,Não aplicável.,FALSE
