Objeto do Contrato,Tipo de Procedimento,Tipo(s) de Contrato,CPVs,Entidade(s) Adjudicante(s),Entidade(s) Adjudicatária(s),Preço Contratual,Data de Publicação,Data de Celebração do Contrato,Prazo de Execução,Local de Execução,Fundamentação,Data de Fecho do Contrato,Preço Total Efetivo,Causas das Alterações ao Prazo,Causas das Alterações ao Preço,Estado,N.º registo do Acordo Quadro,Descrição do Acordo Quadro,Procedimento Centralizado
Aquisição de imunoglobulina 50 mg/ml sol. inj. fr. 200 m,Ajuste Direto Regime Geral,Aquisição de bens móveis,"33690000-3, Medicamentos vários","Centro Hospitalar Lisboa Norte, E. P. E. (508481287)",OCTAPHARMA - PRODUTOS FARMACEUTICOS (502820780),"12.231,00 €",10-01-2018,14-12-2017,1 dias,"Portugal, Lisboa, Lisboa","Artigo 24.º, n.º 1, alínea e) do Código dos Contratos Públicos",,,,,,Não aplicável.,Não aplicável.,FALSE
"Fornecimento e montagem de um sistema de controlo de acesso a pessoas, para uma porta de entrada do Bloco de Cirurgia Plástica instalada no Piso 7 ao lado do Elevador 11.",Ajuste Direto Regime Geral,Empreitadas de obras públicas,"45316210-0, Instalação de equipamento de controlo do tráfego","CENTRO HOSPITALAR LISBOA NORTE, EPE (508481287)","Paulo Jesus Costa Unipessoal, Lda (510167780)","1.698,40 €",10-01-2018,10-01-2018,20 dias,"Portugal, Lisboa, Lisboa","Artigo 19.º, alínea a) do Código dos Contratos Públicos",,,,,,Não aplicável.,Não aplicável.,FALSE
189G000059 - Aquisição de serviços de manutenção às portas automáticas para o ano de 2018,Ajuste Direto Regime Geral,Aquisição de serviços,"50710000-5, Serviços de reparação e manutenção de equipamento eléctrico e mecânico em edifícios","CENTRO HOSPITALAR LISBOA NORTE, EPE (508481287)","Hemmer - Serviços, Lda. (502318929)","3.402,00 €",10-01-2018,10-01-2018,355 dias,"Portugal, Lisboa, Lisboa","Artigo 20.º, n.º 1, alínea a) do Código dos Contratos Públicos",,,,,,Não aplicável.,Não aplicável.,FALSE
189G000027 - Aquisição de serviço de manutenção ao equipamento de distribuição automática de medicação para o ano de 2018,Ajuste Direto Regime Geral,Aquisição de serviços,"50430000-8, Serviços de reparação e manutenção de equipamento de precisão","CENTRO HOSPITALAR LISBOA NORTE, EPE (508481287)","GRIFOLS PORTUGAL - PROD. FARMAC. E HOSP., LDA. (502041285)","50.789,28 €",10-01-2018,05-01-2018,360 dias,"Portugal, Lisboa, Lisboa","Artigo 24.º, n.º 1, alínea e) do Código dos Contratos Públicos",,,,,,Não aplicável.,Não aplicável.,FALSE
Aquisição de material para cardiologia,Ajuste Direto Regime Geral,Aquisição de bens móveis,"33140000-3, Material médico de consumo","Centro Hospitalar Lisboa Norte, E. P. E. (508481287)",Merit Medical (513157816),"6.110,00 €",10-01-2018,10-01-2018,1 dias,"Portugal, Lisboa, Lisboa","Artigo 24.º, n.º 1, alínea e) do Código dos Contratos Públicos",,,,,,Não aplicável.,Não aplicável.,FALSE
189G000020 - Aquisição de serviços de manutenção ao equipamento de ecografia Toshiba para o ano de 2018,Ajuste Direto Regime Geral,Aquisição de serviços,"50421000-2, Serviços de reparação e manutenção de equipamento médico","Centro Hospitalar Lisboa Norte, E. P. E. (508481287)",TOSHIBA MEDICAL SYSTEMS SA (980023700),"13.343,40 €",10-01-2018,02-01-2018,364 dias,"Portugal, Lisboa, Lisboa","Artigo 24.º, n.º 1, alínea e) do Código dos Contratos Públicos",,,,,,Não aplicável.,Não aplicável.,FALSE
Aquisição de tenofovir 245 mg comp.,Ajuste Direto Regime Geral,Aquisição de bens móveis,"33690000-3, Medicamentos vários","Centro Hospitalar Lisboa Norte, E. P. E. (508481287)","TEVA-PHARMA - PRODUTOS FARMACÊUTICOS, LDA. (507045491)","15.105,00 €",10-01-2018,04-01-2018,1 dias,"Portugal, Lisboa, Lisboa","Artigo 20.º, n.º 1, alínea a) do Código dos Contratos Públicos",,,,,,Não aplicável.,Não aplicável.,FALSE
Aquisição de fator IX recombinante 1000 UI Inj.,Ajuste Direto Regime Geral,Aquisição de bens móveis,"33690000-3, Medicamentos vários","Centro Hospitalar Lisboa Norte, E. P. E. (508481287)","PFIZER BIOFARMACEUTICA, SOCIEDADE UNIPESSOAL, LDA (513300376)","94.255,50 €",10-01-2018,10-01-2018,1 dias,"Portugal, Lisboa, Lisboa","Artigo 24.º, n.º 1, alínea e) do Código dos Contratos Públicos",,,,,,Não aplicável.,Não aplicável.,FALSE
ajuste Direto n.º 181G000202,Ajuste Direto Regime Geral,Aquisição de bens móveis,"33690000-3, Medicamentos vários","Centro Hospitalar Lisboa Norte, E. P. E. (508481287)",ZAMBON-PRODUTOS FARMACEUTICOS                      (502155930),"5.865,00 €",09-01-2018,09-01-2018,1 dias,"Portugal, Lisboa, Lisboa","Artigo 24.º, n.º 1, alínea e) do Código dos Contratos Públicos",,,,,,Não aplicável.,Não aplicável.,FALSE
Compra centralizada de Travectedina inj. 1 mg - AD-AC-2017-124,Ajuste Direto Regime Geral,Aquisição de bens móveis,"33690000-3, Medicamentos vários","Centro Hospitalar Lisboa Norte, E. P. E. (508481287)",Medac Sucursal em Portugal (980369959),"62.676,75 €",09-01-2018,04-12-2017,365 dias,"Portugal, Lisboa, Lisboa","Artigo 24.º, n.º 1, alínea e) do Código dos Contratos Públicos",,,,,,Não aplicável.,Não aplicável.,FALSE
Ajuste Direto n.º 171002926 - Compra centralizada CP2015/6 e CP2016/40 - P259-AC-2017-32,Ao abrigo de acordo-quadro (art.º 259.º),Aquisição de bens móveis,"33690000-3, Medicamentos vários","Centro Hospitalar Lisboa Norte, E. P. E. (508481287)",Medac Sucursal em Portugal (980369959),"24.000,00 €",09-01-2018,02-01-2018,25 dias,"Portugal, Lisboa, Lisboa",Artigo 259.º do Código dos Contratos Públicos,,,,,,1771819,CP 2015/6 - Acordo quadro para o fornecimento de Medicamentos do Foro Oncológico,FALSE
Aquisição de dois equipamentos de angiografia para o Serviço de Imagiologia Neurológica - MCDT´s - Angiografia Neurológica e para o Serviço de Imagiologia Geral - MCDT´s - Angiografia Geral,Ajuste Direto Regime Geral,Aquisição de bens móveis,"33111700-8, Sala de angiografia","CENTRO HOSPITALAR LISBOA NORTE, EPE (508481287)","PHILIPS PORTUGUESA, SA (500216843)","1.989.854,45 €",09-01-2018,04-01-2018,89 dias,"Portugal, Lisboa, Lisboa","Artigo 24.º, n.º 1, alínea b) do Código dos Contratos Públicos",,,,,,Não aplicável.,Não aplicável.,FALSE
Aquisição de afatinib 30 mg comp.,Ajuste Direto Regime Geral,Aquisição de bens móveis,"33690000-3, Medicamentos vários","Centro Hospitalar Lisboa Norte, E. P. E. (508481287)","UNILFARMA, LDA (500293023)","5.217,90 €",09-01-2018,09-01-2018,1 dias,"Portugal, Lisboa, Lisboa","Artigo 24.º, n.º 1, alínea e) do Código dos Contratos Públicos",,,,,,Não aplicável.,Não aplicável.,FALSE
Aquisição de actividade VWF teste 60 T,Ajuste Direto Regime Geral,Aquisição de bens móveis,"33696000-5, Reagentes e meios de contraste","Centro Hospitalar Lisboa Norte, E. P. E. (508481287)","Werfen Portugal, Ldª (501086110)","9.600,00 €",09-01-2018,09-01-2018,1 dias,"Portugal, Lisboa, Lisboa","Artigo 24.º, n.º 1, alínea e) do Código dos Contratos Públicos",,,,,,Não aplicável.,Não aplicável.,FALSE
Aquisição de tromboplastina 5x20 ml,Ajuste Direto Regime Geral,Aquisição de bens móveis,"33690000-3, Medicamentos vários","Centro Hospitalar Lisboa Norte, E. P. E. (508481287)","Werfen Portugal, Ldª (501086110)","9.000,00 €",09-01-2018,09-01-2018,1 dias,"Portugal, Lisboa, Lisboa","Artigo 24.º, n.º 1, alínea e) do Código dos Contratos Públicos",,,,,,Não aplicável.,Não aplicável.,FALSE
Aquisição de fator VIII plasma deficiente 1 ml,Ajuste Direto Regime Geral,Aquisição de bens móveis,"33690000-3, Medicamentos vários","Centro Hospitalar Lisboa Norte, E. P. E. (508481287)","Werfen Portugal, Ldª (501086110)","7.500,00 €",09-01-2018,09-01-2018,1 dias,"Portugal, Lisboa, Lisboa","Artigo 24.º, n.º 1, alínea e) do Código dos Contratos Públicos",,,,,,Não aplicável.,Não aplicável.,FALSE
Aquisição de linezolide sol. inj. 2 mg/ml saco 300 ml,Ajuste Direto Regime Geral,Aquisição de bens móveis,"33690000-3, Medicamentos vários","Centro Hospitalar Lisboa Norte, E. P. E. (508481287)","Generis Farmacêutica, SA (508107997)","3.360,00 €",09-01-2018,09-01-2018,1 dias,"Portugal, Lisboa, Lisboa","Artigo 24.º, n.º 1, alínea e) do Código dos Contratos Públicos",,,,,,Não aplicável.,Não aplicável.,FALSE
Aquisição de somatropina inj. 120 mg,Ajuste Direto Regime Geral,Aquisição de bens móveis,"33690000-3, Medicamentos vários","Centro Hospitalar Lisboa Norte, E. P. E. (508481287)",Lilly Portugal - Produtos Farmacêuticos Lda. (500165602),"1.857,51 €",09-01-2018,09-01-2018,1 dias,"Portugal, Lisboa, Lisboa","Artigo 24.º, n.º 1, alínea e) do Código dos Contratos Públicos",,,,,,Não aplicável.,Não aplicável.,FALSE
Aquisição de hemosil drvvt screen,Ajuste Direto Regime Geral,Aquisição de bens móveis,"33690000-3, Medicamentos vários","Centro Hospitalar Lisboa Norte, E. P. E. (508481287)","Werfen Portugal, Ldª (501086110)","5.100,00 €",09-01-2018,09-01-2018,1 dias,"Portugal, Lisboa, Lisboa","Artigo 24.º, n.º 1, alínea e) do Código dos Contratos Públicos",,,,,,Não aplicável.,Não aplicável.,FALSE
Aquisição de esfincter urinário artificial,Ajuste Direto Regime Geral,Aquisição de bens móveis,"33190000-8, Dispositivos e produtos médicos variados","Centro Hospitalar Lisboa Norte, E. P. E. (508481287)","BOSTON SCIENTIFIC PORTUGAL, LDA (504988964)","22.800,00 €",09-01-2018,09-01-2018,1 dias,"Portugal, Lisboa, Lisboa","Artigo 24.º, n.º 1, alínea e) do Código dos Contratos Públicos",,,,,,Não aplicável.,Não aplicável.,FALSE
Aquisição de oxigénio gasoso medicinal garrafa 1.1 m3,Ajuste Direto Regime Geral,Aquisição de bens móveis,"33690000-3, Medicamentos vários","Centro Hospitalar Lisboa Norte, E. P. E. (508481287)","Air Liquide Medicinal, S.A. (501576436)","8.850,00 €",09-01-2018,09-01-2018,1 dias,"Portugal, Lisboa, Lisboa","Artigo 24.º, n.º 1, alínea e) do Código dos Contratos Públicos",,,,,,Não aplicável.,Não aplicável.,FALSE
Ajuste Direto n.º 181000247 - Compra centralizada de medicamentos - P259-AC-2017-143,Ao abrigo de acordo-quadro (art.º 259.º),Aquisição de bens móveis,"33690000-3, Medicamentos vários","Centro Hospitalar Lisboa Norte, E. P. E. (508481287)",MEDAC (980369959),"91.800,00 €",09-01-2018,09-01-2018,365 dias,"Portugal, Lisboa, Lisboa",Artigo 259.º do Código dos Contratos Públicos,,,,,,1771819,CP 2015/6 - Acordo quadro para o fornecimento de Medicamentos do Foro Oncológico,FALSE
Ajuste Direto n.º 181000247 - Compra centralizada de medicamentos - P259-AC-2017-143,Ao abrigo de acordo-quadro (art.º 259.º),Aquisição de bens móveis,"33690000-3, Medicamentos vários","Centro Hospitalar Lisboa Norte, E. P. E. (508481287)","TEVA PHARMA - PRODUTOS FARMACEUTICOS,LDA (507045491)","8.560,79 €",09-01-2018,09-01-2018,365 dias,"Portugal, Lisboa, Lisboa",Artigo 259.º do Código dos Contratos Públicos,,,,,,1771819,CP 2015/6 - Acordo quadro para o fornecimento de Medicamentos do Foro Oncológico,FALSE
"Aquisição de tacrolimus caps. 0,5 mg",Ajuste Direto Regime Geral,Aquisição de bens móveis,"33690000-3, Medicamentos vários","Centro Hospitalar Lisboa Norte, E. P. E. (508481287)","SANDOZ FARMACÊUTICA, LDA.                          (506985261)","1.710,00 €",09-01-2018,09-01-2018,1 dias,"Portugal, Lisboa, Lisboa","Artigo 24.º, n.º 1, alínea e) do Código dos Contratos Públicos",,,,,,Não aplicável.,Não aplicável.,FALSE
Aquisição de material de Cardiologia,Ajuste Direto Regime Geral,Aquisição de bens móveis,"33190000-8, Dispositivos e produtos médicos variados","Centro Hospitalar Lisboa Norte, E. P. E. (508481287)",BIOSONDA (501463313),"9.650,00 €",08-01-2018,08-01-2018,1 dias,"Portugal, Lisboa, Lisboa","Artigo 24.º, n.º 1, alínea e) do Código dos Contratos Públicos",,,,,,Não aplicável.,Não aplicável.,FALSE
Aquisição de diversos medicamentos - Ano de 2018,Ajuste Direto Regime Geral,Aquisição de bens móveis,"33690000-3, Medicamentos vários","Centro Hospitalar Lisboa Norte, E. P. E. (508481287)",Servier Portugal (502177420),"5.162,66 €",08-01-2018,08-01-2018,357 dias,"Portugal, Lisboa, Lisboa","Artigo 24.º, n.º 1, alínea e) do Código dos Contratos Públicos",,,,,,Não aplicável.,Não aplicável.,FALSE
Aquisição de abacavir 600 mg + lamivudina 300 mg comp.,Ajuste Direto Regime Geral,Aquisição de bens móveis,"33690000-3, Medicamentos vários","Centro Hospitalar Lisboa Norte, E. P. E. (508481287)","MYLAN, LDA.                                        (502248793)","39.150,00 €",08-01-2018,08-01-2018,1 dias,"Portugal, Lisboa, Lisboa","Artigo 20.º, n.º 1, alínea a) do Código dos Contratos Públicos",,,,,,Não aplicável.,Não aplicável.,FALSE
Aquisição de nevirapina 400 mg comp. AP,Ajuste Direto Regime Geral,Aquisição de bens móveis,"33690000-3, Medicamentos vários","Centro Hospitalar Lisboa Norte, E. P. E. (508481287)","MYLAN, LDA.                                        (502248793)","5.850,00 €",08-01-2018,08-01-2018,1 dias,"Portugal, Lisboa, Lisboa","Artigo 20.º, n.º 1, alínea a) do Código dos Contratos Públicos",,,,,,Não aplicável.,Não aplicável.,FALSE
Aquisição de óculos p/ proteção de citostáticos,Ajuste Direto Regime Geral,Aquisição de bens móveis,"33190000-8, Dispositivos e produtos médicos variados","Centro Hospitalar Lisboa Norte, E. P. E. (508481287)","Speculum - Artigos Médicos, S.A (502996323)","75,80 €",08-01-2018,08-01-2018,10 dias,"Portugal, Lisboa, Lisboa","Artigo 20.º, n.º 1, alínea a) do Código dos Contratos Públicos",,,,,,Não aplicável.,Não aplicável.,FALSE
Aquisição de serviços de manutenção à solução Progastro para o ano de 2018,Ajuste Direto Regime Geral,Aquisição de serviços,"72212180-4, Serviços de desenvolvimento de software para medicina","Centro Hospitalar Lisboa Norte, E. P. E. (508481287)",ARTIMATICA ARTIGOS INFORMATICA LDA (502690127),"10.452,00 €",08-01-2018,02-01-2018,364 dias,"Portugal, Lisboa, Lisboa","Artigo 20.º, n.º 1, alínea a) do Código dos Contratos Públicos",,,,,,Não aplicável.,Não aplicável.,FALSE
Aquisição de epoetina beta inj.,Ajuste Direto Regime Geral,Aquisição de bens móveis,"33690000-3, Medicamentos vários","Centro Hospitalar Lisboa Norte, E. P. E. (508481287)","ROCHE FARMACEUTICA QUINICA, LDA (500233810)","4.515,60 €",08-01-2018,08-01-2018,1 dias,"Portugal, Lisboa, Lisboa","Artigo 24.º, n.º 1, alínea e) do Código dos Contratos Públicos",,,,,,Não aplicável.,Não aplicável.,FALSE
Empreitada para execução da obra de substituição dos tubos de queda na fachada do edifico do Posto de Transformação.,Ajuste Direto Regime Geral,Empreitadas de obras públicas,"45259100-8, Reparação e manutenção de estações de tratamento de águas residuais","CENTRO HOSPITALAR LISBOA NORTE, EPE (508481287)","Tojalense - Trabalhos Construção Civil - Unipessoal, Lda. (505569400)","4.899,00 €",08-01-2018,08-01-2018,30 dias,"Portugal, Lisboa, Lisboa","Artigo 19.º, alínea a) do Código dos Contratos Públicos",,,,,,Não aplicável.,Não aplicável.,FALSE
"Aquisição de colecalciferol sol. oral 0,5 mg/ml frs. 10 ml apenas representados pela empresa Merck, SA para o ano de 2018",Ajuste Direto Regime Geral,Aquisição de bens móveis,"33616000-1, Vitaminas","Centro Hospitalar Lisboa Norte, E. P. E. (508481287)","MERCK, SA (500650870)","7.554,12 €",08-01-2018,08-01-2018,357 dias,"Portugal, Lisboa, Lisboa","Artigo 24.º, n.º 1, alínea e) do Código dos Contratos Públicos",,,,,,Não aplicável.,Não aplicável.,FALSE
"Aquisição de medicamentos exclusivos apenas representados pela empresa Laboratórios Vitória, Lda. para o ano de 2018",Ajuste Direto Regime Geral,Aquisição de bens móveis,"33690000-3, Medicamentos vários","Centro Hospitalar Lisboa Norte, E. P. E. (508481287)","Laboratórios Vitória, SA (500162220)","2.791,10 €",08-01-2018,08-01-2018,357 dias,"Portugal, Lisboa, Lisboa","Artigo 24.º, n.º 1, alínea e) do Código dos Contratos Públicos",,,,,,Não aplicável.,Não aplicável.,FALSE
Aquisição de prótese valvular aortica,Ajuste Direto Regime Geral,Aquisição de bens móveis,"33140000-3, Material médico de consumo","Centro Hospitalar Lisboa Norte, E. P. E. (508481287)","Medtronic Portugal, Lda. (504223933)","16.500,00 €",08-01-2018,08-01-2018,1 dias,"Portugal, Lisboa, Lisboa","Artigo 24.º, n.º 1, alínea e) do Código dos Contratos Públicos",,,,,,Não aplicável.,Não aplicável.,FALSE
Aquisição de ciclosporina emulsão caps. 50 mg,Ajuste Direto Regime Geral,Aquisição de bens móveis,"33690000-3, Medicamentos vários","Centro Hospitalar Lisboa Norte, E. P. E. (508481287)","TEVA PHARMA - PRODUTOS FARMACEUTICOS,LDA (507045491)","888,00 €",08-01-2018,08-01-2018,1 dias,"Portugal, Lisboa, Lisboa","Artigo 24.º, n.º 1, alínea e) do Código dos Contratos Públicos",,,,,,Não aplicável.,Não aplicável.,FALSE
Aquisição de medicamentos,Ajuste Direto Regime Geral,Aquisição de bens móveis,"33690000-3, Medicamentos vários","Centro Hospitalar Lisboa Norte, E. P. E. (508481287)","TECNIMEDE, SA (500626413)","287,00 €",05-01-2018,04-01-2018,1 dias,"Portugal, Lisboa, Lisboa","Artigo 20.º, n.º 1, alínea a) do Código dos Contratos Públicos",,,,,,Não aplicável.,Não aplicável.,FALSE
"PRESTAÇÃO DE SERVIÇOS NO ÂMBITO DA DISPONIBILIZAÇÃO E UTILIZAÇÃO DA PLATAFORMA ELETRÓNICA DE CONTRATAÇÃO PÚBLICA, PARA O CENTRO HOSPITALAR LISBOA NORTE,EPE",Ajuste Direto Regime Geral,Aquisição de serviços,"72212490-0, Serviços de desenvolvimento de software para adjudicação de contratos","Centro Hospitalar Lisboa Norte, E. P. E. (508481287)","SAPHETY LEVEL- TRUSTED SERVICES, S.A. (507957547)","6.999,96 €",05-01-2018,05-01-2018,365 dias,"Portugal, Lisboa, Lisboa","Artigo 20.º, n.º 1, alínea a) do Código dos Contratos Públicos",,,,,,Não aplicável.,Não aplicável.,FALSE
Aquisição de aflibercept 40 mg/ml sol. inj.,Ajuste Direto Regime Geral,Aquisição de bens móveis,"33690000-3, Medicamentos vários","Centro Hospitalar Lisboa Norte, E. P. E. (508481287)",Bayer Portugal S.A. (500043256),"47.769,60 €",05-01-2018,19-12-2017,1 dias,"Portugal, Lisboa, Lisboa","Artigo 24.º, n.º 1, alínea e) do Código dos Contratos Públicos",,,,,,Não aplicável.,Não aplicável.,FALSE
Aquisição de AC anti VHC Cobas  8.000 teste 200 T,Ajuste Direto Regime Geral,Aquisição de bens móveis,"33696000-5, Reagentes e meios de contraste","Centro Hospitalar Lisboa Norte, E. P. E. (508481287)","Roche Sistemas de Diagnóstico, Lda (504282921)","11.715,00 €",05-01-2018,13-12-2017,1 dias,"Portugal, Lisboa, Lisboa","Artigo 24.º, n.º 1, alínea e) do Código dos Contratos Públicos",,,,,,Não aplicável.,Não aplicável.,FALSE
Aquisição de fator VIII recombinante 500 Ui,Ajuste Direto Regime Geral,Aquisição de bens móveis,"33690000-3, Medicamentos vários","CENTRO HOSPITALAR LISBOA NORTE, EPE (508481287)","SHIRE PHARMACEUTICALS PORTUGAL, LDA                (509264662)","62.316,00 €",05-01-2018,13-12-2017,1 dias,"Portugal, Lisboa, Lisboa","Artigo 24.º, n.º 1, alínea e) do Código dos Contratos Públicos",,,,,,Não aplicável.,Não aplicável.,FALSE
Aquisição de factor VIII recombinante,Ajuste Direto Regime Geral,Aquisição de bens móveis,"33621000-9, Medicamentos para o sangue e para os órgãos hematopoiéticos","Centro Hospitalar Lisboa Norte, E. P. E. (508481287)","SHIRE PHARMACEUTICALS PORTUGAL, LDA                (509264662)","10.905,30 €",05-01-2018,28-12-2017,1 dias,"Portugal, Lisboa, Lisboa","Artigo 24.º, n.º 1, alínea e) do Código dos Contratos Públicos",,,,,,Não aplicável.,Não aplicável.,FALSE
Aquisição de etanercept sol. inj. 50 mg/1 ml canetas,Ajuste Direto Regime Geral,Aquisição de bens móveis,"33690000-3, Medicamentos vários","Centro Hospitalar Lisboa Norte, E. P. E. (508481287)","PFIZER BIOFARMACEUTICA, SOCIEDADE UNIPESSOAL, LDA (513300376)","177.660,00 €",05-01-2018,04-12-2017,1 dias,"Portugal, Lisboa, Lisboa","Artigo 24.º, n.º 1, alínea e) do Código dos Contratos Públicos",,,,,,Não aplicável.,Não aplicável.,FALSE
Aquisição de secoflurano sol. inalação frs. 250 ml,Ajuste Direto Regime Geral,Aquisição de bens móveis,"33690000-3, Medicamentos vários","Centro Hospitalar Lisboa Norte, E. P. E. (508481287)","ABBVIE,LDA (510229050)","46.440,00 €",05-01-2018,13-11-2017,1 dias,"Portugal, Lisboa, Lisboa","Artigo 24.º, n.º 1, alínea e) do Código dos Contratos Públicos",,,,,,Não aplicável.,Não aplicável.,FALSE
Aquisição de abacavir 600 mg + lamivudina 300 mg comp.,Ajuste Direto Regime Geral,Aquisição de bens móveis,"33690000-3, Medicamentos vários","CENTRO HOSPITALAR LISBOA NORTE, EPE (508481287)","SANDOZ FARMACÊUTICA, LDA.                          (506985261)","42.930,00 €",05-01-2018,03-11-2017,1 dias,"Portugal, Lisboa, Lisboa","Artigo 20.º, n.º 1, alínea a) do Código dos Contratos Públicos",,,,,,Não aplicável.,Não aplicável.,FALSE
Aquisição de pacote de horas para suporte e apoio aplicacional Glintt para o ano de 2018.,Ajuste Direto Regime Geral,Aquisição de serviços,"72212213-5, Serviços de desenvolvimento de software para melhoria de sistemas operativos","Centro Hospitalar Lisboa Norte, EPE (508481287)","Glintt Helthcare Solutions, S.A. (502479418)","168.000,00 €",05-01-2018,02-01-2018,364 dias,"Portugal, Lisboa, Lisboa","Artigo 24.º, n.º 1, alínea e) do Código dos Contratos Públicos",,,,,,Não aplicável.,Não aplicável.,FALSE
"Aquisição de serviços de seguros de acidentes de trabalho para funcionários do Centro Hospitalar Lisboa Norte, E.P.E-",Ajuste Direto Regime Geral,Aquisição de serviços,"66512100-3, Serviços de seguros de acidentes","Centro Hospitalar Lisboa Norte, E. P. E. (508481287)","Lusitania Companhia de Seguros, S.A. (501689168)","273.206,25 €",05-01-2018,29-12-2017,59 dias,"Portugal, Lisboa, Lisboa","Artigo 24.º, n.º 1, alínea c) do Código dos Contratos Públicos",,,,,,Não aplicável.,Não aplicável.,FALSE
Aquisição de serviços de manutenção às impressoras locais para o ano de 2018.,Ajuste Direto Regime Geral,Aquisição de serviços,"50312000-5, Manutenção e reparação de equipamento informático","Centro Hospitalar Lisboa Norte, E. P. E. (508481287)","Regra – Sistemas de Informação, S.A. (500229147)","37.714,56 €",05-01-2018,02-01-2018,365 dias,"Portugal, Lisboa, Lisboa","Artigo 20.º, n.º 1, alínea a) do Código dos Contratos Públicos",,,,,,Não aplicável.,Não aplicável.,FALSE
Aquisição de emtricitabina 200 mg + tenofovir 245 mg comp. -.P259-AC-2017-190,Ao abrigo de acordo-quadro (art.º 259.º),Aquisição de bens móveis,"33690000-3, Medicamentos vários","Centro Hospitalar Lisboa Norte, E. P. E. (508481287)",GILEAD SCIENCES (503604704),"1.278.486,00 €",05-01-2018,05-01-2018,365 dias,"Portugal, Lisboa, Lisboa",Artigo 259.º do Código dos Contratos Públicos,,,,,,2183729,Medicamentos antirretrovíricos para o tratamento da infeção por VIH,FALSE
Compra centralizada de bexaroteno caps. moles 75 mg - AD -AC-2017-134,Ajuste Direto Regime Geral,Aquisição de bens móveis,"33690000-3, Medicamentos vários","Centro Hospitalar Lisboa Norte, E. P. E. (508481287)",EISAI FARMACEUTICA UNIPESSOAL LDA. (507847660),"9.349,20 €",04-01-2018,04-01-2018,365 dias,"Portugal, Lisboa, Lisboa","Artigo 24.º, n.º 1, alínea e) do Código dos Contratos Públicos",,,,,,Não aplicável.,Não aplicável.,FALSE
Aquisição de vários medicamentos,Ajuste Direto Regime Geral,Aquisição de bens móveis,"33690000-3, Medicamentos vários","Centro Hospitalar Lisboa Norte, E. P. E. (508481287)",GRUNENTHAL SA (500101965),"448,00 €",04-01-2018,04-01-2018,1 dias,"Portugal, Lisboa, Lisboa","Artigo 20.º, n.º 1, alínea a) do Código dos Contratos Públicos",,,,,,Não aplicável.,Não aplicável.,FALSE
Aquisição de troponina cobas 6.000 conj. det. 100 T,Ajuste Direto Regime Geral,Aquisição de bens móveis,"33690000-3, Medicamentos vários","CENTRO HOSPITALAR LISBOA NORTE, EPE (508481287)","Roche Sistemas de Diagnóstico, Lda (504282921)","10.613,70 €",04-01-2018,02-01-2018,1 dias,"Portugal, Lisboa, Lisboa","Artigo 24.º, n.º 1, alínea e) do Código dos Contratos Públicos",,,,,,Não aplicável.,Não aplicável.,FALSE
Locação de viatura para transporte de medicamentos (SGTF),Ajuste Direto Regime Geral,Aquisição de serviços,"60180000-3, Aluguer de veículos para transporte de mercadorias com condutor","CENTRO HOSPITALAR LISBOA NORTE, EPE (508481287)","Herofibra, lda. (506923134)","14.760,00 €",04-01-2018,01-01-2018,365 dias,"Portugal, Lisboa, Lisboa","Artigo 20.º, n.º 1, alínea a) do Código dos Contratos Públicos",,,,,,Não aplicável.,Não aplicável.,FALSE
Locação de viatura transporte de mercadorias  - Unidade de Logística e Stocks,Ajuste Direto Regime Geral,Aquisição de serviços,"60180000-3, Aluguer de veículos para transporte de mercadorias com condutor","CENTRO HOSPITALAR LISBOA NORTE, EPE (508481287)",EUROPCAR INTERNACIONAL - ALUGUER DE AUTOMOVEIS S A (500074135),"12.231,15 €",04-01-2018,03-01-2018,365 dias,"Portugal, Lisboa, Lisboa","Artigo 20.º, n.º 1, alínea a) do Código dos Contratos Públicos",,,,,,Não aplicável.,Não aplicável.,FALSE
Fornecimento e instalação de diversos cortinados hospitalares para diversos serviços.,Ajuste Direto Regime Geral,Empreitadas de obras públicas,"45421141-4, Instalação de divisórias","CENTRO HOSPITALAR LISBOA NORTE, EPE (508481287)","IFHI, LDA. (502264543)","43.661,00 €",04-01-2018,03-01-2018,30 dias,"Portugal, Lisboa, Lisboa","Artigo 19.º, alínea a) do Código dos Contratos Públicos",,,,,,Não aplicável.,Não aplicável.,FALSE
"182G000008 - Aquisição de consumíveis para aspirador ultra-sónico cusa excel representado pela empresa socime medical, Lda para o ano de 2018",Ajuste Direto Regime Geral,Aquisição de bens móveis,"33162200-5, Instrumentos para blocos operatórios","Centro Hospitalar Lisboa Norte, E. P. E. (508481287)",Socime II (504453939),"102.870,00 €",04-01-2018,02-01-2018,364 dias,"Portugal, Lisboa, Lisboa","Artigo 24.º, n.º 1, alínea e) do Código dos Contratos Públicos",,,,,,Não aplicável.,Não aplicável.,FALSE
Ajuste Direto n.º 181000222 - Compra centralizada de medicamentos - P259-AC-2017-189,Ao abrigo de acordo-quadro (art.º 259.º),Aquisição de bens móveis,"33690000-3, Medicamentos vários","Centro Hospitalar Lisboa Norte, E. P. E. (508481287)",BAXTER MEDICO - FARMACEUTICA (503347345),"83.126,82 €",04-01-2018,04-01-2018,365 dias,"Portugal, Lisboa, Lisboa",Artigo 259.º do Código dos Contratos Públicos,,,,,,1771819,CP 2015/6 - Acordo quadro para o fornecimento de Medicamentos do Foro Oncológico,FALSE
Obra de manutenção anual no Serviço de Cirurgia Plástica -Internamento ¿ Unidade de Queimados do HSM.,Ajuste Direto Regime Geral,Empreitadas de obras públicas,"45453000-7, Obras de revisão e recuperação","Centro Hospitalar Lisboa Norte, E. P. E. (508481287)","C.E Gonçalves, Lda (508657520)","13.362,00 €",03-01-2018,03-01-2018,15 dias,"Portugal, Lisboa, Lisboa","Artigo 19.º, alínea a) do Código dos Contratos Públicos",,,,,,Não aplicável.,Não aplicável.,FALSE
Empreitada para execução de uma copa no Serviço de Informática.,Ajuste Direto Regime Geral,Empreitadas de obras públicas,"45454000-4, Obras de reestruturação","Centro Hospitalar Lisboa Norte, E. P. E. (508481287)","C.E Gonçalves, Lda (508657520)","8.386,45 €",03-01-2018,03-01-2018,20 dias,"Portugal, Lisboa, Lisboa","Artigo 19.º, alínea a) do Código dos Contratos Públicos",,,,,,Não aplicável.,Não aplicável.,FALSE
Aquisição de nifedipina comp. A P 30 mg,Ajuste Direto Regime Geral,Aquisição de bens móveis,"33690000-3, Medicamentos vários","CENTRO HOSPITALAR LISBOA NORTE, EPE (508481287)","GENERIS - FARMACEUTICA, S.A. (508107997)","4.644,64 €",03-01-2018,03-01-2018,1 dias,"Portugal, Lisboa, Lisboa","Artigo 24.º, n.º 1, alínea c) do Código dos Contratos Públicos",,,,,,Não aplicável.,Não aplicável.,FALSE
"CLPQ n.º 189B000001 - Prestação de serviços de contabilidade, fiscalidade e apoio à gestão do património, p/ o CHLN, EPE",Concurso limitado por prévia qualificação,Aquisição de serviços,"79412000-5, Serviços de consultoria em matéria de gestão financeira","Centro Hospitalar Lisboa Norte, E. P. E. (508481287)","GESBANHA - Gestão e Contabilidade, S.A. (501768254)","86.400,00 €",03-01-2018,02-01-2018,364 dias,"Portugal, Lisboa, Lisboa","Artigo 20.º, n.º 1, alínea b) do Código dos Contratos Públicos",,,,,,Não aplicável.,Não aplicável.,FALSE
"CP n.º 189A000002 - Prestação de serviços na área de logística e stocks do CHLN, EPE ",Concurso público,Aquisição de serviços,"79620000-6, Serviços de fornecimento de pessoal, inclusive temporário","CENTRO HOSPITALAR LISBOA NORTE, EPE (508481287)",Serviço de Utilização Comum dos Hospitais (500900469),"113.794,56 €",03-01-2018,02-01-2018,364 dias,"Portugal, Lisboa, Lisboa","Artigo 20.º, n.º 1, alínea b) do Código dos Contratos Públicos",,,,,,Não aplicável.,Não aplicável.,FALSE
Prestação de serviços de manutenção e tratamento de zonas verdes,Ajuste Direto Regime Geral,Aquisição de serviços,"77310000-6, Serviços de plantação e manutenção de áreas verdes","Centro Hospitalar Lisboa Norte, E. P. E. (508481287)","Ferrovial Serviços, S.A. (503307483)","109.044,00 €",03-01-2018,02-01-2018,364 dias,"Portugal, Lisboa, Lisboa","Artigo 27.º, n.º 1, alínea a) do Código dos Contratos Públicos",,,,,,Não aplicável.,Não aplicável.,FALSE
189G000016 - Aquisição de serviços de manutenção ao equipamento laser dornier Artur Oliveira para o ano de 2018,Ajuste Direto Regime Geral,Aquisição de serviços,"50421000-2, Serviços de reparação e manutenção de equipamento médico","CENTRO HOSPITALAR LISBOA NORTE, EPE (508481287)",ARTUR OLIVEIRA (155810073),"1.728,60 €",03-01-2018,03-01-2018,60 dias,"Portugal, Lisboa, Lisboa","Artigo 24.º, n.º 1, alínea e) do Código dos Contratos Públicos",,,,,,Não aplicável.,Não aplicável.,FALSE
Aquisição de colitimetato de sódio sol. p/ nebulização,Ajuste Direto Regime Geral,Aquisição de bens móveis,"33690000-3, Medicamentos vários","Centro Hospitalar Lisboa Norte, E. P. E. (508481287)",ZAMBON-PRODUTOS FARMACEUTICOS                      (502155930),"28.844,55 €",03-01-2018,20-06-2017,1 dias,"Portugal, Lisboa, Lisboa","Artigo 24.º, n.º 1, alínea e) do Código dos Contratos Públicos",,,,,,Não aplicável.,Não aplicável.,FALSE
Aquisição de micofenolato de mofetil caps. 500 mg,Ajuste Direto Regime Geral,Aquisição de bens móveis,"33690000-3, Medicamentos vários","Centro Hospitalar Lisboa Norte, E. P. E. (508481287)",ACCORD HEALTHCARE UNIPESSOAL LDA (508622263),"16.680,00 €",03-01-2018,27-06-2017,1 dias,"Portugal, Lisboa, Lisboa","Artigo 24.º, n.º 1, alínea e) do Código dos Contratos Públicos",,,,,,Não aplicável.,Não aplicável.,FALSE
Aquisição de acetonido de fluocinolona 190 mcg,Ajuste Direto Regime Geral,Aquisição de bens móveis,"33690000-3, Medicamentos vários","Centro Hospitalar Lisboa Norte, E. P. E. (508481287)",ALIMERA SCIENCES LIMITED (980523192),"11.888,00 €",03-01-2018,26-06-2017,1 dias,"Portugal, Lisboa, Lisboa","Artigo 24.º, n.º 1, alínea e) do Código dos Contratos Públicos",,,,,,Não aplicável.,Não aplicável.,FALSE
"Aquisição de serviços de seguros de acidentes de trabalho para funcionários do Centro Hospitalar Lisboa Norte, E.P.E.",Ajuste Direto Regime Geral,Aquisição de serviços,"66512100-3, Serviços de seguros de acidentes","CENTRO HOSPITALAR LISBOA NORTE, EPE (508481287)",Lusitânia Companhia de Seguros (501689168),"121.727,81 €",03-01-2018,27-06-2017,31 dias,"Portugal, Lisboa, Lisboa","Artigo 24.º, n.º 1, alínea c) do Código dos Contratos Públicos",,,,,,Não aplicável.,Não aplicável.,FALSE
174G000192 - Aquisição de laminas de tricotomia durante o ano 2017,Ajuste Direto Regime Geral,Aquisição de bens móveis,"33721100-1, Lâminas de barbear","CENTRO HOSPITALAR LISBOA NORTE, EPE (508481287)",MEDLINE INTERNACIONAL PORTUGAL UNIPESSOAL LDA (510533515),"11.816,40 €",03-01-2018,08-06-2017,206 dias,"Portugal, Lisboa, Lisboa","Artigo 20.º, n.º 1, alínea a) do Código dos Contratos Públicos",,,,,,Não aplicável.,Não aplicável.,FALSE
"CP n.º 172A000015 - Aquisição de dispositivos médicos p/ trombectomia intracraniana, do CHLN, EPE",Concurso público,Locação de bens móveis,"33111730-7, Material para angioplastia","Centro Hospitalar Lisboa Norte, E. P. E. (508481287)","CATETER PROD. MED. HOSPITALARES, LDA. (502914319)","49.980,00 €",03-01-2018,12-06-2017,202 dias,"Portugal, Lisboa, Lisboa","Artigo 20.º, n.º 1, alínea b) do Código dos Contratos Públicos",,,,,,Não aplicável.,Não aplicável.,FALSE
Aquisição de interferão beta 1 B sol. inj. 8.000.000,Ajuste Direto Regime Geral,Aquisição de bens móveis,"33690000-3, Medicamentos vários","Centro Hospitalar Lisboa Norte, E. P. E. (508481287)","NOVARTIS FARMA-PROD.FARMACÊUTICOS,SA.              (500063524)","19.323,00 €",03-01-2018,08-06-2017,1 dias,"Portugal, Lisboa, Lisboa","Artigo 24.º, n.º 1, alínea e) do Código dos Contratos Públicos",,,,,,Não aplicável.,Não aplicável.,FALSE
Aquisição de fator VIII recombinante 500 UI,Ajuste Direto Regime Geral,Aquisição de bens móveis,"33690000-3, Medicamentos vários","Centro Hospitalar Lisboa Norte, E. P. E. (508481287)","BAYER PORTUGAL, SA.                                (500043256)","14.760,00 €",03-01-2018,08-06-2017,1 dias,"Portugal, Lisboa, Lisboa","Artigo 24.º, n.º 1, alínea e) do Código dos Contratos Públicos",,,,,,Não aplicável.,Não aplicável.,FALSE
Aquisição de oito (8) monitores de parâmetros fisiológicos para o Serviço de Anestesia  Unidade Cuidados pós Anestésicos  HPV,Ajuste Direto Regime Geral,Aquisição de bens móveis,"33123210-3, Aparelhos para monitorização cardíaca","Centro Hospitalar Lisboa Norte, E. P. E. (508481287)",DRAGER PORTUGAL LDA (508771323),"47.500,00 €",03-01-2018,29-06-2017,35 dias,"Portugal, Lisboa, Lisboa","Artigo 20.º, n.º 1, alínea a) do Código dos Contratos Públicos",,,,,,Não aplicável.,Não aplicável.,FALSE
CP n.º 176A000002 - Aquisição de material genérico de eletricidade p/ o ano de 2017,Concurso público,Aquisição de bens móveis,"31600000-2, Equipamento e aparelhos eléctricos","Centro Hospitalar Lisboa Norte, E. P. E. (508481287)","JMC, Lda (500157855)","64.258,59 €",03-01-2018,06-06-2017,208 dias,"Portugal, Lisboa, Lisboa","Artigo 20.º, n.º 1, alínea b) do Código dos Contratos Públicos",,,,,,Não aplicável.,Não aplicável.,FALSE
Aquisição de Um Ecógrafo para o Serviço de Cirurgia Cardio-Torácica - Bloco Operatório,Ajuste Direto Regime Geral,Aquisição de bens móveis,"33124120-2, Aparelhos de ultra-sons","CENTRO HOSPITALAR LISBOA NORTE, EPE (508481287)","SIEMENS HEALTHCARE, LDA. (507925173)","44.450,00 €",03-01-2018,05-06-2017,30 dias,"Portugal, Lisboa, Lisboa","Artigo 20.º, n.º 1, alínea a) do Código dos Contratos Públicos",,,,,,Não aplicável.,Não aplicável.,FALSE
Aquisição de imunoglobulina antitimócito coelho,Ajuste Direto Regime Geral,Aquisição de bens móveis,"33690000-3, Medicamentos vários","Centro Hospitalar Lisboa Norte, E. P. E. (508481287)","SANOFI - PRODUTOS FARMACÊUTICOS, LDA. (500134960)","48.327,00 €",03-01-2018,06-06-2017,1 dias,"Portugal, Lisboa, Lisboa","Artigo 24.º, n.º 1, alínea e) do Código dos Contratos Públicos",,,,,,Não aplicável.,Não aplicável.,FALSE
Aquisição de fator VIII recombinante,Ajuste Direto Regime Geral,Aquisição de bens móveis,"33690000-3, Medicamentos vários","CENTRO HOSPITALAR LISBOA NORTE, EPE (508481287)",Bayer (500043256),"98.400,00 €",03-01-2018,02-06-2017,1 dias,"Portugal, Lisboa, Lisboa","Artigo 24.º, n.º 1, alínea e) do Código dos Contratos Públicos",,,,,,Não aplicável.,Não aplicável.,FALSE
Aquisição de isolmaneto linfocitos reagente 100T,Ajuste Direto Regime Geral,Aquisição de bens móveis,"33690000-3, Medicamentos vários","Centro Hospitalar Lisboa Norte, E. P. E. (508481287)","Beckman Coulter Portugal Uni., Lda (509035167)","13.500,00 €",03-01-2018,02-06-2017,1 dias,"Portugal, Lisboa, Lisboa","Artigo 24.º, n.º 1, alínea e) do Código dos Contratos Públicos",,,,,,Não aplicável.,Não aplicável.,FALSE
Aquisição de reagentes,Ajuste Direto Regime Geral,Aquisição de bens móveis,"33696000-5, Reagentes e meios de contraste","Centro Hospitalar Lisboa Norte, E. P. E. (508481287)","Roche Sistemas de Diagnóstico, Lda (504282921)","48.960,00 €",03-01-2018,01-06-2017,1 dias,"Portugal, Lisboa, Lisboa","Artigo 24.º, n.º 1, alínea e) do Código dos Contratos Públicos",,,,,,Não aplicável.,Não aplicável.,FALSE
Aquisição de vários reagentes,Ajuste Direto Regime Geral,Aquisição de bens móveis,"33696000-5, Reagentes e meios de contraste","Centro Hospitalar Lisboa Norte, E. P. E. (508481287)","RADIOMETER IBERICA, SL (980201667)","17.509,40 €",03-01-2018,05-05-2017,1 dias,"Portugal, Lisboa, Lisboa","Artigo 24.º, n.º 1, alínea e) do Código dos Contratos Públicos",,,,,,Não aplicável.,Não aplicável.,FALSE
VEDOLIZUMAB 300 MG INJ,Ajuste Direto Regime Geral,Aquisição de bens móveis,"33690000-3, Medicamentos vários","Centro Hospitalar Lisboa Norte, E. P. E. (508481287)",TAKEDA FARMACEUTICOS PORTUGAL LDA (508512409),"10.000,00 €",03-01-2018,19-05-2017,1 dias,"Portugal, Lisboa, Lisboa","Artigo 24.º, n.º 1, alínea e) do Código dos Contratos Públicos",,,,,,Não aplicável.,Não aplicável.,FALSE
Aquisição de dexmedetomida inj. 100 mcg,Ajuste Direto Regime Geral,Aquisição de bens móveis,"33690000-3, Medicamentos vários","Centro Hospitalar Lisboa Norte, E. P. E. (508481287)",ORIONFIN UNIPESSOAL LDA (508907365),"16.200,00 €",03-01-2018,30-05-2017,1 dias,"Portugal, Lisboa, Lisboa","Artigo 24.º, n.º 1, alínea e) do Código dos Contratos Públicos",,,,,,Não aplicável.,Não aplicável.,FALSE
Aquisição de quatro desfibrilhadores para cuidados intensivos do Serviço de Medicina Intensiva.,Ajuste Direto Regime Geral,Aquisição de bens móveis,"33182100-0, Desfibrilhador","Centro Hospitalar Lisboa Norte, E. P. E. (508481287)","PHYSIO PORTUGALSALES,UNIPESSOAL, LDA. (510137946)","28.600,00 €",03-01-2018,24-05-2017,60 dias,"Portugal, Lisboa, Lisboa","Artigo 20.º, n.º 1, alínea a) do Código dos Contratos Públicos",,,,,,Não aplicável.,Não aplicável.,FALSE
Aquisição de hibridação DNA 4 -lâminas 16 amostras,Ajuste Direto Regime Geral,Aquisição de bens móveis,"33696000-5, Reagentes e meios de contraste","Centro Hospitalar Lisboa Norte, E. P. E. (508481287)"," ILC - INSTRUMENTOS DE LABORAT. E CIENTIFICOS, LDA (500948208)","11.112,00 €",03-01-2018,22-05-2017,1 dias,"Portugal, Lisboa, Lisboa","Artigo 24.º, n.º 1, alínea e) do Código dos Contratos Públicos",,,,,,Não aplicável.,Não aplicável.,FALSE
Aquisição de proteina S livre conj. DET,Ajuste Direto Regime Geral,Aquisição de bens móveis,"33690000-3, Medicamentos vários","Centro Hospitalar Lisboa Norte, E. P. E. (508481287)","WERFEN PORTUGAL, LDA (EX IZASA) (501086110)","11.700,00 €",03-01-2018,23-05-2017,1 dias,"Portugal, Lisboa, Lisboa","Artigo 24.º, n.º 1, alínea e) do Código dos Contratos Públicos",,,,,,Não aplicável.,Não aplicável.,FALSE
Aquisição de infliximab  mg inj. (biossimilar),Ajuste Direto Regime Geral,Aquisição de bens móveis,"33690000-3, Medicamentos vários","Centro Hospitalar Lisboa Norte, E. P. E. (508481287)",LABORATORIOS PFIZER SA (500162166),"78.466,50 €",03-01-2018,23-05-2017,1 dias,"Portugal, Lisboa, Lisboa","Artigo 24.º, n.º 1, alínea e) do Código dos Contratos Públicos",,,,,,Não aplicável.,Não aplicável.,FALSE
Aquisição de cabazitaxel 60 mg inj.,Ajuste Direto Regime Geral,Aquisição de bens móveis,"33690000-3, Medicamentos vários","Centro Hospitalar Lisboa Norte, E. P. E. (508481287)","SANOFI - PRODUTOS FARMACÊUTICOS, LDA. (500134960)","47.652,00 €",03-01-2018,19-05-2017,1 dias,"Portugal, Lisboa, Lisboa","Artigo 24.º, n.º 1, alínea e) do Código dos Contratos Públicos",,,,,,Não aplicável.,Não aplicável.,FALSE
"Aquisição de bosentan comp. 62,5 mg",Ajuste Direto Regime Geral,Aquisição de bens móveis,"33690000-3, Medicamentos vários","Centro Hospitalar Lisboa Norte, E. P. E. (508481287)",ACTELION PHARMACEUTICALS SOCIEDADE UNIPESSOAL LDA (507336488),"12.622,40 €",03-01-2018,22-05-2017,1 dias,"Portugal, Lisboa, Lisboa","Artigo 24.º, n.º 1, alínea e) do Código dos Contratos Públicos",,,,,,Não aplicável.,Não aplicável.,FALSE
Aquisição de loiça e artigos de Hotelaria durante o ano 2018,Ajuste Direto Regime Geral,Aquisição de bens móveis,"39221110-1, Louça","Centro Hospitalar Lisboa Norte, E. P. E. (508481287)","JOÃO ANTUNES AMARO, LDA (500149003)","20.686,80 €",02-01-2018,02-01-2018,365 dias,"Portugal, Lisboa, Lisboa","Artigo 20.º, n.º 1, alínea a) do Código dos Contratos Públicos",,,,,,Não aplicável.,Não aplicável.,FALSE
Aquisição de lenalidomida capsulas 5 mg,Ajuste Direto Regime Geral,Aquisição de bens móveis,"33690000-3, Medicamentos vários","Centro Hospitalar Lisboa Norte, E. P. E. (508481287)",CELGENE - SOCIEDADE UNIPESSOAL LDA (507791690),"44.529,28 €",02-01-2018,02-01-2018,1 dias,"Portugal, Lisboa, Lisboa","Artigo 24.º, n.º 1, alínea e) do Código dos Contratos Públicos",,,,,,Não aplicável.,Não aplicável.,FALSE
Aquisição de tacrolimus caps. 5 mg,Ajuste Direto Regime Geral,Aquisição de bens móveis,"33690000-3, Medicamentos vários","Centro Hospitalar Lisboa Norte, E. P. E. (508481287)","SANDOZ FARMACEUTICA, LDA (506985261)","5.544,00 €",02-01-2018,02-01-2018,1 dias,"Portugal, Lisboa, Lisboa","Artigo 24.º, n.º 1, alínea e) do Código dos Contratos Públicos",,,,,,Não aplicável.,Não aplicável.,FALSE
Aquisição de serviços de manutenção ao licenciamento SAP para o ano de 2018,Ajuste Direto Regime Geral,Aquisição de serviços,"72212218-0, Serviços de desenvolvimento de software para gestão de licenças","Centro Hospitalar Lisboa Norte, E. P. E. (508481287)","Sap Portugal - Sistemas, Aplicações e Produtos Informáticos, Sociedade Unipessoal, Lda. (504569759)","37.329,60 €",02-01-2018,02-01-2018,364 dias,"Portugal, Lisboa, Lisboa","Artigo 20.º, n.º 1, alínea a) do Código dos Contratos Públicos",,,,,,Não aplicável.,Não aplicável.,FALSE
Aquisição de subscrição de base de dados Micromedex para o ano de 2018,Ajuste Direto Regime Geral,Aquisição de serviços,"79980000-7, Serviços de assinatura","Centro Hospitalar Lisboa Norte, E. P. E. (508481287)","LOGISER - SERVIÇOS E SUPORTES LÓGICOS, S.A. (501486852)","30.900,00 €",02-01-2018,02-01-2018,365 dias,"Portugal, Lisboa, Lisboa","Artigo 24.º, n.º 1, alínea e) do Código dos Contratos Públicos",,,,,,Não aplicável.,Não aplicável.,FALSE
Aquisição de serviços de desinfestação das instalações do CHLN,Ajuste Direto Regime Geral,Aquisição de serviços,"90921000-9, Serviços de desinfecção e exterminação","Centro Hospitalar Lisboa Norte, E. P. E. (508481287)",LUTHISA LUSITANA DE TRATAMENTOS DE HIGIENE LDA (506012050),"6.035,04 €",02-01-2018,02-01-2018,181 dias,"Portugal, Lisboa, Lisboa","Artigo 20.º, n.º 1, alínea a) do Código dos Contratos Públicos",,,,,,Não aplicável.,Não aplicável.,FALSE
Compra centralizada de medicamentos - P259-AC-2017-195,Ao abrigo de acordo-quadro (art.º 259.º),Aquisição de bens móveis,"33690000-3, Medicamentos vários","Centro Hospitalar Lisboa Norte, E. P. E. (508481287)","SANOFI - PRODUTOS FARMACÊUTICOS, LDA. (500134960)","19.382,79 €",02-01-2018,02-01-2018,365 dias,"Portugal, Lisboa, Lisboa",Artigo 259.º do Código dos Contratos Públicos,,,,,,1771819,CP 2015/6 - Acordo quadro para o fornecimento de Medicamentos do Foro Oncológico,FALSE
189G000022 - Aquisição de serviços de manutenção ao equipamento e sistemas de gestão e controlo do parque de estacionamento para o ano de 2018,Ajuste Direto Regime Geral,Aquisição de serviços,"98351000-8, Serviços de gestão de parques de estacionamento","CENTRO HOSPITALAR LISBOA NORTE, EPE (508481287)","Fernando L. Gaspar - Sinalização e Equipamentos Rodoviários, S.A. (502042044)","18.365,76 €",02-01-2018,02-01-2018,364 dias,"Portugal, Lisboa, Lisboa","Artigo 24.º, n.º 1, alínea e) do Código dos Contratos Públicos",,,,,,Não aplicável.,Não aplicável.,FALSE
189G000011 - Aquisição de serviços de manutenção aos equipamentos de esterilização AJCOSTA para o ano de 2018,Ajuste Direto Regime Geral,Aquisição de serviços,"50421000-2, Serviços de reparação e manutenção de equipamento médico","CENTRO HOSPITALAR LISBOA NORTE, EPE (508481287)","A.J. COSTA, LDA (500002576)","4.080,48 €",02-01-2018,02-01-2018,365 dias,"Portugal, Lisboa, Lisboa","Artigo 24.º, n.º 1, alínea e) do Código dos Contratos Públicos",,,,,,Não aplicável.,Não aplicável.,FALSE
189G000053 - Empreitada para execução da obra de substituição de tubo de esgoto - Serviço de Gestão de Compras - CHLN - HSM,Ajuste Direto Regime Geral,Empreitadas de obras públicas,"45232400-6, Obras de construção de esgotos","Centro Hospitalar Lisboa Norte, E. P. E. (508481287)","C.E Gonçalves, Lda (508657520)","4.820,00 €",02-01-2018,02-01-2018,21 dias,"Portugal, Lisboa, Lisboa","Artigo 19.º, alínea a) do Código dos Contratos Públicos",,,,,,Não aplicável.,Não aplicável.,FALSE
189G000040 - Aquisição de serviços de manutenção  aos equipamentos de ecografia Aloka para o ano de 2018,Ajuste Direto Regime Geral,Aquisição de serviços,"50421200-4, Serviços de reparação e manutenção de equipamentos de raios X","Centro Hospitalar Lisboa Norte, E. P. E. (508481287)","Multipore - Comércio Internacional, Lda. (501471111)","5.400,00 €",02-01-2018,02-01-2018,365 dias,"Portugal, Lisboa, Lisboa","Artigo 24.º, n.º 1, alínea e) do Código dos Contratos Públicos",,,,,,Não aplicável.,Não aplicável.,FALSE
189G000019 - Aquisição de serviços de manutenção ao sistema pneumático para transporte de amostras clínicas e medicamentos avulso para o ano de 2018,Ajuste Direto Regime Geral,Aquisição de serviços,"50421000-2, Serviços de reparação e manutenção de equipamento médico","Centro Hospitalar Lisboa Norte, E. P. E. (508481287)",JJL INSTALAÇÕES ELÉTRICAS LDA (506310132),"3.381,95 €",02-01-2018,02-01-2018,365 dias,"Portugal, Lisboa, Lisboa","Artigo 24.º, n.º 1, alínea e) do Código dos Contratos Públicos",,,,,,Não aplicável.,Não aplicável.,FALSE
189G000032 - Aquisição de serviços de manutenção ao sistema de sinalização semafórica para o ano de 2018,Ajuste Direto Regime Geral,Aquisição de serviços,"50232000-0, Serviços de manutenção de dispositivos para iluminação pública e de semáforos","Centro Hospitalar Lisboa Norte, E. P. E. (508481287)","Siemens, S.A. (500247480)","2.210,04 €",02-01-2018,02-01-2018,365 dias,"Portugal, Lisboa, Lisboa","Artigo 24.º, n.º 1, alínea e) do Código dos Contratos Públicos",,,,,,Não aplicável.,Não aplicável.,FALSE
Aquisição de serviços de manutenção à solução Healthlog para o ano 2018.,Ajuste Direto Regime Geral,Aquisição de serviços,"72212213-5, Serviços de desenvolvimento de software para melhoria de sistemas operativos","CENTRO HOSPITALAR LISBOA NORTE, EPE (508481287)",BUROTICA LDA (501178503),"5.913,60 €",02-01-2018,02-01-2018,365 dias,"Portugal, Lisboa, Lisboa","Artigo 20.º, n.º 1, alínea a) do Código dos Contratos Públicos",,,,,,Não aplicável.,Não aplicável.,FALSE
Aquisição de serviços de manutenção babymatch ¿ sistema antirroubo para o ano de 2018.,Ajuste Direto Regime Geral,Aquisição de serviços,"50324100-3, Serviços de manutenção de sistemas","CENTRO HOSPITALAR LISBOA NORTE, EPE (508481287)",Infocontrol (501395784),"2.357,04 €",02-01-2018,02-01-2018,365 dias,"Portugal, Lisboa, Lisboa","Artigo 20.º, n.º 1, alínea a) do Código dos Contratos Públicos",,,,,,Não aplicável.,Não aplicável.,FALSE
189G000018 - Aquisição de serviços de manutenção ao sistema controlo acesso e cobrança Via Verde para o ano de 2018,Ajuste Direto Regime Geral,Aquisição de serviços,"50421000-2, Serviços de reparação e manutenção de equipamento médico","Centro Hospitalar Lisboa Norte, E. P. E. (508481287)","Brisa Inovação, S.A. (505216035)","8.548,08 €",02-01-2018,02-01-2018,365 dias,"Portugal, Lisboa, Lisboa","Artigo 24.º, n.º 1, alínea e) do Código dos Contratos Públicos",,,,,,Não aplicável.,Não aplicável.,FALSE
189G000024 - Aquisição de serviços de manutenção ao equipamento de distribuição de medicação para o ano de 2018,Ajuste Direto Regime Geral,Aquisição de serviços,"50422000-9, Serviços de reparação e manutenção de equipamento cirúrgico","Centro Hospitalar Lisboa Norte, EPE (508481287)","Glintt, Business Solutions, Lda. (503502537)","2.640,00 €",02-01-2018,02-01-2018,365 dias,"Portugal, Lisboa, Lisboa","Artigo 24.º, n.º 1, alínea e) do Código dos Contratos Públicos",,,,,,Não aplicável.,Não aplicável.,FALSE
189G000023 - Aquisição de serviços de manutenção ao equipamento de separação celular para o ano de 2018,Ajuste Direto Regime Geral,Aquisição de serviços,"50422000-9, Serviços de reparação e manutenção de equipamento cirúrgico","CENTRO HOSPITALAR LISBOA NORTE, EPE (508481287)","FRESENIUS KABI PHARMA PORTUGAL, LDA (504293753)","5.464,80 €",02-01-2018,02-01-2018,365 dias,"Portugal, Lisboa, Lisboa","Artigo 24.º, n.º 1, alínea e) do Código dos Contratos Públicos",,,,,,Não aplicável.,Não aplicável.,FALSE
189G000031 - Aquisição de serviços de manutenção aos equipamentos de EMG Keypoint para ano de 2018,Ajuste Direto Regime Geral,Aquisição de serviços,"50421000-2, Serviços de reparação e manutenção de equipamento médico","CENTRO HOSPITALAR LISBOA NORTE, EPE (508481287)","MUNDINTER,S.A. (500199906)","573,00 €",02-01-2018,02-01-2018,365 dias,"Portugal, Lisboa, Lisboa","Artigo 24.º, n.º 1, alínea e) do Código dos Contratos Públicos",,,,,,Não aplicável.,Não aplicável.,FALSE
Aquisição de serviços de manutenção à solução do sistema digital ECG´s para o ano de 2018,Ajuste Direto Regime Geral,Aquisição de serviços,"50324100-3, Serviços de manutenção de sistemas","CENTRO HOSPITALAR LISBOA NORTE, EPE (508481287)",CARDIO SOLUCIONS (507158865),"5.970,36 €",02-01-2018,02-01-2018,364 dias,"Portugal, Lisboa, Lisboa","Artigo 20.º, n.º 1, alínea a) do Código dos Contratos Públicos",,,,,,Não aplicável.,Não aplicável.,FALSE
Aquisição de serviços de manutenção às soluções de Radioterapia Elekta para o ano de 2018,Ajuste Direto Regime Geral,Aquisição de serviços,"50312610-4, Manutenção de equipamento para as tecnologias da informação","Centro Hospitalar Lisboa Norte, E. P. E. (508481287)","RRTS Unipessoal, Lda. (514185155)","125.899,27 €",02-01-2018,02-01-2018,364 dias,"Portugal, Lisboa, Lisboa","Artigo 24.º, n.º 1, alínea e) do Código dos Contratos Públicos",,,,,,Não aplicável.,Não aplicável.,FALSE
Aquisição de pacote de horas para manutenção e apoio de soluções Máximo para o ano de 2018,Ajuste Direto Regime Geral,Aquisição de serviços,"72212430-2, Serviços de desenvolvimento de software para gestão de inventários","Centro Hospitalar Lisboa Norte, EPE (508481287)","Companhia IBM Portuguesa, S.A. (500068801)","9.744,00 €",02-01-2018,02-01-2018,365 dias,"Portugal, Lisboa, Lisboa","Artigo 20.º, n.º 1, alínea a) do Código dos Contratos Públicos",,,,,,Não aplicável.,Não aplicável.,FALSE
"Aquisição de serviços de ligação à internet no Centro Hospitalar Lisboa Norte, E.P.E. para o ano de 2018",Ajuste Direto Regime Geral,Aquisição de serviços,"72400000-4, Serviços de Internet","CENTRO HOSPITALAR LISBOA NORTE, EPE (508481287)","Onitelecom - Infocomunicações, S.A (504073206)","2.940,00 €",02-01-2018,02-01-2018,365 dias,"Portugal, Lisboa, Lisboa","Artigo 20.º, n.º 1, alínea a) do Código dos Contratos Públicos",,,,,,Não aplicável.,Não aplicável.,FALSE
Empreitada para execução da obra de instalação de um sistema de vídeo-porteiro no Serviço de Gestão Farmacêutica - Unidade de Gestão de Medicamento e Outros Produtos Farmacêuticos - CHLN-HSM,Ajuste Direto Regime Geral,Empreitadas de obras públicas,"45233292-2, Instalação de equipamento de segurança","Centro Hospitalar Lisboa Norte, E. P. E. (508481287)","Pontiluz, Lda. (501989048)","1.320,25 €",02-01-2018,02-01-2018,8 dias,"Portugal, Lisboa, Lisboa","Artigo 19.º, alínea a) do Código dos Contratos Públicos",,,,,,Não aplicável.,Não aplicável.,FALSE
Aquisição de socos para Bloco durante o ano 2018,Ajuste Direto Regime Geral,Aquisição de bens móveis,"18110000-3, Vestuário profissional","Centro Hospitalar Lisboa Norte, E. P. E. (508481287)","Gameiros Material Clinico, Lda (503326305)","3.400,00 €",02-01-2018,02-01-2018,365 dias,"Portugal, Lisboa, Lisboa","Artigo 20.º, n.º 1, alínea a) do Código dos Contratos Públicos",,,,,,Não aplicável.,Não aplicável.,FALSE
Empreitada para execução da obra de fornecimento e montagem de aparelhos de ar condicionado na Sala de Espera da Farmácia Comercial,Ajuste Direto Regime Geral,Empreitadas de obras públicas,"45331220-4, Instalação de ar condicionado","Centro Hospitalar Lisboa Norte, EPE (508481287)","TERMOSUL - PROJECTOS E INSTALAÇÕES, S.A (501255869)","8.666,74 €",02-01-2018,02-01-2018,60 dias,"Portugal, Lisboa, Lisboa","Artigo 19.º, alínea a) do Código dos Contratos Públicos",,,,,,Não aplicável.,Não aplicável.,FALSE
Aquisição de pulseiras de identificação de doentes durante o ano 2018,Ajuste Direto Regime Geral,Aquisição de bens móveis,"22455100-5, Pulseiras de identificação","Centro Hospitalar Lisboa Norte, E. P. E. (508481287)",AVIQUIMICA IMPORT E MANUFATURA (500039720),"4.367,72 €",02-01-2018,02-01-2018,365 dias,"Portugal, Lisboa, Lisboa","Artigo 20.º, n.º 1, alínea a) do Código dos Contratos Públicos",,,,,,Não aplicável.,Não aplicável.,FALSE
Aquisição de serviços de ligação à PSP e Hotline HSM e HPV para Saloc para o ano de 2018,Ajuste Direto Regime Geral,Aquisição de serviços,"64210000-1, Serviços telefónicos e de transmissão de dados","Centro Hospitalar Lisboa Norte, E. P. E. (508481287)","PT Comunicações, SA (504615947)","1.247,16 €",02-01-2018,02-01-2018,365 dias,"Portugal, Lisboa, Lisboa","Artigo 20.º, n.º 1, alínea a) do Código dos Contratos Públicos",,,,,,Não aplicável.,Não aplicável.,FALSE
Aquisição de subscrição e suporte anual à aplicação H2ST instalada no Serviço de Saúde Ocupacional para o ano de 2018,Ajuste Direto Regime Geral,Aquisição de serviços,"72210000-0, Serviços de programação de pacotes de software","Centro Hospitalar Lisboa Norte, EPE (508481287)",F2S Software Lda (509296084),"995,00 €",02-01-2018,02-01-2018,364 dias,"Portugal, Lisboa, Lisboa","Artigo 20.º, n.º 1, alínea a) do Código dos Contratos Públicos",,,,,,Não aplicável.,Não aplicável.,FALSE
Aquisição de serviços de manutenção ao software de gestão de risco para o ano de 2018,Ajuste Direto Regime Geral,Aquisição de serviços,"72210000-0, Serviços de programação de pacotes de software","Centro Hospitalar Lisboa Norte, E. P. E. (508481287)","RISI - Recursos, Ideias e Sol. Informáticas,Lda. (503754803)","8.400,00 €",02-01-2018,02-01-2018,364 dias,"Portugal, Lisboa, Lisboa","Artigo 20.º, n.º 1, alínea a) do Código dos Contratos Públicos",,,,,,Não aplicável.,Não aplicável.,FALSE
Aquisição de serviços de manutenção ao sistema docbase para o ano de 2018.,Ajuste Direto Regime Geral,Aquisição de serviços,"50312310-1, Manutenção de equipamento para redes de dados","CENTRO HOSPITALAR LISBOA NORTE, EPE (508481287)","MOBILWAVE-TECNOLOGIAS DE INFORMAÇÃO, S.A. (506929183)","4.801,68 €",02-01-2018,02-01-2018,365 dias,"Portugal, Lisboa, Lisboa","Artigo 20.º, n.º 1, alínea a) do Código dos Contratos Públicos",,,,,,Não aplicável.,Não aplicável.,FALSE
Aquisição de uma Camara de Fluxo Laminar para o Serviço de Gestão Técnico Farmacêutica - Unidade de Gestão de Material de Consumo Clínico,Ajuste Direto Regime Geral,Aquisição de bens móveis,"38436730-6, Câmaras de fluxo contínuo para desintegradores ultrassónicos","CENTRO HOSPITALAR LISBOA NORTE, EPE (508481287)",Labocontrole Ldª (501872329),"15.950,00 €",02-01-2018,22-11-2017,45 dias,"Portugal, Lisboa, Lisboa","Artigo 20.º, n.º 1, alínea a) do Código dos Contratos Públicos",,,,,,Não aplicável.,Não aplicável.,FALSE
Aquisição de serviços de manutenção ao software aplicacional Cardiobase para o ano de 2018,Ajuste Direto Regime Geral,Aquisição de serviços,"72212180-4, Serviços de desenvolvimento de software para medicina","Centro Hospitalar Lisboa Norte, E. P. E. (508481287)","INFORTUCANO, LDA. (503586293)","9.975,00 €",02-01-2018,02-01-2018,364 dias,"Portugal, Lisboa, Lisboa","Artigo 20.º, n.º 1, alínea a) do Código dos Contratos Públicos",,,,,,Não aplicável.,Não aplicável.,FALSE
Aquisição de serviços para transmissão de dados em equipamentos móveis para o ano de 2018,Ajuste Direto Regime Geral,Aquisição de serviços,"72400000-4, Serviços de Internet","Centro Hospitalar Lisboa Norte, EPE (508481287)",Nos (502604751),"2.280,00 €",02-01-2018,02-01-2018,364 dias,"Portugal, Lisboa, Lisboa","Artigo 20.º, n.º 1, alínea a) do Código dos Contratos Públicos",,,,,,Não aplicável.,Não aplicável.,FALSE
Aquisição de serviços de manutenção às centrais  / telefones para o ano de 2018,Ajuste Direto Regime Geral,Aquisição de serviços,"50334140-8, Serviços de reparação e manutenção de aparelhos telefónicos","Centro Hospitalar Lisboa Norte, E. P. E. (508481287)",PAHLDATA PORTUGAL COMERCIO EQUIPAMENTO DE INFORMÁTICA SA (501823913),"24.960,00 €",02-01-2018,02-01-2018,364 dias,"Portugal, Lisboa, Lisboa","Artigo 20.º, n.º 1, alínea a) do Código dos Contratos Públicos",,,,,,Não aplicável.,Não aplicável.,FALSE
CP n.º 177A000016 - Aquisição de um ecógrafo com duas sondas de ecógrafo para o Serviço de Nefrologia e Transplantação Renal - MCDT's -  Hemoliálise,Concurso público,Aquisição de bens móveis,"33124120-2, Aparelhos de ultra-sons","Centro Hospitalar Lisboa Norte, E. P. E. (508481287)",GENERAL ELETRIC (500357129),"17.500,00 €",02-01-2018,02-01-2018,25 dias,"Portugal, Lisboa, Lisboa","Artigo 20.º, n.º 1, alínea b) do Código dos Contratos Públicos",,,,,,Não aplicável.,Não aplicável.,FALSE
