Objeto do Contrato,Tipo de Procedimento,Tipo(s) de Contrato,CPVs,Entidade(s) Adjudicante(s),Entidade(s) Adjudicatária(s),Preço Contratual,Data de Publicação,Data de Celebração do Contrato,Prazo de Execução,Local de Execução,Fundamentação,Data de Fecho do Contrato,Preço Total Efetivo,Causas das Alterações ao Prazo,Causas das Alterações ao Preço,Estado,N.º registo do Acordo Quadro,Descrição do Acordo Quadro,Procedimento Centralizado
Contrato Adicional nº 21 da Empreitada de Construção do Centro Materno Infantil do Norte,Ajuste Direto Regime Geral,Empreitadas de obras públicas,"45000000-7, Construção","Centro Hospitalar Porto, E. P. E. (508331471)","MRG, Construction,SA (503156035)","8.174,42 €",26-01-2017,25-07-2016,14 dias,"Portugal, Porto, Porto","Artigo 24.º, n.º 1, alínea e) do Código dos Contratos Públicos","","8.174,42 €",Não Aplicável,Não Aplicável,,Não aplicável.,Não aplicável.,FALSE
Contrato Adicional nº 20 da Empreitada de Construção do Centro Materno Infantil do Norte,Ajuste Direto Regime Geral,Empreitadas de obras públicas,"45000000-7, Construção","Centro Hospitalar Porto, E. P. E. (508331471)","MRG, Construction, SA (503156035)","67.567,14 €",26-01-2017,03-06-2016,309 dias,"Portugal, Porto, Porto","Artigo 24.º, n.º 1, alínea e) do Código dos Contratos Públicos","","67.567,14 €",Não aplicável,Não aplicável,,Não aplicável.,Não aplicável.,FALSE
AQUISIÇÃO DE VENTILADORES MECÂNICOS NEONATAIS E PEDIATRICOS,Ajuste Direto Regime Geral,Aquisição de bens móveis,"39714100-1, Ventiladores","Centro Hospitalar do Porto, E.P.E. (CHP) (508331471)",MEDTRONIC (504223933),"21.000,00 €",23-01-2017,23-03-2016,30 dias,"Portugal, Porto, Porto","Artigo 20.º, n.º 1, alínea a) do Código dos Contratos Públicos",20-10-2016,"21.000,00 €",NÃO APLICÁVEL,NÃO APLICÁVEL,,Não aplicável.,Não aplicável.,FALSE
