freguesia,acronym,validVotesPercentage,votes,dicofre
Gâmbia-Pontes-Alto da Guerra,PS,35.93,641,151207
Gâmbia-Pontes-Alto da Guerra,PCP-PEV,20.24,361,151207
Gâmbia-Pontes-Alto da Guerra,B.E.,12.39,221,151207
Gâmbia-Pontes-Alto da Guerra,PPD/PSD,10.09,180,151207
Gâmbia-Pontes-Alto da Guerra,PAN,6.95,124,151207
Gâmbia-Pontes-Alto da Guerra,CDS-PP,5.33,95,151207
Gâmbia-Pontes-Alto da Guerra,L,2.24,40,151207
Gâmbia-Pontes-Alto da Guerra,PPM.PPV/CDC,1.46,26,151207
Gâmbia-Pontes-Alto da Guerra,PCTP/MRPP,1.4,25,151207
Gâmbia-Pontes-Alto da Guerra,A,1.12,20,151207
Gâmbia-Pontes-Alto da Guerra,PNR,0.84,15,151207
Gâmbia-Pontes-Alto da Guerra,NC,0.62,11,151207
Gâmbia-Pontes-Alto da Guerra,PDR,0.56,10,151207
Gâmbia-Pontes-Alto da Guerra,IL,0.45,8,151207
Gâmbia-Pontes-Alto da Guerra,PURP,0.22,4,151207
Gâmbia-Pontes-Alto da Guerra,PTP,0.11,2,151207
Gâmbia-Pontes-Alto da Guerra,MAS,0.06,1,151207
