freguesia,acronym,validVotesPercentage,votes,dicofre
Cavadoude,PS,54.73,81,090713
Cavadoude,PPD/PSD,24.32,36,090713
Cavadoude,B.E.,10.81,16,090713
Cavadoude,CDS-PP,2.7,4,090713
Cavadoude,R.I.R.,2.7,4,090713
Cavadoude,L,1.35,2,090713
Cavadoude,PCP-PEV,1.35,2,090713
Cavadoude,NC,0.68,1,090713
Cavadoude,PDR,0.68,1,090713
Cavadoude,PURP,0.68,1,090713
Cavadoude,A,0,0,090713
Cavadoude,CH,0,0,090713
Cavadoude,IL,0,0,090713
Cavadoude,MPT,0,0,090713
Cavadoude,PAN,0,0,090713
Cavadoude,PCTP/MRPP,0,0,090713
Cavadoude,PNR,0,0,090713
Cavadoude,PPM,0,0,090713
Cavadoude,PTP,0,0,090713
