freguesia,acronym,validVotesPercentage,votes,dicofre
União das freguesias de Eiras e Mei,PPD/PSD,44.33,90,160155
União das freguesias de Eiras e Mei,PS,38.92,79,160155
União das freguesias de Eiras e Mei,CDS-PP,4.93,10,160155
União das freguesias de Eiras e Mei,PCP-PEV,4.93,10,160155
União das freguesias de Eiras e Mei,B.E.,1.97,4,160155
União das freguesias de Eiras e Mei,PCTP/MRPP,1.48,3,160155
União das freguesias de Eiras e Mei,A,0.99,2,160155
União das freguesias de Eiras e Mei,PURP,0.99,2,160155
União das freguesias de Eiras e Mei,PAN,0.49,1,160155
União das freguesias de Eiras e Mei,PNR,0.49,1,160155
União das freguesias de Eiras e Mei,PTP,0.49,1,160155
União das freguesias de Eiras e Mei,CH,0,0,160155
União das freguesias de Eiras e Mei,IL,0,0,160155
União das freguesias de Eiras e Mei,JPP,0,0,160155
União das freguesias de Eiras e Mei,L,0,0,160155
União das freguesias de Eiras e Mei,MPT,0,0,160155
União das freguesias de Eiras e Mei,NC,0,0,160155
União das freguesias de Eiras e Mei,PDR,0,0,160155
União das freguesias de Eiras e Mei,PPM,0,0,160155
União das freguesias de Eiras e Mei,R.I.R.,0,0,160155
