Objeto do Contrato,Tipo de Procedimento,Tipo(s) de Contrato,CPVs,Entidade(s) Adjudicante(s),Entidade(s) Adjudicatária(s),Preço Contratual,Data de Publicação,Data de Celebração do Contrato,Prazo de Execução,Local de Execução,Fundamentação,Data de Fecho do Contrato,Preço Total Efetivo,Causas das Alterações ao Prazo,Causas das Alterações ao Preço,Estado,N.º registo do Acordo Quadro,Descrição do Acordo Quadro,Procedimento Centralizado
Reparação da Chaminé do Pavilhão Satélite - Unidade I,Ajuste Direto Regime Geral,Empreitadas de obras públicas,"45453000-7, Obras de revisão e recuperação","Centro Hospitalar Vila Nova de Gaia - Espinho, E. P. E. (508142156)","FSA - Construções Unipessoal, Lda (510490530)","60.000,00 €",10-12-2014,02-12-2014,90 dias,"Portugal, Porto, Vila Nova de Gaia","Artigo 19.º, alínea a) do Código dos Contratos Públicos",,,,,,Não aplicável.,Não aplicável.,FALSE
Aquisição de Filtros de Ar para Manutenção de Equipamento AVAC,Ajuste Direto Regime Geral,Aquisição de bens móveis,"42514310-8, Filtros de ar","Centro Hospitalar Vila Nova de Gaia - Espinho, E. P. E. (508142156)","RUBIFIL - Filtros para ar cond. e ventilação, Lda (503173428)","790,77 €",09-12-2014,27-11-2014,35 dias,"Portugal, Porto, Vila Nova de Gaia","Artigo 20.º, n.º 1, alínea a) do Código dos Contratos Públicos",,,,,,Não aplicável.,Não aplicável.,FALSE
Aquisição de Filtros de Ar para Manutenção de Equipamento AVAC,Ajuste Direto Regime Geral,Aquisição de bens móveis,"42514310-8, Filtros de ar","Centro Hospitalar Vila Nova de Gaia - Espinho, E. P. E. (508142156)",Iberconcept Lda. (507212738),"14.773,76 €",09-12-2014,27-11-2014,35 dias,"Portugal, Porto, Vila Nova de Gaia","Artigo 20.º, n.º 1, alínea a) do Código dos Contratos Públicos",,,,,,Não aplicável.,Não aplicável.,FALSE
Aquisição de Filtros de Ar para Manutenção de Equipamento AVAC,Ajuste Direto Regime Geral,Aquisição de bens móveis,"42514310-8, Filtros de ar","Centro Hospitalar Vila Nova de Gaia - Espinho, E. P. E. (508142156)","FRITECNIL - Climatização e Frio, Lda (502326697)","1.804,30 €",09-12-2014,27-11-2014,35 dias,"Portugal, Porto, Vila Nova de Gaia","Artigo 20.º, n.º 1, alínea a) do Código dos Contratos Públicos",,,,,,Não aplicável.,Não aplicável.,FALSE
Aquisição de Filtros de Ar para Manutenção de Equipamentos AVAC,Ajuste Direto Regime Geral,Aquisição de bens móveis,"42514310-8, Filtros de ar","Centro Hospitalar Vila Nova de Gaia - Espinho, E. P. E. (508142156)","Filterwin, Lda (510204023)","25.287,00 €",09-12-2014,27-11-2014,35 dias,"Portugal, Porto, Vila Nova de Gaia","Artigo 20.º, n.º 1, alínea a) do Código dos Contratos Públicos",,,,,,Não aplicável.,Não aplicável.,FALSE
Aquisição de Fraldas Irrecuperáveis Adulto,Ajuste Direto Regime Geral,Aquisição de bens móveis,"33751000-9, Fraldas descartáveis","Centro Hospitalar Vila Nova de Gaia - Espinho, E. P. E. (508142156)","Quilaban - Quimica Laboratorial Analitica, S.A. (500399670)","22.800,00 €",04-12-2014,21-01-2014,90 dias,"Portugal, Porto, Vila Nova de Gaia","Artigo 24.º, n.º 1, alínea c) do Código dos Contratos Públicos",,,,,,Não aplicável.,Não aplicável.,FALSE
Aquisição de Oxigenadores de Membrana c/ Conj de Tubos,Ajuste Direto Regime Geral,Aquisição de bens móveis,"33157800-3, Dispositivo para administração de oxigénio","Centro Hospitalar Vila Nova de Gaia - Espinho, E. P. E. (508142156)",Maquet Portugal (506819698),"12.960,00 €",04-12-2014,21-01-2014,30 dias,"Portugal, Porto, Vila Nova de Gaia","Artigo 24.º, n.º 1, alínea c) do Código dos Contratos Públicos",,,,,,Não aplicável.,Não aplicável.,FALSE
Aquisição de Neuroestimulador de raizes sagradas c/ acessórios,Ajuste Direto Regime Geral,Aquisição de bens móveis,"33100000-1, Equipamento médico","Centro Hospitalar Vila Nova de Gaia - Espinho, E. P. E. (508142156)",Medtronic (504223933),"18.500,00 €",04-12-2014,21-01-2014,10 dias,"Portugal, Porto, Vila Nova de Gaia","Artigo 24.º, n.º 1, alínea c) do Código dos Contratos Públicos",,,,,,Não aplicável.,Não aplicável.,FALSE
Aquisição deSonda de Laser Curva 20G,Ajuste Direto Regime Geral,Aquisição de bens móveis,"33141641-5, Sondas","Centro Hospitalar Vila Nova de Gaia - Espinho, E. P. E. (508142156)",ALCON Portugal (501251685),"7.200,00 €",04-12-2014,21-01-2014,100 dias,"Portugal, Porto, Vila Nova de Gaia","Artigo 24.º, n.º 1, alínea c) do Código dos Contratos Públicos",,,,,,Não aplicável.,Não aplicável.,FALSE
Aquisição de Anticorpo Pre-Diluido,Ajuste Direto Regime Geral,Aquisição de bens móveis,"33696000-5, Reagentes e meios de contraste","Centro Hospitalar Vila Nova de Gaia - Espinho, E. P. E. (508142156)","Roche Sistemas de Diagnóstico, Lda (504282921)","9.125,00 €",04-12-2014,21-01-2014,100 dias,"Portugal, Porto, Vila Nova de Gaia","Artigo 24.º, n.º 1, alínea c) do Código dos Contratos Públicos",,,,,,Não aplicável.,Não aplicável.,FALSE
Aquisição de Reagentes Para Equipamento ViteK,Ajuste Direto Regime Geral,Aquisição de bens móveis,"33696000-5, Reagentes e meios de contraste","Centro Hospitalar Vila Nova de Gaia - Espinho, E. P. E. (508142156)",BIOMERIEUX PORTUGUESA (501524177),"7.401,09 €",02-12-2014,21-01-2014,100 dias,"Portugal, Porto, Vila Nova de Gaia","Artigo 24.º, n.º 1, alínea e) do Código dos Contratos Públicos",,,,,,Não aplicável.,Não aplicável.,FALSE
Aquisição de Medicamentos do Aparelho Locomotor,Ajuste Direto Regime Geral,Aquisição de bens móveis,"33600000-6, Produtos farmacêuticos","Centro Hospitalar Vila Nova de Gaia - Espinho, E. P. E. (508142156)","ABBVIE, LDA (510229050)","2.568,72 €",02-12-2014,21-01-2014,100 dias,"Portugal, Porto, Vila Nova de Gaia","Artigo 24.º, n.º 1, alínea c) do Código dos Contratos Públicos",,,,,,Não aplicável.,Não aplicável.,FALSE
Aquisição de Medicamentos do Aparelho Locomotor,Ajuste Direto Regime Geral,Aquisição de bens móveis,"33600000-6, Produtos farmacêuticos","Centro Hospitalar Vila Nova de Gaia - Espinho, E. P. E. (508142156)",Actavis As Sucursal (980334934),"896,40 €",02-12-2014,21-01-2014,100 dias,"Portugal, Porto, Vila Nova de Gaia","Artigo 24.º, n.º 1, alínea c) do Código dos Contratos Públicos",,,,,,Não aplicável.,Não aplicável.,FALSE
Aquisição de Medicamentos do Aparelho Locomotor,Ajuste Direto Regime Geral,Aquisição de bens móveis,"33600000-6, Produtos farmacêuticos","Centro Hospitalar Vila Nova de Gaia - Espinho, E. P. E. (508142156)",HOSPIRA (502918098),"833,40 €",02-12-2014,21-01-2014,100 dias,"Portugal, Porto, Vila Nova de Gaia","Artigo 24.º, n.º 1, alínea c) do Código dos Contratos Públicos",,,,,,Não aplicável.,Não aplicável.,FALSE
Aquisição de Medicamentos do Aparelho Locomotor,Ajuste Direto Regime Geral,Aquisição de bens móveis,"33600000-6, Produtos farmacêuticos","Centro Hospitalar Vila Nova de Gaia - Espinho, E. P. E. (508142156)","Generis - Farmacêutica, SA (508107997)","2.818,58 €",02-12-2014,21-01-2014,100 dias,"Portugal, Porto, Vila Nova de Gaia","Artigo 24.º, n.º 1, alínea c) do Código dos Contratos Públicos",,,,,,Não aplicável.,Não aplicável.,FALSE
Aquisição de Medicamentos do Aparelho Locomotor,Ajuste Direto Regime Geral,Aquisição de bens móveis,"33600000-6, Produtos farmacêuticos","Centro Hospitalar Vila Nova de Gaia - Espinho, E. P. E. (508142156)","LABESFAL - LABORATÓRIOS ALMIRO, SA (501169580)","576,00 €",02-12-2014,21-01-2014,100 dias,"Portugal, Porto, Vila Nova de Gaia","Artigo 24.º, n.º 1, alínea c) do Código dos Contratos Públicos",,,,,,Não aplicável.,Não aplicável.,FALSE
Aquisição de Medicamentos do Aparelho Locomotor,Ajuste Direto Regime Geral,Aquisição de bens móveis,"33600000-6, Produtos farmacêuticos","Centro Hospitalar Vila Nova de Gaia - Espinho, E. P. E. (508142156)","LABORATORIOS PFIZER, LDA (500162166)","26.013,00 €",02-12-2014,21-01-2014,100 dias,"Portugal, Porto, Vila Nova de Gaia","Artigo 24.º, n.º 1, alínea c) do Código dos Contratos Públicos",,,,,,Não aplicável.,Não aplicável.,FALSE
Aquisição de Medicamentos do Aparelho Locomotor,Ajuste Direto Regime Geral,Aquisição de bens móveis,"33600000-6, Produtos farmacêuticos","Centro Hospitalar Vila Nova de Gaia - Espinho, E. P. E. (508142156)","LABORATORIOS VITÓRIA, S.A (500162220)","126,24 €",02-12-2014,21-01-2014,100 dias,"Portugal, Porto, Vila Nova de Gaia","Artigo 24.º, n.º 1, alínea c) do Código dos Contratos Públicos",,,,,,Não aplicável.,Não aplicável.,FALSE
Aquisição de Medicamentos do Aparelho Locomotor,Ajuste Direto Regime Geral,Aquisição de bens móveis,"33600000-6, Produtos farmacêuticos","Centro Hospitalar Vila Nova de Gaia - Espinho, E. P. E. (508142156)","LABORATÓRIO MEDINFAR, S.A. (500384045)","1.320,00 €",02-12-2014,21-01-2014,100 dias,"Portugal, Porto, Vila Nova de Gaia","Artigo 24.º, n.º 1, alínea c) do Código dos Contratos Públicos",,,,,,Não aplicável.,Não aplicável.,FALSE
Aquisição de Medicamentos do Aparelho Locomotor,Ajuste Direto Regime Geral,Aquisição de bens móveis,"33600000-6, Produtos farmacêuticos","Centro Hospitalar Vila Nova de Gaia - Espinho, E. P. E. (508142156)","Overpharma, Lda. (505792362)","172,10 €",02-12-2014,21-01-2014,100 dias,"Portugal, Porto, Vila Nova de Gaia","Artigo 24.º, n.º 1, alínea c) do Código dos Contratos Públicos",,,,,,Não aplicável.,Não aplicável.,FALSE
Aquisição de Medicamentos do Aparelho Locomotor,Ajuste Direto Regime Geral,Aquisição de bens móveis,"33600000-6, Produtos farmacêuticos","Centro Hospitalar Vila Nova de Gaia - Espinho, E. P. E. (508142156)","AMGEN - BIOFARMACÊUTICA, LDA (502942959)","16.296,45 €",02-12-2014,21-01-2014,100 dias,"Portugal, Porto, Vila Nova de Gaia","Artigo 24.º, n.º 1, alínea c) do Código dos Contratos Públicos",,,,,,Não aplicável.,Não aplicável.,FALSE
Aquisição de Medicamentos do Aparelho Locomotor,Ajuste Direto Regime Geral,Aquisição de bens móveis,"33600000-6, Produtos farmacêuticos","Centro Hospitalar Vila Nova de Gaia - Espinho, E. P. E. (508142156)","RATIOPHARM, LDA (502414910)","49,68 €",02-12-2014,21-01-2014,100 dias,"Portugal, Porto, Vila Nova de Gaia","Artigo 24.º, n.º 1, alínea c) do Código dos Contratos Públicos",,,,,,Não aplicável.,Não aplicável.,FALSE
Aquisição de Medicamentos do Aparelho Locomotor,Ajuste Direto Regime Geral,Aquisição de bens móveis,"33600000-6, Produtos farmacêuticos","Centro Hospitalar Vila Nova de Gaia - Espinho, E. P. E. (508142156)","ANGELINI FARMACÊUTICA, LDA (500583650)","30,20 €",02-12-2014,21-01-2014,100 dias,"Portugal, Porto, Vila Nova de Gaia","Artigo 24.º, n.º 1, alínea c) do Código dos Contratos Públicos",,,,,,Não aplicável.,Não aplicável.,FALSE
Aquisição de Medicamentos do Foro Oncológico ao Abrigo do AQ 2011/06 SPMS,Ajuste Direto Regime Geral,Aquisição de bens móveis,"33600000-6, Produtos farmacêuticos","Centro Hospitalar Vila Nova de Gaia - Espinho, E. P. E. (508142156)","LABORATORIOS PFIZER, LDA (500162166)","79.257,61 €",02-12-2014,21-01-2014,60 dias,"Portugal, Porto, Vila Nova de Gaia","Artigo 24.º, n.º 1, alínea c) do Código dos Contratos Públicos",,,,,,Não aplicável.,Não aplicável.,FALSE
Aquisição de Material Diverso,Ajuste Direto Regime Geral,Aquisição de bens móveis,"33100000-1, Equipamento médico","Centro Hospitalar Vila Nova de Gaia - Espinho, E. P. E. (508142156)","P.M.H. - PROD. MÉDICO-HOSPITALARES, LDA (502376899)","24.957,80 €",02-12-2014,20-01-2014,120 dias,"Portugal, Porto, Vila Nova de Gaia","Artigo 24.º, n.º 1, alínea c) do Código dos Contratos Públicos",,,,,,Não aplicável.,Não aplicável.,FALSE
Aquisição de Reagentes para o Equipamento Sysmex,Ajuste Direto Regime Geral,Aquisição de bens móveis,"33696000-5, Reagentes e meios de contraste","Centro Hospitalar Vila Nova de Gaia - Espinho, E. P. E. (508142156)",Emilio Azevedo Campos S.A. (500094853),"74.284,00 €",02-12-2014,17-01-2014,365 dias,"Portugal, Porto, Vila Nova de Gaia","Artigo 24.º, n.º 1, alínea e) do Código dos Contratos Públicos",,,,,,Não aplicável.,Não aplicável.,FALSE
Aquisição de Campos Perneira e Trouxas,Ajuste Direto Regime Geral,Aquisição de bens móveis,"33140000-3, Material médico de consumo","Centro Hospitalar Vila Nova de Gaia - Espinho, E. P. E. (508142156)","3M Portugal, Lda (500193940)","18.403,40 €",02-12-2014,17-01-2014,120 dias,"Portugal, Porto, Vila Nova de Gaia","Artigo 24.º, n.º 1, alínea c) do Código dos Contratos Públicos",,,,,,Não aplicável.,Não aplicável.,FALSE
Aquisição de Material de Esterilização e Outros,Ajuste Direto Regime Geral,Aquisição de bens móveis,"33100000-1, Equipamento médico<BR/>33140000-3, Material médico de consumo","Centro Hospitalar Vila Nova de Gaia - Espinho, E. P. E. (508142156)","3M Portugal, Lda (500193940)","9.318,26 €",02-12-2014,20-01-2014,120 dias,"Portugal, Porto, Vila Nova de Gaia","Artigo 24.º, n.º 1, alínea c) do Código dos Contratos Públicos",,,,,,Não aplicável.,Não aplicável.,FALSE
