Objeto do Contrato,Tipo de Procedimento,Tipo(s) de Contrato,CPVs,Entidade(s) Adjudicante(s),Entidade(s) Adjudicatária(s),Preço Contratual,Data de Publicação,Data de Celebração do Contrato,Prazo de Execução,Local de Execução,Fundamentação,Data de Fecho do Contrato,Preço Total Efetivo,Causas das Alterações ao Prazo,Causas das Alterações ao Preço,Estado,N.º registo do Acordo Quadro,Descrição do Acordo Quadro,Procedimento Centralizado
DIVERSAS LÂMINAS PARA SERRA OSCILANTE,Ajuste Direto Regime Geral,Aquisição de bens móveis,"33141411-4, Bisturis e lâminas","Centro Hospitalar Tondela-Viseu, E. P. E. (509822940)","B.BRAUN MEDICAL, LDA (501506543)","30.000,00 €",21-07-2016,12-07-2016,1 dias,"Portugal, Viseu, Viseu","Artigo 24.º, n.º 1, alínea e) do Código dos Contratos Públicos",,,,,,Não aplicável.,Não aplicável.,FALSE
CARTUCHO E INDICADOR BIOLÓGICO,Ajuste Direto Regime Geral,Aquisição de bens móveis,"33190000-8, Dispositivos e produtos médicos variados","Centro Hospitalar Tondela-Viseu, E. P. E. (509822940)","VITATECH-HEALTHCARE TECNOLOGIES, LDA. (510693660)","78.761,70 €",21-07-2016,22-02-2016,1 dias,"Portugal, Viseu, Viseu","Artigo 24.º, n.º 1, alínea e) do Código dos Contratos Públicos",,,,,,Não aplicável.,Não aplicável.,FALSE
MEIOS PARA REALIZAÇÃO DE ANALISES CLÍNICAS DE COAGULAÇÃO (1) (AQ_3R/03268/2015),Ajuste Direto Regime Geral,Aquisição de bens móveis,"33696500-0, Reagentes de laboratório","Centro Hospitalar Tondela-Viseu, E. P. E. (509822940)","WERFEN PORTUGAL, LDA (501086110)","89.522,58 €",21-07-2016,23-06-2016,1 dias,"Portugal, Viseu, Viseu","Artigo 26.º, n.º 1, alínea e) do Código dos Contratos Públicos",,,,,,Não aplicável.,Não aplicável.,FALSE
KIT DETEÇÃO ENTEROBACTERIACEAE PROD CARBAPENEMASES,Ajuste Direto Regime Geral,Aquisição de bens móveis,"33696500-0, Reagentes de laboratório","Centro Hospitalar Tondela-Viseu, E. P. E. (509822940)","WERFEN PORTUGAL, LDA (501086110)","18.800,00 €",21-07-2016,11-05-2016,1 dias,"Portugal, Viseu, Viseu","Artigo 24.º, n.º 1, alínea c) do Código dos Contratos Públicos",,,,,,Não aplicável.,Não aplicável.,FALSE
Meios para realização de Análises Clínicas de Gasometrias 								,Ajuste Direto Regime Geral,Aquisição de bens móveis,"33696500-0, Reagentes de laboratório","Centro Hospitalar Tondela-Viseu, E. P. E. (509822940)","WERFEN PORTUGAL , LDA (501086110)","182.438,00 €",21-07-2016,08-06-2016,1 dias,"Portugal, Viseu, Viseu","Artigo 24.º, n.º 1, alínea e) do Código dos Contratos Públicos",,,,,,Não aplicável.,Não aplicável.,FALSE
REAGENTES PARA  MICROBIOLOGIA,Ajuste Direto Regime Geral,Aquisição de bens móveis,"33696500-0, Reagentes de laboratório","Centro Hospitalar Tondela-Viseu, E. P. E. (509822940)","IBERLAB & IMUNOREAGE, LDA (503406694)","13.500,00 €",21-07-2016,22-03-2016,1 dias,"Portugal, Viseu, Viseu","Artigo 20.º, n.º 1, alínea a) do Código dos Contratos Públicos",,,,,,Não aplicável.,Não aplicável.,FALSE
REAGENTES PARA COAGULAÇÃO,Ajuste Direto Regime Geral,Aquisição de bens móveis,"33696500-0, Reagentes de laboratório","Centro Hospitalar Tondela-Viseu, E. P. E. (509822940)","WERFEN PORTUGAL, LDA (501086110)","7.803,31 €",21-07-2016,16-03-2016,1 dias,"Portugal, Viseu, Viseu","Artigo 24.º, n.º 1, alínea c) do Código dos Contratos Públicos",,,,,,Não aplicável.,Não aplicável.,FALSE
SISTEMA CICLADORA PESSOAL HOMECHOICE 8 VIAS,Ajuste Direto Regime Geral,Aquisição de bens móveis,"33181520-3, Produtos de consumo para hemodiálise renal","Centro Hospitalar Tondela-Viseu, E. P. E. (509822940)","BAXTER MEDICO FARMACEUTICA,LD (503347345)","5.920,20 €",21-07-2016,24-06-2016,1 dias,"Portugal, Viseu, Viseu","Artigo 24.º, n.º 1, alínea e) do Código dos Contratos Públicos",,,,,,Não aplicável.,Não aplicável.,FALSE
AQUISIÇÃO DE ENZALUTAMIDA 40MG CAPS,Ajuste Direto Regime Geral,Aquisição de bens móveis,"33600000-6, Produtos farmacêuticos","Centro Hospitalar Tondela-Viseu, E. P. E. (509822940)","ASTELLAS FARMA, LDA (502540249)","8.348,76 €",20-07-2016,18-07-2016,1 dias,"Portugal, Viseu, Viseu","Artigo 26.º, n.º 1, alínea e) do Código dos Contratos Públicos",,,,,,Não aplicável.,Não aplicável.,FALSE
SACO MISTO SEM FOLE PARA ESTERILIZAÇÃO,Ajuste Direto Regime Geral,Aquisição de bens móveis,"33198200-6, Saquetas e invólucros de papel para esterilização","Centro Hospitalar Tondela-Viseu, E. P. E. (509822940)","BASTOS VIEGAS, SA (500042772)","6.550,98 €",20-07-2016,24-06-2016,1 dias,"Portugal, Viseu, Viseu","Artigo 20.º, n.º 1, alínea a) do Código dos Contratos Públicos",,,,,,Não aplicável.,Não aplicável.,FALSE
MEIOS P/ REALIZAÇÃO DE ANÁLISES DE COAGULAÇÃO,Ajuste Direto Regime Geral,Aquisição de bens móveis,"33696500-0, Reagentes de laboratório","Centro Hospitalar Tondela-Viseu, E. P. E. (509822940)","WERFEN PORTUGAL, LDA (501086110)","5.605,56 €",20-07-2016,03-03-2016,1 dias,"Portugal, Viseu, Viseu","Artigo 24.º, n.º 1, alínea c) do Código dos Contratos Públicos",,,,,,Não aplicável.,Não aplicável.,FALSE
AQUISIÇÃO DE NIVOLUMAB 10 MG/ML  INJ FR 10ML,Ajuste Direto Regime Geral,Aquisição de bens móveis,"33600000-6, Produtos farmacêuticos","Centro Hospitalar Tondela-Viseu, E. P. E. (509822940)",BRISTOL-MYERS SQUIBB FARM.PO (500048193),"17.100,00 €",20-07-2016,18-07-2016,1 dias,"Portugal, Viseu, Viseu","Artigo 24.º, n.º 1, alínea e) do Código dos Contratos Públicos",,,,,,Não aplicável.,Não aplicável.,FALSE
SACO MISTO SEM FOLE PARA ESTERILIZAÇÃO,Ajuste Direto Regime Geral,Aquisição de bens móveis,"33198200-6, Saquetas e invólucros de papel para esterilização","Centro Hospitalar Tondela-Viseu, E. P. E. (509822940)","BASTOS VIEGAS, SA (500042772)","5.140,40 €",20-07-2016,24-06-2016,1 dias,"Portugal, Viseu, Viseu","Artigo 20.º, n.º 1, alínea a) do Código dos Contratos Públicos",,,,,,Não aplicável.,Não aplicável.,FALSE
VIROLOGIA A DADORES SANGUE-(ARCHITECT) P/ANO 2016,Ajuste Direto Regime Geral,Aquisição de bens móveis,"33696500-0, Reagentes de laboratório","Centro Hospitalar Tondela-Viseu, E. P. E. (509822940)","ABBOTT LABORATORIOS, LDA (500006148)","85.454,16 €",20-07-2016,16-02-2016,1 dias,"Portugal, Viseu, Viseu","Artigo 24.º, n.º 1, alínea e) do Código dos Contratos Públicos",,,,,,Não aplicável.,Não aplicável.,FALSE
AQUISIÇÃO DE INFLIXIMAB 100MG INJ AMP,Ajuste Direto Regime Geral,Aquisição de bens móveis,"33600000-6, Produtos farmacêuticos","Centro Hospitalar Tondela-Viseu, E. P. E. (509822940)","MERCK,SHARP & DOHME-MSD, LDA (500191360)","64.750,00 €",20-07-2016,18-07-2016,1 dias,"Portugal, Viseu, Viseu","Artigo 24.º, n.º 1, alínea e) do Código dos Contratos Públicos",,,,,,Não aplicável.,Não aplicável.,FALSE
STENT CORONÁRIO EM AÇO P/ ACTP,Ajuste Direto Regime Geral,Aquisição de bens móveis,"33184100-4, Implantes cirúrgicos","Centro Hospitalar Tondela-Viseu, E. P. E. (509822940)","BIOTRONIK PORTUGAL, UNIPESSOAL LDA. (510726941)","11.120,00 €",20-07-2016,23-06-2016,1 dias,"Portugal, Viseu, Viseu","Artigo 20.º, n.º 1, alínea a) do Código dos Contratos Públicos",,,,,,Não aplicável.,Não aplicável.,FALSE
KIT TRATAMENTO HEPÁTICO,Ajuste Direto Regime Geral,Aquisição de bens móveis,"33141620-2, Kits médicos","Centro Hospitalar Tondela-Viseu, E. P. E. (509822940)","BAXTER MEDICO FARMACEUTICA,LD (503347345)","12.000,00 €",19-07-2016,24-06-2016,1 dias,"Portugal, Viseu, Viseu","Artigo 24.º, n.º 1, alínea e) do Código dos Contratos Públicos",,,,,,Não aplicável.,Não aplicável.,FALSE
TOCILIZUMAB 162MG/0.9ML SERINGA PRE-CHEIA SC,Ajuste Direto Regime Geral,Aquisição de bens móveis,"33600000-6, Produtos farmacêuticos","Centro Hospitalar Tondela-Viseu, E. P. E. (509822940)","ROCHE FARMACEUTICA QUIMICA, LDA (500233810)","8.601,50 €",19-07-2016,18-07-2016,1 dias,"Portugal, Viseu, Viseu","Artigo 24.º, n.º 1, alínea e) do Código dos Contratos Públicos",,,,,,Não aplicável.,Não aplicável.,FALSE
"BUDESONIDE 0,05% 2ML SOL.NEBUL AMP",Ajuste Direto Regime Geral,Aquisição de bens móveis,"33600000-6, Produtos farmacêuticos","Centro Hospitalar Tondela-Viseu, E. P. E. (509822940)","ASTRA ZENECA, LDA (502942240)","8.064,00 €",19-07-2016,18-07-2016,1 dias,"Portugal, Viseu, Viseu","Artigo 20.º, n.º 1, alínea a) do Código dos Contratos Públicos",,,,,,Não aplicável.,Não aplicável.,FALSE
LENTE MONOBLOCO ACRILICA HIDROFOBICA,Ajuste Direto Regime Geral,Aquisição de bens móveis,"33731110-7, Lentes intraoculares","Centro Hospitalar Tondela-Viseu, E. P. E. (509822940)","ALCON PORTUGAL-PROD.EQUIP.OFTL,LDA (501251685)","70.000,00 €",18-07-2016,23-06-2016,1 dias,"Portugal, Viseu, Viseu","Artigo 24.º, n.º 1, alínea c) do Código dos Contratos Públicos",,,,,,Não aplicável.,Não aplicável.,FALSE
PRÓTESE MEMBRO INFERIOR TRANSFEMORAL ENDOESQUELÉTICA,Ajuste Direto Regime Geral,Aquisição de bens móveis,"33184000-3, Próteses","Centro Hospitalar Tondela-Viseu, E. P. E. (509822940)",CENTRO REABILITACAO PROF.GAIA (504791834),"7.796,18 €",18-07-2016,29-06-2016,1 dias,"Portugal, Viseu, Viseu","Artigo 24.º, n.º 1, alínea e) do Código dos Contratos Públicos",,,,,,Não aplicável.,Não aplicável.,FALSE
PRÓTESE VASCULAR ANELADA,Ajuste Direto Regime Geral,Aquisição de bens móveis,"33184200-5, Próteses vasculares","Centro Hospitalar Tondela-Viseu, E. P. E. (509822940)","MEDICINÁLIA CORMEDICA, LDA (500684324)","9.240,00 €",18-07-2016,28-06-2016,1 dias,"Portugal, Viseu, Viseu","Artigo 24.º, n.º 1, alínea c) do Código dos Contratos Públicos",,,,,,Não aplicável.,Não aplicável.,FALSE
PRÓTESE DO JOELHO CIMENTADA,Ajuste Direto Regime Geral,Aquisição de bens móveis,"33183200-8, Próteses ortopédicas","Centro Hospitalar Tondela-Viseu, E. P. E. (509822940)","STRYKER PORTUGAL-PROD.Med., Lda (504594214)","22.500,00 €",18-07-2016,28-06-2016,1 dias,"Portugal, Viseu, Viseu","Artigo 24.º, n.º 1, alínea c) do Código dos Contratos Públicos",,,,,,Não aplicável.,Não aplicável.,FALSE
CÂMARA MORTUÁRIA 2 CORPOS,Ajuste Direto Regime Geral,Aquisição de bens móveis,"33900000-9, Equipamento e material post mortem e mortuário","Centro Hospitalar Tondela-Viseu, E. P. E. (509822940)","CENATOLIM, LDA (507397924)","5.550,00 €",18-07-2016,07-06-2016,1 dias,"Portugal, Viseu, Viseu","Artigo 20.º, n.º 1, alínea a) do Código dos Contratos Públicos",,,,,,Não aplicável.,Não aplicável.,FALSE
OXISENSOR DE OXIGÉNIO DESCARTÁVEL NEONATAL,Ajuste Direto Regime Geral,Aquisição de bens móveis,"33140000-3, Material médico de consumo","Centro Hospitalar Tondela-Viseu, E. P. E. (509822940)","COVIDIEN PORTUGAL-PRODUTOS DE SAÚDE UNIPESSOAL,LDA  (503413410)","27.000,00 €",14-07-2016,18-01-2016,1 dias,"Portugal, Viseu, Viseu","Artigo 24.º, n.º 1, alínea e) do Código dos Contratos Públicos",,,,,,Não aplicável.,Não aplicável.,FALSE
