Objeto do Contrato,Tipo de Procedimento,Tipo(s) de Contrato,CPVs,Entidade(s) Adjudicante(s),Entidade(s) Adjudicatária(s),Preço Contratual,Data de Publicação,Data de Celebração do Contrato,Prazo de Execução,Local de Execução,Fundamentação,Data de Fecho do Contrato,Preço Total Efetivo,Causas das Alterações ao Prazo,Causas das Alterações ao Preço,Estado,N.º registo do Acordo Quadro,Descrição do Acordo Quadro,Procedimento Centralizado
Prestação de Serviços de Impressão em Regime de Outsoucing,Ajuste Direto Regime Geral,Aquisição de serviços,"79800000-2, Serviços de impressão e afins","Centro Hospitalar Cova da Beira, E. P. E. (506361659)","Konica Minolta Business Solutions Portugal, unipessoal, Lda. (502120070)","19.170,00 €",19-04-2018,29-03-2018,275 dias,"Portugal, Castelo Branco, Covilhã","Artigo 26.º, n.º 1, alínea a) do Código dos Contratos Públicos",,,,,,Não aplicável.,Não aplicável.,FALSE
AD 45/2017 Aquisição de Artigos para Empacotamento em Esterilização,Ao abrigo de acordo-quadro (art.º 259.º),Aquisição de bens móveis,"33198200-6, Saquetas e invólucros de papel para esterilização","Centro Hospitalar Cova da Beira, EPE (506361659)","EUROCASMEDICA,S.A. (503322105)","13.904,16 €",19-04-2018,19-03-2018,365 dias,"Portugal, Castelo Branco, Covilhã",Artigo 259.º do Código dos Contratos Públicos,,,,,,1974943,CP 2016/43 - Acordo quadro para fornecimento de Material para Empacotamento em Esterilização às Instituições e Serviços do Serviço Nacional de Saúde.,FALSE
AD 45/2017 Aquisição de Artigos para Empacotamento em Esterilização,Ao abrigo de acordo-quadro (art.º 259.º),Aquisição de bens móveis,"33198200-6, Saquetas e invólucros de papel para esterilização","Centro Hospitalar Cova da Beira, EPE (506361659)","DOCWORLD, Lda (508592909)","5.852,32 €",19-04-2018,09-03-2018,365 dias,"Portugal, Castelo Branco, Covilhã",Artigo 259.º do Código dos Contratos Públicos,,,,,,1974943,CP 2016/43 - Acordo quadro para fornecimento de Material para Empacotamento em Esterilização às Instituições e Serviços do Serviço Nacional de Saúde.,FALSE
AD 99/2017-Aquisição de reagentes para determinação da hemoglobina Glicada e Hemoglobinopatias no sangue humano,Ajuste Direto Regime Geral,Aquisição de bens móveis,"33696000-5, Reagentes e meios de contraste","Centro Hospitalar Cova da Beira, E. P. E. (506361659)","Menarini Diagnósticos, Lda. (502610069)","10.780,00 €",12-04-2018,13-03-2018,365 dias,"Portugal, Castelo Branco, Covilhã","Artigo 20.º, n.º 1, alínea a) do Código dos Contratos Públicos",,,,,,Não aplicável.,Não aplicável.,FALSE
AD 105/2017-Aquisição de serviços de assistência técnica aos equipamentos de esterilização,Ajuste Direto Regime Geral,Aquisição de serviços,"50400000-9, Serviços de reparação e manutenção de equipamento médico e de precisão","Centro Hospitalar Cova da Beira, E. P. E. (506361659)","A.J. Costa Irmãos, Ldª (500002576)","19.800,00 €",12-04-2018,29-03-2018,365 dias,"Portugal, Castelo Branco, Covilhã","Artigo 20.º, n.º 1, alínea a) do Código dos Contratos Públicos",,,,,,Não aplicável.,Não aplicável.,FALSE
AD 101/2017 - Prestação de Serviços Médicos da Especialidade de Medicina do Trabalho,Ajuste Direto Regime Geral,Aquisição de serviços,"85147000-1, Serviços de medicina do trabalho","Centro Hospitalar Cova da Beira, E. P. E. (506361659)","Interprev - Segurança e Saúde do Trabalho, S.A. (507072065)","31.200,00 €",12-04-2018,28-03-2018,275 dias,"Portugal, Castelo Branco, Covilhã","Artigo 20.º, n.º 1, alínea a) do Código dos Contratos Públicos",,,,,,Não aplicável.,Não aplicável.,FALSE
