freguesia,acronym,validVotesPercentage,votes,dicofre
Vila Verde da Raia,PPD/PSD,45.69,90,170343
Vila Verde da Raia,PS,28.93,57,170343
Vila Verde da Raia,B.E.,8.63,17,170343
Vila Verde da Raia,CDS-PP,6.09,12,170343
Vila Verde da Raia,A,4.06,8,170343
Vila Verde da Raia,PCTP/MRPP,2.54,5,170343
Vila Verde da Raia,PAN,1.52,3,170343
Vila Verde da Raia,NC,1.02,2,170343
Vila Verde da Raia,PCP-PEV,1.02,2,170343
Vila Verde da Raia,PPM.PPV/CDC,0.51,1,170343
Vila Verde da Raia,IL,0,0,170343
Vila Verde da Raia,L,0,0,170343
Vila Verde da Raia,MAS,0,0,170343
Vila Verde da Raia,PDR,0,0,170343
Vila Verde da Raia,PNR,0,0,170343
Vila Verde da Raia,PTP,0,0,170343
Vila Verde da Raia,PURP,0,0,170343
