freguesia,acronym,validVotesPercentage,votes,dicofre
Torres do Mondego,PS,48.74,328,060329
Torres do Mondego,B.E.,17.24,116,060329
Torres do Mondego,PPD/PSD,14.41,97,060329
Torres do Mondego,PCP-PEV,8.92,60,060329
Torres do Mondego,PAN,2.38,16,060329
Torres do Mondego,CDS-PP,1.78,12,060329
Torres do Mondego,L,1.63,11,060329
Torres do Mondego,PCTP/MRPP,1.19,8,060329
Torres do Mondego,PPM.PPV/CDC,1.04,7,060329
Torres do Mondego,A,0.59,4,060329
Torres do Mondego,PDR,0.59,4,060329
Torres do Mondego,IL,0.45,3,060329
Torres do Mondego,NC,0.45,3,060329
Torres do Mondego,PNR,0.3,2,060329
Torres do Mondego,PTP,0.15,1,060329
Torres do Mondego,PURP,0.15,1,060329
Torres do Mondego,MAS,0,0,060329
