freguesia,acronym,validVotesPercentage,votes,dicofre
Escapães,PS,37.59,371,010904
Escapães,PPD/PSD,33.74,333,010904
Escapães,B.E.,8.51,84,010904
Escapães,CDS-PP,5.57,55,010904
Escapães,PAN,4.66,46,010904
Escapães,PCP-PEV,1.82,18,010904
Escapães,L,1.62,16,010904
Escapães,NC,1.32,13,010904
Escapães,PDR,1.11,11,010904
Escapães,PCTP/MRPP,0.91,9,010904
Escapães,A,0.81,8,010904
Escapães,IL,0.61,6,010904
Escapães,PPM.PPV/CDC,0.61,6,010904
Escapães,PNR,0.51,5,010904
Escapães,PURP,0.41,4,010904
Escapães,PTP,0.2,2,010904
Escapães,MAS,0,0,010904
