Objeto do Contrato,Tipo de Procedimento,Tipo(s) de Contrato,CPVs,Entidade(s) Adjudicante(s),Entidade(s) Adjudicatária(s),Preço Contratual,Data de Publicação,Data de Celebração do Contrato,Prazo de Execução,Local de Execução,Fundamentação,Data de Fecho do Contrato,Preço Total Efetivo,Causas das Alterações ao Prazo,Causas das Alterações ao Preço,Estado,N.º registo do Acordo Quadro,Descrição do Acordo Quadro,Procedimento Centralizado
"P259-AC-2018-17_AQUISIÇÃO DE MEDICAMENTOS DESENCADEADA PELA SPMS, EPE NO ÂMBITO DO DESPACHO 1571/B DE 2016 AO ABRIGO DO ACORDO QUADRO2017/009 - Derivados do plasma humano_Lote8",Ao abrigo de acordo-quadro (art.º 259.º),Aquisição de bens móveis,"33600000-6, Produtos farmacêuticos","Unidade Local de Saúde de Castelo Branco, E. P. E. (509309844)","GRIFOLS PORTUGAL,PROD.FARMACÊUTICOS HOSPITAL LDA (502041285)","60,97 €",20-03-2018,20-03-2018,365 dias,"Portugal, Castelo Branco, Castelo Branco",Artigo 259.º do Código dos Contratos Públicos,,,,,,2800702,CP 2017/9 - Acordo quadro para fornecimento de Derivados do Plasma Humano às Instituições e Serviços do Serviço Nacional de Saúde,FALSE
"P259-AC-2018-17_AQUISIÇÃO DE MEDICAMENTOS DESENCADEADA PELA SPMS, EPE NO ÂMBITO DO DESPACHO 1571/B DE 2016 AO ABRIGO DO ACORDO QUADRO 2017/009 -Derivados do plasma humano_Lote6",Ao abrigo de acordo-quadro (art.º 259.º),Aquisição de bens móveis,"33600000-6, Produtos farmacêuticos","Unidade Local de Saúde de Castelo Branco, E. P. E. (509309844)",TAKEDA FARMACEUTICOS DE PORTUGAL (502801204),"12.700,60 €",20-03-2018,20-03-2018,365 dias,"Portugal, Castelo Branco, Castelo Branco",Artigo 259.º do Código dos Contratos Públicos,,,,,,2800702,CP 2017/9 - Acordo quadro para fornecimento de Derivados do Plasma Humano às Instituições e Serviços do Serviço Nacional de Saúde,FALSE
"P259-AC-2017-146_AQUISIÇÃO DE MEDICAMENTOS DESENCADEADA PELA SPMS, EPE NO ÂMBITO DO DESPACHO 1571/B DE 2016 AO ABRIGO DO ACORDO QUADRO 2017/009 - Derivados do plasma humano_LOTE5",Ao abrigo de acordo-quadro (art.º 259.º),Aquisição de bens móveis,"33600000-6, Produtos farmacêuticos","Unidade Local de Saúde de Castelo Branco, E. P. E. (509309844)","C S L BEHRING UNIPESSOAL,LDA. (503047201)","3.666,80 €",20-03-2018,20-03-2018,365 dias,"Portugal, Castelo Branco, Castelo Branco",Artigo 259.º do Código dos Contratos Públicos,,,,,,2800702,CP 2017/9 - Acordo quadro para fornecimento de Derivados do Plasma Humano às Instituições e Serviços do Serviço Nacional de Saúde,FALSE
00055_2017 - Acordo Quadro para aquisição e aluguer operacional de equipamento informático_L13,Ao abrigo de acordo-quadro (art.º 259.º),Aquisição de bens móveis,"30232000-4, Equipamento periférico","Unidade Local de Saúde de Castelo Branco, E. P. E. (509309844)","ITEN Solutions - Sistemas de Informação, SA (510728189)","4.265,70 €",15-03-2018,13-03-2018,30 dias,"Portugal, Castelo Branco, Castelo Branco",Artigo 259.º do Código dos Contratos Públicos,,,,,,1196657,Acordo Quadro para aquisição e aluguer operacional de equipamento informático,FALSE
