Objeto do Contrato,Tipo de Procedimento,Tipo(s) de Contrato,CPVs,Entidade(s) Adjudicante(s),Entidade(s) Adjudicatária(s),Preço Contratual,Data de Publicação,Data de Celebração do Contrato,Prazo de Execução,Local de Execução,Fundamentação,Data de Fecho do Contrato,Preço Total Efetivo,Causas das Alterações ao Prazo,Causas das Alterações ao Preço,Estado,N.º registo do Acordo Quadro,Descrição do Acordo Quadro,Procedimento Centralizado
"Aquisição por substituição de sonda do Ecógrafo Toshiba Xario SSA-660A do Serviço Radiologia do CHSJ, EPE",Ajuste Direto Regime Geral,Aquisição de bens móveis,"33110000-4, Equipamento de imagiologia para uso médico, dentário e veterinário","Centro Hospitalar de São João, E. P. E. (509821197)",Toshiba Medical SA (980023700),"6.500,00 €",28-04-2016,14-03-2016,20 dias,"Portugal, Porto, Porto","Artigo 24.º, n.º 1, alínea e) do Código dos Contratos Públicos",,,,,,Não aplicável.,Não aplicável.,FALSE
"Reparação por substituição de componentes do Litotritor Storz Modulith SLX-F2 do Serviço de Urologia do CHSJ, EPE",Ajuste Direto Regime Geral,Aquisição de bens móveis,"33100000-1, Equipamento médico","Centro Hospitalar de São João, E. P. E. (509821197)","Teprel Equipamentos Médicos, SA (502262184)","17.950,00 €",28-04-2016,21-03-2016,20 dias,"Portugal, Porto, Porto","Artigo 24.º, n.º 1, alínea e) do Código dos Contratos Públicos",,,,,,Não aplicável.,Não aplicável.,FALSE
"Aquisição por substituição de sonda transesofágica 3D do Ecocardiógrafo Philips iE33 do CHSJ, EPE",Ajuste Direto Regime Geral,Aquisição de bens móveis,"33100000-1, Equipamento médico","Centro Hospitalar de São João, E. P. E. (509821197)",Philips Portuguesa SA (500216843),"20.720,00 €",27-04-2016,29-02-2016,20 dias,"Portugal, Porto, Porto","Artigo 24.º, n.º 1, alínea e) do Código dos Contratos Públicos",,,,,,Não aplicável.,Não aplicável.,FALSE
"Aquisição por substituição de sonda retal e sonda abdominal do Ecógrafo Siemens Sonoline da Consulta Urologia da CHSJ, EPE",Ajuste Direto Regime Geral,Aquisição de bens móveis,"33110000-4, Equipamento de imagiologia para uso médico, dentário e veterinário","Centro Hospitalar de São João, E. P. E. (509821197)",Siemens Healthcare Lda. (507925173),"11.680,00 €",27-04-2016,02-02-2016,20 dias,"Portugal, Porto, Porto","Artigo 24.º, n.º 1, alínea e) do Código dos Contratos Públicos",,,,,,Não aplicável.,Não aplicável.,FALSE
"Aquisição de 9 Marquesas Hidráulicas para o CHSJ, EPE",Ajuste Direto Regime Geral,Aquisição de bens móveis,"33192000-2, Mobiliário para fins médicos","Centro Hospitalar de São João, E. P. E. (509821197)","Bacelar & Irmão, Lda. (500532818)","9.658,98 €",27-04-2016,28-01-2016,30 dias,"Portugal, Porto, Porto","Artigo 20.º, n.º 1, alínea a) do Código dos Contratos Públicos",,,,,,Não aplicável.,Não aplicável.,FALSE
"Aquisição de 6 Computadores Portáteis para o Serviço de Doenças Infecciosas do CHSJ, EPE",Ajuste Direto Regime Geral,Aquisição de bens móveis,"30213100-6, Computadores portáteis","Centro Hospitalar de São João, E. P. E. (509821197)",JANS Informática Lda. (503942111),"9.108,00 €",27-04-2016,01-03-2016,20 dias,"Portugal, Porto, Porto","Artigo 20.º, n.º 1, alínea a) do Código dos Contratos Públicos",,,,,,Não aplicável.,Não aplicável.,FALSE
"Aquisição de 1 Capilaroscópio para o Serviço de Reumatologia do CHSJ, EPE",Ajuste Direto Regime Geral,Aquisição de bens móveis,"33124100-6, Aparelhos para diagnóstico","Centro Hospitalar de São João, E. P. E. (509821197)",DS Medica SRL (12676030153),"13.200,00 €",27-04-2016,04-04-2016,20 dias,"Portugal, Porto, Porto","Artigo 20.º, n.º 1, alínea a) do Código dos Contratos Públicos",,,,,,Não aplicável.,Não aplicável.,FALSE
"Empreitada AVAC de Adaptação da Sala de Angiografia do Piso 7 do CHSJ, EPE",Ajuste Direto Regime Geral,Concessão de obras públicas,"45113000-2, Obras no local","Centro Hospitalar de São João, E. P. E. (509821197)","Clean Breeze, Lda. (507398009)","9.690,24 €",27-04-2016,19-04-2016,30 dias,"Portugal, Porto, Porto","Artigo 19.º, alínea a) do Código dos Contratos Públicos",,,,,,Não aplicável.,Não aplicável.,FALSE
"Aquisição de Cateteres com Balão de Oclusão """"Scepter XC® X-TRA"""" para o Centro Hospitalar de S. João",Ajuste Direto Regime Geral,Aquisição de bens móveis,"33140000-3, Material médico de consumo","Centro Hospitalar de São João, E. P. E. (509821197)","Cateter - Produtos Médicos e Hospitalares, Lda. (502914319)","28.000,00 €",27-04-2016,06-01-2016,360 dias,"Portugal, Porto, Porto","Artigo 24.º, n.º 1, alínea e) do Código dos Contratos Públicos",,,,,,Não aplicável.,Não aplicável.,FALSE
"Aquisição de Consumiveis para Sistema """"Halo-Flex"""" para o Centro Hospitalar de S. João",Ajuste Direto Regime Geral,Aquisição de bens móveis,"33140000-3, Material médico de consumo","Centro Hospitalar de São João, E. P. E. (509821197)","Covidien Portugal - Produtos de Saúde, Lda. (503413410)","21.787,00 €",27-04-2016,05-01-2016,361 dias,"Portugal, Porto, Porto","Artigo 24.º, n.º 1, alínea e) do Código dos Contratos Públicos",,,,,,Não aplicável.,Não aplicável.,FALSE
Aquisição de Reagentes para o Serviço de Anatomia Patológica do Centro Hospitalar de S. João,Ajuste Direto Regime Geral,Aquisição de bens móveis,"33696000-5, Reagentes e meios de contraste","Centro Hospitalar de São João, E. P. E. (509821197)","Roche Sistemas de Diagnóstico, Lda. (504282921)","11.000,00 €",27-04-2016,26-01-2016,340 dias,"Portugal, Porto, Porto","Artigo 24.º, n.º 1, alínea e) do Código dos Contratos Públicos",,,,,,Não aplicável.,Não aplicável.,FALSE
"Aquisição de 2 Equipamentos de Ecocardiografia para o Centro Hospitalar de São João, EPE.",Concurso público,Aquisição de bens móveis,"33112340-3, Ecocardiógrafos","Centro Hospitalar de São João, E. P. E. (509821197)","General Eletric Portuguesa, SA (500357129)","176.800,00 €",27-04-2016,26-04-2016,30 dias,"Portugal, Porto, Porto",Artigo 155.º do Código dos Contratos Públicos,,,,,,Não aplicável.,Não aplicável.,FALSE
"Aquisição de 45 Desfibrilhadores para o CHSJ, EPE",Concurso público,Aquisição de bens móveis,"33182100-0, Desfibrilhador","Centro Hospitalar de São João, E. P. E. (509821197)","Medicinália Cormédica, Lda. (500684324)","196.830,00 €",27-04-2016,28-01-2016,90 dias,"Portugal, Porto, Porto","Artigo 20.º, n.º 1, alínea b) do Código dos Contratos Públicos",,,,,,Não aplicável.,Não aplicável.,FALSE
"Aquisição de Serviços de Reparação dos Torniquetes do Atrium Hospitalidade do CHSJ, EPE",Ajuste Direto Regime Geral,Aquisição de serviços,"50000000-5, Serviços de reparação e manutenção","Centro Hospitalar de São João, E. P. E. (509821197)",LINCIS Lda. (505713519),"9.900,00 €",22-04-2016,22-09-2015,60 dias,"Portugal, Porto, Porto","Artigo 20.º, n.º 1, alínea a) do Código dos Contratos Públicos",,,,,,Não aplicável.,Não aplicável.,FALSE
"Aquisição de Serviços de Atualização da Aplicação de Gestão de Cartões de Visita GestVIDI do CHSJ, EPE",Ajuste Direto Regime Geral,Aquisição de serviços,"72500000-0, Serviços relacionados com a informática","Centro Hospitalar de São João, E. P. E. (509821197)",LINCIS Lda. (505713519),"9.990,00 €",22-04-2016,25-09-2015,60 dias,"Portugal, Porto, Porto","Artigo 24.º, n.º 1, alínea e) do Código dos Contratos Públicos",,,,,,Não aplicável.,Não aplicável.,FALSE
"Aquisição de 1 Equipamento de Biometria para Serviço de Oftalmologia do CHSJ, EPE",Ajuste Direto Regime Geral,Aquisição de bens móveis,"33122000-1, Equipamento oftalmológico","Centro Hospitalar de São João, E. P. E. (509821197)",Carl Zeiss Meditec Iberia SA (980503043),"23.000,00 €",22-04-2016,29-12-2015,30 dias,"Portugal, Porto, Porto","Artigo 20.º, n.º 1, alínea a) do Código dos Contratos Públicos",,,,,,Não aplicável.,Não aplicável.,FALSE
"Aquisição de 1 Microscópio Óptico para o Serviço de Anatomia Patológica do CHSJ, EPE",Ajuste Direto Regime Geral,Aquisição de bens móveis,"38634000-8, Microscópios ópticos","Centro Hospitalar São João, EPE (509821197)","Werfen Portugal, Lda. (501086110)","7.400,00 €",22-04-2016,18-12-2015,10 dias,"Portugal, Porto, Porto","Artigo 20.º, n.º 1, alínea a) do Código dos Contratos Públicos",,,,,,Não aplicável.,Não aplicável.,FALSE
"Aquisição por substituição de sonda linear do Ecógrafo Toshiba Xario SSA-660A do Serviço Radiologia do CHSJ, EPE",Ajuste Direto Regime Geral,Aquisição de bens móveis,"33112000-8, Equipamento de imagiologia por ecos, ultra-sons e doppler","Centro Hospitalar de São João, E. P. E. (509821197)",Toshiba Medical Systems SA (980023700),"11.022,68 €",22-04-2016,16-12-2015,10 dias,"Portugal, Porto, Porto","Artigo 24.º, n.º 1, alínea e) do Código dos Contratos Públicos",,,,,,Não aplicável.,Não aplicável.,FALSE
"Aquisição de upgrade para Laser Lumenis Selecta Trio do Serviço de Oftalmologia do CHSJ, EPE",Ajuste Direto Regime Geral,Aquisição de bens móveis,"33169100-3, Laser cirúrgico","Centro Hospitalar de São João, E. P. E. (509821197)",José Cotta SA (500155739),"7.900,00 €",22-04-2016,24-08-2015,30 dias,"Portugal, Porto, Porto","Artigo 20.º, n.º 1, alínea a) do Código dos Contratos Públicos",,,,,,Não aplicável.,Não aplicável.,FALSE
"Aquisição por substituição de Ampola do TAC Somatom Emotion Duo do CHSJ, EPE",Ajuste Direto Regime Geral,Aquisição de bens móveis,"33115000-9, Aparelhos para tomografia","Centro Hospitalar de São João, E. P. E. (509821197)",Siemens SA (500247480),"42.000,00 €",22-04-2016,21-08-2015,10 dias,"Portugal, Porto, Porto","Artigo 24.º, n.º 1, alínea e) do Código dos Contratos Públicos",,,,,,Não aplicável.,Não aplicável.,FALSE
"Aquisição de 65 Bombas Infusão Volumétrica e 10 Seringas Perfusoras para a UGEM do CHSJ, EPE",Ajuste Direto Regime Geral,Aquisição de bens móveis,"33194100-7, Aparelhos e instrumentos para perfusão","Centro Hospitalar de São João, E. P. E. (509821197)",B. Braun Medical Lda. (504293753),"38.550,00 €",22-04-2016,10-09-2015,30 dias,"Portugal, Porto, Porto","Artigo 24.º, n.º 1, alínea e) do Código dos Contratos Públicos",,,,,,Não aplicável.,Não aplicável.,FALSE
Fornecimento e Montagem de Sala Snoezelen nas Novas Unidades Psiquiatria Pólo Valongo,Ajuste Direto Regime Geral,Aquisição de bens móveis,"39100000-3, Mobiliário","Centro Hospitalar de São João, E. P. E. (509821197)","Sem Barreiras, Lda. (502954396)","9.737,98 €",22-04-2016,17-11-2015,30 dias,"Portugal, Porto, Vila do Conde","Artigo 20.º, n.º 1, alínea a) do Código dos Contratos Públicos",,,,,,Não aplicável.,Não aplicável.,FALSE
Aquisição de diverso mobiliário para novas Unidades de Psiquiatria Pólo Valongo,Ajuste Direto Regime Geral,Aquisição de bens móveis,"39100000-3, Mobiliário","Centro Hospitalar de São João, E. P. E. (509821197)",IKEA Portugal Lda. (505416654),"6.255,11 €",22-04-2016,17-11-2015,10 dias,"Portugal, Porto, Valongo","Artigo 20.º, n.º 1, alínea a) do Código dos Contratos Públicos",,,,,,Não aplicável.,Não aplicável.,FALSE
Aquisição de diverso mobiliário para novas Unidades de Psiquiatria Pólo Valongo,Ajuste Direto Regime Geral,Aquisição de bens móveis,"39100000-3, Mobiliário","Centro Hospitalar de São João, E. P. E. (509821197)",IKEA Portugal Lda. (505416654),"8.515,44 €",22-04-2016,17-11-2015,10 dias,"Portugal, Porto, Valongo","Artigo 20.º, n.º 1, alínea a) do Código dos Contratos Públicos",,,,,,Não aplicável.,Não aplicável.,FALSE
"Aquisição de Licenciamento DICOM e instalação em equipamentos Serviço de Oftalmologia do CHSJ, EPE",Ajuste Direto Regime Geral,Aquisição de bens móveis,"48180000-3, Pacote de software para medicina","Centro Hospitalar de São João, E. P. E. (509821197)","Grupo Taper, Lda. (506886336)","8.980,00 €",22-04-2016,04-08-2015,30 dias,"Portugal, Porto, Porto","Artigo 24.º, n.º 1, alínea e) do Código dos Contratos Públicos",,,,,,Não aplicável.,Não aplicável.,FALSE
"Aquisição de Equipamentos MIO para implementação Área Nutrição do CHSJ, EPE",Ajuste Direto Regime Geral,Aquisição de bens móveis,"30236000-2, Equipamento informático diverso","Centro Hospitalar de São João, E. P. E. (509821197)",Glintt SA (502479418),"9.216,00 €",21-04-2016,31-03-2015,30 dias,"Portugal, Porto, Porto","Artigo 20.º, n.º 1, alínea a) do Código dos Contratos Públicos",,,,,,Não aplicável.,Não aplicável.,FALSE
"Aquisição de Equipamentos Mio para implementação Área Dietética do CHSJ, EPE",Ajuste Direto Regime Geral,Aquisição de bens móveis,"30236000-2, Equipamento informático diverso","Centro Hospitalar de São João, E. P. E. (509821197)",Glintt (CPC-HS) (502479418),"9.984,00 €",21-04-2016,01-04-2015,30 dias,"Portugal, Porto, Porto","Artigo 20.º, n.º 1, alínea a) do Código dos Contratos Públicos",,,,,,Não aplicável.,Não aplicável.,FALSE
