freguesia,acronym,validVotesPercentage,votes,dicofre
Bornes de Aguiar,PS,43.34,394,171303
Bornes de Aguiar,PPD/PSD,37.07,337,171303
Bornes de Aguiar,CDS-PP,5.72,52,171303
Bornes de Aguiar,B.E.,4.84,44,171303
Bornes de Aguiar,A,2.53,23,171303
Bornes de Aguiar,PCP-PEV,1.65,15,171303
Bornes de Aguiar,PAN,1.54,14,171303
Bornes de Aguiar,CH,0.88,8,171303
Bornes de Aguiar,PCTP/MRPP,0.77,7,171303
Bornes de Aguiar,R.I.R.,0.66,6,171303
Bornes de Aguiar,IL,0.44,4,171303
Bornes de Aguiar,PPM,0.22,2,171303
Bornes de Aguiar,L,0.11,1,171303
Bornes de Aguiar,PDR,0.11,1,171303
Bornes de Aguiar,PNR,0.11,1,171303
Bornes de Aguiar,NC,0,0,171303
