Objeto do Contrato,Tipo de Procedimento,Tipo(s) de Contrato,CPVs,Entidade(s) Adjudicante(s),Entidade(s) Adjudicatária(s),Preço Contratual,Data de Publicação,Data de Celebração do Contrato,Prazo de Execução,Local de Execução,Fundamentação,Data de Fecho do Contrato,Preço Total Efetivo,Causas das Alterações ao Prazo,Causas das Alterações ao Preço,Estado,N.º registo do Acordo Quadro,Descrição do Acordo Quadro,Procedimento Centralizado
Aquisição centralizada SPMS - P259-2018-191 - Interferão Alfa 2B; Posaconazol; Pembrolizumab; Sugamadex,Ao abrigo de acordo-quadro (art.º 259.º),Aquisição de bens móveis,"33600000-6, Produtos farmacêuticos","IPO Porto FG, EPE (506362299)","MERCK SHARP & DOHME, LDA (500191360)","1.849.185,76 €",04-01-2019,21-12-2018,365 dias,"Portugal, Porto, Porto",Artigo 259.º do Código dos Contratos Públicos,,,,,,2969238,"CP 2017/6 - Acordo Quadro para fornecimento de Medicamentos do Foro Oncológico e Imunomoduladores, às Instituições e Serviços do Serviço Nacional de Saúde",TRUE
P259-2018-186 - Sorafenib,Ao abrigo de acordo-quadro (art.º 259.º),Locação de bens móveis,"33600000-6, Produtos farmacêuticos","IPO Porto FG, EPE (506362299)","BAYER PORTUGAL, LDA (500043256)","149.468,48 €",04-01-2019,28-12-2018,365 dias,"Portugal, Porto, Porto",Artigo 259.º do Código dos Contratos Públicos,,,,,,3358998,CP 2018/49 - Medicamentos usados nas afeções oculares e otorrinolaringológicas,TRUE
BEVACIZUMAB; ERLOTINIB; PERTUZUMAB; VEMURAFENIB; TRASTUZUMAB; VISMODEGIB,Ao abrigo de acordo-quadro (art.º 259.º),Aquisição de bens móveis,"33600000-6, Produtos farmacêuticos","IPO Porto FG, EPE (506362299)","ROCHE FARMACEUTICA QUIMICA, LDA (500233810)","6.564.887,14 €",04-01-2019,18-12-2018,365 dias,"Portugal, Porto, Porto",Artigo 259.º do Código dos Contratos Públicos,,,,,,2969238,"CP 2017/6 - Acordo Quadro para fornecimento de Medicamentos do Foro Oncológico e Imunomoduladores, às Instituições e Serviços do Serviço Nacional de Saúde",TRUE
