freguesia,acronym,validVotesPercentage,votes,dicofre
União das freguesias de Felgueiras e Feirão,PS,39.26,64,181317
União das freguesias de Felgueiras e Feirão,PPD/PSD,38.65,63,181317
União das freguesias de Felgueiras e Feirão,B.E.,5.52,9,181317
União das freguesias de Felgueiras e Feirão,CDS-PP,4.29,7,181317
União das freguesias de Felgueiras e Feirão,PCP-PEV,4.29,7,181317
União das freguesias de Felgueiras e Feirão,PCTP/MRPP,2.45,4,181317
União das freguesias de Felgueiras e Feirão,A,1.84,3,181317
União das freguesias de Felgueiras e Feirão,PAN,1.84,3,181317
União das freguesias de Felgueiras e Feirão,NC,0.61,1,181317
União das freguesias de Felgueiras e Feirão,PPM.PPV/CDC,0.61,1,181317
União das freguesias de Felgueiras e Feirão,PTP,0.61,1,181317
União das freguesias de Felgueiras e Feirão,IL,0,0,181317
União das freguesias de Felgueiras e Feirão,L,0,0,181317
União das freguesias de Felgueiras e Feirão,MAS,0,0,181317
União das freguesias de Felgueiras e Feirão,PDR,0,0,181317
União das freguesias de Felgueiras e Feirão,PNR,0,0,181317
União das freguesias de Felgueiras e Feirão,PURP,0,0,181317
