freguesia,acronym,validVotesPercentage,votes,dicofre
Capela,PS,41.69,123,131106
Capela,PPD/PSD.CDS-PP,29.83,88,131106
Capela,MPT,9.15,27,131106
Capela,PCP-PEV,6.44,19,131106
Capela,B.E.,4.07,12,131106
Capela,PTP,1.69,5,131106
Capela,L,1.36,4,131106
Capela,PNR,1.36,4,131106
Capela,MAS,1.02,3,131106
Capela,PPV,1.02,3,131106
Capela,PAN,0.68,2,131106
Capela,PND,0.68,2,131106
Capela,PPM,0.68,2,131106
Capela,PCTP/MRPP,0.34,1,131106
Capela,PDA,0,0,131106
Capela,POUS,0,0,131106
