Objeto do Contrato,Tipo de Procedimento,Tipo(s) de Contrato,CPVs,Entidade(s) Adjudicante(s),Entidade(s) Adjudicatária(s),Preço Contratual,Data de Publicação,Data de Celebração do Contrato,Prazo de Execução,Local de Execução,Fundamentação,Data de Fecho do Contrato,Preço Total Efetivo,Causas das Alterações ao Prazo,Causas das Alterações ao Preço,Estado,N.º registo do Acordo Quadro,Descrição do Acordo Quadro,Procedimento Centralizado
Aquisição de serviços Médicos na Área da Triagem Geral (horas) 37027017,Ajuste Direto Regime Geral,Aquisição de serviços,"85100000-0, Serviços de saúde","Centro Hospitalar do Médio Tejo, E. P. E. (506361608)",Andrei Miloslavschi (251085457),"17.028,00 €",21-11-2017,04-10-2017,180 dias,"Portugal, Santarém, Torres Novas","Artigo 20.º, n.º 1, alínea a) do Código dos Contratos Públicos",,,,,,Não aplicável.,Não aplicável.,FALSE
Aquisição de serviços Médicos na Área da Triagem Pediátrica de julho a dez (horas) 37022617,Ajuste Direto Regime Geral,Aquisição de serviços,"85100000-0, Serviços de saúde","Centro Hospitalar do Médio Tejo, E. P. E. (506361608)","Targetpower Serviços Medicos, Lda (508713978)","17.600,00 €",21-11-2017,16-10-2017,180 dias,"Portugal, Santarém, Torres Novas","Artigo 20.º, n.º 1, alínea a) do Código dos Contratos Públicos",,,,,,Não aplicável.,Não aplicável.,FALSE
"Aquisição de Serviços Médicos na Área da Ortopedia (horas),37005317",Ajuste Direto Regime Geral,Aquisição de serviços,"85100000-0, Serviços de saúde","Centro Hospitalar do Médio Tejo, E. P. E. (506361608)","A. Magalhães & J. Dias & Higinio, Lda (504980858)","30.000,00 €",21-11-2017,26-01-2017,365 dias,"Portugal, Santarém, Torres Novas","Artigo 20.º, n.º 1, alínea a) do Código dos Contratos Públicos",,,,,,Não aplicável.,Não aplicável.,FALSE
"Aquisição de Serviços Médicos na Área da Triagem Geral -jan a mar. (horas),37021617",Ajuste Direto Regime Geral,Aquisição de serviços,"85100000-0, Serviços de saúde","Centro Hospitalar do Médio Tejo, E. P. E. (506361608)","QRS-Serviços de Saude, Lda (510641261)","75.000,00 €",21-11-2017,09-06-2017,90 dias,"Portugal, Santarém, Torres Novas","Artigo 20.º, n.º 1, alínea a) do Código dos Contratos Públicos",,,,,,Não aplicável.,Não aplicável.,FALSE
"Aquisição de Serviços Médicos na Área da Medicina Interna (horas),37010417",Ajuste Direto Regime Geral,Aquisição de serviços,"85100000-0, Serviços de saúde","Centro Hospitalar do Médio Tejo, E. P. E. (506361608)","Medimatias, Lda (510888291)","72.000,00 €",21-11-2017,28-09-2017,270 dias,"Portugal, Santarém, Torres Novas","Artigo 20.º, n.º 1, alínea a) do Código dos Contratos Públicos",,,,,,Não aplicável.,Não aplicável.,FALSE
"Aquisição de Serviços Médicos na Área da Oftalmologia (horas),37006317",Ajuste Direto Regime Geral,Aquisição de serviços,"85100000-0, Serviços de saúde","Centro Hospitalar do Médio Tejo, E. P. E. (506361608)","Aruna Fernandes Unipessoal, Lda (510169600)","36.000,00 €",21-11-2017,11-01-2017,365 dias,"Portugal, Santarém, Torres Novas","Artigo 20.º, n.º 1, alínea a) do Código dos Contratos Públicos",,,,,,Não aplicável.,Não aplicável.,FALSE
"Aquisição de Serviços Médicos na Área da Medicina Interna de jan a mar.(horas),37011417",Ajuste Direto Regime Geral,Aquisição de serviços,"85100000-0, Serviços de saúde","Centro Hospitalar do Médio Tejo, E. P. E. (506361608)","Medimatias, Lda (510888291)","45.000,00 €",21-11-2017,28-09-2017,90 dias,"Portugal, Santarém, Torres Novas","Artigo 20.º, n.º 1, alínea a) do Código dos Contratos Públicos",,,,,,Não aplicável.,Não aplicável.,FALSE
Prestação de Serviços Médicos na Área da Medicina Interna- (horas) jan a mar. 37011217,Ajuste Direto Regime Geral,Aquisição de serviços,"85100000-0, Serviços de saúde","Centro Hospitalar do Médio Tejo, E. P. E. (506361608)","Sentido Completo Serviços Medicos Especializados, Lda (509667759)","30.000,00 €",21-11-2017,02-11-2017,90 dias,"Portugal, Santarém, Torres Novas","Artigo 20.º, n.º 1, alínea a) do Código dos Contratos Públicos",,,,,,Não aplicável.,Não aplicável.,FALSE
Prestação de Serviços Médicos na Área da Medicina Interna- (horas) 37010517,Ajuste Direto Regime Geral,Aquisição de serviços,"85100000-0, Serviços de saúde","Centro Hospitalar do Médio Tejo, E. P. E. (506361608)","Sentido Completo Serviços Medicos Especializados, Lda (509667759)","54.315,20 €",21-11-2017,02-11-2017,270 dias,"Portugal, Santarém, Torres Novas","Artigo 20.º, n.º 1, alínea a) do Código dos Contratos Públicos",,,,,,Não aplicável.,Não aplicável.,FALSE
Prestação de Serviços Médicos na área da radiologia- Atos 37026217,Ajuste Direto Regime Geral,Aquisição de serviços,"85100000-0, Serviços de saúde","Centro Hospitalar do Médio Tejo, E. P. E. (506361608)",Maria Margarida Vilela Lúcio Pereira (194366332),"11.333,48 €",21-11-2017,25-10-2017,180 dias,"Portugal, Santarém, Torres Novas","Artigo 20.º, n.º 1, alínea a) do Código dos Contratos Públicos",,,,,,Não aplicável.,Não aplicável.,FALSE
Aquisição de Endoscópio (48000917),Ajuste Direto Regime Geral,Aquisição de bens móveis,"33168100-6, Endoscópios","Centro Hospitalar do Médio Tejo, E. P. E. (506361608)",STB - Serviços Telemáticos e Biomédicos Unipessoal Lda (506989020),"6.200,22 €",16-11-2017,13-01-2017,180 dias,"Portugal, Santarém, Torres Novas","Artigo 20.º, n.º 1, alínea a) do Código dos Contratos Públicos",,,,,,Não aplicável.,Não aplicável.,FALSE
Triturador de Efluente (38002017),Ajuste Direto Regime Geral,Aquisição de bens móveis,"42600000-2, Máquinas-ferramentas","Centro Hospitalar do Médio Tejo, E. P. E. (506361608)","AX FLOW, LDA (500027439)","7.150,00 €",16-11-2017,13-07-2017,56 dias,"Portugal, Santarém, Torres Novas","Artigo 20.º, n.º 1, alínea a) do Código dos Contratos Públicos",,,,,,Não aplicável.,Não aplicável.,FALSE
Aquisição de Pletismógrafo (38001617),Ajuste Direto Regime Geral,Aquisição de bens móveis,"33100000-1, Equipamento médico","Centro Hospitalar do Médio Tejo, E.P.E. (CHMT) (506361608)","SANO TECNICA, LDA (500239819)","32.999,99 €",16-11-2017,07-09-2017,30 dias,"Portugal, Santarém, Torres Novas","Artigo 20.º, n.º 1, alínea a) do Código dos Contratos Públicos",,,,,,Não aplicável.,Não aplicável.,FALSE
Aquisição de Ecógrafo (38002117),Ajuste Direto Regime Geral,Aquisição de bens móveis,"33100000-1, Equipamento médico","Centro Hospitalar do Médio Tejo, E. P. E. (506361608)","SIEMENS  HEALTHCARE , LDA (507925173)","15.000,00 €",16-11-2017,21-07-2017,20 dias,"Portugal, Santarém, Torres Novas","Artigo 20.º, n.º 1, alínea a) do Código dos Contratos Públicos",,,,,,Não aplicável.,Não aplicável.,FALSE
Serviços de Manutenção do Software Modulab (abril a dezembro 2017),Ajuste Direto Regime Geral,Aquisição de serviços,"72000000-5, Serviços de TI: consultoria, desenvolvimento de software, Internet e apoio","Centro Hospitalar do Médio Tejo, E. P. E. (506361608)","WERFEN PORTUGAL, LDA (501086110)","20.895,00 €",15-11-2017,18-04-2017,274 dias,"Portugal, Santarém, Torres Novas","Artigo 20.º, n.º 1, alínea a) do Código dos Contratos Públicos",,,,,,Não aplicável.,Não aplicável.,FALSE
"Prestação Serviços Médicos Radiologia, Atos 37028517.",Ajuste Direto Regime Geral,Aquisição de serviços,"85100000-0, Serviços de saúde","Centro Hospitalar do Médio Tejo, E. P. E. (506361608)","Braz Patricio Alves Centro Diagnostico e Terapeutica Medico Cirurgica, Lda (502633271)","11.041,38 €",13-11-2017,25-10-2017,180 dias,"Portugal, Santarém, Torres Novas","Artigo 20.º, n.º 1, alínea a) do Código dos Contratos Públicos",,,,,,Não aplicável.,Não aplicável.,FALSE
