freguesia,acronym,validVotesPercentage,votes,dicofre
"União das freguesias de Oeiras e São Julião da Barra, Paço de Arcos e Caxias",PPD/PSD.CDS-PP,33.18,6421,111014
"União das freguesias de Oeiras e São Julião da Barra, Paço de Arcos e Caxias",PS,26.54,5135,111014
"União das freguesias de Oeiras e São Julião da Barra, Paço de Arcos e Caxias",PCP-PEV,13.03,2522,111014
"União das freguesias de Oeiras e São Julião da Barra, Paço de Arcos e Caxias",MPT,7.8,1510,111014
"União das freguesias de Oeiras e São Julião da Barra, Paço de Arcos e Caxias",B.E.,6.57,1272,111014
"União das freguesias de Oeiras e São Julião da Barra, Paço de Arcos e Caxias",L,4.98,963,111014
"União das freguesias de Oeiras e São Julião da Barra, Paço de Arcos e Caxias",PAN,3.38,654,111014
"União das freguesias de Oeiras e São Julião da Barra, Paço de Arcos e Caxias",PCTP/MRPP,1.17,226,111014
"União das freguesias de Oeiras e São Julião da Barra, Paço de Arcos e Caxias",PPV,0.9,174,111014
"União das freguesias de Oeiras e São Julião da Barra, Paço de Arcos e Caxias",PPM,0.63,121,111014
"União das freguesias de Oeiras e São Julião da Barra, Paço de Arcos e Caxias",PNR,0.57,110,111014
"União das freguesias de Oeiras e São Julião da Barra, Paço de Arcos e Caxias",PND,0.44,85,111014
"União das freguesias de Oeiras e São Julião da Barra, Paço de Arcos e Caxias",MAS,0.38,74,111014
"União das freguesias de Oeiras e São Julião da Barra, Paço de Arcos e Caxias",PTP,0.23,44,111014
"União das freguesias de Oeiras e São Julião da Barra, Paço de Arcos e Caxias",PDA,0.11,22,111014
"União das freguesias de Oeiras e São Julião da Barra, Paço de Arcos e Caxias",POUS,0.09,18,111014
