Objeto do Contrato,Tipo de Procedimento,Tipo(s) de Contrato,CPVs,Entidade(s) Adjudicante(s),Entidade(s) Adjudicatária(s),Preço Contratual,Data de Publicação,Data de Celebração do Contrato,Prazo de Execução,Local de Execução,Fundamentação,Data de Fecho do Contrato,Preço Total Efetivo,Causas das Alterações ao Prazo,Causas das Alterações ao Preço,Estado,N.º registo do Acordo Quadro,Descrição do Acordo Quadro,Procedimento Centralizado
Reparação de Viatura Mercedes 64-28-SJ,Ajuste Direto Regime Geral,Aquisição de serviços,"50000000-5, Serviços de reparação e manutenção",Centro Hospitalar Psiquiátrico de Lisboa (508338476),CARCLASSE (503048852),"5.644,91 €",27-09-2016,05-04-2016,30 dias,"Portugal, Lisboa, Lisboa","Artigo 24.º, n.º 1, alínea c) do Código dos Contratos Públicos",05-04-2016,"5.644,91 €","",,,Não aplicável.,Não aplicável.,FALSE
Cinacalcet 30 mg comp,Ajuste Direto Regime Geral,Aquisição de bens móveis,"33000000-0, Equipamento médico, medicamentos e produtos para cuidados pessoais",Centro Hospitalar Psiquiátrico de Lisboa (508338476),Amgen Biofarmacêutica (502942959),"280,54 €",27-09-2016,16-06-2016,1 dias,"Portugal, Lisboa, Lisboa","Artigo 24.º, n.º 1, alínea e) do Código dos Contratos Públicos",16-06-2016,"280,54 €","",,,Não aplicável.,Não aplicável.,FALSE
Pancreatina 150 mg caps gr,Ajuste Direto Regime Geral,Aquisição de bens móveis,"33000000-0, Equipamento médico, medicamentos e produtos para cuidados pessoais",Centro Hospitalar Psiquiátrico de Lisboa (508338476),BGP Produts (513263268),"20,92 €",27-09-2016,22-07-2016,1 dias,"Portugal, Lisboa, Lisboa","Artigo 24.º, n.º 1, alínea e) do Código dos Contratos Públicos",22-07-2016,"20,92 €","",,,Não aplicável.,Não aplicável.,FALSE
Alimentação para mês de Janeiro 2016,Ajuste Direto Regime Geral,Aquisição de serviços,"55000000-0, Serviços de hotelaria, restauração e comércio a retalho",Centro Hospitalar Psiquiátrico de Lisboa (508338476),GERTAL (500126623),"73.674,21 €",26-09-2016,15-01-2016,31 dias,"Portugal, Lisboa, Lisboa","Artigo 24.º, n.º 1, alínea c) do Código dos Contratos Públicos",31-01-2016,"73.674,21 €","",,,Não aplicável.,Não aplicável.,FALSE
Mirabegrom 50 mg comp,Ajuste Direto Regime Geral,Aquisição de bens móveis,"33000000-0, Equipamento médico, medicamentos e produtos para cuidados pessoais",Centro Hospitalar Psiquiátrico de Lisboa (508338476),Astellas (502540249),"58,04 €",26-09-2016,03-06-2016,1 dias,"Portugal, Lisboa, Lisboa","Artigo 24.º, n.º 1, alínea e) do Código dos Contratos Públicos",03-06-2016,"58,04 €","",,,Não aplicável.,Não aplicável.,FALSE
Manutenção dos Espaços Verdes para o mês de Março 2016,Ajuste Direto Regime Geral,Aquisição de serviços,"50000000-5, Serviços de reparação e manutenção",Centro Hospitalar Psiquiátrico de Lisboa (508338476),TILIASCOOP (504415069),"7.002,22 €",26-09-2016,24-02-2016,31 dias,"Portugal, Lisboa, Lisboa","Artigo 24.º, n.º 1, alínea c) do Código dos Contratos Públicos",26-04-2016,"7.002,22 €","",,,Não aplicável.,Não aplicável.,FALSE
Manutenção dos Espaços Verdes para Fevereiro 2016,Ajuste Direto Regime Geral,Aquisição de serviços,"50000000-5, Serviços de reparação e manutenção",Centro Hospitalar Psiquiátrico de Lisboa (508338476),TiliasCoop (504415069),"7.002,22 €",26-09-2016,03-02-2016,29 dias,"Portugal, Lisboa, Lisboa","Artigo 24.º, n.º 1, alínea c) do Código dos Contratos Públicos",23-02-2016,"7.002,22 €","",,,Não aplicável.,Não aplicável.,FALSE
Manutenção para os parques e jardins do CHPL para mês de Janeiro 2016,Ajuste Direto Regime Geral,Aquisição de serviços,"50000000-5, Serviços de reparação e manutenção",Centro Hospitalar Psiquiátrico de Lisboa (508338476),Tiliascoop (504415069),"7.002,22 €",26-09-2016,21-01-2016,31 dias,"Portugal, Lisboa, Lisboa","Artigo 24.º, n.º 1, alínea c) do Código dos Contratos Públicos",03-02-2016,"7.002,22 €","",,,Não aplicável.,Não aplicável.,FALSE
Acetilsalicilato Lisina 1800 mg po sol inj,Ajuste Direto Regime Geral,Aquisição de bens móveis,"33000000-0, Equipamento médico, medicamentos e produtos para cuidados pessoais",Centro Hospitalar Psiquiátrico de Lisboa (508338476),Labesfal (501169580),"49,60 €",26-09-2016,25-05-2016,1 dias,"Portugal, Lisboa, Lisboa","Artigo 24.º, n.º 1, alínea e) do Código dos Contratos Públicos",25-05-2016,"49,60 €","",,,Não aplicável.,Não aplicável.,FALSE
Manutenção ao Equipamento Storage EMC Ano 2016,Ajuste Direto Regime Geral,Aquisição de serviços,"50000000-5, Serviços de reparação e manutenção",Centro Hospitalar Psiquiátrico de Lisboa (508338476),Iten (510728189),"3.641,18 €",26-09-2016,15-01-2016,365 dias,"Portugal, Lisboa, Lisboa","Artigo 26.º, n.º 1, alínea a) do Código dos Contratos Públicos",30-12-2016,"3.641,18 €","",,,Não aplicável.,Não aplicável.,FALSE
41108016 - Aripiprazol 400 mg susp inj LP,Ajuste Direto Regime Geral,Aquisição de bens móveis,"33000000-0, Equipamento médico, medicamentos e produtos para cuidados pessoais",Centro Hospitalar Psiquiátrico de Lisboa (508338476),Lundbeck (503573922),"500,14 €",26-09-2016,18-05-2016,1 dias,"Portugal, Lisboa, Lisboa","Artigo 24.º, n.º 1, alínea e) do Código dos Contratos Públicos",18-05-2016,"500,14 €","",,,Não aplicável.,Não aplicável.,FALSE
Assistencia Técnica para máquinas de embalar comprimidos da Farmácia,Ajuste Direto Regime Geral,Aquisição de serviços,"50000000-5, Serviços de reparação e manutenção",Centro Hospitalar Psiquiátrico de Lisboa (508338476),GRIFOLS (502041285),"2.358,08 €",26-09-2016,25-01-2016,365 dias,"Portugal, Lisboa, Lisboa","Artigo 20.º, n.º 1, alínea a) do Código dos Contratos Públicos",30-12-2016,"2.358,08 €","",,,Não aplicável.,Não aplicável.,FALSE
Assistência Técnica ao Equipamento Kardex - Ano 2016,Ajuste Direto Regime Geral,Aquisição de serviços,"50000000-5, Serviços de reparação e manutenção",Centro Hospitalar Psiquiátrico de Lisboa (508338476),GRIFOLS (502041285),"1.900,00 €",26-09-2016,25-01-2016,365 dias,"Portugal, Lisboa, Lisboa","Artigo 20.º, n.º 1, alínea a) do Código dos Contratos Públicos","","","",,,Não aplicável.,Não aplicável.,FALSE
Sitagliptina 25 mg comp,Ajuste Direto Regime Geral,Aquisição de bens móveis,"33000000-0, Equipamento médico, medicamentos e produtos para cuidados pessoais",Centro Hospitalar Psiquiátrico de Lisboa (508338476),MSD (500191360),"136,96 €",26-09-2016,06-05-2016,1 dias,"Portugal, Lisboa, Lisboa","Artigo 24.º, n.º 1, alínea e) do Código dos Contratos Públicos",06-05-2016,"136,96 €","",,,Não aplicável.,Não aplicável.,FALSE
Tri-Hexifenidilo 2 mg comp,Ajuste Direto Regime Geral,Aquisição de bens móveis,"33000000-0, Equipamento médico, medicamentos e produtos para cuidados pessoais",Centro Hospitalar Psiquiátrico de Lisboa (508338476),Teofarma (980244463),"200,88 €",23-09-2016,03-05-2016,1 dias,"Portugal, Lisboa, Lisboa","Artigo 24.º, n.º 1, alínea e) do Código dos Contratos Públicos",03-05-2016,"200,88 €","",,,Não aplicável.,Não aplicável.,FALSE
Medicamento Exclusivo dos Lab Sanóbia,Ajuste Direto Regime Geral,Aquisição de bens móveis,"33000000-0, Equipamento médico, medicamentos e produtos para cuidados pessoais",Centro Hospitalar Psiquiátrico de Lisboa (508338476),Logifarma (503934640),"5,70 €",23-09-2016,20-04-2016,1 dias,"Portugal, Lisboa, Lisboa","Artigo 24.º, n.º 1, alínea e) do Código dos Contratos Públicos",20-04-2016,"5,70 €","",,,Não aplicável.,Não aplicável.,FALSE
Obras de Beneficiação do Pav. 21  C -R/C Ala Direita,Ajuste Direto Regime Geral,Empreitadas de obras públicas,"45215100-8, Obras de construção de edifícios relacionados com serviços de saúde",Centro Hospitalar Psiquiátrico de Lisboa (CHPL) (508338476),"ACTIA - Engenharia e Construções, Lda. (509064930)","43.288,32 €",21-09-2016,16-06-2016,60 dias,"Portugal, Lisboa, Lisboa","Artigo 19.º, alínea a) do Código dos Contratos Públicos","","43.288,32 €",s/ informação,,,Não aplicável.,Não aplicável.,FALSE
Substituição da Caixilharia de Madeira das janelas do Pav. 21 C 1º,Ajuste Direto Regime Geral,Empreitadas de obras públicas,"45210000-2, Construção de edifícios",Centro Hospitalar Psiquiátrico de Lisboa (CHPL) (508338476),Portnorma - Janelas em PVC (502475587),"83.845,78 €",21-09-2016,05-05-2016,30 dias,"Portugal, Lisboa, Lisboa","Artigo 19.º, alínea a) do Código dos Contratos Públicos","","83.845,78 €",está dentro do prazo,,,Não aplicável.,Não aplicável.,FALSE
