freguesia,acronym,validVotesPercentage,votes,dicofre
"Lebução, Fiães e Nozelos",PPD/PSD,58.33,154,171233
"Lebução, Fiães e Nozelos",PS,26.14,69,171233
"Lebução, Fiães e Nozelos",B.E.,4.55,12,171233
"Lebução, Fiães e Nozelos",CDS-PP,2.65,7,171233
"Lebução, Fiães e Nozelos",PPM.PPV/CDC,1.89,5,171233
"Lebução, Fiães e Nozelos",PAN,1.14,3,171233
"Lebução, Fiães e Nozelos",PNR,1.14,3,171233
"Lebução, Fiães e Nozelos",A,0.76,2,171233
"Lebução, Fiães e Nozelos",L,0.76,2,171233
"Lebução, Fiães e Nozelos",PCP-PEV,0.76,2,171233
"Lebução, Fiães e Nozelos",IL,0.38,1,171233
"Lebução, Fiães e Nozelos",MAS,0.38,1,171233
"Lebução, Fiães e Nozelos",NC,0.38,1,171233
"Lebução, Fiães e Nozelos",PCTP/MRPP,0.38,1,171233
"Lebução, Fiães e Nozelos",PTP,0.38,1,171233
"Lebução, Fiães e Nozelos",PDR,0,0,171233
"Lebução, Fiães e Nozelos",PURP,0,0,171233
