Objeto do Contrato,Tipo de Procedimento,Tipo(s) de Contrato,CPVs,Entidade(s) Adjudicante(s),Entidade(s) Adjudicatária(s),Preço Contratual,Data de Publicação,Data de Celebração do Contrato,Prazo de Execução,Local de Execução,Fundamentação,Data de Fecho do Contrato,Preço Total Efetivo,Causas das Alterações ao Prazo,Causas das Alterações ao Preço,Estado,N.º registo do Acordo Quadro,Descrição do Acordo Quadro,Procedimento Centralizado
Realização de exames PET corpo,Ajuste Direto Regime Geral,Aquisição de serviços,"85150000-5, Serviços de imagiologia médica","Hospital do Espírito Santo de Évora, E.P.E. (508085888)",Hospital Cuf Descobertas (504872982),"13.000,00 €",11-10-2013,19-09-2013,112 dias,"Portugal, Évora, Évora","Artigo 20.º, n.º 1, alínea a) do Código dos Contratos Públicos",,,,,,Não aplicável.,Não aplicável.,
Renda de imóvel - 4 º trimestre 2013,Ajuste Direto Regime Geral,Aquisição de serviços,"70220000-9, Serviços de arrendamento ou locação de propriedades não residenciais próprias","Hospital do Espírito Santo de Évora, E.P.E. (508085888)",Santa Casa da Misericórdia de Évora (500745846),"42.853,05 €",11-10-2013,01-10-2013,90 dias,"Portugal, Évora, Évora","Artigo 20.º, n.º 1, alínea a) do Código dos Contratos Públicos",,,,,,Não aplicável.,Não aplicável.,
Análises Clinicas Setembro a Dezembro 2013,Ajuste Direto Regime Geral,Aquisição de serviços,"85148000-8, Serviços de análises clínicas","Hospital do Espírito Santo de Évora, E.P.E. (508085888)",Biomerieux Portugal (501524177),"14.000,00 €",11-10-2013,27-09-2013,120 dias,"Portugal, Évora, Évora","Artigo 20.º, n.º 1, alínea a) do Código dos Contratos Públicos",,,,,,Não aplicável.,Não aplicável.,
Análises Clinicas Outubro a Dezembro 2013,Ajuste Direto Regime Geral,Aquisição de serviços,"85148000-8, Serviços de análises clínicas","Hospital do Espírito Santo de Évora, E.P.E. (508085888)",Menarini Diagnosticos (502610069),"5.225,00 €",11-10-2013,03-10-2013,90 dias,"Portugal, Évora, Évora","Artigo 20.º, n.º 1, alínea a) do Código dos Contratos Públicos",,,,,,Não aplicável.,Não aplicável.,
Aquisição de medicamentos  ACSS,Ao abrigo de acordo-quadro (art.º 259.º),Aquisição de bens móveis,"33690000-3, Medicamentos vários","Hospital do Espírito Santo de Évora, E.P.E. (508085888)",Roche Farmaceutica (506415740),"21.863,00 €",11-10-2013,27-09-2013,8 dias,"Portugal, Évora, Évora",Artigo 259.º do Código dos Contratos Públicos,,,,,,345900,CONCURSO PÚBLICO PARA A CELEBRAÇÃO DE CONTRATOS PÚBLICOS DE APROVISIONAMENTO PARA AQUISIÇÃO MEDICAMENTOS DO FORO ONCOLÓGICO,
Aquisição de medicamentos ACSS,Ao abrigo de acordo-quadro (art.º 259.º),Aquisição de bens móveis,"33690000-3, Medicamentos vários","Hospital do Espírito Santo de Évora, E.P.E. (508085888)",Roche Farmaceutica (506415740),"25.457,00 €",11-10-2013,27-09-2013,8 dias,"Portugal, Évora, Évora",Artigo 259.º do Código dos Contratos Públicos,,,,,,345900,CONCURSO PÚBLICO PARA A CELEBRAÇÃO DE CONTRATOS PÚBLICOS DE APROVISIONAMENTO PARA AQUISIÇÃO MEDICAMENTOS DO FORO ONCOLÓGICO,
Aquisição de medicamentos em CPA,Ao abrigo de acordo-quadro (art.º 259.º),Aquisição de bens móveis,"33690000-3, Medicamentos vários","Hospital do Espírito Santo de Évora, E.P.E. (508085888)",Biogen Idec Portugal (506415740),"23.994,00 €",09-10-2013,02-10-2013,8 dias,"Portugal, Évora, Évora",Artigo 259.º do Código dos Contratos Públicos,,,,,,383205,CONCURSO PÚBLICO PARA A CELEBRAÇÃO DE CONTRATOS PÚBLICOS DE APROVISIONAMENTO PARA AQUISIÇÃO MEDICAMENTOS DO FORO ONCOLÓGICO II,
Medicamentos ACSS,Ao abrigo de acordo-quadro (art.º 259.º),Aquisição de bens móveis,"33690000-3, Medicamentos vários","Hospital do Espírito Santo de Évora, E.P.E. (508085888)",Roche Farmaceutica (500233810),"11.389,30 €",09-10-2013,27-09-2013,8 dias,"Portugal, Évora, Évora",Artigo 259.º do Código dos Contratos Públicos,,,,,,345900,CONCURSO PÚBLICO PARA A CELEBRAÇÃO DE CONTRATOS PÚBLICOS DE APROVISIONAMENTO PARA AQUISIÇÃO MEDICAMENTOS DO FORO ONCOLÓGICO,
Dispositivos médicos em CPA.,Ao abrigo de acordo-quadro (art.º 259.º),Aquisição de bens móveis,"33190000-8, Dispositivos e produtos médicos variados","Hospital do Espírito Santo de Évora, E.P.E. (508085888)",ALBINO DIAS ANDRADE (500013810),"5.211,08 €",04-10-2013,18-04-2013,8 dias,"Portugal, Évora, Évora",Artigo 259.º do Código dos Contratos Públicos,,,,,,534953,"CONCURSO PÚBLICO PARA A CELEBRAÇÃO DE CONTRATOS PÚBLICOS DE APROVISIONAMENTO PARA A ÁREA DA SAÚDE, COM VISTA AO FORNECIMENTO DE MATERIAL DE PENSO TRADICIONAL/CLASSICO - PARTE 1 - ÀS INSTITUIÇÕES E SERVIÇOS DO SERVIÇO NACIONAL DE SAÚDE  ",
Dispositivos médicos em CPA,Ao abrigo de acordo-quadro (art.º 259.º),Aquisição de bens móveis,"33190000-8, Dispositivos e produtos médicos variados","Hospital do Espírito Santo de Évora, E.P.E. (508085888)",ANASTACIO SALDANHA (505804441),"5.581,44 €",04-10-2013,27-05-2013,8 dias,"Portugal, Évora, Évora",Artigo 259.º do Código dos Contratos Públicos,,,,,,451780,CP 2012/24 - MATERAIL DISPOSABLE DE BLOCO OPERATORIO,
Dispositivos médicos em CPA,Ao abrigo de acordo-quadro (art.º 259.º),Aquisição de bens móveis,"33190000-8, Dispositivos e produtos médicos variados","Hospital do Espírito Santo de Évora, E.P.E. (508085888)",ALBINO DIAS ANDRADE (500013810),"6.189,58 €",03-10-2013,19-08-2013,8 dias,"Portugal, Évora, Évora",Artigo 259.º do Código dos Contratos Públicos,,,,,,534953,"CONCURSO PÚBLICO PARA A CELEBRAÇÃO DE CONTRATOS PÚBLICOS DE APROVISIONAMENTO PARA A ÁREA DA SAÚDE, COM VISTA AO FORNECIMENTO DE MATERIAL DE PENSO TRADICIONAL/CLASSICO - PARTE 1 - ÀS INSTITUIÇÕES E SERVIÇOS DO SERVIÇO NACIONAL DE SAÚDE  ",
Dispositivos médicos em CPA,Ao abrigo de acordo-quadro (art.º 259.º),Aquisição de bens móveis,"33190000-8, Dispositivos e produtos médicos variados","Hospital do Espírito Santo de Évora, E.P.E. (508085888)",ALBINO DIAS ANDRADE (500013810),"8.939,61 €",03-10-2013,27-02-2013,8 dias,"Portugal, Évora, Évora",Artigo 259.º do Código dos Contratos Públicos,,,,,,534953,"CONCURSO PÚBLICO PARA A CELEBRAÇÃO DE CONTRATOS PÚBLICOS DE APROVISIONAMENTO PARA A ÁREA DA SAÚDE, COM VISTA AO FORNECIMENTO DE MATERIAL DE PENSO TRADICIONAL/CLASSICO - PARTE 1 - ÀS INSTITUIÇÕES E SERVIÇOS DO SERVIÇO NACIONAL DE SAÚDE  ",
Dispositivos médicos em CPA,Ao abrigo de acordo-quadro (art.º 259.º),Aquisição de bens móveis,"33190000-8, Dispositivos e produtos médicos variados","Hospital do Espírito Santo de Évora, E.P.E. (508085888)",SCA HYGIENE PRODUCTS LDA (503237612),"9.720,00 €",03-10-2013,02-04-2013,8 dias,"Portugal, Évora, Évora",Artigo 259.º do Código dos Contratos Públicos,,,,,,598830,"CONCURSO PÚBLICO PARA A CELEBRAÇÃO DE CONTRATOS PÚBLICOS DE APROVISIONAMENTO PARA A ÁREA DA SAÚDE, COM VISTA AO FORNECIMENTO DE MATERIAL DE INCONTINÊNCIA, PROTEÇÃO CUTÂNEA E ALÍVIO DE PRESSÃO, ÀS INSTITUIÇÕES E SERVIÇOS DO SERVIÇO NACIONAL DE SAÚDE",
Dispositivos médicos em CPA,Ao abrigo de acordo-quadro (art.º 259.º),Aquisição de bens móveis,"33190000-8, Dispositivos e produtos médicos variados","Hospital do Espírito Santo de Évora, E.P.E. (508085888)",SCA HYGIENE PRODUCTS LDA (503237612),"9.720,00 €",03-10-2013,11-01-2013,8 dias,"Portugal, Évora, Évora",Artigo 259.º do Código dos Contratos Públicos,,,,,,598830,"CONCURSO PÚBLICO PARA A CELEBRAÇÃO DE CONTRATOS PÚBLICOS DE APROVISIONAMENTO PARA A ÁREA DA SAÚDE, COM VISTA AO FORNECIMENTO DE MATERIAL DE INCONTINÊNCIA, PROTEÇÃO CUTÂNEA E ALÍVIO DE PRESSÃO, ÀS INSTITUIÇÕES E SERVIÇOS DO SERVIÇO NACIONAL DE SAÚDE",
MCDT para o período de Abril a Julho 2013,Ajuste Direto Regime Geral,Aquisição de serviços,"85145000-7, Serviços prestados por laboratórios médicos","Hospital do Espírito Santo de Évora, E.P.E. (508085888)",Genética Médica Diagnóstico Pré Natal (503622931),"15.000,00 €",02-10-2013,30-04-2013,120 dias,"Portugal, Évora, Évora","Artigo 20.º, n.º 1, alínea a) do Código dos Contratos Públicos",,,,,,Não aplicável.,Não aplicável.,
Assistência Técnica do software Alert,Ajuste Direto Regime Geral,Aquisição de serviços,"72610000-9, Serviços de assistência informática","Hospital do Espírito Santo de Évora, E.P.E. (508085888)",Serviços Partilhados do Ministério da Saúde EPE (509540716),"29.714,00 €",02-10-2013,26-08-2013,365 dias,"Portugal, Évora, Évora","Artigo 20.º, n.º 1, alínea a) do Código dos Contratos Públicos",,,,,,Não aplicável.,Não aplicável.,
Exames de Psiquiatria (Electroconvulsoterapia monopolar ou bipolar),Ajuste Direto Regime Geral,Aquisição de serviços,"85111500-5, Serviços hospitalares de psiquiatria","Hospital do Espírito Santo de Évora, E.P.E. (508085888)",Hospital Cuf Infante Santo (500142742),"9.225,00 €",02-10-2013,02-07-2013,180 dias,"Portugal, Évora, Évora","Artigo 20.º, n.º 1, alínea a) do Código dos Contratos Públicos",,,,,,Não aplicável.,Não aplicável.,
Oxigenoterapia,Ajuste Direto Regime Geral,Aquisição de serviços,"85111700-7, Serviços de oxigenoterapia","Hospital do Espírito Santo de Évora, E.P.E. (508085888)",Praxair Portugal Gases SA (501738916),"6.250,00 €",01-10-2013,31-07-2013,180 dias,"Portugal, Évora, Évora","Artigo 20.º, n.º 1, alínea a) do Código dos Contratos Públicos",,,,,,Não aplicável.,Não aplicável.,
Reagentes Pat. Clinica para o período de Setembro a Dezembro 2013,Ajuste Direto Regime Geral,Aquisição de serviços,"85148000-8, Serviços de análises clínicas","Hospital do Espírito Santo de Évora, E.P.E. (508085888)",Izasa Portugal (501086110),"23.000,00 €",01-10-2013,20-09-2013,120 dias,"Portugal, Évora, Évora","Artigo 20.º, n.º 1, alínea a) do Código dos Contratos Públicos",,,,,,Não aplicável.,Não aplicável.,
Reagentes Pat. Clinica para o período de Setembro a Dezembro 2013,Ajuste Direto Regime Geral,Aquisição de serviços,"85148000-8, Serviços de análises clínicas","Hospital do Espírito Santo de Évora, E.P.E. (508085888)",Siemens Healthcare Diagnostics Lda. (507925173),"33.000,00 €",01-10-2013,20-09-2013,120 dias,"Portugal, Évora, Évora","Artigo 20.º, n.º 1, alínea a) do Código dos Contratos Públicos",,,,,,Não aplicável.,Não aplicável.,
Reagentes Patologia Clinica para o período de Setembro a Dezembro 2013,Ajuste Direto Regime Geral,Aquisição de serviços,"85148000-8, Serviços de análises clínicas","Hospital do Espírito Santo de Évora, E.P.E. (508085888)",Johnson & Johnson Lda. (500153370),"44.400,00 €",01-10-2013,20-09-2013,120 dias,"Portugal, Évora, Évora","Artigo 20.º, n.º 1, alínea a) do Código dos Contratos Públicos",,,,,,Não aplicável.,Não aplicável.,
Reagentes Patologia Clinica para o período de Setembro a Dezembro 2013,Ajuste Direto Regime Geral,Aquisição de serviços,"85148000-8, Serviços de análises clínicas","Hospital do Espírito Santo de Évora, E.P.E. (508085888)",Izasa Portugal (501086110),"20.000,00 €",01-10-2013,20-09-2013,120 dias,"Portugal, Évora, Évora","Artigo 20.º, n.º 1, alínea a) do Código dos Contratos Públicos",,,,,,Não aplicável.,Não aplicável.,
Patologia Clinica para o período de Setembro a Dezembro 2013,Ajuste Direto Regime Geral,Aquisição de serviços,"85148000-8, Serviços de análises clínicas","Hospital do Espírito Santo de Évora, E.P.E. (508085888)",Beckman Coulter Portugal Unipessoal Lda. (509035167),"20.000,00 €",01-10-2013,20-09-2013,120 dias,"Portugal, Évora, Évora","Artigo 20.º, n.º 1, alínea a) do Código dos Contratos Públicos",,,,,,Não aplicável.,Não aplicável.,
Patologia Clinica para o período de Setembro a Dezembro 2013,Ajuste Direto Regime Geral,Aquisição de serviços,"85148000-8, Serviços de análises clínicas","Hospital do Espírito Santo de Évora, E.P.E. (508085888)",Abbott Laboratórios Lda. (500006148),"11.100,00 €",01-10-2013,20-09-2013,120 dias,"Portugal, Évora, Évora","Artigo 20.º, n.º 1, alínea a) do Código dos Contratos Públicos",,,,,,Não aplicável.,Não aplicável.,
Aquisição de medicamentos ACSS,Ao abrigo de acordo-quadro (art.º 259.º),Aquisição de bens móveis,"33690000-3, Medicamentos vários","Hospital do Espírito Santo de Évora, E.P.E. (508085888)",Roche Farmaceutica (500233810),"5.754,60 €",01-10-2013,24-09-2013,8 dias,"Portugal, Évora, Évora",Artigo 259.º do Código dos Contratos Públicos,,,,,,345900,CONCURSO PÚBLICO PARA A CELEBRAÇÃO DE CONTRATOS PÚBLICOS DE APROVISIONAMENTO PARA AQUISIÇÃO MEDICAMENTOS DO FORO ONCOLÓGICO,
