freguesia,acronym,validVotesPercentage,votes,dicofre
Santa Marta de Portuzelo,PS,39.35,781,160928
Santa Marta de Portuzelo,PPD/PSD,32.64,648,160928
Santa Marta de Portuzelo,B.E.,11.13,221,160928
Santa Marta de Portuzelo,PCP-PEV,5.09,101,160928
Santa Marta de Portuzelo,CDS-PP,2.77,55,160928
Santa Marta de Portuzelo,PAN,2.32,46,160928
Santa Marta de Portuzelo,JPP,1.11,22,160928
Santa Marta de Portuzelo,R.I.R.,1.01,20,160928
Santa Marta de Portuzelo,CH,0.91,18,160928
Santa Marta de Portuzelo,IL,0.6,12,160928
Santa Marta de Portuzelo,L,0.6,12,160928
Santa Marta de Portuzelo,A,0.55,11,160928
Santa Marta de Portuzelo,NC,0.45,9,160928
Santa Marta de Portuzelo,PCTP/MRPP,0.35,7,160928
Santa Marta de Portuzelo,MPT,0.3,6,160928
Santa Marta de Portuzelo,PNR,0.25,5,160928
Santa Marta de Portuzelo,PPM,0.25,5,160928
Santa Marta de Portuzelo,PDR,0.1,2,160928
Santa Marta de Portuzelo,PTP,0.1,2,160928
Santa Marta de Portuzelo,PURP,0.1,2,160928
