freguesia,acronym,validVotesPercentage,votes,dicofre
Pessegueiro,PPD/PSD,48.89,22,061207
Pessegueiro,PS,37.78,17,061207
Pessegueiro,A,6.67,3,061207
Pessegueiro,B.E.,6.67,3,061207
Pessegueiro,CDS-PP,0,0,061207
Pessegueiro,IL,0,0,061207
Pessegueiro,L,0,0,061207
Pessegueiro,MAS,0,0,061207
Pessegueiro,NC,0,0,061207
Pessegueiro,PAN,0,0,061207
Pessegueiro,PCP-PEV,0,0,061207
Pessegueiro,PCTP/MRPP,0,0,061207
Pessegueiro,PDR,0,0,061207
Pessegueiro,PNR,0,0,061207
Pessegueiro,PPM.PPV/CDC,0,0,061207
Pessegueiro,PTP,0,0,061207
Pessegueiro,PURP,0,0,061207
