Objeto do Contrato,Tipo de Procedimento,Tipo(s) de Contrato,CPVs,Entidade(s) Adjudicante(s),Entidade(s) Adjudicatária(s),Preço Contratual,Data de Publicação,Data de Celebração do Contrato,Prazo de Execução,Local de Execução,Fundamentação,Data de Fecho do Contrato,Preço Total Efetivo,Causas das Alterações ao Prazo,Causas das Alterações ao Preço,Estado,N.º registo do Acordo Quadro,Descrição do Acordo Quadro,Procedimento Centralizado
Aquisição de serviços gerais,Ajuste Direto Regime Geral,Aquisição de serviços,"98390000-3, Outros serviços","Serviço Partilhados do Ministério da Saúde, E. P. E. (509540716)","Number One, Lda (504451332)","54.300,00 €",11-07-2012,29-06-2012,183 dias,Portugal,"Artigo 20.º, n.º 1, alínea a) do Código dos Contratos Públicos",,,,,,Não aplicável.,Não aplicável.,
Aquisição de serviços de formação em estratégia negocial,Ajuste Direto Regime Geral,Aquisição de serviços,"80500000-9, Serviços de formação","Serviço Partilhados do Ministério da Saúde, E. P. E. (509540716)",MEDIARCOM (507132831),"9.900,00 €",11-07-2012,14-06-2012,15 dias,Portugal,"Artigo 20.º, n.º 1, alínea a) do Código dos Contratos Públicos",,,,,,Não aplicável.,Não aplicável.,
Aquisição de serviços de manutenção SICO,Ajuste Direto Regime Geral,Aquisição de serviços,"72500000-0, Serviços relacionados com a informática","Serviço Partilhados do Ministério da Saúde, E. P. E. (509540716)","Linkare, Lda (506863077)","17.582,40 €",11-07-2012,05-07-2012,149 dias,Portugal,"Artigo 20.º, n.º 1, alínea a) do Código dos Contratos Públicos",,,,,,Não aplicável.,Não aplicável.,
"Aquisição de serviços para desenho, desenvolvimento e implementação do processo de junção das bases de dados dos centros de saúde, por ACES ou por ULS",Ajuste Direto Regime Geral,Aquisição de serviços,"72500000-0, Serviços relacionados com a informática","Serviço Partilhados do Ministério da Saúde, E. P. E. (509540716)","Normática, SA (501782230)","200.000,00 €",11-07-2012,29-06-2012,92 dias,Portugal,"Artigo 20.º, n.º 1, alínea a) do Código dos Contratos Públicos",,,,,,Não aplicável.,Não aplicável.,
Aquisição de serviços para manutenção aplicacional,Ajuste Direto Regime Geral,Aquisição de serviços,"72500000-0, Serviços relacionados com a informática","Serviço Partilhados do Ministério da Saúde, E. P. E. (509540716)","OPTIMIZER, LDA (504775936)","64.800,00 €",11-07-2012,04-07-2012,183 dias,Portugal,"Artigo 20.º, n.º 1, alínea a) do Código dos Contratos Públicos",,,,,,Não aplicável.,Não aplicável.,
Aquisição de serviços para a prescrição e dispensa por DCI,Ajuste Direto Regime Geral,Aquisição de serviços,"72500000-0, Serviços relacionados com a informática","Serviço Partilhados do Ministério da Saúde, E. P. E. (509540716)",COMPTA (500069891),"66.700,00 €",11-07-2012,03-07-2012,183 dias,Portugal,"Artigo 20.º, n.º 1, alínea a) do Código dos Contratos Públicos",,,,,,Não aplicável.,Não aplicável.,
Aquisição de serviços de manutenção e suporte aos registos centrais,Ajuste Direto Regime Geral,Aquisição de serviços,"72500000-0, Serviços relacionados com a informática","Serviço Partilhados do Ministério da Saúde, E. P. E. (509540716)","ARMIS, Lda. (507349601)","76.400,00 €",05-07-2012,03-07-2012,184 dias,Portugal,"Artigo 20.º, n.º 1, alínea a) do Código dos Contratos Públicos",,,,,,Não aplicável.,Não aplicável.,
Aquisição de servidores para CSP,Ajuste Direto Regime Geral,Aquisição de bens móveis,"48820000-2, Servidores","Serviço Partilhados do Ministério da Saúde, E. P. E. (509540716)","Novabase, SA (500074372)","18.529,50 €",05-07-2012,22-06-2012,20 dias,"Portugal, Lisboa, Lisboa","Artigo 20.º, n.º 1, alínea a) do Código dos Contratos Públicos",,,,,,Não aplicável.,Não aplicável.,
Aquisição de serviços para a caraterização da estrutura remuneratória dos médicos do SNS,Ajuste Direto Regime Geral,Aquisição de serviços,"72000000-5, Serviços de TI: consultoria, desenvolvimento de software, Internet e apoio","Serviço Partilhados do Ministério da Saúde, E. P. E. (509540716)","Deloitte Consultores, SA (502310090)","49.000,00 €",05-07-2012,21-06-2012,49 dias,"Portugal, Lisboa, Lisboa","Artigo 20.º, n.º 1, alínea a) do Código dos Contratos Públicos",,,,,,Não aplicável.,Não aplicável.,
