freguesia,acronym,validVotesPercentage,votes,dicofre
Vila Pouca de Aguiar,PS,42.61,496,171314
Vila Pouca de Aguiar,PPD/PSD.CDS-PP,35.4,412,171314
Vila Pouca de Aguiar,PCP-PEV,7.73,90,171314
Vila Pouca de Aguiar,MPT,6.7,78,171314
Vila Pouca de Aguiar,B.E.,1.98,23,171314
Vila Pouca de Aguiar,PCTP/MRPP,1.29,15,171314
Vila Pouca de Aguiar,PAN,0.95,11,171314
Vila Pouca de Aguiar,L,0.69,8,171314
Vila Pouca de Aguiar,PND,0.69,8,171314
Vila Pouca de Aguiar,PTP,0.6,7,171314
Vila Pouca de Aguiar,MAS,0.52,6,171314
Vila Pouca de Aguiar,PPM,0.52,6,171314
Vila Pouca de Aguiar,PNR,0.17,2,171314
Vila Pouca de Aguiar,PDA,0.09,1,171314
Vila Pouca de Aguiar,POUS,0.09,1,171314
Vila Pouca de Aguiar,PPV,0,0,171314
