freguesia,acronym,validVotesPercentage,votes,dicofre
Odivelas,PS,62.86,110,020804
Odivelas,PCP-PEV,20,35,020804
Odivelas,PPD/PSD.CDS-PP,8.57,15,020804
Odivelas,MPT,2.86,5,020804
Odivelas,L,1.71,3,020804
Odivelas,PCTP/MRPP,1.71,3,020804
Odivelas,B.E.,1.14,2,020804
Odivelas,MAS,0.57,1,020804
Odivelas,PPM,0.57,1,020804
Odivelas,PAN,0,0,020804
Odivelas,PDA,0,0,020804
Odivelas,PND,0,0,020804
Odivelas,PNR,0,0,020804
Odivelas,POUS,0,0,020804
Odivelas,PPV,0,0,020804
Odivelas,PTP,0,0,020804
