freguesia,acronym,validVotesPercentage,votes,dicofre
Moitas Venda,PS,33.85,88,140207
Moitas Venda,PPD/PSD,28.85,75,140207
Moitas Venda,B.E.,9.23,24,140207
Moitas Venda,CDS-PP,6.92,18,140207
Moitas Venda,PAN,5.38,14,140207
Moitas Venda,PPM.PPV/CDC,5,13,140207
Moitas Venda,PCP-PEV,4.23,11,140207
Moitas Venda,L,1.54,4,140207
Moitas Venda,A,1.15,3,140207
Moitas Venda,PCTP/MRPP,1.15,3,140207
Moitas Venda,PDR,1.15,3,140207
Moitas Venda,PURP,0.77,2,140207
Moitas Venda,IL,0.38,1,140207
Moitas Venda,NC,0.38,1,140207
Moitas Venda,MAS,0,0,140207
Moitas Venda,PNR,0,0,140207
Moitas Venda,PTP,0,0,140207
