freguesia,acronym,validVotesPercentage,votes,dicofre
Rio Meão,PS,41.62,1045,010921
Rio Meão,PPD/PSD,33.49,841,010921
Rio Meão,B.E.,11.71,294,010921
Rio Meão,CDS-PP,4.02,101,010921
Rio Meão,PAN,2.47,62,010921
Rio Meão,PCP-PEV,2.03,51,010921
Rio Meão,IL,1.23,31,010921
Rio Meão,R.I.R.,0.6,15,010921
Rio Meão,L,0.48,12,010921
Rio Meão,PCTP/MRPP,0.48,12,010921
Rio Meão,A,0.44,11,010921
Rio Meão,CH,0.44,11,010921
Rio Meão,MPT,0.2,5,010921
Rio Meão,PNR,0.2,5,010921
Rio Meão,PTP,0.2,5,010921
Rio Meão,PURP,0.2,5,010921
Rio Meão,NC,0.08,2,010921
Rio Meão,PPM,0.08,2,010921
Rio Meão,JPP,0.04,1,010921
Rio Meão,PDR,0,0,010921
