freguesia,acronym,validVotesPercentage,votes,dicofre
União das freguesias de Aveleda e Rio de Onor,PPD/PSD.CDS-PP,45.45,50,040250
União das freguesias de Aveleda e Rio de Onor,PS,41.82,46,040250
União das freguesias de Aveleda e Rio de Onor,MPT,2.73,3,040250
União das freguesias de Aveleda e Rio de Onor,PND,2.73,3,040250
União das freguesias de Aveleda e Rio de Onor,PAN,1.82,2,040250
União das freguesias de Aveleda e Rio de Onor,PCP-PEV,1.82,2,040250
União das freguesias de Aveleda e Rio de Onor,B.E.,0.91,1,040250
União das freguesias de Aveleda e Rio de Onor,PCTP/MRPP,0.91,1,040250
União das freguesias de Aveleda e Rio de Onor,PDA,0.91,1,040250
União das freguesias de Aveleda e Rio de Onor,PNR,0.91,1,040250
União das freguesias de Aveleda e Rio de Onor,L,0,0,040250
União das freguesias de Aveleda e Rio de Onor,MAS,0,0,040250
União das freguesias de Aveleda e Rio de Onor,POUS,0,0,040250
União das freguesias de Aveleda e Rio de Onor,PPM,0,0,040250
União das freguesias de Aveleda e Rio de Onor,PPV,0,0,040250
União das freguesias de Aveleda e Rio de Onor,PTP,0,0,040250
