Objeto do Contrato,Tipo de Procedimento,Tipo(s) de Contrato,CPVs,Entidade(s) Adjudicante(s),Entidade(s) Adjudicatária(s),Preço Contratual,Data de Publicação,Data de Celebração do Contrato,Prazo de Execução,Local de Execução,Fundamentação,Data de Fecho do Contrato,Preço Total Efetivo,Causas das Alterações ao Prazo,Causas das Alterações ao Preço,Estado,N.º registo do Acordo Quadro,Descrição do Acordo Quadro,Procedimento Centralizado
Material de Consumo Clínico para Inactivação de Plaquetas,Ajuste Direto Regime Geral,Aquisição de bens móveis,"33141000-0, Material médico não químico descartável e produtos hematológicos","Instituto Português do Sangue, I.P. (502423943)",Grifols Portugal (502041285),"1.448.640,00 €",26-02-2011,18-02-2011,315 dias,"Portugal, Lisboa, Lisboa","Artigo 26.º, n.º 1, alínea a) do Código dos Contratos Públicos",,,,,,Não aplicável.,Não aplicável.,
"Aquisição de Sacos para Colheita de Sangue, durante o ano 2011.",Ajuste Direto Regime Geral,Aquisição de bens móveis,"33141613-0, Sacos para sangue","Instituto Português do Sangue, I.P. (502423943)",Grifols Portugal (502041285),"1.025.050,00 €",26-02-2011,18-02-2011,315 dias,"Portugal, Lisboa, Lisboa","Artigo 26.º, n.º 1, alínea a) do Código dos Contratos Públicos",,,,,,Não aplicável.,Não aplicável.,
"Aquisição de Reagentes para os Laboratórios de Doenças Transmissiveis dos CRS Lisboa, Coimbra e Porto, durante o ano de 2011",Ajuste Direto Regime Geral,Aquisição de bens móveis,"33696200-7, Reagentes para análises ao sangue","Instituto Português do Sangue, I.P. (502423943)","Abbott Laboratórios, Lda (500006148)","3.008.301,00 €",25-02-2011,23-02-2011,365 dias,"Portugal, Coimbra, Coimbra<BR/>Portugal, Lisboa, Lisboa<BR/>Portugal, Porto, Porto","Artigo 26.º, n.º 1, alínea a) do Código dos Contratos Públicos",,,,,,Não aplicável.,Não aplicável.,
"Aquisição de Reagentes para os Laboratórios de Doenças Transmissiveis dos CRS Lisboa, Coimbra e Porto, durante o ano de 2011",Ajuste Direto Regime Geral,Aquisição de bens móveis,"33696200-7, Reagentes para análises ao sangue","Instituto Português do Sangue, I.P. (502423943)","Johnson & Johnson, Lda (500153370)","648.528,00 €",25-02-2011,25-02-2011,365 dias,"Portugal, Lisboa, Lisboa<BR/>Portugal, Coimbra, Coimbra<BR/>Portugal, Porto, Porto","Artigo 26.º, n.º 1, alínea a) do Código dos Contratos Públicos",,,,,,Não aplicável.,Não aplicável.,
Contrato Assistência Técnica a diversos equipamentos Instalados no CRSL,Ajuste Direto Regime Geral,Aquisição de serviços,"71356200-0, Serviços de assistência técnica","Instituto Português do Sangue, I.P. (502423943)",Fenwal Europe SPRL (0885601486),"10.171,00 €",23-02-2011,31-01-2011,365 dias,"Portugal, Lisboa, Lisboa","Artigo 27.º, n.º 1, alínea f) do Código dos Contratos Públicos",,,,,,Não aplicável.,Não aplicável.,
"Contrato Assistência Técnica e Reparação dos Elevadores do CRS Lisboa, durante o ano 2011",Ajuste Direto Regime Geral,Aquisição de serviços,"50750000-7, Serviços de manutenção de elevadores","Instituto Português do Sangue, I.P. (502423943)","DSR - Montagem Manutenção Ascensores e Escadas Rolantes, SA (502417625)","6.360,00 €",22-02-2011,01-02-2011,365 dias,"Portugal, Lisboa, Lisboa","Artigo 27.º, n.º 1, alínea f) do Código dos Contratos Públicos",,,,,,Não aplicável.,Não aplicável.,
"Aquisição de Reagentes para o Laboratório dem Hematologia do CRS Coimbra, durante o ano de 2011",Ajuste Direto Regime Geral,Aquisição de bens móveis,"33696200-7, Reagentes para análises ao sangue","Instituto Português do Sangue, I.P. (502423943)","Siemens H. Diagnostics, Lda (507925173)","652,56 €",21-02-2011,08-02-2011,365 dias,"Portugal, Coimbra, Coimbra","Artigo 26.º, n.º 1, alínea a) do Código dos Contratos Públicos",,,,,,Não aplicável.,Não aplicável.,
"Aquisição de Reagentes para os Laboratórios de Doenças Transmissiveis dos CRS Lisboa, Coimbra e Porto, durante o ano de 2011.",Ajuste Direto Regime Geral,Aquisição de bens móveis,"33696200-7, Reagentes para análises ao sangue","Instituto Português do Sangue, I.P. (502423943)","Bio Rad Laboratories, Lda (501301321)","35.413,25 €",21-02-2011,11-02-2011,365 dias,"Portugal, Coimbra, Coimbra<BR/>Portugal, Lisboa, Lisboa<BR/>Portugal, Porto, Porto","Artigo 26.º, n.º 1, alínea a) do Código dos Contratos Públicos",,,,,,Não aplicável.,Não aplicável.,
