freguesia,acronym,validVotesPercentage,votes,dicofre
Usseira,PPD/PSD.CDS-PP,58.7,145,101209
Usseira,PS,20.24,50,101209
Usseira,PCP-PEV,5.67,14,101209
Usseira,MPT,4.05,10,101209
Usseira,B.E.,2.83,7,101209
Usseira,PCTP/MRPP,2.43,6,101209
Usseira,PND,2.43,6,101209
Usseira,L,0.81,2,101209
Usseira,MAS,0.81,2,101209
Usseira,PAN,0.4,1,101209
Usseira,PNR,0.4,1,101209
Usseira,POUS,0.4,1,101209
Usseira,PPM,0.4,1,101209
Usseira,PTP,0.4,1,101209
Usseira,PDA,0,0,101209
Usseira,PPV,0,0,101209
