concelho,n
Abrantes,128
Águeda,393
Aguiar da Beira,34
Alandroal,41
Albergaria-a-Velha,186
Albufeira,80
Alcácer do Sal,95
Alcanena,111
Alcobaça,290
Alcochete,26
Alcoutim,33
Alenquer,70
Alfândega da Fé,57
Alijó,50
Aljezur,37
Aljustrel,72
Almada,147
Almeida,36
Almeirim,98
Almodôvar,77
Alpiarça,37
Alter do Chão,52
Alvaiázere,45
Alvito,27
Amadora,80
Amarante,201
Amares,96
Anadia,158
Angra do Heroísmo,226
Ansião,66
Arcos de Valdevez,126
Arganil,69
Armamar,36
Arouca,153
Arraiolos,55
Arronches,26
Arruda dos Vinhos,77
Aveiro,805
Avis,40
Azambuja,82
Baião,89
Barcelos,548
Barrancos,26
Barreiro,46
Batalha,111
Beja,315
Belmonte,54
Benavente,124
Bombarral,37
Borba,49
Boticas,51
Braga,961
Bragança,269
Cabeceiras de Basto,67
Cadaval,45
Caldas da Rainha,180
Calheta,159
Câmara de Lobos,199
Caminha,78
Campo Maior,61
Cantanhede,201
Carrazeda de Ansiães,58
Carregal do Sal,47
Cartaxo,109
Cascais,137
Castanheira de Pêra,46
Castelo Branco,268
Castelo de Paiva,105
Castelo de Vide,32
Castro Daire,71
Castro Marim,42
Castro Verde,57
Celorico da Beira,46
Celorico de Basto,73
Chamusca,55
Chaves,240
Cinfães,81
Coimbra,985
Condeixa-a-Nova,58
Constância,36
Coruche,94
Corvo,16
Covilhã,296
Crato,25
Cuba,40
Elvas,179
Entroncamento,78
Espinho,135
Esposende,167
Estarreja,124
Estremoz,108
Évora,527
Fafe,167
Faro,236
Felgueiras,292
Ferreira do Alentejo,52
Ferreira do Zêzere,44
Figueira da Foz,246
Figueira de Castelo Rodrigo,59
Figueiró dos Vinhos,73
Fornos de Algodres,37
Freixo de Espada à Cinta,40
Fronteira,25
Funchal,2052
Fundão,184
Gavião,37
Góis,47
Golegã,61
Gondomar,329
Gouveia,76
Grândola,86
Guarda,277
Guimarães,822
Horta,111
Idanha-a-Nova,78
Ílhavo,128
Lagoa,93
Lagos,55
Lajes das Flores,23
Lajes do Pico,40
Lamego,113
Leiria,782
Lisboa,1017
Loulé,129
Loures,151
Lourinhã,67
Lousã,106
Lousada,171
Mação,26
Macedo de Cavaleiros,91
Machico,149
Madalena,78
Mafra,96
Maia,535
Mangualde,126
Manteigas,35
Marco de Canaveses,155
Marinha Grande,385
Marvão,49
Matosinhos,578
Mealhada,97
Mêda,43
Melgaço,87
Mértola,93
Mesão Frio,41
Mira,98
Miranda do Corvo,58
Miranda do Douro,66
Mirandela,173
Mogadouro,83
Moimenta da Beira,54
Moita,35
Monção,101
Monchique,32
Mondim de Basto,43
Monforte,26
Montalegre,77
Montemor-o-Novo,112
Montemor-o-Velho,80
Montijo,46
Mora,28
Mortágua,60
Moura,98
Mourão,27
Murça,49
Murtosa,31
Nazaré,68
Nelas,92
Nisa,32
Nordeste,40
Óbidos,121
Odemira,116
Odivelas,67
Oeiras,242
Oleiros,37
Olhão,81
Oliveira de Azeméis,384
Oliveira de Frades,57
Oliveira do Bairro,154
Oliveira do Hospital,136
Ourém,225
Ourique,54
Ovar,250
Paços de Ferreira,233
Palmela,73
Pampilhosa da Serra,34
Paredes,373
Paredes de Coura,67
Pedrógão Grande,63
Penacova,56
Penafiel,198
Penalva do Castelo,36
Penamacor,36
Penedono,25
Penela,68
Peniche,116
Peso da Régua,88
Pinhel,75
Pombal,255
Ponta Delgada,391
Ponta do Sol,72
Ponte da Barca,92
Ponte de Lima,200
Ponte de Sor,88
Portalegre,204
Portel,38
Portimão,82
Porto,1926
Porto de Mós,134
Porto Moniz,40
Porto Santo,90
Póvoa de Lanhoso,128
Póvoa de Varzim,190
Povoação,41
Proença-a-Nova,43
Redondo,56
Reguengos de Monsaraz,90
Resende,45
Ribeira Brava,126
Ribeira de Pena,64
Ribeira Grande,105
Rio Maior,134
Sabrosa,58
Sabugal,47
Salvaterra de Magos,97
Santa Comba Dão,38
Santa Cruz,324
Santa Cruz da Graciosa,34
Santa Cruz das Flores,25
Santa Maria da Feira,454
Santa Marta de Penaguião,30
Santana,51
Santarém,378
Santiago do Cacém,111
Santo Tirso,326
São Brás de Alportel,34
São João da Madeira,279
São João da Pesqueira,46
São Pedro do Sul,101
São Roque do Pico,55
São Vicente,43
Sardoal,23
Sátão,39
Seia,116
Seixal,65
Sernancelhe,46
Serpa,99
Sertã,101
Sesimbra,43
Setúbal,116
Sever do Vouga,104
Silves,67
Sines,105
Sintra,222
Sobral de Monte Agraço,29
Soure,65
Sousel,48
Tábua,52
Tabuaço,44
Tarouca,38
Tavira,67
Terras de Bouro,61
Tomar,160
Tondela,129
Torre de Moncorvo,65
Torres Novas,160
Torres Vedras,256
Trancoso,71
Trofa,188
Vagos,163
Vale de Cambra,158
Valença,103
Valongo,238
Valpaços,88
Velas,60
Vendas Novas,81
Viana do Alentejo,57
Viana do Castelo,341
Vidigueira,46
Vieira do Minho,71
Vila da Praia da Vitória,92
Vila de Rei,32
Vila do Bispo,36
Vila do Conde,315
Vila do Porto,48
Vila Flor,68
Vila Franca de Xira,55
Vila Franca do Campo,39
Vila Nova da Barquinha,35
Vila Nova de Cerveira,74
Vila Nova de Famalicão,602
Vila Nova de Foz Côa,47
Vila Nova de Gaia,716
Vila Nova de Paiva,37
Vila Nova de Poiares,56
Vila Pouca de Aguiar,91
Vila Real,285
Vila Real de Santo António,38
Vila Velha de Ródão,34
Vila Verde,206
Vila Viçosa,48
Vimioso,41
Vinhais,62
Viseu,453
Vizela,131
Vouzela,95
