Objeto do Contrato,Tipo de Procedimento,Tipo(s) de Contrato,CPVs,Entidade(s) Adjudicante(s),Entidade(s) Adjudicatária(s),Preço Contratual,Data de Publicação,Data de Celebração do Contrato,Prazo de Execução,Local de Execução,Fundamentação,Data de Fecho do Contrato,Preço Total Efetivo,Causas das Alterações ao Prazo,Causas das Alterações ao Preço,Estado,N.º registo do Acordo Quadro,Descrição do Acordo Quadro,Procedimento Centralizado
13200068 - Aquisição de Material Disposable do Bloco Operatório - Parte I-B,Ao abrigo de acordo-quadro (art.º 259.º),Aquisição de bens móveis,"33000000-0, Equipamento médico, medicamentos e produtos para cuidados pessoais","Centro Hospitalar de Lisboa Ocidental, E. P. E. (507618319)","Bastos Viegas, S.A. (500042772)","48.867,47 €",21-01-2019,21-01-2019,365 dias,"Portugal, Lisboa, Lisboa",Artigo 259.º do Código dos Contratos Públicos,,,,,,2102851,CP 2016/74 - Acordo quadro para fornecimento de Material disposable de bloco operatório - Parte I-B às Instituições e Serviços do Serviço Nacional de Saúde,FALSE
Aquisição de sistema para insuficiência cardíaca biventricular,Ajuste Direto Regime Geral,Aquisição de bens móveis,"33140000-3, Material médico de consumo","Centro Hospitalar de Lisboa Ocidental, E. P. E. (507618319)","MEDICINALIA CORMEDICA - COMER. PROD. MED. HOSP.,LD (500684324)","12.000,00 €",18-01-2019,26-12-2018,365 dias,"Portugal, Lisboa, Lisboa","Artigo 20.º, n.º 1, alínea d) do Código dos Contratos Públicos",,,,,,Não aplicável.,Não aplicável.,FALSE
Aquisição de 2 Stents Intracraneanos com Diversor de Fluxo para o CHLO,Ajuste Direto Regime Geral,Aquisição de bens móveis,"33140000-3, Material médico de consumo","Centro Hospitalar de Lisboa Ocidental, E. P. E. (507618319)","Biomédica - Soc. Prod. Médicos, Lda (501745459)","19.000,00 €",18-01-2019,26-12-2018,365 dias,"Portugal, Lisboa, Lisboa","Artigo 20.º, n.º 1, alínea d) do Código dos Contratos Públicos",,,,,,Não aplicável.,Não aplicável.,FALSE
Aquisição de sistemas percutâneos de tratamento da regurgitação mitral para o CHLO,Ajuste Direto Regime Geral,Aquisição de bens móveis,"33140000-3, Material médico de consumo","Centro Hospitalar de Lisboa Ocidental, EPE (CHLO) (507618319)","Abbott Laboratórios, Lda (500006148)","240.000,00 €",18-01-2019,28-12-2018,365 dias,"Portugal, Lisboa, Lisboa","Artigo 24.º, n.º 1, alínea e), subalínea iii) do Código dos Contratos Públicos",,,,,,Não aplicável.,Não aplicável.,FALSE
"Aquisição de stents intracraneanos com diversor de fluxo, cateteres e guia para Angiografia HSC",Ajuste Direto Regime Geral,Aquisição de bens móveis,"33140000-3, Material médico de consumo","Centro Hospitalar de Lisboa Ocidental, E. P. E. (507618319)",MEDTRONIC PORTUGAL LDA (504223933),"23.010,00 €",18-01-2019,28-12-2018,365 dias,"Portugal, Lisboa, Lisboa","Artigo 24.º, n.º 1, alínea e), subalínea ii) do Código dos Contratos Públicos",,,,,,Não aplicável.,Não aplicável.,FALSE
11243108 - Aquisição de Pacemakers Camara Única Percutaneo para CHLO,Ajuste Direto Regime Geral,Aquisição de bens móveis,"33140000-3, Material médico de consumo","Centro Hospitalar de Lisboa Ocidental, EPE (CHLO) (507618319)",MEDTRONIC PORTUGAL LDA (504223933),"191.659,00 €",17-01-2019,26-12-2018,365 dias,"Portugal, Lisboa, Lisboa","Artigo 24.º, n.º 1, alínea e), subalínea ii) do Código dos Contratos Públicos",,,,,,Não aplicável.,Não aplicável.,FALSE
11802918 - 1 VENTILADOR BO DO HSC,Ajuste Direto Regime Geral,Aquisição de bens móveis,"33000000-0, Equipamento médico, medicamentos e produtos para cuidados pessoais","Centro Hospitalar de Lisboa Ocidental, EPE (CHLO) (507618319)","Getinge Group Portugal, Unipessoal, Lda. (506819698)","28.000,00 €",15-01-2019,03-12-2018,30 dias,"Portugal, Lisboa, Lisboa","Artigo 24.º, n.º 1, alínea c) do Código dos Contratos Públicos",,,,,,Não aplicável.,Não aplicável.,FALSE
SUBSTITUIÇÃO DE BATERIAS DE UPS CHLORIDE 80NET 160KVA DO HSFX,Ajuste Direto Regime Geral,Aquisição de serviços,"50000000-5, Serviços de reparação e manutenção","Centro Hospitalar de Lisboa Ocidental, EPE (CHLO) (507618319)","VERTIV PORTUGAL, LDA (503322520)","15.149,72 €",15-01-2019,08-01-2019,15 dias,"Portugal<BR/>Portugal, Lisboa, Lisboa","Artigo 24.º, n.º 1, alínea e), subalínea ii) do Código dos Contratos Públicos",,,,,,Não aplicável.,Não aplicável.,FALSE
Fornecimento e instalação de sistema de climatização dos quartos de isolamento para doenças infecciosas no Serviço de Pneumologia.,Ajuste Direto Regime Geral,Aquisição de serviços,"51500000-7, Serviços de instalação de máquinas e equipamento","Centro Hospitalar de Lisboa Ocidental, EPE (CHLO) (507618319)",SELLTITUDE (513701141),"60.214,74 €",15-01-2019,10-10-2018,63 dias,Portugal,"Artigo 24.º, n.º 1, alínea c) do Código dos Contratos Públicos",,,,,,Não aplicável.,Não aplicável.,FALSE
