Objeto do Contrato,Tipo de Procedimento,Tipo(s) de Contrato,CPVs,Entidade(s) Adjudicante(s),Entidade(s) Adjudicatária(s),Preço Contratual,Data de Publicação,Data de Celebração do Contrato,Prazo de Execução,Local de Execução,Fundamentação,Data de Fecho do Contrato,Preço Total Efetivo,Causas das Alterações ao Prazo,Causas das Alterações ao Preço,Estado,N.º registo do Acordo Quadro,Descrição do Acordo Quadro,Procedimento Centralizado
PRÓTESE FONATÓRIA DE IMPLANTAÇÃO PÓS-CIRURGICA,Ajuste Direto Regime Geral,Aquisição de bens móveis,"33185300-3, Implante para otorrinolaringologia","Centro Hospitalar Tondela-Viseu, E. P. E. (509822940)","ATOS MEDICAL SPAIN, SL - SUCURSAL EM PORTUGAL (980435978)","9.750,00 €",20-09-2016,08-08-2016,180 dias,"Portugal, Viseu, Viseu","Artigo 20.º, n.º 1, alínea a) do Código dos Contratos Públicos",,,,,,Não aplicável.,Não aplicável.,FALSE
CARGA PARA PINÇA APLICAÇÃO CLIPS LAPAROSCOPICO,Ajuste Direto Regime Geral,Aquisição de bens móveis,"33140000-3, Material médico de consumo","Centro Hospitalar Tondela-Viseu, E. P. E. (509822940)","B.BRAUN MEDICAL, LDA (501506543)","8.488,44 €",20-09-2016,02-08-2016,180 dias,"Portugal, Viseu, Viseu","Artigo 24.º, n.º 1, alínea e) do Código dos Contratos Públicos",,,,,,Não aplicável.,Não aplicável.,FALSE
MANGA (PERNEIRA) EXTENSÃO COXA,Ajuste Direto Regime Geral,Aquisição de bens móveis,"33140000-3, Material médico de consumo","Centro Hospitalar Tondela-Viseu, E. P. E. (509822940)","MEDTRONIC PORTUGAL, LDA (504223933)","8.100,00 €",19-09-2016,02-08-2016,365 dias,"Portugal, Viseu, Viseu","Artigo 24.º, n.º 1, alínea e) do Código dos Contratos Públicos",,,,,,Não aplicável.,Não aplicável.,FALSE
ENDOPRÓTESE (STENT) BILIAR METÁLICA,Ajuste Direto Regime Geral,Aquisição de bens móveis,"33184000-3, Próteses","Centro Hospitalar Tondela-Viseu, E. P. E. (509822940)",BOSTON  SCIENTIFIC  PORTUGAL -DISPOSITIVOS MÉDICOS (504988964),"8.900,00 €",19-09-2016,09-08-2016,180 dias,"Portugal, Viseu, Viseu","Artigo 24.º, n.º 1, alínea c) do Código dos Contratos Públicos",,,,,,Não aplicável.,Não aplicável.,FALSE
PRÓTESE MEMBRO INFERIOR TRANSFEMORAL ENDOESQUELÉTICA,Ajuste Direto Regime Geral,Aquisição de bens móveis,"33184000-3, Próteses","Centro Hospitalar Tondela-Viseu, E. P. E. (509822940)",CENTRO REABILITACAO PROF.GAIA (900395460),"5.703,92 €",19-09-2016,05-08-2016,1 dias,"Portugal, Viseu, Viseu","Artigo 20.º, n.º 1, alínea a) do Código dos Contratos Públicos",,,,,,Não aplicável.,Não aplicável.,FALSE
PINÇA CORTE/SELAGEM VASOS,Ajuste Direto Regime Geral,Aquisição de bens móveis,"33169000-2, Material cirúrgico","Centro Hospitalar Tondela-Viseu, E. P. E. (509822940)","MEDTRONIC PORTUGAL, LDA (504223933)","6.950,88 €",19-09-2016,11-08-2016,60 dias,"Portugal, Viseu, Viseu","Artigo 24.º, n.º 1, alínea c) do Código dos Contratos Públicos",,,,,,Não aplicável.,Não aplicável.,FALSE
MATERIAL APLICADO - COLUNA,Ajuste Direto Regime Geral,Aquisição de bens móveis,"33183100-7, Implantes ortopédicos","Centro Hospitalar Tondela-Viseu, E. P. E. (509822940)","JOHNSON & JOHNSON, LDA (500153370)","5.556,04 €",19-09-2016,29-08-2016,1 dias,"Portugal, Viseu, Viseu","Artigo 20.º, n.º 1, alínea a) do Código dos Contratos Públicos",,,,,,Não aplicável.,Não aplicável.,FALSE
SISTEMA FILTRAÇÃO7IRRECUPERÁVEL SANGUE INTER OPERATÓRIO,Ajuste Direto Regime Geral,Aquisição de bens móveis,"33162200-5, Instrumentos para blocos operatórios","Centro Hospitalar Tondela-Viseu, E. P. E. (509822940)",STRYKER PORTUGAL-PROD.M.UNIP.L (974913863),"6.000,00 €",19-09-2016,12-07-2016,90 dias,"Portugal, Viseu, Viseu","Artigo 24.º, n.º 1, alínea c) do Código dos Contratos Públicos",,,,,,Não aplicável.,Não aplicável.,FALSE
BATA PROTEÇÃO NÃO ESTERILIZADA,Ajuste Direto Regime Geral,Aquisição de bens móveis,"33140000-3, Material médico de consumo","Centro Hospitalar Tondela-Viseu, E. P. E. (509822940)","H.R.- Hospitalar,Lda (501895558)","9.920,00 €",19-09-2016,02-08-2016,90 dias,"Portugal, Viseu, Viseu","Artigo 20.º, n.º 1, alínea a) do Código dos Contratos Públicos",,,,,,Não aplicável.,Não aplicável.,FALSE
CARGA PARA MÁQUINA DE SUTURA LINEAR C/ CORTE,Ajuste Direto Regime Geral,Aquisição de bens móveis,"33141120-7, Clipes, suturas, ligaduras","Centro Hospitalar Tondela-Viseu, E. P. E. (509822940)","JOHNSON & JOHNSON, LDA (500153370)","5.760,00 €",19-09-2016,02-08-2016,180 dias,"Portugal, Viseu, Viseu","Artigo 24.º, n.º 1, alínea e) do Código dos Contratos Públicos",,,,,,Não aplicável.,Não aplicável.,FALSE
DIVERSO MATERIAL CLÍNICO PARA GINECOLOGIA/OBSTETRÍCIA,Ajuste Direto Regime Geral,Aquisição de bens móveis,"33140000-3, Material médico de consumo","Centro Hospitalar Tondela-Viseu, E. P. E. (509822940)","BAYER PORTUGAL, Lda (500043256)","52.500,00 €",16-09-2016,19-07-2016,1 dias,"Portugal, Viseu, Viseu","Artigo 24.º, n.º 1, alínea e) do Código dos Contratos Públicos",,,,,,Não aplicável.,Não aplicável.,FALSE
CLIP PARA COURO CABELUDO DE RANEY EM PLÁSTICO,Ajuste Direto Regime Geral,Aquisição de bens móveis,"33141100-1, Pensos; clipes, suturas, ligaduras","Centro Hospitalar Tondela-Viseu, E. P. E. (509822940)","B.BRAUN MEDICAL, LDA (501506543)","5.720,00 €",16-09-2016,02-08-2016,1 dias,"Portugal, Viseu, Viseu","Artigo 20.º, n.º 1, alínea a) do Código dos Contratos Públicos",,,,,,Não aplicável.,Não aplicável.,FALSE
LANCETAS PARA PUNÇÃO CAPILAR,Ajuste Direto Regime Geral,Aquisição de bens móveis,"33141900-9, Lancetas para sangria","Centro Hospitalar Tondela-Viseu, E. P. E. (509822940)","MENARINI DIAGNOSTICOS,LDA (502610069)","22.680,00 €",16-09-2016,19-07-2016,1 dias,"Portugal, Viseu, Viseu","Artigo 20.º, n.º 1, alínea a) do Código dos Contratos Públicos",,,,,,Não aplicável.,Não aplicável.,FALSE
ELETRODO ANSA 30 E PINÇA CORPO ESTRANHO,Ajuste Direto Regime Geral,Aquisição de bens móveis,"33140000-3, Material médico de consumo","Centro Hospitalar Tondela-Viseu, E. P. E. (509822940)",Olympus Iberia.S.A.U. (980474710),"7.390,20 €",16-09-2016,02-08-2016,1 dias,"Portugal, Viseu, Viseu","Artigo 24.º, n.º 1, alínea e) do Código dos Contratos Públicos",,,,,,Não aplicável.,Não aplicável.,FALSE
DISPOSITIVO HEMOSTASE PARA ANGIOPLASTIA CORONÁRIA,Ajuste Direto Regime Geral,Aquisição de bens móveis,"33111730-7, Material para angioplastia","Centro Hospitalar Tondela-Viseu, E. P. E. (509822940)",ST.JUDE MEDICAL PORTUGAL (504180746),"9.600,00 €",16-09-2016,02-08-2016,1 dias,"Portugal, Viseu, Viseu","Artigo 24.º, n.º 1, alínea c) do Código dos Contratos Públicos",,,,,,Não aplicável.,Não aplicável.,FALSE
INTRODUTOR RADIAL COM GUIA HIDROFILA,Ajuste Direto Regime Geral,Aquisição de bens móveis,"33140000-3, Material médico de consumo","Centro Hospitalar Tondela-Viseu, E. P. E. (509822940)",Terumo Europe Espanha SL. -Del. Portugal (980472024),"6.460,00 €",16-09-2016,02-08-2016,1 dias,"Portugal, Viseu, Viseu","Artigo 24.º, n.º 1, alínea c) do Código dos Contratos Públicos",,,,,,Não aplicável.,Não aplicável.,FALSE
DIVERSO MATERIAL PARA HEMODINÂMICA,Ajuste Direto Regime Geral,Aquisição de bens móveis,"33140000-3, Material médico de consumo","Centro Hospitalar Tondela-Viseu, E. P. E. (509822940)","MED X-RAY SISTEMAS MEDICOS, LDA (506187071)","18.373,70 €",15-09-2016,19-07-2016,1 dias,"Portugal, Viseu, Viseu","Artigo 24.º, n.º 1, alínea e) do Código dos Contratos Públicos",,,,,,Não aplicável.,Não aplicável.,FALSE
PULSEIRAS PARA IDENTIFICAÇÃO ELETRÓNICA,Ajuste Direto Regime Geral,Aquisição de bens móveis,"33140000-3, Material médico de consumo","Centro Hospitalar Tondela-Viseu, E. P. E. (509822940)",JOAO LAGO-ENG.SIST.SEGURANCA (506240711),"41.226,00 €",14-09-2016,09-05-2016,1 dias,"Portugal, Viseu, Viseu","Artigo 24.º, n.º 1, alínea e) do Código dos Contratos Públicos",,,,,,Não aplicável.,Não aplicável.,FALSE
DISPOSITIVO C/ FITA POLIPOPILENO PARA INCONTINENTE,Ajuste Direto Regime Geral,Aquisição de bens móveis,"33190000-8, Dispositivos e produtos médicos variados","Centro Hospitalar Tondela-Viseu, E. P. E. (509822940)","JOHNSON & JOHNSON, LDA (500153370)","9.407,40 €",14-09-2016,02-08-2016,1 dias,"Portugal, Viseu, Viseu","Artigo 24.º, n.º 1, alínea c) do Código dos Contratos Públicos",,,,,,Não aplicável.,Não aplicável.,FALSE
CONJUNTOS DESCARTÁVEIS PARA PROCEDIMENTOS AFERÉTICOS,Ajuste Direto Regime Geral,Aquisição de bens móveis,"33140000-3, Material médico de consumo","Centro Hospitalar Tondela-Viseu, E. P. E. (509822940)","TERUMO BCT PORTUGAL UNIPESSOAL, LDA. (510627048)","13.446,00 €",14-09-2016,13-05-2016,1 dias,"Portugal, Viseu, Viseu","Artigo 24.º, n.º 1, alínea e) do Código dos Contratos Públicos",,,,,,Não aplicável.,Não aplicável.,FALSE
MILTEFOSINA 50MG CAPS,Ajuste Direto Regime Geral,Aquisição de bens móveis,"33600000-6, Produtos farmacêuticos","Centro Hospitalar Tondela-Viseu, E. P. E. (509822940)",WE PHARMA LIMITED (944893866),"5.380,00 €",13-09-2016,22-08-2016,1 dias,"Portugal, Viseu, Viseu","Artigo 24.º, n.º 1, alínea c) do Código dos Contratos Públicos",,,,,,Não aplicável.,Não aplicável.,FALSE
LENALIDOMIDA 25MG CAPS,Ajuste Direto Regime Geral,Aquisição de bens móveis,"33600000-6, Produtos farmacêuticos","Centro Hospitalar Tondela-Viseu, E. P. E. (509822940)","CELGENE, SOC. UNIPESSOAL, LDA (507791690)","81.257,09 €",13-09-2016,08-09-2016,1 dias,"Portugal, Viseu, Viseu","Artigo 24.º, n.º 1, alínea e) do Código dos Contratos Públicos",,,,,,Não aplicável.,Não aplicável.,FALSE
