Objeto do Contrato,Tipo de Procedimento,Tipo(s) de Contrato,CPVs,Entidade(s) Adjudicante(s),Entidade(s) Adjudicatária(s),Preço Contratual,Data de Publicação,Data de Celebração do Contrato,Prazo de Execução,Local de Execução,Fundamentação,Data de Fecho do Contrato,Preço Total Efetivo,Causas das Alterações ao Prazo,Causas das Alterações ao Preço,Estado,N.º registo do Acordo Quadro,Descrição do Acordo Quadro,Procedimento Centralizado
Dexametasona 700 mcg Impl Intravítreo,Ao abrigo de acordo-quadro (art.º 258.º),Locação de bens móveis,"33600000-6, Produtos farmacêuticos",Instituto de Oftalmologia do Dr. Gama Pinto (600000052),"Profarin, Lda (500223238)","4.275,00 €",17-12-2018,13-12-2018,10 dias,"Portugal, Lisboa, Lisboa",Artigo 258.º do Código dos Contratos Públicos,19-12-2018,"4.275,00 €",,,,3358998,CP 2018/49 - Medicamentos usados nas afeções oculares e otorrinolaringológicas,FALSE
Lente de Mácula,Ajuste Direto Regime Geral,Aquisição de bens móveis,"33180000-5, Apoio funcional",Instituto de Oftalmologia do Dr. Gama Pinto (600000052),"Alcon Portugal - Produtos e Equipamentos Oftalmofógicos, Lda (501251685)","360,00 €",12-12-2018,19-11-2018,61 dias,"Portugal, Lisboa, Lisboa","Artigo 20.º, n.º 1, alínea d) do Código dos Contratos Públicos",12-12-2018,"360,00 €",,,,Não aplicável.,Não aplicável.,FALSE
Filtro 0.2,Ajuste Direto Regime Geral,Aquisição de bens móveis,"33141000-0, Material médico não químico descartável e produtos hematológicos",Instituto de Oftalmologia do Dr. Gama Pinto (600000052),"B. Braun Medical, Lda. (501506543)","62,50 €",12-12-2018,31-10-2018,61 dias,"Portugal, Lisboa, Lisboa","Artigo 20.º, n.º 1, alínea d) do Código dos Contratos Públicos",12-12-2018,"62,50 €",,,,Não aplicável.,Não aplicável.,FALSE
Adesivo Hipoalérgico,Ajuste Direto Regime Geral,Aquisição de bens móveis,"33141000-0, Material médico não químico descartável e produtos hematológicos",Instituto de Oftalmologia do Dr. Gama Pinto (600000052),"3M ESPANHA, SL SUCURSAL EM PORTUGAL (980560241)","60,00 €",12-12-2018,09-11-2018,52 dias,"Portugal, Lisboa, Lisboa","Artigo 20.º, n.º 1, alínea d) do Código dos Contratos Públicos",12-12-2018,"60,00 €",,,,Não aplicável.,Não aplicável.,FALSE
Anel para Dilatação da Pupila,Ajuste Direto Regime Geral,Aquisição de bens móveis,"33184100-4, Implantes cirúrgicos",Instituto de Oftalmologia do Dr. Gama Pinto (600000052),Oftaltec (503197149),"3.600,00 €",12-12-2018,16-11-2018,56 dias,"Portugal, Lisboa, Lisboa","Artigo 20.º, n.º 1, alínea d) do Código dos Contratos Públicos",12-12-2018,"3.600,00 €",,,,Não aplicável.,Não aplicável.,FALSE
Seringa de Insulina,Ajuste Direto Regime Geral,Aquisição de bens móveis,"33141310-6, Seringas",Instituto de Oftalmologia Doutor Gama Pinto (IOGP) (600000052),"B. Braun Medical, Lda. (501506543)","89,80 €",11-12-2018,14-11-2018,30 dias,"Portugal, Lisboa, Lisboa","Artigo 20.º, n.º 1, alínea d) do Código dos Contratos Públicos",11-12-2018,"89,80 €",,,,Não aplicável.,Não aplicável.,FALSE
Material para Cirurgia de Visudyne,Ajuste Direto Regime Geral,Aquisição de bens móveis,"33140000-3, Material médico de consumo",Instituto de Oftalmologia do Dr. Gama Pinto (600000052),"B. Braun Medical, Lda. (501506543)","950,00 €",11-12-2018,31-10-2018,22 dias,"Portugal, Lisboa, Lisboa","Artigo 20.º, n.º 1, alínea d) do Código dos Contratos Públicos",11-12-2018,"950,00 €",,,,Não aplicável.,Não aplicável.,FALSE
Fita Integradora p/ Esterilização a Vapor TST 134º,Ajuste Direto Regime Geral,Aquisição de bens móveis,"33141000-0, Material médico não químico descartável e produtos hematológicos",Instituto de Oftalmologia do Dr. Gama Pinto (600000052),"Dimor Lusitania, Lda. (500730741)","680,00 €",11-12-2018,23-05-2018,220 dias,"Portugal, Lisboa, Lisboa","Artigo 24.º, n.º 1, alínea a) do Código dos Contratos Públicos",11-12-2018,"680,00 €",,,,Não aplicável.,Não aplicável.,FALSE
