freguesia,acronym,validVotesPercentage,votes,dicofre
Cercal,PS,43.59,575,150903
Cercal,PCP-PEV,22.37,295,150903
Cercal,PPD/PSD,10.31,136,150903
Cercal,B.E.,9.86,130,150903
Cercal,PCTP/MRPP,2.88,38,150903
Cercal,CDS-PP,2.65,35,150903
Cercal,PAN,1.82,24,150903
Cercal,CH,1.74,23,150903
Cercal,PDR,0.99,13,150903
Cercal,PPM,0.68,9,150903
Cercal,L,0.61,8,150903
Cercal,IL,0.53,7,150903
Cercal,R.I.R.,0.53,7,150903
Cercal,MPT,0.38,5,150903
Cercal,PNR,0.3,4,150903
Cercal,A,0.23,3,150903
Cercal,NC,0.23,3,150903
Cercal,PTP,0.15,2,150903
Cercal,PURP,0.15,2,150903
Cercal,MAS,0,0,150903
