Objeto do Contrato,Tipo de Procedimento,Tipo(s) de Contrato,CPVs,Entidade(s) Adjudicante(s),Entidade(s) Adjudicatária(s),Preço Contratual,Data de Publicação,Data de Celebração do Contrato,Prazo de Execução,Local de Execução,Fundamentação,Data de Fecho do Contrato,Preço Total Efetivo,Causas das Alterações ao Prazo,Causas das Alterações ao Preço,Estado,N.º registo do Acordo Quadro,Descrição do Acordo Quadro,Procedimento Centralizado
AM/99/2018 - Aquisição de Medicamentos Diversos.1,Ajuste Direto Regime Geral,Aquisição de bens móveis,"33690000-3, Medicamentos vários","Administração Regional de Saúde do Algarve, I. P. (503148709)","Laboratórios Vitória, S.A. (500162220)","697,94 €",13-03-2018,13-03-2018,294 dias,"Portugal, Faro, Faro","Artigo 24.º, n.º 1, alínea e), subalínea ii) do Código dos Contratos Públicos","","",,"",,Não aplicável.,Não aplicável.,FALSE
Recolha e Gestão de Resíduos Hospitalares Perigosos,Concurso público,Aquisição de serviços,"90524400-0, Recolha, transporte e eliminação de resíduos hospitalares","Administração Regional de Saúde do Algarve, I. P. (503148709)","AMBIMED - GESTÃO AMBIENTAL, LDA (503593427)","37.005,45 €",12-03-2018,01-01-2018,365 dias,"Portugal, Faro, Faro",Artigo 155.º do Código dos Contratos Públicos,"","",,"",,Não aplicável.,Não aplicável.,FALSE
Aquisição de seguro automóvel para as viaturas da ARS Algarve e ACeS,Ajuste Direto Regime Geral,Aquisição de serviços,"66514110-0, Serviços de seguro automóvel","Administração Regional de Saúde do Algarve, I. P. (503148709)",Corbroker (503239470),"8.522,40 €",05-03-2018,21-02-2018,365 dias,Portugal,"Artigo 20.º, n.º 1, alínea d) do Código dos Contratos Públicos","","",,"",,Não aplicável.,Não aplicável.,FALSE
SP/19/2018 - Aquisição de vacinas para PNV 2018,Ao abrigo de acordo-quadro (art.º 259.º),Aquisição de bens móveis,"33651600-4, Vacinas","Administração Regional de Saúde do Algarve, I. P. (503148709)","Glaxo Smith Kline, Lda. (500139962)","75.871,30 €",05-03-2018,14-02-2018,329 dias,"Portugal, Faro, Faro",Artigo 259.º do Código dos Contratos Públicos,14-11-2018,"75.871,30 €",,"",,2327827,CP 2016/13-A - Acordo Quadro para fornecimento de Vacinas e Tuberculinas - Parte II,FALSE
SP/19/2018 - Aquisição de vacinas para PNV 2018,Ao abrigo de acordo-quadro (art.º 259.º),Aquisição de bens móveis,"33651600-4, Vacinas","Administração Regional de Saúde do Algarve, I. P. (503148709)","Merck Sharp & Dohme, Lda. (500191360)","263.600,00 €",05-03-2018,14-02-2018,329 dias,"Portugal, Faro, Faro",Artigo 259.º do Código dos Contratos Públicos,07-11-2018,"263.600,00 €",,"",,2327827,CP 2016/13-A - Acordo Quadro para fornecimento de Vacinas e Tuberculinas - Parte II,FALSE
SP/19/2018 - Aquisição de vacinas para PNV 2018,Ao abrigo de acordo-quadro (art.º 259.º),Aquisição de bens móveis,"33651600-4, Vacinas","Administração Regional de Saúde do Algarve, I. P. (503148709)","Sanofi, Produtos Farmacêuticos, Lda. (500134960)","331.540,00 €",05-03-2018,14-02-2018,329 dias,"Portugal, Faro, Faro",Artigo 259.º do Código dos Contratos Públicos,16-11-2018,"326.790,00 €",,Quantidades encomendadas.,,2327827,CP 2016/13-A - Acordo Quadro para fornecimento de Vacinas e Tuberculinas - Parte II,FALSE
