freguesia,acronym,validVotesPercentage,votes,dicofre
"União das freguesias de Provesende, Gouvães do Douro e São Cristóvão do Douro",PS,47.64,91,171016
"União das freguesias de Provesende, Gouvães do Douro e São Cristóvão do Douro",PPD/PSD.CDS-PP,32.46,62,171016
"União das freguesias de Provesende, Gouvães do Douro e São Cristóvão do Douro",MPT,4.19,8,171016
"União das freguesias de Provesende, Gouvães do Douro e São Cristóvão do Douro",PCP-PEV,4.19,8,171016
"União das freguesias de Provesende, Gouvães do Douro e São Cristóvão do Douro",PCTP/MRPP,2.62,5,171016
"União das freguesias de Provesende, Gouvães do Douro e São Cristóvão do Douro",PPV,2.62,5,171016
"União das freguesias de Provesende, Gouvães do Douro e São Cristóvão do Douro",PAN,2.09,4,171016
"União das freguesias de Provesende, Gouvães do Douro e São Cristóvão do Douro",PTP,1.57,3,171016
"União das freguesias de Provesende, Gouvães do Douro e São Cristóvão do Douro",B.E.,1.05,2,171016
"União das freguesias de Provesende, Gouvães do Douro e São Cristóvão do Douro",PDA,0.52,1,171016
"União das freguesias de Provesende, Gouvães do Douro e São Cristóvão do Douro",PND,0.52,1,171016
"União das freguesias de Provesende, Gouvães do Douro e São Cristóvão do Douro",PNR,0.52,1,171016
"União das freguesias de Provesende, Gouvães do Douro e São Cristóvão do Douro",L,0,0,171016
"União das freguesias de Provesende, Gouvães do Douro e São Cristóvão do Douro",MAS,0,0,171016
"União das freguesias de Provesende, Gouvães do Douro e São Cristóvão do Douro",POUS,0,0,171016
"União das freguesias de Provesende, Gouvães do Douro e São Cristóvão do Douro",PPM,0,0,171016
