Objeto do Contrato,Tipo de Procedimento,Tipo(s) de Contrato,CPVs,Entidade(s) Adjudicante(s),Entidade(s) Adjudicatária(s),Preço Contratual,Data de Publicação,Data de Celebração do Contrato,Prazo de Execução,Local de Execução,Fundamentação,Data de Fecho do Contrato,Preço Total Efetivo,Causas das Alterações ao Prazo,Causas das Alterações ao Preço,Estado,N.º registo do Acordo Quadro,Descrição do Acordo Quadro,Procedimento Centralizado
Aquisição de serviços de consultoria para estudo da viabilidade de criação de um núcleo de compras nos ACES da ARS Algarve,Ajuste Direto Regime Geral,Aquisição de serviços,"79419000-4, Serviços de consultoria para avaliação","Serviços Partilhados do Ministério da Saúde, E. P. E. (509540716)","SC Sousa & CF Santos, Lda. (510383874)","24.000,00 €",09-06-2014,25-11-2013,365 dias,Portugal,"Artigo 20.º, n.º 1, alínea a) do Código dos Contratos Públicos",30-11-2014,"24.000,00 €","","",,Não aplicável.,Não aplicável.,FALSE
Aquisição de storage NETAPP,Ajuste Direto Regime Geral,Aquisição de bens móveis,"30230000-0, Equipamento informático","Serviços Partilhados do Ministério da Saúde, E. P. E. (509540716)","Oramix - Sistemas de Informação, S. A. (504448382)","5.382,00 €",09-06-2014,13-12-2013,15 dias,"Portugal, Lisboa, Lisboa","Artigo 20.º, n.º 1, alínea a) do Código dos Contratos Públicos","","","","",,Não aplicável.,Não aplicável.,FALSE
Aquisição de serviços de desenvolvimento e implementação dos transportes imediatos nos Cuidados de Saúde Primários nas Plataformas Regionais de Transportes de Doentes,Ajuste Direto Regime Geral,Aquisição de serviços,"72500000-0, Serviços relacionados com a informática","Serviços Partilhados do Ministério da Saúde, E. P. E. (509540716)","Link Consulting - Tecnologias de Informação, S. A (504551221)","9.800,00 €",09-06-2014,12-12-2013,19 dias,"Portugal, Lisboa, Lisboa","Artigo 20.º, n.º 1, alínea a) do Código dos Contratos Públicos",31-12-2013,"9.800,00 €","","",,Não aplicável.,Não aplicável.,FALSE
Aquisição de tapes,Ajuste Direto Regime Geral,Aquisição de bens móveis,"30230000-0, Equipamento informático","Serviços Partilhados do Ministério da Saúde, E. P. E. (509540716)","Oramix - Sistemas de Informação, S. A. (504448382)","5.100,00 €",09-06-2014,13-12-2013,28 dias,"Portugal, Lisboa, Lisboa","Artigo 20.º, n.º 1, alínea a) do Código dos Contratos Públicos","","","","",,Não aplicável.,Não aplicável.,FALSE
Aquisição de serviços de assistência técnica IPBRICK,Ajuste Direto Regime Geral,Aquisição de serviços,"72611000-6, Serviços de assistência técnica informática","Serviços Partilhados do Ministério da Saúde, E. P. E. (509540716)","IPBRICK, S. A. (504837958)","7.200,00 €",09-06-2014,01-01-2014,365 dias,"Portugal, Porto, Porto<BR/>Portugal, Lisboa, Lisboa","Artigo 20.º, n.º 1, alínea a) do Código dos Contratos Públicos","","","","",,Não aplicável.,Não aplicável.,FALSE
Aquisição de formação,Ajuste Direto Regime Geral,Aquisição de serviços,"80500000-9, Serviços de formação","Serviços Partilhados do Ministério da Saúde, E. P. E. (509540716)","Oramix, Sistemas de Informação, S. A. (504448382)","36.910,00 €",09-06-2014,27-12-2013,30 dias,"Portugal, Lisboa, Lisboa<BR/>Portugal, Porto, Porto","Artigo 20.º, n.º 1, alínea a) do Código dos Contratos Públicos",31-01-2014,"36.910,00 €","","",,Não aplicável.,Não aplicável.,FALSE
Prestação continuada de serviços de higiene,Ajuste Direto Regime Geral,Aquisição de serviços,"85142300-9, Serviços de higiene","Serviços Partilhados do Ministério da Saúde, E. P. E. (509540716)","Rentokil Portugal - Serviços de Proteção Ambiental, Lda. (501351167)","7.201,66 €",09-06-2014,01-01-2014,365 dias,"Portugal, Lisboa, Lisboa<BR/>Portugal, Porto, Porto","Artigo 20.º, n.º 1, alínea a) do Código dos Contratos Públicos","","","","",,Não aplicável.,Não aplicável.,FALSE
Prestação de serviços de consultoria à plataforma eletrónica de apoio à PEM,Ajuste Direto Regime Geral,Aquisição de serviços,"72600000-6, Serviços de consultoria e assistência informáticas","Serviços Partilhados do Ministério da Saúde, E. P. E. (509540716)","Wide Scope - Sistemas de Planeamento e Optimização, Lda. (505830612)","9.900,00 €",09-06-2014,30-01-2014,335 dias,"Portugal, Porto, Porto","Artigo 20.º, n.º 1, alínea a) do Código dos Contratos Públicos",31-12-2014,"9.900,00 €","","",,Não aplicável.,Não aplicável.,FALSE
"Aquisição de serviços de manutenção do AVAC, gerador, UPS e QGBT do Datacenter",Ajuste Direto Regime Geral,Aquisição de serviços,"50324200-4, Serviços de manutenção preventiva","Serviços Partilhados do Ministério da Saúde, E. P. E. (509540716)","Maxiglobal - Equipamentos e serviços de Informática, S. A. (504320882)","9.940,00 €",09-06-2014,17-12-2013,365 dias,"Portugal, Porto, Porto","Artigo 20.º, n.º 1, alínea a) do Código dos Contratos Públicos",31-12-2014,"9.940,00 €","","",,Não aplicável.,Não aplicável.,FALSE
"Aquisição de serviços de manutenção do software Primavera para a ACSS, no ano de 2014",Ajuste Direto Regime Geral,Aquisição de serviços,"72267100-0, Manutenção de software para as tecnologias da infomação","Serviços Partilhados do Ministério da Saúde, E. P. E. (509540716)","PRIPT - Business Software Solutions, Lda. (507661800)","8.107,30 €",09-06-2014,14-05-2014,231 dias,"Portugal, Lisboa, Lisboa","Artigo 20.º, n.º 1, alínea a) do Código dos Contratos Públicos",31-12-2014,"8.107,30 €","","",,Não aplicável.,Não aplicável.,FALSE
Aquisição de serviços de gestão da área de informação na área de compras da UCT,Ajuste Direto Regime Geral,Aquisição de serviços,"79500000-9, Serviços auxiliares de escritório","Serviços Partilhados do Ministério da Saúde, E. P. E. (509540716)","Softventure - Consultoria e Tecnologia, S. A. (511252277)","64.456,60 €",09-06-2014,31-12-2013,789 dias,"Portugal, Lisboa, Lisboa","Artigo 20.º, n.º 1, alínea a) do Código dos Contratos Públicos",31-05-2015,"42.144,66 €","Revogação do contrato ao abrigo do artigo 331.º do Código dos Contratos Públicos, por acordo entre as partes.","Revogação do contrato ao abrigo do artigo 331.º do Código dos Contratos Públicos, por acordo entre as partes.",,Não aplicável.,Não aplicável.,FALSE
"Aquisição de serviços de apoio à Gestão de Clientes no âmbito do Núcleo de Planeamento do Sistema de Informação e Gestão de Clientes da SPMS, EPE",Ajuste Direto Regime Geral,Aquisição de serviços,"79000000-4, Serviços a empresas: direito, comercialização, consultoria, recrutamento, impressão e segurança","Serviços Partilhados do Ministério da Saúde, E. P. E. (509540716)","Softventure - Consultoria e Tecnologia, S. A. (511252277)","65.029,24 €",09-06-2014,31-12-2013,913 dias,"Portugal, Lisboa, Lisboa","Artigo 20.º, n.º 1, alínea a) do Código dos Contratos Públicos","","","","",,Não aplicável.,Não aplicável.,FALSE
"Aquisição de mobiliário para o edifício da Rua do Breiner, Porto",Ajuste Direto Regime Geral,Aquisição de bens móveis,"39130000-2, Mobiliário de escritório","Serviços Partilhados do Ministério da Saúde, E. P. E. (509540716)","Haworth Portugal - Mobiliário de Escritório, S. A. (500077622)","14.312,84 €",09-06-2014,28-11-2013,73 dias,"Portugal, Porto, Porto","Artigo 20.º, n.º 1, alínea a) do Código dos Contratos Públicos",31-12-2013,"14.312,84 €","","",,Não aplicável.,Não aplicável.,FALSE
"Aquisição de serviços de consultoria funcional, análise, conceptualização, validação de desenhos, testes, formação e apoio aos utilizadores do SONHO - CSP",Ajuste Direto Regime Geral,Aquisição de serviços,"72000000-5, Serviços de TI: consultoria, desenvolvimento de software, Internet e apoio","Serviços Partilhados do Ministério da Saúde, E. P. E. (509540716)","HELP U2B IT, Lda. (510589260)","45.900,00 €",09-06-2014,29-04-2014,216 dias,"Portugal, Porto, Porto","Artigo 20.º, n.º 1, alínea a) do Código dos Contratos Públicos",30-04-2015,"45.900,00 €","","",,Não aplicável.,Não aplicável.,FALSE
