freguesia,acronym,validVotesPercentage,votes,dicofre
Fortios,PS,44.92,376,121404
Fortios,PPD/PSD,26.4,221,121404
Fortios,PCP-PEV,9.08,76,121404
Fortios,B.E.,8.48,71,121404
Fortios,CDS-PP,2.63,22,121404
Fortios,CH,2.51,21,121404
Fortios,PAN,1.91,16,121404
Fortios,L,1.08,9,121404
Fortios,A,0.72,6,121404
Fortios,IL,0.72,6,121404
Fortios,PCTP/MRPP,0.6,5,121404
Fortios,R.I.R.,0.36,3,121404
Fortios,PNR,0.24,2,121404
Fortios,MPT,0.12,1,121404
Fortios,PTP,0.12,1,121404
Fortios,PURP,0.12,1,121404
Fortios,PDR,0,0,121404
