Objeto do Contrato,Tipo de Procedimento,Tipo(s) de Contrato,CPVs,Entidade(s) Adjudicante(s),Entidade(s) Adjudicatária(s),Preço Contratual,Data de Publicação,Data de Celebração do Contrato,Prazo de Execução,Local de Execução,Fundamentação,Data de Fecho do Contrato,Preço Total Efetivo,Causas das Alterações ao Prazo,Causas das Alterações ao Preço,Estado,N.º registo do Acordo Quadro,Descrição do Acordo Quadro,Procedimento Centralizado
Aquisição de Osteossintese: Placas Osteotomia de Adição para tíbia em Aço.,Ajuste Direto Regime Geral,Aquisição de bens móveis,"33183100-7, Implantes ortopédicos","CENTRO HOSPITALAR DE ENTRE O DOURO E VOUGA, E.P.E. (508878462)","Artur Salgado, S.A. (503612600)","4.305,00 €",15-04-2016,02-09-2015,1095 dias,"Portugal, Aveiro, Santa Maria da Feira","Artigo 20.º, n.º 1, alínea a) do Código dos Contratos Públicos","","",,,,Não aplicável.,Não aplicável.,FALSE
Aquisição de Placa Ellis em Aço,Ajuste Direto Regime Geral,Aquisição de bens móveis,"33183300-9, Aparelhos para osteossíntese","CENTRO HOSPITALAR DE ENTRE O DOURO E VOUGA, E.P.E. (508878462)","Artur Salgado,S.A. (503612600)","1.110,00 €",14-04-2016,02-09-2015,1095 dias,"Portugal, Aveiro, Santa Maria da Feira","Artigo 20.º, n.º 1, alínea a) do Código dos Contratos Públicos","","",,,,Não aplicável.,Não aplicável.,FALSE
Aquisição de Próteses de Ombro Invertida e Degenarativa,Ajuste Direto Regime Geral,Aquisição de bens móveis,"33183200-8, Próteses ortopédicas","CENTRO HOSPITALAR DE ENTRE O DOURO E VOUGA, E.P.E. (508878462)","Johnson & Johnson, Lda (500153370)","63.559,80 €",14-04-2016,20-05-2015,365 dias,"Portugal, Aveiro, Santa Maria da Feira","Artigo 20.º, n.º 1, alínea a) do Código dos Contratos Públicos","","",,,,Não aplicável.,Não aplicável.,FALSE
Aquisição de próteses do Ombro de Fraturas e  Revestimento,Ajuste Direto Regime Geral,Aquisição de bens móveis,"33183200-8, Próteses ortopédicas","CENTRO HOSPITALAR DE ENTRE O DOURO E VOUGA, E.P.E. (508878462)",Biomet Portugal (500254990),"14.970,00 €",14-04-2016,08-05-2015,30 dias,"Portugal, Aveiro, Santa Maria da Feira","Artigo 20.º, n.º 1, alínea a) do Código dos Contratos Públicos","","",,,,Não aplicável.,Não aplicável.,FALSE
Aquisição de UpGrade de Tac Phillips Brilliance 6,Ajuste Direto Regime Geral,Aquisição de serviços,"50400000-9, Serviços de reparação e manutenção de equipamento médico e de precisão","CENTRO HOSPITALAR DE ENTRE O DOURO E VOUGA, E.P.E. (508878462)","Philips Portuguesa, S.A. (500216843)","86.700,00 €",14-04-2016,02-10-2015,120 dias,"Portugal, Aveiro, Santa Maria da Feira","Artigo 20.º, n.º 1, alínea a) do Código dos Contratos Públicos","","",,,,Não aplicável.,Não aplicável.,FALSE
Aquisição de diverso material para Bloco Operatório de Urologia,Ajuste Direto Regime Geral,Aquisição de bens móveis,"33100000-1, Equipamento médico","CENTRO HOSPITALAR DE ENTRE O DOURO E VOUGA, E.P.E. (508878462)",Olympus Ibérica  (980474710),"7.968,36 €",13-04-2016,12-04-2016,30 dias,"Portugal, Aveiro, Santa Maria da Feira","Artigo 20.º, n.º 1, alínea a) do Código dos Contratos Públicos",03-06-2016,"7.968,36 €",,,,Não aplicável.,Não aplicável.,FALSE
Aquisição de Detetor Wi-Fi para Sistema de Radiologia Digital Fujifilm,Ajuste Direto Regime Geral,Aquisição de bens móveis,"33100000-1, Equipamento médico","CENTRO HOSPITALAR DE ENTRE O DOURO E VOUGA, E.P.E. (508878462)",Fugifilm Europe GmbH (980456517),"39.500,00 €",13-04-2016,12-02-2016,30 dias,"Portugal, Aveiro, Santa Maria da Feira","Artigo 20.º, n.º 1, alínea a) do Código dos Contratos Públicos",29-03-2016,"39.500,00 €",,,,Não aplicável.,Não aplicável.,FALSE
Aquisição da prestação de serviços para Espaço e Catering- Jantar de Natal do CHEDV,Ajuste Direto Regime Geral,Aquisição de serviços,"51000000-9, Serviços de instalação (excepto software)","Centro Hospitalar de Entre o Douro e Vouga, E.P.E. (508878462)","Feira Viva, Cultura e Desporto, E.M. (505120151)","2.730,00 €",12-04-2016,02-12-2015,5 dias,"Portugal, Aveiro, Santa Maria da Feira","Artigo 20.º, n.º 1, alínea a) do Código dos Contratos Públicos","","",,,,Não aplicável.,Não aplicável.,FALSE
Aquisição da prestação de serviços para Aluguer de espaço e Catering - Jantar de Natal,Ajuste Direto Regime Geral,Aquisição de serviços,"55000000-0, Serviços de hotelaria, restauração e comércio a retalho","Centro Hospitalar de Entre o Douro e Vouga, E.P.E. (508878462)",Restaurante Tirsense (509198031),"11.880,00 €",12-04-2016,30-12-2015,30 dias,"Portugal, Aveiro, Santa Maria da Feira","Artigo 20.º, n.º 1, alínea a) do Código dos Contratos Públicos","","",,,,Não aplicável.,Não aplicável.,FALSE
Aquisição de Serviços Médicos por Teleradiologia-relatórios TAC,Ajuste Direto Regime Geral,Aquisição de serviços,"85150000-5, Serviços de imagiologia médica","CENTRO HOSPITALAR DE ENTRE O DOURO E VOUGA, E.P.E. (508878462)",Dr. Campos Costa Consutório de Tomografia Computorizada Lda (502082429),"69.999,35 €",12-04-2016,14-01-2016,60 dias,"Portugal, Aveiro, Santa Maria da Feira","Artigo 20.º, n.º 1, alínea a) do Código dos Contratos Públicos","","",,,,Não aplicável.,Não aplicável.,FALSE
Aquisição de Prestação de Serviços de Benchmarking on-line de indicadores clínicos,Ajuste Direto Regime Geral,Aquisição de serviços,"79313000-1, Serviços de avaliação dos resultados","CENTRO HOSPITALAR DE ENTRE O DOURO E VOUGA, E.P.E. (508878462)",Iasist Portugal  (508052971),"65.000,00 €",12-04-2016,15-01-2016,5 dias,"Portugal, Aveiro, Santa Maria da Feira","Artigo 20.º, n.º 1, alínea a) do Código dos Contratos Públicos","","",,,,Não aplicável.,Não aplicável.,FALSE
Remodelação da Fachada do Edifício Consulta Externa Pediátrica- Unidade de Saúde de Oliveira de Azeméis,Ajuste Direto Regime Geral,Empreitadas de obras públicas,"45453000-7, Obras de revisão e recuperação","CENTRO HOSPITALAR DE ENTRE O DOURO E VOUGA, E.P.E. (508878462)","Custódio de Melo - Sociedade de Construções, Lda (504032909)","6.975,00 €",12-04-2016,21-01-2016,5 dias,"Portugal, Aveiro, Santa Maria da Feira","Artigo 19.º, alínea a) do Código dos Contratos Públicos","","",,,,Não aplicável.,Não aplicável.,FALSE
Aquisição de Sendores de gotas para Bombas de Infusão,Ajuste Direto Regime Geral,Aquisição de bens móveis,"33100000-1, Equipamento médico","CENTRO HOSPITALAR DE ENTRE O DOURO E VOUGA, E.P.E. (508878462)","Agosaude, S.A.  (507016882)","3.600,00 €",12-04-2016,30-12-2015,30 dias,"Portugal, Aveiro, Santa Maria da Feira","Artigo 20.º, n.º 1, alínea a) do Código dos Contratos Públicos","","",,,,Não aplicável.,Não aplicável.,FALSE
Aquisição de Sendores de Gotas para Bombas de Infusão,Ajuste Direto Regime Geral,Aquisição de bens móveis,"33100000-1, Equipamento médico","CENTRO HOSPITALAR DE ENTRE O DOURO E VOUGA, E.P.E. (508878462)","B. Braun Medical,Lda (501506543)","3.293,80 €",12-04-2016,30-12-2015,10 dias,"Portugal, Aveiro, Santa Maria da Feira","Artigo 20.º, n.º 1, alínea a) do Código dos Contratos Públicos","","",,,,Não aplicável.,Não aplicável.,FALSE
Aquisição de 15+11 Computadores Desktop e 11 Discos SSD,Ajuste Direto Regime Geral,Aquisição de bens móveis,"30200000-1, Equipamento e material informático","CENTRO HOSPITALAR DE ENTRE O DOURO E VOUGA, E.P.E. (508878462)","Exitus Soluções Tecnológicas, Lda (509117660)","2.165,60 €",11-04-2016,13-11-2015,2 dias,"Portugal, Aveiro, Santa Maria da Feira","Artigo 20.º, n.º 1, alínea a) do Código dos Contratos Públicos",26-11-2015,"2.165,60 €",,,,Não aplicável.,Não aplicável.,FALSE
Aquisição de 15 + 11 Computadores desktop e 11 Discos SSD,Ajuste Direto Regime Geral,Aquisição de bens móveis,"30200000-1, Equipamento e material informático","CENTRO HOSPITALAR DE ENTRE O DOURO E VOUGA, E.P.E. (508878462)",Inforlândia Soluções Empresariais  (502425296),"4.440,00 €",11-04-2016,13-11-2015,30 dias,"Portugal, Aveiro, Santa Maria da Feira","Artigo 20.º, n.º 1, alínea a) do Código dos Contratos Públicos",26-11-2015,"4.440,00 €",,,,Não aplicável.,Não aplicável.,FALSE
Aquisição de Prestação de Serviços para Reparação do Autoclave Amaro 5000,Ajuste Direto Regime Geral,Aquisição de serviços,"50800000-3, Serviços de reparação e manutenção diversos","CENTRO HOSPITALAR DE ENTRE O DOURO E VOUGA, E.P.E. (508878462)",Such Serviço de Utilização Comum dos Hospitais (500900469),"3.785,00 €",11-04-2016,28-09-2015,5 dias,"Portugal, Aveiro, Santa Maria da Feira","Artigo 20.º, n.º 1, alínea a) do Código dos Contratos Públicos","","",,,,Não aplicável.,Não aplicável.,FALSE
Aquisição de prestação de serviços de manutenção dos jardins e parques de estacionamento,Ajuste Direto Regime Geral,Aquisição de serviços,"90500000-2, Serviços relativos a resíduos e lixos","CENTRO HOSPITALAR DE ENTRE O DOURO E VOUGA, E.P.E. (508878462)",Ecorede Engenharia e Serviços S.A. (508271754),"27.843,27 €",11-04-2016,11-01-2016,1095 dias,"Portugal, Aveiro, Santa Maria da Feira","Artigo 20.º, n.º 1, alínea a) do Código dos Contratos Públicos","","",,,,Não aplicável.,Não aplicável.,FALSE
