Objeto do Contrato,Tipo de Procedimento,Tipo(s) de Contrato,CPVs,Entidade(s) Adjudicante(s),Entidade(s) Adjudicatária(s),Preço Contratual,Data de Publicação,Data de Celebração do Contrato,Prazo de Execução,Local de Execução,Fundamentação,Data de Fecho do Contrato,Preço Total Efetivo,Causas das Alterações ao Prazo,Causas das Alterações ao Preço,Estado,N.º registo do Acordo Quadro,Descrição do Acordo Quadro,Procedimento Centralizado
"Seringas, Agulhas e contentores",Ao abrigo de acordo-quadro (art.º 259.º),Aquisição de bens móveis,"33000000-0, Equipamento médico, medicamentos e produtos para cuidados pessoais","Centro Hospitalar do Médio Tejo, E. P. E. (506361608)",PERGUT PORTUGAL (501799729),"25.656,18 €",31-03-2016,23-03-2016,366 dias,"Portugal, Santarém, Abrantes",Artigo 259.º do Código dos Contratos Públicos,,,,,,1341769,"ACORDO QUADRO PARA FORNECIMENTO DE SERINGAS, AGULHAS E CONTENTORES ÀS INSTITUIÇÕES E SERVIÇOS DO SERVIÇO NACIONAL DE SAÚDE PROGRAMA DE CONCURSO",FALSE
Dispositivos Médicos Diversos,Ao abrigo de acordo-quadro (art.º 259.º),Aquisição de bens móveis,"33000000-0, Equipamento médico, medicamentos e produtos para cuidados pessoais","Centro Hospitalar do Médio Tejo, E. P. E. (506361608)","OVERPHARMA, LDA (505792362)","1.966,00 €",31-03-2016,15-01-2016,366 dias,"Portugal, Santarém, Abrantes",Artigo 259.º do Código dos Contratos Públicos,,,,,,1587913,Acordo Quadro para fornecimento de Equipamentos e Dispositivos Médicos de uso comum em internamento e ambulatório - Parte I às instituições e serviços do Serviço Nacional de Saúde.,FALSE
Sistemas fechados e Material diverso de Colheita de sangue,Ao abrigo de acordo-quadro (art.º 259.º),Aquisição de bens móveis,"33000000-0, Equipamento médico, medicamentos e produtos para cuidados pessoais","Centro Hospitalar do Médio Tejo, E. P. E. (506361608)","Sarstedt, SA (503019461)","10.913,90 €",30-03-2016,20-01-2016,366 dias,"Portugal, Santarém, Torres Novas",Artigo 259.º do Código dos Contratos Públicos,,,,,,1350003,Acordo Quadro para fornecimento de sistemas fechados e material diverso de recolha de sangue às instituições do SNS,FALSE
Servidor Rack,Ao abrigo de acordo-quadro (art.º 258.º),Aquisição de bens móveis,"32000000-3, Equipamento de rádio, televisão, comunicação, telecomunicações e afins","Centro Hospitalar do Médio Tejo, E. P. E. (506361608)","Basedois, Lda. (501333401)","7.000,00 €",29-03-2016,21-03-2016,60 dias,"Portugal, Santarém, Tomar",Artigo 258.º do Código dos Contratos Públicos,,,,,,1186880,"Acordo Quadro """"Equipamento Informático"""" em vigor na ESPAP",FALSE
"Sonda Probe, 7S-RS, para Ecocardíografo",Ajuste Direto Regime Geral,Aquisição de bens móveis,"33112000-8, Equipamento de imagiologia por ecos, ultra-sons e doppler","Centro Hospitalar do Médio Tejo, E.P.E. (CHMT) (506361608)","General Electric Portuguesa, S.A. (500357129)","5.725,94 €",28-03-2016,18-03-2016,30 dias,"Portugal, Santarém, Torres Novas","Artigo 20.º, n.º 1, alínea a) do Código dos Contratos Públicos",,,,,,Não aplicável.,Não aplicável.,FALSE
Material de Prevenção de Detecção HIV,Ao abrigo de acordo-quadro (art.º 259.º),Aquisição de bens móveis,"33000000-0, Equipamento médico, medicamentos e produtos para cuidados pessoais","Centro Hospitalar do Médio Tejo, E. P. E. (506361608)",Sartsted S.A. (503019461),"9.000,00 €",28-03-2016,16-10-2015,366 dias,"Portugal, Santarém, Abrantes",Artigo 259.º do Código dos Contratos Públicos,,,,,,464738,"Concurso público para a celebração de contratos públicos de aprovisionamento para a área da saúde, com vista ao fornecimento de material de prevenção e deteção do HIV.",FALSE
Testes de sedimentos urinários,Ajuste Direto Regime Geral,Aquisição de bens móveis,"33600000-6, Produtos farmacêuticos","Centro Hospitalar do Médio Tejo, E. P. E. (506361608)","Menarini Diagnósticos - Material de Laboratório, Lda (502610069)","5.517,60 €",28-03-2016,03-03-2016,366 dias,"Portugal, Santarém, Tomar","Artigo 20.º, n.º 1, alínea a) do Código dos Contratos Públicos",,,,,,Não aplicável.,Não aplicável.,FALSE
Aquisição de penso Tradicional/Clássico,Ao abrigo de acordo-quadro (art.º 259.º),Aquisição de bens móveis,"33000000-0, Equipamento médico, medicamentos e produtos para cuidados pessoais","Centro Hospitalar do Médio Tejo, E. P. E. (506361608)","MINNESOTA (3M) PORTUGAL, LDA (500193940)","34.144,00 €",23-03-2016,14-12-2015,366 dias,"Portugal, Santarém, Abrantes",Artigo 259.º do Código dos Contratos Públicos,,,,,,534953,"CONCURSO PÚBLICO PARA A CELEBRAÇÃO DE CONTRATOS PÚBLICOS DE APROVISIONAMENTO PARA A ÁREA DA SAÚDE, COM VISTA AO FORNECIMENTO DE MATERIAL DE PENSO TRADICIONAL/CLASSICO - PARTE 1 - ÀS INSTITUIÇÕES E SERVIÇOS DO SERVIÇO NACIONAL DE SAÚDE  ",FALSE
AQUISICAO SERVIÇOS MEDICOS NA AREA DA ORTOPEDIA ( 37019415),Ajuste Direto Regime Geral,Aquisição de serviços,"85100000-0, Serviços de saúde","Centro Hospitalar do Médio Tejo, E. P. E. (506361608)","ARMANDO PIRES-SERVIÇOS MEDICOS, LDA (508634903)","30.000,00 €",23-03-2016,08-01-2016,92 dias,"Portugal, Santarém, Torres Novas","Artigo 20.º, n.º 1, alínea a) do Código dos Contratos Públicos",,,,,,Não aplicável.,Não aplicável.,FALSE
Material de incontinência,Ao abrigo de acordo-quadro (art.º 259.º),Aquisição de bens móveis,"33000000-0, Equipamento médico, medicamentos e produtos para cuidados pessoais","Centro Hospitalar do Médio Tejo, E. P. E. (506361608)","Medline, Lda (510533515)","27.923,00 €",23-03-2016,06-11-2015,366 dias,"Portugal, Santarém, Tomar",Artigo 259.º do Código dos Contratos Públicos,,,,,,389355,"CONCURSO PÚBLICO PARA A CELEBRAÇÃO DE CONTRATOS PÚBLICOS DE APROVISIONAMENTO PARA AQUISIÇÃO DE MATERIAL DE INCONTINÊNCIA, PROTECÇÃO CUTÂNEA E ALIVIO DE PRESSÃO",FALSE
Manutenção do software Aplicacional_GIAF,Ajuste Direto Regime Geral,Aquisição de serviços,"72300000-8, Serviços relacionados com dados","Centro Hospitalar do Médio Tejo, E.P.E. (CHMT) (506361608)","Indra sistemas Portugal, S.A (506176142)","7.137,37 €",22-03-2016,16-03-2016,366 dias,"Portugal, Santarém, Tomar","Artigo 20.º, n.º 1, alínea a) do Código dos Contratos Públicos",,,,,,Não aplicável.,Não aplicável.,FALSE
Prestação de Serviços Médicos - Cirurgia Pediátrica,Ajuste Direto Regime Geral,Aquisição de serviços,"85100000-0, Serviços de saúde","Centro Hospitalar do Médio Tejo, E. P. E. (506361608)","Catela Cirurgia Pediátrica, Lda (504665979)","11.420,40 €",22-03-2016,01-03-2016,366 dias,"Portugal, Santarém, Torres Novas","Artigo 20.º, n.º 1, alínea a) do Código dos Contratos Públicos",,,,,,Não aplicável.,Não aplicável.,FALSE
Prestação de Serviços Médicos - Cuidados Paliativos,Ajuste Direto Regime Geral,Aquisição de serviços,"85100000-0, Serviços de saúde","Centro Hospitalar do Médio Tejo, E. P. E. (506361608)","Rui Leonardo - Serviços Médicos, Lda (509796915)","19.592,52 €",22-03-2016,11-03-2016,366 dias,"Portugal, Santarém, Tomar","Artigo 20.º, n.º 1, alínea a) do Código dos Contratos Públicos",,,,,,Não aplicável.,Não aplicável.,FALSE
Aquisição de medicamentos diversos,Ao abrigo de acordo-quadro (art.º 259.º),Aquisição de bens móveis,"33600000-6, Produtos farmacêuticos","Centro Hospitalar do Médio Tejo, E. P. E. (506361608)","Unilfarma, Lda (500293023)","14,70 €",21-03-2016,03-03-2016,366 dias,"Portugal, Santarém, Abrantes",Artigo 259.º do Código dos Contratos Públicos,,,,,,1209176,"CONCURSO PÚBLICO PARA A CELEBRAÇÃO DE CONTRATOS PÚBLICOS DE APROVISIONAMENTO PARA A ÁREA DA SAÚDE, COM VISTA AO FORNECIMENTO DE MEDICAMENTOS DIVERSOS, ÀS INSTITUIÇÕES E SERVIÇOS DO SERVIÇO NACIONAL DE SAÚDE",FALSE
Aquisição de medicamentos do aparelho geniturinário,Ao abrigo de acordo-quadro (art.º 259.º),Aquisição de bens móveis,"33600000-6, Produtos farmacêuticos","Centro Hospitalar do Médio Tejo, E. P. E. (506361608)","Bayer Portugal, SA (500043256)","992,56 €",21-03-2016,08-03-2016,366 dias,"Portugal, Santarém, Tomar",Artigo 259.º do Código dos Contratos Públicos,,,,,,1404918,CP 2015/48 - Acordo Quadro para fornecimento de Medicamentos de Consumo Geral - Aparelho Geniturinário às Instituições e Serviços do Serviço Nacional de Saúde,FALSE
Aquisição de nutrição parentérica,Ao abrigo de acordo-quadro (art.º 259.º),Aquisição de bens móveis,"33600000-6, Produtos farmacêuticos","Centro Hospitalar do Médio Tejo, E. P. E. (506361608)","B. Braun Medical, Lda (501506543)","68.176,98 €",21-03-2016,10-03-2016,366 dias,"Portugal, Santarém, Abrantes",Artigo 259.º do Código dos Contratos Públicos,,,,,,1377429,Acordo Quadro para fornecimento de medicamentos para Nutrição Parentérica às Instituições e Serviços do Serviço Nacional de Saúde,FALSE
Aquisição de derivados do plasma humano,Ao abrigo de acordo-quadro (art.º 259.º),Aquisição de bens móveis,"33600000-6, Produtos farmacêuticos","Centro Hospitalar do Médio Tejo, E. P. E. (506361608)","CSL Behring Unipessoal, Lda  (503047201)","19.941,00 €",21-03-2016,10-03-2016,366 dias,"Portugal, Santarém, Abrantes",Artigo 259.º do Código dos Contratos Públicos,,,,,,1423488,ACORDO QUADRO PARA FORNECIMENTO DE DERIVADOS DO PLASMA HUMANO ÀS INSTITUIÇÕES E SERVIÇOS DO SERVIÇO NACIONAL DE SAÚDE CP 2015/9,FALSE
Aquisição de contracetivos orais,Ao abrigo de acordo-quadro (art.º 259.º),Aquisição de bens móveis,"33600000-6, Produtos farmacêuticos","Centro Hospitalar do Médio Tejo, E. P. E. (506361608)","Bayer Portugal, SA (500043256)","12.823,70 €",21-03-2016,10-03-2016,366 dias,"Portugal, Santarém, Abrantes",Artigo 259.º do Código dos Contratos Públicos,,,,,,1459323,CP 2015/20,FALSE
Aquisição de Epoitinas de média duração,Ao abrigo de acordo-quadro (art.º 259.º),Aquisição de bens móveis,"33600000-6, Produtos farmacêuticos","Centro Hospitalar do Médio Tejo, E. P. E. (506361608)","Amgen - Biofarmacêutica, Lda (502942959)","290.000,00 €",21-03-2016,11-03-2016,366 dias,"Portugal, Santarém, Torres Novas",Artigo 259.º do Código dos Contratos Públicos,,,,,,1348990,Acordo quadro para fornecimento de Estimulantes da Eritropoiese às instituições e serviços do serviço nacional de saúde,FALSE
