Objeto do Contrato,Tipo de Procedimento,Tipo(s) de Contrato,CPVs,Entidade(s) Adjudicante(s),Entidade(s) Adjudicatária(s),Preço Contratual,Data de Publicação,Data de Celebração do Contrato,Prazo de Execução,Local de Execução,Fundamentação,Data de Fecho do Contrato,Preço Total Efetivo,Causas das Alterações ao Prazo,Causas das Alterações ao Preço,Estado,N.º registo do Acordo Quadro,Descrição do Acordo Quadro,Procedimento Centralizado
Aquisição de trouxa de Partos e de Cesariana,Ajuste Direto Regime Geral,Aquisição de bens móveis,"33140000-3, Material médico de consumo","Centro Hospitalar Universitário do Algarve, E. P. E. (510745997)","LINEAMEDICA,S.A. (505148676)","14.934,48 €",08-02-2018,24-01-2018,342 dias,"Portugal, Faro, Faro<BR/>Portugal, Faro, Portimão<BR/>Portugal, Faro, Lagos","Artigo 21.º, n.º 1, alínea c) do Código dos Contratos Públicos","","",,"",,Não aplicável.,Não aplicável.,FALSE
74/00004522/2017 Aquisição Toalha Zig Zag e Papel Unibox,Ajuste Direto Regime Geral,Aquisição de bens móveis,"33760000-5, Papel higiénico, lenços, toalhas de mão e guardanapos","Centro Hospitalar Universitário do Algarve, E. P. E. (510745997)",SERVISAN-PROD HIGIENE S.A (500246530),"5.515,20 €",08-02-2018,15-12-2017,15 dias,"Portugal, Faro, Portimão<BR/>Portugal, Faro, Faro<BR/>Portugal, Faro, Lagos","Artigo 20.º, n.º 1, alínea a) do Código dos Contratos Públicos","","",,"",,Não aplicável.,Não aplicável.,FALSE
62/0618/2018-Aquisição de Material de Consumo Clínico,Ajuste Direto Regime Geral,Aquisição de bens móveis,"33140000-3, Material médico de consumo","Centro Hospitalar Universitário do Algarve, E. P. E. (510745997)","PULMOCOR-EQUIPAMENTO MÉDICO, SA (501402578)","4.230,50 €",07-02-2018,05-02-2018,329 dias,"Portugal, Faro, Faro<BR/>Portugal, Faro, Portimão<BR/>Portugal, Faro, Lagos","Artigo 20.º, n.º 1, alínea a) do Código dos Contratos Públicos","","",,"",,Não aplicável.,Não aplicável.,FALSE
74/00004487/2017 Aquisição Sacos Plásticos,Ajuste Direto Regime Geral,Aquisição de bens móveis,"19640000-4, Sacos de polietileno para recolha de lixo e resíduos","Centro Hospitalar Universitário do Algarve, E. P. E. (510745997)","JOALPLAS, IND.PLASTICOS LDA (501891960)","6.260,78 €",07-02-2018,12-12-2017,30 dias,"Portugal, Faro, Lagos<BR/>Portugal, Faro, Faro<BR/>Portugal, Faro, Portimão","Artigo 20.º, n.º 1, alínea a) do Código dos Contratos Públicos","","",,"",,Não aplicável.,Não aplicável.,FALSE
Aquisição de material para Cirurgia da Coluna Lombar,Concurso público,Aquisição de bens móveis,"33140000-3, Material médico de consumo","Centro Hospitalar Universitário do Algarve, E. P. E. (510745997)","YOURSPINE, LDA (513334408)","173.200,00 €",07-02-2018,05-02-2018,327 dias,"Portugal, Faro, Faro","Artigo 20.º, n.º 1, alínea b) do Código dos Contratos Públicos","","",,"",,Não aplicável.,Não aplicável.,FALSE
22/00000073/2018 Aquisição de Material p/ Preparação Citostáticos,Concurso público,Aquisição de bens móveis,"33140000-3, Material médico de consumo","Centro Hospitalar Universitário do Algarve, E. P. E. (510745997)","Docworld – Dispositivos Médicos, Lda. (508592909), SMITHS MEDICAL(PORTUGAL),LDA. (507445937), PMH-PROD.MEDICO-HOSPITALARES (502376899), CODAN II -VENDA E DIST. INSTRUMENTOS MÉDICOS E ACESSÓRIOS,S.A. (504923471), PAUL HARTMANN, LDA. (502271728), Fresenius Kabi Pharma Portugal, Lda. (504293753), B. Braun Medical, Lda. (501506543)","99.246,90 €",07-02-2018,07-02-2018,365 dias,"Portugal, Faro, Lagos<BR/>Portugal, Faro, Portimão<BR/>Portugal, Faro, Faro","Artigo 20.º, n.º 1, alínea b) do Código dos Contratos Públicos","","",,"",,Não aplicável.,Não aplicável.,FALSE
Aquisição de Seringa 3 peças 10 ML Luer Lock - Irrecuperável,Ao abrigo de acordo-quadro (art.º 259.º),Aquisição de bens móveis,"33140000-3, Material médico de consumo","Centro Hospitalar Universitário do Algarve, E.P.E. (510745997)","LINEAMEDICA,S.A. (505148676)","69,90 €",07-02-2018,25-01-2018,341 dias,"Portugal, Faro, Portimão<BR/>Portugal, Faro, Lagos<BR/>Portugal, Faro, Faro",Artigo 259.º do Código dos Contratos Públicos,"","",,"",,1341769,"ACORDO QUADRO PARA FORNECIMENTO DE SERINGAS, AGULHAS E CONTENTORES ÀS INSTITUIÇÕES E SERVIÇOS DO SERVIÇO NACIONAL DE SAÚDE PROGRAMA DE CONCURSO",FALSE
Material de Esterilização,Ao abrigo de acordo-quadro (art.º 259.º),Aquisição de bens móveis,"33198200-6, Saquetas e invólucros de papel para esterilização","Centro Hospitalar Universitário do Algarve, E. P. E. (510745997)",EPJMEDICA - ARTIGOS MEDICOS E HOSPITALARES (506820513),"232,90 €",07-02-2018,19-01-2018,346 dias,"Portugal, Faro, Portimão<BR/>Portugal, Faro, Faro<BR/>Portugal, Faro, Lagos",Artigo 259.º do Código dos Contratos Públicos,"","",,"",,1974943,CP 2016/43 - Acordo quadro para fornecimento de Material para Empacotamento em Esterilização às Instituições e Serviços do Serviço Nacional de Saúde.,FALSE
Material de Esterilização,Ao abrigo de acordo-quadro (art.º 259.º),Aquisição de bens móveis,"33198200-6, Saquetas e invólucros de papel para esterilização","Centro Hospitalar Universitário do Algarve, E. P. E. (510745997)","Bastos Viegas, SA (500042772)","16.344,94 €",07-02-2018,19-01-2018,346 dias,"Portugal, Faro, Faro<BR/>Portugal, Faro, Lagos<BR/>Portugal, Faro, Portimão",Artigo 259.º do Código dos Contratos Públicos,"","",,"",,1974943,CP 2016/43 - Acordo quadro para fornecimento de Material para Empacotamento em Esterilização às Instituições e Serviços do Serviço Nacional de Saúde.,FALSE
62/0626/2018- Aquisição de Microcuvetes para Hemoglobinómetro,Ajuste Direto Regime Geral,Aquisição de bens móveis,"33140000-3, Material médico de consumo","Centro Hospitalar Universitário do Algarve, E. P. E. (510745997)","IBERLAB & IMUNOREAGE-SOLUC.LABORATORIO,LDA. (503406694)","4.700,00 €",06-02-2018,19-01-2018,346 dias,"Portugal, Faro, Portimão<BR/>Portugal, Faro, Faro<BR/>Portugal, Faro, Lagos","Artigo 20.º, n.º 1, alínea a) do Código dos Contratos Públicos","","",,"",,Não aplicável.,Não aplicável.,FALSE
62/0632/2018-Aquisição Conjunto Completo p/ Bomba Tirar Leite,Ajuste Direto Regime Geral,Aquisição de bens móveis,"33140000-3, Material médico de consumo","Centro Hospitalar Universitário do Algarve, E. P. E. (510745997)","MEDELA PRODUCTOS MEDICINALES MEDELA, S.L. SUCURSAL PORTUGAL (980412773)","478,85 €",06-02-2018,25-01-2018,340 dias,"Portugal, Faro, Lagos<BR/>Portugal, Faro, Faro<BR/>Portugal, Faro, Portimão","Artigo 20.º, n.º 1, alínea a) do Código dos Contratos Públicos","","",,"",,Não aplicável.,Não aplicável.,FALSE
"CONCURSO PÚBLICO INTERNACIONAL PARA FORNECIMENTO DE COMBUSTIVEIS RODOVIÁRIOS PARA OS ESTABELECIMENTOS E SERVIÇOS DO SNS, ÓRGÃOS E SERVIÇOS DO MINISTÉRIO DA SAÚDE E OUTRAS ENTIDADES COM ATIVIDADES ESPECÍFICAS DA ÁREA DA SAÚDE",Ao abrigo de acordo-quadro (art.º 259.º),Aquisição de bens móveis,"09134000-7, Gasóleos","Centro Hospitalar Universitário do Algarve, E. P. E. (510745997)","Petróleos de Portugal - Petrogal, S.A. (500697370)","90.717,68 €",06-02-2018,02-01-2018,365 dias,"Portugal, Faro, Portimão<BR/>Portugal, Faro, Faro",Artigo 259.º do Código dos Contratos Públicos,"","",,"",,1005959,Aquisição de combustíveis rodoviários,FALSE
Aquisição de Guia ACTP,Ajuste Direto Regime Geral,Aquisição de bens móveis,"33000000-0, Equipamento médico, medicamentos e produtos para cuidados pessoais","Centro Hospitalar Universitário do Algarve, E. P. E. (510745997)",Terumo Europe España S.L. (980472024),"29.400,00 €",06-02-2018,05-02-2018,329 dias,"Portugal, Faro, Faro","Artigo 20.º, n.º 1, alínea a) do Código dos Contratos Públicos","","",,"",,Não aplicável.,Não aplicável.,FALSE
62/0615/2018- Aquisição de Material de Consumo Clínico,Ajuste Direto Regime Geral,Aquisição de bens móveis,"33140000-3, Material médico de consumo","Centro Hospitalar Universitário do Algarve, E. P. E. (510745997)","MEDICINALIA - CORMEDICA,LDA. (500684324)","25.218,00 €",06-02-2018,16-01-2018,349 dias,"Portugal, Faro, Portimão<BR/>Portugal, Faro, Lagos<BR/>Portugal, Faro, Faro","Artigo 20.º, n.º 1, alínea a) do Código dos Contratos Públicos","","",,"",,Não aplicável.,Não aplicável.,FALSE
62/0639/2018- Aquisição de Placa de Desfibrilhação,Ajuste Direto Regime Geral,Aquisição de bens móveis,"33140000-3, Material médico de consumo","Centro Hospitalar Universitário do Algarve, E. P. E. (510745997)","3M España, S.L., Sucursal em Portugal (980560241)","345,40 €",06-02-2018,29-01-2018,336 dias,"Portugal, Faro, Portimão<BR/>Portugal, Faro, Faro<BR/>Portugal, Faro, Lagos","Artigo 20.º, n.º 1, alínea a) do Código dos Contratos Públicos","","",,"",,Não aplicável.,Não aplicável.,FALSE
62/0628/2018- Aquisição de Pulseiras Anti-Rapto Infantil,Ajuste Direto Regime Geral,Aquisição de bens móveis,"33140000-3, Material médico de consumo","Centro Hospitalar Universitário do Algarve, E.P.E. (510745997)","SAFESIS-João Lago-Engenharia e Sist. de Segurança,Lda (506240711)","8.495,20 €",06-02-2018,26-01-2018,339 dias,"Portugal, Faro, Portimão<BR/>Portugal, Faro, Faro<BR/>Portugal, Faro, Lagos","Artigo 20.º, n.º 1, alínea a) do Código dos Contratos Públicos","","",,"",,Não aplicável.,Não aplicável.,FALSE
62/0608/2018- Aquisição de Ventosa Obstétrica Descartável,Ajuste Direto Regime Geral,Aquisição de bens móveis,"33140000-3, Material médico de consumo","Centro Hospitalar Universitário do Algarve, E. P. E. (510745997)","BACELAR & IRMÃO,LDA (500532818)","6.105,60 €",06-02-2018,05-02-2018,329 dias,"Portugal, Faro, Lagos<BR/>Portugal, Faro, Faro<BR/>Portugal, Faro, Portimão","Artigo 20.º, n.º 1, alínea a) do Código dos Contratos Públicos","","",,"",,Não aplicável.,Não aplicável.,FALSE
62/0624/2018- Aquisição de Material de Citologia,Ajuste Direto Regime Geral,Aquisição de bens móveis,"33140000-3, Material médico de consumo","Centro Hospitalar Universitário do Algarve, E. P. E. (510745997)",Hologic Iberia SL (980277230),"17.706,25 €",06-02-2018,19-01-2018,346 dias,"Portugal, Faro, Faro<BR/>Portugal, Faro, Lagos<BR/>Portugal, Faro, Portimão","Artigo 20.º, n.º 1, alínea a) do Código dos Contratos Públicos","","",,"",,Não aplicável.,Não aplicável.,FALSE
62/0644/2018- Aquisição de Material de Consumo Clínico,Ajuste Direto Regime Geral,Aquisição de bens móveis,"33140000-3, Material médico de consumo","Centro Hospitalar Universitário do Algarve, E. P. E. (510745997)","OLYMPUS IBERIA, s.a.u. (980474710)","10.352,23 €",06-02-2018,05-02-2018,329 dias,"Portugal, Faro, Lagos<BR/>Portugal, Faro, Portimão<BR/>Portugal, Faro, Faro","Artigo 20.º, n.º 1, alínea a) do Código dos Contratos Públicos","","",,"",,Não aplicável.,Não aplicável.,FALSE
62/0614/2018- Aquisição de Agulhas,Ajuste Direto Regime Geral,Aquisição de bens móveis,"33140000-3, Material médico de consumo","Centro Hospitalar Universitário do Algarve, E. P. E. (510745997)",CATETER-PROD.MEDICOS HOSP.LDA. (502914319),"446,20 €",06-02-2018,18-01-2018,347 dias,"Portugal, Faro, Faro<BR/>Portugal, Faro, Lagos<BR/>Portugal, Faro, Portimão","Artigo 20.º, n.º 1, alínea a) do Código dos Contratos Públicos","","",,"",,Não aplicável.,Não aplicável.,FALSE
Proc. 68/2794/2017-Consumiveis-Osmose Inversa e Tratamento Àgua-Hemodialise,Ajuste Direto Regime Geral,Aquisição de serviços,"50530000-9, Serviços de reparação e manutenção de máquinas","Centro Hospitalar Universitário do Algarve, E. P. E. (510745997)","Fresenius Medical Care Portugal, S.A. (503070220)","3.000,00 €",06-02-2018,01-06-2017,214 dias,"Portugal, Faro, Faro","Artigo 24.º, n.º 1, alínea e) do Código dos Contratos Públicos",31-12-2017,"3.301,29 €",,Valor efectivo superior ao valor inicialmente previsto,,Não aplicável.,Não aplicável.,FALSE
65/00000092/2018 Aquisição Fitas Impressão/Embalamento (FDS),Ajuste Direto Regime Geral,Aquisição de bens móveis,"30192300-4, Fitas tintadas","Centro Hospitalar Universitário do Algarve, E. P. E. (510745997)","Baxter Médico Farmacêutica, Lda. (503347345)","8.181,60 €",05-02-2018,19-01-2018,365 dias,"Portugal, Faro, Portimão<BR/>Portugal, Faro, Lagos<BR/>Portugal, Faro, Faro","Artigo 24.º, n.º 1, alínea e), subalínea i) do Código dos Contratos Públicos","","",,"",,Não aplicável.,Não aplicável.,FALSE
Produtos de Apoio-Ajudas Tecnicas,Ajuste Direto Regime Geral,Aquisição de serviços,"85111400-4, Serviços hospitalares de reabilitação","Centro Hospitalar Universitário do Algarve, E. P. E. (510745997)",ANTONIO MOUTINHO LDA (500025550),"566,04 €",05-02-2018,26-01-2018,365 dias,"Portugal, Faro, Faro","Artigo 20.º, n.º 1, alínea d) do Código dos Contratos Públicos","","",,"",,Não aplicável.,Não aplicável.,FALSE
Produtos de Apoio-Ajudas Tecnicas,Ajuste Direto Regime Geral,Aquisição de serviços,"85111400-4, Serviços hospitalares de reabilitação","Centro Hospitalar Universitário do Algarve, E. P. E. (510745997)","AMÉRICO QUINTINO E FILHOS, PRODUTOS ORT.LDA (508988390)","4.290,00 €",05-02-2018,26-01-2018,365 dias,"Portugal, Faro, Portimão<BR/>Portugal, Faro, Faro","Artigo 20.º, n.º 1, alínea d) do Código dos Contratos Públicos","","",,"",,Não aplicável.,Não aplicável.,FALSE
Produtos de Apoio-Ajudas Tecnicas,Ajuste Direto Regime Geral,Aquisição de serviços,"85111400-4, Serviços hospitalares de reabilitação","Centro Hospitalar Universitário do Algarve, E. P. E. (510745997)","Orto Rego - Comércio e Aplicação de Produtos Ortopédicos, Lda. (504820915)","1.780,00 €",05-02-2018,26-01-2018,365 dias,"Portugal, Faro, Portimão","Artigo 20.º, n.º 1, alínea d) do Código dos Contratos Públicos","","",,"",,Não aplicável.,Não aplicável.,FALSE
Produtos de Apoio-Ajudas Tecnicas,Ajuste Direto Regime Geral,Aquisição de serviços,"85111400-4, Serviços hospitalares de reabilitação","Centro Hospitalar Universitário do Algarve, E. P. E. (510745997)",Ortobalance (513555587),"45,00 €",05-02-2018,26-01-2018,365 dias,"Portugal, Faro, Faro","Artigo 20.º, n.º 1, alínea d) do Código dos Contratos Públicos","","",,"",,Não aplicável.,Não aplicável.,FALSE
Produtos de Apoio-Ajudas Tecnicas,Ajuste Direto Regime Geral,Aquisição de serviços,"85111400-4, Serviços hospitalares de reabilitação","Centro Hospitalar Universitário do Algarve, E. P. E. (510745997)",OrtoAtlas (513781790),"944,00 €",05-02-2018,26-01-2018,365 dias,"Portugal, Faro, Faro","Artigo 20.º, n.º 1, alínea d) do Código dos Contratos Públicos","","",,"",,Não aplicável.,Não aplicável.,FALSE
62/0643/2018- Aquisição de Material de Consumo Clínico,Ajuste Direto Regime Geral,Aquisição de bens móveis,"33140000-3, Material médico de consumo","Centro Hospitalar Universitário do Algarve, E. P. E. (510745997)","Nutricia Advanced Medical Nutrition Unipessoal, Lda (507558286)","972,00 €",02-02-2018,25-01-2018,340 dias,"Portugal, Faro, Lagos<BR/>Portugal, Faro, Faro<BR/>Portugal, Faro, Portimão","Artigo 20.º, n.º 1, alínea a) do Código dos Contratos Públicos","","",,"",,Não aplicável.,Não aplicável.,FALSE
62/0623/2018-Aquisição de Material de Consumo Clínico,Ajuste Direto Regime Geral,Aquisição de bens móveis,"33140000-3, Material médico de consumo","Centro Hospitalar Universitário do Algarve, E. P. E. (510745997)","GENERAL ELECTRIC HEALTHCARE PORTUGAL,SOC.UNIPESSOAL,LDA (500357129)","875,00 €",02-02-2018,22-01-2018,343 dias,"Portugal, Faro, Portimão<BR/>Portugal, Faro, Faro<BR/>Portugal, Faro, Lagos","Artigo 20.º, n.º 1, alínea a) do Código dos Contratos Públicos","","",,"",,Não aplicável.,Não aplicável.,FALSE
62/0647/2018-Aquisição de Material de Consumo Clínico,Ajuste Direto Regime Geral,Aquisição de bens móveis,"33140000-3, Material médico de consumo","Centro Hospitalar Universitário do Algarve, E. P. E. (510745997)","MEDTRONIC PORTUGAL, LDA. (504223933)","11.417,73 €",02-02-2018,16-01-2018,349 dias,"Portugal, Faro, Portimão<BR/>Portugal, Faro, Lagos<BR/>Portugal, Faro, Faro","Artigo 20.º, n.º 1, alínea a) do Código dos Contratos Públicos","","",,"",,Não aplicável.,Não aplicável.,FALSE
Aq. de Prestação de Serviços Médicos de Pediatria,Ajuste Direto Regime Geral,Aquisição de serviços,"85121291-9, Serviços de pediatria","Centro Hospitalar Universitário do Algarve, E. P. E. (510745997)",Kelly Healthcare Resourses (510723691),"4.416,00 €",02-02-2018,03-01-2018,31 dias,"Portugal, Faro, Portimão","Artigo 24.º, n.º 1, alínea e), subalínea i) do Código dos Contratos Públicos",31-01-2018,"4.278,00 €",,"O valor inicial do Contrato teve por base as necessidades estimadas para o período de 1 janeiro de 2018 a 31 janeiro de 2018, o valor final reflecte as necessidades efectivas.",,Não aplicável.,Não aplicável.,FALSE
62/0700/2018-Aquisição de Pinças Ligasure,Ajuste Direto Regime Geral,Aquisição de bens móveis,"33140000-3, Material médico de consumo","Centro Hospitalar Universitário do Algarve, E. P. E. (510745997)","MEDTRONIC PORTUGAL, LDA. (504223933)","96.180,00 €",02-02-2018,19-01-2018,346 dias,"Portugal, Faro, Portimão<BR/>Portugal, Faro, Lagos<BR/>Portugal, Faro, Faro","Artigo 20.º, n.º 1, alínea a) do Código dos Contratos Públicos","","",,"",,Não aplicável.,Não aplicável.,FALSE
62/0646/2018-Aquisição de Agulha de Biópsia,Ajuste Direto Regime Geral,Aquisição de bens móveis,"33140000-3, Material médico de consumo","Centro Hospitalar Universitário do Algarve, E. P. E. (510745997)","COLOPLAST PORTUGAL, SOCIEDADE UNIPESSOAL LDA. (503989037)","270,00 €",02-02-2018,22-01-2018,343 dias,"Portugal, Faro, Portimão<BR/>Portugal, Faro, Lagos<BR/>Portugal, Faro, Faro","Artigo 20.º, n.º 1, alínea a) do Código dos Contratos Públicos","","",,"",,Não aplicável.,Não aplicável.,FALSE
62/0617/2018-Aquisição de Material de Laparóscopia,Ajuste Direto Regime Geral,Aquisição de bens móveis,"33140000-3, Material médico de consumo","Centro Hospitalar Universitário do Algarve, E. P. E. (510745997)",ENDOTÉCNICA - Soluções Hospitalares  (503818348),"1.200,00 €",02-02-2018,22-01-2018,343 dias,"Portugal, Faro, Faro<BR/>Portugal, Faro, Lagos<BR/>Portugal, Faro, Portimão","Artigo 20.º, n.º 1, alínea a) do Código dos Contratos Públicos","","",,"",,Não aplicável.,Não aplicável.,FALSE
62/0645/2018-Aquisição de Laringoscópios Descartáveis,Ajuste Direto Regime Geral,Aquisição de bens móveis,"33140000-3, Material médico de consumo","Centro Hospitalar Universitário do Algarve, E. P. E. (510745997)","OVERPHARMA,LDA. (505792362)","1.440,00 €",02-02-2018,18-01-2018,347 dias,"Portugal, Faro, Faro<BR/>Portugal, Faro, Portimão","Artigo 20.º, n.º 1, alínea a) do Código dos Contratos Públicos","","",,"",,Não aplicável.,Não aplicável.,FALSE
78/00000701/2018 Prestação de Serviços Jurídicos - Unidade de Faro,Ajuste Direto Regime Geral,Aquisição de serviços,"79100000-5, Serviços jurídicos","Centro Hospitalar Universitário do Algarve, E. P. E. (510745997)",Cristina Maria Pereira dos Santos Ribeiro (181255170),"15.400,00 €",02-02-2018,01-02-2018,334 dias,"Portugal, Faro, Faro","Artigo 20.º, n.º 1, alínea a) do Código dos Contratos Públicos","","",,"",,Não aplicável.,Não aplicável.,FALSE
62/0661/2018- Aquisição de Material de Consumo Clínico,Ajuste Direto Regime Geral,Aquisição de bens móveis,"33140000-3, Material médico de consumo","Centro Hospitalar Universitário do Algarve, E. P. E. (510745997)","STRYKER PORTUGAL PRODUTOS MEDICOS, LDA (504594214)","13.696,00 €",02-02-2018,17-01-2018,348 dias,"Portugal, Faro, Portimão<BR/>Portugal, Faro, Faro<BR/>Portugal, Faro, Lagos","Artigo 20.º, n.º 1, alínea a) do Código dos Contratos Públicos","","",,"",,Não aplicável.,Não aplicável.,FALSE
24/00000076/2018 Aquisição de Material e Detergentes de Esterilização 2018,Concurso público,Aquisição de bens móveis,"39831200-8, Detergentes","Centro Hospitalar Universitário do Algarve, E.P.E. (510745997)","FRANKLAB PORTUGAL, LDA (506058654), HELDER GONÇALVES Assistência Técnica de Equipamentos, Lda. (503855421), A.MENDES DA SILVA LDA (502064080)","19.697,40 €",02-02-2018,02-02-2018,365 dias,"Portugal, Faro, Lagos<BR/>Portugal, Faro, Portimão<BR/>Portugal, Faro, Faro","Artigo 20.º, n.º 1, alínea b) do Código dos Contratos Públicos","","",,"",,Não aplicável.,Não aplicável.,FALSE
Material de Esterilização,Ao abrigo de acordo-quadro (art.º 259.º),Aquisição de bens móveis,"33198200-6, Saquetas e invólucros de papel para esterilização","Centro Hospitalar Universitário do Algarve, E. P. E. (510745997)","PERGUT PORTUGAL COM  PRODUTOS HOSPIT. MEDICOS, LDA (501799729)","3.614,52 €",01-02-2018,25-01-2018,339 dias,"Portugal, Faro, Lagos<BR/>Portugal, Faro, Faro<BR/>Portugal, Faro, Portimão",Artigo 259.º do Código dos Contratos Públicos,"","",,"",,1974943,CP 2016/43 - Acordo quadro para fornecimento de Material para Empacotamento em Esterilização às Instituições e Serviços do Serviço Nacional de Saúde.,FALSE
Material de Esterilização,Ao abrigo de acordo-quadro (art.º 259.º),Aquisição de bens móveis,"33198200-6, Saquetas e invólucros de papel para esterilização","Centro Hospitalar Universitário do Algarve, E. P. E. (510745997)","DIMOR LUSITANA-COMÉRCIO DE PRODUTO DE HIGIENE, LDA (500730741)","7.704,00 €",01-02-2018,25-01-2018,339 dias,"Portugal, Faro, Faro<BR/>Portugal, Faro, Portimão<BR/>Portugal, Faro, Lagos",Artigo 259.º do Código dos Contratos Públicos,"","",,"",,1974943,CP 2016/43 - Acordo quadro para fornecimento de Material para Empacotamento em Esterilização às Instituições e Serviços do Serviço Nacional de Saúde.,FALSE
