Objeto do Contrato,Tipo de Procedimento,Tipo(s) de Contrato,CPVs,Entidade(s) Adjudicante(s),Entidade(s) Adjudicatária(s),Preço Contratual,Data de Publicação,Data de Celebração do Contrato,Prazo de Execução,Local de Execução,Fundamentação,Data de Fecho do Contrato,Preço Total Efetivo,Causas das Alterações ao Prazo,Causas das Alterações ao Preço,Estado,N.º registo do Acordo Quadro,Descrição do Acordo Quadro,Procedimento Centralizado
MATERIAL DE CONSUMO PARA SERVIÇO DE ANESTESIA,Ajuste Direto Regime Geral,Aquisição de bens móveis,"33170000-2, Anestesia e reanimação","Centro Hospitalar de Trás-os-Montes e Alto Douro, E. P. E. (508100496)",INTERSURGICAL - PORTUGAL                                (503480045),"336,80 €",09-07-2018,02-11-2015,365 dias,"Portugal, Vila Real","Artigo 20.º, n.º 1, alínea a) do Código dos Contratos Públicos",31-12-2015,"336,80 €",Não aplicável,Não aplicável,,Não aplicável.,Não aplicável.,FALSE
MATERIAL DE CONSUMO PARA SERVIÇO DE ANESTESIA,Ajuste Direto Regime Geral,Aquisição de bens móveis,"33170000-2, Anestesia e reanimação","Centro Hospitalar de Trás-os-Montes e Alto Douro, E. P. E. (508100496)","B BRAUN MEDICAL, LDA. (501506543)","1.755,00 €",09-07-2018,30-10-2015,365 dias,"Portugal, Vila Real","Artigo 20.º, n.º 1, alínea a) do Código dos Contratos Públicos",31-12-2015,"1.755,00 €",Não aplicável,Não aplicável,,Não aplicável.,Não aplicável.,FALSE
AD 0011-2016 AQUISIÇÃO DE PROTETORES AURICULARES PARA TERMÓMETRO,Ajuste Direto Regime Geral,Aquisição de bens móveis,"33140000-3, Material médico de consumo","Centro Hospitalar de Trás-os-Montes e Alto Douro, EPE (508100496)","BASIC STUFFS GESTÃO DE EQUIPA, LDA (SPACE ECO) (509062822)","28.296,00 €",06-07-2018,09-10-2015,365 dias,"Portugal, Vila Real","Artigo 20.º, n.º 1, alínea a) do Código dos Contratos Públicos",19-12-2016,"22.856,88 €",não aplicável,não aplicável,,Não aplicável.,Não aplicável.,FALSE
AD 33-2016 Pasta e Separadores Processo Clínico,Ajuste Direto Regime Geral,Aquisição de bens móveis,"22853000-4, Pastas para processos","Centro Hospitalar de Trás-os-Montes e Alto Douro, EPE (508100496)","ENVELOPRINTER,LDA (508469830)","7.783,93 €",06-07-2018,04-11-2015,365 dias,"Portugal, Vila Real","Artigo 20.º, n.º 1, alínea a) do Código dos Contratos Públicos",26-12-2016,"7.739,79 €",não aplicável,não aplicável,,Não aplicável.,Não aplicável.,FALSE
AD 14-2016 Banda Incontinência Urinária,Ajuste Direto Regime Geral,Aquisição de bens móveis,"33140000-3, Material médico de consumo","Centro Hospitalar de Trás-os-Montes e Alto Douro, EPE (508100496)","MOONSURGE - IMPORT.  EXP. MATERIAL MEDICO,LDA (506657035)","17.000,00 €",06-07-2018,04-12-2015,365 dias,"Portugal, Vila Real","Artigo 20.º, n.º 1, alínea a) do Código dos Contratos Públicos",15-12-2016,"12.750,00 €",não aplicável,não aplicável,,Não aplicável.,Não aplicável.,FALSE
AD 2-2016 - Stents Coronários,Ajuste Direto Regime Geral,Aquisição de bens móveis,"33140000-3, Material médico de consumo","Centro Hospitalar de Trás-os-Montes e Alto Douro, E. P. E. (508100496)","BIOTRONIK PORTUGAL, UNIPESSOAL LDA. (510726941)","241.800,00 €",06-07-2018,28-12-2015,365 dias,"Portugal, Vila Real","Artigo 20.º, n.º 1, alínea a) do Código dos Contratos Públicos",23-12-2016,"64.247,87 €",não aplicável,não aplicável,,Não aplicável.,Não aplicável.,FALSE
CATETERES IMPLANTÁVEIS E AGULHAS,Ajuste Direto Regime Geral,Aquisição de bens móveis,"33141200-2, Cateteres","Centro Hospitalar de Trás-os-Montes e Alto Douro, E.P.E. (508100496)","MEDICINALIA CORMEDICA - COMERCIAL. PROD MEDICO HOSPITALARES,LDA (500684324)","20.574,00 €",06-07-2018,18-02-2016,365 dias,"Portugal, Vila Real","Artigo 20.º, n.º 1, alínea a) do Código dos Contratos Públicos",30-12-2016,"20.574,00 €",Não aplicável,Não aplicável,,Não aplicável.,Não aplicável.,FALSE
AD 2-2016 - Stents Coronários,Ajuste Direto Regime Geral,Aquisição de bens móveis,"33140000-3, Material médico de consumo","Centro Hospitalar de Trás-os-Montes e Alto Douro, E. P. E. (508100496)",Boston Scientific Portugal (504988964),"241.800,00 €",06-07-2018,28-12-2015,365 dias,"Portugal, Vila Real","Artigo 20.º, n.º 1, alínea a) do Código dos Contratos Públicos",22-12-2016,"84.633,60 €",não aplicável,não aplicável,,Não aplicável.,Não aplicável.,FALSE
AD 2-2016 - Stents Coronários,Ajuste Direto Regime Geral,Aquisição de bens móveis,"33140000-3, Material médico de consumo","Centro Hospitalar de Trás-os-Montes e Alto Douro, E. P. E. (508100496)","MEDTRONIC PORTUGAL, LDA (504223933)","241.800,00 €",06-07-2018,28-12-2015,365 dias,"Portugal, Vila Real","Artigo 20.º, n.º 1, alínea a) do Código dos Contratos Públicos",08-11-2016,"54.363,58 €",não aplicável,não aplicável,,Não aplicável.,Não aplicável.,FALSE
AD 2-2016 - Stents Coronários,Ajuste Direto Regime Geral,Aquisição de bens móveis,"33140000-3, Material médico de consumo","Centro Hospitalar de Trás-os-Montes e Alto Douro, E. P. E. (508100496)",Abbott Laboratorios lda (500006148),"271.800,00 €",06-07-2018,28-12-2015,365 dias,"Portugal, Vila Real","Artigo 20.º, n.º 1, alínea a) do Código dos Contratos Públicos",22-12-2016,"64.287,73 €",não aplicável,não aplicável,,Não aplicável.,Não aplicável.,FALSE
AD 2-2016 - Stents Coronários,Ajuste Direto Regime Geral,Aquisição de bens móveis,"33140000-3, Material médico de consumo","Centro Hospitalar de Trás-os-Montes e Alto Douro, E. P. E. (508100496)",Terumo (980472024),"252.900,00 €",06-07-2018,28-12-2015,365 dias,"Portugal, Vila Real","Artigo 20.º, n.º 1, alínea a) do Código dos Contratos Públicos",12-12-2016,"45.097,06 €",não aplicável,não aplicável,,Não aplicável.,Não aplicável.,FALSE
DETERGENTES PARA MAQUINAS DE LAVAGEM DE DISPOSITIVOS MÉDICOS,Ajuste Direto Regime Geral,Aquisição de bens móveis,"33190000-8, Dispositivos e produtos médicos variados","Centro Hospitalar de Trás-os-Montes e Alto Douro, EPE (508100496)","HELDER GONÇALVES- ASSISTÊNCIA TÉCNICA A EQUIPAMENTOS, LDA (503855421)","6.504,10 €",06-07-2018,19-01-2016,365 dias,"Portugal, Vila Real","Artigo 20.º, n.º 1, alínea a) do Código dos Contratos Públicos",30-12-2016,"6.504,10 €",Não aplicável,Não aplicável,,Não aplicável.,Não aplicável.,FALSE
AD 0041-2016 - Aquisição de Ortóteses para o CHTMAD,Ajuste Direto Regime Geral,Aquisição de serviços,"85000000-9, Serviços de saúde e acção social","Centro Hospitalar de Trás-os-Montes e Alto Douro, EPE (508100496)","Ortopedia Marques e Gonçalves, Lda (504328620)","1.781,22 €",06-07-2018,02-02-2016,365 dias,"Portugal, Vila Real","Artigo 20.º, n.º 1, alínea a) do Código dos Contratos Públicos",16-12-2016,"406,76 €",não aplicável,não aplicável,,Não aplicável.,Não aplicável.,FALSE
CONSUMÍVEIS PARA OXIGENOTERAPIA,Ajuste Direto Regime Geral,Aquisição de bens móveis,"33157000-5, Aparelhos para assistência respiratória e oxigenoterapia","Centro Hospitalar de Trás-os-Montes e Alto Douro, EPE (508100496)","AIR LIQUIDE MEDICINAL,S.A. (501576436)","2.069,39 €",05-07-2018,01-03-2016,365 dias,"Portugal, Vila Real","Artigo 20.º, n.º 1, alínea a) do Código dos Contratos Públicos",30-12-2016,"2.069,39 €",Não aplicável,Não aplicável,,Não aplicável.,Não aplicável.,FALSE
CONSUMÍVEIS PARA OXIGENOTERAPIA,Ajuste Direto Regime Geral,Aquisição de bens móveis,"33157000-5, Aparelhos para assistência respiratória e oxigenoterapia","Centro Hospitalar de Trás-os-Montes e Alto Douro, EPE (508100496)",COVIDIEN (503413410),"21.985,95 €",05-07-2018,01-03-2016,365 dias,"Portugal, Vila Real","Artigo 20.º, n.º 1, alínea a) do Código dos Contratos Públicos",30-12-2016,"21.985,95 €",Não aplicável,Não aplicável,,Não aplicável.,Não aplicável.,FALSE
AD 40-2016 - Material para Esterilização,Ajuste Direto Regime Geral,Aquisição de bens móveis,"33140000-3, Material médico de consumo","Centro Hospitalar de Trás-os-Montes e Alto Douro, EPE (508100496)","Lablad, Lda (502629703)","80,00 €",05-07-2018,15-01-2016,365 dias,"Portugal, Vila Real","Artigo 20.º, n.º 1, alínea a) do Código dos Contratos Públicos",09-03-2016,"80,00 €",não aplicavel,não aplicavel,,Não aplicável.,Não aplicável.,FALSE
AD 40-2016 - Material para Esterilização,Ajuste Direto Regime Geral,Aquisição de bens móveis,"33140000-3, Material médico de consumo","Centro Hospitalar de Trás-os-Montes e Alto Douro, EPE (508100496)","EUROCASMEDICA - PRODUTOS HOSPITALARES,SA (503322105)","2.186,00 €",05-07-2018,15-01-2016,365 dias,"Portugal, Vila Real","Artigo 20.º, n.º 1, alínea a) do Código dos Contratos Públicos",29-12-2016,"1.303,80 €",não aplicável,não aplicável,,Não aplicável.,Não aplicável.,FALSE
AD 40-2016 - Material para Esterilização,Ajuste Direto Regime Geral,Aquisição de bens móveis,"33140000-3, Material médico de consumo","Centro Hospitalar de Trás-os-Montes e Alto Douro, EPE (508100496)",3 M PORTUGAL (500193940),"7.012,25 €",05-07-2018,15-01-2016,365 dias,"Portugal, Vila Real","Artigo 20.º, n.º 1, alínea a) do Código dos Contratos Públicos",28-12-2016,"6.932,25 €",não aplicável,não aplicável,,Não aplicável.,Não aplicável.,FALSE
AD 40-2016 - Material para Esterilização,Ajuste Direto Regime Geral,Aquisição de bens móveis,"33140000-3, Material médico de consumo","Centro Hospitalar de Trás-os-Montes e Alto Douro, EPE (508100496)","Bastos Viegas, S.A. (500042772)","9.983,07 €",05-07-2018,15-01-2016,365 dias,"Portugal, Vila Real","Artigo 20.º, n.º 1, alínea a) do Código dos Contratos Públicos",23-11-2016,"9.043,98 €",não aplicável,não aplicável,,Não aplicável.,Não aplicável.,FALSE
AD 40-2016 - Material para Esterilização,Ajuste Direto Regime Geral,Aquisição de bens móveis,"33140000-3, Material médico de consumo","Centro Hospitalar de Trás-os-Montes e Alto Douro, EPE (508100496)","HELDER GONÇALVES- ASSISTÊNCIA TÉCNICA A EQUIPAMENTOS, LDA (503855421)","3.260,16 €",05-07-2018,15-01-2016,365 dias,"Portugal, Vila Real","Artigo 20.º, n.º 1, alínea a) do Código dos Contratos Públicos",28-10-2016,"2.220,05 €",não aplicável,não aplicável,,Não aplicável.,Não aplicável.,FALSE
AD 0079-2016 SERINGA PLASTICA IRREC. P BOMBA INFUSORA DE 50 ML,Ajuste Direto Regime Geral,Aquisição de bens móveis,"33141310-6, Seringas","Centro Hospitalar de Trás-os-Montes e Alto Douro, EPE (508100496)",B BRAUN MEDICAL LDA  (501506543),"3.000,00 €",05-07-2018,02-12-2015,365 dias,"Portugal, Vila Real","Artigo 20.º, n.º 1, alínea a) do Código dos Contratos Públicos",31-12-2015,"2.840,00 €",não aplicável,não aplicável,,Não aplicável.,Não aplicável.,FALSE
"AD 3157-2015 INSTRUMENTAL DIVERSO PARA O CHTMAD, EPE",Ajuste Direto Regime Geral,Aquisição de bens móveis,"33162200-5, Instrumentos para blocos operatórios","Centro Hospitalar de Trás-os-Montes e Alto Douro, EPE (508100496)",B BRAUN MEDICAL LDA  (501506543),"46.613,00 €",04-07-2018,02-02-2016,365 dias,"Portugal, Vila Real","Artigo 20.º, n.º 1, alínea a) do Código dos Contratos Públicos",19-12-2016,"46.613,00 €","","",,Não aplicável.,Não aplicável.,FALSE
"AQUISIÇÃO DE BRAÇADEIRAS E SENSORES PARA MONITORES PARA O CHTMAD, E.P.E",Ajuste Direto Regime Geral,Aquisição de bens móveis,"33140000-3, Material médico de consumo","Centro Hospitalar de Trás-os-Montes e Alto Douro, EPE (508100496)",PHYSIO PORTUGAL SALES (510137946),"1.286,00 €",04-07-2018,14-12-2015,365 dias,"Portugal, Vila Real","Artigo 20.º, n.º 1, alínea a) do Código dos Contratos Públicos",30-12-2016,"1.286,00 €",Não aplicável,Não aplicável,,Não aplicável.,Não aplicável.,FALSE
AD 97-2016 - Aquisição Material Consumo Pediatria - Neonatologia,Ajuste Direto Regime Geral,Aquisição de bens móveis,"33140000-3, Material médico de consumo","Centro Hospitalar de Trás-os-Montes e Alto Douro, EPE (508100496)","SANO TECNICA, LDA (500239819)","184,00 €",03-07-2018,22-02-2016,365 dias,"Portugal, Vila Real","Artigo 24.º, n.º 1, alínea c) do Código dos Contratos Públicos",30-12-2016,"",não aplicável,não aplicável,,Não aplicável.,Não aplicável.,FALSE
AD 97-2016 - Aquisição Material Consumo Pediatria - Neonatologia,Ajuste Direto Regime Geral,Aquisição de bens móveis,"33140000-3, Material médico de consumo","Centro Hospitalar de Trás-os-Montes e Alto Douro, EPE (508100496)",VYGON (503232785),"1.590,18 €",03-07-2018,22-02-2016,365 dias,"Portugal, Vila Real","Artigo 24.º, n.º 1, alínea c) do Código dos Contratos Públicos",20-12-2016,"693,12 €",não aplicável,não aplicável,,Não aplicável.,Não aplicável.,FALSE
"MATERIAL DE CONSUMO PARA GINECOLOGIA/OBSTETRÍCIA PARA O CHTMAD, E.P.E.",Ajuste Direto Regime Geral,Aquisição de bens móveis,"33140000-3, Material médico de consumo","Centro Hospitalar de Trás-os-Montes e Alto Douro, E. P. E. (508100496)","MOONSURGE - IMPORT.  EXP. MATERIAL MEDICO,LDA (506657035)","2.430,00 €",03-07-2018,30-06-2016,365 dias,"Portugal, Vila Real","Artigo 20.º, n.º 1, alínea a) do Código dos Contratos Públicos",30-12-2016,"2.430,00 €",Não aplicável,Não aplicável,,Não aplicável.,Não aplicável.,FALSE
CONSUMÍVEIS PARA MÁQUINA CMD,Ajuste Direto Regime Geral,Aquisição de bens móveis,"33140000-3, Material médico de consumo","Centro Hospitalar de Trás-os-Montes e Alto Douro, EPE (508100496)","Alves & Cª (Irmãos),Lda (500310068)","6.944,00 €",03-07-2018,29-01-2016,365 dias,"Portugal, Vila Real","Artigo 24.º, n.º 1, alínea e) do Código dos Contratos Públicos",30-12-2016,"6.944,00 €",Não aplicável,Não aplicável,,Não aplicável.,Não aplicável.,FALSE
"AQUISIÇÃO DE INTRODUTORES PARA VEIAS E ELECTRODOS TEMPORÁRIOS PARA O CHTMAD, E.P.E.",Ajuste Direto Regime Geral,Aquisição de bens móveis,"33140000-3, Material médico de consumo","Centro Hospitalar de Trás-os-Montes e Alto Douro, E. P. E. (508100496)",ST JUDE MEDICAL PORTUGA (504180746),"7.435,40 €",03-07-2018,20-01-2016,365 dias,"Portugal, Vila Real","Artigo 20.º, n.º 1, alínea a) do Código dos Contratos Públicos",30-12-2016,"7.435,40 €",Não aplicável,Não aplicável,,Não aplicável.,Não aplicável.,FALSE
"AQUISIÇÃO DE UPGRADE DO SISTEMA DE PLANEAMENTO E SUBSTITUIÇÃO DO SISTEMA IMAGEM DO ACELERADOR LINEAR DO CHTMAD,EPE.",Ajuste Direto Regime Geral,Aquisição de bens móveis,"31643100-6, Aceleradores lineares","Centro Hospitalar de Trás-os-Montes e Alto Douro, EPE (508100496)","SOCIEDADE AVANÇO, S.A. (500264236)","57.384,00 €",02-07-2018,11-02-2016,365 dias,"Portugal, Vila Real","Artigo 24.º, n.º 1, alínea e) do Código dos Contratos Públicos",30-12-2016,"57.384,00 €",Não aplicável,Não aplicável,,Não aplicável.,Não aplicável.,FALSE
AD 120-2016 - TELEVISORES,Ajuste Direto Regime Geral,Aquisição de bens móveis,"32000000-3, Equipamento de rádio, televisão, comunicação, telecomunicações e afins","Centro Hospitalar de Trás-os-Montes e Alto Douro, EPE (508100496)","MINFO-COMERCIO DE MICRO INFORMATICA, LDA (502480548)","15.703,66 €",02-07-2018,26-02-2016,365 dias,"Portugal, Vila Real","Artigo 20.º, n.º 1, alínea a) do Código dos Contratos Públicos",30-05-2016,"15.703,66 €",não aplicável,não aplicável,,Não aplicável.,Não aplicável.,FALSE
"AQUISIÇÃO DE ORTÓTESES PARA O CHTMAD,EPE.",Ajuste Direto Regime Geral,Aquisição de bens móveis,"33141760-5, Talas","Centro Hospitalar de Trás-os-Montes e Alto Douro, E. P. E. (508100496)","ORTOPEDIA ERNESTO ALMEIDA, LDA. (504303406)","14.829,27 €",02-07-2018,17-03-2016,365 dias,"Portugal, Vila Real","Artigo 20.º, n.º 1, alínea a) do Código dos Contratos Públicos",31-12-2016,"14.829,27 €",Não aplicável,Não aplicável,,Não aplicável.,Não aplicável.,FALSE
Aquisição de Cateteres,Ao abrigo de acordo-quadro (art.º 259.º),Aquisição de bens móveis,"33140000-3, Material médico de consumo","Centro Hospitalar de Trás-os-Montes e Alto Douro, E. P. E. (508100496)","SMITHS MEDICAL PORTUGAL UNIPESSOAL, LDA (507445937)","663,00 €",02-07-2018,01-01-2016,365 dias,"Portugal, Vila Real",Artigo 259.º do Código dos Contratos Públicos,30-12-2016,"663,00 €",Não aplicável,Não aplicável,,1212278,"CONCURSO PÚBLICO PARA A CELEBRAÇÃO DE CONTRATOS PÚBLICOS DE APROVISIONAMENTO PARA A ÁREA DA SAÚDE, COM VISTA AO FORNECIMENTO DE CATETERES, ÀS INSTITUIÇÕES E SERVIÇOS DO SERVIÇO NACIONAL DE SAÚDE",FALSE
