Objeto do Contrato,Tipo de Procedimento,Tipo(s) de Contrato,CPVs,Entidade(s) Adjudicante(s),Entidade(s) Adjudicatária(s),Preço Contratual,Data de Publicação,Data de Celebração do Contrato,Prazo de Execução,Local de Execução,Fundamentação,Data de Fecho do Contrato,Preço Total Efetivo,Causas das Alterações ao Prazo,Causas das Alterações ao Preço,Estado,N.º registo do Acordo Quadro,Descrição do Acordo Quadro,Procedimento Centralizado
Aquisição de 300.000 tiras de reagente exame sumário de urina 10 parâmetros,Concurso público,Aquisição de bens móveis,"33696000-5, Reagentes e meios de contraste","Administração Regional de Saúde do Norte, I. P. (503135593)","Normax - Fábrica de Vidros Cientificos, lda (500203130)","16.950,00 €",30-05-2014,18-02-2014,312 dias,"Portugal, Porto, Maia<BR/>Portugal, Vila Real, Vila Real<BR/>Portugal, Distrito não determinado, Concelho não determinado","Artigo 155.º, alínea a) do Código dos Contratos Públicos",29-07-2014,"16.950,00 €","","",,Não aplicável.,Não aplicável.,FALSE
Aquisição de 288 unidades de penso poliuretano com silicone extra- fino 20x50cm,Concurso público,Aquisição de bens móveis,"33600000-6, Produtos farmacêuticos","Administração Regional de Saúde do Norte, I. P. (503135593)",Molnlycke Health Care (511101066),"29,40 €",29-05-2014,10-04-2014,260 dias,"Portugal, Porto, Maia<BR/>Portugal, Distrito não determinado, Concelho não determinado<BR/>Portugal, Vila Real, Vila Real","Artigo 155.º, alínea a) do Código dos Contratos Públicos",27-06-2014,"29,40 €","","",,Não aplicável.,Não aplicável.,FALSE
Aquisição de 27.000 unidades de Ligadura de cola  de Zinco 10mx10cm,Concurso público,Aquisição de bens móveis,"33600000-6, Produtos farmacêuticos","Administração Regional de Saúde do Norte, I. P. (503135593)","Overpharma Produtos Médicos Farmacêuticos, lda (505792362)","2,90 €",29-05-2014,21-03-2014,248 dias,"Portugal, Vila Real, Vila Real<BR/>Portugal, Porto, Maia<BR/>Portugal, Distrito não determinado, Concelho não determinado","Artigo 155.º, alínea a) do Código dos Contratos Públicos",10-09-2014,"2,90 €","","",,Não aplicável.,Não aplicável.,FALSE
"Aquisição de 5.000 unidades de bisnagas de Maltodextrina, gel",Concurso público,Aquisição de bens móveis,"33600000-6, Produtos farmacêuticos","Administração Regional de Saúde do Norte, I. P. (503135593)",JMV Produtos Hospitalares (501887148),"10,30 €",29-05-2014,22-04-2014,242 dias,"Portugal, Porto, Maia<BR/>Portugal, Distrito não determinado, Concelho não determinado<BR/>Portugal, Vila Real, Vila Real","Artigo 155.º, alínea a) do Código dos Contratos Públicos",15-09-2014,"10,30 €","","",,Não aplicável.,Não aplicável.,FALSE
Aquisição de serviços de cópia e impressão,Ajuste Direto Regime Geral,Aquisição de serviços,"79800000-2, Serviços de impressão e afins","Administração Regional de Saúde do Norte, I. P. (503135593)","Kyocera Mita Portugal, Lda (500682127)","4.228,38 €",29-05-2014,03-01-2014,31 dias,"Portugal, Viana do Castelo, Viana do Castelo<BR/>Portugal, Braga, Braga<BR/>Portugal, Braganca, Bragança<BR/>Portugal, Porto, Gondomar<BR/>Portugal, Porto, Paços de Ferreira<BR/>Portugal, Aveiro, Santa Maria da Feira<BR/>Portugal, Braga, Guimarães<BR/>Portugal, Porto, Matosinhos<BR/>Portugal, Vila Real, Vila Real<BR/>Portugal, Vila Real, Chaves<BR/>Portugal, Porto, Porto<BR/>Portugal, Porto, Vila Nova de Gaia","Artigo 24.º, n.º 1, alínea e) do Código dos Contratos Públicos",28-03-2014,"4.228,38 €","","",,Não aplicável.,Não aplicável.,FALSE
Auditorias externas,Ajuste Direto Regime Geral,Aquisição de serviços,"79212000-3, Serviços de auditoria","Administração Regional de Saúde do Norte, I. P. (503135593)",Instituto Português de Acreditação (507031059),"14.815,56 €",27-05-2014,10-04-2014,20 dias,"Portugal, Braga, Braga","Artigo 24.º, n.º 1, alínea e) do Código dos Contratos Públicos",29-12-2014,"12.443,45 €","","Houve uma redução no n.º de auditorias a serem realizadas, motivo pelo qual o valor total efetivo ficou abaixo do valor contratual.",,Não aplicável.,Não aplicável.,FALSE
Aquisição de 480 comprimidos de Risperidona 2 mg  Aquisição de 4320 comprimidos de Risperidona 3 mg,Ajuste Direto Regime Geral,Aquisição de bens móveis,"33600000-6, Produtos farmacêuticos","Administração Regional de Saúde do Norte, I. P. (503135593)",Actavis AS Sucursal (980334934),"0,00 €",27-05-2014,14-05-2014,365 dias,"Portugal, Vila Real, Vila Real",Artigo 258.º do Código dos Contratos Públicos,26-05-2014,"194,00 €","",por lapso não foi comunicado o valor adjudicado,,1223870,Aquisição de 480 comprimidos de Risperidona 2 mg  Aquisição de 4320 comprimidos de Risperidona 3 mg,FALSE
Aquisição de 13980 comprimidos de Tiapride 100 mg  Aquisição de 480 comprimidos de Quetiapina 300 mg,Ajuste Direto Regime Geral,Aquisição de bens móveis,"33600000-6, Produtos farmacêuticos","Administração Regional de Saúde do Norte, I. P. (503135593)","Generis farmacêutica, SA (508107997)","0,00 €",27-05-2014,14-05-2014,365 dias,"Portugal, Vila Real, Vila Real",Artigo 258.º do Código dos Contratos Públicos,26-09-2014,"1.252,44 €","",por lapso não foi comunicado o valor adjudicado,,1223858,Aquisição de 13980 comprimidos de Tiapride 100 mg  Aquisição de 480 comprimidos de Quetiapina 300 mg,FALSE
Aquisição de 1300 unidades de risperidona 1 mg/ml sol oral Fr 30 ml,Ajuste Direto Regime Geral,Aquisição de bens móveis,"33600000-6, Produtos farmacêuticos","Administração Regional de Saúde do Norte, I. P. (503135593)",Ratiopharm (502414910),"0,00 €",27-05-2014,14-05-2014,365 dias,"Portugal, Vila Real, Vila Real",Artigo 258.º do Código dos Contratos Públicos,19-08-2014,"2.639,00 €","",por lapso não foi comunicado o valor adjudicado,,1223844,Aquisição de 1300 unidades de risperidona 1 mg/ml sol oral Fr 30 ml,FALSE
Aquisição de 550 caixas de Mycroprep 75 ml e 4 caixas de Permanganato de Potássio líquido,Ajuste Direto Regime Geral,Aquisição de bens móveis,"33696500-0, Reagentes de laboratório","Administração Regional de Saúde do Norte, I. P. (503135593)","QUILABAN-QUIM. LAB. ANALITICA,LDA  (500399670)","5.517,52 €",26-05-2014,12-05-2014,365 dias,"Portugal, Vila Real, Vila Real","Artigo 24.º, n.º 1, alínea e) do Código dos Contratos Públicos",10-12-2014,"5.517,52 €","","",,Não aplicável.,Não aplicável.,FALSE
Aquisição de 10 unidades de pera de borracha completa para tensiómetro,Ajuste Direto Regime Geral,Aquisição de bens móveis,"33140000-3, Material médico de consumo","Administração Regional de Saúde do Norte, I. P. (503135593)",Prhofame (501891145),"18,70 €",23-05-2014,26-03-2014,250 dias,"Portugal, Porto, Maia<BR/>Portugal, Vila Real, Vila Real<BR/>Portugal, Distrito não determinado, Concelho não determinado","Artigo 20.º, n.º 1, alínea a) do Código dos Contratos Públicos",15-09-2014,"18,70 €","","",,Não aplicável.,Não aplicável.,FALSE
Aquisição de 40 unidades de manómetro debitómetro com humidificador,Ajuste Direto Regime Geral,Aquisição de bens móveis,"33140000-3, Material médico de consumo","Administração Regional de Saúde do Norte, I. P. (503135593)","Ezequiel Panao Jorge, lda (501412727)","3.032,00 €",23-05-2014,20-03-2014,250 dias,"Portugal, Distrito não determinado, Concelho não determinado<BR/>Portugal, Vila Real, Vila Real<BR/>Portugal, Porto, Maia","Artigo 20.º, n.º 1, alínea a) do Código dos Contratos Públicos",11-09-2014,"3.032,00 €","","",,Não aplicável.,Não aplicável.,FALSE
Aquisição de 30 unidades de escala optométrica plastificada 3m,Ajuste Direto Regime Geral,Aquisição de bens móveis,"33140000-3, Material médico de consumo","Administração Regional de Saúde do Norte, I. P. (503135593)","Eugenio Pereira ,lda (503989525)","221,70 €",23-05-2014,20-03-2014,250 dias,"Portugal, Distrito não determinado, Concelho não determinado<BR/>Portugal, Porto, Maia<BR/>Portugal, Vila Real, Vila Real","Artigo 20.º, n.º 1, alínea a) do Código dos Contratos Públicos",23-06-2014,"221,70 €","","",,Não aplicável.,Não aplicável.,FALSE
Aquisição de 30 unidades de escala optométrica plastificada letrados/iletrados 3m,Ajuste Direto Regime Geral,Aquisição de bens móveis,"33140000-3, Material médico de consumo","Administração Regional de Saúde do Norte, I. P. (503135593)","Eugenio Pereira, lda (503989525)","221,70 €",23-05-2014,20-03-2014,250 dias,"Portugal, Porto, Maia<BR/>Portugal, Distrito não determinado, Concelho não determinado<BR/>Portugal, Vila Real, Vila Real","Artigo 20.º, n.º 1, alínea a) do Código dos Contratos Públicos",30-04-2014,"221,70 €","","",,Não aplicável.,Não aplicável.,FALSE
Aquisição de 10 unidades de braçal para tensiómetro 8/10x32 cm (criança),Ajuste Direto Regime Geral,Aquisição de bens móveis,"33140000-3, Material médico de consumo","Administração Regional de Saúde do Norte, I. P. (503135593)",Prhofame (501891145),"32,00 €",23-05-2014,20-05-2014,250 dias,"Portugal, Vila Real, Vila Real<BR/>Portugal, Porto, Maia<BR/>Portugal, Distrito não determinado, Concelho não determinado","Artigo 20.º, n.º 1, alínea a) do Código dos Contratos Públicos",15-09-2014,"32,00 €","","",,Não aplicável.,Não aplicável.,FALSE
Aquisição de 400 unidades de Prolongadores 50 cm,Ajuste Direto Regime Geral,Aquisição de bens móveis,"33140000-3, Material médico de consumo","Administração Regional de Saúde do Norte, I. P. (503135593)",P M H PRIDUTOS MÉDICOS HOSPITALARES (502376899),"0,00 €",23-05-2014,08-05-2014,365 dias,"Portugal, Vila Real, Vila Real",Artigo 258.º do Código dos Contratos Públicos,12-05-2014,"73,80 €","",por lapso não foi comunicado o valor adjudicado,,1221551,Aquisição de 400 unidades de Prolongadores 50 cm,FALSE
Aquisição de 25.000 unidades de Espátula d´ayre em plástico,Ajuste Direto Regime Geral,Aquisição de bens móveis,"33140000-3, Material médico de consumo","Administração Regional de Saúde do Norte, I. P. (503135593)","Eugenio Pereira, lda (503989525)","1.250,00 €",23-05-2014,20-03-2014,250 dias,"Portugal, Vila Real, Vila Real<BR/>Portugal, Porto, Maia<BR/>Portugal, Distrito não determinado, Concelho não determinado","Artigo 20.º, n.º 1, alínea a) do Código dos Contratos Públicos",30-04-2014,"1.250,00 €","","",,Não aplicável.,Não aplicável.,FALSE
Aquisição de 30 unidades de lanterna de reflexo pupilar,Ajuste Direto Regime Geral,Aquisição de bens móveis,"33140000-3, Material médico de consumo","Administração Regional de Saúde do Norte, I. P. (503135593)","Eugenio Pereira, lda (503989525)","50,40 €",23-05-2014,20-03-2014,250 dias,"Portugal, Distrito não determinado, Concelho não determinado<BR/>Portugal, Vila Real, Vila Real<BR/>Portugal, Porto, Maia","Artigo 20.º, n.º 1, alínea a) do Código dos Contratos Públicos",23-06-2014,"50,40 €","","",,Não aplicável.,Não aplicável.,FALSE
Serviços de apoio técnico nas áreas economicas-financeiras,Ajuste Direto Regime Geral,Aquisição de serviços,"71356000-8, Serviços técnicos","Administração Regional de Saúde do Norte, I. P. (503135593)","Carneiro & Monteiro, Lda (513005250)","12.714,00 €",23-05-2014,01-04-2014,275 dias,"Portugal, Porto, Porto","Artigo 20.º, n.º 1, alínea a) do Código dos Contratos Públicos",31-12-2014,"12.192,40 €","",O valor do contrato é inferior devido ao numero de horas efetuadas serem inferior ao numero de horas previstas para o contrato.,,Não aplicável.,Não aplicável.,FALSE
Apoio técnico nas áreas económico-financeiras,Ajuste Direto Regime Geral,Aquisição de serviços,"71356000-8, Serviços técnicos","Administração Regional de Saúde do Norte, I. P. (503135593)","Pedro Lopes Pinho - Gestão e Consultoria Unipessoal, Lda (513004807)","12.714,00 €",23-05-2014,01-04-2014,275 dias,"Portugal, Porto, Porto","Artigo 20.º, n.º 1, alínea a) do Código dos Contratos Públicos",31-12-2014,"12.192,40 €","",O valor do contrato é inferior devido ao numero de horas realizadas serem inferior ao numero de horas previstas para o contrato.,,Não aplicável.,Não aplicável.,FALSE
Aquisição de 20 unidades de Pediómetro metálico 1 metro,Ajuste Direto Regime Geral,Aquisição de bens móveis,"33140000-3, Material médico de consumo","Administração Regional de Saúde do Norte, I. P. (503135593)","Eugenio Pereira, lda (503989525)","288,00 €",22-05-2014,20-03-2014,250 dias,"Portugal, Vila Real, Vila Real<BR/>Portugal, Porto, Maia<BR/>Portugal, Distrito não determinado, Concelho não determinado","Artigo 20.º, n.º 1, alínea a) do Código dos Contratos Públicos",30-04-2014,"288,00 €","","",,Não aplicável.,Não aplicável.,FALSE
Aquisição de 500 unidades de Termómetro clínico digital,Ajuste Direto Regime Geral,Aquisição de bens móveis,"33140000-3, Material médico de consumo","Administração Regional de Saúde do Norte, I. P. (503135593)",Ezequiel Panao Jorge lda (501412727),"785,00 €",22-05-2014,20-03-2014,250 dias,"Portugal, Porto, Maia<BR/>Portugal, Vila Real, Vila Real<BR/>Portugal, Distrito não determinado, Concelho não determinado","Artigo 20.º, n.º 1, alínea a) do Código dos Contratos Públicos",11-09-2014,"785,00 €","","",,Não aplicável.,Não aplicável.,FALSE
Aquisição 15 Resmas PAPEL CONQUEROR,Ajuste Direto Regime Geral,Aquisição de bens móveis,"30192000-1, Material de escritório","Administração Regional de Saúde do Norte, I. P. (503135593)",Sapel - Sociedade de Acessórios P. Escritório (500242194),"348,00 €",22-05-2014,09-05-2014,365 dias,"Portugal, Vila Real, Vila Real","Artigo 20.º, n.º 1, alínea a) do Código dos Contratos Públicos",21-08-2014,"348,00 €","","",,Não aplicável.,Não aplicável.,FALSE
Aquisição de 180 caixas ETIQUETAS AUTO-COLANTES 25X50 - 135 caixas ETIQUETAS AUTO-COLANTES 9X13,Ajuste Direto Regime Geral,Aquisição de bens móveis,"30192000-1, Material de escritório","Administração Regional de Saúde do Norte, I. P. (503135593)",Distroffice-Com. Reci. Prod. Inf. Esc. Lda (508512077),"756,00 €",22-05-2014,14-05-2014,365 dias,"Portugal, Vila Real, Vila Real","Artigo 20.º, n.º 1, alínea a) do Código dos Contratos Públicos",12-12-2014,"756,00 €","","",,Não aplicável.,Não aplicável.,FALSE
"Aquisição 4.000 folhas ETIQUETAS AUTO-COLANTE 63,5X38,1 (SIMA)-20 Unidades ETIQUETA COM CÓDIGO DE BARRAS-5.500 unidades CD PRINTABLE",Ajuste Direto Regime Geral,Aquisição de bens móveis,"30192000-1, Material de escritório","Administração Regional de Saúde do Norte, I. P. (503135593)",Luirama-Com Equipa Escritório Afins Lda (502762381),"1.808,00 €",22-05-2014,09-05-2014,365 dias,"Portugal, Vila Real, Vila Real","Artigo 20.º, n.º 1, alínea a) do Código dos Contratos Públicos",12-12-2014,"1.808,00 €","","",,Não aplicável.,Não aplicável.,FALSE
"Aquisição de 100 caixas AGRAFES 23/10 (CX 1000) - 110 Unidades ROLO P/MAQUINA 70X80X11 - 65 rolos ROLO DE PAPEL TERMICO, 110X45X11",Ajuste Direto Regime Geral,Aquisição de bens móveis,"30192000-1, Material de escritório","Administração Regional de Saúde do Norte, I. P. (503135593)",Realcópia (503257400),"107,00 €",22-05-2014,15-05-2014,365 dias,"Portugal, Vila Real, Vila Real","Artigo 20.º, n.º 1, alínea a) do Código dos Contratos Públicos",28-05-2014,"107,00 €","","",,Não aplicável.,Não aplicável.,FALSE
Aquisição de 52.980 comprimidos Ibuprofeno 400 mg,Ajuste Direto Regime Geral,Aquisição de bens móveis,"33600000-6, Produtos farmacêuticos","Administração Regional de Saúde do Norte, I. P. (503135593)","Labesfal - Laboratórios Almiro, S.A. (501169580)","0,00 €",22-05-2014,15-05-2014,365 dias,"Portugal, Vila Real, Vila Real",Artigo 258.º do Código dos Contratos Públicos,03-10-2014,"1.054,30 €","",por lapso não foi comunicado o valor adjudicado,,1220483,Aquisição de 52.980 comprimidos Ibuprofeno 400 mg,FALSE
Aquisição de 5.000 unidades de tampão para sondas sem pega esterilizada,Ajuste Direto Regime Geral,Aquisição de bens móveis,"33140000-3, Material médico de consumo","Administração Regional de Saúde do Norte, I. P. (503135593)",EPJMedica (506820513),"440,00 €",22-05-2014,21-02-2014,321 dias,"Portugal, Porto, Maia<BR/>Portugal, Vila Real, Vila Real<BR/>Portugal, Distrito não determinado, Concelho não determinado","Artigo 20.º, n.º 1, alínea a) do Código dos Contratos Públicos",11-09-2014,"440,00 €","","",,Não aplicável.,Não aplicável.,FALSE
"Aquisição de 198 unidades Enoxaparina sódica 100 mg/ml Sol inj 0,2 ml SC - Aquisição de 396 unidades Enoxaparina sódica 100 mg/ml Sol inj 0,4 ml SC",Ajuste Direto Regime Geral,Aquisição de bens móveis,"33600000-6, Produtos farmacêuticos","Administração Regional de Saúde do Norte, I. P. (503135593)","sanofi - Produtos Farmacêuticos, Lda (500134960)","0,00 €",22-05-2014,15-05-2014,365 dias,"Portugal, Vila Real, Vila Real",Artigo 258.º do Código dos Contratos Públicos,01-07-2014,"1.184,04 €","",por lapso não foi comunicado o valor adjudicado,,1220456,"Aquisição de 198 unidades Enoxaparina sódica 100 mg/ml Sol inj 0,2 ml SC - Aquisição de 396 unidades Enoxaparina sódica 100 mg/ml Sol inj 0,4 ml SC",FALSE
Aquisição de 50 ampolas de cloreto de Obidoxina 250 mg/ml sol. inj,Ajuste Direto Regime Geral,Aquisição de bens móveis,"33600000-6, Produtos farmacêuticos","Administração Regional de Saúde do Norte, I. P. (503135593)","Merck, S.A. (500650870)","325,00 €",22-05-2014,09-04-2014,231 dias,"Portugal, Distrito não determinado, Concelho não determinado<BR/>Portugal, Porto, Maia<BR/>Portugal, Vila Real, Vila Real","Artigo 24.º, n.º 1, alínea e) do Código dos Contratos Públicos",11-04-2014,"325,00 €","","",,Não aplicável.,Não aplicável.,FALSE
Instalação dos serviços da URAP,Ajuste Direto Regime Geral,Empreitadas de obras públicas,"45453000-7, Obras de revisão e recuperação","Administração Regional de Saúde do Norte, I. P. (503135593)","Alexandre Loureiro Ferreira, Unipessoal, Lda. (510868940)","30.601,26 €",22-05-2014,05-05-2014,40 dias,"Portugal, Porto, Vila Nova de Gaia","Artigo 19.º, alínea a) do Código dos Contratos Públicos","","30.601,26 €",Verificou-se que foi estimado um prazo ligeiramente superior ao necessário para realização da empreitada superior ao realmente necessário.,"",,Não aplicável.,Não aplicável.,FALSE
Aquisição 4.500 Bisnagas Ác algínico + Ác esteárico + Ác sórbico Emuls cut,Ajuste Direto Regime Geral,Aquisição de bens móveis,"33600000-6, Produtos farmacêuticos","Administração Regional de Saúde do Norte, I. P. (503135593)",Johnson & Jonhson (500153370),"22.455,00 €",21-05-2014,05-03-2014,365 dias,"Portugal, Vila Real, Vila Real","Artigo 24.º, n.º 1, alínea e) do Código dos Contratos Públicos",08-11-2014,"22.455,00 €","","",,Não aplicável.,Não aplicável.,FALSE
Elaboração do Projeto de Execução do Laboratório de Saúde Pública (Braga),Ajuste Direto Regime Geral,Aquisição de serviços,"71240000-2, Serviços de arquitectura, engenharia e planeamento","Administração Regional de Saúde do Norte, I. P. (503135593)",Galbilec - Gestão e Coordenação de Projectos Lda  (507714580),"31.900,00 €",21-05-2014,16-04-2014,30 dias,"Portugal, Braga, Braga","Artigo 20.º, n.º 1, alínea a) do Código dos Contratos Públicos",15-06-2014,"31.900,00 €","","",,Não aplicável.,Não aplicável.,FALSE
Aquisição de 20 frascos de vidro graduado 500 ml com tampa de rosca,Ajuste Direto Regime Geral,Aquisição de bens móveis,"39226220-0, Frascos","Administração Regional de Saúde do Norte, I. P. (503135593)",VWR - Internacional (503842770),"130,00 €",21-05-2014,15-05-2014,365 dias,"Portugal, Vila Real, Vila Real","Artigo 20.º, n.º 1, alínea a) do Código dos Contratos Públicos",16-05-2014,"130,00 €","","",,Não aplicável.,Não aplicável.,FALSE
Aquisição de 77 comprimidos de Buprenorfina 8 mg,Ajuste Direto Regime Geral,Aquisição de bens móveis,"33600000-6, Produtos farmacêuticos","Administração Regional de Saúde do Norte, I. P. (503135593)","DLA Farmacêutica, S.A. (503894427)","60,83 €",21-05-2014,14-05-2014,365 dias,"Portugal, Vila Real, Vila Real",Artigo 258.º do Código dos Contratos Públicos,17-12-2014,"60,83 €","","",,1219425,Aquisição de 77 comprimidos de Buprenorfina 8 mg,FALSE
