Objeto do Contrato,Tipo de Procedimento,Tipo(s) de Contrato,CPVs,Entidade(s) Adjudicante(s),Entidade(s) Adjudicatária(s),Preço Contratual,Data de Publicação,Data de Celebração do Contrato,Prazo de Execução,Local de Execução,Fundamentação,Data de Fecho do Contrato,Preço Total Efetivo,Causas das Alterações ao Prazo,Causas das Alterações ao Preço,Estado,N.º registo do Acordo Quadro,Descrição do Acordo Quadro,Procedimento Centralizado
"Aquisição de Carboximeticelulose Sódica com Prata, Super absorvente 10cmx10cm (penso) (C1358).",Ajuste Direto Regime Geral,Aquisição de bens móveis,"33141111-1, Pensos adesivos",Adm.Reg.de Saúde de Lisboa e Vale do Tejo (ARSLVT) (503148776),"Kvtech Portugal - Produtos Médicos, Unipessoal, Lda. (508671531)","606.400,00 €",10-08-2017,19-07-2017,143 dias,"Portugal, Lisboa",Artigo 258.º do Código dos Contratos Públicos,,,,,,Não aplicável.,Não aplicável.,FALSE
"Aquisição adicional de vacina Tetravalente contra Difteria Tet. Pert. E VIP (DTPaVIP) [UDOSE], (V127).",Ajuste Direto Regime Geral,Aquisição de bens móveis,"33651600-4, Vacinas","Administração Regional de Saúde de Lisboa e Vale do Tejo, I. P. (503148776)","SANOFI - PRODUTOS FARMACÊUTICOS, LDA. (500134960)","375.000,00 €",10-08-2017,14-07-2017,143 dias,"Portugal, Lisboa",Artigo 258.º do Código dos Contratos Públicos,,,,,,Não aplicável.,Não aplicável.,FALSE
"Prestação de serviços médicos sem especialidade para a Administração Regional de Saúde de Lisboa e Vale do Tejo, IP, Contratação Extraordinária, para o mês de julho de 2017",Ajuste Direto Regime Geral,Aquisição de serviços,"85121100-4, Serviços de médicos de clínica geral","Administração Regional de Saúde de Lisboa e Vale do Tejo, I. P. (503148776)","Corevalue Healthcare Solutions, Lda. (513654577)","192.229,60 €",10-08-2017,10-08-2017,30 dias,"Portugal, Lisboa","Artigo 24.º, n.º 1, alínea c) do Código dos Contratos Públicos",,,,,,Não aplicável.,Não aplicável.,FALSE
Aquisição de comunicações de voz e dados em local fixo para o período de 01/02/2017 a 30/06/2017,Ajuste Direto Regime Geral,Aquisição de serviços,"90900000-6, Serviços de limpeza e saneamento",Adm.Reg.de Saúde de Lisboa e Vale do Tejo (ARSLVT) (503148776),"NOS Comunicações, SA (502604751)","33.987,23 €",10-08-2017,22-05-2017,150 dias,"Portugal, Lisboa<BR/>Portugal, Santarém<BR/>Portugal, Setúbal<BR/>Portugal, Leiria","Artigo 20.º, n.º 1, alínea a) do Código dos Contratos Públicos",,,,,,Não aplicável.,Não aplicável.,FALSE
"Aquisição da prestação de serviços de manutenção de instalações de elevação da ARSLVT, IP não abrangidas pelo Acordo quadro, para o ano de 2017.",Ajuste Direto Regime Geral,Aquisição de serviços,"50000000-5, Serviços de reparação e manutenção","Administração Regional de Saúde de Lisboa e Vale do Tejo, I. P. (503148776)","Grupnor - Grupo Português de Elevadores do Norte, Lda (500959579)","1.152,00 €",10-08-2017,27-03-2017,365 dias,"Portugal, Lisboa<BR/>Portugal, Leiria, Caldas da Rainha<BR/>Portugal, Setúbal, Seixal","Artigo 20.º, n.º 1, alínea a) do Código dos Contratos Públicos",,,,,,Não aplicável.,Não aplicável.,FALSE
"Obras no Centro de Saúde de Alcanena, para PT",Ajuste Direto Regime Geral,Empreitadas de obras públicas,"45113000-2, Obras no local","Administração Regional de Saúde de Lisboa e Vale do Tejo, I. P. (503148776)","SECAL - Engenharia e Construções, S.A. (501982248)","9.447,85 €",10-08-2017,10-08-2017,10 dias,"Portugal, Lisboa","Artigo 19.º, alínea a) do Código dos Contratos Públicos",,,,,,Não aplicável.,Não aplicável.,FALSE
Claritromicina 500mg comp.,Ao abrigo de acordo-quadro (art.º 259.º),Aquisição de bens móveis,"33600000-6, Produtos farmacêuticos","Administração Regional de Saúde de Lisboa e Vale do Tejo, I. P. (503148776)","Generis - Farmacêutica, S.a (508107997)","1.740,00 €",09-08-2017,08-08-2017,145 dias,"Portugal, Lisboa",Artigo 259.º do Código dos Contratos Públicos,,,,,,1326195,ACORDO QUADRO PARA FORNECIMENTO DE MEDICAMENTOS ANTI-INFECIOSOS: EXCETO ANTIVÍRICOS E ANTIFÚNGICOS ÀS INSTITUIÇÕES E SERVIÇOS DO SERVIÇO NACIONAL DE SAÚDE,FALSE
Ciprofloxacina 750mg comp.,Ao abrigo de acordo-quadro (art.º 259.º),Aquisição de bens móveis,"33600000-6, Produtos farmacêuticos","Administração Regional de Saúde de Lisboa e Vale do Tejo, I. P. (503148776)",Labesfal - Laboratórios Almiro S.a  (501169580),"244,99 €",09-08-2017,04-08-2017,149 dias,"Portugal, Lisboa",Artigo 259.º do Código dos Contratos Públicos,,,,,,1326195,ACORDO QUADRO PARA FORNECIMENTO DE MEDICAMENTOS ANTI-INFECIOSOS: EXCETO ANTIVÍRICOS E ANTIFÚNGICOS ÀS INSTITUIÇÕES E SERVIÇOS DO SERVIÇO NACIONAL DE SAÚDE,FALSE
Aquisição de material de penso,Concurso público,Aquisição de bens móveis,"33140000-3, Material médico de consumo","Administração Regional de Saúde de Lisboa e Vale do Tejo, I. P. (503148776)",BASTOS VIEGAS S.A. (500042772),"10.500,00 €",08-08-2017,28-07-2017,145 dias,"Portugal, Lisboa","Artigo 20.º, n.º 1, alínea b) do Código dos Contratos Públicos",,,,,,Não aplicável.,Não aplicável.,FALSE
Aquisição de material de penso,Concurso público,Aquisição de bens móveis,"33140000-3, Material médico de consumo","Administração Regional de Saúde de Lisboa e Vale do Tejo, I. P. (503148776)",BASTOS VIEGAS S.A. (500042772),"28.564,00 €",08-08-2017,28-07-2017,145 dias,"Portugal, Lisboa","Artigo 20.º, n.º 1, alínea b) do Código dos Contratos Públicos",,,,,,Não aplicável.,Não aplicável.,FALSE
Aquisição de material de penso,Concurso público,Aquisição de bens móveis,"33140000-3, Material médico de consumo","Administração Regional de Saúde de Lisboa e Vale do Tejo, I. P. (503148776)",PAUL HARTMANN (502271728),"12.600,00 €",08-08-2017,28-07-2017,145 dias,"Portugal, Lisboa","Artigo 20.º, n.º 1, alínea b) do Código dos Contratos Públicos",,,,,,Não aplicável.,Não aplicável.,FALSE
Aquisição de material de penso,Concurso público,Aquisição de bens móveis,"33140000-3, Material médico de consumo","Administração Regional de Saúde de Lisboa e Vale do Tejo, I. P. (503148776)","ANASTACIO SALDANHA UNIPESSOAL, LDA. (505804441)","132,00 €",08-08-2017,08-08-2017,145 dias,"Portugal, Lisboa","Artigo 20.º, n.º 1, alínea b) do Código dos Contratos Públicos",,,,,,Não aplicável.,Não aplicável.,FALSE
"Aquisição de cadeiras para a USF D. Francisco, USF Fonte Luminosa e USF S. Sebastião",Ajuste Direto Regime Geral,Aquisição de bens móveis,"39112000-0, Cadeiras","Administração Regional de Saúde de Lisboa e Vale do Tejo, I. P. (503148776)","MOBAPEC - Mobiliário Escolar, Lda (501155015)","0,00 €",04-08-2017,03-08-2017,20 dias,"Portugal, Lisboa, Lisboa<BR/>Portugal, Santarém, Abrantes<BR/>Portugal, Lisboa, Lourinhã",Artigo 258.º do Código dos Contratos Públicos,,,,,,2863000,"Aquisição de cadeiras para USF D. Francisco de Almeida, USF Fonte Luminosa e USF S. Sebastião",FALSE
Ibuprofeno 400mg comprimido,Ao abrigo de acordo-quadro (art.º 259.º),Aquisição de bens móveis,"33600000-6, Produtos farmacêuticos","Administração Regional de Saúde de Lisboa e Vale do Tejo, I. P. (503148776)","Pharmakern Portugal - Produtos Farmacêuticos, Sociedade Unipessoal Lda  (507002571)","522,00 €",04-08-2017,24-07-2017,160 dias,"Portugal, Lisboa",Artigo 259.º do Código dos Contratos Públicos,,,,,,1410779,CP 2015/47 - Acordo quadro para fornecimento de medicamentos do aparelho locomotor às instituições e serviços do serviço nacional de saúde,FALSE
"PROPOSTA DE SERVIÇOS DE APOIO AO BIARS """"BUSINESS INTELLIGENCE DA ARS"""" E REGISTO CENTRAL DE VACINAS",Ajuste Direto Regime Geral,Aquisição de serviços,"71356300-1, Serviços de apoio técnico","Administração Regional de Saúde de Lisboa e Vale do Tejo, I. P. (503148776)","Nimble Portugal, serviços e consultoria gestão, Lda (510308759)","9.600,00 €",01-08-2017,09-06-2017,205 dias,"Portugal, Lisboa","Artigo 20.º, n.º 1, alínea a) do Código dos Contratos Públicos",,,,,,Não aplicável.,Não aplicável.,FALSE
AQUISIÇÃO DE CONTENTORES DE TRANSPORTE DE DISPOSITIVOS MÉDICOS CONTAMINADOS.,Ajuste Direto Regime Geral,Aquisição de bens móveis,"34928480-6, Contentores e baldes para lixo e resíduos","Administração Regional de Saúde de Lisboa e Vale do Tejo, I. P. (503148776)",Eugénio Pereira (503989525),"3.668,00 €",01-08-2017,26-07-2017,158 dias,"Portugal, Lisboa","Artigo 20.º, n.º 1, alínea a) do Código dos Contratos Públicos",,,,,,Não aplicável.,Não aplicável.,FALSE
Prestação de Serviços Médicos sem especialidade para a ARSLVT Lote 7,Concurso público,Aquisição de serviços,"85100000-0, Serviços de saúde","Administração Regional de Saúde de Lisboa e Vale do Tejo, I. P. (503148776)",Kelly Services (510723691),"225.429,20 €",01-08-2017,03-05-2017,245 dias,"Portugal, Lisboa, Lisboa","Artigo 20.º, n.º 1, alínea b) do Código dos Contratos Públicos",,,,,,Não aplicável.,Não aplicável.,FALSE
Prestação de Serviços Médicos sem especialidade para a ARSLVT Lote 8,Concurso público,Aquisição de serviços,"85100000-0, Serviços de saúde","Administração Regional de Saúde de Lisboa e Vale do Tejo, I. P. (503148776)",Kelly Services (510723691),"53.775,70 €",01-08-2017,03-05-2017,245 dias,"Portugal, Lisboa, Lisboa","Artigo 20.º, n.º 1, alínea b) do Código dos Contratos Públicos",,,,,,Não aplicável.,Não aplicável.,FALSE
Prestação de Serviços Médicos s/ especialidade  para a ARSLVT - Lote 5,Concurso público,Aquisição de serviços,"85100000-0, Serviços de saúde","Administração Regional de Saúde de Lisboa e Vale do Tejo, I. P. (503148776)","GS24 - Healthcare Solutions, Lda (507824652)","433.821,30 €",01-08-2017,03-05-2017,245 dias,"Portugal, Lisboa, Lisboa","Artigo 20.º, n.º 1, alínea b) do Código dos Contratos Públicos",,,,,,Não aplicável.,Não aplicável.,FALSE
