Objeto do Contrato,Tipo de Procedimento,Tipo(s) de Contrato,CPVs,Entidade(s) Adjudicante(s),Entidade(s) Adjudicatária(s),Preço Contratual,Data de Publicação,Data de Celebração do Contrato,Prazo de Execução,Local de Execução,Fundamentação,Data de Fecho do Contrato,Preço Total Efetivo,Causas das Alterações ao Prazo,Causas das Alterações ao Preço,Estado,N.º registo do Acordo Quadro,Descrição do Acordo Quadro,Procedimento Centralizado
40040/2016 Fornecimento de Endoscópio Flexivel,Ajuste Direto Regime Geral,Aquisição de bens móveis,"33168100-6, Endoscópios","CHBM - Centro Hospital Barreiro Montijo, EPE (509186998)","TEPREL - EQUIPAMENTOS MEDICOS, SA (502262184)","14.990,00 €",21-03-2017,06-10-2016,20 dias,"Portugal, Setúbal, Barreiro","Artigo 20.º, n.º 1, alínea a) do Código dos Contratos Públicos",15-12-2016,"14.990,00 €","","",,Não aplicável.,Não aplicável.,FALSE
110010/2016 - MATERIAL DE OFTALMOLOGIA,Concurso público,Aquisição de bens móveis,"33140000-3, Material médico de consumo","Centro Hospitalar Barreiro Montijo, E. P. E. (509186998)",OVERPHARMA- PRODUTOS MEDICOS FARMAC. LDA      (505792362),"181,00 €",21-03-2017,04-02-2016,365 dias,"Portugal, Setúbal, Barreiro","Artigo 20.º, n.º 1, alínea b) do Código dos Contratos Públicos",31-12-2016,"204,67 €","",ALTERAÇÕES NAS QUANTIDADES,,Não aplicável.,Não aplicável.,FALSE
110010/2016 - MATERIAL DE OFTALMOLOGIA,Concurso público,Aquisição de bens móveis,"33140000-3, Material médico de consumo","Centro Hospitalar Barreiro Montijo, E. P. E. (509186998)",Excelentetitulo (510255086),"260,00 €",21-03-2017,04-02-2016,365 dias,"Portugal, Setúbal, Barreiro","Artigo 20.º, n.º 1, alínea b) do Código dos Contratos Públicos",31-12-2016,"65,00 €","",ALTERAÇÕES NAS QUANTIDADES,,Não aplicável.,Não aplicável.,FALSE
110010/2016 - MATERIAL DE OFTALMOLOGIA,Concurso público,Aquisição de bens móveis,"33140000-3, Material médico de consumo","Centro Hospitalar Barreiro Montijo, E. P. E. (509186998)",B BRAUN MEDICAL LDA (501506543),"134,40 €",20-03-2017,04-02-2016,365 dias,"Portugal, Setúbal, Barreiro","Artigo 20.º, n.º 1, alínea b) do Código dos Contratos Públicos",31-12-2016,"","",ALTERAÇÕES NAS QUANTIDADES,,Não aplicável.,Não aplicável.,FALSE
110010/2016 - MATERIAL DE OFTALMOLOGIA,Concurso público,Aquisição de bens móveis,"33140000-3, Material médico de consumo","Centro Hospitalar Barreiro Montijo, E. P. E. (509186998)",ALCON Portugal (501251685),"2.524,84 €",20-03-2017,04-02-2016,365 dias,"Portugal, Setúbal, Barreiro","Artigo 20.º, n.º 1, alínea b) do Código dos Contratos Públicos",31-12-2016,"1.368,18 €","",ALTERAÇÕES NAS QUANTIDADES,,Não aplicável.,Não aplicável.,FALSE
4I0019/2017 Contentores e seringas,Ao abrigo de acordo-quadro (art.º 259.º),Aquisição de bens móveis,"33000000-0, Equipamento médico, medicamentos e produtos para cuidados pessoais","Centro Hospitalar Barreiro Montijo, E. P. E. (509186998)","Quilaban - Quimica Laboratorial Analitica, S.A. (500399670)","163,00 €",20-03-2017,26-01-2017,30 dias,"Portugal, Setúbal, Barreiro","Artigo 20.º, n.º 1, alínea b) do Código dos Contratos Públicos",30-01-2017,"163,00 €","","",,448705,"CONCURSO PÚBLICO PARA A CELEBRAÇÃO DE CONTRATOS PÚBLICOS DE APROVISIONAMENTO PARA A ÁREA DA SAÚDE, COM VISTA AO FORNECIMENTO DE SERINGAS, AGULHAS, CONTENTORES E SISTEMAS FECHADOS DE COLHEITA,  ÀS INSTITUIÇÕES E SERVIÇOS DO SERVIÇO NACIONAL DE SAÚDE",FALSE
110010/2016 - MATERIAL DE OFTALMOLOGIA,Concurso público,Aquisição de bens móveis,"33140000-3, Material médico de consumo","Centro Hospitalar Barreiro Montijo, E. P. E. (509186998)",Abbott Medical Optics Spain S.L. (980262364),"1.590,00 €",20-03-2017,04-02-2016,365 dias,"Portugal, Setúbal, Barreiro","Artigo 20.º, n.º 1, alínea b) do Código dos Contratos Públicos",31-12-2016,"1.272,00 €","",ALTERAÇÕES NAS QUANTIDADES,,Não aplicável.,Não aplicável.,FALSE
Monitores Multiparamêtros,Ajuste Direto Regime Geral,Aquisição de bens móveis,"33100000-1, Equipamento médico","CHBM - Centro Hospital Barreiro Montijo, EPE (509186998)","GERANSWERS, LDA (507683528)","15.600,00 €",20-03-2017,30-12-2016,20 dias,"Portugal, Setúbal, Barreiro","Artigo 20.º, n.º 1, alínea a) do Código dos Contratos Públicos",30-12-2016,"15.600,00 €","","",,Não aplicável.,Não aplicável.,FALSE
"4CPS0002/2016 - Fornecimento de Serviços de Alimentação a Doentes e Funcionários do CHBM, EPE",Ajuste Direto Regime Geral,Aquisição de serviços,"55320000-9, Serviços de provimento de refeições","CHBM - Centro Hospital Barreiro Montijo, EPE (509186998)",ITAU- Instituto Técnico de Alimentação Humana SA (500142858),"815.026,92 €",20-03-2017,23-12-2015,365 dias,"Portugal, Setúbal, Barreiro","Artigo 27.º, n.º 1, alínea a) do Código dos Contratos Públicos",31-12-2016,"863.942,04 €","",Necessidade superior ao previsto,,Não aplicável.,Não aplicável.,FALSE
110010/2016 - MATERIAL DE OFTALMOLOGIA,Concurso público,Aquisição de bens móveis,"33140000-3, Material médico de consumo","Centro Hospitalar Barreiro Montijo, E. P. E. (509186998)",Oftaldata (504887459),"10.225,87 €",20-03-2017,04-02-2016,365 dias,"Portugal, Setúbal, Barreiro","Artigo 20.º, n.º 1, alínea b) do Código dos Contratos Públicos",31-12-2016,"9.898,81 €","",ALTERAÇÕES NAS QUANTIDADES,,Não aplicável.,Não aplicável.,FALSE
110015/2016 - CIRURGIA ENDOSCOPICA,Concurso público,Aquisição de bens móveis,"33169000-2, Material cirúrgico","Centro Hospitalar Barreiro Montijo, E. P. E. (509186998)",CLINIFAR SA                                        (503281115),"6.640,50 €",20-03-2017,01-03-2016,365 dias,"Portugal, Setúbal, Barreiro","Artigo 20.º, n.º 1, alínea b) do Código dos Contratos Públicos",31-12-2016,"8.562,75 €","",ALTERAÇÕES NAS QUANTIDADES,,Não aplicável.,Não aplicável.,FALSE
40069/2016 - Ácido úrico; Calcio e Ferro,Ajuste Direto Regime Geral,Aquisição de bens móveis,"33696500-0, Reagentes de laboratório","Centro Hospitalar Barreiro Montijo, E. P. E. (509186998)",Menarini diagnosticos Lda. (502610069),"407,46 €",20-03-2017,11-04-2016,20 dias,"Portugal, Setúbal, Barreiro","Artigo 20.º, n.º 1, alínea a) do Código dos Contratos Públicos",15-04-2016,"407,46 €","","",,Não aplicável.,Não aplicável.,FALSE
40069/2016 - Ácido úrico; Cálcio e Ferro,Ajuste Direto Regime Geral,Aquisição de bens móveis,"33696500-0, Reagentes de laboratório","Centro Hospitalar Barreiro Montijo, E. P. E. (509186998)",THERMO FISHER DIAGNOSTICS (506916243),"582,60 €",20-03-2017,11-04-2016,20 dias,"Portugal, Setúbal, Barreiro","Artigo 20.º, n.º 1, alínea a) do Código dos Contratos Públicos",15-04-2016,"582,60 €","","",,Não aplicável.,Não aplicável.,FALSE
40069/2016 - Ácido úrico; Cálcio e Ferro,Ajuste Direto Regime Geral,Aquisição de bens móveis,"33696500-0, Reagentes de laboratório","Centro Hospitalar Barreiro Montijo, E. P. E. (509186998)","ABBOTT LABORATORIOS, LDA (500006148)","5.501,62 €",20-03-2017,11-04-2016,20 dias,"Portugal, Setúbal, Barreiro","Artigo 20.º, n.º 1, alínea a) do Código dos Contratos Públicos",15-04-2016,"5.501,62 €","","",,Não aplicável.,Não aplicável.,FALSE
110015/2016 - CIRURGIA ENDOSCOPICA,Concurso público,Aquisição de bens móveis,"33169000-2, Material cirúrgico","Centro Hospitalar Barreiro Montijo, E. P. E. (509186998)","C. R. BARD PORTUGAL, LDA (502438274)","1.074,00 €",20-03-2017,01-03-2016,365 dias,"Portugal, Setúbal, Barreiro","Artigo 20.º, n.º 1, alínea b) do Código dos Contratos Públicos",31-12-2016,"795,70 €","",ALTERAÇÕES NAS QUANTIDADES,,Não aplicável.,Não aplicável.,FALSE
110015/2016 - CIRURGIA ENDOSCOPICA,Concurso público,Aquisição de bens móveis,"33169000-2, Material cirúrgico","Centro Hospitalar Barreiro Montijo, E. P. E. (509186998)","TELEFLEX MEDICAL, S.A. (980249783)","21.603,40 €",20-03-2017,01-03-2016,365 dias,"Portugal, Setúbal, Barreiro","Artigo 20.º, n.º 1, alínea b) do Código dos Contratos Públicos",31-12-2016,"14.354,20 €","",ALTERAÇÕES NAS QUANTIDADES,,Não aplicável.,Não aplicável.,FALSE
110015/2016 - CIRURGIA ENDOSCOPICA,Concurso público,Aquisição de bens móveis,"33169000-2, Material cirúrgico","Centro Hospitalar Barreiro Montijo, E. P. E. (509186998)","Covidien Portugal, Lda (503413410)","78.078,20 €",20-03-2017,01-03-2016,365 dias,"Portugal, Setúbal, Barreiro","Artigo 20.º, n.º 1, alínea b) do Código dos Contratos Públicos",31-12-2016,"36.700,00 €","",ALTERAÇÕES NAS QAUNTIDADES,,Não aplicável.,Não aplicável.,FALSE
4EXC0009-2016 LINHA DE INFUSÃO,Ajuste Direto Regime Geral,Aquisição de bens móveis,"33140000-3, Material médico de consumo","CHBM - Centro Hospital Barreiro Montijo, EPE (509186998)","GAMBRO-SOC PRODUT MEDICOS, LDA (501082107)","320,00 €",20-03-2017,04-01-2016,365 dias,"Portugal, Setúbal, Barreiro","Artigo 24.º, n.º 1, alínea e) do Código dos Contratos Públicos",30-12-2016,"","",O MATERIAL NAO FOI NECESSARIO ADQUIRIR,,Não aplicável.,Não aplicável.,FALSE
DM Entubação,Ajuste Direto Regime Geral,Aquisição de bens móveis,"33141641-5, Sondas","CHBM - Centro Hospital Barreiro Montijo, EPE (509186998)",SMITHS MEDICAL PORTUGAL LDA (507445937),"0,00 €",17-03-2017,08-03-2016,365 dias,"Portugal, Setúbal, Barreiro","Artigo 20.º, n.º 1, alínea a) do Código dos Contratos Públicos",30-12-2016,"","",não necessário aquisição,,Não aplicável.,Não aplicável.,FALSE
DM Entubação,Ajuste Direto Regime Geral,Aquisição de bens móveis,"33141641-5, Sondas","CHBM - Centro Hospital Barreiro Montijo, EPE (509186998)","INTERSURGICAL PORTUGAL, LDA (503480045)","0,00 €",17-03-2017,08-03-2016,365 dias,"Portugal, Setúbal, Barreiro","Artigo 20.º, n.º 1, alínea a) do Código dos Contratos Públicos",30-12-2016,"","",não necessário aquisição,,Não aplicável.,Não aplicável.,FALSE
DM Entubação,Ajuste Direto Regime Geral,Aquisição de bens móveis,"33141641-5, Sondas","CHBM - Centro Hospital Barreiro Montijo, EPE (509186998)","TELEFLEX MEDICAL, S.A. (980249783)","0,00 €",17-03-2017,08-03-2016,365 dias,"Portugal, Setúbal, Barreiro","Artigo 20.º, n.º 1, alínea a) do Código dos Contratos Públicos",30-12-2016,"","",não necessário aquisição,,Não aplicável.,Não aplicável.,FALSE
DM Entubação,Ajuste Direto Regime Geral,Aquisição de bens móveis,"33141641-5, Sondas","CHBM - Centro Hospital Barreiro Montijo, EPE (509186998)","Covidien Portugal, Lda (503413410)","0,00 €",17-03-2017,08-03-2016,365 dias,"Portugal, Setúbal, Barreiro","Artigo 20.º, n.º 1, alínea a) do Código dos Contratos Públicos",30-12-2016,"","",não necessário aquisição,,Não aplicável.,Não aplicável.,FALSE
DM Entubação,Ajuste Direto Regime Geral,Aquisição de bens móveis,"33141641-5, Sondas","CHBM - Centro Hospital Barreiro Montijo, EPE (509186998)","MBA PORTUGAL, S.A. (504445960)","0,00 €",17-03-2017,08-03-2016,365 dias,"Portugal, Setúbal, Barreiro","Artigo 20.º, n.º 1, alínea a) do Código dos Contratos Públicos",30-12-2016,"","",não necessária a aquisição,,Não aplicável.,Não aplicável.,FALSE
110014/2016 - CIRURGIA LAPAROSCOPICA,Concurso público,Aquisição de bens móveis,"33169000-2, Material cirúrgico","Centro Hospitalar Barreiro Montijo, E. P. E. (509186998)","Divisioncare Unipessoal, Lda. (510616593)","1.296,05 €",17-03-2017,22-02-2016,365 dias,"Portugal, Setúbal, Barreiro","Artigo 20.º, n.º 1, alínea b) do Código dos Contratos Públicos",31-12-2016,"26,25 €","",ALTERAÇÕES NAS QUANTIDADES,,Não aplicável.,Não aplicável.,FALSE
4S0034/2016 - FORNECIMENTO DE SERVIÇOS DE JARDINAGEM AO CHBM,Ajuste Direto Regime Geral,Aquisição de serviços,"77311000-3, Serviços de manutenção de jardins ornamentais e recreativos","CHBM - Centro Hospital Barreiro Montijo, EPE (509186998)","Caimalider, Unipessoal, Lda (513070788)","12.658,75 €",17-03-2017,14-03-2016,365 dias,"Portugal, Setúbal, Barreiro","Artigo 20.º, n.º 1, alínea a) do Código dos Contratos Públicos",31-10-2016,"6.662,52 €",Revogação do contrato como previsto n artº 331º do CCP,Revogação do contrato como previsto n artº 331º do CCP,,Não aplicável.,Não aplicável.,FALSE
110014/2016 - CIRURGIA LAPAROSCOPICA,Concurso público,Aquisição de bens móveis,"33169000-2, Material cirúrgico","Centro Hospitalar Barreiro Montijo, E. P. E. (509186998)",ENDOTÉCNICA - Soluções Hospitalares  (503818348),"72.061,00 €",17-03-2017,22-02-2016,365 dias,"Portugal, Setúbal, Barreiro","Artigo 20.º, n.º 1, alínea b) do Código dos Contratos Públicos",31-12-2016,"67.706,00 €","",ALTERAÇÕES NAS QUANTIDADES,,Não aplicável.,Não aplicável.,FALSE
110013/2016 - SUTURA MECÂNICA,Concurso público,Aquisição de bens móveis,"33141125-2, Material de sutura cirúrgica","Centro Hospitalar Barreiro Montijo, E. P. E. (509186998)",ENDOTÉCNICA - Soluções Hospitalares  (503818348),"2.000,00 €",17-03-2017,10-02-2016,365 dias,"Portugal, Setúbal, Barreiro","Artigo 20.º, n.º 1, alínea b) do Código dos Contratos Públicos",31-12-2016,"400,00 €","",ALTERAÇÕES DE QUANTIDADES,,Não aplicável.,Não aplicável.,FALSE
4I0005/2016 - SISTEMAS DE PACEMAKERS,Ao abrigo de acordo-quadro (art.º 259.º),Aquisição de bens móveis,"33182210-4, Estimulador cardíaco (pacemaker)","Centro Hospitalar Barreiro Montijo, E. P. E. (509186998)",BIOTRONIK PORTUGAL UNIPESSOAL LDA (510726941),"102.610,00 €",17-03-2017,28-01-2016,365 dias,"Portugal, Setúbal, Barreiro",Artigo 259.º do Código dos Contratos Públicos,31-12-2016,"102.610,00 €","","",,600105,"CONCURSO PÚBLICO PARA A CELEBRAÇÃO DE CONTRATOS PÚBLICOS DE APROVISIONAMENTO PARA A ÁREA DA SAÚDE, COM VISTA AO FORNECIMENTO SISTEMAS DE PACEMAKERS ÀS INSTITUIÇÕES E SERVIÇOS DO SERVIÇO NACIONAL DE SAÚDE",FALSE
4I0005/2016 - SISTEMAS DE PACEMAKERS,Ao abrigo de acordo-quadro (art.º 259.º),Aquisição de bens móveis,"33182210-4, Estimulador cardíaco (pacemaker)","Centro Hospitalar Barreiro Montijo, E. P. E. (509186998)","MEDTRONIC PORTUGAL, LDA. (504223933)","73.050,00 €",17-03-2017,28-01-2016,365 dias,"Portugal, Setúbal, Barreiro",Artigo 259.º do Código dos Contratos Públicos,31-12-2016,"73.050,00 €","","",,600105,"CONCURSO PÚBLICO PARA A CELEBRAÇÃO DE CONTRATOS PÚBLICOS DE APROVISIONAMENTO PARA A ÁREA DA SAÚDE, COM VISTA AO FORNECIMENTO SISTEMAS DE PACEMAKERS ÀS INSTITUIÇÕES E SERVIÇOS DO SERVIÇO NACIONAL DE SAÚDE",FALSE
110013/2016 - SUTURA MECÂNICA,Concurso público,Aquisição de bens móveis,"33141125-2, Material de sutura cirúrgica","Centro Hospitalar Barreiro Montijo, E. P. E. (509186998)",MEDTRONIC PORTUGAL LDA (504223933),"179.310,00 €",17-03-2017,10-02-2016,365 dias,"Portugal, Setúbal, Barreiro","Artigo 20.º, n.º 1, alínea b) do Código dos Contratos Públicos",31-12-2016,"76.684,00 €","",ALTERAÇÕES NAS QUANTIDADES,,Não aplicável.,Não aplicável.,FALSE
110012/2016 - LENTES INTRAOCULARES,Concurso público,Aquisição de bens móveis,"33731110-7, Lentes intraoculares","Centro Hospitalar Barreiro Montijo, E. P. E. (509186998)",ALCON Portugal (501251685),"26.150,09 €",17-03-2017,28-01-2016,365 dias,"Portugal, Setúbal, Barreiro","Artigo 20.º, n.º 1, alínea b) do Código dos Contratos Públicos",31-12-2016,"12.577,26 €","",ALTERAÇÕES NAS QUANTIDADES,,Não aplicável.,Não aplicável.,FALSE
4I0005/2016 - SISTEMAS DE PACEMAKERS,Ao abrigo de acordo-quadro (art.º 259.º),Aquisição de bens móveis,"33182210-4, Estimulador cardíaco (pacemaker)","CHBM - Centro Hospital Barreiro Montijo, EPE (509186998)",ST. JUDE MEDICAL (504180746),"110.450,00 €",17-03-2017,28-01-2016,365 dias,"Portugal, Setúbal, Barreiro",Artigo 259.º do Código dos Contratos Públicos,31-12-2016,"110.450,00 €","","",,600105,"CONCURSO PÚBLICO PARA A CELEBRAÇÃO DE CONTRATOS PÚBLICOS DE APROVISIONAMENTO PARA A ÁREA DA SAÚDE, COM VISTA AO FORNECIMENTO SISTEMAS DE PACEMAKERS ÀS INSTITUIÇÕES E SERVIÇOS DO SERVIÇO NACIONAL DE SAÚDE",FALSE
40050/2016 - KIT SUTURA HEMORROIDARIA THD + DOPPLER,Ajuste Direto Regime Geral,Aquisição de bens móveis,"33140000-3, Material médico de consumo","Centro Hospitalar Barreiro Montijo, E. P. E. (509186998)",MOONSURGE CIRURGIA E INOVAÇÃO (506657035),"15.080,00 €",17-03-2017,10-03-2016,365 dias,"Portugal, Setúbal, Barreiro","Artigo 20.º, n.º 1, alínea a) do Código dos Contratos Públicos",31-12-2016,"15.080,00 €","","",,Não aplicável.,Não aplicável.,FALSE
110012/2016 - LENTES INTRAOCULARES,Concurso público,Aquisição de bens móveis,"33731110-7, Lentes intraoculares","Centro Hospitalar Barreiro Montijo, E. P. E. (509186998)",Abbott Medical Optics Spain S.L. (980262364),"89.452,25 €",17-03-2017,28-01-2016,365 dias,"Portugal, Setúbal, Barreiro","Artigo 20.º, n.º 1, alínea b) do Código dos Contratos Públicos",31-12-2016,"25.918,29 €","",ALTERAÇÕES NAS QUANTIDADES,,Não aplicável.,Não aplicável.,FALSE
110007/2016 - ENCAVILHAMENTO OSTEOSSINTESE E COLUNA,Concurso público,Aquisição de bens móveis,"33141700-7, Material ortopédico","Centro Hospitalar Barreiro Montijo, E. P. E. (509186998)","STRYKER PORTUGAL PRODUTOS MÉDICOS, LDA. (504594214)","121.935,00 €",17-03-2017,12-02-2016,365 dias,"Portugal, Setúbal, Barreiro","Artigo 20.º, n.º 1, alínea b) do Código dos Contratos Públicos",31-12-2016,"97.517,93 €","",ALTERAÇÕES NAS QUANTIDADES,,Não aplicável.,Não aplicável.,FALSE
110006/2016 - PROTESE DE JOELHO,Concurso público,Aquisição de bens móveis,"33141700-7, Material ortopédico","Centro Hospitalar Barreiro Montijo, E. P. E. (509186998)",Johnson & Johnson Medical (500153370),"158.017,00 €",17-03-2017,04-01-2016,365 dias,"Portugal, Setúbal, Barreiro","Artigo 20.º, n.º 1, alínea b) do Código dos Contratos Públicos",31-12-2016,"78.810,74 €","",ALTERAÇÕES NAS QUANTIDADES,,Não aplicável.,Não aplicável.,FALSE
40004/2016- PAPEIS P/AREA HOTELEIRA 2016,Ajuste Direto Regime Geral,Aquisição de bens móveis,"33198000-4, Artigos de papel para uso hospitalar","CHBM - Centro Hospital Barreiro Montijo, EPE (509186998)","ARTUR & GUERREIRO, LDA (503897787)","16.216,25 €",17-03-2017,18-12-2015,365 dias,"Portugal, Setúbal, Barreiro","Artigo 20.º, n.º 1, alínea a) do Código dos Contratos Públicos",28-11-2016,"18.802,00 €","",Aumento das Necessidades face ao consumo estimado,,Não aplicável.,Não aplicável.,FALSE
4S0017/2017 ELECTRICIDADE P PERIODO DE 01/01/2017 A 15/01/2017 (ENQUANTO AGUARDA CONCLUSÃO PROCESSO AO ABRIGO AQ),Ajuste Direto Regime Geral,Aquisição de bens móveis,"09310000-5, Electricidade","Centro Hospitalar Barreiro Montijo, E. P. E. (509186998)","EDP COMERCIAL - COMERCIALIZAÇÃO DE ENERGIA, S.A. (503504564)","20.850,00 €",17-03-2017,03-01-2017,15 dias,"Portugal, Setúbal, Barreiro","Artigo 20.º, n.º 1, alínea a) do Código dos Contratos Públicos",31-01-2017,"7.730,91 €","",O procedimento de contratação ao abrigo de AQ ficou concluido antes do prazo previsto,,Não aplicável.,Não aplicável.,FALSE
110005/2016 - PROTESE DE ANCA,Concurso público,Aquisição de bens móveis,"33141700-7, Material ortopédico","Centro Hospitalar Barreiro Montijo, E. P. E. (509186998)",Expomédica (501886621),"5.047,07 €",17-03-2017,06-01-2016,365 dias,"Portugal, Setúbal, Barreiro","Artigo 20.º, n.º 1, alínea b) do Código dos Contratos Públicos",31-12-2016,"5.047,07 €","",ALTERAÇÃO NAS QUANTIDADES,,Não aplicável.,Não aplicável.,FALSE
40004/2016- PAPEIS PARA ÁREA HOTELEIRA 2016,Ajuste Direto Regime Geral,Aquisição de bens móveis,"33198000-4, Artigos de papel para uso hospitalar","CHBM - Centro Hospital Barreiro Montijo, EPE (509186998)",M.U.C.-MATERIAL DE UTILIDADE CLINICA LDA (502379308),"53,20 €",17-03-2017,18-12-2015,365 dias,"Portugal, Setúbal, Barreiro","Artigo 20.º, n.º 1, alínea a) do Código dos Contratos Públicos",24-05-2016,"53,20 €","","",,Não aplicável.,Não aplicável.,FALSE
110005/2016 - PROTESE DE ANCA,Concurso público,Aquisição de bens móveis,"33141700-7, Material ortopédico","Centro Hospitalar Barreiro Montijo, E. P. E. (509186998)",Johnson & Johnson Medical (500153370),"141.615,00 €",17-03-2017,06-01-2016,365 dias,"Portugal, Setúbal, Barreiro","Artigo 20.º, n.º 1, alínea b) do Código dos Contratos Públicos",31-12-2016,"64.875,38 €","",ALTERAÇÃO NAS QUANTIDADES,,Não aplicável.,Não aplicável.,FALSE
40035/2016- ROUPA HOSPITALAR (40067/2015),Ajuste Direto Regime Geral,Aquisição de bens móveis,"18000000-9, Vestuário, calçado, malas e artigos de viagem, acessórios","Centro Hospitalar Barreiro Montijo, E. P. E. (509186998)","RIBEIRO & CARLOS, LDA - MUNDIFATO (502383542)","12.191,50 €",16-03-2017,06-01-2016,365 dias,"Portugal, Setúbal, Barreiro","Artigo 20.º, n.º 1, alínea a) do Código dos Contratos Públicos",03-03-2016,"12.067,24 €","",Alteração de quantidades,,Não aplicável.,Não aplicável.,FALSE
40028/2016-IMPRESOS E ENVELOPES 2016 II,Ajuste Direto Regime Geral,Aquisição de bens móveis,"22000000-0, Material impresso e afins","Centro Hospitalar Barreiro Montijo, E. P. E. (509186998)","Louro  Artes Gráficas, Lda (503700479)","14.408,00 €",16-03-2017,18-12-2015,365 dias,"Portugal, Setúbal, Barreiro","Artigo 20.º, n.º 1, alínea a) do Código dos Contratos Públicos",27-09-2016,"12.379,05 €","",Necessidade de consumo inferior ao estimado.,,Não aplicável.,Não aplicável.,FALSE
40057/2016 - MATERIAL PARA ORTOPEDIA,Ajuste Direto Regime Geral,Aquisição de bens móveis,"33140000-3, Material médico de consumo","CHBM - Centro Hospital Barreiro Montijo, EPE (509186998)","STRYKER PORTUGAL - PRODUTOS MEDICOS, UNIPESSOAL,LDA. (504594214)","3.060,00 €",16-03-2017,17-05-2016,365 dias,"Portugal, Setúbal, Barreiro","Artigo 20.º, n.º 1, alínea a) do Código dos Contratos Públicos",31-12-2016,"1.912,52 €","",ALTERAÇÃO NAS QUANTIDADES,,Não aplicável.,Não aplicável.,FALSE
40057/2016 - MATERIAL PARA ORTOPEDIA,Ajuste Direto Regime Geral,Aquisição de bens móveis,"33140000-3, Material médico de consumo","CHBM - Centro Hospital Barreiro Montijo, EPE (509186998)","EXPOMEDICA SOC. EXPORTAÇAO IMPORT.MAT. MEDIC., LDA (501886621)","314,40 €",16-03-2017,17-05-2016,365 dias,"Portugal, Setúbal, Barreiro","Artigo 20.º, n.º 1, alínea a) do Código dos Contratos Públicos",31-12-2016,"144,78 €","",ALTERAÇÃO NAS QUANTIDADES,,Não aplicável.,Não aplicável.,FALSE
40057/2016 - MATERIAL PARA ORTOPEDIA,Ajuste Direto Regime Geral,Aquisição de bens móveis,"33140000-3, Material médico de consumo","CHBM - Centro Hospital Barreiro Montijo, EPE (509186998)",EUROSINTESE (503491403),"17.126,80 €",16-03-2017,17-05-2016,365 dias,"Portugal, Setúbal, Barreiro","Artigo 20.º, n.º 1, alínea a) do Código dos Contratos Públicos",31-12-2016,"1.959,65 €","",ALTERAÇÕES NAS QUANTIDADES,,Não aplicável.,Não aplicável.,FALSE
4O0013/2016 REMODELAÇÃO COBERTURA DA ALA DA PEDIAT Cópia,Ajuste Direto Regime Geral,Empreitadas de obras públicas,"45200000-9, Obras de construção total ou parcial e de engenharia civil","CHBM - Centro Hospital Barreiro Montijo, EPE (509186998)","FACHAIMPER, LDA (505489023)","32.925,01 €",16-03-2017,09-08-2016,35 dias,"Portugal, Setúbal, Barreiro","Artigo 19.º, alínea a) do Código dos Contratos Públicos","","","","",,Não aplicável.,Não aplicável.,FALSE
40057/2016 - MATERIAL PARA ORTOPEDIA,Ajuste Direto Regime Geral,Aquisição de bens móveis,"33140000-3, Material médico de consumo","CHBM - Centro Hospital Barreiro Montijo, EPE (509186998)","B BRAUN MEDICAL, LDA (501506543)","510,40 €",16-03-2017,17-05-2016,365 dias,"Portugal, Setúbal, Barreiro","Artigo 20.º, n.º 1, alínea a) do Código dos Contratos Públicos",31-12-2016,"50,40 €","",ALTERAÇÃO NAS QUANTIDADES,,Não aplicável.,Não aplicável.,FALSE
40055/2016 - MATERIAL PARA CORRECÇÃO DE INCONTINÊNCIA URINÁRIA,Ajuste Direto Regime Geral,Aquisição de bens móveis,"33140000-3, Material médico de consumo","CHBM - Centro Hospital Barreiro Montijo, EPE (509186998)",ENDOTÉCNICA - Soluções Hospitalares  (503818348),"41.840,00 €",16-03-2017,19-04-2016,365 dias,"Portugal, Setúbal, Barreiro","Artigo 20.º, n.º 1, alínea a) do Código dos Contratos Públicos",31-12-2016,"9.750,00 €","",ALTERAÇÃO NAS QUANTIDADES,,Não aplicável.,Não aplicável.,FALSE
DM Entubação,Ajuste Direto Regime Geral,Aquisição de bens móveis,"33141641-5, Sondas","CHBM - Centro Hospital Barreiro Montijo, EPE (509186998)","MBA PORTUGAL, S.A. (504445960)","230,00 €",16-03-2017,08-03-2016,365 dias,"Portugal, Setúbal, Barreiro","Artigo 20.º, n.º 1, alínea a) do Código dos Contratos Públicos",30-12-2016,"195,00 €","",redução consumos,,Não aplicável.,Não aplicável.,FALSE
40003/2016- ETIQUETAS 2016,Ajuste Direto Regime Geral,Aquisição de bens móveis,"30192800-9, Etiquetas autocolantes","CHBM - Centro Hospital Barreiro Montijo, EPE (509186998)","SARSTEDT - TECNOLOGIA DE LABORATORIO,LDA (503019461)","682,50 €",16-03-2017,18-12-2015,365 dias,"Portugal, Setúbal, Barreiro","Artigo 20.º, n.º 1, alínea a) do Código dos Contratos Públicos",20-06-2016,"289,27 €","",Necessidade de consumo inferior ao estimado.,,Não aplicável.,Não aplicável.,FALSE
DM Entubação,Ajuste Direto Regime Geral,Aquisição de bens móveis,"33141641-5, Sondas","CHBM - Centro Hospital Barreiro Montijo, EPE (509186998)",MEDTRONIC PORTUGAL COMERCIO E DIST. APARELHOS MED. (504223933),"2.946,60 €",16-03-2017,08-03-2016,365 dias,"Portugal, Setúbal, Barreiro","Artigo 20.º, n.º 1, alínea a) do Código dos Contratos Públicos",30-12-2016,"1.827,50 €","",redução consumos,,Não aplicável.,Não aplicável.,FALSE
DM Entubação,Ajuste Direto Regime Geral,Aquisição de bens móveis,"33141641-5, Sondas","CHBM - Centro Hospital Barreiro Montijo, EPE (509186998)",Intersurgical - Portugal (503480045),"3.474,83 €",16-03-2017,08-03-2016,365 dias,"Portugal, Setúbal, Barreiro","Artigo 20.º, n.º 1, alínea a) do Código dos Contratos Públicos",30-12-2016,"2.551,60 €","",redução de consumos,,Não aplicável.,Não aplicável.,FALSE
40003/2016- ETIQUETAS 2016,Ajuste Direto Regime Geral,Aquisição de bens móveis,"30192800-9, Etiquetas autocolantes","CHBM - Centro Hospital Barreiro Montijo, EPE (509186998)",Dimor (500730741),"720,00 €",16-03-2017,18-12-2015,365 dias,"Portugal, Setúbal, Barreiro","Artigo 20.º, n.º 1, alínea a) do Código dos Contratos Públicos",17-11-2016,"288,00 €","",Necessidade de consumo inferir ao estimado.,,Não aplicável.,Não aplicável.,FALSE
40026/2016 - MATERIAL PARA CORRECÇÃO DE HÉRNIAS,Ajuste Direto Regime Geral,Aquisição de bens móveis,"33140000-3, Material médico de consumo","CHBM - Centro Hospital Barreiro Montijo, EPE (509186998)","B BRAUN MEDICAL, LDA (501506543)","4.298,00 €",16-03-2017,29-04-2016,365 dias,"Portugal, Setúbal, Barreiro","Artigo 20.º, n.º 1, alínea a) do Código dos Contratos Públicos",31-12-2016,"1.383,17 €","",ALTERAÇÃO NAS QUANTIDADES,,Não aplicável.,Não aplicável.,FALSE
40046/2016 - POSIÇÕES DESERTAS - REAGENTES P/ IMUNOHEMOTERAPIA,Ajuste Direto Regime Geral,Aquisição de bens móveis,"33696500-0, Reagentes de laboratório","Centro Hospitalar Barreiro Montijo, E. P. E. (509186998)","BIO-RAD LABORATORIES, LDA (501301321)","609,20 €",16-03-2017,19-04-2016,365 dias,"Portugal, Setúbal, Barreiro","Artigo 20.º, n.º 1, alínea a) do Código dos Contratos Públicos",31-12-2016,"72,40 €","",Necessidade inferior ao previsto,,Não aplicável.,Não aplicável.,FALSE
40026/2016 - MATERIAL PARA CORECÇÃO DE HÉRNIAS,Ajuste Direto Regime Geral,Aquisição de bens móveis,"33140000-3, Material médico de consumo","CHBM - Centro Hospital Barreiro Montijo, EPE (509186998)",MEDTRONIC PORTUGAL LDA (504223933),"8.180,00 €",16-03-2017,29-04-2016,365 dias,"Portugal, Setúbal, Barreiro","Artigo 20.º, n.º 1, alínea a) do Código dos Contratos Públicos",31-12-2016,"1.982,11 €","",ALTERAÇÕES NAS QUANTIDADES,,Não aplicável.,Não aplicável.,FALSE
DM Entubação,Ajuste Direto Regime Geral,Aquisição de bens móveis,"33141641-5, Sondas","CHBM - Centro Hospital Barreiro Montijo, EPE (509186998)",OVERPHARMA - PRODUTOS MEDICOS E FARM.              (505792362),"110,16 €",16-03-2017,08-03-2016,365 dias,"Portugal, Setúbal, Barreiro","Artigo 20.º, n.º 1, alínea a) do Código dos Contratos Públicos",30-12-2016,"576,00 €","",redução de consumos,,Não aplicável.,Não aplicável.,FALSE
40003/2016- ETIQUETAS 2016,Ajuste Direto Regime Geral,Aquisição de bens móveis,"30192800-9, Etiquetas autocolantes","CHBM - Centro Hospital Barreiro Montijo, EPE (509186998)","DATALABEL PORTUGAL , LDA (506448967)","9.532,73 €",16-03-2017,18-12-2015,365 dias,"Portugal, Setúbal, Barreiro","Artigo 20.º, n.º 1, alínea a) do Código dos Contratos Públicos",13-12-2016,"8.568,89 €","",Necessidade de consumo inferior à estimada.,,Não aplicável.,Não aplicável.,FALSE
40026/2016 - MATERIAL PARA CORRECÇÃO DE HÉRNIAS,Ajuste Direto Regime Geral,Aquisição de bens móveis,"33140000-3, Material médico de consumo","CHBM - Centro Hospital Barreiro Montijo, EPE (509186998)","C. R. BARD PORTUGAL, LDA (502438274)","23.020,00 €",16-03-2017,29-04-2016,365 dias,"Portugal, Setúbal, Barreiro","Artigo 20.º, n.º 1, alínea a) do Código dos Contratos Públicos",31-12-2016,"8.747,16 €","",ALTERAÇÃO NAS QUANTIDADES,,Não aplicável.,Não aplicável.,FALSE
40046/2016 - POSIÇÕES DESERTAS - REAGENTES IMUNOHEMOTERAPIA,Ajuste Direto Regime Geral,Aquisição de bens móveis,"33696500-0, Reagentes de laboratório","Centro Hospitalar Barreiro Montijo, E. P. E. (509186998)",Menarini diagnosticos Lda. (502610069),"8.694,99 €",16-03-2017,19-04-2016,365 dias,"Portugal, Setúbal, Barreiro","Artigo 20.º, n.º 1, alínea a) do Código dos Contratos Públicos",31-12-2016,"4.990,41 €","",Necessidade inferior ao previsto,,Não aplicável.,Não aplicável.,FALSE
Ajuste directo,Ajuste Direto Regime Geral,Aquisição de bens móveis,"33141641-5, Sondas","CHBM - Centro Hospital Barreiro Montijo, EPE (509186998)",SMITHS MEDICAL PORTUGAL LDA (507445937),"916,00 €",16-03-2017,08-03-2016,365 dias,"Portugal, Setúbal, Barreiro","Artigo 20.º, n.º 1, alínea a) do Código dos Contratos Públicos",30-12-2016,"650,40 €","",redução consumos,,Não aplicável.,Não aplicável.,FALSE
DM Entubação,Ajuste Direto Regime Geral,Aquisição de bens móveis,"33141641-5, Sondas","CHBM - Centro Hospital Barreiro Montijo, EPE (509186998)","Anastácio Saldanha Unip., Lda. (505804441)","6.062,16 €",16-03-2017,08-03-2016,365 dias,"Portugal, Setúbal, Barreiro","Artigo 20.º, n.º 1, alínea a) do Código dos Contratos Públicos",30-12-2016,"4.443,75 €","",redução de consumos,,Não aplicável.,Não aplicável.,FALSE
DM Entubação,Ajuste Direto Regime Geral,Aquisição de bens móveis,"33141641-5, Sondas","CHBM - Centro Hospital Barreiro Montijo, EPE (509186998)",Vygon (503232785),"98,08 €",16-03-2017,08-03-2016,365 dias,"Portugal, Setúbal, Barreiro","Artigo 20.º, n.º 1, alínea a) do Código dos Contratos Públicos",30-12-2016,"91,95 €","",redução de consumos,,Não aplicável.,Não aplicável.,FALSE
40025/2016 - MATERIAL PARA FACOEMULSIFICAÇÃO E VITRECTOMIA,Ajuste Direto Regime Geral,Aquisição de bens móveis,"33140000-3, Material médico de consumo","Centro Hospitalar Barreiro Montijo, E. P. E. (509186998)",ALCON PORTUGAL-PROD.EQUIP.OFTALMOLOGICOS (501251685),"11.695,02 €",16-03-2017,01-04-2016,365 dias,"Portugal, Setúbal, Barreiro","Artigo 20.º, n.º 1, alínea a) do Código dos Contratos Públicos",31-12-2016,"11.695,02 €","",ALTERAÇÃO NAS QUANTIDADES,,Não aplicável.,Não aplicável.,FALSE
40025/2016 - MATERIAL PARA FACOEMULSIFICAÇÃO E VITRECTOMIA,Ajuste Direto Regime Geral,Aquisição de bens móveis,"33140000-3, Material médico de consumo","Centro Hospitalar Barreiro Montijo, E. P. E. (509186998)",Abbott Medical Optics Spain S.L. (980262364),"29.028,00 €",16-03-2017,01-04-2016,365 dias,"Portugal, Setúbal, Barreiro","Artigo 20.º, n.º 1, alínea a) do Código dos Contratos Públicos",31-12-2016,"29.028,00 €","","",,Não aplicável.,Não aplicável.,FALSE
40062/2016 Reservatórios p terapia pressão negativa,Ajuste Direto Regime Geral,Aquisição de bens móveis,"33000000-0, Equipamento médico, medicamentos e produtos para cuidados pessoais","Centro Hospitalar Barreiro Montijo, E. P. E. (509186998)","JMV PRODUTOS HOSPITALARES, LDA (501887148)","8.250,00 €",16-03-2017,10-03-2016,365 dias,"Portugal, Setúbal, Barreiro","Artigo 20.º, n.º 1, alínea a) do Código dos Contratos Públicos",30-12-2016,"2.370,30 €","",redução de consunos,,Não aplicável.,Não aplicável.,FALSE
40062/2016 Reservatórios p terapia pressão negativa,Ajuste Direto Regime Geral,Aquisição de bens móveis,"33000000-0, Equipamento médico, medicamentos e produtos para cuidados pessoais","Centro Hospitalar Barreiro Montijo, E. P. E. (509186998)",EXPOMEDICA                                         (501886621),"4.420,00 €",16-03-2017,10-03-2016,365 dias,"Portugal, Setúbal, Barreiro","Artigo 20.º, n.º 1, alínea a) do Código dos Contratos Públicos",30-12-2016,"5.550,00 €","",aumento de consumo,,Não aplicável.,Não aplicável.,FALSE
40024/2016 - MATERIAL PARA ANESTESIA,Ajuste Direto Regime Geral,Aquisição de bens móveis,"33140000-3, Material médico de consumo","CHBM - Centro Hospital Barreiro Montijo, EPE (509186998)","TELEFLEX MEDICAL, S.A. (980249783)","95,00 €",16-03-2017,24-03-2016,365 dias,"Portugal, Setúbal, Barreiro","Artigo 20.º, n.º 1, alínea a) do Código dos Contratos Públicos",31-12-2016,"280,50 €","",ALTERAÇÃO NAS QUANTIDADES,,Não aplicável.,Não aplicável.,FALSE
40024/2016 - MATERIAL PARA ANESTESIA,Ajuste Direto Regime Geral,Aquisição de bens móveis,"33140000-3, Material médico de consumo","CHBM - Centro Hospital Barreiro Montijo, EPE (509186998)",SMITHS MEDICAL PORTUGAL LDA (507445937),"1.254,40 €",16-03-2017,24-03-2016,365 dias,"Portugal, Setúbal, Barreiro","Artigo 20.º, n.º 1, alínea a) do Código dos Contratos Públicos",31-12-2016,"860,00 €","",ALTERAÇÃO NAS QUANTIDADES,,Não aplicável.,Não aplicável.,FALSE
40006/2016 Mascaras de imobilização e liga metálica,Ajuste Direto Regime Geral,Aquisição de bens móveis,"33000000-0, Equipamento médico, medicamentos e produtos para cuidados pessoais","Centro Hospitalar Barreiro Montijo, E. P. E. (509186998)",Ibervoxel (506716899),"774,00 €",16-03-2017,10-02-2016,365 dias,"Portugal, Setúbal, Barreiro","Artigo 20.º, n.º 1, alínea a) do Código dos Contratos Públicos",30-12-2016,"710,00 €","",diminuição de consumos,,Não aplicável.,Não aplicável.,FALSE
40024/2016 - MATERIAL PARA ANESTESIA,Ajuste Direto Regime Geral,Aquisição de bens móveis,"33140000-3, Material médico de consumo","CHBM - Centro Hospital Barreiro Montijo, EPE (509186998)","MEDTRONIC PORTUGAL, LDA. (504223933)","87,60 €",16-03-2017,24-03-2016,365 dias,"Portugal, Setúbal, Barreiro","Artigo 20.º, n.º 1, alínea a) do Código dos Contratos Públicos",31-12-2016,"1.095,00 €","",ALTERAÇÃO NAS QUANTIDADES,,Não aplicável.,Não aplicável.,FALSE
40006/2016 Mascaras de imobilização e liga metálica,Ajuste Direto Regime Geral,Aquisição de bens móveis,"33000000-0, Equipamento médico, medicamentos e produtos para cuidados pessoais","Centro Hospitalar Barreiro Montijo, E. P. E. (509186998)","ABGT, Unipessoal (510517536)","7.650,00 €",16-03-2017,10-02-2016,365 dias,"Portugal, Setúbal, Barreiro","Artigo 20.º, n.º 1, alínea a) do Código dos Contratos Públicos",30-12-2016,"7.689,60 €","",acerto de embalagem,,Não aplicável.,Não aplicável.,FALSE
4SI0031/2016 - Auditorias Financeiras Completas,Ao abrigo de acordo-quadro (art.º 258.º),Aquisição de serviços,"73000000-2, Serviços de investigação e desenvolvimento e serviços de consultoria conexos","Centro Hospitalar Barreiro Montijo, E. P. E. (509186998)","JOÃO CIPRIANO & ASSOCIADOS, SROC LDª (503342742)","813,01 €",16-03-2017,05-04-2016,20 dias,"Portugal, Setúbal, Barreiro","Artigo 20.º, n.º 1, alínea a) do Código dos Contratos Públicos",07-04-2016,"813,01 €","","",,1487168,CELEBRAÇÃO DE ACORDO QUADRO PARA PRESTAÇÃO DE SERVIÇOS DE AUDITORIAS FINANCEIRAS,FALSE
40024/2016 - MATERIAL PARA ANESTESIA,Ajuste Direto Regime Geral,Aquisição de bens móveis,"33140000-3, Material médico de consumo","CHBM - Centro Hospital Barreiro Montijo, EPE (509186998)","MBA PORTUGAL, S.A. (504445960)","373,50 €",16-03-2017,24-03-2016,365 dias,"Portugal, Setúbal, Barreiro","Artigo 20.º, n.º 1, alínea a) do Código dos Contratos Públicos",31-12-2016,"489,00 €","",ALTERAÇÃO NAS QUANTIDADES,,Não aplicável.,Não aplicável.,FALSE
40024/2016 - MATERIAL PARA ANESTESIA,Ajuste Direto Regime Geral,Aquisição de bens móveis,"33140000-3, Material médico de consumo","CHBM - Centro Hospital Barreiro Montijo, EPE (509186998)",Intersurgical - Portugal (503480045),"11.133,70 €",16-03-2017,24-03-2016,365 dias,"Portugal, Setúbal, Barreiro","Artigo 20.º, n.º 1, alínea a) do Código dos Contratos Públicos",31-12-2016,"9.694,55 €","",ALTERAÇÃO NAS QUANTIDADES,,Não aplicável.,Não aplicável.,FALSE
40023/2016 - MATERIAL PARA CONSUMO GERAL,Ajuste Direto Regime Geral,Aquisição de bens móveis,"33140000-3, Material médico de consumo","CHBM - Centro Hospital Barreiro Montijo, EPE (509186998)","STRYKER PORTUGAL - PRODUTOS MEDICOS, UNIPESSOAL,LDA. (504594214)","408,00 €",16-03-2017,04-03-2016,365 dias,"Portugal, Setúbal, Barreiro","Artigo 20.º, n.º 1, alínea a) do Código dos Contratos Públicos",31-12-2016,"816,00 €","",ALTERAÇÃO NAS QUANTIDADES,,Não aplicável.,Não aplicável.,FALSE
40023/2016 - MATERIAL PARA CONSUMO GERAL,Ajuste Direto Regime Geral,Aquisição de bens móveis,"33140000-3, Material médico de consumo","CHBM - Centro Hospital Barreiro Montijo, EPE (509186998)",RMV - PRODUTOS HOSPITALARES S.A (507866347),"1.838,80 €",16-03-2017,04-03-2016,365 dias,"Portugal, Setúbal, Barreiro","Artigo 20.º, n.º 1, alínea a) do Código dos Contratos Públicos",31-12-2016,"757,30 €","",ALTERAÇÃO NAS QUANTIDADES,,Não aplicável.,Não aplicável.,FALSE
40023/2016 - MATERIAL PARA CONSUMO GERAL,Ajuste Direto Regime Geral,Aquisição de bens móveis,"33140000-3, Material médico de consumo","CHBM - Centro Hospital Barreiro Montijo, EPE (509186998)","OFTALDATA - PRODUTOS P\ OFTALMOLOGIA, LDA (504887459)","374,80 €",16-03-2017,04-03-2016,365 dias,"Portugal, Setúbal, Barreiro","Artigo 20.º, n.º 1, alínea a) do Código dos Contratos Públicos",31-12-2016,"151,80 €","",ALTERAÇÃO NAS QUANTIDADES,,Não aplicável.,Não aplicável.,FALSE
40023/2016 - MATERIAL PARA CONSUMO GERAL,Ajuste Direto Regime Geral,Aquisição de bens móveis,"33140000-3, Material médico de consumo","CHBM - Centro Hospital Barreiro Montijo, EPE (509186998)",MEDICINÁLIA CORMEDICA (500684324),"1.124,70 €",14-03-2017,04-03-2016,365 dias,"Portugal, Setúbal, Barreiro","Artigo 20.º, n.º 1, alínea a) do Código dos Contratos Públicos",31-12-2016,"644,00 €","",ALTERAÇÃO NAS QUANTIDADES,,Não aplicável.,Não aplicável.,FALSE
40023/2016 - MATERIAL PARA CONSUMO GERAL,Ajuste Direto Regime Geral,Aquisição de bens móveis,"33140000-3, Material médico de consumo","CHBM - Centro Hospital Barreiro Montijo, EPE (509186998)",M.U.C.-MATERIAL DE UTILIDADE CLINICA LDA (502379308),"134,00 €",14-03-2017,04-03-2016,365 dias,"Portugal, Setúbal, Barreiro","Artigo 20.º, n.º 1, alínea a) do Código dos Contratos Públicos",31-12-2016,"","",ALTERAÇÃO NAS QUANTIDADES,,Não aplicável.,Não aplicável.,FALSE
40023/2016 - MATERIAL PARA CONSUMO GERAL,Ajuste Direto Regime Geral,Aquisição de bens móveis,"33140000-3, Material médico de consumo","CHBM - Centro Hospital Barreiro Montijo, EPE (509186998)",Hospitex Mat. Hospitalar (501909842),"2.721,50 €",14-03-2017,04-03-2016,365 dias,"Portugal, Setúbal, Barreiro","Artigo 20.º, n.º 1, alínea a) do Código dos Contratos Públicos",31-12-2016,"1.870,56 €","",ALTERAÇÃO NAS QUANTIDADES,,Não aplicável.,Não aplicável.,FALSE
40023/2016 - MATERIAL PARA CONSUMO GERAL,Ajuste Direto Regime Geral,Aquisição de bens móveis,"33140000-3, Material médico de consumo","CHBM - Centro Hospital Barreiro Montijo, EPE (509186998)",H.R.-PRODUTOS QUIMICOS LDA (501895558),"188,65 €",14-03-2017,04-03-2016,365 dias,"Portugal, Setúbal, Barreiro","Artigo 20.º, n.º 1, alínea a) do Código dos Contratos Públicos",31-12-2016,"141,00 €","",ALTERAÇÃO NAS QUANTIDADES,,Não aplicável.,Não aplicável.,FALSE
4SI0014/2017 COMBUSTIVEIS RODOVIARIOS PARA MES FEVEREIRO,Ao abrigo de acordo-quadro (art.º 259.º),Aquisição de bens móveis,"09000000-3, Produtos petrolíferos, combustíveis, electricidade e outras fontes de energia","Centro Hospitalar Barreiro Montijo, E. P. E. (509186998)","Petróleos de Portugal - Petrogal, SA (500697370)","2.230,00 €",14-03-2017,30-01-2017,28 dias,"Portugal, Setúbal, Barreiro",Artigo 259.º do Código dos Contratos Públicos,28-02-2017,"1.903,66 €","",consumo total abaixo do inicialomente estimado,,400324,Acordo quadro de fornecimento de combustíveis rodoviários,FALSE
40023/2016 - MATERIAL PARA CONSUMO GERAL,Ajuste Direto Regime Geral,Aquisição de bens móveis,"33140000-3, Material médico de consumo","CHBM - Centro Hospital Barreiro Montijo, EPE (509186998)",EXPOMEDICA                                         (501886621),"19,00 €",14-03-2017,04-03-2016,365 dias,"Portugal, Setúbal, Barreiro","Artigo 20.º, n.º 1, alínea a) do Código dos Contratos Públicos",31-12-2016,"","",ALTERAÇÃO NAS QUANTIDADES,,Não aplicável.,Não aplicável.,FALSE
4DS0058/2017 COMBUSTIVEIS RODOVIARIOS PARA MES JANEIRO,Ao abrigo de acordo-quadro (art.º 259.º),Aquisição de bens móveis,"09000000-3, Produtos petrolíferos, combustíveis, electricidade e outras fontes de energia","Centro Hospitalar Barreiro Montijo, E. P. E. (509186998)","Petróleos de Portugal - Petrogal, SA (500697370)","2.265,44 €",14-03-2017,23-12-2016,31 dias,"Portugal, Setúbal, Barreiro",Artigo 259.º do Código dos Contratos Públicos,31-01-2017,"2.265,44 €","","",,400324,Acordo quadro de fornecimento de combustíveis rodoviários,FALSE
40023/2016 - MATERIAL PARA CONSUMO GERAL,Ajuste Direto Regime Geral,Aquisição de bens móveis,"33140000-3, Material médico de consumo","CHBM - Centro Hospital Barreiro Montijo, EPE (509186998)",Eurocasmédica (503322105),"337,50 €",14-03-2017,04-03-2016,365 dias,"Portugal, Setúbal, Barreiro","Artigo 20.º, n.º 1, alínea a) do Código dos Contratos Públicos",31-12-2016,"140,00 €","",ALTERAÇÃO DE QUANTIDADES,,Não aplicável.,Não aplicável.,FALSE
40023/2016 - MATERIAL PARA CONSUMO GERAL,Ajuste Direto Regime Geral,Aquisição de bens móveis,"33140000-3, Material médico de consumo","CHBM - Centro Hospital Barreiro Montijo, EPE (509186998)",B BRAUN MEDICAL LDA (501506543),"408,35 €",14-03-2017,04-03-2016,365 dias,"Portugal, Setúbal, Barreiro","Artigo 20.º, n.º 1, alínea a) do Código dos Contratos Públicos",31-12-2016,"","",ALTERAÇÃO NAS QUANTIDADES,,Não aplicável.,Não aplicável.,FALSE
40023/2016 - MATERIAL PARA CONSUMO GERAL,Ajuste Direto Regime Geral,Aquisição de bens móveis,"33140000-3, Material médico de consumo","CHBM - Centro Hospital Barreiro Montijo, EPE (509186998)","Anastácio Saldanha Unip., Lda. (505804441)","4.839,00 €",14-03-2017,04-03-2016,365 dias,"Portugal, Setúbal, Barreiro","Artigo 20.º, n.º 1, alínea a) do Código dos Contratos Públicos",31-12-2016,"3.253,60 €","",ALTERAÇÃO NAS QUANTIDADES,,Não aplicável.,Não aplicável.,FALSE
40021/2016- MATERIAL PARA UROLOGIA,Ajuste Direto Regime Geral,Aquisição de bens móveis,"33190000-8, Dispositivos e produtos médicos variados","CHBM - Centro Hospital Barreiro Montijo, EPE (509186998)",BIOSONDA-COMERC MATERIAL HOSPITALAR (501463313),"4.595,00 €",14-03-2017,26-02-2016,365 dias,"Portugal, Setúbal, Barreiro","Artigo 20.º, n.º 1, alínea a) do Código dos Contratos Públicos",31-12-2016,"3.540,00 €","",ALTERAÇÃO NAS QUANTIDADES,,Não aplicável.,Não aplicável.,FALSE
40021/2016 - MATERIAL PARA UROLOGIA,Ajuste Direto Regime Geral,Aquisição de bens móveis,"33190000-8, Dispositivos e produtos médicos variados","CHBM - Centro Hospital Barreiro Montijo, EPE (509186998)","ENDOTÉCNICA - Material Cirurgico, Lda (503818348)","2.448,00 €",14-03-2017,26-02-2016,365 dias,"Portugal, Setúbal, Barreiro","Artigo 20.º, n.º 1, alínea a) do Código dos Contratos Públicos",31-12-2016,"1.160,00 €","",ALTERAÇÃO NAS QUANTIDADES,,Não aplicável.,Não aplicável.,FALSE
40021/2016 - MATERIAL PARA UROLOGIA,Ajuste Direto Regime Geral,Aquisição de bens móveis,"33190000-8, Dispositivos e produtos médicos variados","CHBM - Centro Hospital Barreiro Montijo, EPE (509186998)",B BRAUN MEDICAL LDA (501506543),"1.724,00 €",14-03-2017,26-02-2016,365 dias,"Portugal, Setúbal, Barreiro","Artigo 20.º, n.º 1, alínea a) do Código dos Contratos Públicos",31-12-2016,"645,30 €","",ALTERAÇÃO DE QUANTIDADES,,Não aplicável.,Não aplicável.,FALSE
40021/2016 - MATERIAL PARA UROLOGIA,Ajuste Direto Regime Geral,Aquisição de bens móveis,"33190000-8, Dispositivos e produtos médicos variados","CHBM - Centro Hospital Barreiro Montijo, EPE (509186998)",Teprel - Equipamentos Médicos (502262184),"1.980,28 €",14-03-2017,26-02-2016,365 dias,"Portugal, Setúbal, Barreiro","Artigo 20.º, n.º 1, alínea a) do Código dos Contratos Públicos",31-12-2016,"1.005,72 €","",ALTERAÇÃO NAS QUANTIDADES,,Não aplicável.,Não aplicável.,FALSE
40021/2016- MATERIAL PARA UROLOGIA,Ajuste Direto Regime Geral,Aquisição de bens móveis,"33190000-8, Dispositivos e produtos médicos variados","CHBM - Centro Hospital Barreiro Montijo, EPE (509186998)","COLOPLAST PORTUGAL, SOC. UNIP., LDA. (503989037)","15.924,53 €",14-03-2017,26-02-2016,365 dias,"Portugal, Setúbal, Barreiro","Artigo 20.º, n.º 1, alínea a) do Código dos Contratos Públicos",31-12-2016,"12.077,22 €","",ALTERAÇÃO DE QUANTIDADES,,Não aplicável.,Não aplicável.,FALSE
40021/2016 - MATERIAL PARA UROLOGIA,Ajuste Direto Regime Geral,Aquisição de bens móveis,"33190000-8, Dispositivos e produtos médicos variados","CHBM - Centro Hospital Barreiro Montijo, EPE (509186998)","TELEFLEX MEDICAL, S.A. (980249783)","93,19 €",14-03-2017,26-02-2016,365 dias,"Portugal, Setúbal, Barreiro","Artigo 20.º, n.º 1, alínea a) do Código dos Contratos Públicos",31-12-2016,"74,50 €","",ALTERAÇÃO DE QUANTIDADES,,Não aplicável.,Não aplicável.,FALSE
40021/2016 - MATERIAL PARA UROLOGIA,Ajuste Direto Regime Geral,Aquisição de bens móveis,"33140000-3, Material médico de consumo","CHBM - Centro Hospital Barreiro Montijo, EPE (509186998)","AMS IBERICA,SL (980223598)","165,00 €",13-03-2017,26-02-2016,365 dias,"Portugal, Setúbal, Barreiro","Artigo 20.º, n.º 1, alínea a) do Código dos Contratos Públicos",31-12-2016,"165,00 €","","",,Não aplicável.,Não aplicável.,FALSE
"110028/2016 - Aquisição de Reagentes para Microbiologia, com colocação de equipamentos para o ano de 2016 ",Concurso público,Aquisição de bens móveis,"33696500-0, Reagentes de laboratório","Centro Hospitalar Barreiro Montijo, E. P. E. (509186998)",BIOMERIEUX PORTUGAL                                (501524177),"51.218,70 €",13-03-2017,15-04-2016,365 dias,"Portugal, Setúbal, Barreiro","Artigo 20.º, n.º 1, alínea b) do Código dos Contratos Públicos",31-12-2016,"28.598,80 €","",necessidade inferior ao previsto,,Não aplicável.,Não aplicável.,FALSE
4SI0001/2016 FORNECIMENTO DE ELECTRICIDADE PARA O CHBM P ANO 2016,Ao abrigo de acordo-quadro (art.º 259.º),Aquisição de bens móveis,"09310000-5, Electricidade","Centro Hospitalar Barreiro Montijo, E. P. E. (509186998)","EDP COMERCIAL - COMERCIALIZAÇÃO DE ENERGIA, S.A. (503504564)","466.528,64 €",13-03-2017,21-12-2015,366 dias,"Portugal, Setúbal, Barreiro",Artigo 259.º do Código dos Contratos Públicos,31-12-2016,"505.173,36 €","",Consumo efetivo superior ao inicialmente previsto,,1494502,Acordo quadro para o fornecimento de eletricidade em regime de mercado livre para Portugal Continental,FALSE
4SI0034/2016 GAS NATURAL PARA 2016 (ATE ENTRADA NOVO AQ),Ao abrigo de acordo-quadro (art.º 258.º),Aquisição de bens móveis,"09123000-7, Gás natural","Centro Hospitalar Barreiro Montijo, E. P. E. (509186998)","EDP Comercial, SA (503504564)","93.495,93 €",13-03-2017,27-01-2016,91 dias,"Portugal, Setúbal, Barreiro",Artigo 258.º do Código dos Contratos Públicos,31-03-2016,"82.262,98 €","",Consumo efetivo inferior ao inicialmente estimado,,1555095,Acordo quadro para o fornecimento de gás natural em regime de mercado livre para Portugal Continental,FALSE
40061/2016 - AQUISIÇÃO DE REAGENTES PARA QUIMICA/IMUNOQUIMICA E INFECCIOLOGIA,Ajuste Direto Regime Geral,Aquisição de bens móveis,"33696500-0, Reagentes de laboratório","CHBM - Centro Hospital Barreiro Montijo, EPE (509186998)",BATISTA MARQUES DIAGNOSTICA E REAGENTES            (501439110),"860,00 €",13-03-2017,22-06-2016,180 dias,"Portugal, Setúbal, Barreiro","Artigo 20.º, n.º 1, alínea a) do Código dos Contratos Públicos",31-12-2016,"360,00 €","",Necessidade inferior à previsão,,Não aplicável.,Não aplicável.,FALSE
40061/2016 - AQUISIÇÃO DE REAGENTES PARA QUIMICA/IMUNOQUIMICA E INFECCIOLOGIA,Ajuste Direto Regime Geral,Aquisição de bens móveis,"33696500-0, Reagentes de laboratório","CHBM - Centro Hospital Barreiro Montijo, EPE (509186998)","Bio-Rad Laboratories, Lda. (501301321)","300,00 €",13-03-2017,22-06-2016,180 dias,"Portugal, Setúbal, Barreiro","Artigo 20.º, n.º 1, alínea a) do Código dos Contratos Públicos",31-12-2016,"150,00 €","",Necessidade inferior à previsão,,Não aplicável.,Não aplicável.,FALSE
4SI0015/2016 FORNECIMENTO DE GAS NATURAL AO CHBM,Ao abrigo de acordo-quadro (art.º 258.º),Aquisição de bens móveis,"09123000-7, Gás natural","Centro Hospitalar Barreiro Montijo, E. P. E. (509186998)","Galp Power, SA (504723456)","145.879,00 €",13-03-2017,11-02-2016,275 dias,"Portugal, Setúbal, Barreiro",Artigo 258.º do Código dos Contratos Públicos,31-12-2016,"170.055,43 €","",Consumo efetivo superior ao inicialmente estimado,,1555095,Acordo quadro para o fornecimento de gás natural em regime de mercado livre para Portugal Continental,FALSE
40061/2016 - AQUISIÇÃO DE REAGENTES PARA QUIMICA/IMUNOQUIMICA E INFECCIOLOGIA,Ajuste Direto Regime Geral,Aquisição de bens móveis,"33696500-0, Reagentes de laboratório","CHBM - Centro Hospital Barreiro Montijo, EPE (509186998)",BIO PORTUGAL - QUIMICO FARMACEUTICA                (502380543),"3.215,00 €",13-03-2017,22-06-2016,180 dias,"Portugal, Setúbal, Barreiro","Artigo 20.º, n.º 1, alínea a) do Código dos Contratos Públicos",31-12-2016,"923,74 €","",necessidade inferior à previsão,,Não aplicável.,Não aplicável.,FALSE
40061/2016 - AQUISIÇÃO DE REAGENTES PARA QUIMICA/IMUNOQUIMICA E INFECCIOLOGIA,Ajuste Direto Regime Geral,Aquisição de bens móveis,"33696500-0, Reagentes de laboratório","CHBM - Centro Hospital Barreiro Montijo, EPE (509186998)",BDPL  CIENTIFICA-  REAG. E INST. LDA (504527584),"790,52 €",13-03-2017,22-06-2016,180 dias,"Portugal, Setúbal, Barreiro","Artigo 20.º, n.º 1, alínea a) do Código dos Contratos Públicos",31-12-2016,"322,52 €","",Necessidade inferior à previsão,,Não aplicável.,Não aplicável.,FALSE
40061/2016 - AQUISIÇÃO DE REAGENTES PARA QUIMICA/IMUNOQUIMICA E INFECCIOLOGIA,Ajuste Direto Regime Geral,Aquisição de bens móveis,"33696500-0, Reagentes de laboratório","CHBM - Centro Hospital Barreiro Montijo, EPE (509186998)","ALERE,LDA.                                         (502518863)","80,00 €",13-03-2017,22-06-2016,180 dias,"Portugal, Setúbal, Barreiro","Artigo 20.º, n.º 1, alínea a) do Código dos Contratos Públicos",31-12-2016,"","",Não foi necessário a aquisição do reagente,,Não aplicável.,Não aplicável.,FALSE
AQUISIÇÃO DE REAGENTES PARA QUIMICA/IMUNOQUIMICA E INFECCIOLOGIA,Ajuste Direto Regime Geral,Aquisição de bens móveis,"33696500-0, Reagentes de laboratório","CHBM - Centro Hospital Barreiro Montijo, EPE (509186998)","ABBOTT LABORATÓRIOS, LDA.                          (500006148)","6.672,00 €",13-03-2017,22-06-2016,180 dias,"Portugal, Setúbal, Barreiro","Artigo 20.º, n.º 1, alínea a) do Código dos Contratos Públicos",31-12-2016,"3.656,00 €","",Quantidade necessária inferior à estimativa,,Não aplicável.,Não aplicável.,FALSE
40061/2016 - Aquisição de reagentes para Bioquímica e Imunologia,Ajuste Direto Regime Geral,Aquisição de bens móveis,"33696500-0, Reagentes de laboratório","CHBM - Centro Hospital Barreiro Montijo, EPE (509186998)","Siemens Healthcare, Lda (507925173)","1.410,00 €",13-03-2017,22-06-2016,365 dias,"Portugal, Setúbal, Barreiro","Artigo 20.º, n.º 1, alínea a) do Código dos Contratos Públicos",31-12-2016,"","",Não houve necessidade de aquisição do reagente,,Não aplicável.,Não aplicável.,FALSE
