freguesia,acronym,validVotesPercentage,votes,dicofre
Nossa Senhora da Conceição e São Bartolomeu,PS,33.68,224,071406
Nossa Senhora da Conceição e São Bartolomeu,PPD/PSD,19.1,127,071406
Nossa Senhora da Conceição e São Bartolomeu,PCP-PEV,13.68,91,071406
Nossa Senhora da Conceição e São Bartolomeu,B.E.,11.43,76,071406
Nossa Senhora da Conceição e São Bartolomeu,CDS-PP,6.62,44,071406
Nossa Senhora da Conceição e São Bartolomeu,PPM.PPV/CDC,4.51,30,071406
Nossa Senhora da Conceição e São Bartolomeu,A,2.26,15,071406
Nossa Senhora da Conceição e São Bartolomeu,PCTP/MRPP,2.26,15,071406
Nossa Senhora da Conceição e São Bartolomeu,PAN,2.11,14,071406
Nossa Senhora da Conceição e São Bartolomeu,L,1.05,7,071406
Nossa Senhora da Conceição e São Bartolomeu,NC,1.05,7,071406
Nossa Senhora da Conceição e São Bartolomeu,MAS,0.6,4,071406
Nossa Senhora da Conceição e São Bartolomeu,IL,0.45,3,071406
Nossa Senhora da Conceição e São Bartolomeu,PNR,0.45,3,071406
Nossa Senhora da Conceição e São Bartolomeu,PTP,0.3,2,071406
Nossa Senhora da Conceição e São Bartolomeu,PURP,0.3,2,071406
Nossa Senhora da Conceição e São Bartolomeu,PDR,0.15,1,071406
