freguesia,acronym,validVotesPercentage,votes,dicofre
Pombalinho,PS,41.14,72,141203
Pombalinho,PCP-PEV,24,42,141203
Pombalinho,PPD/PSD.CDS-PP,13.14,23,141203
Pombalinho,MPT,8.57,15,141203
Pombalinho,B.E.,7.43,13,141203
Pombalinho,PCTP/MRPP,1.71,3,141203
Pombalinho,PTP,1.71,3,141203
Pombalinho,PAN,1.14,2,141203
Pombalinho,PDA,0.57,1,141203
Pombalinho,PPM,0.57,1,141203
Pombalinho,L,0,0,141203
Pombalinho,MAS,0,0,141203
Pombalinho,PND,0,0,141203
Pombalinho,PNR,0,0,141203
Pombalinho,POUS,0,0,141203
Pombalinho,PPV,0,0,141203
