Objeto do Contrato,Tipo de Procedimento,Tipo(s) de Contrato,CPVs,Entidade(s) Adjudicante(s),Entidade(s) Adjudicatária(s),Preço Contratual,Data de Publicação,Data de Celebração do Contrato,Prazo de Execução,Local de Execução,Fundamentação,Data de Fecho do Contrato,Preço Total Efetivo,Causas das Alterações ao Prazo,Causas das Alterações ao Preço,Estado,N.º registo do Acordo Quadro,Descrição do Acordo Quadro,Procedimento Centralizado
Prestação de Serviços Medicos,Concurso público,Aquisição de serviços,"85100000-0, Serviços de saúde","Administração Regional de Saúde do Algarve, I. P. (503148709)",Kelly Services - Healthcare Unipessoal Lda (510723691),"205.616,00 €",02-03-2016,19-02-2016,314 dias,"Portugal, Faro, Faro","Artigo 20.º, n.º 1, alínea b) do Código dos Contratos Públicos",21-11-2016,"205.587,50 €",,,,Não aplicável.,Não aplicável.,FALSE
AM 16/2016 - Aquisição de reagentes para controlo da qualidade da água para as USP,Ajuste Direto Regime Geral,Aquisição de bens móveis,"33696500-0, Reagentes de laboratório","Administração Regional de Saúde do Algarve, I. P. (503148709)",HANNA INSTRUMENTS PORTUGAL - INSTRUMENTOS E CONTROLE LDA (502540141),"1.182,00 €",24-02-2016,24-02-2016,304 dias,"Portugal, Faro, Faro","Artigo 24.º, n.º 1, alínea e) do Código dos Contratos Públicos",10-03-2016,"1.182,00 €",,,,Não aplicável.,Não aplicável.,FALSE
AM/64/2016 - Aquisição de Cateteres para EUD,Ajuste Direto Regime Geral,Aquisição de bens móveis,"33141200-2, Cateteres","Administração Regional de Saúde do Algarve, I. P. (503148709)",Teprel Equipamentos Médicos Lda (502262184),"5.179,00 €",23-02-2016,18-02-2016,312 dias,"Portugal, Faro, Faro","Artigo 24.º, n.º 1, alínea e) do Código dos Contratos Públicos","","",,,,Não aplicável.,Não aplicável.,FALSE
