freguesia,acronym,validVotesPercentage,votes,dicofre
Seixo,PPD/PSD.CDS-PP,65.85,268,060802
Seixo,PS,12.78,52,060802
Seixo,MPT,7.37,30,060802
Seixo,B.E.,2.95,12,060802
Seixo,PCP-PEV,2.21,9,060802
Seixo,PND,1.72,7,060802
Seixo,L,1.47,6,060802
Seixo,PPV,1.23,5,060802
Seixo,PTP,1.23,5,060802
Seixo,PNR,0.98,4,060802
Seixo,PAN,0.74,3,060802
Seixo,PCTP/MRPP,0.74,3,060802
Seixo,PPM,0.49,2,060802
Seixo,PDA,0.25,1,060802
Seixo,MAS,0,0,060802
Seixo,POUS,0,0,060802
