Objeto do Contrato,Tipo de Procedimento,Tipo(s) de Contrato,CPVs,Entidade(s) Adjudicante(s),Entidade(s) Adjudicatária(s),Preço Contratual,Data de Publicação,Data de Celebração do Contrato,Prazo de Execução,Local de Execução,Fundamentação,Data de Fecho do Contrato,Preço Total Efetivo,Causas das Alterações ao Prazo,Causas das Alterações ao Preço,Estado,N.º registo do Acordo Quadro,Descrição do Acordo Quadro,Procedimento Centralizado
SC/254/2014 - AQUISIÇÃO DE MEDICAMENTOS GERAIS.10,Ao abrigo de acordo-quadro (art.º 259.º),Aquisição de bens móveis,"33690000-3, Medicamentos vários","Administração Regional de Saúde do Algarve, I. P. (503148709)","Bristol - Myers Squibb Farmacêutica Portuguesa, S.A. (500048193)","26,00 €",19-11-2014,19-11-2014,42 dias,"Portugal, Faro, Faro",Artigo 259.º do Código dos Contratos Públicos,25-11-2014,"26,00 €",,"",,513025,"CONCURSO PÚBLICO PARA A CELEBRAÇÃO DE CONTRATOS PÚBLICOS DE APROVISIONAMENTO PARA A ÁREA DA SAÚDE, COM VISTA AO FORNECIMENTO DE MEDICAMENTOS DE CONSUMO GERAL  (FFOSI)- APARELHO CARDIOVASCULAR., ÀS INSTITUIÇÕES E SERVIÇOS DO SERVIÇO NACIONAL DE SAÚDE",FALSE
SC/254/2014 - AQUISIÇÃO DE MEDICAMENTOS GERAIS.10,Ao abrigo de acordo-quadro (art.º 259.º),Aquisição de bens móveis,"33690000-3, Medicamentos vários","Administração Regional de Saúde do Algarve, I. P. (503148709)","Angelini Farmacêutica, Lda. (500583650)","221,00 €",19-11-2014,19-11-2014,42 dias,"Portugal, Faro, Faro",Artigo 259.º do Código dos Contratos Públicos,12-12-2014,"110,50 €",,Quantidades fornecidas.,,513025,"CONCURSO PÚBLICO PARA A CELEBRAÇÃO DE CONTRATOS PÚBLICOS DE APROVISIONAMENTO PARA A ÁREA DA SAÚDE, COM VISTA AO FORNECIMENTO DE MEDICAMENTOS DE CONSUMO GERAL  (FFOSI)- APARELHO CARDIOVASCULAR., ÀS INSTITUIÇÕES E SERVIÇOS DO SERVIÇO NACIONAL DE SAÚDE",FALSE
SC/254/2014 - AQUISIÇÃO DE MEDICAMENTOS GERAIS.10,Ao abrigo de acordo-quadro (art.º 259.º),Aquisição de bens móveis,"33690000-3, Medicamentos vários","Administração Regional de Saúde do Algarve, I. P. (503148709)","Meda Pharma - Produtos Farmacêuticos, S.A. (500082090)","19,41 €",19-11-2014,19-11-2014,42 dias,"Portugal, Faro, Faro",Artigo 259.º do Código dos Contratos Públicos,31-12-2014,"11,19 €",,Quantidades fornecidas.,,513025,"CONCURSO PÚBLICO PARA A CELEBRAÇÃO DE CONTRATOS PÚBLICOS DE APROVISIONAMENTO PARA A ÁREA DA SAÚDE, COM VISTA AO FORNECIMENTO DE MEDICAMENTOS DE CONSUMO GERAL  (FFOSI)- APARELHO CARDIOVASCULAR., ÀS INSTITUIÇÕES E SERVIÇOS DO SERVIÇO NACIONAL DE SAÚDE",FALSE
SC/254/2014 - AQUISIÇÃO DE MEDICAMENTOS GERAIS.10,Ao abrigo de acordo-quadro (art.º 259.º),Aquisição de bens móveis,"33690000-3, Medicamentos vários","Administração Regional de Saúde do Algarve, I. P. (503148709)","Sanofi - Produtos Farmacêuticos, Lda. (500134960)","447,50 €",19-11-2014,19-11-2014,42 dias,"Portugal, Faro, Faro",Artigo 259.º do Código dos Contratos Públicos,18-12-2014,"180,52 €",,Quantidades fornecidas.,,513025,"CONCURSO PÚBLICO PARA A CELEBRAÇÃO DE CONTRATOS PÚBLICOS DE APROVISIONAMENTO PARA A ÁREA DA SAÚDE, COM VISTA AO FORNECIMENTO DE MEDICAMENTOS DE CONSUMO GERAL  (FFOSI)- APARELHO CARDIOVASCULAR., ÀS INSTITUIÇÕES E SERVIÇOS DO SERVIÇO NACIONAL DE SAÚDE",FALSE
SC/254/2014 - AQUISIÇÃO DE MEDICAMENTOS GERAIS.10,Ao abrigo de acordo-quadro (art.º 259.º),Aquisição de bens móveis,"33690000-3, Medicamentos vários","Administração Regional de Saúde do Algarve, I. P. (503148709)","Aurovitas Unipessoal, Lda. (513053239)","41,40 €",18-11-2014,18-11-2014,43 dias,"Portugal, Faro, Faro",Artigo 259.º do Código dos Contratos Públicos,31-12-2014,"41,40 €",,"",,513025,"CONCURSO PÚBLICO PARA A CELEBRAÇÃO DE CONTRATOS PÚBLICOS DE APROVISIONAMENTO PARA A ÁREA DA SAÚDE, COM VISTA AO FORNECIMENTO DE MEDICAMENTOS DE CONSUMO GERAL  (FFOSI)- APARELHO CARDIOVASCULAR., ÀS INSTITUIÇÕES E SERVIÇOS DO SERVIÇO NACIONAL DE SAÚDE",FALSE
AD/248/2014 - Aquisição de Rouparia para o CMFRS,Ajuste Direto Regime Geral,Aquisição de bens móveis,"39512000-4, Roupa de cama<BR/>39514500-3, Toalhas de rosto","Administração Regional de Saúde do Algarve, I. P. (503148709)",Ribeiro e Carlos Lda. (502383542),"8.478,82 €",18-11-2014,12-11-2014,20 dias,"Portugal, Faro, São Brás de Alportel","Artigo 20.º, n.º 1, alínea a) do Código dos Contratos Públicos","","",,"",,Não aplicável.,Não aplicável.,FALSE
SC/254/2014 - AQUISIÇÃO DE MEDICAMENTOS GERAIS.10,Ao abrigo de acordo-quadro (art.º 259.º),Aquisição de bens móveis,"33690000-3, Medicamentos vários","Administração Regional de Saúde do Algarve, I. P. (503148709)","Tecnifar - Industria Técnica Farmacêutica, S.A. (500280436)","13,14 €",17-11-2014,17-11-2014,44 dias,"Portugal, Faro, Faro",Artigo 259.º do Código dos Contratos Públicos,19-12-2014,"13,14 €",,"",,513025,"CONCURSO PÚBLICO PARA A CELEBRAÇÃO DE CONTRATOS PÚBLICOS DE APROVISIONAMENTO PARA A ÁREA DA SAÚDE, COM VISTA AO FORNECIMENTO DE MEDICAMENTOS DE CONSUMO GERAL  (FFOSI)- APARELHO CARDIOVASCULAR., ÀS INSTITUIÇÕES E SERVIÇOS DO SERVIÇO NACIONAL DE SAÚDE",FALSE
SC/254/2014 - AQUISIÇÃO DE MEDICAMENTOS GERAIS.10,Ao abrigo de acordo-quadro (art.º 259.º),Aquisição de bens móveis,"33690000-3, Medicamentos vários","Administração Regional de Saúde do Algarve, I. P. (503148709)","Labesfal - Laboratórios Almiro, S.A. (501169580)","169,38 €",17-11-2014,17-11-2014,44 dias,"Portugal, Faro, Faro",Artigo 259.º do Código dos Contratos Públicos,31-12-2014,"110,88 €",,Quantidades fornecidas.,,513025,"CONCURSO PÚBLICO PARA A CELEBRAÇÃO DE CONTRATOS PÚBLICOS DE APROVISIONAMENTO PARA A ÁREA DA SAÚDE, COM VISTA AO FORNECIMENTO DE MEDICAMENTOS DE CONSUMO GERAL  (FFOSI)- APARELHO CARDIOVASCULAR., ÀS INSTITUIÇÕES E SERVIÇOS DO SERVIÇO NACIONAL DE SAÚDE",FALSE
SC/254/2014 - AQUISIÇÃO DE MEDICAMENTOS GERAIS.10,Ao abrigo de acordo-quadro (art.º 259.º),Aquisição de bens móveis,"33690000-3, Medicamentos vários","Administração Regional de Saúde do Algarve, I. P. (503148709)","Generis - Farmacêutica, S.A. (508107997)","893,48 €",17-11-2014,17-11-2014,44 dias,"Portugal, Faro, Faro",Artigo 259.º do Código dos Contratos Públicos,31-12-2014,"776,20 €",,Quantidades fornecidas.,,513025,"CONCURSO PÚBLICO PARA A CELEBRAÇÃO DE CONTRATOS PÚBLICOS DE APROVISIONAMENTO PARA A ÁREA DA SAÚDE, COM VISTA AO FORNECIMENTO DE MEDICAMENTOS DE CONSUMO GERAL  (FFOSI)- APARELHO CARDIOVASCULAR., ÀS INSTITUIÇÕES E SERVIÇOS DO SERVIÇO NACIONAL DE SAÚDE",FALSE
SC/254/2014 - AQUISIÇÃO DE MEDICAMENTOS GERAIS.10,Ao abrigo de acordo-quadro (art.º 259.º),Aquisição de bens móveis,"33690000-3, Medicamentos vários","Administração Regional de Saúde do Algarve, I. P. (503148709)","Fresenius Kabi Pharma Portugal, Lda. (504293753)","122,96 €",17-11-2014,17-11-2014,44 dias,"Portugal, Faro, Faro",Artigo 259.º do Código dos Contratos Públicos,03-12-2014,"92,22 €",,Quantidades fornecidas.,,513025,"CONCURSO PÚBLICO PARA A CELEBRAÇÃO DE CONTRATOS PÚBLICOS DE APROVISIONAMENTO PARA A ÁREA DA SAÚDE, COM VISTA AO FORNECIMENTO DE MEDICAMENTOS DE CONSUMO GERAL  (FFOSI)- APARELHO CARDIOVASCULAR., ÀS INSTITUIÇÕES E SERVIÇOS DO SERVIÇO NACIONAL DE SAÚDE",FALSE
SC/263/2014 - AQUISIÇÃO DE MEDICAMENTOS GERAIS.7,Ao abrigo de acordo-quadro (art.º 259.º),Aquisição de bens móveis,"33690000-3, Medicamentos vários","Administração Regional de Saúde do Algarve, I. P. (503148709)","GlaxoSmithKline - Produtos Farmacêuticos, Lda. (500139962)","231,08 €",13-11-2014,13-11-2014,48 dias,"Portugal, Faro, Faro",Artigo 259.º do Código dos Contratos Públicos,"","",,"",,599473,"CONCURSO PÚBLICO PARA A CELEBRAÇÃO DE CONTRATOS PÚBLICOS DE APROVISIONAMENTO PARA A ÁREA DA SAÚDE, COM VISTA AO FORNECIMENTO DE MEDICAMENTOS DE CONSUMO GERAL, GRUPO 4: SANGUE ÀS INSTITUIÇÕES E SERVIÇOS DO SERVIÇO NACIONAL DE SAÚDE",FALSE
Aquisição de Kit´s ginecológicos para processamento de citologia cervical em meio líquido para a realização do rastreio do cancro do colo do útero.,Ajuste Direto Regime Geral,Aquisição de bens móveis,"33141625-7, Kits de diagnóstico","Administração Regional de Saúde do Algarve, I. P. (503148709)","HOLOGIC IBERIA, S.L. (980277230)","30.360,00 €",12-11-2014,31-10-2014,62 dias,"Portugal, Faro, Faro<BR/>Portugal, Faro, Portimão","Artigo 24.º, n.º 1, alínea e) do Código dos Contratos Públicos",31-12-2014,"30.360,00 €",,"",,Não aplicável.,Não aplicável.,FALSE
SC/263/2014 - AQUISIÇÃO DE MEDICAMENTOS GERAIS.7,Ao abrigo de acordo-quadro (art.º 259.º),Aquisição de bens móveis,"33690000-3, Medicamentos vários","Administração Regional de Saúde do Algarve, I. P. (503148709)","Aurovitas Unipessoal, Lda. (513053239)","126,00 €",12-11-2014,12-11-2014,49 dias,"Portugal, Faro, Faro",Artigo 259.º do Código dos Contratos Públicos,"","",,"",,599473,"CONCURSO PÚBLICO PARA A CELEBRAÇÃO DE CONTRATOS PÚBLICOS DE APROVISIONAMENTO PARA A ÁREA DA SAÚDE, COM VISTA AO FORNECIMENTO DE MEDICAMENTOS DE CONSUMO GERAL, GRUPO 4: SANGUE ÀS INSTITUIÇÕES E SERVIÇOS DO SERVIÇO NACIONAL DE SAÚDE",FALSE
