freguesia,acronym,validVotesPercentage,votes,dicofre
Melides,PS,38.28,209,150503
Melides,PCP-PEV,27.29,149,150503
Melides,PPD/PSD.CDS-PP,20.7,113,150503
Melides,MPT,3.3,18,150503
Melides,B.E.,3.11,17,150503
Melides,L,2.38,13,150503
Melides,PCTP/MRPP,2.2,12,150503
Melides,PPM,0.73,4,150503
Melides,PAN,0.55,3,150503
Melides,PNR,0.55,3,150503
Melides,PTP,0.37,2,150503
Melides,MAS,0.18,1,150503
Melides,PND,0.18,1,150503
Melides,PPV,0.18,1,150503
Melides,PDA,0,0,150503
Melides,POUS,0,0,150503
