freguesia,acronym,validVotesPercentage,votes,dicofre
Odivelas,PS,42.49,11850,111603
Odivelas,PPD/PSD,21.77,6072,111603
Odivelas,B.E.,10.34,2884,111603
Odivelas,PCP-PEV,7.18,2001,111603
Odivelas,PAN,4.92,1373,111603
Odivelas,CDS-PP,3.03,845,111603
Odivelas,CH,2.35,656,111603
Odivelas,IL,2.02,563,111603
Odivelas,L,1.6,447,111603
Odivelas,A,1.12,313,111603
Odivelas,PCTP/MRPP,0.78,218,111603
Odivelas,PNR,0.54,150,111603
Odivelas,R.I.R.,0.45,125,111603
Odivelas,NC,0.32,90,111603
Odivelas,MPT,0.26,72,111603
Odivelas,PURP,0.23,64,111603
Odivelas,PDR,0.18,49,111603
Odivelas,MAS,0.17,47,111603
Odivelas,PPM,0.13,37,111603
Odivelas,PTP,0.11,32,111603
