freguesia,acronym,validVotesPercentage,votes,dicofre
Paderne,PS,39.82,264,080103
Paderne,PPD/PSD,18.25,121,080103
Paderne,B.E.,12.52,83,080103
Paderne,CDS-PP,6.64,44,080103
Paderne,PAN,6.33,42,080103
Paderne,PCP-PEV,4.37,29,080103
Paderne,PPM.PPV/CDC,3.17,21,080103
Paderne,PNR,1.96,13,080103
Paderne,L,1.51,10,080103
Paderne,PCTP/MRPP,1.06,7,080103
Paderne,A,0.9,6,080103
Paderne,PDR,0.9,6,080103
Paderne,PTP,0.75,5,080103
Paderne,PURP,0.75,5,080103
Paderne,IL,0.45,3,080103
Paderne,NC,0.45,3,080103
Paderne,MAS,0.15,1,080103
