Objeto do Contrato,Tipo de Procedimento,Tipo(s) de Contrato,CPVs,Entidade(s) Adjudicante(s),Entidade(s) Adjudicatária(s),Preço Contratual,Data de Publicação,Data de Celebração do Contrato,Prazo de Execução,Local de Execução,Fundamentação,Data de Fecho do Contrato,Preço Total Efetivo,Causas das Alterações ao Prazo,Causas das Alterações ao Preço,Estado,N.º registo do Acordo Quadro,Descrição do Acordo Quadro,Procedimento Centralizado
Serviços Médicos - Cirurgia Geral,Ajuste Direto Regime Geral,Aquisição de serviços,"85100000-0, Serviços de saúde","Centro Hospitalar do Médio Tejo, E. P. E. (506361608)","Francisco Toscano - Serviços Médicos Unipessoal, Lda (513198024)","43.200,00 €",29-05-2018,14-02-2018,365 dias,"Portugal, Santarém, Abrantes","Artigo 20.º, n.º 1, alínea a) do Código dos Contratos Públicos",,,,,,Não aplicável.,Não aplicável.,FALSE
Serviços Médicos - Pediatria,Ajuste Direto Regime Geral,Aquisição de serviços,"85100000-0, Serviços de saúde","Centro Hospitalar do Médio Tejo, E. P. E. (506361608)",Ema Alexandra Rosa Grilo (233367438),"18.110,20 €",29-05-2018,25-09-2017,210 dias,"Portugal, Santarém, Torres Novas","Artigo 20.º, n.º 1, alínea a) do Código dos Contratos Públicos",,,,,,Não aplicável.,Não aplicável.,FALSE
Serviços Médicos - Pedopsiquiatria - 37011818,Ajuste Direto Regime Geral,Aquisição de serviços,"85100000-0, Serviços de saúde","Centro Hospitalar do Médio Tejo, E. P. E. (506361608)",Cátia Marina Lopo dos Santos (239488440),"17.680,00 €",29-05-2018,14-03-2018,300 dias,"Portugal, Santarém, Tomar","Artigo 20.º, n.º 1, alínea d) do Código dos Contratos Públicos",,,,,,Não aplicável.,Não aplicável.,FALSE
Serviços Religiosos,Ajuste Direto Regime Geral,Aquisição de serviços,"98300000-6, Serviços diversos","Centro Hospitalar do Médio Tejo, E. P. E. (506361608)",Diocese de Portalegre - Castelo Branco (500833176),"11.914,80 €",29-05-2018,14-03-2018,365 dias,"Portugal, Santarém, Abrantes","Artigo 20.º, n.º 1, alínea a) do Código dos Contratos Públicos",,,,,,Não aplicável.,Não aplicável.,FALSE
Serviços Médicos - Anestesiologia - 37010718,Ajuste Direto Regime Geral,Aquisição de serviços,"85100000-0, Serviços de saúde","Centro Hospitalar do Médio Tejo, E. P. E. (506361608)","Jorge Vila, Lda (504227190)","64.262,00 €",29-05-2018,23-03-2018,90 dias,"Portugal, Santarém, Abrantes","Artigo 24.º, n.º 1, alínea c) do Código dos Contratos Públicos",,,,,,Não aplicável.,Não aplicável.,FALSE
Serviços Médicos - Oncologia - 37022618,Consulta Prévia,Aquisição de serviços,"85100000-0, Serviços de saúde","Centro Hospitalar do Médio Tejo, E. P. E. (506361608)",Andreia Filipa Almeida Chaves (245069674),"24.000,00 €",29-05-2018,27-02-2018,365 dias,"Portugal, Santarém, Torres Novas","Artigo 20.º, n.º 1, alínea c) do Código dos Contratos Públicos",,,,,,Não aplicável.,Não aplicável.,FALSE
Serviços Médicos - Oncologia - 37022618,Consulta Prévia,Aquisição de serviços,"85100000-0, Serviços de saúde","Centro Hospitalar do Médio Tejo, E. P. E. (506361608)","ANTUNES BONITO, SERVIÇOS DE SAÚDE, LDA (510981089)","24.000,00 €",29-05-2018,27-02-2018,365 dias,"Portugal, Santarém, Torres Novas","Artigo 20.º, n.º 1, alínea c) do Código dos Contratos Públicos",,,,,,Não aplicável.,Não aplicável.,FALSE
Serviços Médicos - Oncologia - 37022618,Consulta Prévia,Aquisição de serviços,"85100000-0, Serviços de saúde","Centro Hospitalar do Médio Tejo, E. P. E. (506361608)","Isabel Pazos Unipessoal, Lda (510500013)","24.000,00 €",29-05-2018,27-02-2018,365 dias,"Portugal, Santarém, Torres Novas","Artigo 20.º, n.º 1, alínea c) do Código dos Contratos Públicos",,,,,,Não aplicável.,Não aplicável.,FALSE
Serviços Médicos - Triagem Pediátrica - 37021718,Consulta Prévia,Aquisição de serviços,"85100000-0, Serviços de saúde","Centro Hospitalar do Médio Tejo, E. P. E. (506361608)",Tânia Paula Furtado Rodrigues Mota (219404437),"13.200,00 €",29-05-2018,23-03-2018,365 dias,"Portugal, Santarém, Torres Novas","Artigo 20.º, n.º 1, alínea c) do Código dos Contratos Públicos",,,,,,Não aplicável.,Não aplicável.,FALSE
Serviços Médicos - Triagem Pediátrica - 37021718,Consulta Prévia,Aquisição de serviços,"85100000-0, Serviços de saúde","Centro Hospitalar do Médio Tejo, E. P. E. (506361608)","Arestespiral, Lda. (510147780)","57.200,00 €",29-05-2018,23-03-2018,365 dias,"Portugal, Santarém, Torres Novas","Artigo 20.º, n.º 1, alínea c) do Código dos Contratos Públicos",,,,,,Não aplicável.,Não aplicável.,FALSE
Serviços Médicos - Triagem Geral - 37012218,Ajuste Direto Regime Geral,Aquisição de serviços,"85100000-0, Serviços de saúde","Centro Hospitalar do Médio Tejo, E. P. E. (506361608)",Mileydy Valencia Loaiza (275604527),"19.800,00 €",29-05-2018,10-04-2018,300 dias,"Portugal, Santarém, Abrantes","Artigo 20.º, n.º 1, alínea d) do Código dos Contratos Públicos",,,,,,Não aplicável.,Não aplicável.,FALSE
Serviços Médicos - Medicina Interna - 37010018,Ajuste Direto Regime Geral,Aquisição de serviços,"85100000-0, Serviços de saúde","Centro Hospitalar do Médio Tejo, E. P. E. (506361608)","Talenter - Gestão de Projectos, SA (506111148)","164.306,25 €",25-05-2018,27-03-2018,90 dias,"Portugal, Santarém, Abrantes","Artigo 24.º, n.º 1, alínea c) do Código dos Contratos Públicos",,,,,,Não aplicável.,Não aplicável.,FALSE
Serviços técnicos - Imunohemoterapia,Ajuste Direto Regime Geral,Aquisição de serviços,"85100000-0, Serviços de saúde","Centro Hospitalar do Médio Tejo, E. P. E. (506361608)",Andreia Filipa Carvalho Pereira (245951326),"14.144,00 €",25-05-2018,17-10-2017,365 dias,"Portugal, Santarém, Torres Novas","Artigo 20.º, n.º 1, alínea a) do Código dos Contratos Públicos",,,,,,Não aplicável.,Não aplicável.,FALSE
Serviços Médicos - Anestesiologia - 37010118,Ajuste Direto Regime Geral,Aquisição de serviços,"85100000-0, Serviços de saúde","Centro Hospitalar do Médio Tejo, E. P. E. (506361608)","ANESPSI-SERVIÇO MEDICOS E DE PSICOLOGIA,LDA (508695805)","32.861,25 €",25-05-2018,23-03-2018,90 dias,"Portugal, Santarém, Abrantes","Artigo 24.º, n.º 1, alínea c) do Código dos Contratos Públicos",,,,,,Não aplicável.,Não aplicável.,FALSE
Serviços Controlo de Qualidade Imagiologia,Ajuste Direto Regime Geral,Aquisição de serviços,"71700000-5, Serviços de controlo e monitorização","Centro Hospitalar do Médio Tejo, E. P. E. (506361608)","IQI - Instituto  de Qualidade em Imagem e Proteção Radiológica, S.A (507858352)","12.335,00 €",25-05-2018,07-03-2018,365 dias,"Portugal, Santarém, Torres Novas","Artigo 20.º, n.º 1, alínea a) do Código dos Contratos Públicos",,,,,,Não aplicável.,Não aplicável.,FALSE
