freguesia,acronym,validVotesPercentage,votes,dicofre
Real,PS,53,168,010606
Real,PPD/PSD.CDS-PP,31.86,101,010606
Real,MPT,5.36,17,010606
Real,B.E.,3.47,11,010606
Real,L,1.58,5,010606
Real,PCP-PEV,0.95,3,010606
Real,PND,0.95,3,010606
Real,MAS,0.63,2,010606
Real,PCTP/MRPP,0.63,2,010606
Real,PAN,0.32,1,010606
Real,PDA,0.32,1,010606
Real,PPM,0.32,1,010606
Real,PPV,0.32,1,010606
Real,PTP,0.32,1,010606
Real,PNR,0,0,010606
Real,POUS,0,0,010606
