Objeto do Contrato,Tipo de Procedimento,Tipo(s) de Contrato,CPVs,Entidade(s) Adjudicante(s),Entidade(s) Adjudicatária(s),Preço Contratual,Data de Publicação,Data de Celebração do Contrato,Prazo de Execução,Local de Execução,Fundamentação,Data de Fecho do Contrato,Preço Total Efetivo,Causas das Alterações ao Prazo,Causas das Alterações ao Preço,Estado,N.º registo do Acordo Quadro,Descrição do Acordo Quadro,Procedimento Centralizado
Prestação de Serviços Médicos sem especialidade para o mês de Setembro de 2018,Ajuste Direto Regime Geral,Aquisição de serviços,"85141000-9, Serviços prestados pelo pessoal médico",Adm.Reg.de Saúde de Lisboa e Vale do Tejo (ARSLVT) (503148776),Kelly Healthcare Resourses (510723691),"11.713,35 €",14-12-2018,04-12-2018,30 dias,"Portugal, Santarém, Abrantes<BR/>Portugal, Santarém, Santarém","Artigo 27.º, n.º 1, alínea a) do Código dos Contratos Públicos","","","","",,Não aplicável.,Não aplicável.,FALSE
Prestação de Serviços Médicos de Gine/Obst,Ajuste Direto Regime Geral,Aquisição de serviços,"85121210-8, Serviços de ginecologia ou obstetrícia","Centro Hospitalar Universitário do Algarve, E. P. E. (510745997)",Kelly Healthcare Resourses (510723691),"2.400,00 €",29-11-2018,18-09-2018,90 dias,"Portugal, Faro, Faro<BR/>Portugal, Faro, Portimão","Artigo 24.º, n.º 1, alínea e), subalínea ii) do Código dos Contratos Públicos",31-12-2018,"1.200,00 €","",De acordo com as necessidades efectivas no ano 2018,,Não aplicável.,Não aplicável.,FALSE
Contratação de serviços médicos para o SAP de Vendas Novas nos meses de agosto e setembro de 2017.,Ao abrigo de acordo-quadro (art.º 259.º),Aquisição de serviços,"85121000-3, Serviços de prática médica","Administração Regional de Saúde do Alentejo, I. P. (503148768)","Kelly Services - Healthcare, Unipessoal, Lda. (510723691)","1.580,40 €",24-10-2018,01-08-2017,60 dias,"Portugal, Évora, Vendas Novas",Artigo 259.º do Código dos Contratos Públicos,30-09-2017,"1.580,40 €","","",,1490434,ACORDO QUADRO PARA PRESTAÇÃO DE SERVIÇOS MÉDICOS ÀS INSTITUIÇÕES E SERVIÇOS DO SERVIÇO NACIONAL DE SAÚDE,FALSE
Aquisição de serviços médicos sem especialidade para o mês de agosto de 2018,Ajuste Direto Regime Geral,Aquisição de serviços,"85141000-9, Serviços prestados pelo pessoal médico",Adm.Reg.de Saúde de Lisboa e Vale do Tejo (ARSLVT) (503148776),Kelly Healthcare Resourses (510723691),"44.795,48 €",09-10-2018,17-09-2018,30 dias,Portugal,"Artigo 27.º, n.º 1, alínea a) do Código dos Contratos Públicos","","","","",,Não aplicável.,Não aplicável.,FALSE
Prestação de serviços médicos sem especialidade para o mês de Julho de 2018,Ajuste Direto Regime Geral,Aquisição de serviços,"85141000-9, Serviços prestados pelo pessoal médico",Adm.Reg.de Saúde de Lisboa e Vale do Tejo (ARSLVT) (503148776),Kelly Healthcare Resourses (510723691),"27.859,71 €",18-09-2018,16-08-2018,31 dias,Portugal,"Artigo 27.º, n.º 1, alínea a) do Código dos Contratos Públicos","","","","",,Não aplicável.,Não aplicável.,FALSE
Prestação de Serviços Médicos sem especialidade para o mês de maio de 2018,Ajuste Direto Regime Geral,Aquisição de serviços,"85141000-9, Serviços prestados pelo pessoal médico",Adm.Reg.de Saúde de Lisboa e Vale do Tejo (ARSLVT) (503148776),Kelly Healthcare Resourses (510723691),"27.859,71 €",10-08-2018,31-07-2018,31 dias,Portugal,"Artigo 27.º, n.º 1, alínea a) do Código dos Contratos Públicos","","","","",,Não aplicável.,Não aplicável.,FALSE
Prestação de Serviços Médicos sem especialidade para o mês de junho de 2018,Ajuste Direto Regime Geral,Aquisição de serviços,"85141000-9, Serviços prestados pelo pessoal médico",Adm.Reg.de Saúde de Lisboa e Vale do Tejo (ARSLVT) (503148776),Kelly Healthcare Resourses (510723691),"27.859,71 €",10-08-2018,31-07-2018,30 dias,Portugal,"Artigo 27.º, n.º 1, alínea a) do Código dos Contratos Públicos",22-10-2018,"27.955,19 €","",Alteração do valor do contrato decorrente das modificações objetivas do contrato conforme previsto no artigo 311º e 312º do CCP,,Não aplicável.,Não aplicável.,FALSE
Prestação de serviços médicos sem especialidade para o mês de março de 2018,Ajuste Direto Regime Geral,Aquisição de serviços,"85141000-9, Serviços prestados pelo pessoal médico","Administração Regional de Saúde de Lisboa e Vale do Tejo, I. P. (503148776)",Kelly Healthcare Resourses (510723691),"64.139,88 €",11-06-2018,29-05-2018,31 dias,"Portugal, Lisboa","Artigo 27.º, n.º 1, alínea a) do Código dos Contratos Públicos","","","","",,Não aplicável.,Não aplicável.,FALSE
Prestação de serviços médicos sem especialidade para o mês de abril de 2018,Ajuste Direto Regime Geral,Aquisição de serviços,"85141000-9, Serviços prestados pelo pessoal médico","Administração Regional de Saúde de Lisboa e Vale do Tejo, I. P. (503148776)",Kelly Healthcare Resourses (510723691),"27.859,71 €",11-06-2018,29-05-2018,30 dias,"Portugal, Lisboa","Artigo 27.º, n.º 1, alínea c) do Código dos Contratos Públicos","","","","",,Não aplicável.,Não aplicável.,FALSE
Prestação de Serviços Médicos de Ortopedia- Junho 2017,Ajuste Direto Regime Geral,Aquisição de serviços,"85121283-0, Serviços de ortopedia","Centro Hospitalar Universitário do Algarve, E. P. E. (510745997)",Kelly Healthcare Resourses (510723691),"28.566,00 €",07-05-2018,29-03-2018,30 dias,"Portugal, Faro, Faro","Artigo 24.º, n.º 1, alínea e), subalínea ii) do Código dos Contratos Públicos",31-12-2018,"28.543,00 €","",De acordo com as necessidades efectivas no ano 2018,,Não aplicável.,Não aplicável.,FALSE
Aq. de Serviços Médicos de Ortopedia- julho 2017,Ajuste Direto Regime Geral,Aquisição de serviços,"85121283-0, Serviços de ortopedia","Centro Hospitalar Universitário do Algarve, E. P. E. (510745997)",Kelly Healthcare Resourses (510723691),"22.085,28 €",07-05-2018,13-04-2018,30 dias,"Portugal, Faro, Faro","Artigo 24.º, n.º 1, alínea e), subalínea ii) do Código dos Contratos Públicos",31-12-2018,"22.085,28 €","","",,Não aplicável.,Não aplicável.,FALSE
Prestação de serviços médicos sem especialidade para o mês de fevereiro de 2018,Ajuste Direto Regime Geral,Aquisição de serviços,"85121100-4, Serviços de médicos de clínica geral","Administração Regional de Saúde de Lisboa e Vale do Tejo, I. P. (503148776)",Kelly Healthcare Resourses (510723691),"66.017,60 €",04-05-2018,23-04-2018,28 dias,"Portugal, Lisboa","Artigo 27.º, n.º 1, alínea a) do Código dos Contratos Públicos","","","","",,Não aplicável.,Não aplicável.,FALSE
Prestação de Serviços Médicos de Pediatria,Ajuste Direto Regime Geral,Aquisição de serviços,"85121291-9, Serviços de pediatria","Centro Hospitalar Universitário do Algarve, E. P. E. (510745997)",Kelly Healthcare Resourses (510723691),"60.720,00 €",03-05-2018,01-02-2018,334 dias,"Portugal, Faro, Portimão","Artigo 24.º, n.º 1, alínea b) do Código dos Contratos Públicos",31-12-2018,"61.732,00 €","",De acordo com as necessidades efectivas no ano 2018,,Não aplicável.,Não aplicável.,FALSE
"Aquisição de serviços de cuidados médicos na Área de Anestesiologia, para o mês de Julho de 2017 - CHLC, EPE",Ajuste Direto Regime Geral,Aquisição de serviços,"79625000-1, Serviços de fornecimento de pessoal médico","Centro Hospitalar de Lisboa Central, E.P.E. (CHLC) (508080142)","Kelly Services - Healthcare Unipessoal, Lda. (510723691)","6.024,11 €",11-04-2018,22-08-2017,31 dias,"Portugal, Lisboa, Lisboa","Artigo 20.º, n.º 1, alínea a) do Código dos Contratos Públicos","","","","",,Não aplicável.,Não aplicável.,FALSE
Prestação de Serviços Médicos de Ortopedia,Ajuste Direto Regime Geral,Aquisição de serviços,"85121283-0, Serviços de ortopedia","Centro Hospitalar Universitário do Algarve, E. P. E. (510745997)",Kelly Healthcare Resourses (510723691),"323.917,44 €",09-04-2018,04-04-2018,300 dias,"Portugal, Faro, Portimão<BR/>Portugal, Faro, Faro","Artigo 24.º, n.º 1, alínea b) do Código dos Contratos Públicos",31-12-2018,"322.000,75 €","",De acordo com as necessidades efectivas no ano 2018,,Não aplicável.,Não aplicável.,FALSE
4S0019/2017 SERV. MED. P PLANO CONTIGÊNCIA - MES DEZEMBRO,Ajuste Direto Regime Geral,Aquisição de serviços,"85100000-0, Serviços de saúde","Centro Hospitalar Barreiro Montijo, E. P. E. (509186998)","Kelly Services - Healthcare Unipessoal, Lda (510723691)","960,00 €",26-03-2018,10-01-2017,31 dias,"Portugal, Setúbal, Barreiro","Artigo 20.º, n.º 1, alínea a) do Código dos Contratos Públicos",01-02-2017,"900,00 €","",Consumo efetivo inferior ao estimado,,Não aplicável.,Não aplicável.,FALSE
"4SI0012/2017 SERV MÉDICOS CLINICA GERAL, MGF E MEDICINA INTERNA P MES JANEIRO",Ao abrigo de acordo-quadro (art.º 259.º),Aquisição de serviços,"85100000-0, Serviços de saúde","Centro Hospitalar Barreiro Montijo, E. P. E. (509186998)","Kelly Services - Healthcare Unipessoal, Lda (510723691)","350,40 €",26-03-2018,26-01-2017,31 dias,"Portugal, Setúbal, Barreiro",Artigo 259.º do Código dos Contratos Públicos,05-04-2017,"335,80 €","",Consumo efetivo inferior ao estimado,,1490434,ACORDO QUADRO PARA PRESTAÇÃO DE SERVIÇOS MÉDICOS ÀS INSTITUIÇÕES E SERVIÇOS DO SERVIÇO NACIONAL DE SAÚDE,FALSE
4DS0350/2017 REGULARIZAÇÃO DE TURNOS DE MEDICINA INTERNA REALIZADOS PELO DR. JOSÉ PAXIUTA,Ao abrigo de acordo-quadro (art.º 259.º),Aquisição de serviços,"85100000-0, Serviços de saúde","Centro Hospitalar Barreiro Montijo, E. P. E. (509186998)","Kelly Services - Healthcare Unipessoal, Lda (510723691)","1.401,60 €",26-03-2018,12-07-2017,30 dias,"Portugal, Setúbal, Barreiro",Artigo 259.º do Código dos Contratos Públicos,20-10-2017,"1.401,60 €","","",,1490434,ACORDO QUADRO PARA PRESTAÇÃO DE SERVIÇOS MÉDICOS ÀS INSTITUIÇÕES E SERVIÇOS DO SERVIÇO NACIONAL DE SAÚDE,FALSE
Prestação de serviços médicos sem especialidade,Ajuste Direto Regime Geral,Aquisição de serviços,"85121100-4, Serviços de médicos de clínica geral","Administração Regional de Saúde de Lisboa e Vale do Tejo, I. P. (503148776)",Kelly Healthcare Resourses (510723691),"66.203,45 €",26-02-2018,15-02-2018,30 dias,"Portugal, Lisboa","Artigo 24.º, n.º 1, alínea c) do Código dos Contratos Públicos","","","","",,Não aplicável.,Não aplicável.,FALSE
Aq. de Prestação de Serviços Médicos de Pediatria,Ajuste Direto Regime Geral,Aquisição de serviços,"85121291-9, Serviços de pediatria","Centro Hospitalar Universitário do Algarve, E. P. E. (510745997)",Kelly Healthcare Resourses (510723691),"4.416,00 €",02-02-2018,03-01-2018,31 dias,"Portugal, Faro, Portimão","Artigo 24.º, n.º 1, alínea e), subalínea i) do Código dos Contratos Públicos",31-01-2018,"4.278,00 €","","O valor inicial do Contrato teve por base as necessidades estimadas para o período de 1 janeiro de 2018 a 31 janeiro de 2018, o valor final reflecte as necessidades efectivas.",,Não aplicável.,Não aplicável.,FALSE
Aq. Prestação de Serviços Médicos de Ortopedia,Ajuste Direto Regime Geral,Aquisição de serviços,"85121283-0, Serviços de ortopedia","Centro Hospitalar Universitário do Algarve, E. P. E. (510745997)",Kelly Healthcare Resourses (510723691),"58.464,00 €",30-01-2018,02-01-2018,30 dias,"Portugal, Faro, Faro<BR/>Portugal, Faro, Lagos<BR/>Portugal, Faro, Portimão","Artigo 24.º, n.º 1, alínea e) do Código dos Contratos Públicos",30-03-2018,"58.464,00 €","","",,Não aplicável.,Não aplicável.,FALSE
Aquisição de Serviços de Cuidados Médicos na Área de Anestesiologia do primeiro trimestres de 2017,Ajuste Direto Regime Geral,Aquisição de serviços,"85121200-5, Serviços de medicina especializada","Centro Hospitalar de Lisboa Central, E. P. E. (508080142)",Kelly Healthcare Resourses (510723691),"26.333,98 €",15-01-2018,09-05-2017,90 dias,"Portugal, Lisboa, Lisboa","Artigo 20.º, n.º 1, alínea a) do Código dos Contratos Públicos","","","","",,Não aplicável.,Não aplicável.,FALSE
"Aquisição de Serviços Médicos na Área de Ortopedia Pediatrica para o CHLC, EPE- HDE",Ajuste Direto Regime Geral,Aquisição de serviços,"85121283-0, Serviços de ortopedia","Centro Hospitalar de Lisboa Central, E. P. E. (508080142)",Kelly Healthcare Resourses (510723691),"23.070,24 €",09-01-2018,08-02-2017,365 dias,"Portugal, Lisboa, Lisboa","Artigo 20.º, n.º 1, alínea a) do Código dos Contratos Públicos","","","","",,Não aplicável.,Não aplicável.,FALSE
Aquisição de serviços de enfermagem - SAP Baião - ACES Baixo Tâmega,Ajuste Direto Regime Geral,Aquisição de serviços,"79624000-4, Serviços de fornecimento de pessoal de enfermagem","Administração Regional de Saúde do Norte, I. P. (503135593)",Kelly Healthcare Resourses (510723691),"69.189,12 €",16-11-2017,23-02-2016,365 dias,"Portugal, Porto, Baião","Artigo 24.º, n.º 1, alínea c) do Código dos Contratos Públicos",31-12-2016,"69.189,12 €","","",,Não aplicável.,Não aplicável.,FALSE
Prestação de Serviços Médicos,Ajuste Direto Regime Geral,Aquisição de serviços,"85121000-3, Serviços de prática médica","Centro Hospitalar Universitário do Algarve, E. P. E. (510745997)",Kelly Healthcare Resourses (510723691),"62.640,00 €",15-11-2017,07-11-2017,365 dias,"Portugal, Faro, Faro","Artigo 24.º, n.º 1, alínea e) do Código dos Contratos Públicos",15-11-2017,"62.640,00 €","","O valor inicial do Contrato teve por base as necessidades estimadas para o período de 1 Janeiro de 2016 a 31 Dezembro de 2016, o valor final reflecte as necessidades efectivas.",,Não aplicável.,Não aplicável.,FALSE
Serviços de Anestesiologia de Maio a Dezembro 2016,Ajuste Direto Regime Geral,Aquisição de serviços,"85000000-9, Serviços de saúde e acção social",Centro Hospitalar Psiquiátrico de Lisboa (508338476),"Kelly Services - Healthcare, Unipessoal, Lda. (510723691)","939,20 €",05-09-2017,02-02-2017,31 dias,"Portugal, Lisboa, Lisboa","Artigo 27.º, n.º 1, alínea h) do Código dos Contratos Públicos",02-02-2017,"939,20 €","","",,Não aplicável.,Não aplicável.,FALSE
Serviços de Anestesiologia de Maio a Dezembro 2016,Ao abrigo de acordo-quadro (art.º 258.º),Aquisição de serviços,"85000000-9, Serviços de saúde e acção social",Centro Hospitalar Psiquiátrico de Lisboa (508338476),"Kelly Services - Healthcare, Unipessoal, Lda (510723691)","0,00 €",05-09-2017,03-05-2016,176 dias,"Portugal, Lisboa, Lisboa","Artigo 27.º, n.º 1, alínea h) do Código dos Contratos Públicos",30-12-2016,"6.809,20 €","","O valor do contrato ficou a 0, porque o Base Gov dava erro e não permitia a colocação do valor) que seria 8.218€), porém e dada a Faturação o valor apurado foram os 6809.20€",,1490434,ACORDO QUADRO PARA PRESTAÇÃO DE SERVIÇOS MÉDICOS ÀS INSTITUIÇÕES E SERVIÇOS DO SERVIÇO NACIONAL DE SAÚDE,FALSE
Prestação de Serviços Médicos sem especialidade para a ARSLVT Lote 7,Concurso público,Aquisição de serviços,"85100000-0, Serviços de saúde","Administração Regional de Saúde de Lisboa e Vale do Tejo, I. P. (503148776)",Kelly Services (510723691),"225.429,20 €",01-08-2017,03-05-2017,245 dias,"Portugal, Lisboa, Lisboa","Artigo 20.º, n.º 1, alínea b) do Código dos Contratos Públicos","","","","",,Não aplicável.,Não aplicável.,FALSE
Prestação de Serviços Médicos sem especialidade para a ARSLVT Lote 8,Concurso público,Aquisição de serviços,"85100000-0, Serviços de saúde","Administração Regional de Saúde de Lisboa e Vale do Tejo, I. P. (503148776)",Kelly Services (510723691),"53.775,70 €",01-08-2017,03-05-2017,245 dias,"Portugal, Lisboa, Lisboa","Artigo 20.º, n.º 1, alínea b) do Código dos Contratos Públicos","","","","",,Não aplicável.,Não aplicável.,FALSE
AQUISIÇÃO DE PRESTAÇÃO DE SERVIÇO MÉDICOS DE ORTOPEDIA,Concurso público,Aquisição de serviços,"85121283-0, Serviços de ortopedia","Centro Hospitalar do Algarve, E. P. E. (510745997)",Kelly Services (510723691),"135.720,00 €",01-08-2017,19-07-2017,165 dias,"Portugal, Faro, Faro<BR/>Portugal, Faro, Portimão","Artigo 20.º, n.º 1, alínea b) do Código dos Contratos Públicos","","","","",,Não aplicável.,Não aplicável.,FALSE
Anesteseologia para o 1º Trimestre 2016,Ajuste Direto Regime Geral,Aquisição de serviços,"85000000-9, Serviços de saúde e acção social",Centro Hospitalar Psiquiátrico de Lisboa (508338476),Kelly Services (510723691),"3.050,04 €",28-07-2017,20-01-2016,90 dias,"Portugal, Lisboa, Lisboa","Artigo 26.º, n.º 1, alínea a) do Código dos Contratos Públicos",31-03-2016,"3.050,04 €","","",,Não aplicável.,Não aplicável.,FALSE
"Anesteseologia, Mês de Abril 2016",Ajuste Direto Regime Geral,Aquisição de serviços,"85000000-9, Serviços de saúde e acção social",Centro Hospitalar Psiquiátrico de Lisboa (508338476),Kelly Services (510723691),"1.016,68 €",28-07-2017,19-04-2016,31 dias,"Portugal, Lisboa, Lisboa","Artigo 24.º, n.º 1, alínea a) do Código dos Contratos Públicos",30-04-2016,"1.016,68 €","","",,Não aplicável.,Não aplicável.,FALSE
Prestação de Serviços Médicos,Ao abrigo de acordo-quadro (art.º 259.º),Aquisição de serviços,"85121100-4, Serviços de médicos de clínica geral","Administração Regional de Saúde do Algarve, I. P. (503148709)","Kelly Services - Healthcare Unipessoal, Lda (510723691)","672.550,92 €",06-07-2017,13-04-2017,260 dias,"Portugal, Faro, Faro",Artigo 259.º do Código dos Contratos Públicos,31-12-2017,"306.852,38 €","",horas contratadas não foram todas executadas,,1490434,ACORDO QUADRO PARA PRESTAÇÃO DE SERVIÇOS MÉDICOS ÀS INSTITUIÇÕES E SERVIÇOS DO SERVIÇO NACIONAL DE SAÚDE,FALSE
Prestação sucessiva de cuidados de saúde à comunidade IPS,Ajuste Direto Regime Geral,Aquisição de serviços,"85100000-0, Serviços de saúde",Serviços de Acção Social do Instituto Politécnico de Setúbal (600083845),"Kelly Services - Healthcare Unipessoal, Lda. (510723691)","25.980,00 €",26-05-2017,30-09-2016,334 dias,"Portugal, Setúbal, Setúbal","Artigo 20.º, n.º 1, alínea a) do Código dos Contratos Públicos","","","","",,Não aplicável.,Não aplicável.,FALSE
"prestação de serviços médicos sem especialidade para a Administração Regional de Saúde de Lisboa e Vale do Tejo, IP, para o mês de abril de 2017.",Ajuste Direto Regime Geral,Aquisição de serviços,"85100000-0, Serviços de saúde","Administração Regional de Saúde de Lisboa e Vale do Tejo, I. P. (503148776)","Kelly Services Healthcare - Unipessoal, Lda. (510723691)","201.525,28 €",19-05-2017,09-05-2017,30 dias,"Portugal, Lisboa","Artigo 24.º, n.º 1, alínea e) do Código dos Contratos Públicos","","","","",,Não aplicável.,Não aplicável.,FALSE
Serviços Médicos de Ortopedia,Ajuste Direto Regime Geral,Aquisição de serviços,"85121283-0, Serviços de ortopedia","Centro Hospitalar do Algarve, E. P. E. (510745997)","Kelly Services Healthcare - Unipessoal, Lda. (510723691)","67.620,00 €",17-05-2017,13-04-2017,61 dias,"Portugal, Faro, Portimão<BR/>Portugal, Faro, Faro","Artigo 24.º, n.º 1, alínea e) do Código dos Contratos Públicos",31-05-2017,"59.524,00 €","","O valor inicial do Contrato teve por base as necessidades estimadas para o período de 1 Abril de 2017 a 31 Maio de 2017, o valor final reflecte as necessidades efectivas.",,Não aplicável.,Não aplicável.,FALSE
"Prestação de serviços médicos sem especialidade para a Administração Regional de Saúde de Lisboa e vele do Tejo, IP, vários Distritos (8 Semanas).",Ajuste Direto Regime Geral,Aquisição de serviços,"85100000-0, Serviços de saúde","Administração Regional de Saúde de Lisboa e Vale do Tejo, I. P. (503148776)","Kelly Services Healthcare - Unipessoal, Lda. (510723691)","34.180,00 €",05-05-2017,12-04-2017,60 dias,"Portugal, Lisboa","Artigo 21.º, n.º 1, alínea a) do Código dos Contratos Públicos","","","","",,Não aplicável.,Não aplicável.,FALSE
"Prestação de serviços especializados de supervisão de nutrição, serviço de nutrição, serviços especializados de nutricionismo e serviços especializados de psicologia no âmbito do projeto EEA Grants.",Ajuste Direto Regime Geral,Aquisição de serviços,"75120000-3, Serviços administrativos das agências","Administração Regional de Saúde de Lisboa e Vale do Tejo, I. P. (503148776)","Kelly Services Healthcare - Unipessoal, Lda. (510723691)","43.474,41 €",28-04-2017,17-03-2017,120 dias,"Portugal, Lisboa, Lisboa","Artigo 20.º, n.º 1, alínea a) do Código dos Contratos Públicos","","","","",,Não aplicável.,Não aplicável.,FALSE
Contratação de serviços médicos para a ARSA,Ao abrigo de acordo-quadro (art.º 259.º),Aquisição de serviços,"85100000-0, Serviços de saúde","Administração Regional de Saúde do Alentejo, I. P. (503148768)","Kelly Services - Healthcare Unipessoal, Lda. (510723691)","418.080,00 €",06-04-2017,31-05-2016,275 dias,"Portugal, Évora, Viana do Alentejo<BR/>Portugal, Évora, Vila Viçosa<BR/>Portugal, Évora, Arraiolos<BR/>Portugal, Évora, Montemor-o-Novo<BR/>Portugal, Évora, Estremoz",Artigo 259.º do Código dos Contratos Públicos,31-12-2016,"312.304,95 €","",Número de horas executadas inferior ao número de horas contratadas.,,1490434,ACORDO QUADRO PARA PRESTAÇÃO DE SERVIÇOS MÉDICOS ÀS INSTITUIÇÕES E SERVIÇOS DO SERVIÇO NACIONAL DE SAÚDE,FALSE
Serviços Médicos Ginecologia/Obs-Reg horas de 2016,Ajuste Direto Regime Geral,Aquisição de serviços,"85121210-8, Serviços de ginecologia ou obstetrícia","Centro Hospitalar do Algarve, E. P. E. (510745997)","Kelly Services - Healthcare, Unipessoal, Lda. (510723691)","2.523,00 €",04-04-2017,21-03-2017,0 dias,"Portugal, Faro, Faro<BR/>Portugal, Faro, Portimão","Artigo 24.º, n.º 1, alínea e) do Código dos Contratos Públicos","","","","",,Não aplicável.,Não aplicável.,FALSE
Serviços Médicos Ortopedia -Reg horas de 2016,Ajuste Direto Regime Geral,Aquisição de serviços,"85121283-0, Serviços de ortopedia","Centro Hospitalar do Algarve, E. P. E. (510745997)","Kelly Services - Healthcare, Unipessoal, Lda. (510723691)","19.314,00 €",04-04-2017,21-03-2017,0 dias,"Portugal, Faro, Portimão<BR/>Portugal, Faro, Faro","Artigo 24.º, n.º 1, alínea e) do Código dos Contratos Públicos",17-05-2017,"19.314,00 €","","",,Não aplicável.,Não aplicável.,FALSE
Serviços Médicos Ortopedia -Reg horas de 2016,Ajuste Direto Regime Geral,Aquisição de serviços,"85121283-0, Serviços de ortopedia","Centro Hospitalar do Algarve, E.P.E. (510745997)","Kelly Services - Healthcare, Unipessoal, Lda. (510723691)","70.760,00 €",04-04-2017,21-03-2017,0 dias,"Portugal, Faro, Portimão<BR/>Portugal, Faro, Faro","Artigo 24.º, n.º 1, alínea e) do Código dos Contratos Públicos",17-05-2017,"70.760,00 €","","",,Não aplicável.,Não aplicável.,FALSE
Serviços Médicos Pediatria-Reg Horas 2016,Ajuste Direto Regime Geral,Aquisição de serviços,"85121291-9, Serviços de pediatria","Centro Hospitalar do Algarve, E. P. E. (510745997)","Kelly Services - Healthcare, Unipessoal, Lda. (510723691)","9.077,00 €",04-04-2017,21-03-2017,0 dias,"Portugal, Faro, Portimão<BR/>Portugal, Faro, Faro","Artigo 24.º, n.º 1, alínea e) do Código dos Contratos Públicos","","","","",,Não aplicável.,Não aplicável.,FALSE
Serviços Médicos de Ortopedia,Ao abrigo de acordo-quadro (art.º 259.º),Aquisição de serviços,"85121283-0, Serviços de ortopedia","Centro Hospitalar do Algarve, E. P. E. (510745997)","Kelly Services - Healthcare, Unipessoal, Lda. (510723691)","71.760,00 €",09-03-2017,12-01-2017,90 dias,"Portugal, Faro, Faro<BR/>Portugal, Faro, Portimão",Artigo 155.º do Código dos Contratos Públicos,31-03-2017,"74.025,50 €","","O valor inicial do Contrato teve por base as necessidades estimadas para o período de 1 Janeiro de 2017 a 31 Março de 2017, o valor final reflecte as necessidades efectivas.",,1490434,ACORDO QUADRO PARA PRESTAÇÃO DE SERVIÇOS MÉDICOS ÀS INSTITUIÇÕES E SERVIÇOS DO SERVIÇO NACIONAL DE SAÚDE,FALSE
Serviços Médicos de Ginecologia/Obstetrícia,Ao abrigo de acordo-quadro (art.º 259.º),Aquisição de serviços,"85121210-8, Serviços de ginecologia ou obstetrícia","Centro Hospitalar do Algarve, E. P. E. (510745997)","Kelly Services - Healthcare, Unipessoal, Lda. (510723691)","71.760,00 €",09-03-2017,12-01-2017,90 dias,"Portugal, Faro, Faro<BR/>Portugal, Faro, Portimão",Artigo 155.º do Código dos Contratos Públicos,"","","","",,1490434,ACORDO QUADRO PARA PRESTAÇÃO DE SERVIÇOS MÉDICOS ÀS INSTITUIÇÕES E SERVIÇOS DO SERVIÇO NACIONAL DE SAÚDE,FALSE
Serviços Médicos de Pediatria,Ao abrigo de acordo-quadro (art.º 259.º),Aquisição de serviços,"85121291-9, Serviços de pediatria","Centro Hospitalar do Algarve, E. P. E. (510745997)","Kelly Services - Healthcare, Unipessoal, Lda. (510723691)","71.760,00 €",09-03-2017,12-01-2017,90 dias,"Portugal, Faro, Portimão",Artigo 155.º do Código dos Contratos Públicos,"","","","",,1490434,ACORDO QUADRO PARA PRESTAÇÃO DE SERVIÇOS MÉDICOS ÀS INSTITUIÇÕES E SERVIÇOS DO SERVIÇO NACIONAL DE SAÚDE,FALSE
"4S0009/2016 REFORÇO MÉD MEDICINA INTERNA, NO AMBITO DO PLANO CONTINGENCIA TEMPERATURAS ADVERSAS - MODULO FRIO",Ajuste Direto Regime Geral,Aquisição de serviços,"79625000-1, Serviços de fornecimento de pessoal médico","Centro Hospitalar Barreiro Montijo, E. P. E. (509186998)","Kelly Services - Healthcare, Unipessoal, Lda. (510723691)","9.090,00 €",09-03-2017,07-01-2016,62 dias,"Portugal, Setúbal, Barreiro","Artigo 20.º, n.º 1, alínea a) do Código dos Contratos Públicos",11-04-2016,"8.955,00 €","",Consumo efetivo inferior ao inicialmente estimado,,Não aplicável.,Não aplicável.,FALSE
Prestação de serviços médicos especialistas em Anestesiologia,Ajuste Direto Regime Geral,Aquisição de serviços,"85121000-3, Serviços de prática médica","Centro Hospitalar Cova da Beira, EPE (506361659)","Kelly Services - Healthcare, Unipessoal, Lda. (510723691)","51.205,00 €",14-02-2017,27-05-2016,214 dias,"Portugal, Castelo Branco, Covilhã","Artigo 20.º, n.º 1, alínea a) do Código dos Contratos Públicos","","","","",,Não aplicável.,Não aplicável.,FALSE
Prestação de serviços médicos sem especialidade para o Distrito da Grande Lisboa.,Ajuste Direto Regime Geral,Aquisição de serviços,"85100000-0, Serviços de saúde","Administração Regional de Saúde de Lisboa e Vale do Tejo, I. P. (503148776)","Kelly Services - Healthcare, Unipessoal, Lda. (510723691)","359.368,52 €",13-02-2017,07-02-2017,90 dias,"Portugal, Lisboa","Artigo 24.º, n.º 1, alínea e) do Código dos Contratos Públicos","","","","",,Não aplicável.,Não aplicável.,FALSE
Prestação de serviços médicos sem especialidade para o Distrito de Santarém,Ajuste Direto Regime Geral,Aquisição de serviços,"85100000-0, Serviços de saúde","Administração Regional de Saúde de Lisboa e Vale do Tejo, I. P. (503148776)","Kelly Services - Healthcare, Unipessoal, Lda. (510723691)","107.427,74 €",13-02-2017,07-02-2017,90 dias,"Portugal, Santarém","Artigo 24.º, n.º 1, alínea e) do Código dos Contratos Públicos","","","","",,Não aplicável.,Não aplicável.,FALSE
Prestação de serviços médicos sem especialidade para o Distrito de Setúbal,Ajuste Direto Regime Geral,Aquisição de serviços,"85100000-0, Serviços de saúde","Administração Regional de Saúde de Lisboa e Vale do Tejo, I. P. (503148776)","Kelly Services - Healthcare, Unipessoal, Lda. (510723691)","199.542,84 €",13-02-2017,07-02-2017,90 dias,"Portugal, Setúbal","Artigo 24.º, n.º 1, alínea e) do Código dos Contratos Públicos","","","","",,Não aplicável.,Não aplicável.,FALSE
Contratação de serviços médicos para os meses de abril e maio de 2016,Ajuste Direto Regime Geral,Aquisição de serviços,"85121000-3, Serviços de prática médica",Administração Regional de Saúde do Alentejo (ARSA) (503148768),"Kelly Services - Healthcare, Unipessoal, Lda. (510723691)","130.064,00 €",10-02-2017,01-04-2016,61 dias,"Portugal, Évora, Reguengos de Monsaraz<BR/>Portugal, Évora, Montemor-o-Novo<BR/>Portugal, Évora, Vila Viçosa<BR/>Portugal, Évora, Vendas Novas<BR/>Portugal, Évora, Estremoz<BR/>Portugal, Évora, Viana do Alentejo<BR/>Portugal, Évora, Arraiolos","Artigo 24.º, n.º 1, alínea c) do Código dos Contratos Públicos",31-05-2016,"126.539,75 €","",Número de horas efetuadas inferior ao número de horas contratadas.,,Não aplicável.,Não aplicável.,FALSE
Prestação de serviços médicos sem especialidade para o Distrito de Setúbal,Ajuste Direto Regime Geral,Aquisição de serviços,"85100000-0, Serviços de saúde","Administração Regional de Saúde de Lisboa e Vale do Tejo, I. P. (503148776)","Kelly Services, Lda (510723691)","182.418,66 €",03-02-2017,15-12-2016,60 dias,"Portugal, Lisboa, Lisboa","Artigo 24.º, n.º 1, alínea c) do Código dos Contratos Públicos","","","","",,Não aplicável.,Não aplicável.,FALSE
Prestação de serviços médicos sem especialidade para o Distrito da Grande Lisboa,Ajuste Direto Regime Geral,Aquisição de serviços,"85100000-0, Serviços de saúde","Administração Regional de Saúde de Lisboa e Vale do Tejo, I. P. (503148776)","Kelly Services, Lda (510723691)","350.686,80 €",02-02-2017,22-12-2016,60 dias,"Portugal, Lisboa","Artigo 24.º, n.º 1, alínea d) do Código dos Contratos Públicos","","","","",,Não aplicável.,Não aplicável.,FALSE
Prestação de serviços médicos sem especialidade para o Distrito de Santarém,Ajuste Direto Regime Geral,Aquisição de serviços,"85100000-0, Serviços de saúde","Administração Regional de Saúde de Lisboa e Vale do Tejo, I. P. (503148776)","Kelly Services, Lda (510723691)","148.580,46 €",02-02-2017,22-12-2016,60 dias,"Portugal, Santarém","Artigo 24.º, n.º 1, alínea c) do Código dos Contratos Públicos","","","","",,Não aplicável.,Não aplicável.,FALSE
4SI0023/2016 SERV MÉD DE MEDICINA INTERNA,Ao abrigo de acordo-quadro (art.º 259.º),Aquisição de serviços,"85141000-9, Serviços prestados pelo pessoal médico","Centro Hospitalar Barreiro Montijo, E. P. E. (509186998)","Kelly Services, Lda (510723691)","127.545,60 €",09-11-2016,06-05-2016,214 dias,"Portugal, Setúbal, Barreiro",Artigo 259.º do Código dos Contratos Públicos,31-12-2016,"103.981,20 €","",Consumo efetivo inferior ao inicialmente estimado,,1490434,ACORDO QUADRO PARA PRESTAÇÃO DE SERVIÇOS MÉDICOS ÀS INSTITUIÇÕES E SERVIÇOS DO SERVIÇO NACIONAL DE SAÚDE,FALSE
4SI0011/2016 PREST SERV MÉD UROLOGIA P ANO 2016 (ACORDO QUADRO DOS SPMS Nº 2012/102),Ao abrigo de acordo-quadro (art.º 259.º),Aquisição de serviços,"85141000-9, Serviços prestados pelo pessoal médico","Centro Hospitalar Barreiro Montijo, E. P. E. (509186998)","Kelly Services, Lda (510723691)","9.173,00 €",09-11-2016,18-01-2016,60 dias,"Portugal, Setúbal, Barreiro",Artigo 259.º do Código dos Contratos Públicos,31-03-2016,"10.819,20 €","",Houve necessidade de prolongar o procedimento por mais meses,,454020,"CONCURSO PÚBLICO PARA A CELEBRAÇÃO DE CONTRATOS PÚBLICOS DE APROVISIONAMENTO PARA A ÁREA DA SAÚDE, COM VISTA À PRESTAÇÃO DE SERVIÇOS MÉDICOS ÀS INSTITUIÇÕES E SERVIÇOS DO SERVIÇO NACIONAL DE SAÚDE",FALSE
4SI0006/2016 PREST SERV MÉD MEDICINA P ANO 2016 (ACORDO QUADRO DOS SPMS Nº 2012/102),Ao abrigo de acordo-quadro (art.º 259.º),Aquisição de serviços,"85141000-9, Serviços prestados pelo pessoal médico","Centro Hospitalar Barreiro Montijo, E. P. E. (509186998)","Kelly Services, Lda (510723691)","36.442,00 €",09-11-2016,18-01-2016,60 dias,"Portugal, Setúbal, Barreiro",Artigo 259.º do Código dos Contratos Públicos,31-05-2016,"54.034,60 €","",Houve necessidade de reforço por mais 3 meses,,454020,"CONCURSO PÚBLICO PARA A CELEBRAÇÃO DE CONTRATOS PÚBLICOS DE APROVISIONAMENTO PARA A ÁREA DA SAÚDE, COM VISTA À PRESTAÇÃO DE SERVIÇOS MÉDICOS ÀS INSTITUIÇÕES E SERVIÇOS DO SERVIÇO NACIONAL DE SAÚDE",FALSE
Aquisição de Serviços de Farmacêuticos - 2.º Semestre 2016,Ajuste Direto Regime Geral,Aquisição de serviços,"85000000-9, Serviços de saúde e acção social","Centro Hospitalar Vila Nova de Gaia - Espinho, E. P. E. (508142156)","Kelly Services, Lda (510723691)","23.400,00 €",27-10-2016,20-10-2016,180 dias,"Portugal, Porto, Vila Nova de Gaia","Artigo 20.º, n.º 1, alínea a) do Código dos Contratos Públicos","","","","",,Não aplicável.,Não aplicável.,FALSE
"Serviços Médicos Ortopedia, Pediatria, Anestesiologia, Obstetrícia",Ajuste Direto Regime Geral,Aquisição de serviços,"85121200-5, Serviços de medicina especializada","Centro Hospitalar do Algarve, E. P. E. (510745997)","Kelly services - Healthcare, Unipessoal, Lda (510723691)","149.872,00 €",06-09-2016,04-08-2016,137 dias,"Portugal, Faro, Portimão<BR/>Portugal, Faro, Faro","Artigo 24.º, n.º 1, alínea c) do Código dos Contratos Públicos","","","","",,Não aplicável.,Não aplicável.,FALSE
"Serviços Médicos Ortopedia, Pediatria, Anestesiologia, Obstetrícia",Ajuste Direto Regime Geral,Aquisição de serviços,"85121200-5, Serviços de medicina especializada","Centro Hospitalar do Algarve, E. P. E. (510745997)","Kelly services - Healthcare, Unipessoal, Lda (510723691)","149.872,00 €",06-09-2016,14-07-2016,30 dias,"Portugal, Faro, Faro<BR/>Portugal, Faro, Portimão","Artigo 24.º, n.º 1, alínea c) do Código dos Contratos Públicos","","","","",,Não aplicável.,Não aplicável.,FALSE
Aquisição de serviços médicos APROV-PRT 02/2016/Baixo Tâmega/ARSN,Ajuste Direto Regime Geral,Aquisição de serviços,"79625000-1, Serviços de fornecimento de pessoal médico","Administração Regional de Saúde do Norte,IP (ARSN) (503135593)","Kelly Services, Lda. (510723691)","200.928,00 €",02-08-2016,24-02-2016,366 dias,"Portugal, Porto, Baião","Artigo 24.º, n.º 1, alínea c) do Código dos Contratos Públicos",30-12-2016,"200.928,00 €","","",,Não aplicável.,Não aplicável.,FALSE
"Serviços Médicos Urgência Geral, Básica e Pediátrica",Ajuste Direto Regime Geral,Aquisição de serviços,"85121100-4, Serviços de médicos de clínica geral","Centro Hospitalar do Algarve, E. P. E. (510745997)","Kelly Services - Healthcare, Unipessoal, Lda (510723691)","242.073,00 €",29-07-2016,20-07-2016,274 dias,"Portugal, Faro, Vila Real Sto Antonio<BR/>Portugal, Faro, Albufeira<BR/>Portugal, Faro, Faro<BR/>Portugal, Faro, Portimão<BR/>Portugal, Faro, Loulé<BR/>Portugal, Faro, Lagos","Artigo 24.º, n.º 1, alínea c) do Código dos Contratos Públicos","","","","",,Não aplicável.,Não aplicável.,FALSE
Prestação de Serviços Médicos ao abrigo do catálogo,Ao abrigo de acordo-quadro (art.º 259.º),Aquisição de serviços,"85100000-0, Serviços de saúde","Administração Regional de Saúde do Algarve, I.P. (503148709)","Kelly Services - Healthcare Unipessoal, Lda (510723691)","672.735,00 €",28-07-2016,14-07-2016,170 dias,"Portugal, Faro, Faro",Artigo 259.º do Código dos Contratos Públicos,31-12-2016,"310.643,18 €","",Não foram utilizadas todas as horas previstas no contrato,,1490434,ACORDO QUADRO PARA PRESTAÇÃO DE SERVIÇOS MÉDICOS ÀS INSTITUIÇÕES E SERVIÇOS DO SERVIÇO NACIONAL DE SAÚDE,FALSE
Contrato de prestação de serviços – Fisioterapeutas para o Serviço de MFR,Ajuste Direto Regime Geral,Aquisição de serviços,"98110000-7, Serviços prestados por organizações empresariais, profissionais e especializadas","HOSPITAL PROFESSOR DOUTOR FERNANDO FONSECA, EPE (503035416)","Kelly Services - Healthcare, Unipessoal, Lda. (510723691)","17.035,20 €",18-07-2016,05-07-2016,182 dias,"Portugal, Lisboa, Amadora","Artigo 20.º, n.º 1, alínea a) do Código dos Contratos Públicos","","","","",,Não aplicável.,Não aplicável.,FALSE
"Prestação de Serviços Médicos de MGF no Centro de Saúde de Nisa, na ULSNA, EPE (Junho/2016)",Ajuste Direto Regime Geral,Aquisição de serviços,"85100000-0, Serviços de saúde","Unidade Local de Saúde do Norte Alentejano, E. P. E. (508094461)","Kelly Services - Helthcare, Unipessoal, Lda (510723691)","3.785,00 €",20-06-2016,17-06-2016,30 dias,"Portugal, Portalegre, Nisa","Artigo 24.º, n.º 1, alínea c) do Código dos Contratos Públicos",17-06-2016,"3.785,00 €","","",,Não aplicável.,Não aplicável.,FALSE
Prestação de Serviços Médicos,Ao abrigo de acordo-quadro (art.º 259.º),Aquisição de serviços,"85120000-6, Serviços de prática médica e serviços conexos","Hospital do Espírito Santo de Évora, E. P. E. (508085888)","KELLY SERVICES - HEALTHCARE UNIPESSOAL LDA (510723691), MEDIPEOPLE- LDA (508543436)","436.957,62 €",09-06-2016,07-04-2016,270 dias,"Portugal, Évora, Évora","Artigo 20.º, n.º 1, alínea b) do Código dos Contratos Públicos","","","","",,1490434,ACORDO QUADRO PARA PRESTAÇÃO DE SERVIÇOS MÉDICOS ÀS INSTITUIÇÕES E SERVIÇOS DO SERVIÇO NACIONAL DE SAÚDE,FALSE
Aquisição de serviços médicos para a USF Remo,Concurso público,Aquisição de serviços,"85121200-5, Serviços de medicina especializada","Administração Regional de Saúde do Alentejo, I. P. (503148768)","Kelly Services - Healthcare, Unipessoal, Lda. (510723691)","13.500,00 €",06-05-2016,28-12-2015,60 dias,"Portugal, Évora, Reguengos de Monsaraz",Artigo 155.º do Código dos Contratos Públicos,29-02-2016,"14.200,00 €","",Número de horas prestadas superior ao número de horas contratadas,,Não aplicável.,Não aplicável.,FALSE
Aquisição de serviços médicos para a USF Lusitânia,Concurso público,Aquisição de serviços,"85121200-5, Serviços de medicina especializada","Administração Regional de Saúde do Alentejo, I. P. (503148768)","Kelly Services - Healthcare, Unipessoal, Lda. (510723691)","9.000,00 €",06-05-2016,28-12-2015,60 dias,"Portugal, Évora, Évora",Artigo 155.º do Código dos Contratos Públicos,29-02-2016,"900,00 €","",Número de horas prestadas inferior ao número de horas contratadas,,Não aplicável.,Não aplicável.,FALSE
Contratação de serviços médicos para a UCSP de Vila Viçosa,Concurso público,Aquisição de serviços,"85121200-5, Serviços de medicina especializada","Administração Regional de Saúde do Alentejo, I. P. (503148768)","Kelly Services - Healthcare, Unipessoal, Lda. (510723691)","4.500,00 €",06-05-2016,28-12-2015,60 dias,"Portugal, Évora, Vila Viçosa",Artigo 155.º do Código dos Contratos Públicos,29-02-2016,"4.675,00 €","",Número de horas prestadas superior ao número de horas contratadas,,Não aplicável.,Não aplicável.,FALSE
Aquisição de serviços médicos para a UCSP de Viana do Alentejo,Concurso público,Aquisição de serviços,"85121200-5, Serviços de medicina especializada","Administração Regional de Saúde do Alentejo, I. P. (503148768)","Kelly Services - Healthcare, Unipessoal, Lda. (510723691)","4.500,00 €",06-05-2016,28-12-2015,60 dias,"Portugal, Évora, Viana do Alentejo",Artigo 155.º do Código dos Contratos Públicos,29-02-2016,"3.950,00 €","",Número de horas prestadas inferior ao número de horas contratadas,,Não aplicável.,Não aplicável.,FALSE
Aquisição de serviços médicos para a UCSP de Estremoz,Concurso público,Aquisição de serviços,"85121200-5, Serviços de medicina especializada","Administração Regional de Saúde do Alentejo, I. P. (503148768)","Kelly Services - Healthcare, Unipessoal, Lda. (510723691)","9.000,00 €",06-05-2016,28-12-2015,60 dias,"Portugal, Évora, Portel",Artigo 155.º do Código dos Contratos Públicos,29-02-2016,"8.100,00 €","",Número de horas prestadas inferior ao número de horas contratadas,,Não aplicável.,Não aplicável.,FALSE
Aquisição de serviços médicos para o SAP de Vendas Novas,Concurso público,Aquisição de serviços,"85121100-4, Serviços de médicos de clínica geral","Administração Regional de Saúde do Alentejo, I. P. (503148768)","Kelly Services - Healthcare, Unipessoal, Lda. (510723691)","24.948,00 €",06-05-2016,28-12-2015,60 dias,"Portugal, Évora, Vendas Novas",Artigo 155.º do Código dos Contratos Públicos,29-02-2016,"23.268,00 €","",Número de horas prestadas inferior ao número de horas contratadas,,Não aplicável.,Não aplicável.,FALSE
Aquisição de serviços médicos para o SUB de Montemor-o-Novo,Concurso público,Aquisição de serviços,"85121100-4, Serviços de médicos de clínica geral","Administração Regional de Saúde do Alentejo, I. P. (503148768)","Kelly Services - Healthcare, Unipessoal, Lda. (510723691)","31.752,00 €",06-05-2016,28-12-2015,60 dias,"Portugal, Évora, Montemor-o-Novo",Artigo 155.º do Código dos Contratos Públicos,29-02-2016,"28.213,50 €","",Número de horas prestadas inferior ao número de horas contratadas,,Não aplicável.,Não aplicável.,FALSE
Aquisição de serviços médicos para o SUB de Estremoz,Concurso público,Aquisição de serviços,"85121100-4, Serviços de médicos de clínica geral","Administração Regional de Saúde do Alentejo, I. P. (503148768)","Kelly Services - Healthcare, Unipessoal, Lda. (510723691)","43.092,00 €",06-05-2016,28-12-2015,60 dias,"Portugal, Évora, Estremoz",Artigo 155.º do Código dos Contratos Públicos,29-02-2016,"40.131,42 €","",Número de horas prestadas inferior ao número de horas contratadas,,Não aplicável.,Não aplicável.,FALSE
Aquisição de serviços médicos para o SUB de Estremoz para o período de 22 de outubro a 31 de dezembro de 2015.,Concurso público,Aquisição de serviços,"85121100-4, Serviços de médicos de clínica geral","Administração Regional de Saúde do Alentejo, I. P. (503148768)","Kelly Services - Healthcare, Unipessoal, Lda. (510723691)","51.047,04 €",05-05-2016,22-10-2015,71 dias,"Portugal, Évora, Estremoz",Artigo 155.º do Código dos Contratos Públicos,31-12-2015,"49.470,01 €","",Número de horas prestadas inferior ao número de horas contratadas.,,Não aplicável.,Não aplicável.,FALSE
Contratação serviços médicos para o ACES Alentejo Central para o mês de março de 2016.,Ajuste Direto Regime Geral,Aquisição de serviços,"85121000-3, Serviços de prática médica",Administração Regional de Saúde do Alentejo (ARSA) (503148768),"Kelly Services - Healthcare, Unipessoal, Lda. (510723691)","70.544,00 €",27-04-2016,29-02-2016,31 dias,"Portugal, Évora","Artigo 20.º, n.º 1, alínea a) do Código dos Contratos Públicos",31-03-2016,"63.856,38 €","",O número de horas efectivamente prestadas inferior ao número de horas contratadas.,,Não aplicável.,Não aplicável.,FALSE
Prestação de Serviços Médicos de MGF no CS de Nisa (Março a Abril de 2016),Ajuste Direto Regime Geral,Aquisição de serviços,"85000000-9, Serviços de saúde e acção social","Unidade Local de Saúde do Norte Alentejano, E. P. E. (508094461)","Kelly Services - Healthcare, Unipessoal, Lda. (510723691)","7.571,80 €",11-04-2016,15-03-2016,61 dias,"Portugal, Portalegre, Nisa","Artigo 24.º, n.º 1, alínea b) do Código dos Contratos Públicos",11-04-2016,"7.571,80 €","","",,Não aplicável.,Não aplicável.,FALSE
Serviços Médicos Urgência Geral e Básica,Ajuste Direto Regime Geral,Aquisição de serviços,"85121100-4, Serviços de médicos de clínica geral","Centro Hospitalar do Algarve, E. P. E. (510745997)","Kelly Services - Healthcare, Unipessoal, Lda (510723691)","40.345,50 €",08-04-2016,26-02-2016,91 dias,"Portugal, Faro, Loulé<BR/>Portugal, Faro, Albufeira<BR/>Portugal, Faro, Portimão<BR/>Portugal, Faro, Faro<BR/>Portugal, Faro, Vila Real Sto Antonio<BR/>Portugal, Faro, Lagos","Artigo 24.º, n.º 1, alínea c) do Código dos Contratos Públicos",30-04-2016,"60.973,43 €","","O valor inicial do Contrato teve por base as necessidades estimadas para o período de 1 Janeiro de 2016 a 31 de Março de 2016, o valor final reflecte as necessidades efectivas.",,Não aplicável.,Não aplicável.,FALSE
Prestação de serviços médicos -Radiologoia,Concurso público,Aquisição de serviços,"85150000-5, Serviços de imagiologia médica","Hospital do Espírito Santo de Évora, E. P. E. (508085888)",KELLY SERVICES - HEALTHCARE UNIPESSOAL LDA (510723691),"41.760,00 €",30-03-2016,04-08-2015,120 dias,"Portugal, Évora, Évora","Artigo 20.º, n.º 1, alínea b) do Código dos Contratos Públicos","","","","",,Não aplicável.,Não aplicável.,FALSE
Serviços Médicos Urgência Geral e Básica  Proc 78/1300/2016,Ajuste Direto Regime Geral,Aquisição de serviços,"85121100-4, Serviços de médicos de clínica geral","Centro Hospitalar do Algarve, E. P. E. (510745997)","Kelly Services- Healthcare, Unipessoal, Lda (510723691)","8.048,41 €",24-03-2016,04-02-2016,31 dias,"Portugal, Faro, Loulé<BR/>Portugal, Faro, Faro<BR/>Portugal, Faro, Portimão<BR/>Portugal, Faro, Albufeira","Artigo 24.º, n.º 1, alínea c) do Código dos Contratos Públicos",14-03-2016,"8.048,41 €","","",,Não aplicável.,Não aplicável.,FALSE
AQUISIÇÃO DE SERVIÇOS MEDICOS PARA A ORTOPEDIA CHLO,Ajuste Direto Regime Geral,Aquisição de serviços,"85100000-0, Serviços de saúde","Centro Hospitalar de Lisboa Ocidental, EPE (CHLO) (507618319)",KELLY SERVICES (510723691),"29,65 €",17-03-2016,03-02-2016,60 dias,"Portugal, Lisboa, Lisboa","Artigo 24.º, n.º 1, alínea c) do Código dos Contratos Públicos","","","","",,Não aplicável.,Não aplicável.,FALSE
Prestação de Serviços Medicos,Concurso público,Aquisição de serviços,"85100000-0, Serviços de saúde","Administração Regional de Saúde do Algarve, I. P. (503148709)",Kelly Services - Healthcare Unipessoal Lda (510723691),"205.616,00 €",02-03-2016,19-02-2016,314 dias,"Portugal, Faro, Faro","Artigo 20.º, n.º 1, alínea b) do Código dos Contratos Públicos",21-11-2016,"205.587,50 €",,,,Não aplicável.,Não aplicável.,FALSE
CONTRATO DE AQUISIÇÃO DE PRESTAÇÃO DE SERVIÇOS DE 3 TÉCNICOS DE DIAGNÓSTICO E TERAPÊUTICA DE RADIOLOGIA,Ajuste Direto Regime Geral,Aquisição de serviços,"98110000-7, Serviços prestados por organizações empresariais, profissionais e especializadas","Hospital Professor Doutor Fernando Fonseca, E. P. E. (503035416)","Kelly Services – Healthcare, Unipessoal, Lda (510723691)","13.147,20 €",23-02-2016,15-02-2016,90 dias,"Portugal, Lisboa, Amadora","Artigo 20.º, n.º 1, alínea a) do Código dos Contratos Públicos","","","","",,Não aplicável.,Não aplicável.,FALSE
Prestação de Serviços Médicos Sem Especialidade para o Distrito de Lisboa,Ao abrigo de acordo-quadro (art.º 259.º),Aquisição de serviços,"85100000-0, Serviços de saúde","Administração Regional de Saúde de Lisboa e Vale do Tejo, I. P. (503148776)","Kelly Services Healthcare Unipessoal, Lda. (510723691)","1.360.466,54 €",12-02-2016,01-01-2016,366 dias,"Portugal, Lisboa",Artigo 259.º do Código dos Contratos Públicos,"","","","",,1490434,ACORDO QUADRO PARA PRESTAÇÃO DE SERVIÇOS MÉDICOS ÀS INSTITUIÇÕES E SERVIÇOS DO SERVIÇO NACIONAL DE SAÚDE,FALSE
Prestação de Serviços Médicos Sem Especialidade  para o Distrito de Setúbal,Ao abrigo de acordo-quadro (art.º 259.º),Aquisição de serviços,"85100000-0, Serviços de saúde","Administração Regional de Saúde de Lisboa e Vale do Tejo, I. P. (503148776)","Kelly Services Healthcare Unipessoal, Lda. (510723691)","762.658,34 €",12-02-2016,01-01-2016,366 dias,"Portugal, Setúbal",Artigo 259.º do Código dos Contratos Públicos,"","","","",,1490434,ACORDO QUADRO PARA PRESTAÇÃO DE SERVIÇOS MÉDICOS ÀS INSTITUIÇÕES E SERVIÇOS DO SERVIÇO NACIONAL DE SAÚDE,FALSE
Prestação de Serviços Médicos Sem Especialidade para o Distrito de Santarém,Ao abrigo de acordo-quadro (art.º 259.º),Aquisição de serviços,"85100000-0, Serviços de saúde","Administração Regional de Saúde de Lisboa e Vale do Tejo, I. P. (503148776)","Kelly Services - Healthcare, Lda. (510723691)","406.690,73 €",12-02-2016,01-01-2016,366 dias,"Portugal, Santarém",Artigo 259.º do Código dos Contratos Públicos,"","","","",,1490434,ACORDO QUADRO PARA PRESTAÇÃO DE SERVIÇOS MÉDICOS ÀS INSTITUIÇÕES E SERVIÇOS DO SERVIÇO NACIONAL DE SAÚDE,FALSE
"Prestação de Serviços Médicos, na Especialidade de MGF, nos Centros de Saúde de Montargil e Nisa na ULSNA, EPE (Janeiro a Fevereiro/2016)",Ajuste Direto Regime Geral,Aquisição de serviços,"85100000-0, Serviços de saúde","Unidade Local de Saúde do Norte Alentejano, E. P. E. (508094461)","Kelly Services-Healthcare, Unipessoal, Lda (510723691)","11.803,10 €",02-02-2016,21-12-2015,60 dias,"Portugal, Portalegre, Nisa","Artigo 24.º, n.º 1, alínea c) do Código dos Contratos Públicos",21-12-2015,"11.803,10 €","","",,Não aplicável.,Não aplicável.,FALSE
Prestação de Serviços de Farmacêuticos,Ajuste Direto Regime Geral,Aquisição de serviços,"85149000-5, Serviços farmacêuticos","Centro Hospitalar Vila Nova de Gaia - Espinho, E. P. E. (508142156)","Kelly Services - Healthcare, Unipessoal, Lda (510723691)","23.400,00 €",02-02-2016,28-01-2016,185 dias,"Portugal, Porto, Vila Nova de Gaia","Artigo 20.º, n.º 1, alínea a) do Código dos Contratos Públicos","","","","",,Não aplicável.,Não aplicável.,FALSE
Serviços Médicos de Urgência Geral e Básica,Ajuste Direto Regime Geral,Aquisição de serviços,"85121100-4, Serviços de médicos de clínica geral","Centro Hospitalar do Algarve, E. P. E. (510745997)","Kelly Services - Healthcare, Unipessoal, Lda (510723691)","81.622,05 €",13-01-2016,29-10-2015,122 dias,"Portugal, Faro, Loulé<BR/>Portugal, Faro, Vila Real Sto Antonio<BR/>Portugal, Faro, Albufeira<BR/>Portugal, Faro, Lagos<BR/>Portugal, Faro, Portimão<BR/>Portugal, Faro, Faro","Artigo 24.º, n.º 1, alínea c) do Código dos Contratos Públicos",31-12-2015,"19.386,53 €","","O valor inicial do Contrato teve por base as necessidades estimadas para o período de 1 Outubro de 2016 a 31 Dezembro de 2016, o valor final reflecte as necessidades efectivas.",,Não aplicável.,Não aplicável.,FALSE
Serviços na área da psicologia,Concurso público,Aquisição de serviços,"75120000-3, Serviços administrativos das agências","Administração Regional de Saúde de Lisboa e Vale do Tejo, I. P. (503148776)","Kelly Services Healthcare Unipessoal, Lda. (510723691)","28.182,00 €",01-12-2015,03-11-2015,424 dias,"Portugal, Lisboa, Lisboa",Artigo 155.º do Código dos Contratos Públicos,"","","","",,Não aplicável.,Não aplicável.,FALSE
Serviços na área da nutrição,Concurso público,Aquisição de serviços,"75120000-3, Serviços administrativos das agências","Administração Regional de Saúde de Lisboa e Vale do Tejo, I. P. (503148776)","Kelly Services Healthcare Unipessoal, Lda. (510723691)","93.940,00 €",01-12-2015,03-11-2015,424 dias,"Portugal, Lisboa, Lisboa",Artigo 155.º do Código dos Contratos Públicos,"","","","",,Não aplicável.,Não aplicável.,FALSE
Serviços de Supervisão na área da nutrição,Concurso público,Aquisição de serviços,"75120000-3, Serviços administrativos das agências","Administração Regional de Saúde de Lisboa e Vale do Tejo, I. P. (503148776)","Kelly Services Healthcare Unipessoal, Lda. (510723691)","25.132,00 €",01-12-2015,03-11-2015,424 dias,"Portugal, Lisboa, Lisboa",Artigo 155.º do Código dos Contratos Públicos,"","","","",,Não aplicável.,Não aplicável.,FALSE
Prestação de serviços médicos de Anestesiologia,Ajuste Direto Regime Geral,Aquisição de serviços,"79625000-1, Serviços de fornecimento de pessoal médico","Centro Hospitalar Cova da Beira, EPE (506361659)",Kelly Services (510723691),"41,80 €",27-10-2015,01-10-2014,365 dias,"Portugal, Castelo Branco, Covilhã",Artigo 258.º do Código dos Contratos Públicos,"","","","",,Não aplicável.,Não aplicável.,FALSE
4DS0285/2014 PREST SERV MED ANESTESIA P MES OUTUBRO (P COLMATAR FALHAS),Ao abrigo de acordo-quadro (art.º 259.º),Aquisição de serviços,"79625000-1, Serviços de fornecimento de pessoal médico","Centro Hospitalar Barreiro Montijo, E. P. E. (509186998)","KELLY SERVICES - HEALTHCARE, UNIPESSOAL, LDA (510723691)","301,35 €",18-09-2015,04-11-2014,30 dias,"Portugal, Setúbal, Barreiro",Artigo 259.º do Código dos Contratos Públicos,04-11-2014,"301,35 €","","",,454020,"CONCURSO PÚBLICO PARA A CELEBRAÇÃO DE CONTRATOS PÚBLICOS DE APROVISIONAMENTO PARA A ÁREA DA SAÚDE, COM VISTA À PRESTAÇÃO DE SERVIÇOS MÉDICOS ÀS INSTITUIÇÕES E SERVIÇOS DO SERVIÇO NACIONAL DE SAÚDE",FALSE
4DS0256/2014 PREST SERV MED ANESTESIA P MES SETEMBRO (P COLMATAR FALHAS),Ao abrigo de acordo-quadro (art.º 259.º),Aquisição de serviços,"79625000-1, Serviços de fornecimento de pessoal médico","Centro Hospitalar Barreiro Montijo, E. P. E. (509186998)","KELLY SERVICES - HEALTHCARE, UNIPESSOAL, LDA (510723691)","661,50 €",18-09-2015,07-10-2014,30 dias,"Portugal, Setúbal, Barreiro",Artigo 259.º do Código dos Contratos Públicos,07-10-2014,"661,50 €","","",,454020,"CONCURSO PÚBLICO PARA A CELEBRAÇÃO DE CONTRATOS PÚBLICOS DE APROVISIONAMENTO PARA A ÁREA DA SAÚDE, COM VISTA À PRESTAÇÃO DE SERVIÇOS MÉDICOS ÀS INSTITUIÇÕES E SERVIÇOS DO SERVIÇO NACIONAL DE SAÚDE",FALSE
4DS0251/2014 SERV MED ANESTESIA P MES AGOSTO (P COLMATAR FALHAS),Ao abrigo de acordo-quadro (art.º 259.º),Aquisição de serviços,"79625000-1, Serviços de fornecimento de pessoal médico","Centro Hospitalar Barreiro Montijo, E. P. E. (509186998)","KELLY SERVICES - HEALTHCARE, UNIPESSOAL, LDA (510723691)","1.043,70 €",18-09-2015,31-08-2014,30 dias,"Portugal, Setúbal, Barreiro",Artigo 259.º do Código dos Contratos Públicos,31-08-2014,"1.043,70 €","","",,454020,"CONCURSO PÚBLICO PARA A CELEBRAÇÃO DE CONTRATOS PÚBLICOS DE APROVISIONAMENTO PARA A ÁREA DA SAÚDE, COM VISTA À PRESTAÇÃO DE SERVIÇOS MÉDICOS ÀS INSTITUIÇÕES E SERVIÇOS DO SERVIÇO NACIONAL DE SAÚDE",FALSE
4DS0220/2014 SERV MED ANESTESIA P MES JULHO (P COLMATAR FALHAS),Ao abrigo de acordo-quadro (art.º 259.º),Aquisição de serviços,"79625000-1, Serviços de fornecimento de pessoal médico","Centro Hospitalar Barreiro Montijo, E. P. E. (509186998)","KELLY SERVICES - HEALTHCARE, UNIPESSOAL, LDA (510723691)","308,70 €",18-09-2015,21-08-2014,30 dias,"Portugal, Setúbal, Barreiro",Artigo 259.º do Código dos Contratos Públicos,21-08-2014,"308,70 €","","",,454020,"CONCURSO PÚBLICO PARA A CELEBRAÇÃO DE CONTRATOS PÚBLICOS DE APROVISIONAMENTO PARA A ÁREA DA SAÚDE, COM VISTA À PRESTAÇÃO DE SERVIÇOS MÉDICOS ÀS INSTITUIÇÕES E SERVIÇOS DO SERVIÇO NACIONAL DE SAÚDE",FALSE
4DS0182/2014 PREST SERV MED DE ANESTESIA P MES JUNHO (P COLMATAR FALHAS),Ao abrigo de acordo-quadro (art.º 259.º),Aquisição de serviços,"79625000-1, Serviços de fornecimento de pessoal médico","Centro Hospitalar Barreiro Montijo, E. P. E. (509186998)","KELLY SERVICES - HEALTHCARE, UNIPESSOAL, LDA (510723691)","1.661,10 €",18-09-2015,24-07-2014,30 dias,"Portugal, Setúbal, Barreiro",Artigo 259.º do Código dos Contratos Públicos,24-07-2014,"1.661,10 €","","",,454020,"CONCURSO PÚBLICO PARA A CELEBRAÇÃO DE CONTRATOS PÚBLICOS DE APROVISIONAMENTO PARA A ÁREA DA SAÚDE, COM VISTA À PRESTAÇÃO DE SERVIÇOS MÉDICOS ÀS INSTITUIÇÕES E SERVIÇOS DO SERVIÇO NACIONAL DE SAÚDE",FALSE
4DS087/2014 PREST SERV MED ANESTESIA NO MES DE MAIO (P/ COLMATAR FALHAS),Ao abrigo de acordo-quadro (art.º 259.º),Aquisição de serviços,"79625000-1, Serviços de fornecimento de pessoal médico","Centro Hospitalar Barreiro Montijo, E. P. E. (509186998)","KELLY SERVICES - HEALTHCARE, UNIPESSOAL, LDA (510723691)","1.572,90 €",17-09-2015,05-06-2014,30 dias,"Portugal, Setúbal, Barreiro",Artigo 259.º do Código dos Contratos Públicos,05-06-2014,"1.572,90 €","","",,454020,"CONCURSO PÚBLICO PARA A CELEBRAÇÃO DE CONTRATOS PÚBLICOS DE APROVISIONAMENTO PARA A ÁREA DA SAÚDE, COM VISTA À PRESTAÇÃO DE SERVIÇOS MÉDICOS ÀS INSTITUIÇÕES E SERVIÇOS DO SERVIÇO NACIONAL DE SAÚDE",FALSE
4DS0112/2014 PREST SERV MEDICOS DE ANESTESIA PARA O MES DE MARÇO (P COLMATAR FALHAS),Ao abrigo de acordo-quadro (art.º 259.º),Aquisição de serviços,"79625000-1, Serviços de fornecimento de pessoal médico","Centro Hospitalar Barreiro Montijo, E. P. E. (509186998)","KELLY SERVICES - HEALTHCARE, UNIPESSOAL, LDA (510723691)","1.822,80 €",17-09-2015,08-04-2014,30 dias,"Portugal, Setúbal, Barreiro",Artigo 259.º do Código dos Contratos Públicos,08-04-2014,"1.822,80 €","","",,454020,"CONCURSO PÚBLICO PARA A CELEBRAÇÃO DE CONTRATOS PÚBLICOS DE APROVISIONAMENTO PARA A ÁREA DA SAÚDE, COM VISTA À PRESTAÇÃO DE SERVIÇOS MÉDICOS ÀS INSTITUIÇÕES E SERVIÇOS DO SERVIÇO NACIONAL DE SAÚDE",FALSE
4DS0095/2014 PREST SERV MED ANESTESIA PARA O MES DE FEVEREIRO (P COLMATAR FALHAS),Ao abrigo de acordo-quadro (art.º 259.º),Aquisição de serviços,"79625000-1, Serviços de fornecimento de pessoal médico","Centro Hospitalar Barreiro Montijo, E. P. E. (509186998)","KELLY SERVICES - HEALTHCARE, UNIPESSOAL, LDA (510723691)","676,20 €",16-09-2015,14-03-2014,28 dias,"Portugal, Setúbal, Barreiro","Artigo 20.º, n.º 1, alínea b) do Código dos Contratos Públicos",14-03-2014,"676,20 €","","",,454020,"CONCURSO PÚBLICO PARA A CELEBRAÇÃO DE CONTRATOS PÚBLICOS DE APROVISIONAMENTO PARA A ÁREA DA SAÚDE, COM VISTA À PRESTAÇÃO DE SERVIÇOS MÉDICOS ÀS INSTITUIÇÕES E SERVIÇOS DO SERVIÇO NACIONAL DE SAÚDE",FALSE
"Serviços médicos Urgência Geral e Básica, Sala de Reanimação, Decisão Clínica e So/Obs, Departamento de emergência e cuidados intensivos-78/2714/15",Ajuste Direto Regime Geral,Aquisição de serviços,"85121100-4, Serviços de médicos de clínica geral","Centro Hospitalar do Algarve, E. P. E. (510745997)","Kelly Services - Healthcare, Unipessoal, Lda (510723691)","81.622,05 €",26-08-2015,30-07-2015,92 dias,"Portugal, Faro, Albufeira<BR/>Portugal, Faro, Loulé<BR/>Portugal, Faro, Vila Real Sto Antonio<BR/>Portugal, Faro, Faro<BR/>Portugal, Faro, Portimão<BR/>Portugal, Faro, Lagos","Artigo 24.º, n.º 1, alínea c) do Código dos Contratos Públicos",30-09-2015,"80.318,58 €","","O valor inicial do Contrato teve por base as necessidades estimadas para o período de 1 Julho de 2015 a 30 de Setembro de 2015, o valor final reflecte as necessidades efectivas.",,Não aplicável.,Não aplicável.,FALSE
"Serviços médicos Urgência Geral e Básica, Sala de Reanimação, Decisão Clínica e So/Obs, Departamento de emergência e cuidados intensivos",Ajuste Direto Regime Geral,Aquisição de serviços,"85121100-4, Serviços de médicos de clínica geral","Centro Hospitalar do Algarve, E. P. E. (510745997)","Kelly Services-Healthcare, Unipessoal, Lda (510723691)","80.691,00 €",26-08-2015,30-07-2015,91 dias,"Portugal, Faro, Portimão<BR/>Portugal, Faro, Lagos<BR/>Portugal, Faro, Faro<BR/>Portugal, Faro, Albufeira<BR/>Portugal, Faro, Loulé<BR/>Portugal, Faro, Vila Real Sto Antonio","Artigo 24.º, n.º 1, alínea c) do Código dos Contratos Públicos",18-08-2015,"68.545,97 €","","O valor inicial do Contrato teve por base as necessidades estimadas para o período de 1 Abril de 2015 a 30 de Junho de 2015, o valor final reflecte as necessidades efectivas.",,Não aplicável.,Não aplicável.,FALSE
"Serviços médicos de urgência geral e básica, sala de reanimação, decisão clínica e So/Obs, Departamento de emergência e  Cuidados Intensivos",Ajuste Direto Regime Geral,Aquisição de serviços,"85121100-4, Serviços de médicos de clínica geral","Centro Hospitalar do Algarve, E. P. E. (510745997)","Kelly Services - Healthcare, Unipessoal, Lda (510723691)","27.497,01 €",25-08-2015,30-07-2015,31 dias,"Portugal, Faro, Albufeira<BR/>Portugal, Faro, Vila Real Sto Antonio<BR/>Portugal, Faro, Loulé<BR/>Portugal, Faro, Faro<BR/>Portugal, Faro, Lagos<BR/>Portugal, Faro, Portimão","Artigo 24.º, n.º 1, alínea c) do Código dos Contratos Públicos",30-07-2015,"21.827,95 €","","O valor inicial do Contrato teve por base as necessidades estimadas para o período de 1 Março de 2015 a 31 Março de 2015, o valor final reflecte as necessidades efectivas.",,Não aplicável.,Não aplicável.,FALSE
"Prestação sucessiva de cuidados de saúde à comunidade IPS, nos termos fixados no procedimento pré contratual",Ajuste Direto Regime Geral,Aquisição de serviços,"85100000-0, Serviços de saúde",Serviços de Acção Social do Instituto Politécnico de Setúbal (600083845),"Kelly Services - Healthcare Unipessoal, Lda. (510723691)","4.230,03 €",21-08-2015,29-09-2014,92 dias,"Portugal, Setúbal, Setúbal","Artigo 20.º, n.º 1, alínea a) do Código dos Contratos Públicos","","","","",,Não aplicável.,Não aplicável.,FALSE
Prestação de serviços de rediologia,Concurso público,Aquisição de serviços,"85150000-5, Serviços de imagiologia médica","Hospital do Espírito Santo de Évora, E. P. E. (508085888)",KELLY SERVICES - HEALTHCARE UNIPESSOAL LDA (510723691),"51.982,50 €",07-08-2015,15-06-2015,210 dias,"Portugal, Évora, Évora","Artigo 20.º, n.º 1, alínea b) do Código dos Contratos Públicos","","","","",,Não aplicável.,Não aplicável.,FALSE
AQUISIÇÃO DE SERVIÇOS MEDICOS PARA A ORTOPEDIA DO CHLO NO ANO DE 2015,Ao abrigo de acordo-quadro (art.º 259.º),Aquisição de serviços,"85000000-9, Serviços de saúde e acção social","Centro Hospitalar de Lisboa Ocidental, E. P. E. (507618319)",KELLY SERVICES (510723691),"19.213,00 €",08-07-2015,11-06-2015,214 dias,"Portugal, Lisboa, Lisboa",Artigo 259.º do Código dos Contratos Públicos,"","","","",,454020,"CONCURSO PÚBLICO PARA A CELEBRAÇÃO DE CONTRATOS PÚBLICOS DE APROVISIONAMENTO PARA A ÁREA DA SAÚDE, COM VISTA À PRESTAÇÃO DE SERVIÇOS MÉDICOS ÀS INSTITUIÇÕES E SERVIÇOS DO SERVIÇO NACIONAL DE SAÚDE",FALSE
Aquisição de serviços médicos,Ao abrigo de acordo-quadro (art.º 259.º),Aquisição de serviços,"85120000-6, Serviços de prática médica e serviços conexos","Hospital do Espírito Santo de Évora, E. P. E. (508085888)",Kelly Services (510723691),"425.779,20 €",12-06-2015,25-03-2015,280 dias,"Portugal, Évora, Évora",Artigo 259.º do Código dos Contratos Públicos,"","","","",,454020,"CONCURSO PÚBLICO PARA A CELEBRAÇÃO DE CONTRATOS PÚBLICOS DE APROVISIONAMENTO PARA A ÁREA DA SAÚDE, COM VISTA À PRESTAÇÃO DE SERVIÇOS MÉDICOS ÀS INSTITUIÇÕES E SERVIÇOS DO SERVIÇO NACIONAL DE SAÚDE",FALSE
"Serviços Médicos Urgência Geral e Básica, Sala Reanimação , Decisão clínica e So/OBS, Emerg e Cuidados Intensivos",Ajuste Direto Regime Geral,Aquisição de serviços,"85121100-4, Serviços de médicos de clínica geral","Centro Hospitalar do Algarve, E. P. E. (510745997)","Kelly Services - Healthcare Unipessoal, Lda (510723691)","55.863,00 €",04-06-2015,15-05-2015,59 dias,"Portugal, Faro, Faro<BR/>Portugal, Faro, Vila Real Sto Antonio<BR/>Portugal, Faro, Portimão<BR/>Portugal, Faro, Loulé<BR/>Portugal, Faro, Albufeira<BR/>Portugal, Faro, Lagos","Artigo 24.º, n.º 1, alínea c) do Código dos Contratos Públicos",27-07-2015,"78.477,17 €","","O valor inicial do Contrato teve por base as necessidades estimadas para o período de 1 Janeiro de 2015 a 28 Fevereiro de 2015, o valor final reflecte as necessidades efectivas.",,Não aplicável.,Não aplicável.,FALSE
4SI0010/2015 Serviços Médicos de Urologia,Ao abrigo de acordo-quadro (art.º 259.º),Aquisição de serviços,"79625000-1, Serviços de fornecimento de pessoal médico","Centro Hospitalar Barreiro Montijo, E. P. E. (509186998)","Kelly Services - Healthcare, Unipessoal Lda. (510723691)","45.864,00 €",14-05-2015,26-01-2015,365 dias,"Portugal, Setúbal, Barreiro",Artigo 259.º do Código dos Contratos Públicos,31-12-2015,"41.189,40 €","",Nº horas realizado inferior ao inicialmente estimado,,454020,"CONCURSO PÚBLICO PARA A CELEBRAÇÃO DE CONTRATOS PÚBLICOS DE APROVISIONAMENTO PARA A ÁREA DA SAÚDE, COM VISTA À PRESTAÇÃO DE SERVIÇOS MÉDICOS ÀS INSTITUIÇÕES E SERVIÇOS DO SERVIÇO NACIONAL DE SAÚDE",FALSE
4SI0004/2015 Serviços Médicos de Medicina,Ao abrigo de acordo-quadro (art.º 259.º),Aquisição de serviços,"79625000-1, Serviços de fornecimento de pessoal médico","Centro Hospitalar Barreiro Montijo, E. P. E. (509186998)","Kelly Services - Healthcare, Unipessoal Lda. (510723691)","218.649,60 €",14-05-2015,21-01-2015,365 dias,"Portugal, Setúbal, Barreiro",Artigo 259.º do Código dos Contratos Públicos,31-12-2015,"125.266,25 €","",Nº horas realzadas inferior ao inicialmente estimado,,454020,"CONCURSO PÚBLICO PARA A CELEBRAÇÃO DE CONTRATOS PÚBLICOS DE APROVISIONAMENTO PARA A ÁREA DA SAÚDE, COM VISTA À PRESTAÇÃO DE SERVIÇOS MÉDICOS ÀS INSTITUIÇÕES E SERVIÇOS DO SERVIÇO NACIONAL DE SAÚDE",FALSE
4S0042/2014 - Fornecimento de Serviços de Enfermagem ao CHBM EPE,Ajuste Direto Regime Geral,Aquisição de serviços,"79624000-4, Serviços de fornecimento de pessoal de enfermagem","CHBM - Centro Hospital Barreiro Montijo, EPE (509186998)","Kelly Services - Healthcare, Unipessoal Lda. (510723691)","40.352,00 €",27-03-2015,12-09-2014,122 dias,"Portugal, Setúbal, Barreiro","Artigo 20.º, n.º 1, alínea a) do Código dos Contratos Públicos",31-12-2014,"23.965,06 €","",Sem necessidade de consumo do total de horas estimadas,,Não aplicável.,Não aplicável.,FALSE
4S0035/2014 CONTRATAÇÃO DE SERVIÇOS DE ENFERMAGEM,Ajuste Direto Regime Geral,Aquisição de serviços,"79624000-4, Serviços de fornecimento de pessoal de enfermagem","Centro Hospitalar Barreiro Montijo, E. P. E. (509186998)","Kelly Services - Healthcare, Unipessoal Lda. (510723691)","15.132,00 €",27-03-2015,12-06-2014,184 dias,"Portugal, Setúbal, Barreiro","Artigo 20.º, n.º 1, alínea a) do Código dos Contratos Públicos",30-09-2014,"14.805,84 €","",Consumos inferiores aos inicialmente estimados,,Não aplicável.,Não aplicável.,FALSE
4SI0004/2014 Serviços Médicos de Medicina Interna,Ao abrigo de acordo-quadro (art.º 259.º),Aquisição de serviços,"79625000-1, Serviços de fornecimento de pessoal médico","Centro Hospitalar Barreiro Montijo, E. P. E. (509186998)","Kelly Services - Healthcare, Unipessoal Lda. (510723691)","224.640,00 €",27-03-2015,30-05-2014,365 dias,"Portugal, Setúbal, Barreiro",Artigo 259.º do Código dos Contratos Públicos,31-12-2014,"182.849,77 €","",Consumos inferiores aos inicialmente estimados,,454020,"CONCURSO PÚBLICO PARA A CELEBRAÇÃO DE CONTRATOS PÚBLICOS DE APROVISIONAMENTO PARA A ÁREA DA SAÚDE, COM VISTA À PRESTAÇÃO DE SERVIÇOS MÉDICOS ÀS INSTITUIÇÕES E SERVIÇOS DO SERVIÇO NACIONAL DE SAÚDE",FALSE
4SI0016/2014 Serviços Médicos de Urologia,Ao abrigo de acordo-quadro (art.º 259.º),Aquisição de serviços,"79625000-1, Serviços de fornecimento de pessoal médico","Centro Hospitalar Barreiro Montijo, E. P. E. (509186998)","Kelly Services - Healthare, Unipessoal Lda. (510723691)","12.600,00 €",27-03-2015,01-07-2014,214 dias,"Portugal, Setúbal, Barreiro",Artigo 259.º do Código dos Contratos Públicos,31-12-2014,"7.983,21 €","",Consumos inferiores aos inicialmente estimados,,454020,"CONCURSO PÚBLICO PARA A CELEBRAÇÃO DE CONTRATOS PÚBLICOS DE APROVISIONAMENTO PARA A ÁREA DA SAÚDE, COM VISTA À PRESTAÇÃO DE SERVIÇOS MÉDICOS ÀS INSTITUIÇÕES E SERVIÇOS DO SERVIÇO NACIONAL DE SAÚDE",FALSE
"PRESTAÇÃO DE SERVIÇOS MÉDICOS PARA A ÁREA DA DEPENDÊNCIA DA ARSLVT, IP PARA 2015",Ajuste Direto Regime Geral,Aquisição de serviços,"85100000-0, Serviços de saúde","Administração Regional de Saúde de Lisboa e Vale do Tejo, I. P. (503148776)","KELLY SERVICES - HEALTHCARE, UNIPESSOAL, LDA  (510723691)","11.199,96 €",17-03-2015,30-01-2015,365 dias,"Portugal, Santarém, Santarém",Artigo 258.º do Código dos Contratos Públicos,"","","","",,Não aplicável.,Não aplicável.,FALSE
PRESTAÇÃO DE SERVIÇOS MÉDICOS - PLANO DE CONTINGÊNCIA GRIPE 2015 - MÊS DE MARÇO,Ajuste Direto Regime Geral,Aquisição de serviços,"85100000-0, Serviços de saúde","Administração Regional de Saúde de Lisboa e Vale do Tejo, I. P. (503148776)","KELLY SERVICES - HEALTHCARE, UNIPESSOAL, LDA  (510723691)","352,20 €",17-03-2015,16-03-2015,31 dias,"Portugal, Lisboa, Torres Vedras","Artigo 24.º, n.º 1, alínea c) do Código dos Contratos Públicos","","","","",,Não aplicável.,Não aplicável.,FALSE
PRESTAÇÃO DE SERVIÇOS MÉDICOS - PLANO DE CONTINGÊNCIA GRIPE 2015 - MÊS DE JANEIRO,Ajuste Direto Regime Geral,Aquisição de serviços,"85100000-0, Serviços de saúde","Administração Regional de Saúde de Lisboa e Vale do Tejo, I. P. (503148776)","KELLY SERVICES - HEALTHCARE, UNIPESSOAL, LDA  (510723691)","704,40 €",17-03-2015,16-03-2015,31 dias,"Portugal, Lisboa, Torres Vedras","Artigo 24.º, n.º 1, alínea c) do Código dos Contratos Públicos","","","","",,Não aplicável.,Não aplicável.,FALSE
PRESTAÇÃO DE SERVIÇOS MÉDICOS - PLANO DE CONTINGÊNCIA GRIPE 2015 - MÊS DE FEVEREIRO,Ajuste Direto Regime Geral,Aquisição de serviços,"85100000-0, Serviços de saúde","Administração Regional de Saúde de Lisboa e Vale do Tejo, I. P. (503148776)","KELLY SERVICES - HEALTHCARE, UNIPESSOAL, LDA  (510723691)","1.408,00 €",16-03-2015,16-03-2015,28 dias,"Portugal, Lisboa, Torres Vedras","Artigo 24.º, n.º 1, alínea c) do Código dos Contratos Públicos","","","","",,Não aplicável.,Não aplicável.,FALSE
"PRESTAÇÃO DE SERVIÇOS MÉDICOS PARA A ÁREA DA DEPENDÊNCIA DA ARSLVT, IP PARA 2015",Ajuste Direto Regime Geral,Aquisição de serviços,"85100000-0, Serviços de saúde","Administração Regional de Saúde de Lisboa e Vale do Tejo, I. P. (503148776)","KELLY SERVICES - HEALTHCARE, UNIPESSOAL, LDA  (510723691)","38.948,11 €",09-03-2015,30-01-2015,365 dias,"Portugal, Lisboa, Lisboa",Artigo 258.º do Código dos Contratos Públicos,"","","","",,Não aplicável.,Não aplicável.,FALSE
"PRESTAÇÃO DE SERVIÇOS MÉDICOS PARA A ÁREA DA DEPENDÊNCIA DA ARSLVT, IP PARA 2015",Ajuste Direto Regime Geral,Aquisição de serviços,"85100000-0, Serviços de saúde","Administração Regional de Saúde de Lisboa e Vale do Tejo, I. P. (503148776)","KELLY SERVICES - HEALTHCARE, UNIPESSOAL, LDA  (510723691)","542.264,73 €",09-03-2015,30-01-2015,365 dias,"Portugal, Lisboa, Torres Vedras",Artigo 258.º do Código dos Contratos Públicos,"","","","",,Não aplicável.,Não aplicável.,FALSE
"PRESTAÇÃO DE SERVIÇOS MÉDICOS PARA A ÁREA DA DEPENDÊNCIA DA ARSLVT, IP PARA 2015",Ajuste Direto Regime Geral,Aquisição de serviços,"85100000-0, Serviços de saúde","Administração Regional de Saúde de Lisboa e Vale do Tejo, I. P. (503148776)","KELLY SERVICES - HEALTHCARE, UNIPESSOAL, LDA  (510723691)","347.815,68 €",09-03-2015,30-01-2015,365 dias,"Portugal, Setúbal, Almada",Artigo 258.º do Código dos Contratos Públicos,"","","","",,Não aplicável.,Não aplicável.,FALSE
"PRESTAÇÃO DE SERVIÇOS MÉDICOS PARA A ÁREA DA DEPENDÊNCIA DA ARSLVT, IP PARA 2015",Ajuste Direto Regime Geral,Aquisição de serviços,"85100000-0, Serviços de saúde","Administração Regional de Saúde de Lisboa e Vale do Tejo, I. P. (503148776)","KELLY SERVICES - HEALTHCARE, UNIPESSOAL, LDA  (510723691)","95.105,85 €",09-03-2015,30-01-2015,365 dias,"Portugal, Lisboa, Cascais",Artigo 258.º do Código dos Contratos Públicos,"","","","",,Não aplicável.,Não aplicável.,FALSE
"PRESTAÇÃO DE SERVIÇOS MÉDICOS PARA A ÁREA DA DEPENDÊNCIA DA ARSLVT, IP PARA 2015",Ajuste Direto Regime Geral,Aquisição de serviços,"85100000-0, Serviços de saúde","Administração Regional de Saúde de Lisboa e Vale do Tejo, I. P. (503148776)","KELLY SERVICES - HEALTHCARE, UNIPESSOAL, LDA  (510723691)","330.606,05 €",09-03-2015,30-01-2015,365 dias,"Portugal, Lisboa, Sintra",Artigo 258.º do Código dos Contratos Públicos,"","","","",,Não aplicável.,Não aplicável.,FALSE
"PRESTAÇÃO DE SERVIÇOS MÉDICOS PARA A ÁREA DA DEPENDÊNCIA DA ARSLVT, IP PARA 2015",Ajuste Direto Regime Geral,Aquisição de serviços,"85100000-0, Serviços de saúde","Administração Regional de Saúde de Lisboa e Vale do Tejo, I. P. (503148776)","KELLY SERVICES - HEALTHCARE, UNIPESSOAL, LDA  (510723691)","90.577,00 €",09-03-2015,30-01-2015,365 dias,"Portugal, Lisboa, Lisboa",Artigo 258.º do Código dos Contratos Públicos,"","","","",,Não aplicável.,Não aplicável.,FALSE
"PRESTAÇÃO DE SERVIÇOS MÉDICOS PARA A ÁREA DA DEPENDÊNCIA DA ARSLVT, IP PARA 2015",Ajuste Direto Regime Geral,Aquisição de serviços,"85100000-0, Serviços de saúde","Administração Regional de Saúde de Lisboa e Vale do Tejo, I. P. (503148776)","KELLY SERVICES - HEALTHCARE, UNIPESSOAL, LDA  (510723691)","90.577,00 €",09-03-2015,30-01-2015,365 dias,"Portugal, Lisboa, Loures",Artigo 258.º do Código dos Contratos Públicos,"","","","",,Não aplicável.,Não aplicável.,FALSE
"PRESTAÇÃO DE SERVIÇOS MÉDICOS PARA A ÁREA DA DEPENDÊNCIA DA ARSLVT, IP PARA 2015",Ajuste Direto Regime Geral,Aquisição de serviços,"85100000-0, Serviços de saúde","Administração Regional de Saúde de Lisboa e Vale do Tejo, I. P. (503148776)","KELLY SERVICES - HEALTHCARE, UNIPESSOAL, LDA  (510723691)","36.230,80 €",09-03-2015,30-01-2015,365 dias,"Portugal, Lisboa, Lisboa",Artigo 258.º do Código dos Contratos Públicos,"","","","",,Não aplicável.,Não aplicável.,FALSE
"PRESTAÇÃO DE SERVIÇOS MÉDICOS PARA A ÁREA DA DEPENDÊNCIA DA ARSLVT, IP PARA 2015",Ajuste Direto Regime Geral,Aquisição de serviços,"85100000-0, Serviços de saúde","Administração Regional de Saúde de Lisboa e Vale do Tejo, I. P. (503148776)","KELLY SERVICES - HEALTHCARE, UNIPESSOAL, LDA  (510723691)","60.686,59 €",09-03-2015,30-01-2015,365 dias,"Portugal, Lisboa, Lisboa",Artigo 258.º do Código dos Contratos Públicos,"","","","",,Não aplicável.,Não aplicável.,FALSE
"PRESTAÇÃO DE SERVIÇOS MÉDICOS PARA A ÁREA DA DEPENDÊNCIA DA ARSLVT, IP PARA 2015",Ajuste Direto Regime Geral,Aquisição de serviços,"85100000-0, Serviços de saúde","Administração Regional de Saúde de Lisboa e Vale do Tejo, I. P. (503148776)","KELLY SERVICES - HEALTHCARE, UNIPESSOAL, LDA  (510723691)","65.215,44 €",09-03-2015,30-01-2015,365 dias,"Portugal, Lisboa, Lisboa",Artigo 258.º do Código dos Contratos Públicos,"","","","",,Não aplicável.,Não aplicável.,FALSE
Prestação de Serviços Médicos de Medicina Geral e Familiar no Centro de Saúde de Montargil (Março a Dezembro de 2015),Ajuste Direto Regime Geral,Aquisição de serviços,"85100000-0, Serviços de saúde","Unidade Local de Saúde do Norte Alentejano, E. P. E. (508094461)","Kelly Services, Healthcare, Unipessoal, Lda (510723691)","37.129,75 €",25-02-2015,06-02-2015,306 dias,"Portugal, Portalegre, Ponte de Sor","Artigo 24.º, n.º 1, alínea c) do Código dos Contratos Públicos",25-02-2015,"37.129,75 €","","",,Não aplicável.,Não aplicável.,FALSE
Prestação de Serviços Médicos de Medicina Geral e Familiar no Centro de Saúde de Nisa (Março a Dezembro de 2015),Ajuste Direto Regime Geral,Aquisição de serviços,"85100000-0, Serviços de saúde","Unidade Local de Saúde do Norte Alentejano, E. P. E. (508094461)","Kelly Services, Healthcare, Unipessoal, Lda (510723691)","37.129,75 €",25-02-2015,06-02-2015,306 dias,"Portugal, Portalegre, Nisa","Artigo 24.º, n.º 1, alínea c) do Código dos Contratos Públicos",25-02-2015,"37.129,75 €","","",,Não aplicável.,Não aplicável.,FALSE
Prestação de Serviços Médicos de MGF no CS Nisa (Janeiro e Fevereiro de 2015),Ajuste Direto Regime Geral,Aquisição de serviços,"85100000-0, Serviços de saúde","Unidade Local de Saúde do Norte Alentejano, E. P. E. (508094461)","Kelly Services - Helathcare, Unipessoal, Lda. (510723691)","6.559,88 €",19-02-2015,27-01-2015,59 dias,"Portugal, Portalegre, Nisa","Artigo 24.º, n.º 1, alínea c) do Código dos Contratos Públicos",19-02-2015,"6.559,88 €","","",,Não aplicável.,Não aplicável.,FALSE
"SC 19/2015 - Prestação Serviços Médicos para os ACES da ARS Algarve, I.P.",Ao abrigo de acordo-quadro (art.º 259.º),Aquisição de serviços,"85121100-4, Serviços de médicos de clínica geral","Administração Regional de Saúde do Algarve, I. P. (503148709)","Kelly Services - HealthCare Unipessoal, Lda. (510723691)","854.393,80 €",13-02-2015,29-01-2015,354 dias,"Portugal, Faro",Artigo 259.º do Código dos Contratos Públicos,"","","","",,454020,"CONCURSO PÚBLICO PARA A CELEBRAÇÃO DE CONTRATOS PÚBLICOS DE APROVISIONAMENTO PARA A ÁREA DA SAÚDE, COM VISTA À PRESTAÇÃO DE SERVIÇOS MÉDICOS ÀS INSTITUIÇÕES E SERVIÇOS DO SERVIÇO NACIONAL DE SAÚDE",FALSE
PRESTAÇÃO DE SERVIÇOS MÉDICOS - AUMENTO DE HORAS PARA O ACES AMADORA,Ajuste Direto Regime Geral,Aquisição de serviços,"85100000-0, Serviços de saúde","Administração Regional de Saúde de Lisboa e Vale do Tejo, I. P. (503148776)","KELLY SERVICES - HEALTHCARE, UNIPESSOAL, LDA  (510723691)","4.365,60 €",05-12-2014,25-11-2014,36 dias,"Portugal, Lisboa, Lisboa","Artigo 24.º, n.º 1, alínea e) do Código dos Contratos Públicos","","","","",,Não aplicável.,Não aplicável.,FALSE
PRESTAÇÃO DE SERVIÇOS MÉDICOS PARA ACES LISBOA OCIDENTAL E OEIRAS ATÉ FINAL DE 2014,Ajuste Direto Regime Geral,Aquisição de serviços,"85100000-0, Serviços de saúde","Administração Regional de Saúde de Lisboa e Vale do Tejo, I. P. (503148776)","KELLY SERVICES - HEALTHCARE, UNIPESSOAL, LDA  (510723691)","35.960,00 €",01-12-2014,18-11-2014,43 dias,"Portugal, Lisboa, Lisboa",Artigo 258.º do Código dos Contratos Públicos,"","","","",,Não aplicável.,Não aplicável.,FALSE
"Prestação de Serviços Médicos de MGF, na ULSNA, EPE (Novembro e Dezembro de 2014)",Ajuste Direto Regime Geral,Aquisição de serviços,"85100000-0, Serviços de saúde","Unidade Local de Saúde do Norte Alentejano, E. P. E. (508094461)","Kelly Services - Healthcare, Unipessoal, Lda (510723691)","7.794,00 €",24-11-2014,13-11-2014,61 dias,"Portugal, Portalegre, Nisa","Artigo 24.º, n.º 1, alínea c) do Código dos Contratos Públicos","","","","",,Não aplicável.,Não aplicável.,FALSE
Serviços médicos urgência geral,Ao abrigo de acordo-quadro (art.º 259.º),Aquisição de serviços,"85121100-4, Serviços de médicos de clínica geral","Centro Hospitalar do Algarve, E. P. E. (510745997)","Kelly Services - Healthcare  Unipessoal, Lda (510723691)","320.074,30 €",31-10-2014,20-06-2014,190 dias,"Portugal, Faro, Portimão<BR/>Portugal, Faro, Lagos<BR/>Portugal, Faro, Faro",Artigo 259.º do Código dos Contratos Públicos,"","","","",,454020,"CONCURSO PÚBLICO PARA A CELEBRAÇÃO DE CONTRATOS PÚBLICOS DE APROVISIONAMENTO PARA A ÁREA DA SAÚDE, COM VISTA À PRESTAÇÃO DE SERVIÇOS MÉDICOS ÀS INSTITUIÇÕES E SERVIÇOS DO SERVIÇO NACIONAL DE SAÚDE",FALSE
PRESTAÇÃO DE SERVIÇOS MÉDICOS - AUMENTO DE HORAS - LISBOA CENTRAL,Ajuste Direto Regime Geral,Aquisição de serviços,"85100000-0, Serviços de saúde","Administração Regional de Saúde de Lisboa e Vale do Tejo, I. P. (503148776)","KELLY SERVICES - HEALTHCARE, UNIPESSOAL, LDA  (510723691)","10.186,40 €",17-10-2014,09-10-2014,83 dias,"Portugal, Lisboa, Lisboa","Artigo 24.º, n.º 1, alínea e) do Código dos Contratos Públicos","","","","",,Não aplicável.,Não aplicável.,FALSE
"SC/174/2014 - Prestação de Serviços Médicos para os ACES e SUB's da ARS Algarve, I.P.",Ao abrigo de acordo-quadro (art.º 259.º),Aquisição de serviços,"85121100-4, Serviços de médicos de clínica geral","Administração Regional de Saúde do Algarve, I. P. (503148709)","Kelly Services - Healthcare, Unipessoal Lda. (510723691)","571.535,25 €",09-09-2014,18-08-2014,135 dias,"Portugal, Faro",Artigo 259.º do Código dos Contratos Públicos,"","","","",,454020,"CONCURSO PÚBLICO PARA A CELEBRAÇÃO DE CONTRATOS PÚBLICOS DE APROVISIONAMENTO PARA A ÁREA DA SAÚDE, COM VISTA À PRESTAÇÃO DE SERVIÇOS MÉDICOS ÀS INSTITUIÇÕES E SERVIÇOS DO SERVIÇO NACIONAL DE SAÚDE",FALSE
Serviços Médicos para Urgência Interna-Regime de Presença Fisica,Ao abrigo de acordo-quadro (art.º 258.º),Aquisição de serviços,"85100000-0, Serviços de saúde",Hospital de José Luciano de Castro (501613021),Kelly service (510723691),"56.628,00 €",01-09-2014,02-01-2014,365 dias,"Portugal, Aveiro, Anadia",Artigo 258.º do Código dos Contratos Públicos,"","","","",,454020,"CONCURSO PÚBLICO PARA A CELEBRAÇÃO DE CONTRATOS PÚBLICOS DE APROVISIONAMENTO PARA A ÁREA DA SAÚDE, COM VISTA À PRESTAÇÃO DE SERVIÇOS MÉDICOS ÀS INSTITUIÇÕES E SERVIÇOS DO SERVIÇO NACIONAL DE SAÚDE",FALSE
Serviços Médicos de Urgência Interna-Prevenção,Ao abrigo de acordo-quadro (art.º 258.º),Aquisição de serviços,"85100000-0, Serviços de saúde",Hospital de José Luciano de Castro (501613021),Kelly services (510723691),"28.017,60 €",01-09-2014,02-01-2014,365 dias,"Portugal, Aveiro, Anadia",Artigo 258.º do Código dos Contratos Públicos,"","","","",,454020,"CONCURSO PÚBLICO PARA A CELEBRAÇÃO DE CONTRATOS PÚBLICOS DE APROVISIONAMENTO PARA A ÁREA DA SAÚDE, COM VISTA À PRESTAÇÃO DE SERVIÇOS MÉDICOS ÀS INSTITUIÇÕES E SERVIÇOS DO SERVIÇO NACIONAL DE SAÚDE",FALSE
"Contratação de serviços médicos para a UCSP de Alandroal do ACES Alentejo Central da ARS do Alentejo, I.P.",Ao abrigo de acordo-quadro (art.º 259.º),Aquisição de serviços,"85121200-5, Serviços de medicina especializada","Administração Regional de Saúde do Alentejo, I. P. (503148768)","Kelly Services - Healthcare Unipessoal, Lda. (510723691)","41.260,80 €",07-08-2014,01-03-2014,306 dias,"Portugal, Évora, Alandroal",Artigo 259.º do Código dos Contratos Públicos,31-08-2015,"53.510,10 €","Prorrogação do contrato até conclusão do novo procedimento concursal, por deliberação do Conselho Diretivo.","Prorrogação do contrato até conclusão do novo procedimento concursal, por deliberação do Conselho Diretivo.",,454020,"CONCURSO PÚBLICO PARA A CELEBRAÇÃO DE CONTRATOS PÚBLICOS DE APROVISIONAMENTO PARA A ÁREA DA SAÚDE, COM VISTA À PRESTAÇÃO DE SERVIÇOS MÉDICOS ÀS INSTITUIÇÕES E SERVIÇOS DO SERVIÇO NACIONAL DE SAÚDE",FALSE
"Aquisição de serviços médicos no Serviço de Pediatria do CHLO, EPE - Medicina Geral e Familiar",Ao abrigo de acordo-quadro (art.º 259.º),Aquisição de serviços,"85000000-9, Serviços de saúde e acção social","Centro Hospitalar de Lisboa Ocidental, E. P. E. (507618319)","Kelly Services, Lda (510723691)","23.760,00 €",20-05-2014,28-03-2014,278 dias,"Portugal, Lisboa, Lisboa",Artigo 259.º do Código dos Contratos Públicos,"","","","",,454020,"CONCURSO PÚBLICO PARA A CELEBRAÇÃO DE CONTRATOS PÚBLICOS DE APROVISIONAMENTO PARA A ÁREA DA SAÚDE, COM VISTA À PRESTAÇÃO DE SERVIÇOS MÉDICOS ÀS INSTITUIÇÕES E SERVIÇOS DO SERVIÇO NACIONAL DE SAÚDE",FALSE
Serviços de Anestesiologia parao CHPL Ano 2014,Ao abrigo de acordo-quadro (art.º 259.º),Aquisição de serviços,"85000000-9, Serviços de saúde e acção social",Centro Hospitalar Psiquiátrico de Lisboa (508338476),"KELLY SERVICES - Healthcare, Unipessoal, Lda. (510723691)","8.133,44 €",08-05-2014,28-04-2014,240 dias,"Portugal, Lisboa, Lisboa",Artigo 259.º do Código dos Contratos Públicos,31-12-2014,"6.985,30 €","",Valor total efetivo corresponde ao Total Inserido na Faturação,,454020,"CONCURSO PÚBLICO PARA A CELEBRAÇÃO DE CONTRATOS PÚBLICOS DE APROVISIONAMENTO PARA A ÁREA DA SAÚDE, COM VISTA À PRESTAÇÃO DE SERVIÇOS MÉDICOS ÀS INSTITUIÇÕES E SERVIÇOS DO SERVIÇO NACIONAL DE SAÚDE",FALSE
Serviços Médicos para o ACES Lisboa Central e para o ACES Médio Tejo,Ajuste Direto Regime Geral,Aquisição de serviços,"85100000-0, Serviços de saúde","Administração Regional de Saúde de Lisboa e Vale do Tejo, I. P. (503148776)","Kelly Services - Healthcare, Unipessoal Lda. (510723691)","55.378,40 €",05-05-2014,23-04-2014,252 dias,"Portugal, Santarém, Santarém",Artigo 258.º do Código dos Contratos Públicos,"","","","",,Não aplicável.,Não aplicável.,FALSE
Serviços Médicos para o ACES Lisboa Central e para o ACES Médio Tejo,Ajuste Direto Regime Geral,Aquisição de serviços,"85100000-0, Serviços de saúde","Administração Regional de Saúde de Lisboa e Vale do Tejo, I. P. (503148776)","Kelly Services - Healthcare, Unipessoal Lda. (510723691)","31.944,00 €",05-05-2014,23-04-2014,252 dias,"Portugal, Lisboa, Lisboa",Artigo 258.º do Código dos Contratos Públicos,"","","","",,Não aplicável.,Não aplicável.,FALSE
"Prestação de Serviços de Cuidados de Saúde na área médica, para o período de 12 meses, para a área de influência da ARSLVT, IP",Ajuste Direto Regime Geral,Aquisição de serviços,"85100000-0, Serviços de saúde","Administração Regional de Saúde de Lisboa e Vale do Tejo, I.P. (503148776)","Kelly Services - Healthcare Unipessoal, Lda (510723691)","1.712.988,68 €",26-02-2014,30-12-2013,365 dias,"Portugal, Lisboa",Artigo 258.º do Código dos Contratos Públicos,"","","","",,Não aplicável.,Não aplicável.,FALSE
PRESTAÇÃO DE SERVIÇOS MÉDICOS 2014 - AUMENTO DE HORAS,Ajuste Direto Regime Geral,Aquisição de serviços,"85100000-0, Serviços de saúde","Administração Regional de Saúde de Lisboa e Vale do Tejo, I. P. (503148776)","Kelly Services - Healthcare, unipessoal, Lda (510723691)","75.670,40 €",25-02-2014,20-02-2014,365 dias,"Portugal, Lisboa, Lisboa<BR/>Portugal, Lisboa, Oeiras","Artigo 24.º, n.º 1, alínea e) do Código dos Contratos Públicos","","","","",,Não aplicável.,Não aplicável.,FALSE
Prestação de serviços médicos para reforço das consultas de recurso/ambulatório,Ao abrigo de acordo-quadro (art.º 259.º),Aquisição de serviços,"85100000-0, Serviços de saúde","Administração Regional de Saúde do Algarve, I. P. (503148709)","Kelly Services - Healthcare, Unipessoal Lda. (510723691)","523.149,75 €",17-01-2014,19-12-2013,365 dias,"Portugal, Faro",Artigo 259.º do Código dos Contratos Públicos,"","","","",,454020,"CONCURSO PÚBLICO PARA A CELEBRAÇÃO DE CONTRATOS PÚBLICOS DE APROVISIONAMENTO PARA A ÁREA DA SAÚDE, COM VISTA À PRESTAÇÃO DE SERVIÇOS MÉDICOS ÀS INSTITUIÇÕES E SERVIÇOS DO SERVIÇO NACIONAL DE SAÚDE",FALSE
Prestação de serviços médicos para o ACES Lisboa Norte - 10 horas / semana,Ajuste Direto Regime Geral,Aquisição de serviços,"85100000-0, Serviços de saúde","Administração Regional de Saúde de Lisboa e Vale do Tejo, I. P. (503148776)","Kelly Services - Healthcare, Unipessoal, Lda. (510723691)","1.273,30 €",13-12-2013,13-12-2013,18 dias,"Portugal, Lisboa, Lisboa","Artigo 24.º, n.º 1, alínea e) do Código dos Contratos Públicos","","","","",,Não aplicável.,Não aplicável.,
Aquisição de Serviços de Animação Sociocultural para o Centro de Apoio Social de Oeiras,Ajuste Direto Regime Geral,Aquisição de serviços,"85300000-2, Serviços de acção social e serviços conexos",Inst. de Acção Social das Forças Armadas (IASFA) (500746427),"Kelly Services - Healthcare, Unipessoal Lda (510723691)","7.575,00 €",18-10-2013,08-08-2013,153 dias,"Portugal, Lisboa, Oeiras","Artigo 20.º, n.º 1, alínea a) do Código dos Contratos Públicos",31-12-2013,"7.575,00 €","","",,Não aplicável.,Não aplicável.,
"Prestação sucessiva de cuidados de saúde aos estudantes do IPS, nas vertentes de clínica geral, planeamento familiar, nutricionismo e psicologia clínica (nas modalidades de psicoterapia, aconselhamento psicológico e formação comportamental - intervenções de grupo)",Concurso público,Aquisição de serviços,"85100000-0, Serviços de saúde",Serviços de Acção Social do Instituto Politécnico de Setúbal (600083845),"Kelly Services - Healthcare, Unipessoal Lda. (510723691)","3.600,00 €",24-10-2012,21-09-2012,365 dias,"Portugal, Setúbal, Setúbal","Artigo 21.º, n.º 1, alínea b) do Código dos Contratos Públicos",17-10-2014,"17.655,00 €","","O preço total efetivo sem IVA resulta da execução de 2 renovações, conforme previsto no contrato inicial publicitado. ",,Não aplicável.,Não aplicável.,
