Objeto do Contrato,Tipo de Procedimento,Tipo(s) de Contrato,CPVs,Entidade(s) Adjudicante(s),Entidade(s) Adjudicatária(s),Preço Contratual,Data de Publicação,Data de Celebração do Contrato,Prazo de Execução,Local de Execução,Fundamentação,Data de Fecho do Contrato,Preço Total Efetivo,Causas das Alterações ao Prazo,Causas das Alterações ao Preço,Estado,N.º registo do Acordo Quadro,Descrição do Acordo Quadro,Procedimento Centralizado
"Calibração de Vários Equipamentos do CRSCoimbra, durante o ano 2010.",Ajuste Direto Regime Geral,Aquisição de serviços,"71356200-0, Serviços de assistência técnica","Instituto Português do Sangue, I.P. (502423943)",Instituto de Soldadura e Qualidade (500140022),"6.981,10 €",10-01-2011,17-02-2010,317 dias,"Portugal, Coimbra, Coimbra","Artigo 27.º, n.º 1, alínea f) do Código dos Contratos Públicos",,,,,,Não aplicável.,Não aplicável.,
"Contrato de Assistência Técnica a 4 Centrifugas, durante o ano 2010.",Ajuste Direto Regime Geral,Aquisição de serviços,"71356200-0, Serviços de assistência técnica","Instituto Português do Sangue, I.P. (502423943)",Certilab (505403013),"1.495,00 €",10-01-2011,31-03-2010,275 dias,"Portugal, Coimbra, Coimbra","Artigo 27.º, n.º 1, alínea f) do Código dos Contratos Públicos",,,,,,Não aplicável.,Não aplicável.,
"Contrato Assistência Técnica a Câmara Fuxo Laminar do CRSCoimbra, durante o ano 2010.",Ajuste Direto Regime Geral,Aquisição de serviços,"71356200-0, Serviços de assistência técnica","Instituto Português do Sangue, I.P. (502423943)","Tradelabor Importação e Exportação, Ldª (503069442)","600,00 €",10-01-2011,31-03-2010,275 dias,"Portugal, Coimbra, Coimbra","Artigo 27.º, n.º 1, alínea f) do Código dos Contratos Públicos",,,,,,Não aplicável.,Não aplicável.,
"Contrato Assistência Técnica a 4 Centrifugas do CRSCoimbra, durante o ano 2010.",Ajuste Direto Regime Geral,Aquisição de serviços,"71356200-0, Serviços de assistência técnica","Instituto Português do Sangue, I.P. (502423943)",SUCH - Serviço de Utilização Comum dos Hospitais (500900469),"1.908,00 €",10-01-2011,31-03-2010,275 dias,"Portugal, Coimbra, Coimbra","Artigo 27.º, n.º 1, alínea f) do Código dos Contratos Públicos",,,,,,Não aplicável.,Não aplicável.,
"Contrato Assistência Técnica Selador Conexão Estéril do Lab. Controlo Qualidade do CRSCoimbra, durante o ano 2010.",Ajuste Direto Regime Geral,Aquisição de serviços,"71356200-0, Serviços de assistência técnica","Instituto Português do Sangue, I.P. (502423943)",Normax (500203130),"1.100,00 €",10-01-2011,25-05-2010,209 dias,"Portugal, Coimbra, Coimbra","Artigo 27.º, n.º 1, alínea f) do Código dos Contratos Públicos",,,,,,Não aplicável.,Não aplicável.,
"Contrato Assistência Tencica aos Sistemas de Monitorização de Temperaturas do CRSCoimbra, durante o ano 2010.",Ajuste Direto Regime Geral,Aquisição de serviços,"71356200-0, Serviços de assistência técnica","Instituto Português do Sangue, I.P. (502423943)","ITISE - Equipamentos Técnicos de Presição e Cientificos, Ldª (502316985)","2.550,00 €",10-01-2011,31-03-2010,275 dias,"Portugal, Coimbra, Coimbra","Artigo 27.º, n.º 1, alínea f) do Código dos Contratos Públicos",,,,,,Não aplicável.,Não aplicável.,
"Contrato Assistência Técnica ao Coagulometro Amelung Amax 190 Plus, do CRS porto, durante os anos 2010/2011",Ajuste Direto Regime Geral,Aquisição de serviços,"71356200-0, Serviços de assistência técnica","Instituto Português do Sangue, I.P. (502423943)",Grifols Portugal (502041285),"4.147,44 €",07-01-2011,10-08-2010,730 dias,"Portugal, Porto, Porto","Artigo 27.º, n.º 1, alínea f) do Código dos Contratos Públicos",,,,,,Não aplicável.,Não aplicável.,
"Contrato Assistência Técnica para vários equipamentos para o CRS do Porto, durante os anos de 2010/2011",Ajuste Direto Regime Geral,Aquisição de serviços,"71356200-0, Serviços de assistência técnica","Instituto Português do Sangue, I.P. (502423943)","Menarini Diagnósticos, Lda (502610069)","52.470,32 €",07-01-2011,02-08-2010,730 dias,"Portugal, Porto, Porto","Artigo 27.º, n.º 1, alínea f) do Código dos Contratos Públicos",,,,,,Não aplicável.,Não aplicável.,
"Contrato Assistência Técnica para vários equipamentos do CRS do Porto, durante o ano de 2010/2011",Ajuste Direto Regime Geral,Aquisição de serviços,"71356200-0, Serviços de assistência técnica","Instituto Português do Sangue, I.P. (502423943)",SUCH - Serviço de Utilização Comum dos Hospitais (500900469),"1.344,00 €",07-01-2011,16-07-2010,730 dias,"Portugal, Porto, Porto","Artigo 27.º, n.º 1, alínea f) do Código dos Contratos Públicos",,,,,,Não aplicável.,Não aplicável.,
"Contrato Assistência Técnica ao Irradiador Gammacell 249 GC3000, s/n 250, do CRS Porto, durante o ano de 2010",Ajuste Direto Regime Geral,Aquisição de serviços,"71356200-0, Serviços de assistência técnica","Instituto Português do Sangue, I.P. (502423943)","Grupo Taper - Equip. Precisão Cientifica, Lda (506886336)","4.900,00 €",07-01-2011,10-08-2010,365 dias,"Portugal, Porto, Porto","Artigo 27.º, n.º 1, alínea f) do Código dos Contratos Públicos",,,,,,Não aplicável.,Não aplicável.,
"Contrato Assistência Técnica de vários equipamentos para o CRS do Porto, durante o ano de 2010/2011",Ajuste Direto Regime Geral,Aquisição de serviços,"71356200-0, Serviços de assistência técnica","Instituto Português do Sangue, I.P. (502423943)","Sarstedt Tecnologia de Laboratório, Lda (503019461)","1.943,40 €",07-01-2011,02-08-2010,730 dias,"Portugal, Porto, Porto","Artigo 27.º, n.º 1, alínea f) do Código dos Contratos Públicos",,,,,,Não aplicável.,Não aplicável.,
"Contrato Assistência Técnica para Esterilizador Horizontal JSM, s/n 2157, do CRS do Porto, durante o ano 2010/2011",Ajuste Direto Regime Geral,Aquisição de serviços,"71356200-0, Serviços de assistência técnica","Instituto Português do Sangue, I.P. (502423943)","Prohs - Equipamento Hospitalar e Serviços Associados, SA (505005468)","2.334,00 €",07-01-2011,09-08-2010,730 dias,"Portugal, Porto, Porto","Artigo 27.º, n.º 1, alínea f) do Código dos Contratos Públicos",,,,,,Não aplicável.,Não aplicável.,
"Contrato Assistência Técnica a vários equipamentos para o CRS do Porto, durante o ano de 2010 e 2011",Ajuste Direto Regime Geral,Aquisição de serviços,"71356200-0, Serviços de assistência técnica","Instituto Português do Sangue, I.P. (502423943)","Dalkia - Energia e Serviços, SA (502876581)","400,00 €",07-01-2011,15-12-2010,730 dias,"Portugal, Porto, Porto","Artigo 27.º, n.º 1, alínea f) do Código dos Contratos Públicos",,,,,,Não aplicável.,Não aplicável.,
"Contrato Assistência Técnica aos equipamentos do CRS do Porto, durante o ano de 2010 e 2011",Ajuste Direto Regime Geral,Aquisição de serviços,"71356200-0, Serviços de assistência técnica","Instituto Português do Sangue, I.P. (502423943)","Diamed Portuguesa Diagnóstica, SA (501675809)","22.800,00 €",07-01-2011,02-08-2010,730 dias,"Portugal, Porto, Porto","Artigo 27.º, n.º 1, alínea f) do Código dos Contratos Públicos",,,,,,Não aplicável.,Não aplicável.,
"Contrato Assistência Técnica de Vários Equipamentos do CRS do Porto, durante 2010/2011",Ajuste Direto Regime Geral,Aquisição de serviços,"71356200-0, Serviços de assistência técnica","Instituto Português do Sangue, I.P. (502423943)","H. Seabra - Com. Ind. Termicas, Lda (500727902)","16.876,80 €",07-01-2011,04-10-2010,730 dias,"Portugal, Porto, Porto","Artigo 27.º, n.º 1, alínea f) do Código dos Contratos Públicos",,,,,,Não aplicável.,Não aplicável.,
Contrato Assistência Térnica a 1 Frigorifico -4º.,Ajuste Direto Regime Geral,Aquisição de serviços,"71356200-0, Serviços de assistência técnica","Instituto Português do Sangue, I.P. (502423943)","H. Seabra - Comercio e Industrias Termicas, SA (500727902)","1.601,70 €",07-01-2011,31-08-2010,122 dias,"Portugal, Lisboa, Lisboa","Artigo 27.º, n.º 1, alínea f) do Código dos Contratos Públicos",,,,,,Não aplicável.,Não aplicável.,
"Contrato Assistência Técnica ao Termociclador Rotorgene do CRS do Porto, durante o ano 2010/2011",Ajuste Direto Regime Geral,Aquisição de serviços,"71356200-0, Serviços de assistência técnica","Instituto Português do Sangue, I.P. (502423943)","Quilaban Laboratorial Analitica, Lda (500399670)","1.954,76 €",07-01-2011,15-12-2010,730 dias,"Portugal, Porto, Porto","Artigo 27.º, n.º 1, alínea f) do Código dos Contratos Públicos",,,,,,Não aplicável.,Não aplicável.,
"Ensaio a Vários Equipamentos instalados no CRSLisboa, durante o ano 2010.",Ajuste Direto Regime Geral,Aquisição de serviços,"71356200-0, Serviços de assistência técnica","Instituto Português do Sangue, I.P. (502423943)",Instituto de Soldadura e Qualidade (500140022),"2.492,40 €",07-01-2011,15-06-2010,199 dias,"Portugal, Lisboa, Lisboa","Artigo 27.º, n.º 1, alínea f) do Código dos Contratos Públicos",,,,,,Não aplicável.,Não aplicável.,
Aquisição de 4 contentores,Ajuste Direto Regime Geral,Aquisição de bens móveis,"34928480-6, Contentores e baldes para lixo e resíduos","Instituto Português do Sangue, I.P. (502423943)","Sopsa-Representação e Comercio, SA (502392266)","9.185,00 €",07-01-2011,10-12-2010,20 dias,"Portugal, Coimbra, Coimbra","Artigo 20.º, n.º 1, alínea a) do Código dos Contratos Públicos",,,,,,Não aplicável.,Não aplicável.,
"Calibração de vários equipamentos do CRSLisboa, durante o ano 2010.",Ajuste Direto Regime Geral,Aquisição de serviços,"71356200-0, Serviços de assistência técnica","Instituto Português do Sangue, I.P. (502423943)",Instituto de Soldadura e Qualidade (500140022),"3.753,50 €",06-01-2011,02-11-2010,59 dias,"Portugal, Lisboa, Lisboa","Artigo 27.º, n.º 1, alínea f) do Código dos Contratos Públicos",,,,,,Não aplicável.,Não aplicável.,
"Assistência Técnica aos Clusters do IPS, IP, até 31 Dezembro 2010.",Ajuste Direto Regime Geral,Aquisição de serviços,"71356200-0, Serviços de assistência técnica","Instituto Português do Sangue, I.P. (502423943)","ATMINFORMATICA 2, SOLUÇÕES E SISTEMAS, SA. (504062859)","19.759,92 €",06-01-2011,30-11-2010,31 dias,"Portugal, Lisboa, Lisboa<BR/>Portugal, Coimbra, Coimbra<BR/>Portugal, Porto, Porto","Artigo 27.º, n.º 1, alínea f) do Código dos Contratos Públicos",,,,,,Não aplicável.,Não aplicável.,
"Calibração e Ensaio a Vários Equipamentos do Centro Regional de Sangue de Lisboa, durante o ano 2010.",Ajuste Direto Regime Geral,Aquisição de serviços,"71356200-0, Serviços de assistência técnica","Instituto Português do Sangue, I.P. (502423943)",Instituto de Soldadura e Qualidade (500140022),"6.348,00 €",06-01-2011,15-04-2010,260 dias,"Portugal, Lisboa, Lisboa","Artigo 27.º, n.º 1, alínea f) do Código dos Contratos Públicos",,,,,,Não aplicável.,Não aplicável.,
"Calibração de Vários Equipamentos do Centro Regional de Sangue de Lisboa, durante o ano 2010.",Ajuste Direto Regime Geral,Aquisição de serviços,"71356200-0, Serviços de assistência técnica","Instituto Português do Sangue, I.P. (502423943)",Normax (500203130),"8.802,56 €",06-01-2011,07-06-2010,207 dias,"Portugal, Lisboa, Lisboa","Artigo 27.º, n.º 1, alínea f) do Código dos Contratos Públicos",,,,,,Não aplicável.,Não aplicável.,
"Contrato Assistência Técnica a vários Equipamentos do CRS do Porto, de 2010 a 2011",Ajuste Direto Regime Geral,Aquisição de serviços,"71356200-0, Serviços de assistência técnica","Instituto Português do Sangue, I.P. (502423943)","Fenwal Europe, SPRL (980362679)","35.860,00 €",06-01-2011,16-08-2010,730 dias,"Portugal, Porto, Porto","Artigo 27.º, n.º 1, alínea f) do Código dos Contratos Públicos",,,,,,Não aplicável.,Não aplicável.,
"Aquisição de 4 Seladores Térmicos de Bancada e 2 Seladores Térmicos Portateis, para o Centro Regional de Sangue do Porto.",Ajuste Direto Regime Geral,Aquisição de bens móveis,"33191000-5, Aparelhos para esterilização, desinfecção e higiene","Instituto Português do Sangue, I.P. (502423943)",Fenwal Europe SPRL (980362679),"14.000,00 €",06-01-2011,17-12-2010,13 dias,"Portugal, Porto, Porto","Artigo 20.º, n.º 1, alínea a) do Código dos Contratos Públicos",,,,,,Não aplicável.,Não aplicável.,
"Contrato Assistencia Técnica aos Equipamentos do CRS do Porto, durante os anos 2010 e 2011",Ajuste Direto Regime Geral,Aquisição de serviços,"71356200-0, Serviços de assistência técnica","Instituto Português do Sangue, I.P. (502423943)","Certilab, Lda (505403013)","3.156,00 €",06-01-2011,02-08-2010,730 dias,"Portugal, Porto, Porto","Artigo 27.º, n.º 1, alínea f) do Código dos Contratos Públicos",,,,,,Não aplicável.,Não aplicável.,
Aquisição de Reagentes para Realização de Hemogramas para o CRS Lisboa,Ajuste Direto Regime Geral,Aquisição de bens móveis,"33696200-7, Reagentes para análises ao sangue","Instituto Português do Sangue, I.P. (502423943)","Izasa Portugal, Lda (501086110)","46.250,00 €",04-01-2011,25-11-2010,30 dias,"Portugal, Lisboa, Lisboa","Artigo 20.º, n.º 1, alínea a) do Código dos Contratos Públicos",,,,,,Não aplicável.,Não aplicável.,
Reagentes para o Laboratório de Doenças Transmissiveis do CRS Lisboa,Ajuste Direto Regime Geral,Aquisição de bens móveis,"33696200-7, Reagentes para análises ao sangue","Instituto Português do Sangue, I.P. (502423943)","Bio Rad, Lda (501301321)","21.273,60 €",04-01-2011,23-11-2010,30 dias,"Portugal, Lisboa, Lisboa","Artigo 26.º, n.º 1, alínea a) do Código dos Contratos Públicos",,,,,,Não aplicável.,Não aplicável.,
Reagentes para o Laboratório de Doenças Transmissiveis do CRS Porto,Ajuste Direto Regime Geral,Aquisição de bens móveis,"33696200-7, Reagentes para análises ao sangue","Instituto Português do Sangue, I.P. (502423943)","Roche Sistemas Diagnósticos, Lda (504282921)","16.200,00 €",04-01-2011,20-12-2010,10 dias,"Portugal, Porto, Porto","Artigo 26.º, n.º 1, alínea a) do Código dos Contratos Públicos",,,,,,Não aplicável.,Não aplicável.,
Reagentes para o Laboratório de Biologia Molecular do CRS Lisboa,Ajuste Direto Regime Geral,Aquisição de bens móveis,"33696200-7, Reagentes para análises ao sangue","Instituto Português do Sangue, I.P. (502423943)","Roche Sistemas Diagnósticos, Lda (504282921)","258.681,60 €",04-01-2011,28-12-2010,3 dias,"Portugal, Lisboa, Lisboa","Artigo 26.º, n.º 1, alínea a) do Código dos Contratos Públicos",,,,,,Não aplicável.,Não aplicável.,
Reagentes para o Laboratório de Doenças Transmissiveis do CRS Lisboa,Ajuste Direto Regime Geral,Aquisição de bens móveis,"33696200-7, Reagentes para análises ao sangue","Instituto Português do Sangue, I.P. (502423943)","Abbott Laboratórios, Lda (500006148)","207.930,00 €",04-01-2011,07-12-2010,30 dias,"Portugal, Lisboa, Lisboa","Artigo 26.º, n.º 1, alínea a) do Código dos Contratos Públicos",,,,,,Não aplicável.,Não aplicável.,
Reagentes para o Laboratório de Doenças Transmissiveis do CRS Lisboa,Ajuste Direto Regime Geral,Aquisição de bens móveis,"33696200-7, Reagentes para análises ao sangue","Instituto Português do Sangue, I.P. (502423943)","Bioportugal, Lda (502380543)","17.337,60 €",04-01-2011,17-12-2010,10 dias,"Portugal, Lisboa, Lisboa","Artigo 26.º, n.º 1, alínea a) do Código dos Contratos Públicos",,,,,,Não aplicável.,Não aplicável.,
Reagentes para o Laboratório de Doenças Transmissiveis do CRS Lisboa,Ajuste Direto Regime Geral,Aquisição de bens móveis,"33696200-7, Reagentes para análises ao sangue","Instituto Português do Sangue, I.P. (502423943)","Johnson & Johnson, Lda (500153370)","48.000,00 €",04-01-2011,23-11-2010,30 dias,"Portugal, Lisboa, Lisboa","Artigo 26.º, n.º 1, alínea a) do Código dos Contratos Públicos",,,,,,Não aplicável.,Não aplicável.,
Reagentes para o Laboratório de Doenças Transmissiveis do CRS Lisboa,Ajuste Direto Regime Geral,Aquisição de bens móveis,"33696200-7, Reagentes para análises ao sangue","Instituto Português do Sangue, I.P. (502423943)","Quilaban, Lda (500399670)","24.500,00 €",04-01-2011,09-12-2010,30 dias,"Portugal, Lisboa, Lisboa","Artigo 20.º, n.º 1, alínea a) do Código dos Contratos Públicos",,,,,,Não aplicável.,Não aplicável.,
