Objeto do Contrato,Tipo de Procedimento,Tipo(s) de Contrato,CPVs,Entidade(s) Adjudicante(s),Entidade(s) Adjudicatária(s),Preço Contratual,Data de Publicação,Data de Celebração do Contrato,Prazo de Execução,Local de Execução,Fundamentação,Data de Fecho do Contrato,Preço Total Efetivo,Causas das Alterações ao Prazo,Causas das Alterações ao Preço,Estado,N.º registo do Acordo Quadro,Descrição do Acordo Quadro,Procedimento Centralizado
Contratação de Serviços de Assistentes Operacionais para SUB Estremoz,Ajuste Direto Regime Geral,Aquisição de serviços,"79600000-0, Serviços de recrutamento",Administração Regional de Saúde do Alentejo (ARSA) (503148768),"Sempre Mais, Unipessoal, Lda. (509884903)","2.400,00 €",11-05-2016,01-03-2016,60 dias,"Portugal, Évora, Estremoz","Artigo 20.º, n.º 1, alínea a) do Código dos Contratos Públicos",11-05-2016,"2.400,00 €",,"",,Não aplicável.,Não aplicável.,FALSE
Aquisição de pilhas para termómetros,Ajuste Direto Regime Geral,Aquisição de bens móveis,"30000000-9, Máquinas, equipamento e material de escritório e de informática, excepto mobiliário e pacotes de programas (software)","Administração Regional de Saúde do Alentejo, I. P. (503148768)",Novabit Informática Unipessoal Lda  (503411302),"4,20 €",10-05-2016,09-10-2015,30 dias,"Portugal, Évora","Artigo 20.º, n.º 1, alínea a) do Código dos Contratos Públicos",31-12-2015,"4,20 €",,"",,Não aplicável.,Não aplicável.,FALSE
Aquisição de Consumíveis informáticos,Ajuste Direto Regime Geral,Aquisição de bens móveis,"30000000-9, Máquinas, equipamento e material de escritório e de informática, excepto mobiliário e pacotes de programas (software)","Administração Regional de Saúde do Alentejo, I. P. (503148768)","MAXONE - MATERIAL DE ESCRITÓRIO, LDA. (507052609)","3.259,50 €",10-05-2016,12-10-2015,200 dias,"Portugal, Évora","Artigo 20.º, n.º 1, alínea a) do Código dos Contratos Públicos",10-05-2016,"3.259,50 €",,"",,Não aplicável.,Não aplicável.,FALSE
Aquisição de Material de Electromedicina e de laboratório,Ajuste Direto Regime Geral,Aquisição de bens móveis,"33000000-0, Equipamento médico, medicamentos e produtos para cuidados pessoais","Administração Regional de Saúde do Alentejo, I. P. (503148768)","3M PORTUGAL, LDA. (500193940)","240,00 €",10-05-2016,06-03-2015,365 dias,"Portugal, Évora","Artigo 20.º, n.º 1, alínea a) do Código dos Contratos Públicos",10-05-2016,"240,00 €",,"",,Não aplicável.,Não aplicável.,FALSE
Aquisição de material electromedicina e de laboratório,Ajuste Direto Regime Geral,Aquisição de bens móveis,"33000000-0, Equipamento médico, medicamentos e produtos para cuidados pessoais","Administração Regional de Saúde do Alentejo, I. P. (503148768)",EZEQUIEL PANAO JORGE (501412727),"261,07 €",10-05-2016,12-03-2015,365 dias,"Portugal, Évora","Artigo 20.º, n.º 1, alínea a) do Código dos Contratos Públicos",10-05-2016,"261,07 €",,"",,Não aplicável.,Não aplicável.,FALSE
Aquisição de material Consumo Clinico,Ajuste Direto Regime Geral,Aquisição de bens móveis,"33000000-0, Equipamento médico, medicamentos e produtos para cuidados pessoais","Administração Regional de Saúde do Alentejo, I. P. (503148768)","HEMICARE - COMERCIO E REPRESENTAÇAO DE MATERIAL E EQUIPAMENTO, LDA. (506517080)","1.382,00 €",09-05-2016,06-03-2015,365 dias,"Portugal, Évora","Artigo 20.º, n.º 1, alínea a) do Código dos Contratos Públicos",09-05-2016,"1.382,00 €",,"",,Não aplicável.,Não aplicável.,FALSE
Aquisição de material de consumo clínico,Ajuste Direto Regime Geral,Aquisição de bens móveis,"33000000-0, Equipamento médico, medicamentos e produtos para cuidados pessoais","Administração Regional de Saúde do Alentejo, I. P. (503148768)","ANASTACIO SALDANHA, UNIPESSOAL, LDA. (505804441)","3.383,00 €",09-05-2016,06-03-2015,365 dias,"Portugal, Évora","Artigo 20.º, n.º 1, alínea a) do Código dos Contratos Públicos",09-05-2016,"3.383,00 €",,"",,Não aplicável.,Não aplicável.,FALSE
Aquisição de Material de Consumo Clínico,Ajuste Direto Regime Geral,Aquisição de bens móveis,"33000000-0, Equipamento médico, medicamentos e produtos para cuidados pessoais","Administração Regional de Saúde do Alentejo, I. P. (503148768)","INTERSURGICAL PORTUGAL, LDA. (503480045)","1.978,92 €",09-05-2016,06-03-2015,365 dias,"Portugal, Évora","Artigo 20.º, n.º 1, alínea a) do Código dos Contratos Públicos",09-05-2016,"1.978,92 €",,"",,Não aplicável.,Não aplicável.,FALSE
Aquisição de Material de Consumo Clínico,Ajuste Direto Regime Geral,Aquisição de bens móveis,"33000000-0, Equipamento médico, medicamentos e produtos para cuidados pessoais","Administração Regional de Saúde do Alentejo, I. P. (503148768)","PAUL HARTMAN,LDA. (502271728)","159,20 €",09-05-2016,06-03-2015,365 dias,"Portugal, Évora","Artigo 20.º, n.º 1, alínea a) do Código dos Contratos Públicos",09-05-2016,"159,20 €",,"",,Não aplicável.,Não aplicável.,FALSE
Aquisição de material de Consumo Clínico,Ajuste Direto Regime Geral,Aquisição de bens móveis,"33000000-0, Equipamento médico, medicamentos e produtos para cuidados pessoais","Administração Regional de Saúde do Alentejo, I. P. (503148768)",EZEQUIEL PANAO JORGE (501412727),"2.372,40 €",09-05-2016,06-03-2015,365 dias,"Portugal, Évora","Artigo 20.º, n.º 1, alínea a) do Código dos Contratos Públicos",09-05-2016,"2.372,40 €",,"",,Não aplicável.,Não aplicável.,FALSE
Aquisição de material consumo clínico,Ajuste Direto Regime Geral,Aquisição de bens móveis,"33000000-0, Equipamento médico, medicamentos e produtos para cuidados pessoais","Administração Regional de Saúde do Alentejo, I. P. (503148768)","H.R.PRODUTOS QUIMICOS,LDA (501895558)","34,80 €",09-05-2016,06-03-2015,365 dias,"Portugal, Évora","Artigo 20.º, n.º 1, alínea a) do Código dos Contratos Públicos",09-05-2016,"34,80 €",,"",,Não aplicável.,Não aplicável.,FALSE
Aquisição de material de Consumo Clínico,Ajuste Direto Regime Geral,Aquisição de bens móveis,"33000000-0, Equipamento médico, medicamentos e produtos para cuidados pessoais","Administração Regional de Saúde do Alentejo, I. P. (503148768)","MUNDINTER,SA (500199906)","49,80 €",09-05-2016,06-03-2015,365 dias,"Portugal, Évora","Artigo 20.º, n.º 1, alínea a) do Código dos Contratos Públicos",09-05-2016,"49,80 €",,"",,Não aplicável.,Não aplicável.,FALSE
Aquisição de material de Consumo Clínico,Ajuste Direto Regime Geral,Aquisição de bens móveis,"33000000-0, Equipamento médico, medicamentos e produtos para cuidados pessoais","Administração Regional de Saúde do Alentejo, I. P. (503148768)","INTERSURGICAL PORTUGAL, LDA. (503480045)","1.668,24 €",09-05-2016,06-03-2015,365 dias,"Portugal, Évora","Artigo 20.º, n.º 1, alínea a) do Código dos Contratos Públicos",09-05-2016,"1.668,24 €",,"",,Não aplicável.,Não aplicável.,FALSE
Aquisição de Material Consumo Clínico,Ajuste Direto Regime Geral,Aquisição de bens móveis,"33000000-0, Equipamento médico, medicamentos e produtos para cuidados pessoais","Administração Regional de Saúde do Alentejo, I. P. (503148768)","BASTOS VIEGAS, S.A. (500042772)","2.011,80 €",09-05-2016,06-03-2015,365 dias,"Portugal, Évora","Artigo 20.º, n.º 1, alínea a) do Código dos Contratos Públicos",09-05-2016,"2.011,80 €",,"",,Não aplicável.,Não aplicável.,FALSE
Aquisição de material Consumo Clínico,Ajuste Direto Regime Geral,Aquisição de bens móveis,"33000000-0, Equipamento médico, medicamentos e produtos para cuidados pessoais","Administração Regional de Saúde do Alentejo, I. P. (503148768)",EPJMEDICA - ART.MEDICOS HOSPIT (506820513),"803,80 €",09-05-2016,06-03-2015,365 dias,"Portugal, Évora","Artigo 20.º, n.º 1, alínea a) do Código dos Contratos Públicos",09-05-2016,"803,80 €",,"",,Não aplicável.,Não aplicável.,FALSE
Aquisição de material de Tratamento,Ajuste Direto Regime Geral,Aquisição de bens móveis,"33000000-0, Equipamento médico, medicamentos e produtos para cuidados pessoais","Administração Regional de Saúde do Alentejo, I. P. (503148768)","H.R.PRODUTOS QUIMICOS,LDA (501895558)","321,08 €",09-05-2016,06-03-2015,365 dias,"Portugal, Évora","Artigo 20.º, n.º 1, alínea a) do Código dos Contratos Públicos",09-05-2016,"321,08 €",,"",,Não aplicável.,Não aplicável.,FALSE
Aquisição de material de Tratamento,Ajuste Direto Regime Geral,Aquisição de bens móveis,"33000000-0, Equipamento médico, medicamentos e produtos para cuidados pessoais","Administração Regional de Saúde do Alentejo, I. P. (503148768)","Overpharma, Produtos Médicos e Farmacêuticos, Lda. (505792362)","61,25 €",09-05-2016,06-03-2015,365 dias,"Portugal, Évora","Artigo 20.º, n.º 1, alínea a) do Código dos Contratos Públicos",09-05-2016,"61,25 €",,"",,Não aplicável.,Não aplicável.,FALSE
Aquisição de Material de Tratamento,Ajuste Direto Regime Geral,Aquisição de bens móveis,"33000000-0, Equipamento médico, medicamentos e produtos para cuidados pessoais","Administração Regional de Saúde do Alentejo, I. P. (503148768)","B. BRAUN MEDICAL, LDA (501506543)","288,60 €",09-05-2016,06-03-2015,365 dias,"Portugal, Évora","Artigo 20.º, n.º 1, alínea a) do Código dos Contratos Públicos",09-05-2016,"288,60 €",,"",,Não aplicável.,Não aplicável.,FALSE
Aquisição de material de Tratamento,Ajuste Direto Regime Geral,Aquisição de bens móveis,"33000000-0, Equipamento médico, medicamentos e produtos para cuidados pessoais","Administração Regional de Saúde do Alentejo, I. P. (503148768)",EPJMEDICA - ART.MEDICOS HOSPIT (506820513),"1.126,29 €",09-05-2016,06-03-2015,365 dias,"Portugal, Évora","Artigo 20.º, n.º 1, alínea a) do Código dos Contratos Públicos",09-05-2016,"1.126,29 €",,"",,Não aplicável.,Não aplicável.,FALSE
Aquisição de material de Tratamento,Ajuste Direto Regime Geral,Aquisição de bens móveis,"33000000-0, Equipamento médico, medicamentos e produtos para cuidados pessoais","Administração Regional de Saúde do Alentejo, I. P. (503148768)",P M H PRODUTOS MED.HOSPITALAR (502376899),"425,00 €",09-05-2016,06-03-2015,365 dias,"Portugal, Évora","Artigo 20.º, n.º 1, alínea a) do Código dos Contratos Públicos",09-05-2016,"425,00 €",,"",,Não aplicável.,Não aplicável.,FALSE
Aquisição de material Tratamento,Ajuste Direto Regime Geral,Aquisição de bens móveis,"33000000-0, Equipamento médico, medicamentos e produtos para cuidados pessoais","Administração Regional de Saúde do Alentejo, I. P. (503148768)",Carefusion (503898554),"1.196,00 €",09-05-2016,06-03-2015,365 dias,"Portugal, Évora","Artigo 20.º, n.º 1, alínea a) do Código dos Contratos Públicos",09-05-2016,"1.196,00 €",,"",,Não aplicável.,Não aplicável.,FALSE
Aquisição de Material de Tratamento,Ajuste Direto Regime Geral,Aquisição de bens móveis,"33000000-0, Equipamento médico, medicamentos e produtos para cuidados pessoais","Administração Regional de Saúde do Alentejo, I. P. (503148768)",HOSPITEX-MAT. HOSPITALAR (501909842),"2.790,00 €",09-05-2016,06-03-2015,365 dias,"Portugal, Évora","Artigo 20.º, n.º 1, alínea a) do Código dos Contratos Públicos",09-05-2016,"2.790,00 €",,"",,Não aplicável.,Não aplicável.,FALSE
Aquisição de Material de Tratamento,Ajuste Direto Regime Geral,Aquisição de bens móveis,"33000000-0, Equipamento médico, medicamentos e produtos para cuidados pessoais","Administração Regional de Saúde do Alentejo, I. P. (503148768)",PERGUT PORTUGAL (501799729),"675,20 €",09-05-2016,06-03-2015,365 dias,"Portugal, Évora","Artigo 20.º, n.º 1, alínea a) do Código dos Contratos Públicos",09-05-2016,"675,20 €",,"",,Não aplicável.,Não aplicável.,FALSE
Aquisição material de Penso Sutura e Artigos Cirúrgicos,Ajuste Direto Regime Geral,Aquisição de bens móveis,"33000000-0, Equipamento médico, medicamentos e produtos para cuidados pessoais","Administração Regional de Saúde do Alentejo, I. P. (503148768)","ALBINO DIAS DE ANDRADE,LDA. (500013810)","1.465,10 €",09-05-2016,25-02-2015,365 dias,"Portugal, Évora","Artigo 20.º, n.º 1, alínea a) do Código dos Contratos Públicos",09-05-2016,"1.465,10 €",,"",,Não aplicável.,Não aplicável.,FALSE
Aquisição de Material de penso Sutura e Artigos Cirúrgicos,Ajuste Direto Regime Geral,Aquisição de bens móveis,"33000000-0, Equipamento médico, medicamentos e produtos para cuidados pessoais","Administração Regional de Saúde do Alentejo, I. P. (503148768)","B. BRAUN MEDICAL, LDA (501506543)","68,03 €",09-05-2016,25-02-2015,365 dias,"Portugal, Évora","Artigo 20.º, n.º 1, alínea a) do Código dos Contratos Públicos",09-05-2016,"68,03 €",,"",,Não aplicável.,Não aplicável.,FALSE
Aquisição de material de penso Sutura e Artigos Cirúrgicos,Ajuste Direto Regime Geral,Aquisição de bens móveis,"33000000-0, Equipamento médico, medicamentos e produtos para cuidados pessoais","Administração Regional de Saúde do Alentejo, I. P. (503148768)","H.R.PRODUTOS QUIMICOS,LDA (501895558)","176,64 €",09-05-2016,25-02-2015,365 dias,"Portugal, Évora","Artigo 20.º, n.º 1, alínea a) do Código dos Contratos Públicos",09-05-2016,"176,64 €",,"",,Não aplicável.,Não aplicável.,FALSE
Aquisição Material Penso Sutura e Artigos Cirúrgicos,Ajuste Direto Regime Geral,Aquisição de bens móveis,"33000000-0, Equipamento médico, medicamentos e produtos para cuidados pessoais","Administração Regional de Saúde do Alentejo, I. P. (503148768)",P M H PRODUTOS MED.HOSPITALAR (502376899),"491,40 €",09-05-2016,25-02-2015,365 dias,"Portugal, Évora, Évora","Artigo 20.º, n.º 1, alínea a) do Código dos Contratos Públicos",09-05-2016,"491,40 €",,"",,Não aplicável.,Não aplicável.,FALSE
Aquisição de Material de Penso Sutura e Artigos Cirúrgicos,Ajuste Direto Regime Geral,Aquisição de bens móveis,"33000000-0, Equipamento médico, medicamentos e produtos para cuidados pessoais","Administração Regional de Saúde do Alentejo, I. P. (503148768)","SPECULUM, LDA (502996323)","76,61 €",09-05-2016,25-02-2015,365 dias,"Portugal, Évora","Artigo 20.º, n.º 1, alínea a) do Código dos Contratos Públicos",09-05-2016,"76,61 €",,"",,Não aplicável.,Não aplicável.,FALSE
Aquisição de Material de penso Sutura e Artigos Cirúrgicos,Ajuste Direto Regime Geral,Aquisição de bens móveis,"33000000-0, Equipamento médico, medicamentos e produtos para cuidados pessoais","Administração Regional de Saúde do Alentejo, I. P. (503148768)",Abilio Freire Lda. (500432600),"554,26 €",09-05-2016,25-02-2015,365 dias,"Portugal, Évora","Artigo 20.º, n.º 1, alínea a) do Código dos Contratos Públicos",09-05-2016,"554,26 €",,"",,Não aplicável.,Não aplicável.,FALSE
Aquisição de Material Penso Sutura e artigos Cirúrgicos,Ajuste Direto Regime Geral,Aquisição de bens móveis,"33000000-0, Equipamento médico, medicamentos e produtos para cuidados pessoais","Administração Regional de Saúde do Alentejo, I. P. (503148768)","ALBINO DIAS DE ANDRADE,LDA. (500013810)","1.959,63 €",09-05-2016,25-02-2015,365 dias,"Portugal, Évora","Artigo 20.º, n.º 1, alínea a) do Código dos Contratos Públicos",09-05-2016,"1.959,63 €",,"",,Não aplicável.,Não aplicável.,FALSE
Aquisição de material Penso Sutura e Artigos Cirúrgicos,Ajuste Direto Regime Geral,Aquisição de bens móveis,"33000000-0, Equipamento médico, medicamentos e produtos para cuidados pessoais","Administração Regional de Saúde do Alentejo, I. P. (503148768)","SMITH & NEPHEW,LDA. (503552461)","208,08 €",09-05-2016,25-02-2015,365 dias,"Portugal, Évora","Artigo 20.º, n.º 1, alínea a) do Código dos Contratos Públicos",09-05-2016,"208,08 €",,"",,Não aplicável.,Não aplicável.,FALSE
Aquisição de Material de Penso Sutura e Artigos Cirúrgicos,Ajuste Direto Regime Geral,Aquisição de bens móveis,"33000000-0, Equipamento médico, medicamentos e produtos para cuidados pessoais","Administração Regional de Saúde do Alentejo, I. P. (503148768)","BASTOS VIEGAS, S.A. (500042772)","1.629,44 €",09-05-2016,25-02-2015,365 dias,"Portugal, Évora","Artigo 20.º, n.º 1, alínea a) do Código dos Contratos Públicos",09-05-2016,"1.629,44 €",,"",,Não aplicável.,Não aplicável.,FALSE
Aquisição de Material de Penso e Artigos Cirúrgicos,Ajuste Direto Regime Geral,Aquisição de bens móveis,"33000000-0, Equipamento médico, medicamentos e produtos para cuidados pessoais","Administração Regional de Saúde do Alentejo, I. P. (503148768)",EZEQUIEL PANAO JORGE (501412727),"2.734,57 €",09-05-2016,25-02-2015,365 dias,"Portugal, Évora","Artigo 20.º, n.º 1, alínea a) do Código dos Contratos Públicos",09-05-2016,"2.734,57 €",,"",,Não aplicável.,Não aplicável.,FALSE
Aquisição de Material de penso Sutura e Artigos Cirúrgicos,Ajuste Direto Regime Geral,Aquisição de bens móveis,"33000000-0, Equipamento médico, medicamentos e produtos para cuidados pessoais","Administração Regional de Saúde do Alentejo, I. P. (503148768)",DOCWORLD - Dispositivos Médicos (508592909),"285,98 €",09-05-2016,25-02-2015,365 dias,"Portugal, Évora","Artigo 20.º, n.º 1, alínea a) do Código dos Contratos Públicos",09-05-2016,"285,98 €",,"",,Não aplicável.,Não aplicável.,FALSE
Aquisição de material de hotelaria,Ajuste Direto Regime Geral,Aquisição de bens móveis,"39000000-2, Mobiliário (incl. de escritório), acessórios, aparelhos domésticos (excl. iluminação) e produtos de limpeza","Administração Regional de Saúde do Alentejo, I. P. (503148768)",Tiago Morgado (505233673),"12.047,52 €",09-05-2016,03-06-2015,365 dias,"Portugal, Évora","Artigo 20.º, n.º 1, alínea a) do Código dos Contratos Públicos",09-05-2016,"12.047,52 €",,"",,Não aplicável.,Não aplicável.,FALSE
Aquisição Material de farmácia,Ao abrigo de acordo-quadro (art.º 258.º),Aquisição de bens móveis,"33000000-0, Equipamento médico, medicamentos e produtos para cuidados pessoais","Administração Regional de Saúde do Alentejo, I. P. (503148768)","SANOFI - Produtos Farmacêuticos, Ldª (500134960)","1.144,41 €",06-05-2016,06-05-2016,90 dias,"Portugal, Évora","Artigo 20.º, n.º 1, alínea a) do Código dos Contratos Públicos",29-04-2016,"1.144,41 €",,"",,1326195,ACORDO QUADRO PARA FORNECIMENTO DE MEDICAMENTOS ANTI-INFECIOSOS: EXCETO ANTIVÍRICOS E ANTIFÚNGICOS ÀS INSTITUIÇÕES E SERVIÇOS DO SERVIÇO NACIONAL DE SAÚDE,FALSE
"Aquisição de Serviços de Técnico Superior de Saúde, Ramo Psicologia, para o Departamento de Saúde Pública e Planeamento por um Período de Doze Meses",Ajuste Direto Regime Geral,Aquisição de serviços,"85121270-6, Serviços de psiquiatria ou psicologia",Administração Regional de Saúde do Alentejo (ARSA) (503148768),Edgar Manuel Damião Palminhas (216869943),"17.141,16 €",06-05-2016,01-01-2015,365 dias,"Portugal, Évora, Évora","Artigo 20.º, n.º 1, alínea a) do Código dos Contratos Públicos",12-05-2015,"5.713,72 €",,resciindiu-se o contrato em maio de 2015.,,Não aplicável.,Não aplicável.,FALSE
Aquisição de serviços médicos para a USF Remo,Concurso público,Aquisição de serviços,"85121200-5, Serviços de medicina especializada","Administração Regional de Saúde do Alentejo, I. P. (503148768)","Kelly Services - Healthcare, Unipessoal, Lda. (510723691)","13.500,00 €",06-05-2016,28-12-2015,60 dias,"Portugal, Évora, Reguengos de Monsaraz",Artigo 155.º do Código dos Contratos Públicos,29-02-2016,"14.200,00 €",,Número de horas prestadas superior ao número de horas contratadas,,Não aplicável.,Não aplicável.,FALSE
Aquisição de serviços médicos para a USF Lusitânia,Concurso público,Aquisição de serviços,"85121200-5, Serviços de medicina especializada","Administração Regional de Saúde do Alentejo, I. P. (503148768)","Kelly Services - Healthcare, Unipessoal, Lda. (510723691)","9.000,00 €",06-05-2016,28-12-2015,60 dias,"Portugal, Évora, Évora",Artigo 155.º do Código dos Contratos Públicos,29-02-2016,"900,00 €",,Número de horas prestadas inferior ao número de horas contratadas,,Não aplicável.,Não aplicável.,FALSE
Contratação de serviços médicos para a UCSP de Vila Viçosa,Concurso público,Aquisição de serviços,"85121200-5, Serviços de medicina especializada","Administração Regional de Saúde do Alentejo, I. P. (503148768)","Kelly Services - Healthcare, Unipessoal, Lda. (510723691)","4.500,00 €",06-05-2016,28-12-2015,60 dias,"Portugal, Évora, Vila Viçosa",Artigo 155.º do Código dos Contratos Públicos,29-02-2016,"4.675,00 €",,Número de horas prestadas superior ao número de horas contratadas,,Não aplicável.,Não aplicável.,FALSE
Aquisição de 150 ampolas de fitomenadiona,Ao abrigo de acordo-quadro (art.º 258.º),Aquisição de bens móveis,"33000000-0, Equipamento médico, medicamentos e produtos para cuidados pessoais","Administração Regional de Saúde do Alentejo, I. P. (503148768)","Roche Farmacêutica Química, Ldª (500233810)","300,00 €",06-05-2016,16-11-2015,90 dias,"Portugal, Évora","Artigo 20.º, n.º 1, alínea a) do Código dos Contratos Públicos",06-05-2016,"300,00 €",,"",,1210107,"CONCURSO PÚBLICO PARA A CELEBRAÇÃO DE CONTRATOS PÚBLICOS DE APROVISIONAMENTO PARA A ÁREA DA SAÚDE, COM VISTA AO FORNECIMENTO DE MEDICAMENTOS DO GRUPO 4: SANGUE, ÀS INSTITUIÇÕES E SERVIÇOS DO SERVIÇO NACIONAL DE SAÚDE",FALSE
Aquisição de serviços médicos para a UCSP de Viana do Alentejo,Concurso público,Aquisição de serviços,"85121200-5, Serviços de medicina especializada","Administração Regional de Saúde do Alentejo, I. P. (503148768)","Kelly Services - Healthcare, Unipessoal, Lda. (510723691)","4.500,00 €",06-05-2016,28-12-2015,60 dias,"Portugal, Évora, Viana do Alentejo",Artigo 155.º do Código dos Contratos Públicos,29-02-2016,"3.950,00 €",,Número de horas prestadas inferior ao número de horas contratadas,,Não aplicável.,Não aplicável.,FALSE
Aquisição de serviços médicos para a UCSP de Estremoz,Concurso público,Aquisição de serviços,"85121200-5, Serviços de medicina especializada","Administração Regional de Saúde do Alentejo, I. P. (503148768)","Kelly Services - Healthcare, Unipessoal, Lda. (510723691)","9.000,00 €",06-05-2016,28-12-2015,60 dias,"Portugal, Évora, Portel",Artigo 155.º do Código dos Contratos Públicos,29-02-2016,"8.100,00 €",,Número de horas prestadas inferior ao número de horas contratadas,,Não aplicável.,Não aplicável.,FALSE
Aquisição de serviços médicos para a UCSP de Estremoz,Concurso público,Aquisição de serviços,"85121200-5, Serviços de medicina especializada","Administração Regional de Saúde do Alentejo, I. P. (503148768)","Corevalue - Healthcare Solutions, Lda. (513654577)","4.500,00 €",06-05-2016,28-12-2015,60 dias,"Portugal, Évora, Estremoz",Artigo 155.º do Código dos Contratos Públicos,29-02-2016,"4.100,00 €",,Número de horas prestadas inferior ao número de horas contratadas,,Não aplicável.,Não aplicável.,FALSE
Aquisição de serviços médicos para o SAP de Vendas Novas,Concurso público,Aquisição de serviços,"85121100-4, Serviços de médicos de clínica geral","Administração Regional de Saúde do Alentejo, I. P. (503148768)","Kelly Services - Healthcare, Unipessoal, Lda. (510723691)","24.948,00 €",06-05-2016,28-12-2015,60 dias,"Portugal, Évora, Vendas Novas",Artigo 155.º do Código dos Contratos Públicos,29-02-2016,"23.268,00 €",,Número de horas prestadas inferior ao número de horas contratadas,,Não aplicável.,Não aplicável.,FALSE
Aquisição de Consumíveis Informáticos e Material de economato.,Ajuste Direto Regime Geral,Aquisição de bens móveis,"30000000-9, Máquinas, equipamento e material de escritório e de informática, excepto mobiliário e pacotes de programas (software)","Administração Regional de Saúde do Alentejo, I. P. (503148768)","MAXONE - Material de Escritório, Ldª (507052609)","5.869,06 €",06-05-2016,03-09-2015,300 dias,"Portugal, Évora","Artigo 20.º, n.º 1, alínea a) do Código dos Contratos Públicos",31-12-2015,"5.869,06 €",,"",,Não aplicável.,Não aplicável.,FALSE
Aquisição de serviços médicos para o SUB de Montemor-o-Novo,Concurso público,Aquisição de serviços,"85121100-4, Serviços de médicos de clínica geral","Administração Regional de Saúde do Alentejo, I. P. (503148768)","Kelly Services - Healthcare, Unipessoal, Lda. (510723691)","31.752,00 €",06-05-2016,28-12-2015,60 dias,"Portugal, Évora, Montemor-o-Novo",Artigo 155.º do Código dos Contratos Públicos,29-02-2016,"28.213,50 €",,Número de horas prestadas inferior ao número de horas contratadas,,Não aplicável.,Não aplicável.,FALSE
Aquisição de Consumíveis informáticos e material de economato.,Ajuste Direto Regime Geral,Aquisição de bens móveis,"30000000-9, Máquinas, equipamento e material de escritório e de informática, excepto mobiliário e pacotes de programas (software)","Administração Regional de Saúde do Alentejo, I. P. (503148768)",OLMAR (508831989),"320,50 €",06-05-2016,03-09-2015,300 dias,"Portugal, Évora","Artigo 20.º, n.º 1, alínea a) do Código dos Contratos Públicos",31-12-2015,"320,50 €",,"",,Não aplicável.,Não aplicável.,FALSE
Aquisição de material de Economato e Consumíveis Informáticos,Ajuste Direto Regime Geral,Aquisição de bens móveis,"30000000-9, Máquinas, equipamento e material de escritório e de informática, excepto mobiliário e pacotes de programas (software)","Administração Regional de Saúde do Alentejo, I. P. (503148768)",Centeque Sul (505148811),"193,42 €",06-05-2016,07-09-2015,300 dias,"Portugal, Évora","Artigo 20.º, n.º 1, alínea a) do Código dos Contratos Públicos",31-12-2015,"193,42 €",,"",,Não aplicável.,Não aplicável.,FALSE
Aquisição de serviços médicos para o SUB de Estremoz,Concurso público,Aquisição de serviços,"85121100-4, Serviços de médicos de clínica geral","Administração Regional de Saúde do Alentejo, I. P. (503148768)","Kelly Services - Healthcare, Unipessoal, Lda. (510723691)","43.092,00 €",06-05-2016,28-12-2015,60 dias,"Portugal, Évora, Estremoz",Artigo 155.º do Código dos Contratos Públicos,29-02-2016,"40.131,42 €",,Número de horas prestadas inferior ao número de horas contratadas,,Não aplicável.,Não aplicável.,FALSE
Aquisição de solução polielectrolítica,Ajuste Direto Regime Geral,Aquisição de bens móveis,"33000000-0, Equipamento médico, medicamentos e produtos para cuidados pessoais","Administração Regional de Saúde do Alentejo, I. P. (503148768)","Angelini Farmacêutica, Ldª (500583650)","676,50 €",06-05-2016,23-02-2015,366 dias,"Portugal, Évora","Artigo 20.º, n.º 1, alínea a) do Código dos Contratos Públicos",30-12-2015,"676,50 €",,"",,Não aplicável.,Não aplicável.,FALSE
Rastreio do Cancro do Colon e Recto - Aquisição de Consumíveis e Aluguer de Equipamento,Ajuste Direto Regime Geral,Aquisição de bens móveis,"31000000-6, Maquinaria, aparelhagem, equipamento e consumíveis eléctricos; iluminação<BR/>33000000-0, Equipamento médico, medicamentos e produtos para cuidados pessoais","Administração Regional de Saúde do Alentejo, I. P. (503148768)","Lusopalex - Sociedade Distribuição Produtos Hospitalares, Ldª (503531588)","12.300,00 €",06-05-2016,16-02-2015,366 dias,"Portugal, Évora","Artigo 20.º, n.º 1, alínea a) do Código dos Contratos Públicos",31-12-2015,"12.300,00 €",,"",,Não aplicável.,Não aplicável.,FALSE
Aquisição de serviços médicos para a USF Lusitânia para o período de 19 de outubro a 31 de dezembro de 2015.,Concurso público,Aquisição de serviços,"85121200-5, Serviços de medicina especializada","Administração Regional de Saúde do Alentejo, I. P. (503148768)","Corevalue - Healthcare Solutions, Lda. (513654577)","8.687,76 €",06-05-2016,19-10-2015,74 dias,"Portugal, Évora, Évora",Artigo 155.º do Código dos Contratos Públicos,31-12-2015,"7.232,97 €",,Número de horas prestadas inferior ao número de horas contratadas.,,Não aplicável.,Não aplicável.,FALSE
Aquisição de serviços médicos para a UCSP de Vila Viçosa para o período de 19 de outubro a 31 de dezembro de 2015.,Concurso público,Aquisição de serviços,"85121200-5, Serviços de medicina especializada","Administração Regional de Saúde do Alentejo, I. P. (503148768)","Corevalue - Healthcare Solutions, Lda. (513654577)","4.343,88 €",06-05-2016,19-10-2015,74 dias,"Portugal, Évora, Vila Viçosa",Artigo 155.º do Código dos Contratos Públicos,31-12-2015,"3.811,14 €",,Número de horas prestadas inferior ao número de horas contratadas.,,Não aplicável.,Não aplicável.,FALSE
Aquisição de serviços médicos para a UCSP de Viana do Alentejo para o período de 19 de outubro a 31 de dezembro de 2015.,Concurso público,Aquisição de serviços,"85121200-5, Serviços de medicina especializada","Administração Regional de Saúde do Alentejo, I. P. (503148768)","Corevalue - Healthcare Solutions, Lda. (513654577)","4.343,88 €",06-05-2016,19-10-2015,74 dias,"Portugal, Évora, Viana do Alentejo",Artigo 155.º do Código dos Contratos Públicos,31-12-2015,"4.487,31 €",,Número de horas prestadas superior ao número de horas contratadas.,,Não aplicável.,Não aplicável.,FALSE
Aquisição de serviços médicos para a UCSP de Portel para o período de 19 de outubro a 31 de dezembro,Concurso público,Aquisição de serviços,"85121200-5, Serviços de medicina especializada","Administração Regional de Saúde do Alentejo, I. P. (503148768)","Corevalue - Healthcare Solutions, Lda. (513654577)","8.687,76 €",06-05-2016,19-10-2015,74 dias,"Portugal, Évora, Portel",Artigo 155.º do Código dos Contratos Públicos,31-12-2015,"7.704,24 €",,Número de horas prestadas inferior ao número de horas contratadas,,Não aplicável.,Não aplicável.,FALSE
Aquisição de serviços médicos para a UCSP de Estremoz para o período de 19 de outubro a 31 de dezembro de 2015.,Concurso público,Aquisição de serviços,"85121200-5, Serviços de medicina especializada","Administração Regional de Saúde do Alentejo, I. P. (503148768)","Corevalue - Healthcare Solutions, Lda. (513654577)","4.343,88 €",05-05-2016,16-10-2015,74 dias,"Portugal, Évora, Estremoz",Artigo 155.º do Código dos Contratos Públicos,31-12-2015,"4.302,90 €",,O número de horas prestadas foi inferior ao número de horas contratadas.,,Não aplicável.,Não aplicável.,FALSE
Aquisição de serviços médicos para o período de 19 de outubro a 31 de dezembro de 2015.,Concurso público,Aquisição de serviços,"85121100-4, Serviços de médicos de clínica geral","Administração Regional de Saúde do Alentejo, I. P. (503148768)","Corevalue - Healthcare Solutions, Lda. (513654577)","32.253,91 €",05-05-2016,16-10-2015,74 dias,"Portugal, Évora, Montemor-o-Novo",Artigo 155.º do Código dos Contratos Públicos,31-12-2015,"32.253,91 €",,"",,Não aplicável.,Não aplicável.,FALSE
Aquisição de serviços médicos para o SUB de Estremoz para o período de 22 de outubro a 31 de dezembro de 2015.,Concurso público,Aquisição de serviços,"85121100-4, Serviços de médicos de clínica geral","Administração Regional de Saúde do Alentejo, I. P. (503148768)","Kelly Services - Healthcare, Unipessoal, Lda. (510723691)","51.047,04 €",05-05-2016,22-10-2015,71 dias,"Portugal, Évora, Estremoz",Artigo 155.º do Código dos Contratos Públicos,31-12-2015,"49.470,01 €",,Número de horas prestadas inferior ao número de horas contratadas.,,Não aplicável.,Não aplicável.,FALSE
