freguesia,acronym,validVotesPercentage,votes,dicofre
Cedovim,PS,41.94,52,091403
Cedovim,PPD/PSD.CDS-PP,40.32,50,091403
Cedovim,MPT,5.65,7,091403
Cedovim,PND,3.23,4,091403
Cedovim,PCP-PEV,2.42,3,091403
Cedovim,B.E.,1.61,2,091403
Cedovim,MAS,1.61,2,091403
Cedovim,PAN,0.81,1,091403
Cedovim,PCTP/MRPP,0.81,1,091403
Cedovim,PPV,0.81,1,091403
Cedovim,PTP,0.81,1,091403
Cedovim,L,0,0,091403
Cedovim,PDA,0,0,091403
Cedovim,PNR,0,0,091403
Cedovim,POUS,0,0,091403
Cedovim,PPM,0,0,091403
