Objeto do Contrato,Tipo de Procedimento,Tipo(s) de Contrato,CPVs,Entidade(s) Adjudicante(s),Entidade(s) Adjudicatária(s),Preço Contratual,Data de Publicação,Data de Celebração do Contrato,Prazo de Execução,Local de Execução,Fundamentação,Data de Fecho do Contrato,Preço Total Efetivo,Causas das Alterações ao Prazo,Causas das Alterações ao Preço,Estado,N.º registo do Acordo Quadro,Descrição do Acordo Quadro,Procedimento Centralizado
Aquisição de material de consumo clinico,Ajuste Direto Regime Geral,Aquisição de bens móveis,"33140000-3, Material médico de consumo",Instituto Nacional de Saúde Dr.Ricardo Jorge(INSA) (501427511),"QLABO- Equipamentos Laboratório e serviços, Lda (503829994)","12.818,76 €",10-11-2015,28-10-2015,90 dias,"Portugal, Lisboa, Lisboa","Artigo 20.º, n.º 1, alínea a) do Código dos Contratos Públicos",,,,,,Não aplicável.,Não aplicável.,FALSE
Aquisição de bens para fins exclusivos de investigação no INSA,Ajuste Direto Regime Geral,Aquisição de bens móveis,"33140000-3, Material médico de consumo","Instituto Nacional de Saúde Doutor Ricardo Jorge, I. P. (501427511)","Alfagene - Novas Tecnologias das Ciências da Vida, Lda (503387398)","318,27 €",10-11-2015,13-10-2015,90 dias,"Portugal, Lisboa, Lisboa","Artigo 26.º, n.º 1, alínea b) do Código dos Contratos Públicos",,,,,,Não aplicável.,Não aplicável.,FALSE
Aquisição de reagentes para fins exclusivos de investigação no INSA,Ajuste Direto Regime Geral,Aquisição de bens móveis,"33100000-1, Equipamento médico",Instituto Nacional de Saúde Dr.Ricardo Jorge(INSA) (501427511),"Roche Sistemas de diagnóstico, Lda (504282921)","462,72 €",09-11-2015,03-11-2015,90 dias,"Portugal, Lisboa, Lisboa","Artigo 26.º, n.º 1, alínea b) do Código dos Contratos Públicos",,,,,,Não aplicável.,Não aplicável.,FALSE
Aquisição de bens para fins exclusivos de investigação do INSA,Ajuste Direto Regime Geral,Aquisição de bens móveis,"33140000-3, Material médico de consumo","Instituto Nacional de Saúde Doutor Ricardo Jorge, I. P. (501427511)","Qlabo- Equipamentos  de laboratório & Serviços, Lda (503829994)","632,00 €",09-11-2015,29-10-2015,90 dias,"Portugal, Lisboa, Lisboa","Artigo 26.º, n.º 1, alínea b) do Código dos Contratos Públicos",,,,,,Não aplicável.,Não aplicável.,FALSE
Aquisição de prestação de serviços para fins exclusivos de investigação do INSA,Ajuste Direto Regime Geral,Aquisição de serviços,"50000000-5, Serviços de reparação e manutenção","Instituto Nacional de Saúde Doutor Ricardo Jorge, I. P. (501427511)",Joana Rita Gaspar de Barros Martinho Chora (245180729),"4.995,00 €",09-11-2015,20-10-2015,90 dias,"Portugal, Lisboa, Lisboa","Artigo 26.º, n.º 1, alínea b) do Código dos Contratos Públicos",,,,,,Não aplicável.,Não aplicável.,FALSE
Aquisição de reagentes para as áreas do diagnóstico molecular para o INSA,Concurso público,Aquisição de bens móveis,"33696500-0, Reagentes de laboratório","Instituto Nacional de Saúde Dr. Ricardo Jorge, I. P. (501427511)","VWR Internacional, Lda (503842770)","25.300,19 €",09-11-2015,25-05-2015,90 dias,"Portugal, Porto, Porto<BR/>Portugal, Setúbal, Setúbal<BR/>Portugal, Lisboa, Lisboa","Artigo 20.º, n.º 1, alínea b) do Código dos Contratos Públicos",,,,,,Não aplicável.,Não aplicável.,FALSE
Aquisição de reagentes para as áreas do diagnóstico molecular para o INSA,Concurso público,Aquisição de bens móveis,"33696500-0, Reagentes de laboratório","Instituto Nacional de Saúde Dr. Ricardo Jorge, I. P. (501427511)","Alfagene - Novas Tecnologias das Ciências da Vida, Lda (503387398)","50.932,25 €",09-11-2015,25-05-2015,90 dias,"Portugal, Porto, Porto<BR/>Portugal, Setúbal, Setúbal<BR/>Portugal, Lisboa, Lisboa","Artigo 20.º, n.º 1, alínea b) do Código dos Contratos Públicos",,,,,,Não aplicável.,Não aplicável.,FALSE
Aquisição de reagentes para as áreas do diagnóstico molecular para o INSA,Concurso público,Aquisição de bens móveis,"33696500-0, Reagentes de laboratório","Instituto Nacional de Saúde Dr. Ricardo Jorge, I. P. (501427511)","Quilaban, SA (500399670)","3.018,70 €",09-11-2015,25-05-2015,90 dias,"Portugal, Setúbal, Setúbal<BR/>Portugal, Porto, Porto<BR/>Portugal, Lisboa, Lisboa","Artigo 20.º, n.º 1, alínea b) do Código dos Contratos Públicos",,,,,,Não aplicável.,Não aplicável.,FALSE
Aquisição de reagentes para as áreas do diagnóstico molecular para o INSA,Concurso público,Aquisição de bens móveis,"33696500-0, Reagentes de laboratório","Instituto Nacional de Saúde Dr. Ricardo Jorge, I. P. (501427511)","Citomed - Equipamentos e reagentes para laboratório, Lda (503492043)","11.629,00 €",09-11-2015,25-05-2015,90 dias,"Portugal, Setúbal, Setúbal<BR/>Portugal, Porto, Porto<BR/>Portugal, Lisboa, Lisboa","Artigo 20.º, n.º 1, alínea b) do Código dos Contratos Públicos",,,,,,Não aplicável.,Não aplicável.,FALSE
Aquisição de reagentes para as áreas do diagnóstico molecular para o INSA,Concurso público,Aquisição de bens móveis,"33696500-0, Reagentes de laboratório","Instituto Nacional de Saúde Dr. Ricardo Jorge, I. P. (501427511)","Werfen Portugal, Lda (501086110)","1.620,00 €",09-11-2015,25-05-2015,90 dias,"Portugal, Porto, Porto<BR/>Portugal, Lisboa, Lisboa<BR/>Portugal, Setúbal, Setúbal","Artigo 20.º, n.º 1, alínea b) do Código dos Contratos Públicos",,,,,,Não aplicável.,Não aplicável.,FALSE
Aquisição de reagentes para as áreas do diagnóstico molecular para o INSA,Concurso público,Aquisição de bens móveis,"33696500-0, Reagentes de laboratório","Instituto Nacional de Saúde Dr. Ricardo Jorge, I. P. (501427511)","Frilabo II , Lda (507958861)","3.810,00 €",09-11-2015,25-05-2015,90 dias,"Portugal, Porto, Porto<BR/>Portugal, Lisboa, Lisboa<BR/>Portugal, Setúbal, Setúbal","Artigo 20.º, n.º 1, alínea b) do Código dos Contratos Públicos",,,,,,Não aplicável.,Não aplicável.,FALSE
Aquisição de reagentes para as áreas do diagnóstico molecular para o INSA,Concurso público,Aquisição de bens móveis,"33696500-0, Reagentes de laboratório","Instituto Nacional de Saúde Dr. Ricardo Jorge, I. P. (501427511)",Fischer Scientific (506429210),"4.104,99 €",09-11-2015,25-05-2015,90 dias,"Portugal, Porto, Porto<BR/>Portugal, Lisboa, Lisboa<BR/>Portugal, Setúbal, Setúbal","Artigo 20.º, n.º 1, alínea b) do Código dos Contratos Públicos",,,,,,Não aplicável.,Não aplicável.,FALSE
Aquisição de reagentes para as áreas do diagnóstico molecular para o INSA,Concurso público,Aquisição de bens móveis,"33696500-0, Reagentes de laboratório","Instituto Nacional de Saúde Dr. Ricardo Jorge, I. P. (501427511)","Roche Sistemas de Diagnósticos, Lda (504282921)","49.060,00 €",09-11-2015,25-05-2015,90 dias,"Portugal, Setúbal, Setúbal<BR/>Portugal, Porto, Porto<BR/>Portugal, Lisboa, Lisboa","Artigo 20.º, n.º 1, alínea b) do Código dos Contratos Públicos",,,,,,Não aplicável.,Não aplicável.,FALSE
Aquisição de reagentes para as áreas do diagnóstico molecular para o INSA,Concurso público,Aquisição de bens móveis,"33696500-0, Reagentes de laboratório","Instituto Nacional de Saúde Dr. Ricardo Jorge, I. P. (501427511)","ILC - Instrumentos de Laboratório e Científicos, Lda (500948208)","70,00 €",09-11-2015,25-05-2015,90 dias,"Portugal, Porto, Porto<BR/>Portugal, Lisboa, Lisboa<BR/>Portugal, Setúbal, Setúbal","Artigo 20.º, n.º 1, alínea b) do Código dos Contratos Públicos",,,,,,Não aplicável.,Não aplicável.,FALSE
Aquisição de reagentes para diagnóstico molecular para o INSA,Concurso público,Aquisição de bens móveis,"33696500-0, Reagentes de laboratório","Instituto Nacional de Saúde Dr. Ricardo Jorge, I. P. (501427511)","Bio-Rad Laboratories, Lda (501301321)","1.624,00 €",06-11-2015,25-05-2015,90 dias,"Portugal, Lisboa, Lisboa<BR/>Portugal, Setúbal, Setúbal<BR/>Portugal, Porto, Porto","Artigo 20.º, n.º 1, alínea b) do Código dos Contratos Públicos",,,,,,Não aplicável.,Não aplicável.,FALSE
Aquisição de reagentes para diagnóstico molecular para o INSA,Concurso público,Aquisição de bens móveis,"33696500-0, Reagentes de laboratório","Instituto Nacional de Saúde Dr. Ricardo Jorge, I. P. (501427511)","Bioportugal- Química farmacêutica, Lda (502380543)","725,00 €",05-11-2015,25-05-2015,90 dias,"Portugal, Lisboa, Lisboa<BR/>Portugal, Setúbal, Setúbal<BR/>Portugal, Porto, Porto","Artigo 20.º, n.º 1, alínea b) do Código dos Contratos Públicos",,,,,,Não aplicável.,Não aplicável.,FALSE
Aquisição de reagentes para diagnostico molecular para o INSA,Concurso público,Aquisição de bens móveis,"33696500-0, Reagentes de laboratório","Instituto Nacional de Saúde Dr. Ricardo Jorge, I. P. (501427511)","Enzifarma, SA (503636975)","3.857,20 €",05-11-2015,25-05-2015,90 dias,"Portugal, Lisboa, Lisboa<BR/>Portugal, Setúbal, Setúbal<BR/>Portugal, Porto, Porto","Artigo 20.º, n.º 1, alínea b) do Código dos Contratos Públicos",,,,,,Não aplicável.,Não aplicável.,FALSE
Aquisição de amostras para o programa PNAEQ para o INSA,Ajuste Direto Regime Geral,Aquisição de bens móveis,"33000000-0, Equipamento médico, medicamentos e produtos para cuidados pessoais","Instituto Nacional de Saúde Doutor Ricardo Jorge, I. P. (501427511)",Laquality OY (VAT FI01100791),"21.324,73 €",05-11-2015,29-07-2015,90 dias,"Portugal, Lisboa, Lisboa","Artigo 24.º, n.º 1, alínea e) do Código dos Contratos Públicos",,,,,,Não aplicável.,Não aplicável.,FALSE
Aquisição de reagentes ao estrangeiro para os laboratório do  INSA,Ajuste Direto Regime Geral,Aquisição de bens móveis,"33140000-3, Material médico de consumo","Instituto Nacional de Saúde Doutor Ricardo Jorge, I. P. (501427511)","Tracer Tecnologias Analíticas, SL (CIF ESB82689092)","25.644,00 €",05-11-2015,09-09-2015,90 dias,"Portugal, Porto, Porto","Artigo 24.º, n.º 1, alínea e) do Código dos Contratos Públicos",,,,,,Não aplicável.,Não aplicável.,FALSE
Aquisição de material de vidro e porcelana para o INSA,Concurso público,Aquisição de bens móveis,"33793000-5, Artigos de vidro para laboratório","Instituto Nacional de Saúde Dr. Ricardo Jorge, I. P. (501427511)","Normax- Fabrica de vidro científicos, Lda (500203130)","4.347,60 €",04-11-2015,21-05-2015,90 dias,"Portugal, Porto, Porto<BR/>Portugal, Lisboa, Lisboa<BR/>Portugal, Setúbal, Setúbal","Artigo 20.º, n.º 1, alínea b) do Código dos Contratos Públicos",,,,,,Não aplicável.,Não aplicável.,FALSE
Aquisição de material de vidro e porcelana para o INSA,Concurso público,Aquisição de bens móveis,"33793000-5, Artigos de vidro para laboratório","Instituto Nacional de Saúde Dr. Ricardo Jorge, I. P. (501427511)","Aiatelab - Equipamentos de laboratório, Lda (508533104)","568,72 €",04-11-2015,21-05-2015,90 dias,"Portugal, Setúbal, Setúbal<BR/>Portugal, Porto, Porto<BR/>Portugal, Lisboa, Lisboa","Artigo 20.º, n.º 1, alínea b) do Código dos Contratos Públicos",,,,,,Não aplicável.,Não aplicável.,FALSE
Aquisição de material de vidro e porcelana para o INSA,Concurso público,Aquisição de bens móveis,"33793000-5, Artigos de vidro para laboratório","Instituto Nacional de Saúde Dr. Ricardo Jorge, I. P. (501427511)","VWR Internacional, Lda (503842770)","1.982,29 €",04-11-2015,21-05-2015,90 dias,"Portugal, Porto, Porto<BR/>Portugal, Lisboa, Lisboa<BR/>Portugal, Setúbal, Setúbal","Artigo 20.º, n.º 1, alínea b) do Código dos Contratos Públicos",,,,,,Não aplicável.,Não aplicável.,FALSE
Aquisição de material de vidro e porcelana para o INSA,Concurso público,Aquisição de bens móveis,"33793000-5, Artigos de vidro para laboratório","Instituto Nacional de Saúde Dr. Ricardo Jorge, I. P. (501427511)","Laborspirit, Lda (507485149)","1.236,51 €",03-11-2015,21-05-2015,90 dias,"Portugal, Porto, Porto<BR/>Portugal, Setúbal, Setúbal<BR/>Portugal, Lisboa, Lisboa","Artigo 20.º, n.º 1, alínea b) do Código dos Contratos Públicos",,,,,,Não aplicável.,Não aplicável.,FALSE
Aquisição de material de vidro e porcelana para o INSA,Concurso público,Aquisição de bens móveis,"33793000-5, Artigos de vidro para laboratório","Instituto Nacional de Saúde Dr. Ricardo Jorge, I. P. (501427511)","Reagentes 5, Lda (501194053)","869,50 €",03-11-2015,21-05-2015,90 dias,"Portugal, Porto, Porto<BR/>Portugal, Setúbal, Setúbal<BR/>Portugal, Lisboa, Lisboa","Artigo 20.º, n.º 1, alínea b) do Código dos Contratos Públicos",,,,,,Não aplicável.,Não aplicável.,FALSE
Aquisição de consumíveis de informática para o INSA,Ajuste Direto Regime Geral,Aquisição de bens móveis,"22900000-9, Material impresso diverso","Instituto Nacional de Saúde Doutor Ricardo Jorge, I. P. (501427511)","Fluir - Consumíveis e equipamento informático, Lda  (506212424)","4.052,70 €",03-11-2015,30-03-2015,90 dias,"Portugal, Lisboa, Lisboa","Artigo 20.º, n.º 1, alínea a) do Código dos Contratos Públicos",,,,,,Não aplicável.,Não aplicável.,FALSE
Aquisição de serviços de manutenção/ assistência técnica ao microscópio electrónico no INSA,Ajuste Direto Regime Geral,Aquisição de serviços,"50800000-3, Serviços de reparação e manutenção diversos","Instituto Nacional de Saúde Doutor Ricardo Jorge, I. P. (501427511)",FEI Europe BV (W0032378B),"2.650,00 €",02-11-2015,19-08-2015,90 dias,"Portugal, Lisboa, Lisboa","Artigo 24.º, n.º 1, alínea e) do Código dos Contratos Públicos",,,,,,Não aplicável.,Não aplicável.,FALSE
Aquisição de reagentes para o INSA,Ajuste Direto Regime Geral,Aquisição de bens móveis,"33140000-3, Material médico de consumo","Instituto Nacional de Saúde Doutor Ricardo Jorge, I. P. (501427511)","Tebu-bio, Lda (509036171)","1.732,00 €",02-11-2015,29-10-2015,90 dias,"Portugal, Lisboa, Lisboa","Artigo 20.º, n.º 1, alínea a) do Código dos Contratos Públicos",,,,,,Não aplicável.,Não aplicável.,FALSE
Aquisição de detergente de laboratório RBS 50 para o INSA Lisboa,Ajuste Direto Regime Geral,Aquisição de bens móveis,"39830000-9, Produtos de limpeza","Instituto Nacional de Saúde Doutor Ricardo Jorge, I. P. (501427511)","Clinifar produtos clínicos farmacêuticos, SA (503281115)","4.440,00 €",02-11-2015,30-10-2015,90 dias,"Portugal, Lisboa, Lisboa","Artigo 20.º, n.º 1, alínea a) do Código dos Contratos Públicos",,,,,,Não aplicável.,Não aplicável.,FALSE
