Objeto do Contrato,Tipo de Procedimento,Tipo(s) de Contrato,CPVs,Entidade(s) Adjudicante(s),Entidade(s) Adjudicatária(s),Preço Contratual,Data de Publicação,Data de Celebração do Contrato,Prazo de Execução,Local de Execução,Fundamentação,Data de Fecho do Contrato,Preço Total Efetivo,Causas das Alterações ao Prazo,Causas das Alterações ao Preço,Estado,N.º registo do Acordo Quadro,Descrição do Acordo Quadro,Procedimento Centralizado
Material Deformidades da Coluna(Req. 366),Ajuste Direto Regime Geral,Aquisição de bens móveis,"33000000-0, Equipamento médico, medicamentos e produtos para cuidados pessoais","Centro Hospitalar e Universitário de Coimbra, E. P. E. (510103448)",ACUNA Y FOMBONA (980095891),"20.928,00 €",30-04-2014,11-04-2014,30 dias,"Portugal, Coimbra, Coimbra","Artigo 24.º, n.º 1, alínea e) do Código dos Contratos Públicos",30-04-2014,"20.928,00 €",,,,Não aplicável.,Não aplicável.,FALSE
Reagentes Autoimunidade - testes automatizados,Ajuste Direto Regime Geral,Aquisição de bens móveis,"33000000-0, Equipamento médico, medicamentos e produtos para cuidados pessoais","Centro Hospitalar e Universitário de Coimbra, E. P. E. (510103448)","Izasa Portugal - Distribuições Técnicas, Lda (501086110)","70.067,20 €",30-04-2014,28-01-2014,365 dias,"Portugal, Coimbra, Coimbra","Artigo 26.º, n.º 1, alínea a) do Código dos Contratos Públicos",31-12-2014,"70.067,20 €",,,,Não aplicável.,Não aplicável.,FALSE
Reagentes Gasimetria - Serviço Urgência - Hospital Geral,Ajuste Direto Regime Geral,Aquisição de bens móveis,"33000000-0, Equipamento médico, medicamentos e produtos para cuidados pessoais","Centro Hospitalar e Universitário de Coimbra, E. P. E. (510103448)","Izasa Portugal - Distribuições Técnicas, Lda (501086110)","23.922,00 €",29-04-2014,31-01-2014,365 dias,"Portugal, Coimbra, Coimbra","Artigo 26.º, n.º 1, alínea a) do Código dos Contratos Públicos",31-12-2014,"23.922,00 €",,,,Não aplicável.,Não aplicável.,FALSE
Reagentes Gasimetria para Unidade Cuidados Intensivos - Hospital Geral,Ajuste Direto Regime Geral,Aquisição de bens móveis,"33000000-0, Equipamento médico, medicamentos e produtos para cuidados pessoais","Centro Hospitalar e Universitário de Coimbra, E. P. E. (510103448)","Siemens Healthcare Diagnóstics, Unipessoal, Lda (507925173)","47.956,40 €",29-04-2014,27-01-2014,365 dias,"Portugal, Coimbra, Coimbra","Artigo 26.º, n.º 1, alínea a) do Código dos Contratos Públicos",31-12-2014,"47.956,40 €",,,,Não aplicável.,Não aplicável.,FALSE
Reagentes para o Serviço de Cardiologia - Laboratório de Hemodinâmica -Hospital Geral,Ajuste Direto Regime Geral,Aquisição de bens móveis,"33000000-0, Equipamento médico, medicamentos e produtos para cuidados pessoais","Centro Hospitalar e Universitário de Coimbra, E. P. E. (510103448)","Magnamed Comercialização Produtos Médicos, Lda (503640476)","2.913,95 €",29-04-2014,07-01-2014,365 dias,"Portugal, Coimbra, Coimbra","Artigo 26.º, n.º 1, alínea a) do Código dos Contratos Públicos",31-12-2014,"2.913,95 €",,,,Não aplicável.,Não aplicável.,FALSE
Envelope Modelo 203 (Tyvek),Ajuste Direto Regime Geral,Aquisição de bens móveis,"30000000-9, Máquinas, equipamento e material de escritório e de informática, excepto mobiliário e pacotes de programas (software)","Centro Hospitalar e Universitário de Coimbra, E. P. E. (510103448)","AMBITRADE COMERCIO E SERVIÇOS, SA (503016101)","24.302,40 €",29-04-2014,08-04-2014,240 dias,"Portugal, Coimbra, Coimbra","Artigo 24.º, n.º 1, alínea e) do Código dos Contratos Públicos","","",,,,Não aplicável.,Não aplicável.,FALSE
Detergentes,Ajuste Direto Regime Geral,Aquisição de bens móveis,"39831200-8, Detergentes","Centro Hospitalar e Universitário de Coimbra, E. P. E. (510103448)","HIGIGUIMA - REPRESENTAÇÕES, SOC. UNIPESSOAL, LDA (505786516)","1.776,00 €",29-04-2014,07-04-2014,240 dias,"Portugal, Coimbra, Coimbra","Artigo 20.º, n.º 1, alínea a) do Código dos Contratos Públicos","","",,,,Não aplicável.,Não aplicável.,FALSE
Aquisição de uma Centrífuga Refrigerada de Bancada,Ajuste Direto Regime Geral,Aquisição de bens móveis,"33000000-0, Equipamento médico, medicamentos e produtos para cuidados pessoais","Centro Hospitalar e Universitário de Coimbra, E. P. E. (510103448)","Izasa Portugal, Lda. (501086110)","6.940,86 €",24-04-2014,24-04-2014,21 dias,"Portugal, Coimbra, Coimbra","Artigo 20.º, n.º 1, alínea a) do Código dos Contratos Públicos","","",,,,Não aplicável.,Não aplicável.,FALSE
"Manutenção dos sistemas PICIS-HG e PACS-HUC, 2014. ",Ajuste Direto Regime Geral,Aquisição de serviços,"72000000-5, Serviços de TI: consultoria, desenvolvimento de software, Internet e apoio","Centro Hospitalar e Universitário de Coimbra, E. P. E. (510103448)","Siemens, SA (500247480)","137.250,41 €",23-04-2014,01-04-2014,365 dias,"Portugal, Coimbra, Coimbra","Artigo 24.º, n.º 1, alínea e) do Código dos Contratos Públicos","","",,,,Não aplicável.,Não aplicável.,FALSE
Manutenção e suporte da infraestrutura servidores e storage do CHUC(jan-mar),Ajuste Direto Regime Geral,Aquisição de serviços,"72000000-5, Serviços de TI: consultoria, desenvolvimento de software, Internet e apoio","Centro Hospitalar e Universitário de Coimbra, E. P. E. (510103448)",Hewlett Packard Portugal (502407697),"4.230,40 €",23-04-2014,17-03-2014,90 dias,"Portugal, Coimbra, Coimbra","Artigo 24.º, n.º 1, alínea e) do Código dos Contratos Públicos","","",,,,Não aplicável.,Não aplicável.,FALSE
Manutenção e suporte da infraestrutura servidores e storage do CHUC(abr-dez),Ajuste Direto Regime Geral,Aquisição de serviços,"72000000-5, Serviços de TI: consultoria, desenvolvimento de software, Internet e apoio","Centro Hospitalar e Universitário de Coimbra, E. P. E. (510103448)",Hewlett Packard Portugal (502407697),"25.396,15 €",23-04-2014,17-03-2014,275 dias,"Portugal, Coimbra, Coimbra","Artigo 24.º, n.º 1, alínea e) do Código dos Contratos Públicos","","",,,,Não aplicável.,Não aplicável.,FALSE
Monitor desfibrilhador para os Cuidados Intensivos,Ajuste Direto Regime Geral,Aquisição de bens móveis,"33000000-0, Equipamento médico, medicamentos e produtos para cuidados pessoais","Centro Hospitalar e Universitário de Coimbra, E. P. E. (510103448)","Remeditec, S.A. (505086344)","7.541,55 €",22-04-2014,22-04-2014,45 dias,"Portugal, Coimbra, Coimbra","Artigo 20.º, n.º 1, alínea a) do Código dos Contratos Públicos","","",,,,Não aplicável.,Não aplicável.,FALSE
Aquisição de uma Incubadora Neonatal,Ajuste Direto Regime Geral,Aquisição de bens móveis,"33000000-0, Equipamento médico, medicamentos e produtos para cuidados pessoais","Centro Hospitalar e Universitário de Coimbra, E. P. E. (510103448)","IBERDATA EQUIPAMENTOS, LDA (501904921)","13.750,00 €",22-04-2014,07-01-2014,30 dias,"Portugal, Coimbra, Coimbra","Artigo 20.º, n.º 1, alínea a) do Código dos Contratos Públicos","","",,,,Não aplicável.,Não aplicável.,FALSE
Aquisição de diverso material informática-diversos serviços,Ajuste Direto Regime Geral,Aquisição de bens móveis,"30000000-9, Máquinas, equipamento e material de escritório e de informática, excepto mobiliário e pacotes de programas (software)","Centro Hospitalar e Universitário de Coimbra, E. P. E. (510103448)",logidoc (503154750),"375,15 €",22-04-2014,17-04-2014,15 dias,"Portugal, Coimbra, Coimbra","Artigo 20.º, n.º 1, alínea a) do Código dos Contratos Públicos","","",,,,Não aplicável.,Não aplicável.,FALSE
LIDOCAÍNA 100 MG/ML SOL PULV BUCAL FR 50 ML,Ajuste Direto Regime Geral,Aquisição de bens móveis,"33698000-9, Produtos para fins clínicos","Centro Hospitalar e Universitário de Coimbra, E.P. (510103448)",LABORATORIOS INIBSA SA (500139571),"844,90 €",22-04-2014,11-11-2013,365 dias,"Portugal, Coimbra, Coimbra","Artigo 24.º, n.º 1, alínea e) do Código dos Contratos Públicos",31-12-2014,"844,90 €",,,,Não aplicável.,Não aplicável.,FALSE
Aquisição de diverso material informática-diversos serviços,Ajuste Direto Regime Geral,Aquisição de bens móveis,"30000000-9, Máquinas, equipamento e material de escritório e de informática, excepto mobiliário e pacotes de programas (software)","Centro Hospitalar e Universitário de Coimbra, E. P. E. (510103448)","NORMATICA-SERVIÇOS INFORMÁTICA E ORGANIZAÇÃO, LDA (501782230)","207,71 €",22-04-2014,17-04-2014,15 dias,"Portugal, Coimbra, Coimbra","Artigo 20.º, n.º 1, alínea a) do Código dos Contratos Públicos","","",,,,Não aplicável.,Não aplicável.,FALSE
ZONISAMIDA,Ajuste Direto Regime Geral,Aquisição de bens móveis,"33698000-9, Produtos para fins clínicos","Centro Hospitalar e Universitário de Coimbra, E. P. E. (510103448)",EISAI FARMACEUTICA UNIPESSOAL LDA (507847660),"1.343,68 €",22-04-2014,18-12-2013,365 dias,"Portugal, Coimbra, Coimbra","Artigo 24.º, n.º 1, alínea e) do Código dos Contratos Públicos",31-12-2014,"1.343,68 €",,,,Não aplicável.,Não aplicável.,FALSE
Aquisição de diverso material informático- Diversos serviços,Ajuste Direto Regime Geral,Aquisição de bens móveis,"30000000-9, Máquinas, equipamento e material de escritório e de informática, excepto mobiliário e pacotes de programas (software)","Centro Hospitalar e Universitário de Coimbra, E. P. E. (510103448)","ITEN SOLUTIONS - SISTEMAS DE INFORMAÇÃO, S.A. (510728189)","1.705,27 €",22-04-2014,17-04-2014,15 dias,"Portugal, Coimbra, Coimbra","Artigo 20.º, n.º 1, alínea a) do Código dos Contratos Públicos","","",,,,Não aplicável.,Não aplicável.,FALSE
Aquisição de diverso material informático- diversos serviços,Ajuste Direto Regime Geral,Aquisição de bens móveis,"30000000-9, Máquinas, equipamento e material de escritório e de informática, excepto mobiliário e pacotes de programas (software)","Centro Hospitalar e Universitário de Coimbra, E. P. E. (510103448)",ITEN SOLUTIONS (510728189),"2.380,00 €",22-04-2014,21-04-2014,15 dias,"Portugal, Coimbra, Coimbra","Artigo 20.º, n.º 1, alínea a) do Código dos Contratos Públicos","","",,,,Não aplicável.,Não aplicável.,FALSE
IOXITALAMATO MEGLUMINA 650.9MG/ML+IOXITALAMATO SÓDIO 96.6MG/ML SOLINJ FR 50ML IV,Ajuste Direto Regime Geral,Aquisição de bens móveis,"33698000-9, Produtos para fins clínicos","Centro Hospitalar e Universitário de Coimbra, E.P. (510103448)",A. MARTINS &FERNANDES (501172114),"614,50 €",22-04-2014,13-11-2013,365 dias,"Portugal, Coimbra, Coimbra","Artigo 24.º, n.º 1, alínea e) do Código dos Contratos Públicos",31-12-2014,"614,50 €",,,,Não aplicável.,Não aplicável.,FALSE
Centela 10mg/g pom bisn 30g,Ajuste Direto Regime Geral,Aquisição de bens móveis,"33698000-9, Produtos para fins clínicos","Centro Hospitalar e Universitário de Coimbra, E. P. E. (510103448)",Confar - Consorcio Farmaceutico Lda (500070229),"855,60 €",21-04-2014,28-11-2013,365 dias,"Portugal, Coimbra, Coimbra","Artigo 24.º, n.º 1, alínea e) do Código dos Contratos Públicos",31-12-2014,"855,60 €",,,,Não aplicável.,Não aplicável.,FALSE
Parafina Liquida 144.275ml sol oral fr 145ml,Ajuste Direto Regime Geral,Aquisição de bens móveis,"33698000-9, Produtos para fins clínicos","Centro Hospitalar e Universitário de Coimbra, E. P. E. (510103448)",Confar - Consorcio Farmaceutico Lda (500070229),"808,30 €",21-04-2014,26-11-2013,365 dias,"Portugal, Coimbra, Coimbra","Artigo 24.º, n.º 1, alínea e) do Código dos Contratos Públicos",31-12-2014,"808,30 €",,,,Não aplicável.,Não aplicável.,FALSE
Nitrofurantoina 100mg caps,Ajuste Direto Regime Geral,Aquisição de bens móveis,"33698000-9, Produtos para fins clínicos","Centro Hospitalar e Universitário de Coimbra, E. P. E. (510103448)","Dilofar, Distribuição Transportes e Logistica Lda (500563004)","808,30 €",21-04-2014,28-11-2013,365 dias,"Portugal, Coimbra, Coimbra","Artigo 24.º, n.º 1, alínea e) do Código dos Contratos Públicos",31-12-2014,"808,30 €",,,,Não aplicável.,Não aplicável.,FALSE
Piracetam 6g/30ml sol inj fr 30ml IV,Ajuste Direto Regime Geral,Aquisição de bens móveis,"33698000-9, Produtos para fins clínicos","Centro Hospitalar e Universitário de Coimbra, E. P. E. (510103448)",Labesfal Laboratorios Almiro SA (501169580),"633,75 €",21-04-2014,26-11-2013,365 dias,"Portugal, Coimbra, Coimbra","Artigo 24.º, n.º 1, alínea e) do Código dos Contratos Públicos",31-12-2014,"633,75 €",,,,Não aplicável.,Não aplicável.,FALSE
diosmina 450mg comp,Ajuste Direto Regime Geral,Aquisição de bens móveis,"33698000-9, Produtos para fins clínicos","Centro Hospitalar e Universitário de Coimbra, E. P. E. (510103448)",Decomed Farmaceutica Lda (503099660),"1.281,97 €",21-04-2014,02-01-2014,365 dias,"Portugal<BR/>Portugal, Coimbra, Coimbra","Artigo 24.º, n.º 1, alínea e) do Código dos Contratos Públicos","","",,,,Não aplicável.,Não aplicável.,FALSE
SACCHAROMYCES BOULARDII 250MG CAPS,Ajuste Direto Regime Geral,Aquisição de bens móveis,"33698000-9, Produtos para fins clínicos","Centro Hospitalar e Universitário de Coimbra, E. P. E. (510103448)",merck sa (500650870),"1.048,32 €",21-04-2014,14-01-2014,365 dias,"Portugal, Coimbra, Coimbra","Artigo 24.º, n.º 1, alínea e) do Código dos Contratos Públicos",31-12-2014,"1.048,32 €",,,,Não aplicável.,Não aplicável.,FALSE
FENTANILO 100UGCOMP SUBLING,Ajuste Direto Regime Geral,Aquisição de bens móveis,"33698000-9, Produtos para fins clínicos","Centro Hospitalar e Universitário de Coimbra, E. P. E. (510103448)",LABORATORIO VITORIA SA (500162220),"3.465,60 €",21-04-2014,11-11-2013,365 dias,"Portugal, Coimbra, Coimbra","Artigo 24.º, n.º 1, alínea e) do Código dos Contratos Públicos",31-12-2014,"3.465,60 €",,,,Não aplicável.,Não aplicável.,FALSE
SACCHAROMYCES BOULARDII 250MG PÓ SUSP ORAL SAQ,Ajuste Direto Regime Geral,Aquisição de bens móveis,"33698000-9, Produtos para fins clínicos","Centro Hospitalar e Universitário de Coimbra, E. P. E. (510103448)",MERCK SA (500650870),"1.035,50 €",21-04-2014,14-01-2014,365 dias,"Portugal, Coimbra, Coimbra","Artigo 24.º, n.º 1, alínea e) do Código dos Contratos Públicos",31-12-2014,"1.035,50 €",,,,Não aplicável.,Não aplicável.,FALSE
QUININA 300MG COMP,Ajuste Direto Regime Geral,Aquisição de bens móveis,"33698000-9, Produtos para fins clínicos","Centro Hospitalar e Universitário de Coimbra, E. P. E. (510103448)",LABESFAL - LABORATORIOS ALMIRO SA (501169580),"1.331,00 €",21-04-2014,26-11-2013,365 dias,"Portugal, Coimbra, Coimbra","Artigo 24.º, n.º 1, alínea e) do Código dos Contratos Públicos",31-12-2014,"1.331,00 €",,,,Não aplicável.,Não aplicável.,FALSE
"PREDNISOLONA, NEOMICINA E SULFACETAMINA POMADA OFT. BISN 3,5G",Ajuste Direto Regime Geral,Aquisição de bens móveis,"33698000-9, Produtos para fins clínicos","Centro Hospitalar e Universitário de Coimbra, E. P. E. (510103448)",LABORATORIOS EDOL - PRODUTOS FARMACEUTICOS SA (507072642),"1.053,50 €",21-04-2014,28-11-2013,365 dias,"Portugal, Coimbra, Coimbra","Artigo 24.º, n.º 1, alínea e) do Código dos Contratos Públicos",31-12-2014,"1.053,50 €",,,,Não aplicável.,Não aplicável.,FALSE
CLONIXINA 300MG CAPS,Ajuste Direto Regime Geral,Aquisição de bens móveis,"33698000-9, Produtos para fins clínicos","Centro Hospitalar e Universitário de Coimbra, E.P. (510103448)",LUSOMEDICAMENTA - SOCIEDADE TECNICA  FARMACEUTICA SA (507150473),"901,28 €",21-04-2014,11-11-2013,365 dias,"Portugal, Coimbra, Coimbra","Artigo 24.º, n.º 1, alínea e) do Código dos Contratos Públicos",31-12-2014,"901,28 €",,,,Não aplicável.,Não aplicável.,FALSE
Cal Sodada tipo (Datex Ohmed) - embal.,Ajuste Direto Regime Geral,Aquisição de bens móveis,"33698000-9, Produtos para fins clínicos","Centro Hospitalar e Universitário de Coimbra, E. P. E. (510103448)",Iberdata Equipamentos SA (501904921),"804,00 €",21-04-2014,26-11-2013,365 dias,"Portugal, Coimbra, Coimbra","Artigo 24.º, n.º 1, alínea e) do Código dos Contratos Públicos",31-12-2014,"804,00 €",,,,Não aplicável.,Não aplicável.,FALSE
Piridoxina 150mg/ml sol inj fr 2ml IM IV,Ajuste Direto Regime Geral,Aquisição de bens móveis,"33698000-9, Produtos para fins clínicos","Centro Hospitalar e Universitário de Coimbra, E. P. E. (510103448)",Labesfal - Laboratorios Almiro SA (501169580),"1.598,48 €",21-04-2014,26-11-2013,365 dias,"Portugal, Coimbra, Coimbra","Artigo 24.º, n.º 1, alínea e) do Código dos Contratos Públicos",31-12-2014,"1.598,48 €",,,,Não aplicável.,Não aplicável.,FALSE
IFOSFAMIDA 1000MG PÓ SOL INJ FR IV,Ajuste Direto Regime Geral,Aquisição de bens móveis,"33698000-9, Produtos para fins clínicos","Centro Hospitalar e Universitário de Coimbra, E.P. (510103448)",BAXTER MEDICO FARMACEUTICO LDA (503347345),"1.096,50 €",21-04-2014,13-11-2013,365 dias,"Portugal, Coimbra, Coimbra","Artigo 24.º, n.º 1, alínea e) do Código dos Contratos Públicos",31-12-2014,"1.096,50 €",,,,Não aplicável.,Não aplicável.,FALSE
Hidroxizinas,Ajuste Direto Regime Geral,Aquisição de bens móveis,"33698000-9, Produtos para fins clínicos","Centro Hospitalar e Universitário de Coimbra, E. P. E. (510103448)",UCB Pharma Lda (500291322),"2.337,24 €",21-04-2014,13-11-2013,365 dias,"Portugal, Coimbra, Coimbra","Artigo 24.º, n.º 1, alínea e) do Código dos Contratos Públicos",31-12-2014,"2.337,24 €",,,,Não aplicável.,Não aplicável.,FALSE
Esteres de Acidos gordos iodados 480mg/ml sol inj fr 10ml ILinfátivoIV,Ajuste Direto Regime Geral,Aquisição de bens móveis,"33690000-3, Medicamentos vários","Centro Hospitalar e Universitário de Coimbra, E. P. E. (510103448)",A. Martins & Fernandes SA (501172114),"1.935,00 €",21-04-2014,18-04-2014,365 dias,"Portugal, Coimbra, Coimbra","Artigo 24.º, n.º 1, alínea e) do Código dos Contratos Públicos",31-12-2014,"1.935,00 €",,,,Não aplicável.,Não aplicável.,FALSE
"Aquisição de serviços para manutenção das aplicações de assiduidade do CHUC, EPE, 2014",Ajuste Direto Regime Geral,Aquisição de serviços,"72000000-5, Serviços de TI: consultoria, desenvolvimento de software, Internet e apoio","Centro Hospitalar e Universitário de Coimbra, E. P. E. (510103448)",AdvancingTO (506002144),"80.845,00 €",21-04-2014,08-04-2014,305 dias,"Portugal, Coimbra, Coimbra","Artigo 24.º, n.º 1, alínea e) do Código dos Contratos Públicos","","",,,,Não aplicável.,Não aplicável.,FALSE
Glucose 50mg/ml sol inj fr 25/500ml IV,Ajuste Direto Regime Geral,Aquisição de bens móveis,"33698000-9, Produtos para fins clínicos","Centro Hospitalar e Universitário de Coimbra, E. P. E. (510103448)",Labesfal - Laboratorios Almiro SA (501169580),"1.379,40 €",21-04-2014,26-11-2013,365 dias,"Portugal, Coimbra, Coimbra","Artigo 24.º, n.º 1, alínea e) do Código dos Contratos Públicos",31-12-2014,"1.379,40 €",,,,Não aplicável.,Não aplicável.,FALSE
Medicamentos Exclusivos,Ajuste Direto Regime Geral,Aquisição de bens móveis,"33698000-9, Produtos para fins clínicos","Centro Hospitalar e Universitário de Coimbra, E.P. (510103448)",Bomi Portugal - Operador Logistico Farmaceutico Lda (504736655),"2.696,96 €",21-04-2014,18-12-2013,365 dias,"Portugal, Coimbra, Coimbra","Artigo 24.º, n.º 1, alínea e) do Código dos Contratos Públicos",31-12-2014,"2.696,96 €",,,,Não aplicável.,Não aplicável.,FALSE
