Objeto do Contrato,Tipo de Procedimento,Tipo(s) de Contrato,CPVs,Entidade(s) Adjudicante(s),Entidade(s) Adjudicatária(s),Preço Contratual,Data de Publicação,Data de Celebração do Contrato,Prazo de Execução,Local de Execução,Fundamentação,Data de Fecho do Contrato,Preço Total Efetivo,Causas das Alterações ao Prazo,Causas das Alterações ao Preço,Estado,N.º registo do Acordo Quadro,Descrição do Acordo Quadro,Procedimento Centralizado
4S0020/2017 Serviços Médicos - MCDT de Obstetrícia para o ano 2017,Ajuste Direto Regime Geral,Aquisição de serviços,"85000000-9, Serviços de saúde e acção social","Centro Hospitalar Barreiro Montijo, E. P. E. (509186998)",FETUS VITAE - SERVIÇOS MEDICOS LDA (505896702),"21.727,50 €",20-06-2017,21-02-2017,365 dias,"Portugal, Setúbal, Barreiro","Artigo 20.º, n.º 1, alínea a) do Código dos Contratos Públicos",30-06-2017,"9.170,00 €",,Contrato rescindido em Junho,,Não aplicável.,Não aplicável.,FALSE
4S0030/2016 MCDT - ECOS OBSTETRICAS E GINECOLGICAS,Ajuste Direto Regime Geral,Aquisição de serviços,"85141000-9, Serviços prestados pelo pessoal médico","Centro Hospitalar Barreiro Montijo, E. P. E. (509186998)",FETUS VITAE - SERVIÇOS MEDICOS LDA (505896702),"32.340,00 €",07-11-2016,02-02-2016,366 dias,"Portugal, Setúbal, Barreiro","Artigo 20.º, n.º 1, alínea a) do Código dos Contratos Públicos",31-12-2016,"20.904,50 €",,Consumo efetivo inferior ao inicialmente estimado,,Não aplicável.,Não aplicável.,FALSE
Aquisição de Prestação de Serviços Médicos,Ajuste Direto Regime Geral,Aquisição de serviços,"85111300-3, Serviços hospitalares de ginecologia","Hospital do Espírito Santo de Évora, E. P. E. (508085888)",FETUS VITAE - SERVIÇOS MEDICOS LDA (505896702),"47.560,00 €",20-10-2015,15-05-2015,150 dias,"Portugal, Évora, Évora","Artigo 20.º, n.º 1, alínea a) do Código dos Contratos Públicos","","",,"",,Não aplicável.,Não aplicável.,FALSE
