Objeto do Contrato,Tipo de Procedimento,Tipo(s) de Contrato,CPVs,Entidade(s) Adjudicante(s),Entidade(s) Adjudicatária(s),Preço Contratual,Data de Publicação,Data de Celebração do Contrato,Prazo de Execução,Local de Execução,Fundamentação,Data de Fecho do Contrato,Preço Total Efetivo,Causas das Alterações ao Prazo,Causas das Alterações ao Preço,Estado,N.º registo do Acordo Quadro,Descrição do Acordo Quadro,Procedimento Centralizado
Aquisição de serviços de desenvolvimento de vídeos promocionais,Ajuste Direto Regime Geral,Aquisição de serviços,"72232000-0, Desenvolvimento de software de processamento de transacções e de software à medida","SPMS - Serviços Partilhados do Ministério da Saúde, E. P. E. (509540716)","We Mean Business, Lda. (510480454)","14.400,00 €",07-01-2015,30-12-2014,365 dias,Portugal,"Artigo 20.º, n.º 1, alínea a) do Código dos Contratos Públicos","","",,,,Não aplicável.,Não aplicável.,FALSE
Trabalhos de reabilitação da copa no 9.º piso - AR61,Ajuste Direto Regime Geral,Empreitadas de obras públicas,"45262700-8, Obras de transformação de edifícios","SPMS - Serviços Partilhados do Ministério da Saúde, E. P. E. (509540716)","Paulo Manuel Silva Abreu, Lda. (502574593)","59.936,00 €",07-01-2015,23-12-2014,30 dias,"Portugal, Lisboa, Lisboa","Artigo 19.º, alínea a) do Código dos Contratos Públicos","","",,,,Não aplicável.,Não aplicável.,FALSE
Execução de trabalhos de compartimentação com divisórias em vidro e estrutura de inox escovado e outros trabalhos de conservação de edifícios,Ajuste Direto Regime Geral,Empreitadas de obras públicas,"45441000-0, Colocação de vidros","SPMS - Serviços Partilhados do Ministério da Saúde, E. P. E. (509540716)","Always Layered, Lda. (510795765)","19.950,00 €",07-01-2015,07-10-2014,30 dias,"Portugal, Lisboa, Lisboa","Artigo 19.º, alínea a) do Código dos Contratos Públicos","","",,,,Não aplicável.,Não aplicável.,FALSE
Aquisição de substituição da cobertura do edifício do Porto,Ajuste Direto Regime Geral,Empreitadas de obras públicas,"45261210-9, Cobertura de telhados","SPMS - Serviços Partilhados do Ministério da Saúde, E. P. E. (509540716)","Imotools, Lda. (506268241)","139.074,65 €",06-01-2015,30-12-2014,30 dias,"Portugal, Porto, Porto","Artigo 19.º, alínea a) do Código dos Contratos Públicos","","",,,,Não aplicável.,Não aplicável.,FALSE
"Aquisição de equipamentos de ar condicionado para o edifício da SPMS, sito no Porto",Ajuste Direto Regime Geral,Aquisição de bens móveis,"39717200-3, Aparelhos de ar condicionado","SPMS - Serviços Partilhados do Ministério da Saúde, E. P. E. (509540716)","Ventilarco - Instalações Técnicas Especiais, S. A. (507950690)","73.980,99 €",06-01-2015,30-12-2014,30 dias,"Portugal, Porto, Porto","Artigo 20.º, n.º 1, alínea a) do Código dos Contratos Públicos",31-12-2015,"47.337,43 €",,,,Não aplicável.,Não aplicável.,FALSE
"Aquisição de trabalhos de execução, fornecimento e montagem de cobertura sobre o terraço do Datacenter de Lisboa",Ajuste Direto Regime Geral,Empreitadas de obras públicas,"45261213-0, Colocação de coberturas metálicas","SPMS - Serviços Partilhados do Ministério da Saúde, E. P. E. (509540716)","Imotools, Lda. (506268241)","38.799,26 €",06-01-2015,30-12-2014,30 dias,"Portugal, Lisboa, Lisboa","Artigo 19.º, alínea a) do Código dos Contratos Públicos","","",,,,Não aplicável.,Não aplicável.,FALSE
Aquisição de Scanner,Ajuste Direto Regime Geral,Aquisição de bens móveis,"30236200-4, Equipamento para processamento de dados","SPMS- Serviços Partilhados do M. da Saúde, E.P.E. (509540716)","EDNI - Empresa Distrubuidora de material Informático, Lda. (503258121)","2.492,28 €",31-12-2014,12-12-2014,1095 dias,"Portugal, Lisboa, Lisboa","Artigo 20.º, n.º 1, alínea a) do Código dos Contratos Públicos",31-12-2014,"2.492,28 €",,,,Não aplicável.,Não aplicável.,FALSE
Aquisição de serviços de assessment á política de segurança de informação,Ajuste Direto Regime Geral,Aquisição de serviços,"72910000-2, Serviços informáticos de segurança","SPMS - Serviços Partilhados do Ministério da Saúde, E. P. E. (509540716)","NovaBase Business Solutions, Soluções de Consultoria, Desenvolvimento, Integração, Outsourcing, Manutenção e Operações de Sistemas de Informação, S. A. (504857312)","74.800,00 €",31-12-2014,22-12-2014,52 dias,Portugal,"Artigo 20.º, n.º 1, alínea a) do Código dos Contratos Públicos",28-02-2015,"74.800,00 €",,,,Não aplicável.,Não aplicável.,FALSE
"Aquisição de serviços de manutenção evolutiva e corretiva do sistema de informação e monitorização do SNS, SIM@SNS",Ajuste Direto Regime Geral,Aquisição de serviços,"72212100-0, Serviços de desenvolvimento de software para sectores específicos","SPMS - Serviços Partilhados do Ministério da Saúde, E. P. E. (509540716)","ALTRANPORTUGAL, S. A (504272179)","9.600,00 €",31-12-2014,23-12-2014,67 dias,"Portugal, Porto, Porto","Artigo 20.º, n.º 1, alínea a) do Código dos Contratos Públicos",28-02-2015,"9.600,00 €",,,,Não aplicável.,Não aplicável.,FALSE
