Objeto do Contrato,Tipo de Procedimento,Tipo(s) de Contrato,CPVs,Entidade(s) Adjudicante(s),Entidade(s) Adjudicatária(s),Preço Contratual,Data de Publicação,Data de Celebração do Contrato,Prazo de Execução,Local de Execução,Fundamentação,Data de Fecho do Contrato,Preço Total Efetivo,Causas das Alterações ao Prazo,Causas das Alterações ao Preço,Estado,N.º registo do Acordo Quadro,Descrição do Acordo Quadro,Procedimento Centralizado
AQUISIÇÃO DE CARNE DURANTE O 3º TRIMESTRE,Ajuste Direto Regime Geral,Aquisição de bens móveis,"15000000-8, Produtos alimentares, bebidas, tabaco e produtos afins","Instituto Português de Oncologia de Coimbra Francisco Gentil, E. P. E. (506361438)","INDUBEIRA - INDUSTRIA ALIMENTAR, S.A. (503501875)","11.131,60 €",21-07-2014,24-06-2014,90 dias,"Portugal, Coimbra, Coimbra","Artigo 20.º, n.º 1, alínea a) do Código dos Contratos Públicos",30-09-2014,"7.574,26 €",,Diminuição das necessidades,,Não aplicável.,Não aplicável.,FALSE
AQUISIÇÃO DE CARNE DURANTE O 3º TRIMESTRE,Ajuste Direto Regime Geral,Aquisição de bens móveis,"15000000-8, Produtos alimentares, bebidas, tabaco e produtos afins","Instituto Português de Oncologia de Coimbra Francisco Gentil, E. P. E. (506361438)","GRANDE CONHECEDOR - UNIP., LDA. (508702720)","4.182,00 €",21-07-2014,13-06-2014,90 dias,"Portugal, Coimbra, Coimbra","Artigo 20.º, n.º 1, alínea a) do Código dos Contratos Públicos",30-09-2014,"2.470,73 €",,Diminuição das necessidades,,Não aplicável.,Não aplicável.,FALSE
AQUISIÇÃO DE CARNE DURANTE O 3º TRIMESTRE,Ajuste Direto Regime Geral,Aquisição de bens móveis,"15000000-8, Produtos alimentares, bebidas, tabaco e produtos afins","Instituto Português de Oncologia de Coimbra Francisco Gentil, E. P. E. (506361438)","LUSIAVES - IND. E COM. AVES, LDA. (501667490)","1.707,50 €",21-07-2014,13-06-2014,90 dias,"Portugal, Coimbra, Coimbra","Artigo 20.º, n.º 1, alínea a) do Código dos Contratos Públicos",15-09-2014,"582,18 €",,Diminuição das necessidades,,Não aplicável.,Não aplicável.,FALSE
AQUISIÇÃO DE CARNE DURANTE O 3º TRIMESTRE,Ajuste Direto Regime Geral,Aquisição de bens móveis,"15000000-8, Produtos alimentares, bebidas, tabaco e produtos afins","Instituto Português de Oncologia de Coimbra Francisco Gentil, E. P. E. (506361438)","PAC & BOM - COMERCIO E SERVIÇOS, LDA. (503554049)","1.905,75 €",21-07-2014,13-06-2014,90 dias,"Portugal, Coimbra, Coimbra","Artigo 20.º, n.º 1, alínea a) do Código dos Contratos Públicos",22-09-2014,"1.027,37 €",,Diminuição das necessidades,,Não aplicável.,Não aplicável.,FALSE
AQUISIÇÃO DE PESCADO DURANTE O 3º TRIMESTRE,Ajuste Direto Regime Geral,Aquisição de bens móveis,"15000000-8, Produtos alimentares, bebidas, tabaco e produtos afins","Instituto Português de Oncologia de Coimbra Francisco Gentil, E. P. E. (506361438)","INDUBEIRA - INDUSTRIA ALIMENTAR, S.A. (503501875)","2.560,00 €",21-07-2014,13-06-2014,90 dias,"Portugal, Coimbra, Coimbra","Artigo 20.º, n.º 1, alínea a) do Código dos Contratos Públicos",30-09-2014,"1.355,92 €",,Diminuição das necessidades,,Não aplicável.,Não aplicável.,FALSE
AQUISIÇÃO DE PESCADO DURANTE O 3º TRIMESTRE,Ajuste Direto Regime Geral,Aquisição de bens móveis,"15000000-8, Produtos alimentares, bebidas, tabaco e produtos afins","Instituto Português de Oncologia de Coimbra Francisco Gentil, E. P. E. (506361438)","LITOFISH, LDA (507825470)","6.770,00 €",21-07-2014,13-06-2014,90 dias,"Portugal, Coimbra, Coimbra","Artigo 20.º, n.º 1, alínea a) do Código dos Contratos Públicos",29-09-2014,"5.603,96 €",,Diminuição das necessidades,,Não aplicável.,Não aplicável.,FALSE
AQUISIÇÃO DE PESCADO DURANTE O 3º TRIMESTRE,Ajuste Direto Regime Geral,Aquisição de bens móveis,"15000000-8, Produtos alimentares, bebidas, tabaco e produtos afins","Instituto Português de Oncologia de Coimbra Francisco Gentil, E. P. E. (506361438)","DELTAGEL - PROD. ALIMENTARES, S.A. (505477882)","12.165,00 €",21-07-2014,24-06-2014,90 dias,"Portugal, Coimbra, Coimbra","Artigo 20.º, n.º 1, alínea a) do Código dos Contratos Públicos",30-09-2014,"6.376,18 €",,Diminuição das necessidades,,Não aplicável.,Não aplicável.,FALSE
AQUISIÇÃO DE PESCADO DURANTE O 3º TRIMESTRE,Ajuste Direto Regime Geral,Aquisição de bens móveis,"15000000-8, Produtos alimentares, bebidas, tabaco e produtos afins","Instituto Português de Oncologia de Coimbra Francisco Gentil, E. P. E. (506361438)","FRIJOBEL - INDUSTRIA COM. ALIMENTAR, LDA. (501957855)","506,40 €",21-07-2014,13-06-2014,90 dias,"Portugal, Coimbra, Coimbra","Artigo 20.º, n.º 1, alínea a) do Código dos Contratos Públicos",23-07-2014,"16,30 €",,Diminuição das necessidades,,Não aplicável.,Não aplicável.,FALSE
AQUISIÇÃO DE FRUTA E LEGUMES FRESCOS E CONGELADOS DURANTE O 3º TRIMESTRE,Ajuste Direto Regime Geral,Aquisição de bens móveis,"15000000-8, Produtos alimentares, bebidas, tabaco e produtos afins","Instituto Português de Oncologia de Coimbra Francisco Gentil, E. P. E. (506361438)",FRUTAS DO BISPO (506284204),"3.574,00 €",21-07-2014,13-06-2014,90 dias,"Portugal, Coimbra, Coimbra","Artigo 20.º, n.º 1, alínea a) do Código dos Contratos Públicos",30-09-2014,"1.687,81 €",,Diminuição das necessidades,,Não aplicável.,Não aplicável.,FALSE
AQUISIÇÃO DE FRUTA E LEGUMES FRESCOS E CONGELADOS DURANTE O 3º TRIMESTRE,Ajuste Direto Regime Geral,Aquisição de bens móveis,"15000000-8, Produtos alimentares, bebidas, tabaco e produtos afins","Instituto Português de Oncologia de Coimbra Francisco Gentil, E. P. E. (506361438)",ADRIANO MANUEL VENTURA A. CARVALHO (172405890),"5.682,10 €",21-07-2014,13-06-2014,90 dias,"Portugal, Coimbra, Coimbra","Artigo 20.º, n.º 1, alínea a) do Código dos Contratos Públicos",30-09-2014,"5.030,84 €",,Diminuição das necessidades,,Não aplicável.,Não aplicável.,FALSE
AQUISIÇÃO DE FRUTA E LEGUMES FRESCOS E CONGELADOS DURANTE O 3º TRIMESTRE,Ajuste Direto Regime Geral,Aquisição de bens móveis,"15000000-8, Produtos alimentares, bebidas, tabaco e produtos afins","Instituto Português de Oncologia de Coimbra Francisco Gentil, E. P. E. (506361438)",FERNANDO JORGE DE JESUS POVOA (209909951),"4.875,00 €",21-07-2014,13-06-2014,90 dias,"Portugal, Coimbra, Coimbra","Artigo 20.º, n.º 1, alínea a) do Código dos Contratos Públicos",26-09-2014,"4.089,50 €",,Diminuição das necessidades,,Não aplicável.,Não aplicável.,FALSE
AQUISIÇÃO DE FRUTA E LEGUMES FRESCOS E CONGELADOS DURANTE O 3º TRIMESTRE,Ajuste Direto Regime Geral,Aquisição de bens móveis,"15000000-8, Produtos alimentares, bebidas, tabaco e produtos afins","Instituto Português de Oncologia de Coimbra Francisco Gentil, E. P. E. (506361438)","INDUBEIRA - INDUSTRIA ALIMENTAR, S.A. (503501875)","1.338,70 €",21-07-2014,13-06-2014,90 dias,"Portugal, Coimbra, Coimbra","Artigo 20.º, n.º 1, alínea a) do Código dos Contratos Públicos",26-09-2014,"798,30 €",,Diminuição das necessidades,,Não aplicável.,Não aplicável.,FALSE
AQUISIÇÃO DE FRUTA E LEGUMES FRESCOS E CONGELADOS DURANTE O 3º TRIMESTRE,Ajuste Direto Regime Geral,Aquisição de bens móveis,"15000000-8, Produtos alimentares, bebidas, tabaco e produtos afins","Instituto Português de Oncologia de Coimbra Francisco Gentil, E. P. E. (506361438)","JPP FRUTAS, LDA. - COM.FRUTA.PROD.HORT. (506946916)","3.430,50 €",21-07-2014,13-06-2014,90 dias,"Portugal, Coimbra, Coimbra","Artigo 20.º, n.º 1, alínea a) do Código dos Contratos Públicos",30-09-2014,"2.835,59 €",,Diminuição das necessidades,,Não aplicável.,Não aplicável.,FALSE
AQUISIÇÃO DE FRUTA E LEGUMES FRESCOS E CONGELADOS DURANTE O 3º TRIMESTRE,Ajuste Direto Regime Geral,Aquisição de bens móveis,"15000000-8, Produtos alimentares, bebidas, tabaco e produtos afins","Instituto Português de Oncologia de Coimbra Francisco Gentil, E. P. E. (506361438)","FRUTIBAIRRADA - COM.FRUTAS E LEGUMES, LDA. (504314750)","3.496,00 €",21-07-2014,24-06-2014,90 dias,"Portugal, Coimbra, Coimbra","Artigo 20.º, n.º 1, alínea a) do Código dos Contratos Públicos",30-09-2014,"3.603,94 €",,Necessidade de aumento das quantidades consumidas em virtude do aumento do nº de doentes,,Não aplicável.,Não aplicável.,FALSE
AQUISIÇÃO DE FRUTA E LEGUMES FRESCOS E CONGELADOS DURANTE O 3º TRIMESTRE,Ajuste Direto Regime Geral,Aquisição de bens móveis,"15000000-8, Produtos alimentares, bebidas, tabaco e produtos afins","Instituto Português de Oncologia de Coimbra Francisco Gentil, E. P. E. (506361438)","DELTAGEL - PROD. ALIMENTARES, S.A. (505477882)","3.302,90 €",21-07-2014,24-06-2014,90 dias,"Portugal, Coimbra, Coimbra","Artigo 20.º, n.º 1, alínea a) do Código dos Contratos Públicos",30-09-2014,"1.720,52 €",,Diminuição das necessidades,,Não aplicável.,Não aplicável.,FALSE
AQUISIÇÃO DE FRUTA E LEGUMES FRESCOS E CONGELADOS DURANTE O 3º TRIMESTRE,Ajuste Direto Regime Geral,Aquisição de bens móveis,"15000000-8, Produtos alimentares, bebidas, tabaco e produtos afins","Instituto Português de Oncologia de Coimbra Francisco Gentil, E. P. E. (506361438)",MARIA ISABEL RIBEIRO GASPAR (146220935),"2.537,75 €",21-07-2014,24-06-2014,90 dias,"Portugal, Coimbra, Coimbra","Artigo 20.º, n.º 1, alínea a) do Código dos Contratos Públicos",30-09-2014,"2.633,83 €",,Necessidade de aumento das quantidades consumidas em virtude do aumento do nº de doentes,,Não aplicável.,Não aplicável.,FALSE
