Objeto do Contrato,Tipo de Procedimento,Tipo(s) de Contrato,CPVs,Entidade(s) Adjudicante(s),Entidade(s) Adjudicatária(s),Preço Contratual,Data de Publicação,Data de Celebração do Contrato,Prazo de Execução,Local de Execução,Fundamentação,Data de Fecho do Contrato,Preço Total Efetivo,Causas das Alterações ao Prazo,Causas das Alterações ao Preço,Estado,N.º registo do Acordo Quadro,Descrição do Acordo Quadro,Procedimento Centralizado
"MEIOS P/REALIZ. ANAL.CLINICAS P/ IDENTIF. E TSA, HEMOCULT. E MICOBACTERIAS",Ajuste Direto Regime Geral,Aquisição de bens móveis,"33696500-0, Reagentes de laboratório","Centro Hospitalar Tondela-Viseu, E. P. E. (509822940)","Biomérieux Portugal, Lda (501524177)","6.317,50 €",21-08-2018,09-08-2018,60 dias,"Portugal, Viseu, Viseu","Artigo 26.º, n.º 1, alínea a) do Código dos Contratos Públicos",,,,,,Não aplicável.,Não aplicável.,FALSE
BRENTUXIMAB 50 MG AMP,Ajuste Direto Regime Geral,Aquisição de bens móveis,"33600000-6, Produtos farmacêuticos","Centro Hospitalar Tondela-Viseu, E. P. E. (509822940)",TAKEDA - FARMACÊUTICOS PORTUGAL LDA (502801204),"120.802,40 €",16-08-2018,09-08-2018,90 dias,"Portugal, Viseu, Viseu","Artigo 24.º, n.º 1, alínea e), subalínea iii) do Código dos Contratos Públicos",,,,,,Não aplicável.,Não aplicável.,FALSE
RECERT.SIST.QUALIDADE  C/ TRANS P/ ISO 9001:2015  (FARMÁCIA e UN MED.FETAL),Ajuste Direto Regime Geral,Aquisição de serviços,"79132000-8, Serviços de certificação","Centro Hospitalar Tondela-Viseu, E. P. E. (509822940)","SGS ICS, LDA (504254960)","7.675,32 €",14-08-2018,29-06-2018,1095 dias,"Portugal, Viseu, Viseu","Artigo 20.º, n.º 1, alínea d) do Código dos Contratos Públicos",,,,,,Não aplicável.,Não aplicável.,FALSE
RECERT.SIST.QUAL.C/ TRANS P/ ISO 9001:2015(ANAT.PATOL./PAT.CLIN./S.SANGUE),Ajuste Direto Regime Geral,Aquisição de serviços,"79132000-8, Serviços de certificação","Centro Hospitalar Tondela-Viseu, E. P. E. (509822940)","BUREAU VERITAS CERTIFICATION PORTUGAL, LDA (504330551)","9.078,38 €",14-08-2018,29-06-2018,1095 dias,"Portugal, Viseu, Viseu","Artigo 20.º, n.º 1, alínea d) do Código dos Contratos Públicos",,,,,,Não aplicável.,Não aplicável.,FALSE
MEIOS P/ REAL.ANÁL.CLÍN. DE IMUNOLOGIA (AQ_2R/02671/17)(1),Ajuste Direto Regime Geral,Aquisição de bens móveis,"33696500-0, Reagentes de laboratório","Centro Hospitalar Tondela-Viseu, E. P. E. (509822940)","QUILABAN, SA (500399670)","43.515,80 €",14-08-2018,20-04-2018,365 dias,"Portugal, Viseu, Viseu","Artigo 26.º, n.º 1, alínea e) do Código dos Contratos Públicos",,,,,,Não aplicável.,Não aplicável.,FALSE
MEIOS P/ REALIZ.  ANÁL. CLÍN. BIOLOGIA MOLECULAR (CARGAS VIRAIS)_ (AQ_3R/03172/17)(1),Ajuste Direto Regime Geral,Aquisição de bens móveis,"33696500-0, Reagentes de laboratório","Centro Hospitalar Tondela-Viseu, E. P. E. (509822940)","Roche Sistemas Diagnósticos, Lda (504282921)","94.176,00 €",14-08-2018,23-04-2018,365 dias,"Portugal, Viseu, Viseu","Artigo 26.º, n.º 1, alínea e) do Código dos Contratos Públicos",,,,,,Não aplicável.,Não aplicável.,FALSE
MEIOS P/ REAL.ANÁL.CLÍN. DE AUTOIMUNIDADE (AQ_2R/03187/17)(1),Ajuste Direto Regime Geral,Aquisição de bens móveis,"33696500-0, Reagentes de laboratório","Centro Hospitalar Tondela-Viseu, E. P. E. (509822940)","EUROIMMUN PORTUGAL, UNIP.,LDA (504022180)","15.199,90 €",13-08-2018,20-04-2018,365 dias,"Portugal, Viseu, Viseu","Artigo 26.º, n.º 1, alínea e) do Código dos Contratos Públicos",,,,,,Não aplicável.,Não aplicável.,FALSE
MEIOS P/ REALIZ. ANÁL. CLÍN.CITOMETRIA DE FLUXO_ (AQ_2R/000493/18)(1),Ajuste Direto Regime Geral,Aquisição de bens móveis,"33696500-0, Reagentes de laboratório","Centro Hospitalar Tondela-Viseu, E. P. E. (509822940)","Beckman Coulter Portugal, Unip., Lda (509035167)","22.500,00 €",13-08-2018,09-05-2018,365 dias,"Portugal, Viseu, Viseu","Artigo 26.º, n.º 1, alínea e) do Código dos Contratos Públicos",,,,,,Não aplicável.,Não aplicável.,FALSE
CONTROLOS INTERNOS DE QUALIDADE,Ajuste Direto Regime Geral,Aquisição de bens móveis,"33696500-0, Reagentes de laboratório","Centro Hospitalar Tondela-Viseu, E. P. E. (509822940)"," BIO RAD LABORATORIES, LDA (501301321)","7.902,50 €",13-08-2018,12-07-2018,1 dias,"Portugal, Viseu, Viseu","Artigo 26.º, n.º 1, alínea a) do Código dos Contratos Públicos",,,,,,Não aplicável.,Não aplicável.,FALSE
MEIOS P/ REALIZAÇÃO  ANÁLISES CLÍNICAS DE HEMOGLOBINAS_AQ_2R/01086/2018 (1),Ajuste Direto Regime Geral,Aquisição de bens móveis,"33696500-0, Reagentes de laboratório","Centro Hospitalar Tondela-Viseu, E. P. E. (509822940)","BIO RAD LABORATORIES, LDA (501301321)","9.669,00 €",13-08-2018,03-08-2018,365 dias,"Portugal, Viseu, Viseu","Artigo 26.º, n.º 1, alínea e) do Código dos Contratos Públicos",,,,,,Não aplicável.,Não aplicável.,FALSE
SOLUCAO LAMINA (IRIS),Ajuste Direto Regime Geral,Aquisição de bens móveis,"33696500-0, Reagentes de laboratório","Centro Hospitalar Tondela-Viseu, E. P. E. (509822940)","BECKMAN COULTER PORTUGAL UNIP., LDA (509035167)","8.976,60 €",13-08-2018,03-08-2018,90 dias,"Portugal, Viseu, Viseu","Artigo 26.º, n.º 1, alínea a) do Código dos Contratos Públicos",,,,,,Não aplicável.,Não aplicável.,FALSE
MEIOS P/ REALIZ. ANÁLISES CLÍNICAS DE MICROELISA_AQ_2R/01138/2018 (1),Ajuste Direto Regime Geral,Aquisição de bens móveis,"33696500-0, Reagentes de laboratório","Centro Hospitalar Tondela-Viseu, E. P. E. (509822940)","EUROIMMUN PORTUGAL UNIPESSOAL, LDA (504022180)","9.480,00 €",13-08-2018,03-07-2018,365 dias,"Portugal, Viseu, Viseu","Artigo 26.º, n.º 1, alínea e) do Código dos Contratos Públicos",,,,,,Não aplicável.,Não aplicável.,FALSE
