Objeto do Contrato,Tipo de Procedimento,Tipo(s) de Contrato,CPVs,Entidade(s) Adjudicante(s),Entidade(s) Adjudicatária(s),Preço Contratual,Data de Publicação,Data de Celebração do Contrato,Prazo de Execução,Local de Execução,Fundamentação,Data de Fecho do Contrato,Preço Total Efetivo,Causas das Alterações ao Prazo,Causas das Alterações ao Preço,Estado,N.º registo do Acordo Quadro,Descrição do Acordo Quadro,Procedimento Centralizado
Controlo de acessos,Ajuste Direto Regime Geral,Aquisição de bens móveis,"30200000-1, Equipamento e material informático","Centro Hospitalar do Médio Tejo, E. P. E. (506361608)","Dois BR - Serviços Tecnológicos Profissionais, Lda. (503763110)","19.500,00 €",07-01-2019,26-11-2018,30 dias,Portugal,"Artigo 20.º, n.º 1, alínea d) do Código dos Contratos Públicos",12-12-2018,"19.500,00 €",,0,,Não aplicável.,Não aplicável.,FALSE
Cardiotocógrafo,Ajuste Direto Regime Geral,Aquisição de bens móveis,"33100000-1, Equipamento médico","Centro Hospitalar do Médio Tejo, E.P.E. (CHMT) (506361608)",Sano-Técnica (500239819),"12.990,00 €",07-01-2019,09-10-2018,30 dias,"Portugal, Santarém, Abrantes","Artigo 20.º, n.º 1, alínea d) do Código dos Contratos Públicos",19-12-2018,"12.990,00 €",,0,,Não aplicável.,Não aplicável.,FALSE
