freguesia,acronym,validVotesPercentage,votes,dicofre
Sapataria,PS,36.56,302,111202
Sapataria,PCP-PEV,16.83,139,111202
Sapataria,PPD/PSD,11.86,98,111202
Sapataria,B.E.,10.17,84,111202
Sapataria,PAN,7.99,66,111202
Sapataria,CDS-PP,5.08,42,111202
Sapataria,L,2.78,23,111202
Sapataria,PCTP/MRPP,2.06,17,111202
Sapataria,A,1.82,15,111202
Sapataria,PPM.PPV/CDC,1.82,15,111202
Sapataria,NC,0.85,7,111202
Sapataria,PDR,0.73,6,111202
Sapataria,IL,0.48,4,111202
Sapataria,PNR,0.36,3,111202
Sapataria,PTP,0.24,2,111202
Sapataria,PURP,0.24,2,111202
Sapataria,MAS,0.12,1,111202
