freguesia,acronym,validVotesPercentage,votes,dicofre
Vale de Estrela,PS,46.09,112,090746
Vale de Estrela,PPD/PSD,27.98,68,090746
Vale de Estrela,B.E.,10.7,26,090746
Vale de Estrela,CDS-PP,6.17,15,090746
Vale de Estrela,PAN,2.88,7,090746
Vale de Estrela,PCP-PEV,2.47,6,090746
Vale de Estrela,CH,1.23,3,090746
Vale de Estrela,A,0.82,2,090746
Vale de Estrela,PCTP/MRPP,0.82,2,090746
Vale de Estrela,IL,0.41,1,090746
Vale de Estrela,R.I.R.,0.41,1,090746
Vale de Estrela,L,0,0,090746
Vale de Estrela,MPT,0,0,090746
Vale de Estrela,NC,0,0,090746
Vale de Estrela,PDR,0,0,090746
Vale de Estrela,PNR,0,0,090746
Vale de Estrela,PPM,0,0,090746
Vale de Estrela,PTP,0,0,090746
Vale de Estrela,PURP,0,0,090746
