Objeto do Contrato,Tipo de Procedimento,Tipo(s) de Contrato,CPVs,Entidade(s) Adjudicante(s),Entidade(s) Adjudicatária(s),Preço Contratual,Data de Publicação,Data de Celebração do Contrato,Prazo de Execução,Local de Execução,Fundamentação,Data de Fecho do Contrato,Preço Total Efetivo,Causas das Alterações ao Prazo,Causas das Alterações ao Preço,Estado,N.º registo do Acordo Quadro,Descrição do Acordo Quadro,Procedimento Centralizado
Aquisição de Medicamentos Exclusivos,Ajuste Direto Regime Geral,Aquisição de bens móveis,"33000000-0, Equipamento médico, medicamentos e produtos para cuidados pessoais","Unidade Local de Saúde do Norte Alentejano, E. P. E. (508094461)","Labesfal - Lab. Almiro, SA (501169580)","17.935,00 €",08-01-2016,07-12-2015,365 dias,"Portugal, Portalegre, Elvas<BR/>Portugal, Portalegre, Portalegre","Artigo 24.º, n.º 1, alínea e) do Código dos Contratos Públicos","","",,,,Não aplicável.,Não aplicável.,FALSE
Aquisição de Medicamentos Exclusivos,Ajuste Direto Regime Geral,Aquisição de bens móveis,"33000000-0, Equipamento médico, medicamentos e produtos para cuidados pessoais","Unidade Local de Saúde do Norte Alentejano, E. P. E. (508094461)","Janssen Cilag Farmacêutica, Lda. (500189412)","139.237,38 €",08-01-2016,11-11-2015,365 dias,"Portugal, Portalegre, Elvas<BR/>Portugal, Portalegre, Portalegre","Artigo 24.º, n.º 1, alínea e) do Código dos Contratos Públicos","","",,,,Não aplicável.,Não aplicável.,FALSE
"Prestação de Serviços Médicos na Especialidade de Gastroenterologia na ULSNA, EPE",Ajuste Direto Regime Geral,Aquisição de serviços,"85100000-0, Serviços de saúde","Unidade Local de Saúde do Norte Alentejano, E. P. E. (508094461)",Rogério da Silva Godinho (176874070),"12.886,50 €",07-01-2016,10-12-2015,245 dias,"Portugal, Portalegre, Elvas","Artigo 20.º, n.º 1, alínea a) do Código dos Contratos Públicos",31-12-2015,"12.886,50 €",,,,Não aplicável.,Não aplicável.,FALSE
"Prestação de Serviços de Lavagem, Tratamento e Fornecimento de Roupa e, Regime de Aluguer na ULSNA, EPE",Concurso público,Aquisição de serviços,"98300000-6, Serviços diversos","Unidade Local de Saúde do Norte Alentejano, E. P. E. (508094461)",SUCH - Serviço de Utilização Comum dos Hospitais (500900469),"321.352,28 €",05-01-2016,07-10-2015,366 dias,"Portugal, Portalegre, Portalegre","Artigo 20.º, n.º 1, alínea b) do Código dos Contratos Públicos",05-01-2016,"321.352,28 €",,,,Não aplicável.,Não aplicável.,FALSE
"Prestação de Serviços de Recolha, Acondicionamento, Transporte, Tratamento e Destino Final dos Diversos Tipos de Resíduos produzidos na ULSNA, EPE",Concurso público,Aquisição de serviços,"90524400-0, Recolha, transporte e eliminação de resíduos hospitalares","Unidade Local de Saúde do Norte Alentejano, E. P. E. (508094461)","Ambimed - Gestão Ambiental, Lda. (503593427)","95.868,60 €",05-01-2016,29-09-2015,366 dias,"Portugal, Portalegre, Portalegre","Artigo 20.º, n.º 1, alínea b) do Código dos Contratos Públicos",05-01-2016,"95.868,60 €",,,,Não aplicável.,Não aplicável.,FALSE
"Prestação de Serviços de Vigilância e Segurança e Aquisição de Sistemas de Videovigilância para a ULSNA, EPE",Ajuste Direto Regime Geral,Aquisição de serviços,"79710000-4, Serviços de segurança","Unidade Local de Saúde do Norte Alentejano, E. P. E. (508094461)","Prestibel - Empresa de Segurança, SA (501326456)","437.223,24 €",05-01-2016,29-09-2015,366 dias,"Portugal, Portalegre, Portalegre","Artigo 27.º, n.º 1, alínea a) do Código dos Contratos Públicos",05-01-2016,"437.223,24 €",,,,Não aplicável.,Não aplicável.,FALSE
