Objeto do Contrato,Tipo de Procedimento,Tipo(s) de Contrato,CPVs,Entidade(s) Adjudicante(s),Entidade(s) Adjudicatária(s),Preço Contratual,Data de Publicação,Data de Celebração do Contrato,Prazo de Execução,Local de Execução,Fundamentação,Data de Fecho do Contrato,Preço Total Efetivo,Causas das Alterações ao Prazo,Causas das Alterações ao Preço,Estado,N.º registo do Acordo Quadro,Descrição do Acordo Quadro,Procedimento Centralizado
49008317-Contrato renovação de licenciamento IPBRICK,Ajuste Direto Regime Geral,Aquisição de serviços,"72500000-0, Serviços relacionados com a informática",Hospital Dr. Francisco Zagalo (501510150),FULLCOM - SOLUÇÕES E SERVIÇOS DE COMUN. LDA. (506502309),"1.929,50 €",31-10-2017,27-10-2017,720 dias,"Portugal, Aveiro, Ovar","Artigo 20.º, n.º 1, alínea a) do Código dos Contratos Públicos",31-12-2017,"1.929,50 €","","",,Não aplicável.,Não aplicável.,FALSE
AD 51001217 - Corretivos Volémia e Outras Soluções Estéreis(Medic.S/ CHNM),Ao abrigo de acordo-quadro (art.º 259.º),Aquisição de bens móveis,"33600000-6, Produtos farmacêuticos",Hospital Dr. Francisco Zagalo (501510150),"Overpharma Produtos Médicos e Farmacêuticos, Lda (505792362)","1.203,84 €",30-10-2017,08-08-2017,150 dias,"Portugal, Aveiro, Ovar",Artigo 259.º do Código dos Contratos Públicos,29-12-2017,"729,60 €","",valor da previsão superior as necessidades,,1331181,Acordo Quadro para fornecimento de corretivos da volémia e outras soluções estéreis às Instituições e Serviços do Serviço Nacional de Saúde,FALSE
AD 51001217 - Corretivos Volémia e Outras Soluções Estéreis(Medic.S/ CHNM),Ao abrigo de acordo-quadro (art.º 259.º),Aquisição de bens móveis,"33600000-6, Produtos farmacêuticos",Hospital Dr. Francisco Zagalo (501510150),"Labesfal - Laboratórios Almiro, S.A. (501169580)","383,76 €",30-10-2017,08-08-2017,150 dias,"Portugal, Aveiro, Ovar",Artigo 259.º do Código dos Contratos Públicos,29-12-2017,"369,00 €","",valor da previsão superior as necessiodades,,1331181,Acordo Quadro para fornecimento de corretivos da volémia e outras soluções estéreis às Instituições e Serviços do Serviço Nacional de Saúde,FALSE
AD 51001217 - Corretivos Volémia e Outras Soluções Estéreis(Medic.S/ CHNM),Ao abrigo de acordo-quadro (art.º 259.º),Aquisição de bens móveis,"33600000-6, Produtos farmacêuticos",Hospital Dr. Francisco Zagalo (501510150),B.BRAUN MEDICAL (501506543),"1.281,00 €",30-10-2017,08-08-2017,150 dias,"Portugal, Aveiro, Ovar",Artigo 259.º do Código dos Contratos Públicos,29-12-2017,"976,00 €","",valor da previsão superior as necessidades,,1331181,Acordo Quadro para fornecimento de corretivos da volémia e outras soluções estéreis às Instituições e Serviços do Serviço Nacional de Saúde,FALSE
49006017-Serviços Medicos de Medicina Interna,Ajuste Direto Regime Geral,Aquisição de serviços,"79600000-0, Serviços de recrutamento",Hospital Dr. Francisco Zagalo (501510150),ANTONIO VIEIRA & VIEIRA LDA (501490477),"2.964,00 €",30-10-2017,28-09-2017,120 dias,"Portugal, Aveiro, Ovar","Artigo 20.º, n.º 1, alínea a) do Código dos Contratos Públicos",31-12-2017,"3.289,00 €","",serviços acima do previsto,,Não aplicável.,Não aplicável.,FALSE
49005617-Serviços de Estudos/Documento Estrategico para o Hospital,Ajuste Direto Regime Geral,Aquisição de serviços,"79600000-0, Serviços de recrutamento",Hospital Dr. Francisco Zagalo (501510150),DIGITAL NATIVE UNIPESSOAL LDA (514112310),"13.095,00 €",30-10-2017,19-07-2017,270 dias,"Portugal, Aveiro, Ovar","Artigo 20.º, n.º 1, alínea a) do Código dos Contratos Públicos",31-03-2018,"9.482,00 €",serviços abaixo do previsto,serviços abaixo do previsto,,Não aplicável.,Não aplicável.,FALSE
49005517-Prestação Serviços medicos de Ortopedia,Ajuste Direto Regime Geral,Aquisição de serviços,"79600000-0, Serviços de recrutamento",Hospital Dr. Francisco Zagalo - Ovar (501510150),"PIMENTA & REIS, PRESTACAO SERVICOS MEDICOS LDA (514075759)","6.864,00 €",30-10-2017,05-09-2017,120 dias,"Portugal, Aveiro, Ovar","Artigo 20.º, n.º 1, alínea a) do Código dos Contratos Públicos",30-11-2017,"2.015,00 €","",serviços abaixo do previsto,,Não aplicável.,Não aplicável.,FALSE
AD 46000317 Aquisição de material p/ tratamento de água,Ajuste Direto Regime Geral,Aquisição de bens móveis,"24950000-8, Produtos químicos para fins específicos",Hospital Dr. Francisco Zagalo (501510150),"ENKROTT -  GESTAO E TRATAMENTO DE AGUAS, SA (500103461)","178,00 €",30-10-2017,20-09-2017,20 dias,"Portugal, Aveiro, Ovar","Artigo 20.º, n.º 1, alínea a) do Código dos Contratos Públicos",09-10-2017,"178,00 €","","",,Não aplicável.,Não aplicável.,FALSE
AD- 51001417 MEDICAMENTOS OCULARES E ORL,Ao abrigo de acordo-quadro (art.º 259.º),Aquisição de bens móveis,"33662100-9, Medicamentos usados em oftalmologia",Hospital Dr. Francisco Zagalo (501510150),"Davi II- Farmacêutica, S.A. (508309450)","51,00 €",26-10-2017,18-10-2017,75 dias,"Portugal, Aveiro, Ovar",Artigo 259.º do Código dos Contratos Públicos,29-12-2017,"34,00 €","",valor da previsão superior as necessidades,,1377420,Acordo quadro para fornecimento de medicamentos usados nas afecções oculares e otorrinolaringologias às instituições e serviços do serviço nacional de saúde,FALSE
AD- 51001417 MEDICAMENTOS OCULARES E ORL,Ao abrigo de acordo-quadro (art.º 259.º),Aquisição de bens móveis,"33662100-9, Medicamentos usados em oftalmologia",Hospital Dr. Francisco Zagalo (501510150),"Laboratório Edol - Produtos Farmacêuticos, SA (507072642)","220,40 €",26-10-2017,18-10-2017,75 dias,"Portugal, Aveiro, Ovar",Artigo 259.º do Código dos Contratos Públicos,29-12-2017,"","",valor da previsão superior as necessidades,,1377420,Acordo quadro para fornecimento de medicamentos usados nas afecções oculares e otorrinolaringologias às instituições e serviços do serviço nacional de saúde,FALSE
AD- 51001417 MEDICAMENTOS OCULARES E ORL,Ao abrigo de acordo-quadro (art.º 259.º),Aquisição de bens móveis,"33662100-9, Medicamentos usados em oftalmologia",Hospital Dr. Francisco Zagalo (501510150),"GLAXOSMITHKLINE-PROD. FARMACÊUTICOS, LDA.          (500139962)","78,80 €",26-10-2017,18-10-2017,75 dias,"Portugal, Aveiro, Ovar",Artigo 259.º do Código dos Contratos Públicos,29-12-2017,"","",valor da previsão superior as necessidades,,1377420,Acordo quadro para fornecimento de medicamentos usados nas afecções oculares e otorrinolaringologias às instituições e serviços do serviço nacional de saúde,FALSE
AD 51001517 - MEDICAMENTOS DO APARELHO GENITURINARIO,Ao abrigo de acordo-quadro (art.º 259.º),Aquisição de bens móveis,"33640000-8, Medicamentos para o aparelho geniturinário e hormonas",Hospital Dr. Francisco Zagalo - Ovar (501510150),"Sanofi-Produtos Farmacêuticos, Lda. (500134960)","32,76 €",25-10-2017,20-09-2017,74 dias,"Portugal, Aveiro, Ovar",Artigo 259.º do Código dos Contratos Públicos,29-12-2017,"9,36 €","",valor da previsão superior as necessidades,,1404918,CP 2015/48 - Acordo Quadro para fornecimento de Medicamentos de Consumo Geral - Aparelho Geniturinário às Instituições e Serviços do Serviço Nacional de Saúde,FALSE
AD 51001517 - MEDICAMENTOS DO APARELHO GENITURINARIO,Ao abrigo de acordo-quadro (art.º 259.º),Aquisição de bens móveis,"33640000-8, Medicamentos para o aparelho geniturinário e hormonas",Hospital Dr. Francisco Zagalo - Ovar (501510150),Jaba Recordati (500492867),"74,76 €",25-10-2017,20-09-2017,74 dias,"Portugal, Aveiro, Ovar",Artigo 259.º do Código dos Contratos Públicos,29-12-2017,"56,40 €","",valor da previsão superior as necessidades,,1404918,CP 2015/48 - Acordo Quadro para fornecimento de Medicamentos de Consumo Geral - Aparelho Geniturinário às Instituições e Serviços do Serviço Nacional de Saúde,FALSE
AD 51001517 - MEDICAMENTOS DO APARELHO GENITURINARIO,Ao abrigo de acordo-quadro (art.º 259.º),Aquisição de bens móveis,"33640000-8, Medicamentos para o aparelho geniturinário e hormonas",Hospital Dr. Francisco Zagalo - Ovar (501510150),"Farmoz - Soc. Técnico Medicinal, S.A. (501505334)","8,16 €",25-10-2017,20-09-2017,74 dias,"Portugal, Aveiro, Ovar",Artigo 259.º do Código dos Contratos Públicos,29-12-2017,"","",valor da previsão superior as necessidades,,1404918,CP 2015/48 - Acordo Quadro para fornecimento de Medicamentos de Consumo Geral - Aparelho Geniturinário às Instituições e Serviços do Serviço Nacional de Saúde,FALSE
AD 51001517 - MEDICAMENTOS DO APARELHO GENITURINARIO,Ao abrigo de acordo-quadro (art.º 259.º),Aquisição de bens móveis,"33640000-8, Medicamentos para o aparelho geniturinário e hormonas",Hospital Dr. Francisco Zagalo - Ovar (501510150),OVERPHARMA - PRODUTOS MEDICOS E FARM.              (505792362),"131,60 €",25-10-2017,20-09-2017,72 dias,"Portugal, Aveiro, Ovar",Artigo 259.º do Código dos Contratos Públicos,29-12-2017,"34,60 €","",valor da previsão superior as necessidades,,1404918,CP 2015/48 - Acordo Quadro para fornecimento de Medicamentos de Consumo Geral - Aparelho Geniturinário às Instituições e Serviços do Serviço Nacional de Saúde,FALSE
AD 41000917 - AQUISIÇÃO DE MEDICAMENTOS C/CHNM,Ajuste Direto Regime Geral,Aquisição de bens móveis,"33690000-3, Medicamentos vários",Hospital Dr. Francisco Zagalo - Ovar (501510150),Manuela David Rodrigues Castro - Farmácia Carmindo Lamy (173097618),"3.374,07 €",25-10-2017,01-02-2017,334 dias,"Portugal, Aveiro, Ovar","Artigo 20.º, n.º 1, alínea a) do Código dos Contratos Públicos",29-12-2017,"3.207,23 €","",VALOR DA PREVISÃO SUPERIOR AS NECESSIDADES,,Não aplicável.,Não aplicável.,FALSE
AD  41001017 - AQUISIÇÃO DE MEDICAMENTOS S/CHNM,Ajuste Direto Regime Geral,Aquisição de bens móveis,"33690000-3, Medicamentos vários",Hospital Dr. Francisco Zagalo (501510150),Manuela David Rodrigues Castro - Farmácia Carmindo Lamy (173097618),"345,05 €",25-10-2017,01-02-2017,334 dias,"Portugal, Aveiro, Ovar","Artigo 20.º, n.º 1, alínea a) do Código dos Contratos Públicos",29-12-2017,"263,87 €","",VALOR DA PREVISÃO SUPERIOR AS NECESSIDADES,,Não aplicável.,Não aplicável.,FALSE
AD - 48000117 - AQUISIÇÃO DE OUTROS PROD. FARMACEUTICOS,Ajuste Direto Regime Geral,Aquisição de bens móveis,"33680000-0, Artigos de farmácia",Hospital Dr. Francisco Zagalo (501510150),Manuela David Rodrigues Castro - Farmácia Carmindo Lamy (173097618),"47,45 €",25-10-2017,01-02-2017,334 dias,"Portugal, Aveiro, Ovar","Artigo 20.º, n.º 1, alínea a) do Código dos Contratos Públicos",29-12-2017,"60,58 €","",VALOR SUPERIOR AS PREVISÕES,,Não aplicável.,Não aplicável.,FALSE
49007317-Serviços medicos de Otorrinolaringologia,Ajuste Direto Regime Geral,Aquisição de serviços,"85141000-9, Serviços prestados pelo pessoal médico",Hospital Dr. Francisco Zagalo (501510150),OTOATLANTICA SERVICOS MEDICOS LDA (507479025),"74.973,00 €",25-10-2017,12-09-2017,150 dias,"Portugal, Aveiro, Ovar","Artigo 20.º, n.º 1, alínea a) do Código dos Contratos Públicos",31-12-2017,"74.762,00 €","",Serviços abaixo do previsto,,Não aplicável.,Não aplicável.,FALSE
AD - 43001517 - REAGENTES PARA EQUIP. OLYMPUS AU400,Ajuste Direto Regime Geral,Aquisição de bens móveis,"33696500-0, Reagentes de laboratório",Hospital Dr. Francisco Zagalo (501510150),"Beckman Coulter Portugal Unipessoal, Lda (509035167)","4.153,19 €",24-10-2017,18-10-2017,75 dias,"Portugal, Aveiro, Ovar","Artigo 24.º, n.º 1, alínea e) do Código dos Contratos Públicos",29-12-2017,"3.336,52 €","",Valor da previsão superior as necessidades,,Não aplicável.,Não aplicável.,FALSE
