freguesia,acronym,validVotesPercentage,votes,dicofre
Oliveira do Douro,PS,51.32,117,180410
Oliveira do Douro,PPD/PSD,24.12,55,180410
Oliveira do Douro,PCP-PEV,5.26,12,180410
Oliveira do Douro,B.E.,4.82,11,180410
Oliveira do Douro,CDS-PP,3.07,7,180410
Oliveira do Douro,PAN,2.63,6,180410
Oliveira do Douro,NC,2.19,5,180410
Oliveira do Douro,PCTP/MRPP,1.32,3,180410
Oliveira do Douro,PPM.PPV/CDC,1.32,3,180410
Oliveira do Douro,IL,0.88,2,180410
Oliveira do Douro,L,0.88,2,180410
Oliveira do Douro,PTP,0.88,2,180410
Oliveira do Douro,A,0.44,1,180410
Oliveira do Douro,MAS,0.44,1,180410
Oliveira do Douro,PURP,0.44,1,180410
Oliveira do Douro,PDR,0,0,180410
Oliveira do Douro,PNR,0,0,180410
