freguesia,acronym,validVotesPercentage,votes,dicofre
Fornelos e Queijada,PPD/PSD,43.29,229,160758
Fornelos e Queijada,CDS-PP,21.36,113,160758
Fornelos e Queijada,PS,20.42,108,160758
Fornelos e Queijada,B.E.,5.29,28,160758
Fornelos e Queijada,PAN,2.08,11,160758
Fornelos e Queijada,NC,1.7,9,160758
Fornelos e Queijada,PDR,1.51,8,160758
Fornelos e Queijada,PCP-PEV,1.13,6,160758
Fornelos e Queijada,IL,0.76,4,160758
Fornelos e Queijada,L,0.76,4,160758
Fornelos e Queijada,PNR,0.57,3,160758
Fornelos e Queijada,PPM.PPV/CDC,0.57,3,160758
Fornelos e Queijada,PCTP/MRPP,0.38,2,160758
Fornelos e Queijada,A,0.19,1,160758
Fornelos e Queijada,MAS,0,0,160758
Fornelos e Queijada,PTP,0,0,160758
Fornelos e Queijada,PURP,0,0,160758
