Objeto do Contrato,Tipo de Procedimento,Tipo(s) de Contrato,CPVs,Entidade(s) Adjudicante(s),Entidade(s) Adjudicatária(s),Preço Contratual,Data de Publicação,Data de Celebração do Contrato,Prazo de Execução,Local de Execução,Fundamentação,Data de Fecho do Contrato,Preço Total Efetivo,Causas das Alterações ao Prazo,Causas das Alterações ao Preço,Estado,N.º registo do Acordo Quadro,Descrição do Acordo Quadro,Procedimento Centralizado
Medicamentos do SNC 20108,Consulta Prévia,Aquisição de bens móveis,"33600000-6, Produtos farmacêuticos","Centro Hospitalar do Tâmega e Sousa, E. P. E. (508318262)","ROCHE Farmacêutica Química, Lda. (500233810)","468,74 €",06-02-2019,04-04-2018,202 dias,"Portugal, Porto, Penafiel<BR/>Portugal<BR/>Portugal, Porto, Amarante","Artigo 20.º, n.º 1, alínea c) do Código dos Contratos Públicos",,,,,,Não aplicável.,Não aplicável.,FALSE
Medicamentos do SNC 20108,Consulta Prévia,Aquisição de bens móveis,"33600000-6, Produtos farmacêuticos","Centro Hospitalar do Tâmega e Sousa, E. P. E. (508318262)",Ratiopharm (502414910),"1.977,81 €",06-02-2019,04-04-2018,202 dias,"Portugal, Porto, Amarante<BR/>Portugal, Porto, Penafiel<BR/>Portugal","Artigo 20.º, n.º 1, alínea c) do Código dos Contratos Públicos",,,,,,Não aplicável.,Não aplicável.,FALSE
Medicamentos do SNC 20108,Consulta Prévia,Aquisição de bens móveis,"33600000-6, Produtos farmacêuticos","Centro Hospitalar do Tâmega e Sousa, E. P. E. (508318262)",profarin (500223238),"91,05 €",06-02-2019,04-04-2018,202 dias,"Portugal, Porto, Amarante<BR/>Portugal, Porto, Penafiel<BR/>Portugal","Artigo 20.º, n.º 1, alínea c) do Código dos Contratos Públicos",,,,,,Não aplicável.,Não aplicável.,FALSE
Medicamentos do SNC 20108,Consulta Prévia,Aquisição de bens móveis,"33600000-6, Produtos farmacêuticos","Centro Hospitalar do Tâmega e Sousa, E. P. E. (508318262)","Overpharma, Lda. (505792362)","657,60 €",05-02-2019,04-04-2018,202 dias,"Portugal, Porto, Amarante<BR/>Portugal, Porto, Penafiel<BR/>Portugal","Artigo 20.º, n.º 1, alínea c) do Código dos Contratos Públicos",,,,,,Não aplicável.,Não aplicável.,FALSE
Medicamentos do SNC 20108,Consulta Prévia,Aquisição de bens móveis,"33600000-6, Produtos farmacêuticos","Centro Hospitalar do Tâmega e Sousa, E. P. E. (508318262)",LABORATORIOS VITORIA SA (500162220),"693,05 €",05-02-2019,04-04-2018,202 dias,"Portugal, Porto, Amarante<BR/>Portugal, Porto, Penafiel<BR/>Portugal","Artigo 20.º, n.º 1, alínea c) do Código dos Contratos Públicos",,,,,,Não aplicável.,Não aplicável.,FALSE
Medicamentos do SNC 20108,Consulta Prévia,Aquisição de bens móveis,"33600000-6, Produtos farmacêuticos","Centro Hospitalar do Tâmega e Sousa, E. P. E. (508318262)","Novartis Farma, SA (500063524)","648,64 €",05-02-2019,04-04-2018,202 dias,"Portugal, Porto, Amarante<BR/>Portugal<BR/>Portugal, Porto, Penafiel","Artigo 20.º, n.º 1, alínea c) do Código dos Contratos Públicos",,,,,,Não aplicável.,Não aplicável.,FALSE
Medicamentos do SNC 20108,Consulta Prévia,Aquisição de bens móveis,"33600000-6, Produtos farmacêuticos","Centro Hospitalar do Tâmega e Sousa, E. P. E. (508318262)",JANSSEN-CILAG FARMACEUTICA LDA (500189412),"76,97 €",05-02-2019,04-04-2018,202 dias,"Portugal, Porto, Amarante<BR/>Portugal<BR/>Portugal, Porto, Penafiel","Artigo 20.º, n.º 1, alínea c) do Código dos Contratos Públicos",,,,,,Não aplicável.,Não aplicável.,FALSE
Medicamentos do SNC 20108,Consulta Prévia,Aquisição de bens móveis,"33600000-6, Produtos farmacêuticos","Centro Hospitalar do Tâmega e Sousa, E. P. E. (508318262)",B BRAUN MEDICAL LDA (501506543),"2.635,96 €",05-02-2019,04-04-2018,202 dias,"Portugal, Porto, Amarante<BR/>Portugal<BR/>Portugal, Porto, Penafiel","Artigo 20.º, n.º 1, alínea c) do Código dos Contratos Públicos",,,,,,Não aplicável.,Não aplicável.,FALSE
Medicamentos do SNC 20108,Consulta Prévia,Aquisição de bens móveis,"33600000-6, Produtos farmacêuticos","Centro Hospitalar do Tâmega e Sousa, E. P. E. (508318262)","Generis Farmacêutica, SA (508107997)","318,94 €",05-02-2019,04-04-2018,202 dias,"Portugal, Porto, Penafiel<BR/>Portugal<BR/>Portugal, Porto, Amarante","Artigo 20.º, n.º 1, alínea c) do Código dos Contratos Públicos",,,,,,Não aplicável.,Não aplicável.,FALSE
08/Cpr.18.300 - Serviço Manutenção dos Jardins,Consulta Prévia,Aquisição de serviços,"77310000-6, Serviços de plantação e manutenção de áreas verdes","Centro Hospitalar do Tâmega e Sousa, E.P.E. (508318262)","LENDAS & ALAMEDAS - AMBIENTE E PAISAGISMO, UNIPESSOAL, LDA. (514087870)","18.600,00 €",02-02-2019,07-11-2018,7 dias,"Portugal, Porto, Amarante<BR/>Portugal, Porto, Penafiel","Artigo 20.º, n.º 1, alínea c) do Código dos Contratos Públicos",,,,,,Não aplicável.,Não aplicável.,FALSE
"08/AD.18.332 - Prestação de serviços de manutenção ao sistema Trace Me do Centro Hospitalar do Tâmega e Sousa, E.P.E. ",Ajuste Direto Regime Geral,Aquisição de serviços,"72600000-6, Serviços de consultoria e assistência informáticas","Centro Hospitalar do Tâmega e Sousa, E.P.E. (508318262)",Intellicare (505158655),"8.820,00 €",02-02-2019,05-12-2018,365 dias,"Portugal, Porto, Penafiel<BR/>Portugal, Porto, Amarante","Artigo 20.º, n.º 1, alínea d) do Código dos Contratos Públicos",,,,,,Não aplicável.,Não aplicável.,FALSE
08/Cpr.18.302 - Assistência Tecn. e Controlo Água,Consulta Prévia,Aquisição de serviços,"90400000-1, Serviços relacionados com águas residuais","Centro Hospitalar do Tâmega e Sousa, E.P.E. (508318262)","Microchem - Ensaios e Análises Técnicas, Lda (507797400)","5.654,35 €",02-02-2019,07-11-2018,30 dias,"Portugal, Porto, Amarante<BR/>Portugal, Porto, Penafiel","Artigo 20.º, n.º 1, alínea c) do Código dos Contratos Públicos",,,,,,Não aplicável.,Não aplicável.,FALSE
08/AD.18.399 - Solução informática para o Serviço Social,Ajuste Direto Regime Geral,Aquisição de bens móveis,"48100000-9, Pacote de software para sectores específicos","Centro Hospitalar do Tâmega e Sousa, E.P.E. (508318262)","SWH Solutions, Unipessoal, Lda. (508144396)","8.050,00 €",02-02-2019,03-01-2019,365 dias,"Portugal, Porto, Penafiel<BR/>Portugal, Porto, Amarante","Artigo 20.º, n.º 1, alínea d) do Código dos Contratos Públicos",,,,,,Não aplicável.,Não aplicável.,FALSE
"08/Cpr.18.304 - Obras dos Centro de Saúde, no âmbito da Internalização dos MCDT, ao Centro Hospitalar Tâmega e Sousa, E.P.E.",Consulta Prévia,Empreitadas de obras públicas,"45113000-2, Obras no local","Centro Hospitalar do Tâmega e Sousa, E. P. E. (508318262)",Habirobim Construção e Reabilitação lda (505115093),"11.800,00 €",02-02-2019,14-11-2018,7 dias,"Portugal, Porto, Amarante<BR/>Portugal, Porto, Penafiel","Artigo 19.º, alínea c) do Código dos Contratos Públicos",,,,,,Não aplicável.,Não aplicável.,FALSE
Medicamentos de várias áreas terapêuticas para 2019,Ao abrigo de acordo-quadro (art.º 259.º),Aquisição de bens móveis,"33600000-6, Produtos farmacêuticos","Centro Hospitalar do Tâmega e Sousa, E.P.E. (508318262)","Sanofi - Produtos Farmacêuticos, Lda (500134960)","1.260,00 €",02-02-2019,19-12-2018,365 dias,"Portugal, Porto, Amarante<BR/>Portugal, Porto, Penafiel",Artigo 259.º do Código dos Contratos Públicos,,,,,,2556987,"CP 2017/65 - Acordo Quadro para fornecimento de Medicamentos de Várias áreas Terapêuticas, às Instituições e Serviços do Serviço Nacional de Saúde",FALSE
Medicamentos de várias áreas terapêuticas para 2019,Ao abrigo de acordo-quadro (art.º 259.º),Aquisição de bens móveis,"33600000-6, Produtos farmacêuticos","Centro Hospitalar do Tâmega e Sousa, E.P.E. (508318262)","JANSSEN-CILAG FARMACEUTICA, LDA. (500189412)","351.217,20 €",02-02-2019,19-12-2018,365 dias,"Portugal, Porto, Penafiel<BR/>Portugal, Porto, Amarante",Artigo 259.º do Código dos Contratos Públicos,,,,,,2556987,"CP 2017/65 - Acordo Quadro para fornecimento de Medicamentos de Várias áreas Terapêuticas, às Instituições e Serviços do Serviço Nacional de Saúde",FALSE
Medicamentos de várias áreas terapêuticas para 2019,Ao abrigo de acordo-quadro (art.º 259.º),Aquisição de bens móveis,"33600000-6, Produtos farmacêuticos","Centro Hospitalar do Tâmega e Sousa, E.P.E. (508318262)",GlaxoSmithKline -Prod.Farm .Ldª (500139962),"20.949,80 €",02-02-2019,19-12-2018,365 dias,"Portugal, Porto, Penafiel<BR/>Portugal, Porto, Amarante",Artigo 259.º do Código dos Contratos Públicos,,,,,,2556987,"CP 2017/65 - Acordo Quadro para fornecimento de Medicamentos de Várias áreas Terapêuticas, às Instituições e Serviços do Serviço Nacional de Saúde",FALSE
Medicamentos de várias áreas terapêuticas para 2019,Ao abrigo de acordo-quadro (art.º 259.º),Aquisição de bens móveis,"33600000-6, Produtos farmacêuticos","Centro Hospitalar do Tâmega e Sousa, E.P.E. (508318262)",GENERIS FARMACÊUTICA S.A. (508107997),"100,80 €",02-02-2019,19-12-2018,365 dias,"Portugal, Porto, Penafiel<BR/>Portugal, Porto, Amarante",Artigo 259.º do Código dos Contratos Públicos,,,,,,2556987,"CP 2017/65 - Acordo Quadro para fornecimento de Medicamentos de Várias áreas Terapêuticas, às Instituições e Serviços do Serviço Nacional de Saúde",FALSE
Medicamentos Diversos,Concurso público,Aquisição de bens móveis,"33600000-6, Produtos farmacêuticos","Centro Hospitalar do Tâmega e Sousa, E. P. E. (508318262)",LABORATORIOS VITORIA SA (500162220),"453,88 €",02-02-2019,12-04-2018,335 dias,"Portugal, Porto, Penafiel<BR/>Portugal, Porto, Amarante<BR/>Portugal","Artigo 20.º, n.º 1, alínea a) do Código dos Contratos Públicos",,,,,,Não aplicável.,Não aplicável.,FALSE
Medicamentos Diversos,Concurso público,Aquisição de bens móveis,"33600000-6, Produtos farmacêuticos","Centro Hospitalar do Tâmega e Sousa, E. P. E. (508318262)",TEVA PHARMA  - PROD. FARMACÊUTICOS (507045491),"1.841,50 €",02-02-2019,12-04-2018,335 dias,"Portugal, Porto, Penafiel<BR/>Portugal, Porto, Amarante<BR/>Portugal","Artigo 20.º, n.º 1, alínea a) do Código dos Contratos Públicos",,,,,,Não aplicável.,Não aplicável.,FALSE
Cateteres de Hemodinâmica | 2018,Consulta Prévia,Aquisição de bens móveis,"33100000-1, Equipamento médico","Centro Hospitalar do Tâmega e Sousa, E.P.E. (508318262)","WORLD MEDICA, S. L. (B82612599)","4.840,00 €",02-02-2019,07-11-2018,365 dias,"Portugal, Porto, Amarante<BR/>Portugal, Porto, Penafiel","Artigo 20.º, n.º 1, alínea c) do Código dos Contratos Públicos",,,,,,Não aplicável.,Não aplicável.,FALSE
Medicamentos Diversos,Concurso público,Aquisição de bens móveis,"33600000-6, Produtos farmacêuticos","Centro Hospitalar do Tâmega e Sousa, E. P. E. (508318262)",TECNIFAR-IND.TECN.FARMAC.SA (500280436),"880,00 €",02-02-2019,12-04-2018,335 dias,"Portugal, Porto, Amarante<BR/>Portugal, Porto, Penafiel<BR/>Portugal","Artigo 20.º, n.º 1, alínea a) do Código dos Contratos Públicos",,,,,,Não aplicável.,Não aplicável.,FALSE
Cateteres de Hemodinâmica | 2018,Consulta Prévia,Aquisição de bens móveis,"33100000-1, Equipamento médico","Centro Hospitalar do Tâmega e Sousa, E.P.E. (508318262)","Cardiva Portugal Unipessoal, Lda (508570514)","9.900,00 €",02-02-2019,07-11-2018,365 dias,"Portugal, Porto, Penafiel<BR/>Portugal, Porto, Amarante","Artigo 20.º, n.º 1, alínea c) do Código dos Contratos Públicos",,,,,,Não aplicável.,Não aplicável.,FALSE
Medicamentos Diversos,Concurso público,Aquisição de bens móveis,"33600000-6, Produtos farmacêuticos","Centro Hospitalar do Tâmega e Sousa, E. P. E. (508318262)",profarin (500223238),"2.380,00 €",02-02-2019,12-04-2018,335 dias,"Portugal<BR/>Portugal, Porto, Penafiel<BR/>Portugal, Porto, Amarante","Artigo 20.º, n.º 1, alínea a) do Código dos Contratos Públicos",,,,,,Não aplicável.,Não aplicável.,FALSE
Cateteres de Hemodinâmica | 2018,Consulta Prévia,Aquisição de bens móveis,"33100000-1, Equipamento médico","Centro Hospitalar do Tâmega e Sousa, E.P.E. (508318262)",CARDINAL HEALTH PORTUGAL 513 UNIPESSOAL LDA (513620834),"18.465,00 €",02-02-2019,07-11-2018,365 dias,"Portugal, Porto, Amarante<BR/>Portugal, Porto, Penafiel","Artigo 20.º, n.º 1, alínea c) do Código dos Contratos Públicos",,,,,,Não aplicável.,Não aplicável.,FALSE
Medicamentos Diversos,Concurso público,Aquisição de bens móveis,"33600000-6, Produtos farmacêuticos","Centro Hospitalar do Tâmega e Sousa, E. P. E. (508318262)",PROCLINICA EQUIPAMENTOS E PRODUTOS CLINICOS LDA (500222665),"593,75 €",02-02-2019,12-04-2018,335 dias,"Portugal<BR/>Portugal, Porto, Penafiel<BR/>Portugal, Porto, Amarante","Artigo 20.º, n.º 1, alínea a) do Código dos Contratos Públicos",,,,,,Não aplicável.,Não aplicável.,FALSE
Cateteres de Hemodinâmica | 2018,Consulta Prévia,Aquisição de bens móveis,"33100000-1, Equipamento médico","Centro Hospitalar do Tâmega e Sousa, E.P.E. (508318262)","BOSTON SCIENTIFIC PORTUGAL, LDA (504988964)","2.550,00 €",02-02-2019,07-11-2018,365 dias,"Portugal, Porto, Amarante<BR/>Portugal, Porto, Penafiel","Artigo 20.º, n.º 1, alínea c) do Código dos Contratos Públicos",,,,,,Não aplicável.,Não aplicável.,FALSE
Cateteres de Hemodinâmica | 2018,Consulta Prévia,Aquisição de bens móveis,"33100000-1, Equipamento médico","Centro Hospitalar do Tâmega e Sousa, E.P.E. (508318262)",BiotronikPortugal Unipessoal Lda (510726941),"24.175,00 €",02-02-2019,07-11-2018,365 dias,"Portugal, Porto, Penafiel<BR/>Portugal, Porto, Amarante","Artigo 20.º, n.º 1, alínea c) do Código dos Contratos Públicos",,,,,,Não aplicável.,Não aplicável.,FALSE
Medicamentos Diversos,Concurso público,Aquisição de bens móveis,"33600000-6, Produtos farmacêuticos","Centro Hospitalar do Tâmega e Sousa, E. P. E. (508318262)",PIERRE FABRE MED.PORTUGAL LDA (500230366),"381,15 €",02-02-2019,12-04-2018,335 dias,"Portugal, Porto, Penafiel<BR/>Portugal, Porto, Amarante<BR/>Portugal","Artigo 20.º, n.º 1, alínea a) do Código dos Contratos Públicos",,,,,,Não aplicável.,Não aplicável.,FALSE
Medicamentos Diversos,Concurso público,Aquisição de bens móveis,"33600000-6, Produtos farmacêuticos","Centro Hospitalar do Tâmega e Sousa, E. P. E. (508318262)","Overpharma, Lda. (505792362)","1.979,55 €",02-02-2019,12-04-2018,335 dias,"Portugal, Porto, Penafiel<BR/>Portugal<BR/>Portugal, Porto, Amarante","Artigo 20.º, n.º 1, alínea a) do Código dos Contratos Públicos",,,,,,Não aplicável.,Não aplicável.,FALSE
Cateteres de Hemodinâmica | 2018,Consulta Prévia,Aquisição de bens móveis,"33100000-1, Equipamento médico","Centro Hospitalar do Tâmega e Sousa, E.P.E. (508318262)",B BRAUN MEDICAL LDA (501506543),"114,00 €",02-02-2019,07-11-2018,365 dias,"Portugal, Porto, Penafiel<BR/>Portugal, Porto, Amarante","Artigo 20.º, n.º 1, alínea c) do Código dos Contratos Públicos",,,,,,Não aplicável.,Não aplicável.,FALSE
Medicamentos Diversos,Concurso público,Aquisição de bens móveis,"33600000-6, Produtos farmacêuticos","Centro Hospitalar do Tâmega e Sousa, E. P. E. (508318262)",Novo Nordisk (501485210),"423,15 €",02-02-2019,12-04-2018,335 dias,"Portugal, Porto, Amarante<BR/>Portugal","Artigo 20.º, n.º 1, alínea a) do Código dos Contratos Públicos",,,,,,Não aplicável.,Não aplicável.,FALSE
Cateteres de Hemodinâmica | 2018,Consulta Prévia,Aquisição de bens móveis,"33100000-1, Equipamento médico","Centro Hospitalar do Tâmega e Sousa, E.P.E. (508318262)","MEDTRONIC PORTUGAL, LDA. (504223933)","13.300,00 €",02-02-2019,07-11-2018,365 dias,"Portugal, Porto, Amarante<BR/>Portugal, Porto, Penafiel","Artigo 20.º, n.º 1, alínea c) do Código dos Contratos Públicos",,,,,,Não aplicável.,Não aplicável.,FALSE
Medicamentos Diversos,Concurso público,Aquisição de bens móveis,"33600000-6, Produtos farmacêuticos","Centro Hospitalar do Tâmega e Sousa, E. P. E. (508318262)","MERCK SHARP & DOHME, LDA (500191360)","710,57 €",02-02-2019,12-04-2018,335 dias,"Portugal<BR/>Portugal, Porto, Penafiel<BR/>Portugal, Porto, Amarante","Artigo 20.º, n.º 1, alínea a) do Código dos Contratos Públicos",,,,,,Não aplicável.,Não aplicável.,FALSE
Medicamentos Diversos,Concurso público,Aquisição de bens móveis,"33600000-6, Produtos farmacêuticos","Centro Hospitalar do Tâmega e Sousa, E. P. E. (508318262)",LOGIFARMA - LOGISTICA FARMACÊUTICA S.A. (503934640),"6.105,60 €",02-02-2019,12-04-2018,335 dias,"Portugal, Porto, Amarante<BR/>Portugal<BR/>Portugal, Porto, Penafiel","Artigo 20.º, n.º 1, alínea a) do Código dos Contratos Públicos",,,,,,Não aplicável.,Não aplicável.,FALSE
Medicamentos Diversos,Concurso público,Aquisição de bens móveis,"33600000-6, Produtos farmacêuticos","Centro Hospitalar do Tâmega e Sousa, E. P. E. (508318262)","LABESFAL-LABORATORIOS ALMIRO, SA (501169580)","2.899,20 €",02-02-2019,12-04-2018,335 dias,"Portugal<BR/>Portugal, Porto, Penafiel<BR/>Portugal, Porto, Amarante","Artigo 20.º, n.º 1, alínea a) do Código dos Contratos Públicos",,,,,,Não aplicável.,Não aplicável.,FALSE
Medicamentos Diversos,Concurso público,Aquisição de bens móveis,"33600000-6, Produtos farmacêuticos","Centro Hospitalar do Tâmega e Sousa, E. P. E. (508318262)",JOHNSON & JOHNSON PROD.PROF. (500153370),"183,60 €",02-02-2019,12-04-2018,335 dias,"Portugal<BR/>Portugal, Porto, Penafiel<BR/>Portugal, Porto, Amarante","Artigo 20.º, n.º 1, alínea a) do Código dos Contratos Públicos",,,,,,Não aplicável.,Não aplicável.,FALSE
Contratação de prestação de serviços médicos para o Serviço de Imagiologia,Ajuste Direto Regime Geral,Aquisição de serviços,"85100000-0, Serviços de saúde","Centro Hospitalar do Tâmega e Sousa, E. P. E. (508318262)","FRANCISCO SOLHA SILVA, UNIPESSOAL LDA (515105554)","13.520,00 €",02-02-2019,03-01-2019,23 dias,"Portugal, Porto, Penafiel","Artigo 20.º, n.º 1, alínea d) do Código dos Contratos Públicos",,,,,,Não aplicável.,Não aplicável.,FALSE
Medicamentos Diversos,Concurso público,Aquisição de bens móveis,"33600000-6, Produtos farmacêuticos","Centro Hospitalar do Tâmega e Sousa, E. P. E. (508318262)","Generis, SA (508107997)","691,26 €",02-02-2019,12-04-2018,335 dias,"Portugal, Porto, Penafiel<BR/>Portugal, Porto, Amarante<BR/>Portugal","Artigo 20.º, n.º 1, alínea a) do Código dos Contratos Públicos",,,,,,Não aplicável.,Não aplicável.,FALSE
Medicamentos Diversos,Concurso público,Aquisição de bens móveis,"33600000-6, Produtos farmacêuticos","Centro Hospitalar do Tâmega e Sousa, E. P. E. (508318262)","FRESENIUS MEDICAL CARE PORTUGAL, S.A. (503070220)","531,00 €",02-02-2019,12-04-2018,335 dias,"Portugal<BR/>Portugal, Porto, Penafiel<BR/>Portugal, Porto, Amarante","Artigo 20.º, n.º 1, alínea a) do Código dos Contratos Públicos",,,,,,Não aplicável.,Não aplicável.,FALSE
Medicamentos Diversos,Concurso público,Aquisição de bens móveis,"33600000-6, Produtos farmacêuticos","Centro Hospitalar do Tâmega e Sousa, E. P. E. (508318262)",FERRAZ LYNCE SA (500113270),"7.235,83 €",02-02-2019,12-04-2018,335 dias,"Portugal<BR/>Portugal, Porto, Penafiel<BR/>Portugal, Porto, Amarante","Artigo 20.º, n.º 1, alínea a) do Código dos Contratos Públicos",,,,,,Não aplicável.,Não aplicável.,FALSE
Medicamentos Diversos,Concurso público,Aquisição de bens móveis,"33600000-6, Produtos farmacêuticos","Centro Hospitalar do Tâmega e Sousa, E. P. E. (508318262)","Farmoz - Sociedade Técnico Medicinal, SA (501505334)","448,80 €",02-02-2019,12-04-2018,335 dias,"Portugal, Porto, Amarante<BR/>Portugal, Porto, Penafiel<BR/>Portugal","Artigo 20.º, n.º 1, alínea a) do Código dos Contratos Públicos",,,,,,Não aplicável.,Não aplicável.,FALSE
Medicamentos Diversos,Concurso público,Aquisição de bens móveis,"33600000-6, Produtos farmacêuticos","Centro Hospitalar do Tâmega e Sousa, E. P. E. (508318262)",ESTERIPLAS (502020776),"2.007,00 €",02-02-2019,12-04-2018,335 dias,"Portugal, Porto, Amarante<BR/>Portugal, Porto, Penafiel<BR/>Portugal","Artigo 20.º, n.º 1, alínea a) do Código dos Contratos Públicos",,,,,,Não aplicável.,Não aplicável.,FALSE
Medicamentos Diversos,Concurso público,Aquisição de bens móveis,"33600000-6, Produtos farmacêuticos","Centro Hospitalar do Tâmega e Sousa, E. P. E. (508318262)",BRISTOL - MYERS SQUIBB SA. (500048193),"164,16 €",02-02-2019,12-04-2018,335 dias,"Portugal, Porto, Amarante<BR/>Portugal, Porto, Penafiel<BR/>Portugal","Artigo 20.º, n.º 1, alínea a) do Código dos Contratos Públicos",,,,,,Não aplicável.,Não aplicável.,FALSE
Reparação de Videobroncoscopio,Ajuste Direto Regime Geral,Aquisição de serviços,"50420000-5, Serviços de reparação e manutenção de equipamento médico e cirúrgico","Centro Hospitalar do Tâmega e Sousa, E. P. E. (508318262)","OLYMPUS IBERIA, s.a.u. (980474710)","8.547,51 €",02-02-2019,02-11-2017,17 dias,"Portugal, Porto, Penafiel","Artigo 21.º, n.º 1, alínea a) do Código dos Contratos Públicos",,,,,,Não aplicável.,Não aplicável.,FALSE
Medicamentos Diversos,Concurso público,Aquisição de bens móveis,"33600000-6, Produtos farmacêuticos","Centro Hospitalar do Tâmega e Sousa, E. P. E. (508318262)",Baxter (503347345),"8.584,00 €",02-02-2019,12-04-2018,335 dias,"Portugal, Porto, Amarante<BR/>Portugal, Porto, Penafiel<BR/>Portugal","Artigo 20.º, n.º 1, alínea a) do Código dos Contratos Públicos",,,,,,Não aplicável.,Não aplicável.,FALSE
Medicamentos Diversos,Concurso público,Aquisição de bens móveis,"33600000-6, Produtos farmacêuticos","Centro Hospitalar do Tâmega e Sousa, E. P. E. (508318262)",B BRAUN MEDICAL LDA (501506543),"2.126,28 €",02-02-2019,12-04-2018,335 dias,"Portugal, Porto, Amarante<BR/>Portugal, Porto, Penafiel<BR/>Portugal","Artigo 20.º, n.º 1, alínea a) do Código dos Contratos Públicos",,,,,,Não aplicável.,Não aplicável.,FALSE
Medicamentos Diversos,Concurso público,Aquisição de bens móveis,"33600000-6, Produtos farmacêuticos","Centro Hospitalar do Tâmega e Sousa, E. P. E. (508318262)","ACCORD HEALTHCARE, UNIPESSOAL, LDA (508622263)","778,80 €",02-02-2019,12-04-2018,335 dias,"Portugal<BR/>Portugal, Porto, Amarante<BR/>Portugal, Porto, Penafiel","Artigo 20.º, n.º 1, alínea a) do Código dos Contratos Públicos",,,,,,Não aplicável.,Não aplicável.,FALSE
07/CPr.18.201 - Construção Hospital de Dia UPA,Consulta Prévia,Empreitadas de obras públicas,"45200000-9, Obras de construção total ou parcial e de engenharia civil","Centro Hospitalar do Tâmega e Sousa, E.P.E. (508318262)","Luís Gonzaga - Construções, Lda  (500610533)","78.677,31 €",02-02-2019,12-09-2018,111 dias,"Portugal<BR/>Portugal, Porto, Penafiel","Artigo 20.º, n.º 1, alínea c) do Código dos Contratos Públicos",,,,,,Não aplicável.,Não aplicável.,FALSE
Fabius-kit ref: MX08197 Fabius-kit ref: MX08196,Ajuste Direto Regime Geral,Aquisição de bens móveis,"33100000-1, Equipamento médico","Centro Hospitalar do Tâmega e Sousa, E.P.E. (508318262)","Dräger Portugal, Lda (508771323)","4.896,00 €",02-02-2019,14-11-2018,36 dias,"Portugal, Porto, Penafiel<BR/>Portugal, Porto, Amarante<BR/>Portugal","Artigo 20.º, n.º 1, alínea d) do Código dos Contratos Públicos",,,,,,Não aplicável.,Não aplicável.,FALSE
08/AD.18.223 - Prest. Serviços Elaboração Projectos Especialidades,Ajuste Direto Regime Geral,Aquisição de serviços,"71200000-0, Serviços de arquitectura e afins","Centro Hospitalar do Tâmega e Sousa, E. P. E. (508318262)","MOFASE – ARQUITETURA E ENGENHARIA, LIMITADA (504594591)","16.400,00 €",02-02-2019,01-09-2018,61 dias,"Portugal, Porto, Amarante<BR/>Portugal, Porto, Penafiel<BR/>Portugal","Artigo 20.º, n.º 1, alínea d) do Código dos Contratos Públicos",,,,,,Não aplicável.,Não aplicável.,FALSE
08/AD.18.322 - Prestação de serviços de fornecimento de refeições,Ajuste Direto Regime Geral,Aquisição de bens móveis,"15894220-9, Refeições para hospitais","Centro Hospitalar do Tâmega e Sousa, E.P.E. (508318262)","EUREST Portugal - Sociedade Europeia de Restaurantes, Lda (500347506)","331.055,15 €",02-02-2019,10-10-2018,264 dias,"Portugal, Porto, Amarante<BR/>Portugal, Porto, Penafiel<BR/>Portugal","Artigo 24.º, n.º 1, alínea c) do Código dos Contratos Públicos",,,,,,Não aplicável.,Não aplicável.,FALSE
Aquisição de Duodenovideoscopio,Ajuste Direto Regime Geral,Aquisição de bens móveis,"33100000-1, Equipamento médico","Centro Hospitalar do Tâmega e Sousa, E. P. E. (508318262)","OLYMPUS IBERIA, s.a.u. (980474710)","28.016,00 €",02-02-2019,18-06-2018,197 dias,"Portugal, Porto, Amarante<BR/>Portugal, Porto, Penafiel<BR/>Portugal","Artigo 20.º, n.º 1, alínea d) do Código dos Contratos Públicos",,,,,,Não aplicável.,Não aplicável.,FALSE
"11/Cpr.18.245 – Ajudas técnicas – Óculos para o Centro Hospitalar do Tâmega e Sousa, EPE",Consulta Prévia,Aquisição de bens móveis,"33734000-4, Óculos","Centro Hospitalar do Tâmega e Sousa, E.P.E. (508318262)"," CENTRO ÓPTICO BOA IMAGEM, S.A. (502282487)","17.167,00 €",01-02-2019,19-10-2018,365 dias,"Portugal<BR/>Portugal, Porto, Penafiel<BR/>Portugal, Porto, Amarante","Artigo 20.º, n.º 1, alínea c) do Código dos Contratos Públicos",,,,,,Não aplicável.,Não aplicável.,FALSE
"04/Cpr.18.316 – Fornecimento de Sacos de Plástico ao Centro Hospitalar do Tâmega e Sousa, E.P.E.",Consulta Prévia,Aquisição de bens móveis,"19640000-4, Sacos de polietileno para recolha de lixo e resíduos","Centro Hospitalar do Tâmega e Sousa, E.P.E. (508318262)","A.J.OLIVEIRA, LDA. (502293748)","68.729,32 €",01-02-2019,20-11-2018,365 dias,Portugal,"Artigo 20.º, n.º 1, alínea c) do Código dos Contratos Públicos",,,,,,Não aplicável.,Não aplicável.,FALSE
"Consumíveis para cirurgia de catarata, segmento anterior e posterior, com colocação de equipamento para o ano de 2019",Concurso público,Aquisição de bens móveis,"33100000-1, Equipamento médico","Centro Hospitalar do Tâmega e Sousa, E.P.E. (508318262)",BAUSCH  LOMB (980218764),"187.556,00 €",01-02-2019,07-12-2018,365 dias,"Portugal, Porto, Penafiel<BR/>Portugal<BR/>Portugal, Porto, Amarante","Artigo 20.º, n.º 1, alínea b) do Código dos Contratos Públicos",,,,,,Não aplicável.,Não aplicável.,FALSE
02/Cpr.18.380 – Artigos de Cimentação,Consulta Prévia,Aquisição de bens móveis,"33140000-3, Material médico de consumo","Centro Hospitalar do Tâmega e Sousa, E.P.E. (508318262)",HERAEUS MEDICAL PORTUGAL LDA (508322227),"21.560,00 €",01-02-2019,21-01-2019,365 dias,"Portugal<BR/>Portugal, Porto, Penafiel<BR/>Portugal, Porto, Amarante","Artigo 20.º, n.º 1, alínea c) do Código dos Contratos Públicos",,,,,,Não aplicável.,Não aplicável.,FALSE
02/Cpr.18.380 – Artigos de Cimentação,Consulta Prévia,Aquisição de bens móveis,"33140000-3, Material médico de consumo","Centro Hospitalar do Tâmega e Sousa, E.P.E. (508318262)","ARTUR SALGADO, LDA (503612600)","32.880,00 €",01-02-2019,21-01-2019,365 dias,"Portugal<BR/>Portugal, Porto, Amarante<BR/>Portugal, Porto, Penafiel","Artigo 20.º, n.º 1, alínea c) do Código dos Contratos Públicos",,,,,,Não aplicável.,Não aplicável.,FALSE
