Objeto do Contrato,Tipo de Procedimento,Tipo(s) de Contrato,CPVs,Entidade(s) Adjudicante(s),Entidade(s) Adjudicatária(s),Preço Contratual,Data de Publicação,Data de Celebração do Contrato,Prazo de Execução,Local de Execução,Fundamentação,Data de Fecho do Contrato,Preço Total Efetivo,Causas das Alterações ao Prazo,Causas das Alterações ao Preço,Estado,N.º registo do Acordo Quadro,Descrição do Acordo Quadro,Procedimento Centralizado
"Aquisição de  Prestação de Serviços de Apoio ao Nível de Gestão e Estruturação do IPST, IP",Ajuste Direto Regime Geral,Aquisição de serviços,"71300000-1, Serviços de engenharia","Instituto Português do Sangue e da Transplantação, I. P. (502423943)",Artur  Jorge Laginha Paraíso  (174837925),"28.512,00 €",16-09-2014,28-04-2014,365 dias,"Portugal, Lisboa, Lisboa<BR/>Portugal, Coimbra, Coimbra<BR/>Portugal, Porto, Porto","Artigo 20.º, n.º 1, alínea a) do Código dos Contratos Públicos",,,,,,Não aplicável.,Não aplicável.,FALSE
Aquisição de Reagentes para o Lab. de doenças Transmissíveis do CST Porto,Ajuste Direto Regime Geral,Aquisição de bens móveis,"33696200-7, Reagentes para análises ao sangue","Instituto Português do Sangue e da Transplantação, I. P. (502423943)","Bio Rad Laboratories, Lda (501301321)","18.384,44 €",16-09-2014,03-09-2014,120 dias,"Portugal, Porto, Porto","Artigo 20.º, n.º 1, alínea a) do Código dos Contratos Públicos",,,,,,Não aplicável.,Não aplicável.,FALSE
Aquisição de Prestação de Serviços de Assessoria Jurídica ao IPST,Ajuste Direto Regime Geral,Aquisição de serviços,"79111000-5, Serviços de assessoria jurídica","Instituto Português do Sangue e da Transplantação, I. P. (502423943)",Rui Miguel Varela Gonçalves (204250110),"13.500,00 €",16-09-2014,06-05-2014,240 dias,"Portugal, Lisboa, Lisboa","Artigo 20.º, n.º 1, alínea a) do Código dos Contratos Públicos",,,,,,Não aplicável.,Não aplicável.,FALSE
Aquisição de prestação de serviços de seguro automóvel para frota automóvel,Ao abrigo de acordo-quadro (art.º 259.º),Aquisição de serviços,"66514110-0, Serviços de seguro automóvel","Direção-Geral da Saúde (600037100), Instituto Português do Sangue e da Transplantação, I.P. (502423943), Inspeção-Geral das Atividades em Saúde (600018857), Infarmed - Autoridade Nacional do Medicamento e Produtos de Saúde, I.P. (600037002), Administração Central do Sistema de Saúde, I.P. (508188423), Serviço de Intervenção nos Comportamentos Aditivos e nas Dependências (600084884), Administração Regional de Saúde Algarve, I.P. (503148709), Secretaria-Geral do Ministério da Saúde (600080684), Administração Regional de Saúde Centro, I.P. (503122165), Administração Regional de Saúde Alentejo, I.P. (503148768), Administração Regional de Saúde Norte, I.P. (503135593)","Macif Portugal - Companhia de Seguros, SA (503640549)","1.833,86 €",12-09-2014,29-01-2013,365 dias,"Portugal, Lisboa, Lisboa",Artigo 259.º do Código dos Contratos Públicos,,,,,,181477,Concurso limitado por prévia qualificação para a celebração de acordo quadro para a prestação do serviço de seguro automóvel.,TRUE
Prestação de Serviços de Consultadoria na área de Comunicação e Imprensa do IPST,Ajuste Direto Regime Geral,Aquisição de serviços,"79341100-7, Serviços de consultoria em matéria de publicidade","Instituto Português do Sangue e da Transplantação, I. P. (502423943)",Diamantino Rui Da Silva Cabanas (150367724),"16.488,00 €",12-09-2014,13-05-2014,240 dias,"Portugal, Lisboa, Lisboa","Artigo 20.º, n.º 1, alínea a) do Código dos Contratos Públicos",,,,,,Não aplicável.,Não aplicável.,FALSE
"Prestação de Serviços de Gestão de Resíduos dos Grupos III,IV e Líquidos do IPST",Ajuste Direto Regime Geral,Aquisição de serviços,"90513500-1, Tratamento e eliminação de líquidos residuais","Instituto Português do Sangue e da Transplantação, I. P. (502423943)","Ambimed - Gestão Ambiental, Lda  (503593427)","56.454,06 €",12-09-2014,26-06-2014,365 dias,"Portugal, Porto, Porto<BR/>Portugal, Lisboa, Lisboa<BR/>Portugal, Coimbra, Coimbra","Artigo 27.º, n.º 1, alínea a) do Código dos Contratos Públicos",,,,,,Não aplicável.,Não aplicável.,FALSE
Aquisição de serviços de consultadoria de t´cnico oficial de contas do IPST,Ajuste Direto Regime Geral,Aquisição de serviços,"79212300-6, Serviços de revisão legal de contas","Instituto Português do Sangue e da Transplantação, I. P. (502423943)",João Manuel Rolo de Oliveira (179470604),"14.010,00 €",12-09-2014,01-04-2014,365 dias,"Portugal, Lisboa, Lisboa","Artigo 20.º, n.º 1, alínea a) do Código dos Contratos Públicos",,,,,,Não aplicável.,Não aplicável.,FALSE
Aquisição de serviços de consultadoria na área de engenharia do IPST,Ajuste Direto Regime Geral,Aquisição de serviços,"71318000-0, Serviços de consultoria e assessoria em matéria de engenharia","Instituto Português do Sangue e da Transplantação, I. P. (502423943)","Cofiplan - Gestão e Coordenação e Fiscalização, Lda (503924440)","13.196,16 €",12-09-2014,19-03-2014,180 dias,"Portugal, Lisboa, Lisboa","Artigo 20.º, n.º 1, alínea a) do Código dos Contratos Públicos",,,,,,Não aplicável.,Não aplicável.,FALSE
Aquisição de papel para fotocópia e impressão,Ao abrigo de acordo-quadro (art.º 259.º),Aquisição de bens móveis,"30197630-1, Papel para impressão","Administração Regional de Saúde de Lisboa e Vale do Tejo, I. P. (503148776), Serviço de Intervenção nos Comportamentos Aditivos e nas Dependências (600084884), Inspeção-Geral das Atividades em Saúde (600018857), Secretaria-Geral do Ministério da Saúde (600080684), Administração Regional de Saúde do Alentejo, I. P. - SNCP (503148768), Instituto Nacional de Saúde Dr. Ricardo Jorge, I. P. (501427511), Instituto Português do Sangue e da Transplantação, I.P. (502423943), Direção-Geral da Saúde (600037100), Instituto Nacional de Emergência Médica, I.P. (501356126), Administração Regional de Saúde Algarve, I.P. (503148709), Administração Regional de Saúde do Centro, I. P. (503122165), INFARMED - Autoridade Nacional do Medicamento e Produtos de Saúde, I. P. (600037002), Administração Regional de Saúde do Norte, I. P. (503135593), Administração Central do Sistema de Saúde, I. P. (508188423)","Staples Portuigal, Equipamento de Escritório, S.A. (503789372)","2.327,85 €",12-09-2014,15-01-2013,350 dias,"Portugal, Lisboa, Lisboa",Artigo 259.º do Código dos Contratos Públicos,,,,,,-406976964,"CP 2013/47 - CONCURSO PÚBLICO PARA A CELEBRAÇÃO DE CONTRATOS PÚBLICOS DE APROVISIONAMENTO PARA A ÁREA DA SAÚDE, COM VISTA AO FORNECIMENTO DE MEDICAMENTOS DE CONSUMO GERAL - APARELHO LOCOMOTOR",TRUE
Reagente para o Laboratório Imunohematologia,Ajuste Direto Regime Geral,Aquisição de bens móveis,"33696200-7, Reagentes para análises ao sangue","Instituto Português do Sangue e da Transplantação, I. P. (502423943)",OCD Clinical Diagnosticos Portugal (513032665),"7.500,00 €",12-09-2014,10-09-2014,120 dias,"Portugal, Faro, Faro","Artigo 20.º, n.º 1, alínea a) do Código dos Contratos Públicos",,,,,,Não aplicável.,Não aplicável.,FALSE
Aquisição de economato,Ao abrigo de acordo-quadro (art.º 259.º),Aquisição de bens móveis,"30190000-7, Equipamento e material de escritório diverso","Instituto Português do Sangue e da Transplantação, I.P. (502423943), Infarmed - Autoridade Nacional do Medicamento e Produtos de Saúde, I.P (600037002), Secretaria-Geral do Ministério da Saúde (600080684), Direção-Geral da Saúde (600037100), Serviço de Intervenção nos Comportamentos Aditivos e nas Dependências (600084884), Administração Regional de Saúde Alentejo, I.P.  (503148768), Instituto Nacional de Emergência Médica, I.P. (501356126), Administração Regional de Saúde Algarve, I.P. (503148709), Administração Regional de Saúde Norte, I.P. (503135593)","Olmar - Artigos de papelaria, Lda (508831989)","1.023,49 €",11-09-2014,02-09-2013,122 dias,"Portugal, Lisboa, Lisboa",Artigo 259.º do Código dos Contratos Públicos,,,,,,600257,Concurso limitado por prévia qualificação para a celebração de Acordo Quadro para o fornecimento de bens de  mobiliário.,TRUE
Aquisição de Reagente p/ Qualidade HCV PCR Para o Lab. Doenças Transmissíveis do CST Porto,Ajuste Direto Regime Geral,Aquisição de bens móveis,"33696200-7, Reagentes para análises ao sangue","Instituto Português do Sangue e da Transplantação, I. P. (502423943)","Roche Sistemas de Diagnósticos, Lda (504282921)","18.576,00 €",11-09-2014,03-09-2014,120 dias,"Portugal, Porto, Porto","Artigo 20.º, n.º 1, alínea a) do Código dos Contratos Públicos",,,,,,Não aplicável.,Não aplicável.,FALSE
