Objeto do Contrato,Tipo de Procedimento,Tipo(s) de Contrato,CPVs,Entidade(s) Adjudicante(s),Entidade(s) Adjudicatária(s),Preço Contratual,Data de Publicação,Data de Celebração do Contrato,Prazo de Execução,Local de Execução,Fundamentação,Data de Fecho do Contrato,Preço Total Efetivo,Causas das Alterações ao Prazo,Causas das Alterações ao Preço,Estado,N.º registo do Acordo Quadro,Descrição do Acordo Quadro,Procedimento Centralizado
Aquisição de Central telefónica CS Vila de Rei,Ajuste Direto Regime Geral,Aquisição de bens móveis,"32551200-2, Centrais telefónicas","Unidade Local de Saúde de Castelo Branco, E.P.E. (509309844)","GONKSYS, S.A. (510874169)","5.409,19 €",21-03-2016,27-01-2016,10 dias,"Portugal, Castelo Branco, Castelo Branco","Artigo 20.º, n.º 1, alínea a) do Código dos Contratos Públicos",15-03-2016,"5.409,19 €",,"",,Não aplicável.,Não aplicável.,FALSE
Instrumental cirurgico para caixas de cirurgia de Ortopedia,Ajuste Direto Regime Geral,Aquisição de bens móveis,"33169000-2, Material cirúrgico","Unidade Local de Saúde de Castelo Branco, E.P.E. (509309844)","SPECULUM-ARTIGOS MEDICOS, LDA (502996323)","10.058,12 €",21-03-2016,08-01-2016,20 dias,"Portugal, Castelo Branco, Castelo Branco","Artigo 20.º, n.º 1, alínea a) do Código dos Contratos Públicos",14-06-2016,"10.058,12 €",,"",,Não aplicável.,Não aplicável.,FALSE
"Prestação de Serviços de Lavagem, Tratamento e Fornecimento de Roupa Hospitalar em Regime de Aluguer para o estabelecimento Hospitalar da ULSCB, EPE, durante o ano de 2016",Concurso público,Aquisição de serviços,"98311000-6, Serviços de recolha de roupa por lavandarias","Unidade Local de Saúde de Castelo Branco, E. P. E. (509309844)",SUCH - DIRECÇÃO REGIONAL DO CENTRO (500900469),"297.000,00 €",17-03-2016,18-02-2016,365 dias,"Portugal, Castelo Branco, Castelo Branco","Artigo 20.º, n.º 1, alínea b) do Código dos Contratos Públicos",31-12-2016,"261.390,28 €",,Quantidade inferior à estimada,,Não aplicável.,Não aplicável.,FALSE
Prestação de Serviços de Manutenção de Centrais Telefónicas,Ajuste Direto Regime Geral,Aquisição de serviços,"50334110-9, Serviços de manutenção de redes telefónicas","Unidade Local de Saúde de Castelo Branco, E.P.E. (509309844)","GONKSYS, S.A. (510874169)","12.131,28 €",16-03-2016,09-03-2016,365 dias,"Portugal, Castelo Branco, Castelo Branco","Artigo 20.º, n.º 1, alínea a) do Código dos Contratos Públicos",31-12-2016,"11.767,35 €",,Reduções remuneratórias nos termos do exigido no OE2016,,Não aplicável.,Não aplicável.,FALSE
