freguesia,acronym,validVotesPercentage,votes,dicofre
União das freguesias de Vila Nova de Famalicão e Calendário,PPD/PSD.CDS-PP,36.03,2192,031260
União das freguesias de Vila Nova de Famalicão e Calendário,PS,33.53,2040,031260
União das freguesias de Vila Nova de Famalicão e Calendário,MPT,9.12,555,031260
União das freguesias de Vila Nova de Famalicão e Calendário,PCP-PEV,8.04,489,031260
União das freguesias de Vila Nova de Famalicão e Calendário,B.E.,4.7,286,031260
União das freguesias de Vila Nova de Famalicão e Calendário,L,2.37,144,031260
União das freguesias de Vila Nova de Famalicão e Calendário,PAN,1.76,107,031260
União das freguesias de Vila Nova de Famalicão e Calendário,PCTP/MRPP,1.71,104,031260
União das freguesias de Vila Nova de Famalicão e Calendário,PTP,0.54,33,031260
União das freguesias de Vila Nova de Famalicão e Calendário,PPM,0.46,28,031260
União das freguesias de Vila Nova de Famalicão e Calendário,PND,0.41,25,031260
União das freguesias de Vila Nova de Famalicão e Calendário,PNR,0.36,22,031260
União das freguesias de Vila Nova de Famalicão e Calendário,MAS,0.33,20,031260
União das freguesias de Vila Nova de Famalicão e Calendário,PPV,0.31,19,031260
União das freguesias de Vila Nova de Famalicão e Calendário,PDA,0.16,10,031260
União das freguesias de Vila Nova de Famalicão e Calendário,POUS,0.16,10,031260
