freguesia,acronym,validVotesPercentage,votes,dicofre
Água Longa,PPD/PSD.CDS-PP,44.36,299,131402
Água Longa,PS,30.12,203,131402
Água Longa,MPT,6.68,45,131402
Água Longa,PCP-PEV,5.64,38,131402
Água Longa,B.E.,3.86,26,131402
Água Longa,L,1.93,13,131402
Água Longa,PAN,1.63,11,131402
Água Longa,PCTP/MRPP,1.34,9,131402
Água Longa,PPM,1.19,8,131402
Água Longa,PND,1.04,7,131402
Água Longa,PTP,0.89,6,131402
Água Longa,PNR,0.74,5,131402
Água Longa,MAS,0.59,4,131402
Água Longa,PDA,0,0,131402
Água Longa,POUS,0,0,131402
Água Longa,PPV,0,0,131402
