freguesia,acronym,validVotesPercentage,votes,dicofre
Amor,PS,32.38,374,100901
Amor,PPD/PSD,24.85,287,100901
Amor,B.E.,10.48,121,100901
Amor,CDS-PP,10.48,121,100901
Amor,PAN,5.63,65,100901
Amor,PCP-PEV,4.07,47,100901
Amor,L,2.86,33,100901
Amor,A,2.77,32,100901
Amor,PPM.PPV/CDC,1.65,19,100901
Amor,NC,1.3,15,100901
Amor,PURP,0.78,9,100901
Amor,PCTP/MRPP,0.69,8,100901
Amor,PDR,0.69,8,100901
Amor,IL,0.61,7,100901
Amor,PNR,0.52,6,100901
Amor,PTP,0.17,2,100901
Amor,MAS,0.09,1,100901
