Objeto do Contrato,Tipo de Procedimento,Tipo(s) de Contrato,CPVs,Entidade(s) Adjudicante(s),Entidade(s) Adjudicatária(s),Preço Contratual,Data de Publicação,Data de Celebração do Contrato,Prazo de Execução,Local de Execução,Fundamentação,Data de Fecho do Contrato,Preço Total Efetivo,Causas das Alterações ao Prazo,Causas das Alterações ao Preço,Estado,N.º registo do Acordo Quadro,Descrição do Acordo Quadro,Procedimento Centralizado
Aquisição de consultoria para a definição de Plano Estratégico da Linha de Serviços Transversais Hospitalar e Cuidados de Saúde,Ajuste Direto Regime Geral,Aquisição de serviços,"72232000-0, Desenvolvimento de software de processamento de transacções e de software à medida","SPMS - Serviços Partilhados do Ministério da Saúde, E. P. E. (509540716)","Pyramid It Architects, SL (B8556754)","9.450,00 €",20-03-2015,05-02-2015,49 dias,"Portugal, Lisboa, Lisboa<BR/>Portugal, Porto, Porto","Artigo 20.º, n.º 1, alínea a) do Código dos Contratos Públicos","","",,"",,Não aplicável.,Não aplicável.,FALSE
"Aquisição de serviços em """"outsourcing"""" das infraestruturas de telecomunicações (RIS)",Ajuste Direto Regime Geral,Aquisição de serviços,"72700000-7, Serviços de rede informática","SPMS - Serviços Partilhados do Ministério da Saúde, E. P. E. (509540716)","Onitelecom - Infocomunicações, S. A. (504073206)","3.480.000,00 €",17-03-2015,23-12-2014,182 dias,Portugal,"Artigo 24.º, n.º 1, alínea e) do Código dos Contratos Públicos",30-06-2015,"3.471.214,69 €",,Consumo efetivo,,Não aplicável.,Não aplicável.,FALSE
Aquisição de serviços de consultoria,Ajuste Direto Regime Geral,Aquisição de serviços,"73220000-0, Serviços de consultoria em matéria de desenvolvimento","SPMS - Serviços Partilhados do Ministério da Saúde, E. P. E. (509540716)","Pricewaterhousecoopers / AG - Acessoria de Gestão, Lda. (504193279)","49.800,00 €",17-03-2015,23-02-2015,90 dias,Portugal,"Artigo 20.º, n.º 1, alínea a) do Código dos Contratos Públicos","","",,"",,Não aplicável.,Não aplicável.,FALSE
Aquisição de outsourcing de infraestruturas FHS,Ajuste Direto Regime Geral,Aquisição de serviços,"50334400-9, Serviços de manutenção de sistemas de comunicações","SPMS - Serviços Partilhados do Ministério da Saúde, E. P. E. (509540716)","Timegarden, Lda. (510354939)","34.934,00 €",11-03-2015,11-02-2015,365 dias,Portugal,"Artigo 20.º, n.º 1, alínea a) do Código dos Contratos Públicos",31-12-2015,"34.934,00 €",,"",,Não aplicável.,Não aplicável.,FALSE
