Objeto do Contrato,Tipo de Procedimento,Tipo(s) de Contrato,CPVs,Entidade(s) Adjudicante(s),Entidade(s) Adjudicatária(s),Preço Contratual,Data de Publicação,Data de Celebração do Contrato,Prazo de Execução,Local de Execução,Fundamentação,Data de Fecho do Contrato,Preço Total Efetivo,Causas das Alterações ao Prazo,Causas das Alterações ao Preço,Estado,N.º registo do Acordo Quadro,Descrição do Acordo Quadro,Procedimento Centralizado
Aquisição de Serviços de Segurança,Ajuste Direto Regime Geral,Aquisição de serviços,"79710000-4, Serviços de segurança",Hospital Prof. Doutor Fernando Fonseca E.P.E. (503035416),"PROSEGUR, LDA (501290567)","383.082,84 €",10-12-2018,15-10-2018,181 dias,"Portugal, Lisboa, Amadora","Artigo 24.º, n.º 1, alínea c) do Código dos Contratos Públicos",,,,,,Não aplicável.,Não aplicável.,FALSE
Aquisição de Relatórios de Exames através de Telerradiologia,Ajuste Direto Regime Geral,Aquisição de serviços,"85150000-5, Serviços de imagiologia médica",Hospital Prof. Doutor Fernando Fonseca E.P.E. (503035416),"Dr. Campos Costa – Consultório de Tomografia Computorizada, S.A. (502082429)","67.998,50 €",07-12-2018,04-05-2017,120 dias,"Portugal, Lisboa, Amadora","Artigo 24.º, n.º 1, alínea c) do Código dos Contratos Públicos",,,,,,Não aplicável.,Não aplicável.,FALSE
Contrato de Manutenção para os Equipamentos de Medição Radiológica da Medical Consult. Para o ano 2018,Ajuste Direto Regime Geral,Aquisição de serviços,"50000000-5, Serviços de reparação e manutenção","Hospital Professor Doutor Fernando Fonseca, E. P. E. (503035416)","MedicalConsult, Sociedade Unipessoal, Lda. (504092138)","9.948,00 €",03-12-2018,03-12-2018,365 dias,"Portugal, Lisboa, Amadora","Artigo 24.º, n.º 1, alínea e), subalínea ii) do Código dos Contratos Públicos",,,,,,Não aplicável.,Não aplicável.,FALSE
