Objeto do Contrato,Tipo de Procedimento,Tipo(s) de Contrato,CPVs,Entidade(s) Adjudicante(s),Entidade(s) Adjudicatária(s),Preço Contratual,Data de Publicação,Data de Celebração do Contrato,Prazo de Execução,Local de Execução,Fundamentação,Data de Fecho do Contrato,Preço Total Efetivo,Causas das Alterações ao Prazo,Causas das Alterações ao Preço,Estado,N.º registo do Acordo Quadro,Descrição do Acordo Quadro,Procedimento Centralizado
Topiramato 50 mg - comp Glatiramero 20 Mg/Ml -1 Ml -Amp.,Ajuste Direto Regime Geral,Aquisição de bens móveis,"33600000-6, Produtos farmacêuticos","Unidade Local de Saúde de Castelo Branco, E. P. E. (509309844)","TEVA PHARMA,PROD.FARMACEUT.LDA (507045491)","5.015,08 €",31-05-2013,05-04-2013,30 dias,"Portugal, Castelo Branco, Castelo Branco","Artigo 26.º, n.º 1, alínea e) do Código dos Contratos Públicos",08-04-2013,"5.015,08 €",,,,Não aplicável.,Não aplicável.,
Factor VIII Octocog Alfa 2000U.I.- pó sol. inj. IV,Ajuste Direto Regime Geral,Aquisição de bens móveis,"33600000-6, Produtos farmacêuticos","Unidade Local de Saúde de Castelo Branco, E. P. E. (509309844)","BAXTER MEDICO-FARMACEUTICA,L (503347345)","21.408,00 €",31-05-2013,02-04-2013,30 dias,"Portugal, Castelo Branco, Castelo Branco","Artigo 26.º, n.º 1, alínea e) do Código dos Contratos Públicos",05-04-2013,"21.408,00 €",,,,Não aplicável.,Não aplicável.,
Linezolida 600 mg comp,Ajuste Direto Regime Geral,Aquisição de bens móveis,"33600000-6, Produtos farmacêuticos","Unidade Local de Saúde de Castelo Branco, E. P. E. (509309844)","LABORATORIOS PFIZER,LDA (500162166)","4.474,10 €",31-05-2013,22-03-2013,30 dias,"Portugal, Castelo Branco, Castelo Branco","Artigo 26.º, n.º 1, alínea e) do Código dos Contratos Públicos",23-04-2013,"4.474,10 €",,,,Não aplicável.,Não aplicável.,
"Infliximab 100 mg, IV - Amp.",Ajuste Direto Regime Geral,Aquisição de bens móveis,"33600000-6, Produtos farmacêuticos","Unidade Local de Saúde de Castelo Branco, E. P. E. (509309844)","MERCK SHARP & DOHME,LDA (500191360)","13.758,40 €",30-05-2013,22-03-2013,30 dias,"Portugal, Castelo Branco, Castelo Branco","Artigo 26.º, n.º 1, alínea e) do Código dos Contratos Públicos",25-03-2013,"13.758,40 €",,,,Não aplicável.,Não aplicável.,
SUNITINIB 25 MG - CAPS SUNITINIB 50 MG - CAPS,Ajuste Direto Regime Geral,Aquisição de bens móveis,"33600000-6, Produtos farmacêuticos","Unidade Local de Saúde de Castelo Branco, E. P. E. (509309844)","LABORATORIOS PFIZER,LDA (500162166)","7.139,98 €",30-05-2013,21-03-2013,30 dias,"Portugal, Castelo Branco, Castelo Branco","Artigo 26.º, n.º 1, alínea e) do Código dos Contratos Públicos",22-03-2013,"7.139,98 €",,,,Não aplicável.,Não aplicável.,
Factor Anti hemofi. 1000 u. (factor Vlll),Ajuste Direto Regime Geral,Aquisição de bens móveis,"33600000-6, Produtos farmacêuticos","Unidade Local de Saúde de Castelo Branco, E. P. E. (509309844)","BAXTER MEDICO-FARMACEUTICA,L (503347345)","8.028,00 €",29-05-2013,20-03-2013,30 dias,"Portugal, Castelo Branco, Castelo Branco","Artigo 26.º, n.º 1, alínea e) do Código dos Contratos Públicos",22-03-2013,"8.028,00 €",,,,Não aplicável.,Não aplicável.,
Interferao Beta 1 B - 8 milhoes -Serin.,Ajuste Direto Regime Geral,Aquisição de bens móveis,"33600000-6, Produtos farmacêuticos","Unidade Local de Saúde de Castelo Branco, E. P. E. (509309844)","NOVARTIS FARMA,S.A (500063524)","8.820,85 €",29-05-2013,17-04-2013,30 dias,"Portugal, Castelo Branco, Castelo Branco","Artigo 26.º, n.º 1, alínea e) do Código dos Contratos Públicos",18-04-2013,"8.820,85 €",,,,Não aplicável.,Não aplicável.,
ETANERCEPT 50 MG/1 ML( caneta ),Ajuste Direto Regime Geral,Aquisição de bens móveis,"33600000-6, Produtos farmacêuticos","Unidade Local de Saúde de Castelo Branco, E. P. E. (509309844)","LABORATORIOS PFIZER,LDA (500162166)","17.523,40 €",29-05-2013,15-04-2013,30 dias,"Portugal, Castelo Branco, Castelo Branco","Artigo 26.º, n.º 1, alínea e) do Código dos Contratos Públicos",17-04-2013,"17.523,40 €",,,,Não aplicável.,Não aplicável.,
Sugamadex 100 mg/ml sol. inj Fr de 2ml,Ajuste Direto Regime Geral,Aquisição de bens móveis,"33600000-6, Produtos farmacêuticos","Unidade Local de Saúde de Castelo Branco, E. P. E. (509309844)","MERCK SHARP & DOHME,LDA (500191360)","9.336,00 €",28-05-2013,15-04-2013,30 dias,"Portugal, Castelo Branco, Castelo Branco","Artigo 24.º, n.º 1, alínea e) do Código dos Contratos Públicos",20-05-2013,"9.336,00 €",,,,Não aplicável.,Não aplicável.,
Linezolida 600 mg/300ml sol inj saco 300 ml IV,Ajuste Direto Regime Geral,Aquisição de bens móveis,"33600000-6, Produtos farmacêuticos","Unidade Local de Saúde de Castelo Branco, E. P. E. (509309844)","LABORATORIOS PFIZER,LDA (500162166)","10.498,00 €",28-05-2013,23-04-2013,60 dias,"Portugal, Castelo Branco, Castelo Branco","Artigo 26.º, n.º 1, alínea e) do Código dos Contratos Públicos",21-05-2013,"10.498,00 €",,,,Não aplicável.,Não aplicável.,
Aquisição de serviços de software Reporting aos Médicos,Ajuste Direto Regime Geral,Aquisição de serviços,"72268000-1, Serviços de fornecimento de software","Unidade Local de Saúde de Castelo Branco, E. P. E. (509309844)","NIMBLE PORTAL -SERVIÇOS  E CONSULTORIA GESTÃO, LDA (510308759)","9.000,00 €",27-05-2013,08-04-2013,365 dias,"Portugal, Castelo Branco, Castelo Branco","Artigo 20.º, n.º 1, alínea a) do Código dos Contratos Públicos",04-07-2013,"9.000,00 €",,,,Não aplicável.,Não aplicável.,
Factor VIII Octocog Alfa 2000U.I.- pó sol. inj. IV,Ajuste Direto Regime Geral,Aquisição de bens móveis,"33600000-6, Produtos farmacêuticos","Unidade Local de Saúde de Castelo Branco, E. P. E. (509309844)","BAXTER MEDICO-FARMACEUTICA,L (503347345)","26.760,00 €",27-05-2013,29-04-2013,30 dias,"Portugal, Castelo Branco, Castelo Branco","Artigo 26.º, n.º 1, alínea e) do Código dos Contratos Públicos",02-05-2013,"26.760,00 €",,,,Não aplicável.,Não aplicável.,
Factor Anti hemofi. 1000 u. (factor Vlll),Ajuste Direto Regime Geral,Aquisição de bens móveis,"33600000-6, Produtos farmacêuticos","Unidade Local de Saúde de Castelo Branco, E. P. E. (509309844)","BAXTER MEDICO-FARMACEUTICA,L (503347345)","10.035,00 €",27-05-2013,29-04-2013,30 dias,"Portugal, Castelo Branco, Castelo Branco","Artigo 26.º, n.º 1, alínea e) do Código dos Contratos Públicos",02-05-2013,"10.035,00 €",,,,Não aplicável.,Não aplicável.,
Aquisição de Factor Anti hemofi. 1000 u. (factor Vlll),Ajuste Direto Regime Geral,Aquisição de bens móveis,"33600000-6, Produtos farmacêuticos","Unidade Local de Saúde de Castelo Branco, E. P. E. (509309844)","BAXTER MEDICO-FARMACEUTICA,L (503347345)","10.035,00 €",27-05-2013,22-04-2013,30 dias,"Portugal, Castelo Branco, Castelo Branco","Artigo 26.º, n.º 1, alínea e) do Código dos Contratos Públicos",26-04-2013,"10.035,00 €",,,,Não aplicável.,Não aplicável.,
"Aquisição de Antitripsina Alfa-1 - 1000mg, sol. inj.",Ajuste Direto Regime Geral,Aquisição de bens móveis,"33600000-6, Produtos farmacêuticos","Unidade Local de Saúde de Castelo Branco, E. P. E. (509309844)","GRIFOLS PORTUGAL,LDA. (502041285)","6.400,00 €",27-05-2013,22-04-2013,30 dias,"Portugal, Castelo Branco, Castelo Branco","Artigo 24.º, n.º 1, alínea e) do Código dos Contratos Públicos",24-04-2013,"6.400,00 €",,,,Não aplicável.,Não aplicável.,
Repearação de TAC,Ajuste Direto Regime Geral,Aquisição de serviços,"50421200-4, Serviços de reparação e manutenção de equipamentos de raios X","Unidade Local de Saúde de Castelo Branco, E. P. E. (509309844)","SIEMENS,SA (500247480)","61.200,00 €",27-05-2013,10-04-2013,30 dias,"Portugal, Castelo Branco, Castelo Branco","Artigo 26.º, n.º 1, alínea a) do Código dos Contratos Públicos",22-04-2013,"61.200,00 €",,,,Não aplicável.,Não aplicável.,
Ren.da licença software do SGTD,Ajuste Direto Regime Geral,Aquisição de serviços,"72268000-1, Serviços de fornecimento de software","Unidade Local de Saúde de Castelo Branco, E. P. E. (509309844)",LINK CONSULTING - TECNOLOGIAS DE INFORMAÇÃO (504551221),"7.500,00 €",27-05-2013,10-04-2013,30 dias,"Portugal, Castelo Branco, Castelo Branco","Artigo 24.º, n.º 1, alínea e) do Código dos Contratos Públicos",22-04-2013,"7.500,00 €",,,,Não aplicável.,Não aplicável.,
"Aquisição de Infliximab 100 mg, IV - Amp.",Ajuste Direto Regime Geral,Aquisição de bens móveis,"33600000-6, Produtos farmacêuticos","Unidade Local de Saúde de Castelo Branco, E. P. E. (509309844)","MERCK SHARP & DOHME,LDA (500191360)","11.807,36 €",27-05-2013,15-04-2013,30 dias,"Portugal, Castelo Branco, Castelo Branco","Artigo 20.º, n.º 1, alínea a) do Código dos Contratos Públicos",18-04-2013,"11.807,36 €",,,,Não aplicável.,Não aplicável.,
