Objeto do Contrato,Tipo de Procedimento,Tipo(s) de Contrato,CPVs,Entidade(s) Adjudicante(s),Entidade(s) Adjudicatária(s),Preço Contratual,Data de Publicação,Data de Celebração do Contrato,Prazo de Execução,Local de Execução,Fundamentação,Data de Fecho do Contrato,Preço Total Efetivo,Causas das Alterações ao Prazo,Causas das Alterações ao Preço,Estado,N.º registo do Acordo Quadro,Descrição do Acordo Quadro,Procedimento Centralizado
Aquisição de cinco Equipamentos de tosse mecanicamente assistida para o Serviço de UGI Pediátrica do CHUC.,Consulta Prévia,Aquisição de bens móveis,"31000000-6, Maquinaria, aparelhagem, equipamento e consumíveis eléctricos; iluminação","Centro Hospitalar e Universitário de Coimbra, E. P. E. (510103448)",Teprel (502262184),"30.000,00 €",30-11-2018,10-07-2018,30 dias,"Portugal, Coimbra, Coimbra","Artigo 20.º, n.º 1, alínea c) do Código dos Contratos Públicos","","","","",,Não aplicável.,Não aplicável.,FALSE
Aquisição de Data Loggers para o Serviço de Nefrologia do pólo HG,Consulta Prévia,Aquisição de bens móveis,"31000000-6, Maquinaria, aparelhagem, equipamento e consumíveis eléctricos; iluminação","Centro Hospitalar e Universitário de Coimbra, E. P. E. (510103448)",Supplylab (508453534),"444,00 €",30-11-2018,20-06-2018,30 dias,"Portugal, Coimbra, Coimbra","Artigo 20.º, n.º 1, alínea c) do Código dos Contratos Públicos","","","","",,Não aplicável.,Não aplicável.,FALSE
Implante coclear c/ feixe de eléctrodos longo,Ajuste Direto Regime Geral,Aquisição de bens móveis,"33000000-0, Equipamento médico, medicamentos e produtos para cuidados pessoais","Centro Hospitalar e Universitário de Coimbra, E. P. E. (510103448)",Med-el Portugal (980362539),"24.882,19 €",30-11-2018,30-11-2018,20 dias,"Portugal, Coimbra, Coimbra","Artigo 24.º, n.º 1, alínea e), subalínea ii) do Código dos Contratos Públicos",30-11-2018,"24.882,19 €","","",,Não aplicável.,Não aplicável.,FALSE
040224462018 - OUTRO MATERIAL DE CONSUMO CLINICO * Lâmina para Máquina Tricotomia,Ajuste Direto Regime Geral,Aquisição de bens móveis,"33000000-0, Equipamento médico, medicamentos e produtos para cuidados pessoais","Centro Hospitalar e Universitário de Coimbra, E. P. E. (510103448)","BECTON DICKINSON PORTUGAL UNIPESSOAL, LDA (514239743)","9.500,00 €",30-11-2018,12-10-2018,60 dias,"Portugal, Coimbra, Coimbra","Artigo 24.º, n.º 1, alínea e), subalínea ii) do Código dos Contratos Públicos","","","","",,Não aplicável.,Não aplicável.,FALSE
PROCEDIMENTO N.º 040150562017 - ÓXIDO DE ETILENO PARA ESTERILIZADOR STERIGAS 8XL,Ajuste Direto Regime Geral,Aquisição de bens móveis,"33698000-9, Produtos para fins clínicos","Centro Hospitalar e Universitário de Coimbra, E. P. E. (510103448)",3M ESPANA S.L. SUCURSAL EM PORTUGAL (980560241),"648,00 €",30-11-2018,16-11-2017,365 dias,"Portugal, Coimbra, Coimbra","Artigo 26.º, n.º 1, alínea a) do Código dos Contratos Públicos",29-12-2017,"648,00 €","","",,Não aplicável.,Não aplicável.,FALSE
040225652018 - OSTEOSSINTESE * Cavilhas ; Fios Guia; Sistema de Fixação da Coluna Dorso-Lombar,Ajuste Direto Regime Geral,Sociedade<br/>Aquisição de bens móveis,"33000000-0, Equipamento médico, medicamentos e produtos para cuidados pessoais","Centro Hospitalar e Universitário de Coimbra, E. P. E. (510103448)",Johnson & Johnson (500153370),"7.900,00 €",30-11-2018,30-10-2018,60 dias,"Portugal, Coimbra, Coimbra","Artigo 24.º, n.º 1, alínea e), subalínea ii) do Código dos Contratos Públicos","","","","",,Não aplicável.,Não aplicável.,FALSE
"040224962018 - OSTEOSINTESE * Fixadores Externos, Rótulas, Barras, Cravos Schanz e Steiman; Fios Guia e Kirschner; Placas; Parafusos de Bloqueio; Material de Coluna em Fracturas; Sistemas de Fixação da Coluna; Agulhas Percutâneas Transpedicular; Anilhas; cimento Osseo; Sistema Punção Injecção para Vertebroplastia e Espaçadores.",Ajuste Direto Regime Geral,Aquisição de bens móveis,"33000000-0, Equipamento médico, medicamentos e produtos para cuidados pessoais","Centro Hospitalar e Universitário de Coimbra, E. P. E. (510103448)",JOHNSON JOHNSON MEDICAL (500153370),"22.502,16 €",29-11-2018,24-10-2018,60 dias,"Portugal, Coimbra, Coimbra","Artigo 24.º, n.º 1, alínea e), subalínea ii) do Código dos Contratos Públicos","","","","",,Não aplicável.,Não aplicável.,FALSE
040225662018 - OSTEOSSINTESE *Material de Fixação da Coluna,Ajuste Direto Regime Geral,Aquisição de bens móveis,"33000000-0, Equipamento médico, medicamentos e produtos para cuidados pessoais","Centro Hospitalar e Universitário de Coimbra, E. P. E. (510103448)","MEDTRONIC PORTUGAL, LDA. (504223933)","12.418,85 €",29-11-2018,25-10-2018,60 dias,"Portugal, Coimbra, Coimbra","Artigo 24.º, n.º 1, alínea e), subalínea ii) do Código dos Contratos Públicos","","","","",,Não aplicável.,Não aplicável.,FALSE
040227472018 - OSTEOSINTESE *Material de Fixação da Coluna; Fios Guia; Cânula Trabalho Cifoplastia; Cimento Ósseo; Misturadora de Cimento para Cifoplastia; Adaptador Metálico para Seringa ,Ajuste Direto Regime Geral,Aquisição de bens móveis,"33000000-0, Equipamento médico, medicamentos e produtos para cuidados pessoais","Centro Hospitalar e Universitário de Coimbra, E. P. E. (510103448)","MEDTRONIC PORTUGAL, LDA (504223933)","13.793,50 €",29-11-2018,13-11-2018,60 dias,"Portugal, Coimbra, Coimbra","Artigo 24.º, n.º 1, alínea e), subalínea ii) do Código dos Contratos Públicos","","","","",,Não aplicável.,Não aplicável.,FALSE
"Aquisição de exames MCDT-RMN/Ecografia para utentes do CHUC, E.P.E",Concurso público,Aquisição de serviços,"85100000-0, Serviços de saúde","Centro Hospitalar e Universitário de Coimbra, E.P. (510103448)","DIATON (500972974), SANFIL (500621527)","9.217,00 €",28-11-2018,28-11-2018,61 dias,Portugal,"Artigo 20.º, n.º 1, alínea a) do Código dos Contratos Públicos","","","","",,Não aplicável.,Não aplicável.,FALSE
040227142018 - OUTRO MATERIAL DE CONSUMO CLINICO *Luvas de Nitrilo não esterilizadas,Ajuste Direto Regime Geral,Aquisição de bens móveis,"33000000-0, Equipamento médico, medicamentos e produtos para cuidados pessoais","Centro Hospitalar e Universitário de Coimbra, E. P. E. (510103448)",EZEQUIEL PANAO JORGE LDA      (501412727),"8.618,40 €",28-11-2018,15-11-2018,60 dias,"Portugal, Coimbra, Coimbra","Artigo 24.º, n.º 1, alínea e), subalínea ii) do Código dos Contratos Públicos","","","","",,Não aplicável.,Não aplicável.,FALSE
040223502018 - OUTRO MATERIAL DE CONSUMO CLÍNICO *kit Sistema para Introdução de Prótese (Introdutor de Prótese Biliar),Ajuste Direto Regime Geral,Aquisição de bens móveis,"33000000-0, Equipamento médico, medicamentos e produtos para cuidados pessoais","Centro Hospitalar e Universitário de Coimbra, E. P. E. (510103448)",BIOSONDA-COMERC MATERIAL HOSPITALAR (501463313),"7.400,00 €",28-11-2018,03-10-2018,60 dias,"Portugal, Coimbra, Coimbra","Artigo 24.º, n.º 1, alínea e), subalínea ii) do Código dos Contratos Públicos","","","","",,Não aplicável.,Não aplicável.,FALSE
Próteses do Joelho,Ajuste Direto Regime Geral,Aquisição de bens móveis,"33000000-0, Equipamento médico, medicamentos e produtos para cuidados pessoais","Centro Hospitalar e Universitário de Coimbra, E. P. E. (510103448)",STRYKER (504594214),"100.600,00 €",28-11-2018,27-08-2018,180 dias,"Portugal, Coimbra, Coimbra","Artigo 24.º, n.º 1, alínea e), subalínea ii) do Código dos Contratos Públicos","","","","",,Não aplicável.,Não aplicável.,FALSE
Próteses do Joelho,Ajuste Direto Regime Geral,Aquisição de bens móveis,"33000000-0, Equipamento médico, medicamentos e produtos para cuidados pessoais","Centro Hospitalar e Universitário de Coimbra, E. P. E. (510103448)",Stryker (504594214),"84.025,00 €",28-11-2018,29-09-2017,20 dias,"Portugal, Coimbra, Coimbra","Artigo 24.º, n.º 1, alínea e) do Código dos Contratos Públicos",29-12-2017,"78.980,60 €","",Valor final de acordo com o consumido.,,Não aplicável.,Não aplicável.,FALSE
Próteses de Anca,Ajuste Direto Regime Geral,Aquisição de bens móveis,"33000000-0, Equipamento médico, medicamentos e produtos para cuidados pessoais","Centro Hospitalar e Universitário de Coimbra, E. P. E. (510103448)",STRYKER (504594214),"78.926,86 €",28-11-2018,25-08-2017,20 dias,"Portugal, Coimbra, Coimbra","Artigo 24.º, n.º 1, alínea e) do Código dos Contratos Públicos",29-12-2017,"42.910,27 €","",Valor de acordo com o consumido.,,Não aplicável.,Não aplicável.,FALSE
040226292018 - OUTRO MATERIAL DE CONSUMO CLINICO * Sensor Monitorização Continua de Glicose A,Ajuste Direto Regime Geral,Aquisição de bens móveis,"33000000-0, Equipamento médico, medicamentos e produtos para cuidados pessoais","Centro Hospitalar e Universitário de Coimbra, E. P. E. (510103448)",MEDTRONIC PORTUGAL LDA (504223933),"9.375,00 €",28-11-2018,07-11-2018,180 dias,"Portugal, Coimbra, Coimbra","Artigo 24.º, n.º 1, alínea e), subalínea ii) do Código dos Contratos Públicos","","","","",,Não aplicável.,Não aplicável.,FALSE
Reparação Ecoendoscopio Pentax  S. Gastro. Polo HUC,Ajuste Direto Regime Geral,Aquisição de serviços,"50000000-5, Serviços de reparação e manutenção","Centro Hospitalar e Universitário de Coimbra, E. P. E. (510103448)","SISTEMAS INTEGRALES DE LA MEDICINA., S.A. (980488842)","6.813,00 €",28-11-2018,28-11-2018,30 dias,"Portugal, Coimbra, Coimbra","Artigo 20.º, n.º 1, alínea d) do Código dos Contratos Públicos","","","","",,Não aplicável.,Não aplicável.,FALSE
procedimento n.º 040150512017 -SOFOSBUVIR 400 MG + VELPATASVIR 100 MG COMP,Ajuste Direto Regime Geral,Aquisição de bens móveis,"33698000-9, Produtos para fins clínicos","Centro Hospitalar e Universitário de Coimbra, E. P. E. (510103448)","GILEAD SCIENCES, LDA. (503604704)","46.183,83 €",27-11-2018,19-12-2017,365 dias,"Portugal, Coimbra, Coimbra","Artigo 24.º, n.º 1, alínea e) do Código dos Contratos Públicos",29-12-2017,"46.183,83 €","","",,Não aplicável.,Não aplicável.,FALSE
procedimento n.º 040150382017 - SELEXIPAG 800 µG COMP,Ajuste Direto Regime Geral,Aquisição de bens móveis,"33698000-9, Produtos para fins clínicos","Centro Hospitalar e Universitário de Coimbra, E. P. E. (510103448)","ACTELION PHARMACEUTICALS PORTUGAL, LDA (507336488)","9.600,00 €",27-11-2018,24-11-2017,365 dias,"Portugal, Coimbra, Coimbra","Artigo 24.º, n.º 1, alínea e) do Código dos Contratos Públicos",29-12-2017,"9.600,00 €","","",,Não aplicável.,Não aplicável.,FALSE
Próteses Totais da anca - via micro invasiva,Ajuste Direto Regime Geral,Aquisição de bens móveis,"33000000-0, Equipamento médico, medicamentos e produtos para cuidados pessoais","Centro Hospitalar e Universitário de Coimbra, E. P. E. (510103448)",Artur Salgado (503612600),"41.150,00 €",27-11-2018,22-11-2018,20 dias,"Portugal, Coimbra, Coimbra","Artigo 24.º, n.º 1, alínea e), subalínea ii) do Código dos Contratos Públicos","","","","",,Não aplicável.,Não aplicável.,FALSE
procedimento n.º 040150172017 - INOTUZUMAB OZOGAMICINA 1 MG PÓ CONC SOL INJ FR IV,Ajuste Direto Regime Geral,Aquisição de bens móveis,"33698000-9, Produtos para fins clínicos","Centro Hospitalar e Universitário de Coimbra, E.P. (510103448)","Pfizer Biofarmaceutica, Sociedade Unipessoal Lda. (513300376)","68.089,00 €",27-11-2018,15-11-2017,365 dias,"Portugal, Coimbra, Coimbra","Artigo 24.º, n.º 1, alínea e) do Código dos Contratos Públicos",29-12-2017,"69.790,00 €","conforme informação de adjudicação """"no entanto, e de acordo com a proposta em anexo, verifica-se um aumento de preço unitário considerado inicialmente (9.727,00 €) para 9.970,00€, traduzindo-se na necessidade do aumento do valor da adjudicação em 243,00€ que, acrescido de IVA à taxa legal em vigor, perfaz 257,58€""""",correção do valor da adjudicação,,Não aplicável.,Não aplicável.,FALSE
procedimento n.º 040150162017 - RITUXIMAB 100 MG/10 ML SOL INJ FR 10 ML IV,Ajuste Direto Regime Geral,Aquisição de bens móveis,"33698000-9, Produtos para fins clínicos","Centro Hospitalar e Universitário de Coimbra, E. P. E. (510103448)","PHARMAKERN PORTUGAL, Produtos Farmacêuticos Soc. Unipessoal Lda (507002571)","21.000,00 €",27-11-2018,29-11-2017,365 dias,"Portugal, Coimbra, Coimbra","Artigo 24.º, n.º 1, alínea e) do Código dos Contratos Públicos",29-12-2017,"21.000,00 €","","",,Não aplicável.,Não aplicável.,FALSE
Cardioversor Dupla camara DDD,Ajuste Direto Regime Geral,Aquisição de bens móveis,"33182210-4, Estimulador cardíaco (pacemaker)","Centro Hospitalar e Universitário de Coimbra, E. P. E. (510103448)",Abbott Medical (504180746),"144.375,00 €",26-11-2018,16-10-2018,90 dias,"Portugal, Coimbra, Coimbra","Artigo 24.º, n.º 1, alínea c) do Código dos Contratos Públicos",28-12-2018,"144.375,00 €","","",,Não aplicável.,Não aplicável.,FALSE
Implante Coclear - Feixe de eléctrodos longo,Ajuste Direto Regime Geral,Aquisição de bens móveis,"33000000-0, Equipamento médico, medicamentos e produtos para cuidados pessoais","Centro Hospitalar e Universitário de Coimbra, E.P. (510103448)",Med-el (980362539),"24.882,19 €",26-11-2018,22-11-2018,20 dias,"Portugal, Coimbra, Coimbra","Artigo 24.º, n.º 1, alínea e), subalínea ii) do Código dos Contratos Públicos","","","","",,Não aplicável.,Não aplicável.,FALSE
Implantes Cocleares - Kit Adulto,Ajuste Direto Regime Geral,Aquisição de bens móveis,"33000000-0, Equipamento médico, medicamentos e produtos para cuidados pessoais","Centro Hospitalar e Universitário de Coimbra, E.P. (510103448)",Coselgi (509230598),"43.489,65 €",26-11-2018,30-10-2018,20 dias,"Portugal, Coimbra, Coimbra","Artigo 24.º, n.º 1, alínea c) do Código dos Contratos Públicos",26-11-2018,"43.489,65 €","","",,Não aplicável.,Não aplicável.,FALSE
Pacemaker VDDR; Pacemaker CRT-P; Pacemakers DD-R; Electrodos para Pacemakers ,Ajuste Direto Regime Geral,Aquisição de bens móveis,"33182210-4, Estimulador cardíaco (pacemaker)","Centro Hospitalar e Universitário de Coimbra, E. P. E. (510103448)",Abbott Medical (504180746),"131.365,00 €",26-11-2018,16-10-2018,90 dias,"Portugal, Coimbra, Coimbra","Artigo 24.º, n.º 1, alínea c) do Código dos Contratos Públicos","","","","",,Não aplicável.,Não aplicável.,FALSE
Implantes Cocleares - Kit Pediátrico,Ajuste Direto Regime Geral,Aquisição de bens móveis,"33000000-0, Equipamento médico, medicamentos e produtos para cuidados pessoais","Centro Hospitalar e Universitário de Coimbra, E. P. E. (510103448)",Coselgi (509230598),"28.993,10 €",26-11-2018,22-11-2018,20 dias,"Portugal, Coimbra, Coimbra","Artigo 24.º, n.º 1, alínea c) do Código dos Contratos Públicos","","","","",,Não aplicável.,Não aplicável.,FALSE
Cardioversor com ressincronização CDI - CRTD,Ajuste Direto Regime Geral,Aquisição de bens móveis,"33182210-4, Estimulador cardíaco (pacemaker)","Centro Hospitalar e Universitário de Coimbra, E. P. E. (510103448)",Abbott Medical (504180746),"178.668,00 €",26-11-2018,17-10-2018,90 dias,"Portugal, Coimbra, Coimbra","Artigo 24.º, n.º 1, alínea c) do Código dos Contratos Públicos","","","","",,Não aplicável.,Não aplicável.,FALSE
040225942018 - OSTEOSSINTESE * Rótulas; Cravos Schanz; Barras; Fios Kirschener; Parafusos Canulados; Anilhas; Fios Guia,Ajuste Direto Regime Geral,Aquisição de bens móveis,"33000000-0, Equipamento médico, medicamentos e produtos para cuidados pessoais","Centro Hospitalar e Universitário de Coimbra, E. P. E. (510103448)","JOHNSON & JOHNSON,LDA.                                                   (500153370)","8.577,51 €",22-11-2018,06-11-2018,30 dias,"Portugal, Coimbra, Coimbra","Artigo 24.º, n.º 1, alínea e), subalínea ii) do Código dos Contratos Públicos","","","","",,Não aplicável.,Não aplicável.,FALSE
040227132018 - OUTRO MATERIAL DE CONSUMO CLINICO *Aventais de Plástico Descartáveis *Luvas de Nitrilo Não Esterilizadas,Ajuste Direto Regime Geral,Aquisição de bens móveis,"33000000-0, Equipamento médico, medicamentos e produtos para cuidados pessoais","Centro Hospitalar e Universitário de Coimbra, E. P. E. (510103448)","EZEQUIEL PANAO JORGE,LDA (501412727)","9.441,00 €",22-11-2018,12-11-2018,30 dias,"Portugal, Coimbra, Coimbra","Artigo 24.º, n.º 1, alínea e), subalínea ii) do Código dos Contratos Públicos","","","","",,Não aplicável.,Não aplicável.,FALSE
040225812018 - OUTRO MATERIAL DE CONSUMO CLÍNICO *Sensor Fluxo Para Ventilador *Circuito Respiratório,Ajuste Direto Regime Geral,Aquisição de bens móveis<br/>Sociedade,"33000000-0, Equipamento médico, medicamentos e produtos para cuidados pessoais","Centro Hospitalar e Universitário de Coimbra, E. P. E. (510103448)",SPACEINSP (514126329),"6.875,00 €",22-11-2018,07-11-2018,30 dias,"Portugal, Coimbra, Coimbra","Artigo 24.º, n.º 1, alínea e), subalínea ii) do Código dos Contratos Públicos","","","","",,Não aplicável.,Não aplicável.,FALSE
- OUTRO MATERIAL DE CONSUMO CLINICO * Papel TNT,Ajuste Direto Regime Geral,Aquisição de bens móveis,"33000000-0, Equipamento médico, medicamentos e produtos para cuidados pessoais","Centro Hospitalar e Universitário de Coimbra, E. P. E. (510103448)","3M ESPANHA, SL SUCURSAL EM PORTUGAL (980560241)","8.480,00 €",21-11-2018,12-11-2018,30 dias,"Portugal, Coimbra, Coimbra","Artigo 24.º, n.º 1, alínea e), subalínea ii) do Código dos Contratos Públicos","","","","",,Não aplicável.,Não aplicável.,FALSE
040224302018 - OUTRO MATERIAL DE CONSUMO CLINICO *Luvas de Nitrilo,Ajuste Direto Regime Geral,Aquisição de bens móveis,"33000000-0, Equipamento médico, medicamentos e produtos para cuidados pessoais","Centro Hospitalar e Universitário de Coimbra, E. P. E. (510103448)","EZEQUIEL PANAO JORGE,LDA (501412727)","8.550,00 €",21-11-2018,16-10-2018,30 dias,"Portugal, Coimbra, Coimbra","Artigo 24.º, n.º 1, alínea e), subalínea ii) do Código dos Contratos Públicos","","","","",,Não aplicável.,Não aplicável.,FALSE
