freguesia,acronym,validVotesPercentage,votes,dicofre
Glória,PS,54.79,80,070402
Glória,PCP-PEV,13.01,19,070402
Glória,PPD/PSD,10.27,15,070402
Glória,B.E.,8.9,13,070402
Glória,CDS-PP,4.11,6,070402
Glória,PCTP/MRPP,2.74,4,070402
Glória,PAN,2.05,3,070402
Glória,NC,1.37,2,070402
Glória,PPM.PPV/CDC,1.37,2,070402
Glória,L,0.68,1,070402
Glória,PNR,0.68,1,070402
Glória,A,0,0,070402
Glória,IL,0,0,070402
Glória,MAS,0,0,070402
Glória,PDR,0,0,070402
Glória,PTP,0,0,070402
Glória,PURP,0,0,070402
