Objeto do Contrato,Tipo de Procedimento,Tipo(s) de Contrato,CPVs,Entidade(s) Adjudicante(s),Entidade(s) Adjudicatária(s),Preço Contratual,Data de Publicação,Data de Celebração do Contrato,Prazo de Execução,Local de Execução,Fundamentação,Data de Fecho do Contrato,Preço Total Efetivo,Causas das Alterações ao Prazo,Causas das Alterações ao Preço,Estado,N.º registo do Acordo Quadro,Descrição do Acordo Quadro,Procedimento Centralizado
Renovação do Licenciamento Performance Monitor para várias USF´s,Ajuste Direto Regime Geral,Aquisição de bens móveis,"22456000-1, Licenças","Administração Regional de Saúde de Lisboa e Vale do Tejo, I.P. (503148776)","MedicineOne - Life Sciences Computing, Lda (504799541)","41.905,00 €",30-11-2011,29-11-2011,2 dias,"Portugal, Lisboa, Lisboa","Artigo 24.º, n.º 1, alínea e) do Código dos Contratos Públicos","","",,,,Não aplicável.,Não aplicável.,
Licenças MedicineOne,Ajuste Direto Regime Geral,Aquisição de bens móveis,"22456000-1, Licenças","Administração Regional de Saúde de Lisboa e Vale do Tejo, I.P. (503148776)","MedicineOne - Life Sciences Computing, Lda (504799541)","6.061,44 €",30-11-2011,08-11-2011,2 dias,"Portugal, Lisboa, Lisboa","Artigo 24.º, n.º 1, alínea e) do Código dos Contratos Públicos","","",,,,Não aplicável.,Não aplicável.,
Implementação de Software; Parametrização de Dados e Suporte à Entrada em Produção do mesmo Várias USF´s,Ajuste Direto Regime Geral,Aquisição de bens móveis,"48900000-7, Pacote de software e sistemas informáticos diversos","Administração Regional de Saúde de Lisboa e Vale do Tejo, I.P. (503148776)","MedicineOne - Life Sciences Computing, Lda (504799541)","26.036,64 €",30-11-2011,07-11-2011,2 dias,"Portugal, Lisboa, Lisboa","Artigo 24.º, n.º 1, alínea e) do Código dos Contratos Públicos","","",,,,Não aplicável.,Não aplicável.,
Renovação do Licenciamento da Solução de Gestão de Atendimento para várias USF´s,Ajuste Direto Regime Geral,Aquisição de bens móveis,"22456000-1, Licenças","Administração Regional de Saúde de Lisboa e Vale do Tejo, I.P. (503148776)","MedicineOne - Life Sciences Computing, Lda (504799541)","39.852,00 €",30-11-2011,07-11-2011,2 dias,"Portugal, Lisboa, Lisboa","Artigo 24.º, n.º 1, alínea e) do Código dos Contratos Públicos","","",,,,Não aplicável.,Não aplicável.,
Pequena Obra- Circuito de esterilização - Armazém UCSP Sardoal,Ajuste Direto Regime Geral,Empreitadas de obras públicas,"45000000-7, Construção","Administração Regional de Saúde de Lisboa e Vale do Tejo, I.P. (503148776)","Sanfoal, Lda (509320376)","4.800,00 €",30-11-2011,23-08-2011,10 dias,"Portugal, Santarém, Sardoal","Artigo 19.º, alínea a) do Código dos Contratos Públicos","","",,,,Não aplicável.,Não aplicável.,
"Serviço de emissão de certificados de autenticação, assinatura e confidencialidade - Ano de 2011",Ajuste Direto Regime Geral,Aquisição de serviços,"98390000-3, Outros serviços","Administração Regional de Saúde de Lisboa e Vale do Tejo, I.P. (503148776)",CEGER - CENTRO DE GESTÃO DA REDE INFORMÁTICA DO GOVERNO (600055639),"450,00 €",30-11-2011,21-11-2011,365 dias,"Portugal, Lisboa, Lisboa","Artigo 24.º, n.º 1, alínea e) do Código dos Contratos Públicos","","",,,,Não aplicável.,Não aplicável.,
Aquisição de Frigorificos de Vacinas e Registadores de Temperatura,Ajuste Direto Regime Geral,Aquisição de bens móveis,"39180000-7, Mobiliário de laboratório","Administração Regional de Saúde de Lisboa e Vale do Tejo, I.P. (503148776)",Welsyn Lda (509816703),"8.031,60 €",30-11-2011,17-08-2011,10 dias,"Portugal, Santarém, Sardoal","Artigo 20.º, n.º 1, alínea a) do Código dos Contratos Públicos","","",,,,Não aplicável.,Não aplicável.,
"Climatização das Salas de Movimento das UCSP de Almeirim e Coruche;Climatização da Sala de Sistema da USF de Samora Correia, com fornecimento e instalação de aparelhos de Ar Condicionado e transferencia de outros",Ajuste Direto Regime Geral,Empreitadas de obras públicas,"45315000-8, Instalação de equipamento para aquecimento e de outro equipamento eléctrico em edifícios","Administração Regional de Saúde de Lisboa e Vale do Tejo, I.P. (503148776)","AG CLIMA - Climatização Regional, LDA (502276592)","2.385,00 €",30-11-2011,18-08-2011,8 dias,"Portugal, Santarém, Almeirim","Artigo 19.º, alínea a) do Código dos Contratos Públicos",28-10-2011,"2.385,00 €",,,,Não aplicável.,Não aplicável.,
Aquisição de Fenilefrina COL,Ajuste Direto Regime Geral,Aquisição de bens móveis,"33690000-3, Medicamentos vários","Administração Regional de Saúde de Lisboa e Vale do Tejo, I.P. (503148776)",Bausch & Lomb SA . Sucursal em Portugal (980218764),"520,00 €",30-11-2011,23-11-2011,20 dias,"Portugal, Lisboa, Lisboa","Artigo 26.º, n.º 1, alínea e) do Código dos Contratos Públicos","","",,,,Não aplicável.,Não aplicável.,
Aquisição de estores interiores para a USF Ribeirinha.,Ajuste Direto Regime Geral,Aquisição de bens móveis,"19260000-6, Tela","Administração Regional de Saúde de Lisboa e Vale do Tejo, I.P. (503148776)",Ergotec Lda (503455105),"3.526,27 €",30-11-2011,29-11-2011,20 dias,"Portugal, Setúbal, Setúbal","Artigo 20.º, n.º 1, alínea a) do Código dos Contratos Públicos","","",,,,Não aplicável.,Não aplicável.,
Equipamento médico para a USF Conchas,Concurso público,Aquisição de bens móveis,"33100000-1, Equipamento médico","Administração Regional de Saúde de Lisboa e Vale do Tejo, I.P. (503148776)","Intercromo SA (504058568), Sano Técnica Lda (500239819), Elnor SA (500094403)","14.027,00 €",28-11-2011,25-11-2011,30 dias,"Portugal, Lisboa, Lisboa","Artigo 155.º, alínea b) do Código dos Contratos Públicos","","",,,,Não aplicável.,Não aplicável.,
Aquisição de material hoteleiro - detergentes,Ajuste Direto Regime Geral,Aquisição de bens móveis,"39831200-8, Detergentes","Administração Regional de Saúde de Lisboa e Vale do Tejo, I.P. (503148776)","Mundo da Higiene (502650389), Matériactiva (505828448)","14.397,00 €",28-11-2011,24-11-2011,21 dias,"Portugal, Lisboa","Artigo 20.º, n.º 1, alínea a) do Código dos Contratos Públicos","","",,,,Não aplicável.,Não aplicável.,
COMPRESSAS NÃO TECIDO ESTERILIZADAS DIVERSAS,Ajuste Direto Regime Geral,Aquisição de bens móveis,"33141119-7, Compressas","Administração Regional de Saúde de Lisboa e Vale do Tejo, I.P. (503148776)","ALBINO DIAS DE ANDRADE, Lda. (500013810)","10.862,72 €",25-11-2011,17-11-2011,0 dias,"Portugal, Lisboa, Lisboa","Artigo 26.º, n.º 1, alínea e) do Código dos Contratos Públicos","","",,,,Não aplicável.,Não aplicável.,
CURETA 4MM. DESCARTAVEIS,Ajuste Direto Regime Geral,Aquisição de bens móveis,"33140000-3, Material médico de consumo","Administração Regional de Saúde de Lisboa e Vale do Tejo, I.P. (503148776)","HOSPITEX - MATERIAL HOSPITALAR, Lda. (501909842)","2.235,00 €",25-11-2011,18-11-2011,1 dias,"Portugal, Lisboa, Lisboa","Artigo 24.º, n.º 1, alínea e) do Código dos Contratos Públicos","","",,,,Não aplicável.,Não aplicável.,
Prestação de Serviços de Consultoria nas Áreas Económico-Financeira e de Produção no Âmbito do Contrato de Gestão do Hospital de Loures.,Ajuste Direto Regime Geral,Aquisição de serviços,"98390000-3, Outros serviços","Administração Regional de Saúde de Lisboa e Vale do Tejo, I.P. (503148776)","BANCO BPI, S.A. (501214534)","31.430,00 €",25-11-2011,11-11-2011,365 dias,"Portugal, Lisboa, Loures","Artigo 24.º, n.º 1, alínea e) do Código dos Contratos Públicos","","",,,,Não aplicável.,Não aplicável.,
Equipamento médico para a USF planalto,Ajuste Direto Regime Geral,Aquisição de bens móveis,"33100000-1, Equipamento médico","Administração Regional de Saúde de Lisboa e Vale do Tejo, I.P. (503148776)",Bacelar e irmão Lda (500532818),"3.186,40 €",23-11-2011,18-11-2011,30 dias,"Portugal, Santarém, Santarém","Artigo 20.º, n.º 1, alínea a) do Código dos Contratos Públicos","","",,,,Não aplicável.,Não aplicável.,
Filtros para venticolonvectores,Ajuste Direto Regime Geral,Aquisição de serviços,"50000000-5, Serviços de reparação e manutenção","Administração Regional de Saúde de Lisboa e Vale do Tejo, I.P. (503148776)","VILARCON- Climatização e Energias, Lda (504359622)","852,51 €",23-11-2011,09-11-2011,5 dias,"Portugal, Santarém, Torres Novas","Artigo 24.º, n.º 1, alínea e) do Código dos Contratos Públicos",09-11-2011,"852,51 €",,,,Não aplicável.,Não aplicável.,
Substituição de motor da viatura 35-23-RN,Ajuste Direto Regime Geral,Aquisição de serviços,"50000000-5, Serviços de reparação e manutenção","Administração Regional de Saúde de Lisboa e Vale do Tejo, I.P. (503148776)","LIZAUTO- Soc. Portuguesa Comércio e Reparação de Automóveis, Lda (501417052)","5.669,41 €",23-11-2011,02-11-2011,5 dias,"Portugal, Santarém, Ourém","Artigo 24.º, n.º 1, alínea e) do Código dos Contratos Públicos",02-11-2011,"5.669,41 €",,,,Não aplicável.,Não aplicável.,
Revisão dos 560.000 KMS ( inclui a substituição da correia de distribuição),Ajuste Direto Regime Geral,Aquisição de serviços,"50000000-5, Serviços de reparação e manutenção","Administração Regional de Saúde de Lisboa e Vale do Tejo, I.P. (503148776)","LIZAUTO - Soc. Portuguesa Comércio e reparação de Automóveis, Lda (501417052)","424,93 €",23-11-2011,19-10-2011,5 dias,"Portugal, Santarém, Ourém","Artigo 24.º, n.º 1, alínea e) do Código dos Contratos Públicos",19-10-2011,"424,93 €",,,,Não aplicável.,Não aplicável.,
Reparação de esterilizador existente na UCSP de Ourém,Ajuste Direto Regime Geral,Aquisição de serviços,"50000000-5, Serviços de reparação e manutenção","Administração Regional de Saúde de Lisboa e Vale do Tejo, I.P. (503148776)",STERYL- SER (508051711),"661,00 €",23-11-2011,17-10-2011,5 dias,"Portugal, Santarém, Ourém","Artigo 24.º, n.º 1, alínea e) do Código dos Contratos Públicos",17-10-2011,"661,00 €",,,,Não aplicável.,Não aplicável.,
"Limpeza técnica, afinações e ajustes , colação de compressor scoll, ventilador , gás R417 , mão de obra e deslocação , para reparação do sistema de AVAC, da UCSP de Alcanena",Ajuste Direto Regime Geral,Aquisição de serviços,"50000000-5, Serviços de reparação e manutenção","Administração Regional de Saúde de Lisboa e Vale do Tejo, I.P. (503148776)",SUCH - SERVIÇO DE UTILIZAÇÃO COMUM HOSPITAIS (500900469),"4.415,94 €",23-11-2011,12-08-2011,5 dias,"Portugal, Santarém, Torres Novas","Artigo 24.º, n.º 1, alínea e) do Código dos Contratos Públicos",12-08-2011,"4.415,94 €",,,,Não aplicável.,Não aplicável.,
MANGA P/ CIRURGIA MICROCOAXIAL,Ajuste Direto Regime Geral,Aquisição de bens móveis,"33140000-3, Material médico de consumo","Administração Regional de Saúde de Lisboa e Vale do Tejo, I.P. (503148776)","ABBOTT MEDICAL OPTICS SPAIN, S.L.SUCURSAL EM PORTUGAL (980262364)","448,80 €",22-11-2011,07-11-2011,2 dias,"Portugal, Lisboa, Lisboa","Artigo 24.º, n.º 1, alínea e) do Código dos Contratos Públicos","","",,,,Não aplicável.,Não aplicável.,
Aquisição de serviços de higiene e limpeza - ACES XVI,Ajuste Direto Regime Geral,Aquisição de serviços,"90910000-9, Serviços de limpeza","Administração Regional de Saúde de Lisboa e Vale do Tejo, I.P. (503148776)","Number One, Lda (504451332)","9.446,42 €",21-11-2011,18-11-2011,31 dias,"Portugal, Setúbal, Palmela","Artigo 26.º, n.º 1, alínea e) do Código dos Contratos Públicos","","",,,,Não aplicável.,Não aplicável.,
Aquisição de serviços de higiene e limpeza - ACES VI Grande Lisboa - Loures.,Ajuste Direto Regime Geral,Aquisição de serviços,"90910000-9, Serviços de limpeza","Administração Regional de Saúde de Lisboa e Vale do Tejo, I.P. (503148776)","Number One, Lda (504451332)","13.223,30 €",21-11-2011,10-11-2011,31 dias,"Portugal, Lisboa, Loures","Artigo 24.º, n.º 1, alínea e) do Código dos Contratos Públicos","","",,,,Não aplicável.,Não aplicável.,
Aquisição de serviços de higiene e limpeza - ACES X Grande Lisboa - Cacém/Queluz,Ajuste Direto Regime Geral,Aquisição de serviços,"90910000-9, Serviços de limpeza","Administração Regional de Saúde de Lisboa e Vale do Tejo, I.P. (503148776)","Number One, Lda (504451332)","13.460,75 €",21-11-2011,26-10-2011,31 dias,"Portugal, Lisboa, Sintra","Artigo 24.º, n.º 1, alínea e) do Código dos Contratos Públicos","","",,,,Não aplicável.,Não aplicável.,
Públicação de Anúncio em Diário da República referente ao Concurso Público Urgente com o n.º 1883/2011 (algálias diversas),Ajuste Direto Regime Geral,Aquisição de serviços,"98390000-3, Outros serviços","Administração Regional de Saúde de Lisboa e Vale do Tejo, I.P. (503148776)","Imprensa Nacional Casa da Moeda, S.A. (500792887)","487,80 €",21-11-2011,07-11-2011,30 dias,"Portugal, Lisboa, Lisboa","Artigo 24.º, n.º 1, alínea e) do Código dos Contratos Públicos","","",,,,Não aplicável.,Não aplicável.,
"Prestação de Serviços na área de Gestão de Resíduos Hospitalares Sólidos e Líquidos Perigosos com Risco Biológico e com Risco Químico da ARSLVT,IP. Período de 01/10/2011 a 31/12/2011.",Ajuste Direto Regime Geral,Aquisição de serviços,"98390000-3, Outros serviços","Administração Regional de Saúde de Lisboa e Vale do Tejo, I.P. (503148776)",SUCH - SERVIÇO DE UTILIZAÇÃO COMUM HOSPITAIS (500900469),"61.056,26 €",21-11-2011,10-11-2011,90 dias,"Portugal, Lisboa, Lisboa","Artigo 24.º, n.º 1, alínea e) do Código dos Contratos Públicos","","",,,,Não aplicável.,Não aplicável.,
Mudanças do Centro de Saúde de Cascais (UCSP + USF Cidadela) das antigas instalações do Hospital de Cascais para a unidade do C. S. Cascais.,Ajuste Direto Regime Geral,Aquisição de serviços,"98390000-3, Outros serviços","Administração Regional de Saúde de Lisboa e Vale do Tejo, I.P. (503148776)","TRANSPORTES BARATA & CARVALHO, LDA. (500425299)","29.000,00 €",21-11-2011,04-11-2011,15 dias,"Portugal, Lisboa, Cascais","Artigo 24.º, n.º 1, alínea e) do Código dos Contratos Públicos","","",,,,Não aplicável.,Não aplicável.,
Públicação de anúncio em Diário da República referente ao concurso Público Internacional com o n.º 2730/2011- aquisição de material diverso para saúde oral.,Ajuste Direto Regime Geral,Aquisição de serviços,"98390000-3, Outros serviços","Administração Regional de Saúde de Lisboa e Vale do Tejo, I.P. (503148776)","Imprensa Nacional Casa da Moeda, S.A. (500792887)","384,51 €",21-11-2011,11-11-2011,30 dias,"Portugal, Lisboa, Lisboa","Artigo 24.º, n.º 1, alínea e) do Código dos Contratos Públicos","","",,,,Não aplicável.,Não aplicável.,
"Aquisição de serviços postais e financeiros na modalidade de vale em ordenador, na Sede da ARSLVT, IP, ACES Oeste Norte, ACES Setúbal e ACES Santarém.",Ajuste Direto Regime Geral,Aquisição de serviços,"98390000-3, Outros serviços","Administração Regional de Saúde de Lisboa e Vale do Tejo, I.P. (503148776)","CTT - Correios de Portugal, SA (500077568)","61.573,85 €",21-11-2011,14-11-2011,365 dias,Portugal,"Artigo 24.º, n.º 1, alínea e) do Código dos Contratos Públicos","","",,,,Não aplicável.,Não aplicável.,
Públicação de anúncio em Diário da República referente ao concurso Público urgente com o n.º 1880/2011,Ajuste Direto Regime Geral,Aquisição de serviços,"98390000-3, Outros serviços","Administração Regional de Saúde de Lisboa e Vale do Tejo, I.P. (503148776)",Imprensa Nacional Casa da Moeda (500792887),"569,11 €",21-11-2011,14-11-2011,30 dias,"Portugal, Lisboa, Lisboa","Artigo 24.º, n.º 1, alínea e) do Código dos Contratos Públicos","","",,,,Não aplicável.,Não aplicável.,
Aquisição de Vacina Dupla TD - Monodose,Ajuste Direto Regime Geral,Aquisição de bens móveis,"33651600-4, Vacinas","Administração Regional de Saúde de Lisboa e Vale do Tejo, I.P. (503148776)","SPMS, EPE (509540716)","92.591,62 €",21-11-2011,18-11-2011,90 dias,"Portugal, Lisboa","Artigo 26.º, n.º 1, alínea e) do Código dos Contratos Públicos","","",,,,Não aplicável.,Não aplicável.,
