Objeto do Contrato,Tipo de Procedimento,Tipo(s) de Contrato,CPVs,Entidade(s) Adjudicante(s),Entidade(s) Adjudicatária(s),Preço Contratual,Data de Publicação,Data de Celebração do Contrato,Prazo de Execução,Local de Execução,Fundamentação,Data de Fecho do Contrato,Preço Total Efetivo,Causas das Alterações ao Prazo,Causas das Alterações ao Preço,Estado,N.º registo do Acordo Quadro,Descrição do Acordo Quadro,Procedimento Centralizado
"Aquisição de garrafões e garrafas de água natural ao IPST, IP, durante o ano de 2013 ",Ajuste Direto Regime Geral,Aquisição de bens móveis,"41100000-0, Água natural","Instituto Português do Sangue e da Transplantação, I. P. (502423943)","Águas de Carvalhelhos, SA (500012032)","2.121,60 €",19-10-2013,12-08-2013,150 dias,"Portugal, Porto, Porto<BR/>Portugal, Coimbra, Coimbra<BR/>Portugal, Lisboa, Lisboa","Artigo 20.º, n.º 1, alínea a) do Código dos Contratos Públicos",,,,,,Não aplicável.,Não aplicável.,
"Aquisição de garrafões e garrafas de água natural ao IPST, IP, durante o ano de 2013 ",Ajuste Direto Regime Geral,Aquisição de bens móveis,"41100000-0, Água natural","Instituto Português do Sangue e da Transplantação, I. P. (502423943)",Nestla Waters Direct Portugal (501629190),"3.628,50 €",19-10-2013,12-08-2013,150 dias,"Portugal, Porto, Porto<BR/>Portugal, Lisboa, Lisboa<BR/>Portugal, Coimbra, Coimbra","Artigo 20.º, n.º 1, alínea a) do Código dos Contratos Públicos",,,,,,Não aplicável.,Não aplicável.,
"Aquisição de sumos diversos em embalagem individual ao IPST, IP, durante o ano de 2013.",Ajuste Direto Regime Geral,Aquisição de bens móveis,"15320000-7, Sumos de fruta e de produtos hortícolas","Instituto Português do Sangue e da Transplantação, I. P. (502423943)","Chavibom, Comércio e Distribuição Alimentar, Lda (503492272)","14.025,00 €",19-10-2013,17-07-2013,180 dias,"Portugal, Porto, Porto<BR/>Portugal, Lisboa, Lisboa<BR/>Portugal, Coimbra, Coimbra","Artigo 20.º, n.º 1, alínea a) do Código dos Contratos Públicos",,,,,,Não aplicável.,Não aplicável.,
Aquisição de serviço de catering (almoço) no Dia Nacional do Dador de Sangue,Ajuste Direto Regime Geral,Aquisição de serviços,"55520000-1, Serviços de fornecimento de refeições (catering)","Instituto Português do Sangue e da Transplantação, I. P. (502423943)","Flor de Santo Amaro, Investimentos Hoteleiros, Lda (500545103)","17.500,00 €",19-10-2013,26-06-2013,1 dias,"Portugal, Lisboa, Lisboa","Artigo 20.º, n.º 1, alínea a) do Código dos Contratos Públicos",,,,,,Não aplicável.,Não aplicável.,
Aquisição de diversos brindes para o evento do Dia Nacional do Dador de Sangue,Ajuste Direto Regime Geral,Aquisição de serviços,"79340000-9, Serviços de publicidade e marketing","Instituto Português do Sangue e da Transplantação, I. P. (502423943)","SPL, LDA (510620582)","28.000,00 €",19-10-2013,19-04-2013,7 dias,"Portugal, Lisboa, Lisboa","Artigo 20.º, n.º 1, alínea a) do Código dos Contratos Públicos",,,,,,Não aplicável.,Não aplicável.,
"Aluguer de viaturas de transporte de pessoal e equipamento para brigadas de colheita de sangue do CST de Coimbra, durante o ano de 2013",Ajuste Direto Regime Geral,Aquisição de serviços,"60172000-4, Aluguer de autocarros e autocarros de turismo com condutor","Instituto Português do Sangue e da Transplantação, I. P. (502423943)","Rodoviária da Beira Litoral, SA (502550414)","89.712,00 €",19-10-2013,07-05-2013,365 dias,"Portugal, Coimbra, Coimbra","Artigo 27.º, n.º 1, alínea a) do Código dos Contratos Públicos",,,,,,Não aplicável.,Não aplicável.,
"Aquisição de Mat. Cons. Clínico - Rolhas Perfuradoras p/Segmentos Unidades de Sangue, para os armazéns do IPST, IP, durante o ano 2013",Ajuste Direto Regime Geral,Aquisição de bens móveis,"33141000-0, Material médico não químico descartável e produtos hematológicos","Instituto Português do Sangue e da Transplantação, I. P. (502423943)",Sarstedt (503019461),"4.370,00 €",18-10-2013,14-05-2013,200 dias,"Portugal, Coimbra, Coimbra","Artigo 20.º, n.º 1, alínea a) do Código dos Contratos Públicos",,,,,,Não aplicável.,Não aplicável.,
Aquisição de Mat. Consumo Clínico - Lancetas p/picada Capilar,Ajuste Direto Regime Geral,Aquisição de bens móveis,"33141000-0, Material médico não químico descartável e produtos hematológicos","Instituto Português do Sangue e da Transplantação, I. P. (502423943)","Iberlab&Imunoreage, Ldª (503406694)","7.467,60 €",18-10-2013,13-05-2013,204 dias,"Portugal, Porto, Porto<BR/>Portugal, Coimbra, Coimbra","Artigo 20.º, n.º 1, alínea a) do Código dos Contratos Públicos",,,,,,Não aplicável.,Não aplicável.,
"Aquisição de Material de Consumo Clinico para os Armazéns do IPST, IP",Ajuste Direto Regime Geral,Aquisição de bens móveis,"33140000-3, Material médico de consumo","Instituto Português do Sangue e da Transplantação, I. P. (502423943)","Quilaban - Química Laboratorial Analitica, Ldª (500399670)","892,69 €",18-10-2013,14-05-2013,228 dias,"Portugal, Coimbra, Coimbra<BR/>Portugal, Porto, Porto","Artigo 20.º, n.º 1, alínea a) do Código dos Contratos Públicos",,,,,,Não aplicável.,Não aplicável.,
"Aquisição de Reagentes para Genotipagem Alélica por Sequenciação dos Genes HLA para o IPST, durante o ano 2013",Concurso público,Aquisição de bens móveis,"33696200-7, Reagentes para análises ao sangue","Instituto Português do Sangue e da Transplantação, I. P. (502423943)","BioPortugal Químico, Farmacêutica, Lda (502380543)","361.725,00 €",18-10-2013,08-07-2013,176 dias,"Portugal, Coimbra, Coimbra<BR/>Portugal, Lisboa, Lisboa<BR/>Portugal, Porto, Porto","Artigo 20.º, n.º 1, alínea b) do Código dos Contratos Públicos",,,,,,Não aplicável.,Não aplicável.,
Aquisição de Reagentes para Genotipagem  HLA de Baixa Resolução e Definição de Alosensibilização em Histocompatibilidade Clínica para IPST. IP,Concurso público,Aquisição de bens móveis,"33696200-7, Reagentes para análises ao sangue","Instituto Português do Sangue e da Transplantação, I. P. (502423943)",Comercial Rafer (980180651),"736.042,93 €",18-10-2013,12-06-2013,202 dias,"Portugal, Coimbra, Coimbra<BR/>Portugal, Lisboa, Lisboa<BR/>Portugal, Porto, Porto","Artigo 20.º, n.º 1, alínea b) do Código dos Contratos Públicos",,,,,,Não aplicável.,Não aplicável.,
"Aquisição de Reagentes na Área de Transplantação para o IPST, IP, durante o ano de 2013",Concurso público,Aquisição de bens móveis,"33696200-7, Reagentes para análises ao sangue","Instituto Português do Sangue e da Transplantação, I. P. (502423943)","Alfagene - Novas Tecnologias das Ciencias da Vida, Lda (503387398)","1.991.475,00 €",18-10-2013,25-06-2013,188 dias,"Portugal, Porto, Porto<BR/>Portugal, Lisboa, Lisboa<BR/>Portugal, Coimbra, Coimbra","Artigo 21.º, n.º 1, alínea b) do Código dos Contratos Públicos",,,,,,Não aplicável.,Não aplicável.,
"Aquisição de Reagentes para o Laboratório de Imunohematologia doo CST Coimbra, durante o ano 2013",Ajuste Direto Regime Geral,Aquisição de bens móveis,"33696200-7, Reagentes para análises ao sangue","Instituto Português do Sangue e da Transplantação, I. P. (502423943)",Diamed  POrtuguesa S.A (501675809),"11.672,00 €",18-10-2013,20-09-2013,83 dias,"Portugal, Coimbra, Coimbra","Artigo 26.º, n.º 1, alínea a) do Código dos Contratos Públicos",,,,,,Não aplicável.,Não aplicável.,
Aquisição de Reagentes para Pesq. de Ácidos Nucleicos Virais HIV/HCV/HBV para os Laboratórios de Biologia Molecular,Ajuste Direto Regime Geral,Aquisição de bens móveis,"33696200-7, Reagentes para análises ao sangue","Instituto Português do Sangue e da Transplantação, I. P. (502423943)",Roche (504282921),"672.100,00 €",17-10-2013,03-10-2013,89 dias,"Portugal, Coimbra, Coimbra<BR/>Portugal, Porto, Porto","Artigo 26.º, n.º 1, alínea a) do Código dos Contratos Públicos",,,,,,Não aplicável.,Não aplicável.,
"Aquisição de Cloreto de Sódio 0,9% 500ml e Cloreto de Sódio 0,9% 1000ml",Ao abrigo de acordo-quadro (art.º 259.º),Aquisição de bens móveis,"33600000-6, Produtos farmacêuticos","Instituto Português do Sangue e da Transplantação, I. P. (502423943)","Over Pharma - Prod. Médicos e Farmacêuticos, Ldª (505792362)","4.769,60 €",12-10-2013,20-02-2013,314 dias,"Portugal, Coimbra, Coimbra<BR/>Portugal, Porto, Porto",Artigo 259.º do Código dos Contratos Públicos,,,,,,-405831022,CP 2012/3 - CORRECTIVOS DA VOLÉMIA E OUTRAS SOLUÇÕES ESTÉREIS,
Aquisição de Reagentes p/Lab. Imuno-Leucoplaquetria do CST Porto,Ajuste Direto Regime Geral,Aquisição de bens móveis,"33696200-7, Reagentes para análises ao sangue","Instituto Português do Sangue e da Transplantação, I. P. (502423943)","Roche, Sistemas de Diagnosticos, Sociedade Unipessoal, Ldª (504282921)","7.158,50 €",12-10-2013,22-05-2013,220 dias,"Portugal, Porto, Porto","Artigo 20.º, n.º 1, alínea a) do Código dos Contratos Públicos",,,,,,Não aplicável.,Não aplicável.,
Aquisição de Reagente p/Lab. Leucoplaquetária de CST Porto,Ajuste Direto Regime Geral,Aquisição de bens móveis,"33696200-7, Reagentes para análises ao sangue","Instituto Português do Sangue e da Transplantação, I. P. (502423943)","Quilaban - Quimica Laboratorial Analitica, Ldª (500399670)","13.978,88 €",12-10-2013,02-07-2013,180 dias,"Portugal, Porto, Porto","Artigo 20.º, n.º 1, alínea a) do Código dos Contratos Públicos",,,,,,Não aplicável.,Não aplicável.,
Aquisição de Reagentes p/Pesquisa Anticorpos Plasmadium spp (Malária),Ajuste Direto Regime Geral,Aquisição de bens móveis,"33696200-7, Reagentes para análises ao sangue","Instituto Português do Sangue e da Transplantação, I. P. (502423943)","Bio Rad Laboratories, Ldª (501301321)","39.600,32 €",12-10-2013,06-06-2013,205 dias,"Portugal, Coimbra, Coimbra","Artigo 20.º, n.º 1, alínea a) do Código dos Contratos Públicos",,,,,,Não aplicável.,Não aplicável.,
"Aquisição de Reagentes p/Lab. Doenças Transmissíveis do CST Porto, durante o ano 2013.",Ajuste Direto Regime Geral,Aquisição de bens móveis,"33696200-7, Reagentes para análises ao sangue","Instituto Português do Sangue e da Transplantação, I. P. (502423943)","Bio Rad Laboratories, Ldª (501301321)","27.091,20 €",12-10-2013,10-05-2013,234 dias,"Portugal, Porto, Porto","Artigo 20.º, n.º 1, alínea a) do Código dos Contratos Públicos",,,,,,Não aplicável.,Não aplicável.,
Aquisição de Anticoagulante ACD p/Colheitas de Aférese,Ajuste Direto Regime Geral,Aquisição de bens móveis,"33696200-7, Reagentes para análises ao sangue","Instituto Português do Sangue e da Transplantação, I. P. (502423943)",Fenwal Europe SPRL (980362679),"7.219,20 €",12-10-2013,30-04-2013,230 dias,"Portugal, Lisboa, Lisboa<BR/>Portugal, Porto, Porto<BR/>Portugal, Coimbra, Coimbra","Artigo 20.º, n.º 1, alínea a) do Código dos Contratos Públicos",,,,,,Não aplicável.,Não aplicável.,
Aquisição de Reagentes de Imunohematologia p/o CST - Delegação Algarve.,Ajuste Direto Regime Geral,Aquisição de bens móveis,"33696200-7, Reagentes para análises ao sangue","Instituto Português do Sangue e da Transplantação, I. P. (502423943)","Grifols Portugal, Ldª (502041285)","19.835,00 €",12-10-2013,30-04-2013,245 dias,"Portugal, Faro, Faro","Artigo 20.º, n.º 1, alínea a) do Código dos Contratos Públicos",,,,,,Não aplicável.,Não aplicável.,
"Aquisição de Reagentes p/Lab. Doenças Transmissíveis do IPST, IP.",Ajuste Direto Regime Geral,Aquisição de bens móveis,"33696200-7, Reagentes para análises ao sangue","Instituto Português do Sangue e da Transplantação, I. P. (502423943)","Abboott Laboratórios, Ldª (500006148)","40.250,00 €",12-10-2013,10-05-2013,235 dias,"Portugal, Lisboa, Lisboa<BR/>Portugal, Coimbra, Coimbra","Artigo 20.º, n.º 1, alínea a) do Código dos Contratos Públicos",,,,,,Não aplicável.,Não aplicável.,
Aquisição de Reagentes p/ Lab. de Imunohematologia CST Lisboa - Delegação Algarve,Ajuste Direto Regime Geral,Aquisição de bens móveis,"33696200-7, Reagentes para análises ao sangue","Instituto Português do Sangue e da Transplantação, I. P. (502423943)","Johnson&Johnson, Ldª (500153370)","67.450,00 €",12-10-2013,25-03-2013,280 dias,"Portugal, Faro, Faro","Artigo 20.º, n.º 1, alínea a) do Código dos Contratos Públicos",,,,,,Não aplicável.,Não aplicável.,
Aquisição de Reagentes para Realização de Hemogramas para o CST Porto,Ajuste Direto Regime Geral,Aquisição de bens móveis,"33696200-7, Reagentes para análises ao sangue","Instituto Português do Sangue e da Transplantação, I. P. (502423943)",Emílio de Azevedo Campos (500094853),"7.800,00 €",12-10-2013,21-08-2013,120 dias,"Portugal, Porto, Porto","Artigo 26.º, n.º 1, alínea a) do Código dos Contratos Públicos",,,,,,Não aplicável.,Não aplicável.,
"Aquisição de Reagentes p/Laboratório de Doenças Transmissíveis do IPST., IP.",Ajuste Direto Regime Geral,Aquisição de bens móveis,"33696200-7, Reagentes para análises ao sangue","Instituto Português do Sangue e da Transplantação, I. P. (502423943)","Abbott Laboratórios, Ldª (500006148)","138.397,00 €",12-10-2013,08-08-2013,145 dias,"Portugal, Lisboa, Lisboa<BR/>Portugal, Porto, Porto<BR/>Portugal, Coimbra, Coimbra","Artigo 26.º, n.º 1, alínea a) do Código dos Contratos Públicos",,,,,,Não aplicável.,Não aplicável.,
"Prestação de Serviços Trabalho Temporário na Área Técnica-Operacional, durante o mês de Julho de 2013.",Ajuste Direto Regime Geral,Aquisição de serviços,"79620000-6, Serviços de fornecimento de pessoal, inclusive temporário","Instituto Português do Sangue e da Transplantação, I. P. (502423943)","RANDSTAD-RECURSOS HUMANOS , SA (503299006)","90.880,58 €",12-10-2013,11-07-2013,31 dias,"Portugal, Coimbra, Coimbra<BR/>Portugal, Porto, Porto<BR/>Portugal, Lisboa, Lisboa","Artigo 27.º, n.º 1, alínea a) do Código dos Contratos Públicos",,,,,,Não aplicável.,Não aplicável.,
Aquisição de Pontas para Pipetador,Ajuste Direto Regime Geral,Aquisição de bens móveis,"38437110-1, Pontas de pipetas","Instituto Português do Sangue e da Transplantação, I. P. (502423943)","Vertex Technics, SL (B60220191)","6.360,49 €",12-10-2013,17-09-2013,84 dias,"Portugal, Coimbra, Coimbra","Artigo 24.º, n.º 1, alínea e) do Código dos Contratos Públicos",,,,,,Não aplicável.,Não aplicável.,
