Objeto do Contrato,Tipo de Procedimento,Tipo(s) de Contrato,CPVs,Entidade(s) Adjudicante(s),Entidade(s) Adjudicatária(s),Preço Contratual,Data de Publicação,Data de Celebração do Contrato,Prazo de Execução,Local de Execução,Fundamentação,Data de Fecho do Contrato,Preço Total Efetivo,Causas das Alterações ao Prazo,Causas das Alterações ao Preço,Estado,N.º registo do Acordo Quadro,Descrição do Acordo Quadro,Procedimento Centralizado
"O presente contrato estabelece as condições jurídicas, técnicas e económicas para a Prestação de Serviços de Vigilância e Segurança Humana à entidade adjudicante",Ao abrigo de acordo-quadro (art.º 259.º),Aquisição de serviços,"79000000-4, Serviços a empresas: direito, comercialização, consultoria, recrutamento, impressão e segurança",Secretaria-Geral do Ministério da Saúde (600080684),Prestibel -Empresa Segurança S.A. (501326456),"80.025,60 €",20-04-2017,14-12-2016,365 dias,"Portugal, Lisboa, Lisboa",Artigo 259.º do Código dos Contratos Públicos,,,,,,613183,Acordo quadro para a prestação de serviços de vigilância e segurança,TRUE
"O presente contrato estabelece as condições jurídicas, técnicas e económicas para o fornecimento eletricidade à entidade adjudicante, cujas necessidades a fornecer constam no Anexo I do presente contrato",Ao abrigo de acordo-quadro (art.º 259.º),Aquisição de bens móveis,"09310000-5, Electricidade",Secretaria-Geral do Ministério da Saúde - SNCP (600080684),"Iberdrola Clientes Portugal, Unipessoal, Lda (502124083)","35.074,38 €",13-04-2017,27-12-2016,366 dias,"Portugal, Lisboa, Lisboa",Artigo 259.º do Código dos Contratos Públicos,,,,,,1351201,Acordo quadro de fornecimento de papel e economato,TRUE
