freguesia,acronym,validVotesPercentage,votes,dicofre
União das freguesias de Vila Seca e Santo Adrião,PS,43.85,57,180123
União das freguesias de Vila Seca e Santo Adrião,PPD/PSD,25.38,33,180123
União das freguesias de Vila Seca e Santo Adrião,CDS-PP,10,13,180123
União das freguesias de Vila Seca e Santo Adrião,PCP-PEV,6.92,9,180123
União das freguesias de Vila Seca e Santo Adrião,B.E.,5.38,7,180123
União das freguesias de Vila Seca e Santo Adrião,PCTP/MRPP,3.85,5,180123
União das freguesias de Vila Seca e Santo Adrião,PAN,2.31,3,180123
União das freguesias de Vila Seca e Santo Adrião,A,0.77,1,180123
União das freguesias de Vila Seca e Santo Adrião,MAS,0.77,1,180123
União das freguesias de Vila Seca e Santo Adrião,PPM.PPV/CDC,0.77,1,180123
União das freguesias de Vila Seca e Santo Adrião,IL,0,0,180123
União das freguesias de Vila Seca e Santo Adrião,L,0,0,180123
União das freguesias de Vila Seca e Santo Adrião,NC,0,0,180123
União das freguesias de Vila Seca e Santo Adrião,PDR,0,0,180123
União das freguesias de Vila Seca e Santo Adrião,PNR,0,0,180123
União das freguesias de Vila Seca e Santo Adrião,PTP,0,0,180123
União das freguesias de Vila Seca e Santo Adrião,PURP,0,0,180123
