freguesia,acronym,validVotesPercentage,votes,dicofre
"União das freguesias de Coz, Alpedriz e Montes",PS,46.39,629,100122
"União das freguesias de Coz, Alpedriz e Montes",PPD/PSD,22.42,304,100122
"União das freguesias de Coz, Alpedriz e Montes",B.E.,10.55,143,100122
"União das freguesias de Coz, Alpedriz e Montes",PCP-PEV,5.31,72,100122
"União das freguesias de Coz, Alpedriz e Montes",CDS-PP,3.61,49,100122
"União das freguesias de Coz, Alpedriz e Montes",PAN,3.02,41,100122
"União das freguesias de Coz, Alpedriz e Montes",R.I.R.,1.7,23,100122
"União das freguesias de Coz, Alpedriz e Montes",CH,1.47,20,100122
"União das freguesias de Coz, Alpedriz e Montes",L,1.11,15,100122
"União das freguesias de Coz, Alpedriz e Montes",PCTP/MRPP,0.96,13,100122
"União das freguesias de Coz, Alpedriz e Montes",IL,0.88,12,100122
"União das freguesias de Coz, Alpedriz e Montes",A,0.81,11,100122
"União das freguesias de Coz, Alpedriz e Montes",PDR,0.44,6,100122
"União das freguesias de Coz, Alpedriz e Montes",MPT,0.22,3,100122
"União das freguesias de Coz, Alpedriz e Montes",PNR,0.22,3,100122
"União das freguesias de Coz, Alpedriz e Montes",PPM,0.22,3,100122
"União das freguesias de Coz, Alpedriz e Montes",PURP,0.22,3,100122
"União das freguesias de Coz, Alpedriz e Montes",JPP,0.15,2,100122
"União das freguesias de Coz, Alpedriz e Montes",NC,0.15,2,100122
"União das freguesias de Coz, Alpedriz e Montes",PTP,0.15,2,100122
"União das freguesias de Coz, Alpedriz e Montes",MAS,0,0,100122
