Objeto do Contrato,Tipo de Procedimento,Tipo(s) de Contrato,CPVs,Entidade(s) Adjudicante(s),Entidade(s) Adjudicatária(s),Preço Contratual,Data de Publicação,Data de Celebração do Contrato,Prazo de Execução,Local de Execução,Fundamentação,Data de Fecho do Contrato,Preço Total Efetivo,Causas das Alterações ao Prazo,Causas das Alterações ao Preço,Estado,N.º registo do Acordo Quadro,Descrição do Acordo Quadro,Procedimento Centralizado
Reagentes,Ajuste Direto Regime Geral,Aquisição de bens móveis,"33694000-1, Meios de diagnóstico","Centro Hospitalar de Lisboa Central, E. P. E. (508080142)",Siemens (507925173),"4.674,25 €",21-04-2014,21-04-2014,90 dias,"Portugal, Lisboa, Lisboa","Artigo 26.º, n.º 1, alínea a) do Código dos Contratos Públicos","","",,,,Não aplicável.,Não aplicável.,FALSE
HCG URINA,Ajuste Direto Regime Geral,Aquisição de bens móveis,"33696500-0, Reagentes de laboratório","Centro Hospitalar de Lisboa Central, E. P. E. (508080142)",SIPACO-COM.GERAL REPRESENT.LDA (500749299),"306,00 €",21-04-2014,21-04-2014,90 dias,"Portugal, Lisboa, Lisboa","Artigo 26.º, n.º 1, alínea a) do Código dos Contratos Públicos","","",,,,Não aplicável.,Não aplicável.,FALSE
Aquisição de dietas modulares.,Ajuste Direto Regime Geral,Aquisição de bens móveis,"33692300-0, Alimentos enterais","Centro Hospitalar de Lisboa Central, E. P. E. (508080142)",Fresenius Kabi (504293753),"2.306,00 €",21-04-2014,21-01-2014,344 dias,"Portugal, Lisboa, Lisboa","Artigo 24.º, n.º 1, alínea a) do Código dos Contratos Públicos","","",,,,Não aplicável.,Não aplicável.,FALSE
"AQUISIÇÃO DE DIETA COMP.MODIF.ENR.PROTEICO,0,EMB. 200ML",Ajuste Direto Regime Geral,Aquisição de bens móveis,"33000000-0, Equipamento médico, medicamentos e produtos para cuidados pessoais","Centro Hospitalar de Lisboa Central, E. P. E. (508080142)","Fresenius Kabi Pharma Portugal Lda (504293753), Nutricia Advanced Medical Nutrition - Unipessoal, Lda (507558286)","6.013,92 €",21-04-2014,07-03-2014,299 dias,"Portugal, Lisboa, Lisboa","Artigo 20.º, n.º 1, alínea a) do Código dos Contratos Públicos","","",,,,Não aplicável.,Não aplicável.,FALSE
AQUISIÇAO DE ELTROMBOPAG 50 MG COMP. E ELTROMBOPAG 25 MG COMP.,Ao abrigo de acordo-quadro (art.º 259.º),Aquisição de bens móveis,"33000000-0, Equipamento médico, medicamentos e produtos para cuidados pessoais","Centro Hospitalar de Lisboa Central, E. P. E. (508080142)","Glaxosmithkline - Produtos Farmacêuticos, Lda (500139962)","23.660,00 €",21-04-2014,16-04-2014,259 dias,"Portugal, Lisboa, Lisboa",Artigo 259.º do Código dos Contratos Públicos,"","",,,,599473,"CONCURSO PÚBLICO PARA A CELEBRAÇÃO DE CONTRATOS PÚBLICOS DE APROVISIONAMENTO PARA A ÁREA DA SAÚDE, COM VISTA AO FORNECIMENTO DE MEDICAMENTOS DE CONSUMO GERAL, GRUPO 4: SANGUE ÀS INSTITUIÇÕES E SERVIÇOS DO SERVIÇO NACIONAL DE SAÚDE",FALSE
"AQUISIÇÃO DE SOFOSBUVIR 400 MG, COMP.",Ajuste Direto Regime Geral,Aquisição de bens móveis,"33000000-0, Equipamento médico, medicamentos e produtos para cuidados pessoais","Centro Hospitalar de Lisboa Central, E. P. E. (508080142)",Gilead Sciences Lda (503604704),"97.620,00 €",21-04-2014,10-04-2014,265 dias,"Portugal, Lisboa, Lisboa","Artigo 24.º, n.º 1, alínea e) do Código dos Contratos Públicos","","",,,,Não aplicável.,Não aplicável.,FALSE
"Agulhas, Aspirador e cateteres de aspiração",Concurso público,Aquisição de bens móveis,"33140000-3, Material médico de consumo","Centro Hospitalar de Lisboa Central, E. P. E. (508080142)",Medtronic Portugal (504223933),"43.890,00 €",21-04-2014,15-04-2014,268 dias,"Portugal, Lisboa, Lisboa","Artigo 20.º, n.º 1, alínea b) do Código dos Contratos Públicos","","",,,,Não aplicável.,Não aplicável.,FALSE
PAPEL TERMICO E CELOFANE PARA MAQUINAS DE DOSE UNITÁRIA,Concurso público,Aquisição de bens móveis,"33140000-3, Material médico de consumo","Centro Hospitalar de Lisboa Central, E. P. E. (508080142)",GRIFOLS (502041285),"36.582,00 €",21-04-2014,04-04-2014,270 dias,"Portugal, Lisboa, Lisboa","Artigo 20.º, n.º 1, alínea b) do Código dos Contratos Públicos","","",,,,Não aplicável.,Não aplicável.,FALSE
PAPEL TERMICO E CELOFANE PARA MAQUINAS DE DOSE UNITÁRIA,Concurso público,Aquisição de bens móveis,"33140000-3, Material médico de consumo","Centro Hospitalar de Lisboa Central, E. P. E. (508080142)",BAXTER (503347345),"29.940,00 €",21-04-2014,08-04-2014,270 dias,"Portugal, Lisboa, Lisboa","Artigo 20.º, n.º 1, alínea b) do Código dos Contratos Públicos","","",,,,Não aplicável.,Não aplicável.,FALSE
4-2.0793/14 - Aquisição de Punch e Trepano para Cirurgia de Cornea,Ajuste Direto Regime Geral,Aquisição de bens móveis,"33140000-3, Material médico de consumo","Centro Hospitalar de Lisboa Central, E. P. E. (508080142)","Grupo Taper, Equipamentos de Precisão Cientifica, Lda (506886336)","29.145,00 €",21-04-2014,16-04-2014,250 dias,"Portugal, Lisboa, Lisboa","Artigo 20.º, n.º 1, alínea a) do Código dos Contratos Públicos","","",,,,Não aplicável.,Não aplicável.,FALSE
4-2.0988/14 - Aquisição de Serras e Brocas para Motor Anspach,Ajuste Direto Regime Geral,Aquisição de bens móveis,"33140000-3, Material médico de consumo","Centro Hospitalar de Lisboa Central, E.P.E. (CHLC) (508080142)","Johnson & Johnson, Lda (500153370)","13.674,90 €",21-04-2014,16-04-2014,250 dias,"Portugal, Lisboa, Lisboa","Artigo 20.º, n.º 1, alínea a) do Código dos Contratos Públicos","","",,,,Não aplicável.,Não aplicável.,FALSE
Aquisição de Ciclofosfamida 1000mg inj e infosfamida 1000mg inj.,Ajuste Direto Regime Geral,Aquisição de bens móveis,"33690000-3, Medicamentos vários","Centro Hospitalar de Lisboa Central, E. P. E. (508080142)","Baxter Medico Farmacêutica, Lda (503347345)","42.840,00 €",21-04-2014,11-02-2014,334 dias,"Portugal, Lisboa, Lisboa","Artigo 24.º, n.º 1, alínea e) do Código dos Contratos Públicos","","",,,,Não aplicável.,Não aplicável.,FALSE
Aquisição de Sulfáto de Bário 1000mg/ml Susp. Oral Barrica 2000ml.,Ajuste Direto Regime Geral,Aquisição de bens móveis,"33690000-3, Medicamentos vários","Centro Hospitalar de Lisboa Central, E. P. E. (508080142)","A. Martins & Fernandes, S.A. (501172114)","2.450,00 €",21-04-2014,18-02-2014,320 dias,"Portugal, Lisboa, Lisboa","Artigo 24.º, n.º 1, alínea e) do Código dos Contratos Públicos","","",,,,Não aplicável.,Não aplicável.,FALSE
Aquisição de Lactulose 10g/15ml xarope saqueta 15ml.,Ajuste Direto Regime Geral,Aquisição de bens móveis,"33690000-3, Medicamentos vários","Centro Hospitalar de Lisboa Central, E. P. E. (508080142)","Ferraz Lynce, S.A. (500113270)","27.696,00 €",21-04-2014,04-02-2014,336 dias,"Portugal, Lisboa, Lisboa","Artigo 24.º, n.º 1, alínea e) do Código dos Contratos Públicos","","",,,,Não aplicável.,Não aplicável.,FALSE
OBRAS DE REPARAÇÃO ESTRUTURAL DO MURO DE CONTENÇÃO DA RUA JOSE ANTONIO SERRANO,Ajuste Direto Regime Geral,Empreitadas de obras públicas,"45000000-7, Construção","Centro Hospitalar de Lisboa Central, E. P. E. (508080142)",MONUMENTA (503990159),"42.868,50 €",17-04-2014,14-04-2014,50 dias,"Portugal, Lisboa, Lisboa","Artigo 24.º, n.º 1, alínea c) do Código dos Contratos Públicos","","",,,,Não aplicável.,Não aplicável.,FALSE
impressos,Ajuste Direto Regime Geral,Aquisição de bens móveis,"30199700-7, Artigos de papelaria impressos excepto formulários","Centro Hospitalar de Lisboa Central, E. P. E. (508080142)","Tipografia Ribatejo,Lda (503700479)","25.585,13 €",17-04-2014,17-01-2014,348 dias,"Portugal, Lisboa, Lisboa","Artigo 20.º, n.º 1, alínea a) do Código dos Contratos Públicos","","",,,,Não aplicável.,Não aplicável.,FALSE
4-2.1055/14 - Auisição de Compressas ABS Estéril 1x1,Ajuste Direto Regime Geral,Aquisição de bens móveis,"33140000-3, Material médico de consumo","Centro Hospitalar de Lisboa Central, E.P.E. (CHLC) (508080142)","Johnson & Johnson, Lda (500153370)","3.840,00 €",17-04-2014,15-04-2014,1080 dias,"Portugal, Lisboa, Lisboa","Artigo 20.º, n.º 1, alínea a) do Código dos Contratos Públicos","","",,,,Não aplicável.,Não aplicável.,FALSE
"Algálias aramadas, bequille e sacos de urina com válvula",Concurso público,Aquisição de bens móveis,"33140000-3, Material médico de consumo","Centro Hospitalar de Lisboa Central, E. P. E. (508080142)",Coloplast (503989037),"1.187,90 €",17-04-2014,04-04-2014,265 dias,"Portugal, Lisboa, Lisboa","Artigo 20.º, n.º 1, alínea b) do Código dos Contratos Públicos","","",,,,Não aplicável.,Não aplicável.,FALSE
"Algálias aramadas, bequille e sacos de urina",Concurso público,Aquisição de bens móveis,"33140000-3, Material médico de consumo","Centro Hospitalar de Lisboa Central, E. P. E. (508080142)",H.R. Hospitalar (501895558),"34,50 €",17-04-2014,04-04-2014,265 dias,"Portugal, Lisboa, Lisboa","Artigo 20.º, n.º 1, alínea b) do Código dos Contratos Públicos","","",,,,Não aplicável.,Não aplicável.,FALSE
Kits e Stents ureterais para o HDE,Ajuste Direto Regime Geral,Aquisição de bens móveis,"33140000-3, Material médico de consumo","Centro Hospitalar de Lisboa Central, E.P.E. (CHLC) (508080142)",Coloplast (503989037),"5.270,00 €",17-04-2014,01-04-2014,265 dias,"Portugal, Lisboa, Lisboa","Artigo 20.º, n.º 1, alínea a) do Código dos Contratos Públicos","","",,,,Não aplicável.,Não aplicável.,FALSE
Material p/administração de citostaticos lotes desertos dos Concursos 1-2.0031/14 e 1-2.0050/14,Ajuste Direto Regime Geral,Aquisição de bens móveis,"33140000-3, Material médico de consumo","Centro Hospitalar de Lisboa Central, E.P.E. (CHLC) (508080142)",Fresenius Kabi (504293753),"135,00 €",17-04-2014,25-03-2014,300 dias,"Portugal, Lisboa, Lisboa","Artigo 20.º, n.º 1, alínea a) do Código dos Contratos Públicos","","",,,,Não aplicável.,Não aplicável.,FALSE
4-2.0065/14 - Aquisição de Laringoscópio Optico Descartável,Ajuste Direto Regime Geral,Aquisição de bens móveis,"33140000-3, Material médico de consumo","Centro Hospitalar de Lisboa Central, E. P. E. (508080142)",Eurocasmedica (503322105),"2.255,00 €",17-04-2014,15-04-2014,300 dias,"Portugal, Lisboa, Lisboa","Artigo 20.º, n.º 1, alínea a) do Código dos Contratos Públicos","","",,,,Não aplicável.,Não aplicável.,FALSE
Etiquetas,Ajuste Direto Regime Geral,Aquisição de bens móveis,"30199760-5, Etiquetas","Centro Hospitalar de Lisboa Central, E. P. E. (508080142)","Pergaminho Dourado Unipessoal, Lda (509136591), DadaLabel (506448967)","21.329,62 €",17-04-2014,22-01-2014,320 dias,"Portugal, Lisboa, Lisboa","Artigo 20.º, n.º 1, alínea a) do Código dos Contratos Públicos","","",,,,Não aplicável.,Não aplicável.,FALSE
"Algálias aramadas, bequille e sacos de urina com válvula",Concurso público,Aquisição de bens móveis,"33140000-3, Material médico de consumo","Centro Hospitalar de Lisboa Central, E. P. E. (508080142)","BSN Medical, S.A. (505385058)","22.400,00 €",17-04-2014,15-04-2014,259 dias,"Portugal, Lisboa, Lisboa","Artigo 20.º, n.º 1, alínea b) do Código dos Contratos Públicos","","",,,,Não aplicável.,Não aplicável.,FALSE
"Algálias aramadas, bequille e sacos de urina com válvula",Concurso público,Aquisição de bens móveis,"33140000-3, Material médico de consumo","Centro Hospitalar de Lisboa Central, E. P. E. (508080142)","P.M.H., S.A. (502376899)","143.338,00 €",17-04-2014,15-04-2014,259 dias,"Portugal, Lisboa, Lisboa","Artigo 20.º, n.º 1, alínea b) do Código dos Contratos Públicos","","",,,,Não aplicável.,Não aplicável.,FALSE
510195/14COLISTIMETATO DE SÓDIO/METRONIDAZOL 5 MG/ML /FOSFOMICINA 3000 MG,Ao abrigo de acordo-quadro (art.º 259.º),Aquisição de bens móveis,"33000000-0, Equipamento médico, medicamentos e produtos para cuidados pessoais","Centro Hospitalar de Lisboa Central, E. P. E. (508080142)",Generis-Farmaceutica S.A (508107997),"12.734,00 €",17-04-2014,08-01-2014,365 dias,"Portugal, Lisboa, Lisboa",Artigo 259.º do Código dos Contratos Públicos,"","",,,,455180,"CONCURSO PÚBLICO PARA A CELEBRAÇÃO DE CONTRATOS PÚBLICOS DE APROVISIONAMENTO PARA A ÁREA DA SAÚDE, COM VISTA AO FORNECIMENTO DE MEDICAMENTOS ANTI-INFECIOSOS: ANTIVÍRICOS E ANTIFÚNGICOS, ÀS INSTITUIÇÕES E SERVIÇOS DO SERVIÇO NACIONAL DE SAÚDE  ",FALSE
AQ - Combustíveis Rodoviários,Ao abrigo de acordo-quadro (art.º 259.º),Aquisição de bens móveis,"09100000-0, Combustíveis","Administração Regional de Saúde Algarve, I.P. (503148709), Centro Hospitalar Psiquiátrico de Lisboa (508338476), Gabinete do Secretátio de Estado da Saúde (600052290), Hospital Arcebispo João Crisóstomo - Cantanhede (501626123), Centro Hospitalar do Médio Ave, E.P.E. (508093937), Insituto Nacional de Saúde Dr. Ricardo Jorge, I.P. (501427511), Centro Hospitalar de Lisboa Central, E. P. E. (508080142), Hospital de Magalhães Lemos, E. P. E. (502828790), Centro Hospitalar do Algarve, E. P. E. (510745997), Unidade Local de Saúde do Litoral Alentejano, E.P.E. (510445152), Unidade Local de Saúde do Alto Minho, E. P. E. (508786193), Centro Hospitalar Barreiro Montijo, E.P.E. (509186998), Centro Hospitalar de São João, E. P. E. (509821197), Instituto Português Oncologia de Coimbra Francisco Gentil, E.P.E. (506361438), Administração Regional de Saúde de Lisboa e Vale do Tejo, I. P. (503148776), CHO - Centro Hospitalar do Oeste (510412009), INFARMED - Autoridade Nacional do Medicamento e Produtos de Saúde I.P. (600037002), Unidade Local de Saúde do Nordeste, E. P. E (509932584), Administração Central do Sistema de Saúde, I.P. (508188423), Hospital Professor Doutor Fernando Fonseca, E.P.E. (503035416), Unidade Local de Saúde da Guarda, E.P.E. (508752000), Centro Hospitalar de Trás-os-Montes e Alto Douro, E. P. E. (508100496), Centro Hospitalar de Lisboa Ocidental, E.P.E. (507618319), Administração Regional de Saúde do Centro, I. P. (503122165), Hospital Distrital da Figueira da Foz, EPE (506361527), Centro Hospitalar do Alto Ave, E.P.E. (508080827), Centro Hospitalar Tondela-Viseu, E.P.E. (509822940), Hospital Santa Maria Maior, E.P.E. - Barcelos (506361381), Centro Hospitalar de Entre o Douro e Vouga, E.P.E. (508878462), Unidade Local de Saúde do Baixo Alentejo, E.P.E. (508754275), Gabinete do Secretário de Estado Adjunto do Ministro da Saúde (600071006), Administração Regional de Saúde do Alentejo, I. P. (503148768), Serviço Partilhados do Ministério da Saúde, E. P. E. (509540716), Centro Hospitalar Lisboa Norte, E. P. E. (508481287), Centro Hospitalar e Universitário de Coimbra, E. P. E. (510103448), Direcção-Geral da Saúde (600037100), Instituto Nacional de Emergência Médica, I.P. (501356126), Hospital Dr. Francisco Zagalo - Ovar (501510150), Instituto Português Oncologia do Porto Francisco Gentil, E.P.E. (506362299), Centro Hospitalar do Baixo Vouga, E.P.E. (510123210), Hospital do Espírito Santo de Évora, E. P. E. (508085888), Unidade Local de Saúde do Norte Alentejano, E. P. E. (508094461), Centro Hospitalar do Porto, E.P.E. (508331471), Administração Regional de Saúde do Norte, I. P. (503135593), Centro Hospitalar de Leiria, E.P.E. (509822932), Inspeção-Geral das Atividades em Saúde (600018857), Serviço de Intervenção nos Comportamentos Aditivos e nas Dependências (600084884), Centro Hospitalar Vila Nova de Gaia - Espinho, E. P. E. (508142156), Hospital Garcia de Orta, E.P.E. (506361470), Secretaria-Geral do Ministério da Saúde (600080684), Instituto Português do sangue (502423943), Gabinete do Ministro da Saúde (600052303), Hospital José Luciano de Castro - Anadia (501613021), Hospital de Santarém, E.P.E. (506361462), Unidade Local de Saúde de Matosinhos, E.P.E. (506361390), Centro Medicina de Reabilitação da Região Centro Rovisco Pais (503767336), Centro Hospitalar do Tâmega e Sousa, E. P. E. (508318262)",Petróleos de Portugal - Petrogal SA (500697370),"20.031,90 €",17-04-2014,08-01-2014,335 dias,"Portugal, Évora, Évora",Artigo 259.º do Código dos Contratos Públicos,08-01-2014,"20.031,90 €",,,,400324,Acordo quadro de fornecimento de combustíveis rodoviários,TRUE
"Rolhas para algálias, sacos colectores de urinas e dispositivos urinários",Ajuste Direto Regime Geral,Aquisição de bens móveis,"33000000-0, Equipamento médico, medicamentos e produtos para cuidados pessoais","Centro Hospitalar de Lisboa Central, E. P. E. (508080142)",Teleflex Medical (980249783),"216,00 €",17-04-2014,25-03-2014,259 dias,"Portugal, Lisboa, Lisboa","Artigo 20.º, n.º 1, alínea a) do Código dos Contratos Públicos","","",,,,Não aplicável.,Não aplicável.,FALSE
"Rolhas de plástico para algálias, sacos de urina e dispositivos urinários",Ajuste Direto Regime Geral,Aquisição de bens móveis<br/>Empreitadas de obras públicas,"33000000-0, Equipamento médico, medicamentos e produtos para cuidados pessoais","Centro Hospitalar de Lisboa Central, E. P. E. (508080142)",Coloplast (503989037),"4.501,20 €",17-04-2014,25-03-2014,259 dias,"Portugal, Lisboa, Lisboa","Artigo 22.º, n.º 1, alínea a) do Código dos Contratos Públicos","","",,,,Não aplicável.,Não aplicável.,FALSE
"Rolhas de plástico para algálias, sacos colectores de urina e dispositivos urinários",Ajuste Direto Regime Geral,Empreitadas de obras públicas<br/>Aquisição de bens móveis,"33000000-0, Equipamento médico, medicamentos e produtos para cuidados pessoais","Centro Hospitalar de Lisboa Central, E. P. E. (508080142)",C.R.Bard (502438274),"21,70 €",17-04-2014,25-03-2014,259 dias,"Portugal, Lisboa, Lisboa","Artigo 22.º, n.º 1, alínea a) do Código dos Contratos Públicos","","",,,,Não aplicável.,Não aplicável.,FALSE
510377/14 - Aquisicao de Estavudina 40 mg Caps,Ao abrigo de acordo-quadro (art.º 259.º),Aquisição de bens móveis,"33600000-6, Produtos farmacêuticos","Centro Hospitalar de Lisboa Central, E. P. E. (508080142)","Bristol-Myers Squibb Farmaceutica Portuguesa, S.A. (500048193)","28.761,04 €",16-04-2014,24-02-2014,310 dias,"Portugal, Lisboa, Lisboa",Artigo 259.º do Código dos Contratos Públicos,"","",,,,461371,CP 2012/40 - MEDICAMENTOS ANTI-RETROVIRAIS,FALSE
Aquisição de 340 emb de Polielect Glucose p DPCA c/ Bicarbonato Kit 12500ml,Ajuste Direto Regime Geral,Aquisição de bens móveis,"33000000-0, Equipamento médico, medicamentos e produtos para cuidados pessoais","Centro Hospitalar de Lisboa Central, E. P. E. (508080142)",Baxter Médico Farmacêutica Lda (503347345),"23.426,00 €",16-04-2014,28-03-2014,278 dias,"Portugal<BR/>Portugal, Lisboa, Lisboa","Artigo 20.º, n.º 1, alínea a) do Código dos Contratos Públicos","","",,,,Não aplicável.,Não aplicável.,FALSE
"510273/14 - Aquisicao de Etanercept 25 mg Po, Sol Inj Fr SC",Ao abrigo de acordo-quadro (art.º 259.º),Aquisição de bens móveis,"33600000-6, Produtos farmacêuticos","Centro Hospitalar de Lisboa Central, E. P. E. (508080142)","Laboratorios Pfizer, Lda. (500162166)","10.513,92 €",16-04-2014,28-01-2014,337 dias,"Portugal, Lisboa, Lisboa",Artigo 259.º do Código dos Contratos Públicos,"","",,,,345900,CONCURSO PÚBLICO PARA A CELEBRAÇÃO DE CONTRATOS PÚBLICOS DE APROVISIONAMENTO PARA AQUISIÇÃO MEDICAMENTOS DO FORO ONCOLÓGICO,FALSE
410326/14 - Aquisicao de Adenosina 3 mg/ml Sol Inj Fr 10 ml IV,Ajuste Direto Regime Geral,Aquisição de bens móveis,"33600000-6, Produtos farmacêuticos","Centro Hospitalar de Lisboa Central, E. P. E. (508080142)","Sanofi - Produtos Farmaceuticos, Lda (500134960)","5.316,20 €",16-04-2014,17-02-2014,317 dias,"Portugal, Lisboa, Lisboa","Artigo 24.º, n.º 1, alínea e) do Código dos Contratos Públicos","","",,,,Não aplicável.,Não aplicável.,FALSE
"4-2.0186/14 - Material para administração de citóstáticos, lotes desertos dos concursos públicos 12003114 e 12005014",Ajuste Direto Regime Geral,Aquisição de bens móveis,"33140000-3, Material médico de consumo","Centro Hospitalar de Lisboa Central, E.P.E. (CHLC) (508080142)",PMH (502376899),"4.041,00 €",15-04-2014,15-04-2014,300 dias,"Portugal, Lisboa, Lisboa","Artigo 20.º, n.º 1, alínea a) do Código dos Contratos Públicos","","",,,,Não aplicável.,Não aplicável.,FALSE
"Algálias aramadas, bequille e sacos de urina com válvula",Concurso público,Aquisição de bens móveis,"33140000-3, Material médico de consumo","Centro Hospitalar de Lisboa Central, E. P. E. (508080142)","B. Braun Medical, Lda. (501506543)","798,00 €",15-04-2014,14-04-2014,260 dias,"Portugal, Lisboa, Lisboa","Artigo 20.º, n.º 1, alínea b) do Código dos Contratos Públicos","","",,,,Não aplicável.,Não aplicável.,FALSE
510131/14AQUISIÇÃO DE OLANZAPINA 10 MG E 5 MG COMP ORODISP,Ao abrigo de acordo-quadro (art.º 259.º),Aquisição de bens móveis,"33000000-0, Equipamento médico, medicamentos e produtos para cuidados pessoais","Centro Hospitalar de Lisboa Central, E. P. E. (508080142)",Teva Pharma Produtos Farmaceuticos (507045491),"9.534,00 €",15-04-2014,02-01-2014,365 dias,"Portugal, Lisboa, Lisboa",Artigo 259.º do Código dos Contratos Públicos,"","",,,,389354,CONCURSO PÚBLICO PARA A CELEBRAÇÃO DE CONTRATOS PÚBLICOS DE APROVISIONAMENTO PARA AQUISIÇÃO MEDICAMENTOS ANTI-PSICÓTICOS,FALSE
410416/14FACTORES DE COAGULAÇÃO DO SANGUE PÓ COLA TEC FR 10 ML,Ajuste Direto Regime Geral,Aquisição de bens móveis,"33000000-0, Equipamento médico, medicamentos e produtos para cuidados pessoais","Centro Hospitalar de Lisboa Central, E. P. E. (508080142)",Baxter Medico Farmaceutica (503347345),"9.700,00 €",15-04-2014,08-04-2014,272 dias,"Portugal, Lisboa, Lisboa","Artigo 20.º, n.º 1, alínea a) do Código dos Contratos Públicos","","",,,,Não aplicável.,Não aplicável.,FALSE
Prolongamentos e torneiras de três vias,Concurso público,Aquisição de bens móveis,"33140000-3, Material médico de consumo","Centro Hospitalar de Lisboa Central, E. P. E. (508080142)","H.R. Hospitalar, Lda. (501895558)","15.232,00 €",15-04-2014,01-04-2014,260 dias,"Portugal, Lisboa, Lisboa","Artigo 20.º, n.º 1, alínea b) do Código dos Contratos Públicos","","",,,,Não aplicável.,Não aplicável.,FALSE
Prolongamentos e torneiras de três vias,Concurso público,Aquisição de bens móveis,"33140000-3, Material médico de consumo","Centro Hospitalar de Lisboa Central, E. P. E. (508080142)",Aviquimica (500039720),"511,06 €",15-04-2014,11-03-2014,260 dias,"Portugal, Lisboa, Lisboa","Artigo 20.º, n.º 1, alínea b) do Código dos Contratos Públicos","","",,,,Não aplicável.,Não aplicável.,FALSE
510246/14BETAMETASONA /HIDROCORTISONA /CLOTRIMAZOL /ACICLOVIR/BETAMETASONA/CETOCONAZOL,Ao abrigo de acordo-quadro (art.º 259.º),Aquisição de bens móveis,"33000000-0, Equipamento médico, medicamentos e produtos para cuidados pessoais","Centro Hospitalar de Lisboa Central, E. P. E. (508080142)","Laboratorio Edol-prod Farmaceuticos S.A  (507072642), Lab. Medinfar-produtos Farmaceuticos  (500384045), Generis  Farmaceutica S.A (508107997), Overpharma -produtos Medicos e Farmaceuticos Lda (505792362), Merck Sharp & Dhome (500191360), Farmoz -soc. Tecnico Medicinal S.A (501505334)","5.984,70 €",14-04-2014,14-01-2014,356 dias,"Portugal, Lisboa, Lisboa",Artigo 259.º do Código dos Contratos Públicos,"","",,,,602875,"CONCURSO PÚBLICO PARA A CELEBRAÇÃO DE CONTRATOS PÚBLICOS DE APROVISIONAMENTO PARA A ÁREA DA SAÚDE, COM VISTA AO FORNECIMENTO DE MEDICAMENTOS DE CONSUMO GERAL - USADOS NAS AFECÇÕES CUTÂNEAS, ÀS INSTITUIÇÕES E SERVIÇOS DO SERVIÇO NACIONAL DE SAÚDE",FALSE
510300/14ALOPURINOL 300/ALOPURINOL 100/IBUPROFENO 400/CETOROLAC 30 MG/1,Ao abrigo de acordo-quadro (art.º 259.º),Aquisição de bens móveis,"33000000-0, Equipamento médico, medicamentos e produtos para cuidados pessoais","Centro Hospitalar de Lisboa Central, E. P. E. (508080142)","Bial- Portela & Cª S.A (500220913), Labesfal Laboratorios Almiro S.A (501169580), Generis  Farmaceutica S.A (508107997)","38.672,32 €",14-04-2014,10-02-2014,329 dias,"Portugal, Lisboa, Lisboa",Artigo 259.º do Código dos Contratos Públicos,"","",,,,600392,"CONCURSO PÚBLICO PARA A CELEBRAÇÃO DE CONTRATOS PÚBLICOS DE APROVISIONAMENTO PARA A ÁREA DA SAÚDE, COM VISTA AO FORNECIMENTO DE MEDICAMENTOS DE CONSUMO GERAL - APARELHO LOCOMOTOR ÀS INSTITUIÇÕES E SERVIÇOS DO SERVIÇO NACIONAL DE SAÚDE",FALSE
510404/14 - Aquisicao de Pantoprazol 40 mg Po Sol Inj Fr IV,Ao abrigo de acordo-quadro (art.º 259.º),Aquisição de bens móveis,"33600000-6, Produtos farmacêuticos","Centro Hospitalar de Lisboa Central, E. P. E. (508080142)","Hikma Farmaceutica (Portugal), Lda (502266791)","39.440,00 €",14-04-2014,31-03-2014,275 dias,"Portugal, Lisboa, Lisboa",Artigo 259.º do Código dos Contratos Públicos,"","",,,,520788,CONCURSO PUBLICO PARA A CELEBRAÇÃO DE CONTRATOS PUBLICOS DE APROVISIONAMENTO PARA A AREA DA SAUDE  COM VISTA AO FORNECIMENTO DE MEDICAMENTOS PARA O APARELHO DIGESTIVO  AS INSITUIÇÕES DO SERVIÇO NACIONAL DE SAÚDE,FALSE
410246/14ÁCIDO CLODRÓNICO 520 MG COMP,Ajuste Direto Regime Geral,Aquisição de bens móveis,"33000000-0, Equipamento médico, medicamentos e produtos para cuidados pessoais","Centro Hospitalar de Lisboa Central, E. P. E. (508080142)",Dermis Produtos de saude SA (507988990),"13.213,74 €",14-04-2014,17-02-2014,329 dias,"Portugal, Lisboa, Lisboa","Artigo 24.º, n.º 1, alínea e) do Código dos Contratos Públicos","","",,,,Não aplicável.,Não aplicável.,FALSE
410333/14Hexaflureto de Enxofre P/ Oftalmologia,Ajuste Direto Regime Geral,Aquisição de bens móveis,"33000000-0, Equipamento médico, medicamentos e produtos para cuidados pessoais","Centro Hospitalar de Lisboa Central, E. P. E. (508080142)",Fase 4 Lda (502840714),"7.605,00 €",14-04-2014,06-03-2014,90 dias,"Portugal, Lisboa, Lisboa","Artigo 20.º, n.º 1, alínea a) do Código dos Contratos Públicos","","",,,,Não aplicável.,Não aplicável.,FALSE
"Agulhas epicraneanas, de punção lombar e para neuro-estimulação",Ajuste Direto Regime Geral,Aquisição de bens móveis,"33000000-0, Equipamento médico, medicamentos e produtos para cuidados pessoais","Centro Hospitalar de Lisboa Central, E. P. E. (508080142)","Vygon, Lda. (503232785)","1.056,00 €",14-04-2014,27-03-2014,261 dias,"Portugal, Lisboa, Lisboa","Artigo 20.º, n.º 1, alínea a) do Código dos Contratos Públicos","","",,,,Não aplicável.,Não aplicável.,FALSE
"Agulhas epicraneanas, de punção lombar e para neuro-estimulação",Ajuste Direto Regime Geral,Aquisição de bens móveis,"33000000-0, Equipamento médico, medicamentos e produtos para cuidados pessoais","Centro Hospitalar de Lisboa Central, E. P. E. (508080142)","B. Braun Medical, Lda. (501506543)","10.107,00 €",14-04-2014,09-04-2014,261 dias,"Portugal, Lisboa, Lisboa","Artigo 20.º, n.º 1, alínea a) do Código dos Contratos Públicos","","",,,,Não aplicável.,Não aplicável.,FALSE
aquisição de campo cirurgico estéril com saco para fluido 137x137cm,Ajuste Direto Regime Geral,Aquisição de bens móveis,"33140000-3, Material médico de consumo","Centro Hospitalar de Lisboa Central, E. P. E. (508080142)",bastos viegas (500042772),"13.910,00 €",14-04-2014,31-03-2014,275 dias,"Portugal, Lisboa, Lisboa","Artigo 20.º, n.º 1, alínea a) do Código dos Contratos Públicos","","",,,,Não aplicável.,Não aplicável.,FALSE
diversas meias antitromboticas,Concurso público,Aquisição de bens móveis,"33140000-3, Material médico de consumo","Centro Hospitalar de Lisboa Central, E. P. E. (508080142)",Anastacio Saldanha (505804441),"7.296,00 €",14-04-2014,16-01-2014,350 dias,"Portugal, Lisboa, Lisboa","Artigo 20.º, n.º 1, alínea b) do Código dos Contratos Públicos","","",,,,Não aplicável.,Não aplicável.,FALSE
diversas meias antitromboticas,Concurso público,Aquisição de bens móveis,"33140000-3, Material médico de consumo","Centro Hospitalar de Lisboa Central, E. P. E. (508080142)",BSN Medical (505385058),"14.790,00 €",14-04-2014,18-03-2014,280 dias,"Portugal, Lisboa, Lisboa","Artigo 20.º, n.º 1, alínea b) do Código dos Contratos Públicos","","",,,,Não aplicável.,Não aplicável.,FALSE
DIVERSAS MEIAS ANTITROMBOTICAS,Concurso público,Aquisição de bens móveis,"33140000-3, Material médico de consumo","Centro Hospitalar de Lisboa Central, E. P. E. (508080142)",Covidien Portugal (503413410),"66.780,00 €",14-04-2014,16-01-2014,355 dias,"Portugal, Lisboa, Lisboa","Artigo 20.º, n.º 1, alínea b) do Código dos Contratos Públicos","","",,,,Não aplicável.,Não aplicável.,FALSE
"CLIPS, CLAMPS E SUBSTITUTOS DE DURA MATER",Concurso público,Aquisição de bens móveis,"33140000-3, Material médico de consumo","Centro Hospitalar de Lisboa Central, E. P. E. (508080142)",BRAUN MEDICAL (501506543),"35.210,00 €",14-04-2014,28-03-2014,274 dias,"Portugal, Lisboa, Lisboa","Artigo 20.º, n.º 1, alínea b) do Código dos Contratos Públicos","","",,,,Não aplicável.,Não aplicável.,FALSE
"Aquisição de  Trolamina 6,7mg/g Emul, bisnaga; Miconazol 20mg/g Gel Oral; Miconazol 20mg/g ",Ajuste Direto Regime Geral,Aquisição de bens móveis,"33000000-0, Equipamento médico, medicamentos e produtos para cuidados pessoais","Centro Hospitalar de Lisboa Central, E. P. E. (508080142)",Johnson & Johnson Medical (500153370),"32.763,40 €",14-04-2014,28-02-2014,306 dias,"Portugal, Lisboa, Lisboa","Artigo 24.º, n.º 1, alínea e) do Código dos Contratos Públicos","","",,,,Não aplicável.,Não aplicável.,FALSE
510390/14 CAPSAICINA 179MG ADESIVO CUT,Ao abrigo de acordo-quadro (art.º 259.º),Aquisição de bens móveis,"33000000-0, Equipamento médico, medicamentos e produtos para cuidados pessoais","Centro Hospitalar de Lisboa Central, E. P. E. (508080142)",AstellasFarma Lda (502540249),"4.418,80 €",14-04-2014,07-03-2014,301 dias,"Portugal, Lisboa, Lisboa",Artigo 259.º do Código dos Contratos Públicos,"","",,,,611371,"CONCURSO PÚBLICO PARA A CELEBRAÇÃO DE CONTRATOS PÚBLICOS DE APROVISIONAMENTO PARA A ÁREA DA SAÚDE, COM VISTA AO FORNECIMENTO DE MEDICAMENTOS ANESTÉSICOS E RELAXANTES MUSCULARES, ÀS INSTITUIÇÕES E SERVIÇOS DO SERVIÇO NACIONAL DE SAÚDE    ",FALSE
510010/14AQUISIÇÃO DE LIDOCAÍNA 20 MG/G + CLORO-HEXIDINA 0.5 MG/G GEL URET SER 11 ML E 6 ML,Ao abrigo de acordo-quadro (art.º 259.º),Aquisição de bens móveis,"33000000-0, Equipamento médico, medicamentos e produtos para cuidados pessoais","Centro Hospitalar de Lisboa Central, E. P. E. (508080142)",Pharmis Biofarmaceutica Lda (502595442),"65.912,40 €",11-04-2014,02-01-2014,365 dias,"Portugal, Lisboa, Lisboa",Artigo 259.º do Código dos Contratos Públicos,"","",,,,611371,"CONCURSO PÚBLICO PARA A CELEBRAÇÃO DE CONTRATOS PÚBLICOS DE APROVISIONAMENTO PARA A ÁREA DA SAÚDE, COM VISTA AO FORNECIMENTO DE MEDICAMENTOS ANESTÉSICOS E RELAXANTES MUSCULARES, ÀS INSTITUIÇÕES E SERVIÇOS DO SERVIÇO NACIONAL DE SAÚDE    ",FALSE
510298/14ESOMEPRAZOL 20 MG COMP GR/ESOMEPRAZOL 40 MG COMP GR,Ao abrigo de acordo-quadro (art.º 259.º),Aquisição de bens móveis,"33000000-0, Equipamento médico, medicamentos e produtos para cuidados pessoais","Centro Hospitalar de Lisboa Central, E. P. E. (508080142)",Sanofi-Produtos Farmaceuticos Lda (500134960),"5.436,48 €",11-04-2014,10-02-2014,328 dias,"Portugal, Lisboa, Lisboa",Artigo 259.º do Código dos Contratos Públicos,"","",,,,520788,CONCURSO PUBLICO PARA A CELEBRAÇÃO DE CONTRATOS PUBLICOS DE APROVISIONAMENTO PARA A AREA DA SAUDE  COM VISTA AO FORNECIMENTO DE MEDICAMENTOS PARA O APARELHO DIGESTIVO  AS INSITUIÇÕES DO SERVIÇO NACIONAL DE SAÚDE,FALSE
Aquisição de especulos,Ajuste Direto Regime Geral,Aquisição de bens móveis,"33140000-3, Material médico de consumo","Centro Hospitalar de Lisboa Central, E.P.E. (CHLC) (508080142)",Speculum (502996323),"54,00 €",11-04-2014,11-04-2014,274 dias,"Portugal, Lisboa, Lisboa","Artigo 20.º, n.º 1, alínea a) do Código dos Contratos Públicos","","",,,,Não aplicável.,Não aplicável.,FALSE
Aquisição de especulos,Ajuste Direto Regime Geral,Aquisição de bens móveis,"33140000-3, Material médico de consumo","Centro Hospitalar de Lisboa Central, E.P.E. (CHLC) (508080142)",Overpharma (505792362),"5.248,00 €",11-04-2014,11-04-2014,274 dias,"Portugal, Lisboa, Lisboa","Artigo 20.º, n.º 1, alínea a) do Código dos Contratos Públicos","","",,,,Não aplicável.,Não aplicável.,FALSE
Aquisição de especulos,Ajuste Direto Regime Geral,Aquisição de bens móveis,"33140000-3, Material médico de consumo","Centro Hospitalar de Lisboa Central, E.P.E. (CHLC) (508080142)",Filsat (506708616),"5.479,93 €",11-04-2014,11-04-2014,274 dias,"Portugal, Lisboa, Lisboa","Artigo 20.º, n.º 1, alínea a) do Código dos Contratos Públicos","","",,,,Não aplicável.,Não aplicável.,FALSE
Aquisição de especulos,Ajuste Direto Regime Geral,Aquisição de bens móveis,"33140000-3, Material médico de consumo","Centro Hospitalar de Lisboa Central, E.P.E. (CHLC) (508080142)",Epjmedica (506820513),"351,00 €",11-04-2014,11-04-2014,274 dias,"Portugal, Lisboa, Lisboa","Artigo 20.º, n.º 1, alínea a) do Código dos Contratos Públicos","","",,,,Não aplicável.,Não aplicável.,FALSE
Aquisição de especulos,Ajuste Direto Regime Geral,Aquisição de bens móveis,"33140000-3, Material médico de consumo","Centro Hospitalar de Lisboa Central, E.P.E. (CHLC) (508080142)",Filsat (505804441),"237,86 €",11-04-2014,11-04-2014,274 dias,"Portugal, Lisboa, Lisboa","Artigo 20.º, n.º 1, alínea a) do Código dos Contratos Públicos","","",,,,Não aplicável.,Não aplicável.,FALSE
510425/14 - Aquisição de Emtricitabina 200 mg + Tenofovir 245 mg comp.,Ao abrigo de acordo-quadro (art.º 259.º),Aquisição de bens móveis,"33600000-6, Produtos farmacêuticos","Centro Hospitalar de Lisboa Central, E. P. E. (508080142)","Gilead Sciences, Lda. (503604704)","2.239.805,30 €",11-04-2014,10-04-2014,90 dias,"Portugal, Lisboa, Lisboa",Artigo 259.º do Código dos Contratos Públicos,"","",,,,461371,CP 2012/40 - MEDICAMENTOS ANTI-RETROVIRAIS,FALSE
510424/14 - Aquisição de Imatinib 100 mg comp. e Imatinib 400 mg comp.,Ao abrigo de acordo-quadro (art.º 259.º),Aquisição de bens móveis,"33600000-6, Produtos farmacêuticos","Centro Hospitalar de Lisboa Central, E. P. E. (508080142)","Novartis Farma - Produtos Farmacêuticos, S. A. (500063524)","709.731,65 €",11-04-2014,10-04-2014,60 dias,"Portugal, Lisboa, Lisboa",Artigo 259.º do Código dos Contratos Públicos,"","",,,,383205,CONCURSO PÚBLICO PARA A CELEBRAÇÃO DE CONTRATOS PÚBLICOS DE APROVISIONAMENTO PARA AQUISIÇÃO MEDICAMENTOS DO FORO ONCOLÓGICO II,FALSE
"Aquisição de Factor VIII da Coagulação Humana 1000UI e 500UI, e Factor IX 1000UI.",Ajuste Direto Regime Geral,Aquisição de bens móveis,"33000000-0, Equipamento médico, medicamentos e produtos para cuidados pessoais","Centro Hospitalar de Lisboa Central, E. P. E. (508080142)","Octapharma - Produtos Farmacêuticos, Lda. (502820780)","592.250,00 €",11-04-2014,25-03-2014,90 dias,"Portugal, Lisboa, Lisboa","Artigo 24.º, n.º 1, alínea e) do Código dos Contratos Públicos","","",,,,Não aplicável.,Não aplicável.,FALSE
PROTEINA C REATIVA,Ajuste Direto Regime Geral,Aquisição de bens móveis,"33690000-3, Medicamentos vários","Centro Hospitalar de Lisboa Central, E. P. E. (508080142)",JOHNOS & JOHNSON (500153370),"3.528,68 €",11-04-2014,14-03-2014,90 dias,"Portugal, Lisboa, Lisboa","Artigo 26.º, n.º 1, alínea a) do Código dos Contratos Públicos","","",,,,Não aplicável.,Não aplicável.,FALSE
FERRITINA E ADFAFETOPROTEINA,Ajuste Direto Regime Geral,Aquisição de bens móveis,"33694000-1, Meios de diagnóstico","Centro Hospitalar de Lisboa Central, E. P. E. (508080142)",SIEMENS HEALTHCARE (507925173),"885,17 €",11-04-2014,14-03-2014,90 dias,"Portugal, Lisboa, Lisboa","Artigo 26.º, n.º 1, alínea a) do Código dos Contratos Públicos","","",,,,Não aplicável.,Não aplicável.,FALSE
ENTEROVIRUS P/ PCR,Ajuste Direto Regime Geral,Aquisição de bens móveis,"33696200-7, Reagentes para análises ao sangue","Centro Hospitalar de Lisboa Central, E. P. E. (508080142)",IZASA PORTUGAL (501086110),"1.426,80 €",11-04-2014,14-03-2014,90 dias,"Portugal, Lisboa, Lisboa","Artigo 26.º, n.º 1, alínea a) do Código dos Contratos Públicos","","",,,,Não aplicável.,Não aplicável.,FALSE
REAGENTES,Ajuste Direto Regime Geral,Aquisição de bens móveis,"33696000-5, Reagentes e meios de contraste","Centro Hospitalar de Lisboa Central, E. P. E. (508080142)",SIEMENS (507925173),"4.000,00 €",11-04-2014,12-02-2014,30 dias,"Portugal, Lisboa, Lisboa","Artigo 26.º, n.º 1, alínea a) do Código dos Contratos Públicos","","",,,,Não aplicável.,Não aplicável.,FALSE
Vitamina D e Renina,Ajuste Direto Regime Geral,Aquisição de bens móveis,"33694000-1, Meios de diagnóstico","Centro Hospitalar de Lisboa Central, E. P. E. (508080142)",DIASORIN (980379563),"2.949,50 €",11-04-2014,21-02-2014,60 dias,"Portugal, Lisboa, Lisboa","Artigo 26.º, n.º 1, alínea a) do Código dos Contratos Públicos","","",,,,Não aplicável.,Não aplicável.,FALSE
Reagentes,Ajuste Direto Regime Geral,Aquisição de bens móveis,"33694000-1, Meios de diagnóstico","Centro Hospitalar de Lisboa Central, E. P. E. (508080142)",Biomerieux (501524177),"17.736,00 €",11-04-2014,22-01-2014,20 dias,"Portugal, Lisboa, Lisboa","Artigo 24.º, n.º 1, alínea c) do Código dos Contratos Públicos","","",,,,Não aplicável.,Não aplicável.,FALSE
