freguesia,acronym,validVotesPercentage,votes,dicofre
Lordelo,PS,40.14,285,171414
Lordelo,PPD/PSD.CDS-PP,27.46,195,171414
Lordelo,MPT,9.3,66,171414
Lordelo,PCP-PEV,8.73,62,171414
Lordelo,B.E.,3.38,24,171414
Lordelo,L,3.24,23,171414
Lordelo,PPV,1.97,14,171414
Lordelo,PAN,1.69,12,171414
Lordelo,PCTP/MRPP,1.55,11,171414
Lordelo,PND,0.85,6,171414
Lordelo,PTP,0.56,4,171414
Lordelo,MAS,0.42,3,171414
Lordelo,PNR,0.28,2,171414
Lordelo,PPM,0.28,2,171414
Lordelo,POUS,0.14,1,171414
Lordelo,PDA,0,0,171414
