freguesia,acronym,validVotesPercentage,votes,dicofre
Arranhó,PS,43.78,517,110201
Arranhó,PPD/PSD,33.11,391,110201
Arranhó,B.E.,7.2,85,110201
Arranhó,PCP-PEV,5.25,62,110201
Arranhó,CDS-PP,2.79,33,110201
Arranhó,PAN,2.71,32,110201
Arranhó,A,1.27,15,110201
Arranhó,CH,1.02,12,110201
Arranhó,L,0.59,7,110201
Arranhó,IL,0.42,5,110201
Arranhó,PDR,0.42,5,110201
Arranhó,NC,0.34,4,110201
Arranhó,PCTP/MRPP,0.34,4,110201
Arranhó,PURP,0.25,3,110201
Arranhó,MPT,0.17,2,110201
Arranhó,PNR,0.17,2,110201
Arranhó,PTP,0.08,1,110201
Arranhó,R.I.R.,0.08,1,110201
Arranhó,MAS,0,0,110201
Arranhó,PPM,0,0,110201
