freguesia,acronym,validVotesPercentage,votes,dicofre
Horta,PS,51,51,091407
Horta,PPD/PSD.CDS-PP,33,33,091407
Horta,MPT,4,4,091407
Horta,PCP-PEV,4,4,091407
Horta,L,2,2,091407
Horta,MAS,2,2,091407
Horta,B.E.,1,1,091407
Horta,PAN,1,1,091407
Horta,PCTP/MRPP,1,1,091407
Horta,PTP,1,1,091407
Horta,PDA,0,0,091407
Horta,PND,0,0,091407
Horta,PNR,0,0,091407
Horta,POUS,0,0,091407
Horta,PPM,0,0,091407
Horta,PPV,0,0,091407
