freguesia,acronym,validVotesPercentage,votes,dicofre
Alvoco das Várzeas,PS,59.28,99,061102
Alvoco das Várzeas,PPD/PSD,21.56,36,061102
Alvoco das Várzeas,B.E.,9.58,16,061102
Alvoco das Várzeas,PCP-PEV,3.59,6,061102
Alvoco das Várzeas,PAN,1.8,3,061102
Alvoco das Várzeas,CDS-PP,1.2,2,061102
Alvoco das Várzeas,PPM,1.2,2,061102
Alvoco das Várzeas,IL,0.6,1,061102
Alvoco das Várzeas,L,0.6,1,061102
Alvoco das Várzeas,PNR,0.6,1,061102
Alvoco das Várzeas,A,0,0,061102
Alvoco das Várzeas,CH,0,0,061102
Alvoco das Várzeas,JPP,0,0,061102
Alvoco das Várzeas,MAS,0,0,061102
Alvoco das Várzeas,MPT,0,0,061102
Alvoco das Várzeas,NC,0,0,061102
Alvoco das Várzeas,PCTP/MRPP,0,0,061102
Alvoco das Várzeas,PDR,0,0,061102
Alvoco das Várzeas,PURP,0,0,061102
Alvoco das Várzeas,R.I.R.,0,0,061102
