Objeto do Contrato,Tipo de Procedimento,Tipo(s) de Contrato,CPVs,Entidade(s) Adjudicante(s),Entidade(s) Adjudicatária(s),Preço Contratual,Data de Publicação,Data de Celebração do Contrato,Prazo de Execução,Local de Execução,Fundamentação,Data de Fecho do Contrato,Preço Total Efetivo,Causas das Alterações ao Prazo,Causas das Alterações ao Preço,Estado,N.º registo do Acordo Quadro,Descrição do Acordo Quadro,Procedimento Centralizado
Conversão da Central Térmica,Ajuste Direto Regime Geral,Aquisição de bens móveis,"39715210-2, Equipamento para aquecimento central","Hospital do Espírito Santo de Évora, E.P.E. (508085888)",VAPOREL - SOC IND METALO-MECANICA LDA (500295433),"102.610,90 €",06-09-2011,30-08-2011,120 dias,"Portugal, Évora, Évora","Artigo 20.º, n.º 1, alínea a) do Código dos Contratos Públicos",,,,,,Não aplicável.,Não aplicável.,
"Colocação de equipamentos, reagentes e consumiveis para realização de testes.",Concurso público,Aquisição de serviços,"85148000-8, Serviços de análises clínicas","Hospital do Espírito Santo de Évora, E.P.E. (508085888)","QUILABAM (500399670), NOVARTIS FARMA-PROD FARMACEUT (500063524), EMILIO DE AZEVEDO CAMPOS CIA L (500094853), ABBOTT LABORATORIOS LDA (500006148), GRIFOLS PORTUGAL LDA (502041285), JOHNSON & JOHNSON LDA (500153370)","559.933,80 €",06-09-2011,01-09-2011,365 dias,"Portugal, Évora, Évora","Artigo 20.º, n.º 1, alínea b) do Código dos Contratos Públicos",,,,,,Não aplicável.,Não aplicável.,
"Fornecimento de Dispositivos Médicos, Oftalmologia e, colocação de equipamentos",Concurso público,Aquisição de bens móveis,"33731110-7, Lentes intraoculares","Hospital do Espírito Santo de Évora, E.P.E. (508085888)","BAUSCH & LOMB S A (980218764), OPTIFAR (501609377), FILSAT (506708616), OFTALDATA - PROD OFTALMOLOGIA (504887459), ABBOTT MEDICAL OPTICS SPAIN SL SUC PORTUGAL (980262364)","296.353,00 €",06-09-2011,30-08-2011,365 dias,"Portugal, Évora, Évora","Artigo 20.º, n.º 1, alínea b) do Código dos Contratos Públicos",,,,,,Não aplicável.,Não aplicável.,
"Fornecimentos de Dispositivos Médicos, Uso Geral",Concurso público,Aquisição de bens móveis,"33190000-8, Dispositivos e produtos médicos variados","Hospital do Espírito Santo de Évora, E.P.E. (508085888)","PULMOCOR - EQUIPAMENTO MEDICO (501402578), ANASTACIO SALDANHA (505804441), ROCHA NEVES LDA (500233691), COVIDIEN PORTUGAL LDA (503413410), MEDICINALIA-CORMEDICA (500684324), SIEMENS HEALTHCARE DIAGNOSTICS LDA (507925173), QUILABAM (500399670), OVERPHARMA LDA (505792362), DIMOR LUSITANA LDA (500730741), PMH-PROD MEDICOS HOSPITALARES (502376899), B BRAUN MEDICAL LDA (501506543), INTERSURGICAL PORTUGAL LDA (503480045), MENARINI DIAGNOSTICOS LDA (502610069), H R - HOSPITALAR LDA (501895558), AVIQUIMICA (500039720)","150.282,50 €",06-09-2011,30-08-2011,365 dias,"Portugal, Évora, Évora","Artigo 20.º, n.º 1, alínea b) do Código dos Contratos Públicos",,,,,,Não aplicável.,Não aplicável.,
