Objeto do Contrato,Tipo de Procedimento,Tipo(s) de Contrato,CPVs,Entidade(s) Adjudicante(s),Entidade(s) Adjudicatária(s),Preço Contratual,Data de Publicação,Data de Celebração do Contrato,Prazo de Execução,Local de Execução,Fundamentação,Data de Fecho do Contrato,Preço Total Efetivo,Causas das Alterações ao Prazo,Causas das Alterações ao Preço,Estado,N.º registo do Acordo Quadro,Descrição do Acordo Quadro,Procedimento Centralizado
Instalação de sistema de tratamento/desinfeção da água de abastecimento do HFF (AF e AQS) com recurso a dióxido de cloro,Ajuste Direto Regime Geral,Aquisição de bens móveis,"42996000-4, Máquinas para tratamento de águas residuais",Hospital Prof. Doutor Fernando Fonseca E.P.E. (503035416),"AnyThink, Lda. (513263780)","13.880,00 €",23-10-2015,16-06-2015,60 dias,"Portugal, Lisboa, Amadora","Artigo 20.º, n.º 1, alínea a) do Código dos Contratos Públicos",,,,,,Não aplicável.,Não aplicável.,FALSE
"Reparações de elevadores (1, 2, 3, 4, 5, 10, 11, 14, 15 e 16)",Ajuste Direto Regime Geral,Aquisição de serviços,"50750000-7, Serviços de manutenção de elevadores",Hospital Prof. Doutor Fernando Fonseca E.P.E. (503035416),"Efacec-Manvia manutenção Hospitalar, ACE (509801510)","28.437,80 €",23-10-2015,14-07-2015,60 dias,"Portugal, Lisboa, Amadora","Artigo 20.º, n.º 1, alínea a) do Código dos Contratos Públicos",,,,,,Não aplicável.,Não aplicável.,FALSE
CONTRATO DE MANUTENÇÃO PREVENTIVA E CURATIVA DE 21 MÁQUINAS DE LAVAR DESINFETAR ARRASTADEIRAS ARJO (MAQUET),Ajuste Direto Regime Geral,Aquisição de serviços,"50530000-9, Serviços de reparação e manutenção de máquinas",Hospital Prof. Doutor Fernando Fonseca E.P.E. (503035416),"Maquet Portugal – Comércio de Equipamentos Hospitalares, Unipessoal, Lda. (506819698)","15.627,15 €",23-10-2015,20-10-2015,270 dias,"Portugal, Lisboa, Amadora","Artigo 20.º, n.º 1, alínea a) do Código dos Contratos Públicos",,,,,,Não aplicável.,Não aplicável.,FALSE
Contrato de Serviços de Manutenção no período de 1.10.2015 a 31.12.2015,Ajuste Direto Regime Geral,Aquisição de serviços,"71356000-8, Serviços técnicos",Hospital Prof. Doutor Fernando Fonseca E.P.E. (503035416),"Efacec-Manvia, Manutenção Hospilar, A.C.E. (509801510)","245.874,00 €",23-10-2015,05-10-2015,90 dias,"Portugal, Lisboa, Amadora","Artigo 24.º, n.º 1, alínea c) do Código dos Contratos Públicos",,,,,,Não aplicável.,Não aplicável.,FALSE
Peças para reparação de RX da sala 1 da urgência,Ajuste Direto Regime Geral,Aquisição de serviços,"50421200-4, Serviços de reparação e manutenção de equipamentos de raios X","Hospital Professor Doutor Fernando Fonseca, E. P. E. (503035416)","Efacec- Manvia, Manutenção Hospitalar, A.C.E. (509801510)","8.245,00 €",23-10-2015,05-10-2015,60 dias,"Portugal, Lisboa, Amadora","Artigo 20.º, n.º 1, alínea a) do Código dos Contratos Públicos",,,,,,Não aplicável.,Não aplicável.,FALSE
"CONTRATO DE CONCESSÃO TEMPORÁRIA DO DIREITO DE EXPLORAÇÃO DE LOJA, PARA ACTIVIDADE COMERCIAL DE VENDA DE ARTIGOS ORTOPÉDICOS, FISIOTERAPIA, MOBILIÁRIO HOSPITALAR E DE GERIATRIA NO ÁTRIO DO HOSPITAL",Concurso público,Outros Tipos (Concessão do direito de exploração de imóvel),"70130000-1, Serviços de arrendamento de bens imóveis próprios",Hospital Prof. Doutor Fernando Fonseca E.P.E. (503035416),"Ortopaulos - Centro de Ortoprotesia, unipessoal Lda. (509305717)","1.450,00 €",22-10-2015,01-04-2015,1095 dias,"Portugal, Lisboa, Amadora","Artigo 20.º, n.º 1, alínea b) do Código dos Contratos Públicos",,,,,,Não aplicável.,Não aplicável.,FALSE
Requalificação do Internamento de Ortopedia A,Ajuste Direto Regime Geral,Empreitadas de obras públicas,"45113000-2, Obras no local",Hospital Prof. Doutor Fernando Fonseca E.P.E. (503035416),Jorge & Lico Lda. (506883965),"60.975,00 €",22-10-2015,02-09-2015,20 dias,"Portugal, Lisboa, Amadora","Artigo 19.º, alínea a) do Código dos Contratos Públicos",,,,,,Não aplicável.,Não aplicável.,FALSE
Aquisição de serviços de manutenção à Toshiba,Ajuste Direto Regime Geral,Aquisição de serviços,"50421200-4, Serviços de reparação e manutenção de equipamentos de raios X",Hospital Prof. Doutor Fernando Fonseca E.P.E. (503035416),"Toshiba Medical Systems, S.A. (980023700)","9.500,00 €",22-10-2015,02-10-2015,90 dias,"Portugal, Lisboa, Amadora","Artigo 24.º, n.º 1, alínea e) do Código dos Contratos Públicos",,,,,,Não aplicável.,Não aplicável.,FALSE
PRESTAÇÃO DE SERVIÇOS DE 3 TÉCNICOS DE DIAGNÓSTICO E TERAPÊUTICA,Ajuste Direto Regime Geral,Aquisição de serviços,"98110000-7, Serviços prestados por organizações empresariais, profissionais e especializadas",Hospital Prof. Doutor Fernando Fonseca E.P.E. (503035416),"Medipeople – Soluções de Saúde e Educação, Lda. (508543436)","25.347,60 €",21-10-2015,21-03-2015,180 dias,"Portugal, Lisboa, Amadora","Artigo 20.º, n.º 1, alínea a) do Código dos Contratos Públicos",,,,,,Não aplicável.,Não aplicável.,FALSE
