freguesia,acronym,validVotesPercentage,votes,dicofre
Portela,PS,38.81,26,160423
Portela,PPD/PSD.CDS-PP,32.84,22,160423
Portela,MPT,10.45,7,160423
Portela,B.E.,7.46,5,160423
Portela,PCP-PEV,5.97,4,160423
Portela,MAS,1.49,1,160423
Portela,PNR,1.49,1,160423
Portela,PTP,1.49,1,160423
Portela,L,0,0,160423
Portela,PAN,0,0,160423
Portela,PCTP/MRPP,0,0,160423
Portela,PDA,0,0,160423
Portela,PND,0,0,160423
Portela,POUS,0,0,160423
Portela,PPM,0,0,160423
Portela,PPV,0,0,160423
