Objeto do Contrato,Tipo de Procedimento,Tipo(s) de Contrato,CPVs,Entidade(s) Adjudicante(s),Entidade(s) Adjudicatária(s),Preço Contratual,Data de Publicação,Data de Celebração do Contrato,Prazo de Execução,Local de Execução,Fundamentação,Data de Fecho do Contrato,Preço Total Efetivo,Causas das Alterações ao Prazo,Causas das Alterações ao Preço,Estado,N.º registo do Acordo Quadro,Descrição do Acordo Quadro,Procedimento Centralizado
Aquisição de serviços de reestruturação do microsite do Plano nacional de Saúde e respetivo alojamento para o ano de 2013,Ajuste Direto Regime Geral,Aquisição de serviços,"72000000-5, Serviços de TI: consultoria, desenvolvimento de software, Internet e apoio",Direcção-Geral da Saúde (600037100),LOG OSCON Ldª (505768674),"8.939,00 €",11-12-2013,20-05-2013,365 dias,"Portugal, Lisboa, Lisboa","Artigo 20.º, n.º 1, alínea a) do Código dos Contratos Públicos",11-12-2013,"8.939,00 €",,,,Não aplicável.,Não aplicável.,
Serviços de manutenção e instalação do Sistema de Informação de Suporte ao Tratamento de Dados de Pessoas Infetadas por VIH/SIDA (SI.VIDA),Ajuste Direto Regime Geral,Aquisição de serviços,"72700000-7, Serviços de rede informática",Direcção-Geral da Saúde (600037100),"SPMS - Serviços Partilhados do Ministério da Saúde, E.P.E. (509540716)","330.000,00 €",10-12-2013,08-04-2013,267 dias,"Portugal, Lisboa, Lisboa","Artigo 24.º, n.º 1, alínea e) do Código dos Contratos Públicos",10-12-2013,"330.000,00 €",,,,Não aplicável.,Não aplicável.,
Aquisição de manuais no âmbito da prevenção do suicídio,Ajuste Direto Regime Geral,Aquisição de bens móveis,"22470000-5, Manuais",Direcção-Geral da Saúde (600037100),Escola Superior de Enfermagem de Coimbra (600081583),"6.610,00 €",04-12-2013,19-09-2013,70 dias,"Portugal, Coimbra, Coimbra","Artigo 24.º, n.º 1, alínea e) do Código dos Contratos Públicos",03-12-2013,"6.610,00 €",,,,Não aplicável.,Não aplicável.,
