freguesia,acronym,validVotesPercentage,votes,dicofre
Bom Sucesso,PS,48.34,175,060515
Bom Sucesso,PPD/PSD,26.8,97,060515
Bom Sucesso,B.E.,8.01,29,060515
Bom Sucesso,CDS-PP,2.76,10,060515
Bom Sucesso,PCP-PEV,2.76,10,060515
Bom Sucesso,A,2.49,9,060515
Bom Sucesso,PAN,1.93,7,060515
Bom Sucesso,PCTP/MRPP,1.38,5,060515
Bom Sucesso,L,1.1,4,060515
Bom Sucesso,IL,0.83,3,060515
Bom Sucesso,NC,0.83,3,060515
Bom Sucesso,PPM.PPV/CDC,0.83,3,060515
Bom Sucesso,PNR,0.55,2,060515
Bom Sucesso,PURP,0.55,2,060515
Bom Sucesso,MAS,0.28,1,060515
Bom Sucesso,PDR,0.28,1,060515
Bom Sucesso,PTP,0.28,1,060515
