Objeto do Contrato,Tipo de Procedimento,Tipo(s) de Contrato,CPVs,Entidade(s) Adjudicante(s),Entidade(s) Adjudicatária(s),Preço Contratual,Data de Publicação,Data de Celebração do Contrato,Prazo de Execução,Local de Execução,Fundamentação,Data de Fecho do Contrato,Preço Total Efetivo,Causas das Alterações ao Prazo,Causas das Alterações ao Preço,Estado,N.º registo do Acordo Quadro,Descrição do Acordo Quadro,Procedimento Centralizado
Aquisição de computadores portáteis,Ajuste Direto Regime Geral,Aquisição de bens móveis,"30213100-6, Computadores portáteis","SPMS - Serviços Partilhados do Ministério da Saúde, E. P. E. (509540716)","Iten Solutions - Sistemas de Infornação, S. A (510728189)","9.976,01 €",31-01-2017,28-12-2016,30 dias,Portugal,"Artigo 20.º, n.º 1, alínea a) do Código dos Contratos Públicos",31-12-2016,"9.976,01 €",,,,Não aplicável.,Não aplicável.,FALSE
Aquisição de serviços de desenvolvimento de módulos na PDS,Concurso público,Aquisição de serviços,"72500000-0, Serviços relacionados com a informática","SPMS - Serviços Partilhados do Ministério da Saúde, E. P. E. (509540716)","Altran Portugal, SA (504272179)","90.851,84 €",31-01-2017,27-12-2016,365 dias,Portugal,"Artigo 21.º, n.º 2 do Código dos Contratos Públicos","","",,,,Não aplicável.,Não aplicável.,FALSE
Aquisição de serviços de apoio para Núcleo de Apoio de Easy Procurament (@NEP),Ajuste Direto Regime Geral,Aquisição de serviços,"79420000-4, Serviços relacionados com a gestão","SPMS - Serviços Partilhados do Ministério da Saúde, E. P. E. (509540716)","Solidnetworks Business Consulting, Lda. (508991579)","25.000,00 €",31-01-2017,04-01-2017,365 dias,Portugal,"Artigo 20.º, n.º 1, alínea a) do Código dos Contratos Públicos",04-01-2018,"25.000,00 €",,,,Não aplicável.,Não aplicável.,FALSE
Aquisição de economato para o ano de 2017,Ajuste Direto Regime Geral,Aquisição de bens móveis,"30192700-8, Artigos de papelaria","SPMS - Serviços Partilhados do Ministério da Saúde, E. P. E. (509540716)",Staples Portugal - Equip.Escrit.SA (503789372),"7.500,00 €",30-01-2017,30-12-2016,365 dias,Portugal,"Artigo 20.º, n.º 1, alínea a) do Código dos Contratos Públicos","","",,,,Não aplicável.,Não aplicável.,FALSE
Aquisição de serviços especializados para Identificação dos Procedimentos e Normas aplicáveis em matéria de Segurança e Privacidade da Informação,Ajuste Direto Regime Geral,Aquisição de serviços,"79111000-5, Serviços de assessoria jurídica","SPMS- Serviços Partilhados do M. da Saúde, E.P.E. (509540716)","Marksearch - Estudos de Mercado, L.da (IDC Portugal) (507510453)","60.000,00 €",30-01-2017,27-12-2016,93 dias,Portugal,"Artigo 20.º, n.º 1, alínea a) do Código dos Contratos Públicos","","",,,,Não aplicável.,Não aplicável.,FALSE
Aquisição de serviços de manutenção evolutiva do SAM no âmbito da referenciação CTH e MCD,Ao abrigo de acordo-quadro (art.º 259.º),Aquisição de serviços,"72500000-0, Serviços relacionados com a informática","SPMS- Serviços Partilhados do M. da Saúde, E.P.E. (509540716)","Altran Portugal, SA (504272179)","63.275,52 €",26-01-2017,04-11-2016,365 dias,Portugal,Artigo 259.º do Código dos Contratos Públicos,"","",,,,425776,CONCURSO PÚBLICO n.º 20120117 -,FALSE
Aquisição de serviços de requalificação do edifício da SPMS,Ajuste Direto Regime Geral,Aquisição de serviços,"50700000-2, Serviços de reparação e manutenção de equipamento em edifícios","SPMS- Serviços Partilhados do M. da Saúde, E.P.E. (509540716)","Smart Supreme Solutions - Tecnologia de Engenharia Unipessoal, Lda.                 al (513222847)","74.404,15 €",26-01-2017,30-12-2016,30 dias,Portugal,"Artigo 20.º, n.º 1, alínea a) do Código dos Contratos Públicos",31-01-2017,"74.404,15 €",,,,Não aplicável.,Não aplicável.,FALSE
