freguesia,acronym,validVotesPercentage,votes,dicofre
União das freguesias de Amieira e Alqueva,PCP-PEV,52.35,156,070909
União das freguesias de Amieira e Alqueva,PS,37.92,113,070909
União das freguesias de Amieira e Alqueva,PCTP/MRPP,3.02,9,070909
União das freguesias de Amieira e Alqueva,PPD/PSD.CDS-PP,2.35,7,070909
União das freguesias de Amieira e Alqueva,B.E.,1.34,4,070909
União das freguesias de Amieira e Alqueva,MPT,1.01,3,070909
União das freguesias de Amieira e Alqueva,PND,0.67,2,070909
União das freguesias de Amieira e Alqueva,L,0.34,1,070909
União das freguesias de Amieira e Alqueva,PAN,0.34,1,070909
União das freguesias de Amieira e Alqueva,PPM,0.34,1,070909
União das freguesias de Amieira e Alqueva,PTP,0.34,1,070909
União das freguesias de Amieira e Alqueva,MAS,0,0,070909
União das freguesias de Amieira e Alqueva,PDA,0,0,070909
União das freguesias de Amieira e Alqueva,PNR,0,0,070909
União das freguesias de Amieira e Alqueva,POUS,0,0,070909
União das freguesias de Amieira e Alqueva,PPV,0,0,070909
