freguesia,acronym,validVotesPercentage,votes,dicofre
Cárquere,PS,50.6,126,181303
Cárquere,PPD/PSD.CDS-PP,33.73,84,181303
Cárquere,PCP-PEV,4.42,11,181303
Cárquere,MPT,2.41,6,181303
Cárquere,PCTP/MRPP,2.41,6,181303
Cárquere,B.E.,1.61,4,181303
Cárquere,L,1.61,4,181303
Cárquere,PND,1.61,4,181303
Cárquere,PAN,0.4,1,181303
Cárquere,PNR,0.4,1,181303
Cárquere,PPV,0.4,1,181303
Cárquere,PTP,0.4,1,181303
Cárquere,MAS,0,0,181303
Cárquere,PDA,0,0,181303
Cárquere,POUS,0,0,181303
Cárquere,PPM,0,0,181303
