freguesia,acronym,validVotesPercentage,votes,dicofre
Vilar de Peregrinos,PPD/PSD.CDS-PP,46.3,25,041233
Vilar de Peregrinos,PS,37.04,20,041233
Vilar de Peregrinos,MPT,5.56,3,041233
Vilar de Peregrinos,PND,3.7,2,041233
Vilar de Peregrinos,B.E.,1.85,1,041233
Vilar de Peregrinos,L,1.85,1,041233
Vilar de Peregrinos,PCP-PEV,1.85,1,041233
Vilar de Peregrinos,PDA,1.85,1,041233
Vilar de Peregrinos,MAS,0,0,041233
Vilar de Peregrinos,PAN,0,0,041233
Vilar de Peregrinos,PCTP/MRPP,0,0,041233
Vilar de Peregrinos,PNR,0,0,041233
Vilar de Peregrinos,POUS,0,0,041233
Vilar de Peregrinos,PPM,0,0,041233
Vilar de Peregrinos,PPV,0,0,041233
Vilar de Peregrinos,PTP,0,0,041233
