freguesia,acronym,validVotesPercentage,votes,dicofre
Mosteiro,PPD/PSD.CDS-PP,41.67,5,480107
Mosteiro,PS,33.33,4,480107
Mosteiro,PDA,16.67,2,480107
Mosteiro,MPT,8.33,1,480107
Mosteiro,B.E.,0,0,480107
Mosteiro,L,0,0,480107
Mosteiro,MAS,0,0,480107
Mosteiro,PAN,0,0,480107
Mosteiro,PCP-PEV,0,0,480107
Mosteiro,PCTP/MRPP,0,0,480107
Mosteiro,PND,0,0,480107
Mosteiro,PNR,0,0,480107
Mosteiro,POUS,0,0,480107
Mosteiro,PPM,0,0,480107
Mosteiro,PPV,0,0,480107
Mosteiro,PTP,0,0,480107
