freguesia,acronym,validVotesPercentage,votes,dicofre
Regilde,PS,60.79,200,130318
Regilde,PPD/PSD,15.2,50,130318
Regilde,B.E.,8.21,27,130318
Regilde,CDS-PP,3.95,13,130318
Regilde,PAN,3.65,12,130318
Regilde,PCP-PEV,3.65,12,130318
Regilde,A,1.52,5,130318
Regilde,L,0.91,3,130318
Regilde,PPM.PPV/CDC,0.61,2,130318
Regilde,IL,0.3,1,130318
Regilde,NC,0.3,1,130318
Regilde,PCTP/MRPP,0.3,1,130318
Regilde,PDR,0.3,1,130318
Regilde,PTP,0.3,1,130318
Regilde,MAS,0,0,130318
Regilde,PNR,0,0,130318
Regilde,PURP,0,0,130318
