freguesia,acronym,validVotesPercentage,votes,dicofre
Covas do Douro,PS,49.36,77,171002
Covas do Douro,PPD/PSD,27.56,43,171002
Covas do Douro,B.E.,5.13,8,171002
Covas do Douro,CDS-PP,4.49,7,171002
Covas do Douro,PAN,3.21,5,171002
Covas do Douro,PCP-PEV,3.21,5,171002
Covas do Douro,L,1.92,3,171002
Covas do Douro,PPM.PPV/CDC,1.92,3,171002
Covas do Douro,IL,0.64,1,171002
Covas do Douro,MAS,0.64,1,171002
Covas do Douro,NC,0.64,1,171002
Covas do Douro,PCTP/MRPP,0.64,1,171002
Covas do Douro,PDR,0.64,1,171002
Covas do Douro,A,0,0,171002
Covas do Douro,PNR,0,0,171002
Covas do Douro,PTP,0,0,171002
Covas do Douro,PURP,0,0,171002
