freguesia,acronym,validVotesPercentage,votes,dicofre
São Salvador e Santa Maria,PCP-PEV,32.89,343,021120
São Salvador e Santa Maria,PS,31.74,331,021120
São Salvador e Santa Maria,PPD/PSD.CDS-PP,14.96,156,021120
São Salvador e Santa Maria,MPT,5.66,59,021120
São Salvador e Santa Maria,PCTP/MRPP,4.7,49,021120
São Salvador e Santa Maria,B.E.,4.03,42,021120
São Salvador e Santa Maria,L,1.63,17,021120
São Salvador e Santa Maria,PAN,1.53,16,021120
São Salvador e Santa Maria,PTP,0.77,8,021120
São Salvador e Santa Maria,PNR,0.67,7,021120
São Salvador e Santa Maria,PPM,0.58,6,021120
São Salvador e Santa Maria,PND,0.48,5,021120
São Salvador e Santa Maria,MAS,0.19,2,021120
São Salvador e Santa Maria,PPV,0.19,2,021120
São Salvador e Santa Maria,PDA,0,0,021120
São Salvador e Santa Maria,POUS,0,0,021120
