Objeto do Contrato,Tipo de Procedimento,Tipo(s) de Contrato,CPVs,Entidade(s) Adjudicante(s),Entidade(s) Adjudicatária(s),Preço Contratual,Data de Publicação,Data de Celebração do Contrato,Prazo de Execução,Local de Execução,Fundamentação,Data de Fecho do Contrato,Preço Total Efetivo,Causas das Alterações ao Prazo,Causas das Alterações ao Preço,Estado,N.º registo do Acordo Quadro,Descrição do Acordo Quadro,Procedimento Centralizado
"Aquisição de Sistema de Armazenamento de Dados para """"Datacenter"""" da ULS na Guarda ",Concurso público,Aquisição de bens móveis<br/>Aquisição de serviços,"30234500-3, Meios de armazenamento de memória","Unidade Local de Saúde da Guarda, E. P. E. (508752000)",Gonksys S.A. (510874169),"22.453,63 €",10-03-2017,13-01-2017,42 dias,"Portugal, Guarda, Guarda","Artigo 20.º, n.º 1, alínea b) do Código dos Contratos Públicos",,,,,,Não aplicável.,Não aplicável.,FALSE
Renovação do Licenciamento e Suporte do Sistema de Gestão de Transporte de Doentes (SGTD) para 2017,Ajuste Direto Regime Geral,Aquisição de serviços,"72200000-7, Serviços de consultoria e de programação de software","Unidade Local de Saúde da Guarda, E. P. E. (508752000)","Link Consulting-Tecnologias de informação ,S.A (504551221)","11.000,00 €",08-03-2017,13-02-2017,365 dias,"Portugal, Guarda, Guarda","Artigo 24.º, n.º 1, alínea e) do Código dos Contratos Públicos",,,,,,Não aplicável.,Não aplicável.,FALSE
"  Aquisição de Serviços para Contentorização, Recolha, Tratamento e Transporte de Resíduos Sólidos Urbanos",Concurso público,Aquisição de serviços,"90511100-3, Serviços de recolha de resíduos sólidos urbanos","UNIDADE LOCAL DE SAÚDE DA GUARDA, E.P.E (508752000)","RRI - Recolha de Residuos Industriais, S.A (504982010)","26.900,04 €",02-03-2017,14-02-2017,365 dias,"Portugal, Guarda, Guarda","Artigo 20.º, n.º 1, alínea b) do Código dos Contratos Públicos",,,,,,Não aplicável.,Não aplicável.,FALSE
Pavimentação do espaço junto ao INEM com acesso ao compactador de resíduos,Ajuste Direto Regime Geral,Empreitadas de obras públicas,"45432112-2, Pavimentação","UNIDADE LOCAL DE SAÚDE DA GUARDA, E.P.E (508752000)","João Tomé Saraiva - Sociedade de Construções, Lda. (506887260)","8.260,00 €",02-03-2017,17-11-2016,15 dias,"Portugal, Guarda, Guarda","Artigo 19.º, alínea a) do Código dos Contratos Públicos",,,,,,Não aplicável.,Não aplicável.,FALSE
