freguesia,acronym,validVotesPercentage,votes,dicofre
União das freguesias de Tourais e Lajes,PPD/PSD.CDS-PP,55.08,309,091235
União das freguesias de Tourais e Lajes,PS,30.84,173,091235
União das freguesias de Tourais e Lajes,MPT,4.63,26,091235
União das freguesias de Tourais e Lajes,PCP-PEV,2.67,15,091235
União das freguesias de Tourais e Lajes,B.E.,1.6,9,091235
União das freguesias de Tourais e Lajes,PAN,1.07,6,091235
União das freguesias de Tourais e Lajes,PND,1.07,6,091235
União das freguesias de Tourais e Lajes,L,0.89,5,091235
União das freguesias de Tourais e Lajes,PCTP/MRPP,0.71,4,091235
União das freguesias de Tourais e Lajes,MAS,0.53,3,091235
União das freguesias de Tourais e Lajes,PNR,0.36,2,091235
União das freguesias de Tourais e Lajes,PDA,0.18,1,091235
União das freguesias de Tourais e Lajes,POUS,0.18,1,091235
União das freguesias de Tourais e Lajes,PTP,0.18,1,091235
União das freguesias de Tourais e Lajes,PPM,0,0,091235
União das freguesias de Tourais e Lajes,PPV,0,0,091235
