Objeto do Contrato,Tipo de Procedimento,Tipo(s) de Contrato,CPVs,Entidade(s) Adjudicante(s),Entidade(s) Adjudicatária(s),Preço Contratual,Data de Publicação,Data de Celebração do Contrato,Prazo de Execução,Local de Execução,Fundamentação,Data de Fecho do Contrato,Preço Total Efetivo,Causas das Alterações ao Prazo,Causas das Alterações ao Preço,Estado,N.º registo do Acordo Quadro,Descrição do Acordo Quadro,Procedimento Centralizado
AD - 48000317 CAL SODADA,Ajuste Direto Regime Geral,Aquisição de bens móveis,"33600000-6, Produtos farmacêuticos",Hospital Dr. Francisco Zagalo (501510150),"Iberdata, Equipamentos, S.A. (501904921)","134,04 €",27-11-2017,27-10-2017,66 dias,"Portugal, Aveiro, Ovar","Artigo 20.º, n.º 1, alínea a) do Código dos Contratos Públicos",30-11-2017,"134,04 €",,"",,Não aplicável.,Não aplicável.,FALSE
51002017 - ÓXIDO FERRICO SACAROSADO,Ao abrigo de acordo-quadro (art.º 259.º),Aquisição de bens móveis,"33600000-6, Produtos farmacêuticos",Hospital Dr. Francisco Zagalo (501510150),OM PHARMA S.A (500207410),"240,00 €",24-11-2017,03-11-2017,59 dias,"Portugal, Aveiro, Ovar",Artigo 259.º do Código dos Contratos Públicos,15-12-2017,"240,00 €",,"",,2489595,CP 2016/18 - Acordo quadro para fornecimento de Medicamentos do Grupo 4: Sangue às Instituições e Serviços do Serviço Nacional de Saúde,FALSE
51001917 - AQUISIÇÃO IMIGLUCERASE 400,Ao abrigo de acordo-quadro (art.º 259.º),Aquisição de bens móveis,"33690000-3, Medicamentos vários",Hospital Dr. Francisco Zagalo (501510150),"SANOFI- PRODUTOS FARMACÊUTICOS,LDA. (500134960)","57.004,20 €",22-11-2017,18-10-2017,129 dias,"Portugal, Aveiro, Ovar",Artigo 259.º do Código dos Contratos Públicos,15-12-2017,"57.004,20 €",,"",,2658382,CP 2017/58 - Acordo Quadro para fornecimento de Medicamentos para Doenças Lisossomais de Sobrecarga às Instituições e Serviços do Serviço Nacional de Saúde,FALSE
AD 51001117 CORRETIVO DA VOLÉMIA E OUTRAS SOLUÇÕES ESTEREIS,Ao abrigo de acordo-quadro (art.º 259.º),Aquisição de bens móveis,"33600000-6, Produtos farmacêuticos",Hospital Dr. Francisco Zagalo - Ovar (501510150),"LABESFAL-LAB. ALMIRO, SA. (501169580)","65,69 €",21-11-2017,28-06-2017,187 dias,"Portugal, Aveiro, Ovar",Artigo 259.º do Código dos Contratos Públicos,29-12-2017,"",,valor da previsão superior as necessidades,,1331181,Acordo Quadro para fornecimento de corretivos da volémia e outras soluções estéreis às Instituições e Serviços do Serviço Nacional de Saúde,FALSE
AD 51001117 CORRETIVO DA VOLÉMIA E OUTRAS SOLUÇÕES ESTEREIS,Ao abrigo de acordo-quadro (art.º 259.º),Aquisição de bens móveis,"33600000-6, Produtos farmacêuticos",Hospital Dr. Francisco Zagalo - Ovar (501510150),"Baxter Médico Farmacêutica, Lda. (503347345)","17,40 €",21-11-2017,28-06-2017,187 dias,"Portugal, Aveiro, Ovar",Artigo 259.º do Código dos Contratos Públicos,29-12-2017,"",,valor da previsão superior as necessidades,,1331181,Acordo Quadro para fornecimento de corretivos da volémia e outras soluções estéreis às Instituições e Serviços do Serviço Nacional de Saúde,FALSE
AD 51001117 CORRETIVO DA VOLÉMIA E OUTRAS SOLUÇÕES ESTEREIS,Ao abrigo de acordo-quadro (art.º 259.º),Aquisição de bens móveis,"33600000-6, Produtos farmacêuticos",Hospital Dr. Francisco Zagalo - Ovar (501510150),B. BRAUN (501506543),"101,50 €",21-11-2017,28-06-2017,187 dias,"Portugal, Aveiro, Ovar",Artigo 259.º do Código dos Contratos Públicos,29-12-2017,"66,06 €",,valor da previsão superior as necessidades,,1331181,Acordo Quadro para fornecimento de corretivos da volémia e outras soluções estéreis às Instituições e Serviços do Serviço Nacional de Saúde,FALSE
AD 51001117 CORRETIVO DA VOLÉMIA E OUTRAS SOLUÇÕES ESTEREIS,Ao abrigo de acordo-quadro (art.º 259.º),Aquisição de bens móveis,"33600000-6, Produtos farmacêuticos",Hospital Dr. Francisco Zagalo - Ovar (501510150),B. BRAUN (501506543),"79,56 €",21-11-2017,28-06-2017,187 dias,"Portugal, Aveiro, Ovar",Artigo 259.º do Código dos Contratos Públicos,29-12-2017,"72,30 €",,valor da previsão superior as necessidades,,1331181,Acordo Quadro para fornecimento de corretivos da volémia e outras soluções estéreis às Instituições e Serviços do Serviço Nacional de Saúde,FALSE
AD 51001117 CORRETIVO DA VOLÉMIA E OUTRAS SOLUÇÕES ESTEREIS,Ao abrigo de acordo-quadro (art.º 259.º),Aquisição de bens móveis,"33600000-6, Produtos farmacêuticos",Hospital Dr. Francisco Zagalo - Ovar (501510150),B. BRAUN (501506543),"817,38 €",21-11-2017,28-06-2017,187 dias,"Portugal, Aveiro, Ovar",Artigo 259.º do Código dos Contratos Públicos,29-12-2017,"444,00 €",,valor da previsão superior as necessidades,,1331181,Acordo Quadro para fornecimento de corretivos da volémia e outras soluções estéreis às Instituições e Serviços do Serviço Nacional de Saúde,FALSE
AD 51001117 CORRETIVO DA VOLÉMIA E OUTRAS SOLUÇÕES ESTEREIS,Ao abrigo de acordo-quadro (art.º 259.º),Aquisição de bens móveis,"33600000-6, Produtos farmacêuticos",Hospital Dr. Francisco Zagalo - Ovar (501510150),B. BRAUN (501506543),"141,84 €",21-11-2017,28-06-2017,187 dias,"Portugal, Aveiro, Ovar",Artigo 259.º do Código dos Contratos Públicos,29-12-2017,"",,valor da previsão superior as necessidades,,1331181,Acordo Quadro para fornecimento de corretivos da volémia e outras soluções estéreis às Instituições e Serviços do Serviço Nacional de Saúde,FALSE
AD 51001117 CORRETIVO DA VOLÉMIA E OUTRAS SOLUÇÕES ESTEREIS,Ao abrigo de acordo-quadro (art.º 259.º),Aquisição de bens móveis,"33600000-6, Produtos farmacêuticos",Hospital Dr. Francisco Zagalo - Ovar (501510150),B. BRAUN (501506543),"362,00 €",21-11-2017,28-06-2017,187 dias,"Portugal, Aveiro, Ovar",Artigo 259.º do Código dos Contratos Públicos,29-12-2017,"",,valor da previsão superior as necessidades,,1331181,Acordo Quadro para fornecimento de corretivos da volémia e outras soluções estéreis às Instituições e Serviços do Serviço Nacional de Saúde,FALSE
- AD 51001117 CORRETIVO DA VOLÉMIA E OUTRAS SOLUÇÕES ESTEREIS,Ao abrigo de acordo-quadro (art.º 259.º),Aquisição de bens móveis,"33600000-6, Produtos farmacêuticos",Hospital Dr. Francisco Zagalo - Ovar (501510150),"Baxter Médico Farmacêutica, Lda. (503347345)","33,60 €",21-11-2017,28-06-2017,187 dias,"Portugal, Aveiro, Ovar",Artigo 259.º do Código dos Contratos Públicos,29-12-2017,"",,valor da previsão superior as necessidades,,1331181,Acordo Quadro para fornecimento de corretivos da volémia e outras soluções estéreis às Instituições e Serviços do Serviço Nacional de Saúde,FALSE
- AD 51001117 CORRETIVO DA VOLÉMIA E OUTRAS SOLUÇÕES ESTEREIS,Ao abrigo de acordo-quadro (art.º 259.º),Aquisição de bens móveis,"33600000-6, Produtos farmacêuticos",Hospital Dr. Francisco Zagalo - Ovar (501510150),"Baxter Médico Farmacêutica, Lda. (503347345)","19,96 €",21-11-2017,28-06-2017,187 dias,"Portugal, Aveiro, Ovar",Artigo 259.º do Código dos Contratos Públicos,29-12-2017,"9,48 €",,valor da previsão superior as necessidades,,1331181,Acordo Quadro para fornecimento de corretivos da volémia e outras soluções estéreis às Instituições e Serviços do Serviço Nacional de Saúde,FALSE
- AD 51001117 CORRETIVO DA VOLÉMIA E OUTRAS SOLUÇÕES ESTEREIS,Ao abrigo de acordo-quadro (art.º 259.º),Aquisição de bens móveis,"33600000-6, Produtos farmacêuticos",Hospital Dr. Francisco Zagalo - Ovar (501510150),"Baxter Médico Farmacêutica, Lda. (503347345)","36,00 €",21-11-2017,28-06-2017,187 dias,"Portugal, Aveiro, Ovar",Artigo 259.º do Código dos Contratos Públicos,29-12-2017,"",,valor da previsão superior as necessidades,,1331181,Acordo Quadro para fornecimento de corretivos da volémia e outras soluções estéreis às Instituições e Serviços do Serviço Nacional de Saúde,FALSE
- AD 51001117 CORRETIVO DA VOLÉMIA E OUTRAS SOLUÇÕES ESTEREIS,Ao abrigo de acordo-quadro (art.º 259.º),Aquisição de bens móveis,"33600000-6, Produtos farmacêuticos",Hospital Dr. Francisco Zagalo - Ovar (501510150),"Baxter Médico Farmacêutica, Lda. (503347345)","51,50 €",21-11-2017,28-06-2017,187 dias,"Portugal, Aveiro, Ovar",Artigo 259.º do Código dos Contratos Públicos,29-12-2017,"",,valor da previsão superior as necessidades,,1331181,Acordo Quadro para fornecimento de corretivos da volémia e outras soluções estéreis às Instituições e Serviços do Serviço Nacional de Saúde,FALSE
- AD 51001117 CORRETIVO DA VOLÉMIA E OUTRAS SOLUÇÕES ESTEREIS,Ao abrigo de acordo-quadro (art.º 259.º),Aquisição de bens móveis,"33600000-6, Produtos farmacêuticos",Hospital Dr. Francisco Zagalo - Ovar (501510150),"Baxter Médico Farmacêutica, Lda. (503347345)","209,70 €",21-11-2017,28-06-2017,187 dias,"Portugal, Aveiro, Ovar",Artigo 259.º do Código dos Contratos Públicos,29-12-2017,"132,82 €",,valor da previsão superior as necessidades,,1331181,Acordo Quadro para fornecimento de corretivos da volémia e outras soluções estéreis às Instituições e Serviços do Serviço Nacional de Saúde,FALSE
- AD 51001117 CORRETIVO DA VOLÉMIA E OUTRAS SOLUÇÕES ESTEREIS,Ao abrigo de acordo-quadro (art.º 259.º),Aquisição de bens móveis,"33600000-6, Produtos farmacêuticos",Hospital Dr. Francisco Zagalo - Ovar (501510150),B. BRAUN (501506543),"65,16 €",21-11-2017,28-06-2017,187 dias,"Portugal, Aveiro, Ovar",Artigo 259.º do Código dos Contratos Públicos,29-12-2017,"",,valor da previsão superior as necessidades,,1331181,Acordo Quadro para fornecimento de corretivos da volémia e outras soluções estéreis às Instituições e Serviços do Serviço Nacional de Saúde,FALSE
- AD 51001117 CORRETIVO DA VOLÉMIA E OUTRAS SOLUÇÕES ESTEREIS,Ao abrigo de acordo-quadro (art.º 259.º),Aquisição de bens móveis,"33600000-6, Produtos farmacêuticos",Hospital Dr. Francisco Zagalo - Ovar (501510150),B. BRAUN (501506543),"49,75 €",21-11-2017,28-06-2017,187 dias,"Portugal, Aveiro, Ovar",Artigo 259.º do Código dos Contratos Públicos,29-12-2017,"",,valor da previsão superior as necessidades,,1331181,Acordo Quadro para fornecimento de corretivos da volémia e outras soluções estéreis às Instituições e Serviços do Serviço Nacional de Saúde,FALSE
- AD 51001117 CORRETIVO DA VOLÉMIA E OUTRAS SOLUÇÕES ESTEREIS,Ao abrigo de acordo-quadro (art.º 259.º),Aquisição de bens móveis,"33600000-6, Produtos farmacêuticos",Hospital Dr. Francisco Zagalo - Ovar (501510150),"OVERPHARMA,LDA. (505792362)","46,98 €",21-11-2017,28-06-2017,187 dias,"Portugal, Aveiro, Ovar",Artigo 259.º do Código dos Contratos Públicos,29-12-2017,"",,valor da previsão superior as necessidades,,1331181,Acordo Quadro para fornecimento de corretivos da volémia e outras soluções estéreis às Instituições e Serviços do Serviço Nacional de Saúde,FALSE
- AD 51001117 CORRETIVO DA VOLÉMIA E OUTRAS SOLUÇÕES ESTEREIS,Ao abrigo de acordo-quadro (art.º 259.º),Aquisição de bens móveis,"33600000-6, Produtos farmacêuticos",Hospital Dr. Francisco Zagalo - Ovar (501510150),B. BRAUN (501506543),"41,62 €",21-11-2017,28-06-2017,187 dias,"Portugal, Aveiro, Ovar",Artigo 259.º do Código dos Contratos Públicos,29-12-2017,"",,valor da previsão superior as necessidades,,1331181,Acordo Quadro para fornecimento de corretivos da volémia e outras soluções estéreis às Instituições e Serviços do Serviço Nacional de Saúde,FALSE
- AD 51001117 CORRETIVO DA VOLÉMIA E OUTRAS SOLUÇÕES ESTEREIS,Ao abrigo de acordo-quadro (art.º 259.º),Aquisição de bens móveis,"33600000-6, Produtos farmacêuticos",Hospital Dr. Francisco Zagalo - Ovar (501510150),B. BRAUN (501506543),"108,16 €",21-11-2017,28-06-2017,187 dias,"Portugal, Aveiro, Ovar",Artigo 259.º do Código dos Contratos Públicos,29-12-2017,"",,valor da previsão superior as necessidades,,1331181,Acordo Quadro para fornecimento de corretivos da volémia e outras soluções estéreis às Instituições e Serviços do Serviço Nacional de Saúde,FALSE
AD -51001117 CORRETIVO DE VOLÉMIA E OUTRAS SOLUÇÕES ESTEREIS,Ao abrigo de acordo-quadro (art.º 259.º),Aquisição de bens móveis,"33600000-6, Produtos farmacêuticos",Hospital Dr. Francisco Zagalo - Ovar (501510150),"LABESFAL-LAB. ALMIRO, SA. (501169580)","150,00 €",21-11-2017,28-06-2017,187 dias,"Portugal, Aveiro, Ovar",Artigo 259.º do Código dos Contratos Públicos,29-12-2017,"",,valor da previsão superior as necessidades,,1331181,Acordo Quadro para fornecimento de corretivos da volémia e outras soluções estéreis às Instituições e Serviços do Serviço Nacional de Saúde,FALSE
AD -51001117 CORRETIVO DE VOLÉMIA E OUTRAS SOLUÇÕES ESTEREIS,Ao abrigo de acordo-quadro (art.º 259.º),Aquisição de bens móveis,"33600000-6, Produtos farmacêuticos",Hospital Dr. Francisco Zagalo - Ovar (501510150),"GRIFOLS PORTUGAL-PROD.FARM.HOSPIT., LDA (502041285)","309,76 €",21-11-2017,28-06-2017,187 dias,"Portugal, Aveiro, Ovar",Artigo 259.º do Código dos Contratos Públicos,29-12-2017,"128,00 €",,valor da previsão superior as necessidades,,1331181,Acordo Quadro para fornecimento de corretivos da volémia e outras soluções estéreis às Instituições e Serviços do Serviço Nacional de Saúde,FALSE
AD -51001117 CORRETIVO DE VOLÉMIA E OUTRAS SOLUÇÕES ESTEREIS,Ao abrigo de acordo-quadro (art.º 259.º),Aquisição de bens móveis,"33600000-6, Produtos farmacêuticos",Hospital Dr. Francisco Zagalo - Ovar (501510150),B. BRAUN (501506543),"383,68 €",21-11-2017,28-06-2017,187 dias,"Portugal, Aveiro, Ovar",Artigo 259.º do Código dos Contratos Públicos,29-12-2017,"228,00 €",,valor da previsão superior as necessidades,,1331181,Acordo Quadro para fornecimento de corretivos da volémia e outras soluções estéreis às Instituições e Serviços do Serviço Nacional de Saúde,FALSE
AD -51001117 CORRETIVO DE VOLÉMIA E OUTRAS SOLUÇÕES ESTEREIS,Ao abrigo de acordo-quadro (art.º 259.º),Aquisição de bens móveis,"33600000-6, Produtos farmacêuticos",Hospital Dr. Francisco Zagalo - Ovar (501510150),"OVERPHARMA,LDA. (505792362)","806,00 €",21-11-2017,28-06-2017,187 dias,"Portugal, Aveiro, Ovar",Artigo 259.º do Código dos Contratos Públicos,29-12-2017,"528,00 €",,valor da previsão superior as necessidades,,1331181,Acordo Quadro para fornecimento de corretivos da volémia e outras soluções estéreis às Instituições e Serviços do Serviço Nacional de Saúde,FALSE
AD -51001117 CORRETIVO DE VOLÉMIA E OUTRAS SOLUÇÕES ESTEREIS,Ao abrigo de acordo-quadro (art.º 259.º),Aquisição de bens móveis,"33600000-6, Produtos farmacêuticos",Hospital Dr. Francisco Zagalo - Ovar (501510150),B. Braun Medical (501506543),"903,81 €",21-11-2017,28-06-2017,187 dias,"Portugal, Aveiro, Ovar",Artigo 259.º do Código dos Contratos Públicos,29-12-2017,"375,00 €",,valor da previsão superior as necessidades,,1331181,Acordo Quadro para fornecimento de corretivos da volémia e outras soluções estéreis às Instituições e Serviços do Serviço Nacional de Saúde,FALSE
AD -51001117 CORRETIVO DE VOLÉMIA E OUTRAS SOLUÇÕES ESTEREIS,Ao abrigo de acordo-quadro (art.º 259.º),Aquisição de bens móveis,"33600000-6, Produtos farmacêuticos",Hospital Dr. Francisco Zagalo - Ovar (501510150),B. Braun Medical (501506543),"63,92 €",21-11-2017,28-06-2017,187 dias,"Portugal, Aveiro, Ovar",Artigo 259.º do Código dos Contratos Públicos,29-12-2017,"",,valor da previsão superior as necessidades,,1331181,Acordo Quadro para fornecimento de corretivos da volémia e outras soluções estéreis às Instituições e Serviços do Serviço Nacional de Saúde,FALSE
AD -51001117 CORRETIVO DE VOLÉMIA E OUTRAS SOLUÇÕES ESTEREIS,Ao abrigo de acordo-quadro (art.º 259.º),Aquisição de bens móveis,"33600000-6, Produtos farmacêuticos",Hospital Dr. Francisco Zagalo - Ovar (501510150),B. Braun Medical (501506543),"38,88 €",21-11-2017,28-06-2017,187 dias,"Portugal, Aveiro, Ovar",Artigo 259.º do Código dos Contratos Públicos,29-12-2017,"",,valor da previsão superior as necessidades,,1331181,Acordo Quadro para fornecimento de corretivos da volémia e outras soluções estéreis às Instituições e Serviços do Serviço Nacional de Saúde,FALSE
AD -51001117 CORRETIVO DE VOLÉMIA E OUTRAS SOLUÇÕES,Ao abrigo de acordo-quadro (art.º 259.º),Aquisição de bens móveis,"33600000-6, Produtos farmacêuticos",Hospital Dr. Francisco Zagalo - Ovar (501510150),B. Braun Medical (501506543),"76,60 €",21-11-2017,28-06-2017,187 dias,"Portugal, Aveiro, Ovar",Artigo 259.º do Código dos Contratos Públicos,29-12-2017,"",,valor da previsão superior as necessidades,,1331181,Acordo Quadro para fornecimento de corretivos da volémia e outras soluções estéreis às Instituições e Serviços do Serviço Nacional de Saúde,FALSE
AD -51001117 CORRETIVO DE VOLÉMIA E OUTRAS SOLUÇÕES ESTEREIS,Ao abrigo de acordo-quadro (art.º 259.º),Aquisição de bens móveis,"33600000-6, Produtos farmacêuticos",Hospital Dr. Francisco Zagalo - Ovar (501510150),B. Braun Medical (501506543),"31,00 €",21-11-2017,28-06-2017,187 dias,"Portugal, Aveiro, Ovar",Artigo 259.º do Código dos Contratos Públicos,29-12-2017,"",,valor da previsão superior as necessidades,,1331181,Acordo Quadro para fornecimento de corretivos da volémia e outras soluções estéreis às Instituições e Serviços do Serviço Nacional de Saúde,FALSE
