freguesia,acronym,validVotesPercentage,votes,dicofre
Manhouce,PS,53.28,146,181607
Manhouce,PPD/PSD,28.47,78,181607
Manhouce,CDS-PP,4.38,12,181607
Manhouce,B.E.,4.01,11,181607
Manhouce,PCP-PEV,4.01,11,181607
Manhouce,L,1.09,3,181607
Manhouce,R.I.R.,1.09,3,181607
Manhouce,IL,0.73,2,181607
Manhouce,PCTP/MRPP,0.73,2,181607
Manhouce,PURP,0.73,2,181607
Manhouce,CH,0.36,1,181607
Manhouce,MPT,0.36,1,181607
Manhouce,PNR,0.36,1,181607
Manhouce,PPM,0.36,1,181607
Manhouce,A,0,0,181607
Manhouce,JPP,0,0,181607
Manhouce,NC,0,0,181607
Manhouce,PAN,0,0,181607
Manhouce,PDR,0,0,181607
Manhouce,PTP,0,0,181607
