Objeto do Contrato,Tipo de Procedimento,Tipo(s) de Contrato,CPVs,Entidade(s) Adjudicante(s),Entidade(s) Adjudicatária(s),Preço Contratual,Data de Publicação,Data de Celebração do Contrato,Prazo de Execução,Local de Execução,Fundamentação,Data de Fecho do Contrato,Preço Total Efetivo,Causas das Alterações ao Prazo,Causas das Alterações ao Preço,Estado,N.º registo do Acordo Quadro,Descrição do Acordo Quadro,Procedimento Centralizado
Aquisição de tablets com capa e teclado,Consulta Prévia,Aquisição de bens móveis,"30236000-2, Equipamento informático diverso",Entidade Reguladora da Saúde (507021266),"Pamafe Informática, Lda (504099388)","5.393,86 €",02-02-2019,14-12-2018,15 dias,"Portugal, Porto, Porto","Artigo 20.º, n.º 1, alínea c) do Código dos Contratos Públicos",,,,,,Não aplicável.,Não aplicável.,FALSE
"Aquisição de computadores portáteis e fixos, monitores, teclados e tapetes para ratos",Consulta Prévia,Aquisição de bens móveis,"30236000-2, Equipamento informático diverso",Entidade Reguladora da Saúde (507021266),"Pamafe Informática, Lda. (504099388)","19.155,85 €",02-02-2019,14-12-2018,15 dias,"Portugal, Porto, Porto","Artigo 20.º, n.º 1, alínea c) do Código dos Contratos Públicos",,,,,,Não aplicável.,Não aplicável.,FALSE
"Aquisição de computadores fixos, monitores, teclados, ratos e tapetes para rato.",Consulta Prévia,Aquisição de bens móveis,"30236000-2, Equipamento informático diverso",Entidade Reguladora da Saúde (507021266),"Pamafe Informática, lda (504099388)","20.878,30 €",01-02-2019,09-11-2018,20 dias,"Portugal, Porto, Porto","Artigo 20.º, n.º 1, alínea c) do Código dos Contratos Públicos",,,,,,Não aplicável.,Não aplicável.,FALSE
"Fornecimento de combustíveis rodoviários (gasóleos), em postos de abastecimento públicos em Portugal Continental.",Consulta Prévia,Aquisição de bens móveis,"09134000-7, Gasóleos",Entidade Reguladora da Saúde (507021266),"Petróleos de Portugal - Petrogal, S.A. (500697370)","25.000,00 €",01-02-2019,14-08-2018,1095 dias,Portugal,"Artigo 20.º, n.º 1, alínea c) do Código dos Contratos Públicos",,,,,,Não aplicável.,Não aplicável.,FALSE
Aquisição de serviços para integração de uma nova imagem institucional na ERS,Ajuste Direto Regime Geral,Aquisição de serviços,"79930000-2, Serviços de concepção de modelos especializados",Entidade Reguladora da Saúde (507021266),"Rui Álvaro Silva - Design Unipessoal, Lda. (510033628)","10.750,00 €",01-02-2019,21-12-2018,10 dias,Portugal,"Artigo 20.º, n.º 1, alínea d) do Código dos Contratos Públicos",,,,,,Não aplicável.,Não aplicável.,FALSE
Criação e implementação de um portal institucional para a Entidade Reguladora da Saúde (ERS),Consulta Prévia,Aquisição de serviços,"72413000-8, Serviços de concepção de sítios da World Wide Web (WWW)",Entidade Reguladora da Saúde (507021266),"PontoPR - Serviços de Publicidade e Robótica, Lda (504794108)","27.870,00 €",01-02-2019,19-11-2018,60 dias,Portugal,"Artigo 20.º, n.º 1, alínea c) do Código dos Contratos Públicos",,,,,,Não aplicável.,Não aplicável.,FALSE
"Aquisição de serviços informáticos para: a)	a manutenção preventiva e corretiva, bem como a resolução de incidentes nas plataformas informáticas atualmente existentes de suporte ao Sistema Nacional de Avaliação em Saúde (SINAS) – plataforma de recolha de dados (SINAS.data) e plataforma tecnológica de cálculo de indicadores; b)	a revisão, atualização e introdução de novos indicadores no SINAS@Hospitais através de uma bolsa de 300 horas de serviços, prestados por acesso remoto por um programador sénior, com capacidade para dominar a solução. ",Consulta Prévia,Aquisição de serviços,"50324200-4, Serviços de manutenção preventiva",Entidade Reguladora da Saúde (507021266),"Cerner Portugal, Unipessoal, Lda (513269843)","34.000,00 €",01-02-2019,25-07-2018,365 dias,Portugal,"Artigo 20.º, n.º 1, alínea c) do Código dos Contratos Públicos",,,,,,Não aplicável.,Não aplicável.,FALSE
Aquisição de apólice de seguro de Acidentes de Trabalho,Consulta Prévia,Aquisição de serviços,"66512000-2, Serviços de seguros de acidentes e de saúde",Entidade Reguladora da Saúde (507021266),"Fidelidade - Companhia de Seguros, S.A. (500918880)","49.861,92 €",01-02-2019,18-12-2018,730 dias,Portugal,"Artigo 20.º, n.º 1, alínea c) do Código dos Contratos Públicos",,,,,,Não aplicável.,Não aplicável.,FALSE
Aquisição de serviços especializados para apoio à otimização do processo de tratamento de queixas e reclamações do utente do sistema de saúde,Ajuste Direto Regime Geral,Aquisição de serviços,"79930000-2, Serviços de concepção de modelos especializados",Entidade Reguladora da Saúde (507021266),"Kaizen Institute Portugal Training Unipessoal, Lda (508830001)","11.200,00 €",01-02-2019,27-08-2018,60 dias,"Portugal, Porto, Porto","Artigo 20.º, n.º 1, alínea d) do Código dos Contratos Públicos",,,,,,Não aplicável.,Não aplicável.,FALSE
"Desenvolvimento de funcionalidades no sistema informático, denominado SRER, com vista à conformidade com as normas do RGPD",Consulta Prévia,Aquisição de serviços,"72000000-5, Serviços de TI: consultoria, desenvolvimento de software, Internet e apoio",Entidade Reguladora da Saúde (507021266),"Ubiquity Tecnology, Lda (510134696)","74.400,00 €",01-02-2019,26-10-2018,150 dias,"Portugal, Porto, Porto","Artigo 20.º, n.º 1, alínea c) do Código dos Contratos Públicos",,,,,,Não aplicável.,Não aplicável.,FALSE
Aquisição de serviços de limpeza para as instalações da Entidade Reguladora da Saúde,Consulta Prévia,Aquisição de serviços,"98300000-6, Serviços diversos",Entidade Reguladora da Saúde (507021266),"Euromex - Facility Services, Lda (502629428)","65.819,88 €",01-02-2019,17-09-2018,1095 dias,"Portugal, Porto, Porto","Artigo 20.º, n.º 1, alínea c) do Código dos Contratos Públicos",,,,,,Não aplicável.,Não aplicável.,FALSE
