Objeto do Contrato,Tipo de Procedimento,Tipo(s) de Contrato,CPVs,Entidade(s) Adjudicante(s),Entidade(s) Adjudicatária(s),Preço Contratual,Data de Publicação,Data de Celebração do Contrato,Prazo de Execução,Local de Execução,Fundamentação,Data de Fecho do Contrato,Preço Total Efetivo,Causas das Alterações ao Prazo,Causas das Alterações ao Preço,Estado,N.º registo do Acordo Quadro,Descrição do Acordo Quadro,Procedimento Centralizado
Aquisição de diverso material de cirurgia - AjD 42389316,Ajuste Direto Regime Geral,Aquisição de bens móveis,"33140000-3, Material médico de consumo",Centro Hospitalar do Oeste (510412009),"SOCIME II - PRODUTOS MEDICOS, LDA (504453939)","234,00 €",10-11-2016,03-10-2016,1 dias,"Portugal, Leiria, Caldas da Rainha","Artigo 20.º, n.º 1, alínea a) do Código dos Contratos Públicos",03-10-2016,"234,00 €",,,,Não aplicável.,Não aplicável.,FALSE
Aquisição de diverso material de cirurgia - AjD 42389316,Ajuste Direto Regime Geral,Aquisição de bens móveis,"33140000-3, Material médico de consumo",Centro Hospitalar do Oeste (510412009),"MEDTRONIC PORTUGAL, LDA (504223933)","234,00 €",10-11-2016,03-10-2016,1 dias,"Portugal, Leiria, Caldas da Rainha","Artigo 20.º, n.º 1, alínea a) do Código dos Contratos Públicos",03-10-2016,"234,00 €",,,,Não aplicável.,Não aplicável.,FALSE
Aquisição de diverso material de cirurgia - AjD 42389316,Ajuste Direto Regime Geral,Aquisição de bens móveis,"33140000-3, Material médico de consumo",Centro Hospitalar do Oeste (510412009),"MEDTRONIC PORTUGAL, LDA (504223933)","228,00 €",10-11-2016,03-10-2016,1 dias,"Portugal, Leiria, Caldas da Rainha","Artigo 20.º, n.º 1, alínea a) do Código dos Contratos Públicos",03-10-2016,"228,00 €",,,,Não aplicável.,Não aplicável.,FALSE
Aquisição de diverso material de cirurgia - AjD 42389316,Ajuste Direto Regime Geral,Aquisição de bens móveis,"33140000-3, Material médico de consumo",Centro Hospitalar do Oeste (510412009),"MEDTRONIC PORTUGAL, LDA (504223933)","714,00 €",10-11-2016,03-10-2016,1 dias,"Portugal, Leiria, Caldas da Rainha","Artigo 20.º, n.º 1, alínea a) do Código dos Contratos Públicos",03-10-2016,"714,00 €",,,,Não aplicável.,Não aplicável.,FALSE
Aquisição de material de ortopedia - AjD 42405616,Ajuste Direto Regime Geral,Aquisição de bens móveis,"33140000-3, Material médico de consumo",Centro Hospitalar do Oeste (510412009),"STRYKER PORTUGAL-PROD.Med., Lda (504594214)","5.381,00 €",10-11-2016,13-10-2016,1 dias,"Portugal, Leiria, Caldas da Rainha","Artigo 20.º, n.º 1, alínea a) do Código dos Contratos Públicos",13-10-2016,"5.381,00 €",,,,Não aplicável.,Não aplicável.,FALSE
