freguesia,acronym,validVotesPercentage,votes,dicofre
Meruge,PS,50,117,061110
Meruge,PPD/PSD,28.63,67,061110
Meruge,PCP-PEV,6.84,16,061110
Meruge,B.E.,5.56,13,061110
Meruge,PAN,2.14,5,061110
Meruge,CDS-PP,1.71,4,061110
Meruge,CH,1.28,3,061110
Meruge,PCTP/MRPP,1.28,3,061110
Meruge,A,0.85,2,061110
Meruge,PNR,0.85,2,061110
Meruge,L,0.43,1,061110
Meruge,PDR,0.43,1,061110
Meruge,IL,0,0,061110
Meruge,JPP,0,0,061110
Meruge,MAS,0,0,061110
Meruge,MPT,0,0,061110
Meruge,NC,0,0,061110
Meruge,PPM,0,0,061110
Meruge,PURP,0,0,061110
Meruge,R.I.R.,0,0,061110
