freguesia,acronym,validVotesPercentage,votes,dicofre
Silvalde,PS,46.98,1137,010705
Silvalde,PPD/PSD.CDS-PP,19.79,479,010705
Silvalde,PCP-PEV,14.5,351,010705
Silvalde,MPT,7.23,175,010705
Silvalde,B.E.,4.13,100,010705
Silvalde,PCTP/MRPP,2.81,68,010705
Silvalde,L,1.28,31,010705
Silvalde,PAN,0.91,22,010705
Silvalde,PND,0.45,11,010705
Silvalde,PTP,0.41,10,010705
Silvalde,PNR,0.37,9,010705
Silvalde,PPM,0.37,9,010705
Silvalde,PDA,0.25,6,010705
Silvalde,PPV,0.25,6,010705
Silvalde,POUS,0.17,4,010705
Silvalde,MAS,0.08,2,010705
