freguesia,acronym,validVotesPercentage,votes,dicofre
Benquerença,PS,54.05,120,050706
Benquerença,PPD/PSD,21.17,47,050706
Benquerença,B.E.,7.66,17,050706
Benquerença,PCP-PEV,3.6,8,050706
Benquerença,CDS-PP,2.25,5,050706
Benquerença,CH,2.25,5,050706
Benquerença,PAN,2.25,5,050706
Benquerença,PCTP/MRPP,1.8,4,050706
Benquerença,A,1.35,3,050706
Benquerença,L,0.9,2,050706
Benquerença,MPT,0.9,2,050706
Benquerença,IL,0.45,1,050706
Benquerença,PDR,0.45,1,050706
Benquerença,PNR,0.45,1,050706
Benquerença,R.I.R.,0.45,1,050706
Benquerença,PPM,0,0,050706
Benquerença,PTP,0,0,050706
Benquerença,PURP,0,0,050706
