freguesia,acronym,validVotesPercentage,votes,dicofre
Aldeia da Ponte,PS,48.37,74,091103
Aldeia da Ponte,PPD/PSD,27.45,42,091103
Aldeia da Ponte,B.E.,9.8,15,091103
Aldeia da Ponte,CDS-PP,3.92,6,091103
Aldeia da Ponte,PCP-PEV,3.27,5,091103
Aldeia da Ponte,PAN,2.61,4,091103
Aldeia da Ponte,MPT,1.31,2,091103
Aldeia da Ponte,A,0.65,1,091103
Aldeia da Ponte,CH,0.65,1,091103
Aldeia da Ponte,L,0.65,1,091103
Aldeia da Ponte,PURP,0.65,1,091103
Aldeia da Ponte,R.I.R.,0.65,1,091103
Aldeia da Ponte,IL,0,0,091103
Aldeia da Ponte,NC,0,0,091103
Aldeia da Ponte,PCTP/MRPP,0,0,091103
Aldeia da Ponte,PDR,0,0,091103
Aldeia da Ponte,PNR,0,0,091103
Aldeia da Ponte,PPM,0,0,091103
Aldeia da Ponte,PTP,0,0,091103
