freguesia,acronym,validVotesPercentage,votes,dicofre
União das freguesias de Mezio e Moura Morta,PPD/PSD,47.3,114,180324
União das freguesias de Mezio e Moura Morta,PS,29.46,71,180324
União das freguesias de Mezio e Moura Morta,CDS-PP,11.2,27,180324
União das freguesias de Mezio e Moura Morta,B.E.,3.73,9,180324
União das freguesias de Mezio e Moura Morta,PAN,2.49,6,180324
União das freguesias de Mezio e Moura Morta,L,1.24,3,180324
União das freguesias de Mezio e Moura Morta,PCTP/MRPP,0.83,2,180324
União das freguesias de Mezio e Moura Morta,PPM,0.83,2,180324
União das freguesias de Mezio e Moura Morta,R.I.R.,0.83,2,180324
União das freguesias de Mezio e Moura Morta,CH,0.41,1,180324
União das freguesias de Mezio e Moura Morta,NC,0.41,1,180324
União das freguesias de Mezio e Moura Morta,PCP-PEV,0.41,1,180324
União das freguesias de Mezio e Moura Morta,PDR,0.41,1,180324
União das freguesias de Mezio e Moura Morta,PTP,0.41,1,180324
União das freguesias de Mezio e Moura Morta,A,0,0,180324
União das freguesias de Mezio e Moura Morta,IL,0,0,180324
União das freguesias de Mezio e Moura Morta,JPP,0,0,180324
União das freguesias de Mezio e Moura Morta,MPT,0,0,180324
União das freguesias de Mezio e Moura Morta,PNR,0,0,180324
União das freguesias de Mezio e Moura Morta,PURP,0,0,180324
