freguesia,acronym,validVotesPercentage,votes,dicofre
São Vicente,PPD/PSD,32.63,31,170334
São Vicente,CDS-PP,31.58,30,170334
São Vicente,PS,29.47,28,170334
São Vicente,B.E.,2.11,2,170334
São Vicente,PAN,1.05,1,170334
São Vicente,PCP-PEV,1.05,1,170334
São Vicente,PCTP/MRPP,1.05,1,170334
São Vicente,PURP,1.05,1,170334
São Vicente,A,0,0,170334
São Vicente,IL,0,0,170334
São Vicente,L,0,0,170334
São Vicente,MAS,0,0,170334
São Vicente,NC,0,0,170334
São Vicente,PDR,0,0,170334
São Vicente,PNR,0,0,170334
São Vicente,PPM.PPV/CDC,0,0,170334
São Vicente,PTP,0,0,170334
