Objeto do Contrato,Tipo de Procedimento,Tipo(s) de Contrato,CPVs,Entidade(s) Adjudicante(s),Entidade(s) Adjudicatária(s),Preço Contratual,Data de Publicação,Data de Celebração do Contrato,Prazo de Execução,Local de Execução,Fundamentação,Data de Fecho do Contrato,Preço Total Efetivo,Causas das Alterações ao Prazo,Causas das Alterações ao Preço,Estado,N.º registo do Acordo Quadro,Descrição do Acordo Quadro,Procedimento Centralizado
Aquisição de Medicamentos Exclusivos,Ajuste Direto Regime Geral,Aquisição de bens móveis,"33000000-0, Equipamento médico, medicamentos e produtos para cuidados pessoais","Unidade Local de Saúde do Norte Alentejano, E. P. E. (508094461)","Sanofi  Produtos Farmacêuticos, Lda. (500134960)","48.324,00 €",19-03-2015,05-03-2015,365 dias,"Portugal, Portalegre, Portalegre<BR/>Portugal, Portalegre, Elvas","Artigo 24.º, n.º 1, alínea e) do Código dos Contratos Públicos",31-12-2015,"47.820,00 €",,Não foram adquiridas as quantidades totais estimadas.,,Não aplicável.,Não aplicável.,FALSE
Prestação de serviços de Manutenção do Equipamento Somation Emotion 16 (Ano 2015),Ajuste Direto Regime Geral,Aquisição de serviços,"50000000-5, Serviços de reparação e manutenção","Unidade Local de Saúde do Norte Alentejano, E. P. E. (508094461)",SIEMENS (500247480),"45.000,00 €",19-03-2015,31-07-2014,365 dias,"Portugal, Portalegre, Portalegre","Artigo 24.º, n.º 1, alínea e) do Código dos Contratos Públicos","","",,"",,Não aplicável.,Não aplicável.,FALSE
Aquisição de reagentes alergologia/imunologia para o 1º. Semestre de 2015,Ajuste Direto Regime Geral,Aquisição de bens móveis,"33000000-0, Equipamento médico, medicamentos e produtos para cuidados pessoais","Unidade Local de Saúde do Norte Alentejano, E. P. E. (508094461)",Phadia Sociedade Unipessoal (506916243),"58.887,15 €",18-03-2015,26-02-2015,180 dias,"Portugal, Portalegre, Elvas<BR/>Portugal, Portalegre, Portalegre","Artigo 24.º, n.º 1, alínea e) do Código dos Contratos Públicos",31-12-2015,"49.606,10 €",,Não foram adquiridas todas as quantidades estimadas.,,Não aplicável.,Não aplicável.,FALSE
Aquisição de gases medicinais de Janeiro a Abril,Ajuste Direto Regime Geral,Aquisição de bens móveis,"33000000-0, Equipamento médico, medicamentos e produtos para cuidados pessoais","Unidade Local de Saúde do Norte Alentejano, E. P. E. (508094461)","Air Liquide Medicinal, SA (501576436)","102.680,40 €",18-03-2015,26-01-2015,120 dias,"Portugal, Portalegre","Artigo 24.º, n.º 2, alínea c) do Código dos Contratos Públicos",31-12-2015,"94.282,13 €",,Não foram adquiridas as quantidades totais estimadas.,,Não aplicável.,Não aplicável.,FALSE
"Aquisição de vinhetas e receituário médico, para 2015",Ajuste Direto Regime Geral,Aquisição de bens móveis,"22900000-9, Material impresso diverso","Unidade Local de Saúde do Norte Alentejano, E. P. E. (508094461)",IMPRENSA NACIONAL - CASA DA MOEDA SA (500792887),"6.700,00 €",18-03-2015,08-01-2015,365 dias,"Portugal, Portalegre","Artigo 24.º, n.º 1, alínea e) do Código dos Contratos Públicos",18-03-2015,"6.700,00 €",,"",,Não aplicável.,Não aplicável.,FALSE
Aquisição de Medicamentos Exclusivos,Ajuste Direto Regime Geral,Aquisição de bens móveis,"33000000-0, Equipamento médico, medicamentos e produtos para cuidados pessoais","Unidade Local de Saúde do Norte Alentejano, E. P. E. (508094461)",CSL Behring (503047201),"18.750,00 €",18-03-2015,26-01-2015,300 dias,"Portugal, Portalegre, Elvas<BR/>Portugal, Portalegre, Portalegre","Artigo 24.º, n.º 1, alínea e) do Código dos Contratos Públicos",31-12-2015,"1.982,70 €",,Não foram adquiridas as quantidades totais estimadas.,,Não aplicável.,Não aplicável.,FALSE
AQUISIÇÃO DE MEDICAMENTOS,Ajuste Direto Regime Geral,Aquisição de bens móveis,"33000000-0, Equipamento médico, medicamentos e produtos para cuidados pessoais","Unidade Local de Saúde do Norte Alentejano, E. P. E. (508094461)","AMGEN BIOFARMACÊUTICA, LDA.                        (502942959)","5.471,28 €",18-03-2015,29-12-2014,30 dias,"Portugal, Portalegre, Portalegre","Artigo 24.º, n.º 1, alínea e) do Código dos Contratos Públicos",29-12-2014,"5.471,28 €",,"",,Não aplicável.,Não aplicável.,FALSE
"Fornecimento de Seringas, Contentores e Sistemas Fechados de Colheita, para a ULSNA; EPE, para 2015, no âmbito do AQ - CP 22/2012 da SPMS",Ao abrigo de acordo-quadro (art.º 259.º),Aquisição de bens móveis,"33140000-3, Material médico de consumo","Unidade Local de Saúde do Norte Alentejano, E. P. E. (508094461)",NORMAX FABRICA DE VIDROS CIENTIFICOS (500203130),"47.418,50 €",18-03-2015,07-01-2015,365 dias,"Portugal, Portalegre",Artigo 259.º do Código dos Contratos Públicos,18-03-2015,"47.418,50 €",,"",,1341769,"ACORDO QUADRO PARA FORNECIMENTO DE SERINGAS, AGULHAS E CONTENTORES ÀS INSTITUIÇÕES E SERVIÇOS DO SERVIÇO NACIONAL DE SAÚDE PROGRAMA DE CONCURSO",FALSE
"Aquisição de Papel Térmico e celofane P/Farmácia, para a ULSNA,EPE 2015",Ajuste Direto Regime Geral,Aquisição de bens móveis,"33600000-6, Produtos farmacêuticos","Unidade Local de Saúde do Norte Alentejano, E. P. E. (508094461)",GRIFOLS PORTUGAL (502041285),"8.266,66 €",18-03-2015,23-01-2015,365 dias,"Portugal, Portalegre","Artigo 24.º, n.º 1, alínea e) do Código dos Contratos Públicos",18-03-2015,"8.266,66 €",,"",,Não aplicável.,Não aplicável.,FALSE
"Fornecimento de Seringas, Contentores e Sistemas Fechados de Colheita, para a ULSNA, EPE, para 2015, no âmbito do AQ - CP 22/2015 da SPMS",Ao abrigo de acordo-quadro (art.º 259.º),Aquisição de bens móveis,"33140000-3, Material médico de consumo","Unidade Local de Saúde do Norte Alentejano, E. P. E. (508094461)",COVIDIEN PORTUGAL (503413410),"1.014,75 €",18-03-2015,07-01-2015,365 dias,"Portugal, Portalegre",Artigo 259.º do Código dos Contratos Públicos,18-03-2015,"1.014,75 €",,"",,1341769,"ACORDO QUADRO PARA FORNECIMENTO DE SERINGAS, AGULHAS E CONTENTORES ÀS INSTITUIÇÕES E SERVIÇOS DO SERVIÇO NACIONAL DE SAÚDE PROGRAMA DE CONCURSO",FALSE
"Fornecimento de Seringas, Contentores e Sistemas Fechados de Colheita, para a ULSNA, EPE, para 2015, no âmbito do AQ - CP 22/2012 da SPMS",Ao abrigo de acordo-quadro (art.º 259.º),Aquisição de bens móveis,"33140000-3, Material médico de consumo","Unidade Local de Saúde do Norte Alentejano, E. P. E. (508094461)",Ambimed - Gestão Ambiental Lda. (503593427),"2.175,00 €",18-03-2015,07-01-2015,365 dias,"Portugal, Portalegre",Artigo 259.º do Código dos Contratos Públicos,07-01-2015,"2.175,00 €",,"",,1341769,"ACORDO QUADRO PARA FORNECIMENTO DE SERINGAS, AGULHAS E CONTENTORES ÀS INSTITUIÇÕES E SERVIÇOS DO SERVIÇO NACIONAL DE SAÚDE PROGRAMA DE CONCURSO",FALSE
"Fornecimento de Seringas, Contentores e Sistemas Fechados de Colheita, para a ULSNA, EPE, para 2015, no âmbito do AQ - CP 22/2012 da SPMS",Ao abrigo de acordo-quadro (art.º 259.º),Aquisição de bens móveis,"33140000-3, Material médico de consumo","Unidade Local de Saúde do Norte Alentejano, E. P. E. (508094461)",OVERPHARMA - PRODUTOS MEDICOS E FARM. (505792362),"825,00 €",18-03-2015,07-01-2015,365 dias,"Portugal, Portalegre",Artigo 259.º do Código dos Contratos Públicos,07-01-2015,"825,00 €",,"",,1341769,"ACORDO QUADRO PARA FORNECIMENTO DE SERINGAS, AGULHAS E CONTENTORES ÀS INSTITUIÇÕES E SERVIÇOS DO SERVIÇO NACIONAL DE SAÚDE PROGRAMA DE CONCURSO",FALSE
"Fornecimento de Seringas, Contentores e Sistemas fechados de Colheita, para a ULSNA, EPE, em 2015, no âmbito do AQ - CP 22/2012 da SPMS",Ao abrigo de acordo-quadro (art.º 259.º),Aquisição de bens móveis,"33140000-3, Material médico de consumo","Unidade Local de Saúde do Norte Alentejano, E. P. E. (508094461)",PMH PRODUTOS MEDICO HOSPITALARES SA (502376899),"4.659,00 €",18-03-2015,07-01-2015,365 dias,"Portugal, Portalegre",Artigo 259.º do Código dos Contratos Públicos,18-03-2015,"4.659,00 €",,"",,1341769,"ACORDO QUADRO PARA FORNECIMENTO DE SERINGAS, AGULHAS E CONTENTORES ÀS INSTITUIÇÕES E SERVIÇOS DO SERVIÇO NACIONAL DE SAÚDE PROGRAMA DE CONCURSO",FALSE
"Fornecimento de Seringas, Contentores e Sistemas Fechados de Colheita, para a ULSNA, EPE, em 2015, no âmbito do AQ - CP 22/2012 da SPMS",Ao abrigo de acordo-quadro (art.º 259.º),Aquisição de bens móveis,"33140000-3, Material médico de consumo","Unidade Local de Saúde do Norte Alentejano, E. P. E. (508094461)","B BRAUN MEDICAL, LDA. (501506543)","2.058,12 €",18-03-2015,07-01-2015,365 dias,"Portugal, Portalegre",Artigo 259.º do Código dos Contratos Públicos,18-03-2015,"2.058,12 €",,"",,1341769,"ACORDO QUADRO PARA FORNECIMENTO DE SERINGAS, AGULHAS E CONTENTORES ÀS INSTITUIÇÕES E SERVIÇOS DO SERVIÇO NACIONAL DE SAÚDE PROGRAMA DE CONCURSO",FALSE
"Aquisição de Agulhas com Sistema Anti Picada, para a ULSNA, EPE, para 2015",Ajuste Direto Regime Geral,Aquisição de bens móveis,"33140000-3, Material médico de consumo","Unidade Local de Saúde do N. Alentejano,EPE(ULSNA) (508094461)",SPECULUM ARTIGOS MEDICOS SA (502996323),"89,20 €",17-03-2015,28-01-2015,365 dias,"Portugal, Portalegre","Artigo 20.º, n.º 1, alínea a) do Código dos Contratos Públicos",17-03-2015,"89,20 €",,"",,Não aplicável.,Não aplicável.,FALSE
"Aquisição de Agulhas com Sistema Anti Picada, para a ULSNA, EPE, para 2015",Ajuste Direto Regime Geral,Aquisição de bens móveis,"33140000-3, Material médico de consumo","Unidade Local de Saúde do Norte Alentejano, E. P. E. (508094461)","HR - Hospitalar, Lda. (501895558)","540,00 €",17-03-2015,28-01-2015,365 dias,"Portugal, Portalegre","Artigo 20.º, n.º 1, alínea a) do Código dos Contratos Públicos",17-03-2015,"540,00 €",,"",,Não aplicável.,Não aplicável.,FALSE
"Prestação de Serviços de Comunicações Móveis para a ULSNA, EPE",Ajuste Direto Regime Geral,Aquisição de serviços,"64200000-8, Serviços de telecomunicações","Unidade Local de Saúde do Norte Alentejano, E. P. E. (508094461)","NOS - Comunicações, SA (502604751)","30.089,37 €",17-03-2015,21-01-2015,1095 dias,"Portugal, Portalegre, Portalegre","Artigo 20.º, n.º 1, alínea a) do Código dos Contratos Públicos","","",,"",,Não aplicável.,Não aplicável.,FALSE
Aquisição de equipamentos para a USF Portus Alacer,Ajuste Direto Regime Geral,Aquisição de bens móveis,"39000000-2, Mobiliário (incl. de escritório), acessórios, aparelhos domésticos (excl. iluminação) e produtos de limpeza<BR/>33000000-0, Equipamento médico, medicamentos e produtos para cuidados pessoais","Unidade Local de Saúde do Norte Alentejano, E. P. E. (508094461)",Bacelar (500532818),"4.335,51 €",17-03-2015,13-06-2014,30 dias,"Portugal, Portalegre, Portalegre","Artigo 20.º, n.º 1, alínea a) do Código dos Contratos Públicos","","",,"",,Não aplicável.,Não aplicável.,FALSE
Aquisição de equipamentos para a USF Portus Alacer,Ajuste Direto Regime Geral,Aquisição de bens móveis,"39000000-2, Mobiliário (incl. de escritório), acessórios, aparelhos domésticos (excl. iluminação) e produtos de limpeza","Unidade Local de Saúde do Norte Alentejano, E. P. E. (508094461)",Sanotecnica (500239819),"2.073,45 €",17-03-2015,13-06-2014,30 dias,"Portugal, Portalegre, Portalegre","Artigo 20.º, n.º 1, alínea a) do Código dos Contratos Públicos","","",,"",,Não aplicável.,Não aplicável.,FALSE
Aquisição de frigorifico,Ajuste Direto Regime Geral,Aquisição de bens móveis,"38000000-5, Equipamento laboratorial, óptico e de precisão (exc. óculos)","Unidade Local de Saúde do Norte Alentejano, E. P. E. (508094461)",Labosistemas (505322137),"2.700,00 €",17-03-2015,26-03-2014,30 dias,"Portugal, Portalegre, Portalegre","Artigo 20.º, n.º 1, alínea a) do Código dos Contratos Públicos","","",,"",,Não aplicável.,Não aplicável.,FALSE
Agitador de Plaquetas com estufa,Ajuste Direto Regime Geral,Aquisição de bens móveis,"33000000-0, Equipamento médico, medicamentos e produtos para cuidados pessoais","Unidade Local de Saúde do Norte Alentejano, E. P. E. (508094461)",Labo sistema (505322137),"4.990,00 €",17-03-2015,26-03-2014,30 dias,"Portugal, Portalegre, Portalegre","Artigo 20.º, n.º 1, alínea a) do Código dos Contratos Públicos","","",,"",,Não aplicável.,Não aplicável.,FALSE
"Prestação de Serviços Médicos de MGF, para o Centro de Saúde de Ponte de Sôr (Março a Dezembro de 2015)",Ajuste Direto Regime Geral,Aquisição de serviços,"85100000-0, Serviços de saúde","Unidade Local de Saúde do Norte Alentejano, E. P. E. (508094461)","Helped - Prestação de Serviços de Saúde, Lda (506069010)","75.471,90 €",17-03-2015,04-03-2015,306 dias,"Portugal, Portalegre, Ponte de Sor","Artigo 24.º, n.º 1, alínea c) do Código dos Contratos Públicos",04-03-2015,"75.471,90 €",,"",,Não aplicável.,Não aplicável.,FALSE
"Aquisição de Mobiliário Hospitalar para o Serviço de Cirurgia do HDJMG - ULSNA, EPE",Ajuste Direto Regime Geral,Aquisição de bens móveis,"39000000-2, Mobiliário (incl. de escritório), acessórios, aparelhos domésticos (excl. iluminação) e produtos de limpeza","Unidade Local de Saúde do Norte Alentejano, E. P. E. (508094461)",Mundinter (500199906),"17.995,32 €",16-03-2015,06-02-2015,30 dias,"Portugal, Portalegre, Portalegre","Artigo 20.º, n.º 1, alínea a) do Código dos Contratos Públicos","","",,"",,Não aplicável.,Não aplicável.,FALSE
"Prestação de Serviços Médicos, na Especialidade de Ginecologia/Obstetrícia, na ULSNA, EPE (Março a Dezembro de 2014)",Ajuste Direto Regime Geral,Aquisição de serviços,"85100000-0, Serviços de saúde","Unidade Local de Saúde do Norte Alentejano, E. P. E. (508094461)","Dr. Cienfuegos Campini, SLU (B06599369)","40.600,50 €",16-03-2015,18-05-2014,306 dias,"Portugal, Portalegre, Portalegre","Artigo 24.º, n.º 1, alínea c) do Código dos Contratos Públicos",31-12-2014,"40.600,50 €",,"",,Não aplicável.,Não aplicável.,FALSE
Aquisição de Equipamento Cirúrgico de Otorrinolaringologia,Ajuste Direto Regime Geral,Aquisição de bens móveis,"33000000-0, Equipamento médico, medicamentos e produtos para cuidados pessoais","Unidade Local de Saúde do Norte Alentejano, E. P. E. (508094461)",Angosaude (507016882),"1.226,74 €",16-03-2015,18-09-2013,30 dias,"Portugal, Portalegre, Portalegre","Artigo 20.º, n.º 1, alínea a) do Código dos Contratos Públicos","","",,"",,Não aplicável.,Não aplicável.,FALSE
Aquisição de Equipamento Cirúrgico de Otorrinolaringologia,Ajuste Direto Regime Geral,Aquisição de bens móveis,"33000000-0, Equipamento médico, medicamentos e produtos para cuidados pessoais","Unidade Local de Saúde do Norte Alentejano, E. P. E. (508094461)",Grupo Taper (506886336),"346,67 €",16-03-2015,18-09-2013,30 dias,"Portugal, Portalegre, Portalegre","Artigo 20.º, n.º 1, alínea a) do Código dos Contratos Públicos","","",,"",,Não aplicável.,Não aplicável.,FALSE
Aquisição de Equipamento Cirúrgico de Otorrinolaringologia,Ajuste Direto Regime Geral,Aquisição de bens móveis,"33000000-0, Equipamento médico, medicamentos e produtos para cuidados pessoais","Unidade Local de Saúde do Norte Alentejano, E. P. E. (508094461)",Normax (500203130),"2.519,22 €",16-03-2015,18-09-2013,30 dias,"Portugal, Portalegre, Portalegre","Artigo 20.º, n.º 1, alínea a) do Código dos Contratos Públicos","","",,"",,Não aplicável.,Não aplicável.,FALSE
Aquisição de Equipamento Cirúrgico de Otorrinolaringologia,Ajuste Direto Regime Geral,Aquisição de bens móveis,"33000000-0, Equipamento médico, medicamentos e produtos para cuidados pessoais","Unidade Local de Saúde do Norte Alentejano, E. P. E. (508094461)",Medtronic (504223933),"618,00 €",16-03-2015,18-09-2013,30 dias,"Portugal, Portalegre, Portalegre","Artigo 20.º, n.º 1, alínea a) do Código dos Contratos Públicos","","",,"",,Não aplicável.,Não aplicável.,FALSE
"Aquisição de Mobiliário Hospitalar para o Serviço de Cirurgia do HDJMG - ULSNA, EPE",Concurso público,Aquisição de bens móveis,"39100000-3, Mobiliário","Unidade Local de Saúde do Norte Alentejano, E. P. E. (508094461)",Paramédica (501393005),"680,00 €",16-03-2015,21-01-2015,30 dias,"Portugal, Portalegre, Portalegre","Artigo 20.º, n.º 1, alínea b) do Código dos Contratos Públicos","","",,"",,Não aplicável.,Não aplicável.,FALSE
"Aquisição de Mobiliário Hospitalar para o Serviço de Cirurgia do HDJMG - ULSNA, EPE",Concurso público,Aquisição de bens móveis,"39100000-3, Mobiliário","Unidade Local de Saúde do Norte Alentejano, E. P. E. (508094461)",Bacelar (501393005),"750,00 €",16-03-2015,21-01-2015,25 dias,"Portugal, Portalegre, Portalegre","Artigo 20.º, n.º 1, alínea b) do Código dos Contratos Públicos","","",,"",,Não aplicável.,Não aplicável.,FALSE
"Aquisição de Mobiliário Hospitalar para o Serviço de Cirurgia do HDJMG - ULSNA, EPE",Concurso público,Aquisição de bens móveis,"39100000-3, Mobiliário","Unidade Local de Saúde do Norte Alentejano, E. P. E. (508094461)",Mundinter (500199906),"61.557,62 €",16-03-2015,29-01-2015,15 dias,"Portugal, Portalegre, Portalegre","Artigo 20.º, n.º 1, alínea b) do Código dos Contratos Públicos","","",,"",,Não aplicável.,Não aplicável.,FALSE
"Aquisição de Mobiliário Hospitalar para o Serviço de Cirurgia do HDJMG - ULSNA, EPE",Concurso público,Aquisição de bens móveis,"39100000-3, Mobiliário","Unidade Local de Saúde do Norte Alentejano, E. P. E. (508094461)",Filsat (506708616),"1.635,00 €",16-03-2015,21-01-2015,29 dias,"Portugal, Portalegre, Portalegre","Artigo 20.º, n.º 1, alínea b) do Código dos Contratos Públicos","","",,"",,Não aplicável.,Não aplicável.,FALSE
"Aquisição de Mobiliário Hospitalar para o Serviço de Cirurgia do HDJMG - ULSNA, EPE",Concurso público,Aquisição de bens móveis,"39100000-3, Mobiliário","Unidade Local de Saúde do Norte Alentejano, E. P. E. (508094461)",B.I. e Q. (504105337),"6.600,00 €",16-03-2015,21-01-2015,30 dias,"Portugal, Portalegre, Portalegre","Artigo 20.º, n.º 1, alínea b) do Código dos Contratos Públicos","","",,"",,Não aplicável.,Não aplicável.,FALSE
"Aquisição de Mobiliário Hospitalar para o Serviço de Cirurgia do HDJMG - ULSNA, EPE",Concurso público,Aquisição de bens móveis,"39100000-3, Mobiliário","Unidade Local de Saúde do Norte Alentejano, E. P. E. (508094461)",Gaben (508124379),"21.838,00 €",16-03-2015,27-01-2015,30 dias,"Portugal, Portalegre, Portalegre","Artigo 20.º, n.º 1, alínea b) do Código dos Contratos Públicos","","",,"",,Não aplicável.,Não aplicável.,FALSE
Aquisição de Medicamentos Exclusivos,Ajuste Direto Regime Geral,Aquisição de bens móveis,"33000000-0, Equipamento médico, medicamentos e produtos para cuidados pessoais","Unidade Local de Saúde do Norte Alentejano, E. P. E. (508094461)"," Labesfal Lab. Almiro, SA (501169580)","32.309,60 €",16-03-2015,03-03-2015,330 dias,"Portugal, Portalegre, Elvas<BR/>Portugal, Portalegre, Portalegre","Artigo 24.º, n.º 1, alínea e) do Código dos Contratos Públicos",31-12-2015,"22.907,44 €",,Não foram adquiridas as quantidades totais estimadas.,,Não aplicável.,Não aplicável.,FALSE
Aquisição de Produtos Farmacêuticos Exclusivos,Ajuste Direto Regime Geral,Aquisição de bens móveis,"33000000-0, Equipamento médico, medicamentos e produtos para cuidados pessoais","Unidade Local de Saúde do Norte Alentejano, E. P. E. (508094461)",Abbott Medical Optics Spain S.L. (980262364),"16.031,15 €",16-03-2015,19-02-2015,300 dias,"Portugal, Portalegre, Portalegre<BR/>Portugal, Portalegre, Elvas","Artigo 24.º, n.º 1, alínea e) do Código dos Contratos Públicos",31-12-2015,"15.529,25 €",,Não foram adquiridas os totais estimados,,Não aplicável.,Não aplicável.,FALSE
"Aquisição de Equipamentos Administrativos para o Serviço de Cirurgia do HDJMG - ULSNA, EPE",Ajuste Direto Regime Geral,Aquisição de bens móveis,"39000000-2, Mobiliário (incl. de escritório), acessórios, aparelhos domésticos (excl. iluminação) e produtos de limpeza","Unidade Local de Saúde do Norte Alentejano, E. P. E. (508094461)",Joaquim Espanhol (195969391),"4.142,00 €",13-03-2015,07-01-2015,5 dias,"Portugal, Portalegre, Portalegre","Artigo 20.º, n.º 1, alínea a) do Código dos Contratos Públicos","","",,"",,Não aplicável.,Não aplicável.,FALSE
"Aquisição de Equipamentos Administrativos para o Serviço de Cirurgia do HDJMG - ULSNA, EPE",Ajuste Direto Regime Geral,Aquisição de bens móveis,"39000000-2, Mobiliário (incl. de escritório), acessórios, aparelhos domésticos (excl. iluminação) e produtos de limpeza","Unidade Local de Saúde do Norte Alentejano, E. P. E. (508094461)",Decorpar (501517049),"8.217,00 €",13-03-2015,07-01-2015,15 dias,"Portugal, Portalegre, Portalegre","Artigo 20.º, n.º 1, alínea a) do Código dos Contratos Públicos","","",,"",,Não aplicável.,Não aplicável.,FALSE
Aquisição de Medicamentos Exclusivos,Ajuste Direto Regime Geral,Aquisição de bens móveis,"33000000-0, Equipamento médico, medicamentos e produtos para cuidados pessoais","Unidade Local de Saúde do Norte Alentejano, E. P. E. (508094461)","Amgen  Biofarmacêutica, Lda (502942959)","122.889,58 €",13-03-2015,05-03-2015,365 dias,"Portugal, Portalegre, Elvas<BR/>Portugal, Portalegre, Portalegre","Artigo 24.º, n.º 1, alínea e) do Código dos Contratos Públicos",31-12-2015,"60.240,41 €",,Não foram adquiridas as quantidades totais estimadas,,Não aplicável.,Não aplicável.,FALSE
"Aquisição de Equipamentos Médicos para o Serviço de Cirurgia do HDJMG - ULSNA, EPE",Ajuste Direto Regime Geral,Aquisição de bens móveis,"33000000-0, Equipamento médico, medicamentos e produtos para cuidados pessoais","Unidade Local de Saúde do Norte Alentejano, E. P. E. (508094461)",Clinifar (503281115),"60.000,00 €",13-03-2015,23-12-2014,30 dias,"Portugal, Portalegre, Portalegre","Artigo 20.º, n.º 1, alínea a) do Código dos Contratos Públicos","","",,"",,Não aplicável.,Não aplicável.,FALSE
"Aquisição deEquipamento Informático para o Serviço de Cirurgia do HDJMG - ULSNA, EPE",Ajuste Direto Regime Geral,Aquisição de bens móveis,"30000000-9, Máquinas, equipamento e material de escritório e de informática, excepto mobiliário e pacotes de programas (software)","Unidade Local de Saúde do Norte Alentejano, E. P. E. (508094461)",Informantem (503670693),"9.949,17 €",12-03-2015,27-11-2014,30 dias,"Portugal, Portalegre, Portalegre","Artigo 20.º, n.º 1, alínea a) do Código dos Contratos Públicos","","",,"",,Não aplicável.,Não aplicável.,FALSE
"Aquisição de Bombas e Seringas Infusoras para o Serviço de Cirurgia do HDJMG - ULSNA, EPE",Ajuste Direto Regime Geral,Aquisição de bens móveis,"33000000-0, Equipamento médico, medicamentos e produtos para cuidados pessoais","Unidade Local de Saúde do Norte Alentejano, E. P. E. (508094461)","B. Braun Medical, Lda (501506543)","20.000,00 €",12-03-2015,29-12-2014,15 dias,"Portugal, Portalegre, Portalegre","Artigo 20.º, n.º 1, alínea a) do Código dos Contratos Públicos",20-01-2015,"20.000,00 €",,"",,Não aplicável.,Não aplicável.,FALSE
Aquisição de Medicamentos Exclusivos,Ajuste Direto Regime Geral,Aquisição de bens móveis,"33000000-0, Equipamento médico, medicamentos e produtos para cuidados pessoais","Unidade Local de Saúde do Norte Alentejano, E. P. E. (508094461)","Celgene sociedade Unipessoal, Lda (507791690)","27.200,00 €",12-03-2015,04-03-2015,365 dias,"Portugal, Portalegre, Portalegre<BR/>Portugal, Portalegre, Elvas","Artigo 24.º, n.º 1, alínea e) do Código dos Contratos Públicos",31-12-2015,"3.200,00 €",,Não foram adquiridas as quantidades totais estimadas.,,Não aplicável.,Não aplicável.,FALSE
"Aquisição de Equipamentos para o Serviço de Cirurgia do HDJMG - ULSNA, EPE",Ajuste Direto Regime Geral,Aquisição de bens móveis,"39000000-2, Mobiliário (incl. de escritório), acessórios, aparelhos domésticos (excl. iluminação) e produtos de limpeza","Unidade Local de Saúde do Norte Alentejano, E. P. E. (508094461)",QUIMOVEIS DE JOAQUIM FERNANDO BAGINA ESPANHOL (195969391),"490,00 €",12-03-2015,11-02-2015,1 dias,"Portugal, Portalegre, Portalegre","Artigo 20.º, n.º 1, alínea a) do Código dos Contratos Públicos",11-02-2015,"490,00 €",,"",,Não aplicável.,Não aplicável.,FALSE
"Aquisição de Equipamentos para o Serviço de Cirurgia do HDJMG - ULSNA, EPE",Ajuste Direto Regime Geral,Aquisição de bens móveis,"39000000-2, Mobiliário (incl. de escritório), acessórios, aparelhos domésticos (excl. iluminação) e produtos de limpeza","Unidade Local de Saúde do Norte Alentejano, E. P. E. (508094461)",Bacelar (500532818),"2.132,12 €",12-03-2015,11-02-2015,1 dias,"Portugal, Portalegre, Portalegre","Artigo 20.º, n.º 1, alínea a) do Código dos Contratos Públicos",11-02-2015,"2.132,12 €",,"",,Não aplicável.,Não aplicável.,FALSE
"Aquisição de Equipamentos para o Serviço de Cirurgia do HDJMG - ULSNA, EPE",Ajuste Direto Regime Geral,Aquisição de bens móveis,"39000000-2, Mobiliário (incl. de escritório), acessórios, aparelhos domésticos (excl. iluminação) e produtos de limpeza","Unidade Local de Saúde do Norte Alentejano, E. P. E. (508094461)",Bacelar (500532818),"1.950,00 €",12-03-2015,11-02-2015,1 dias,"Portugal, Portalegre, Portalegre","Artigo 20.º, n.º 1, alínea a) do Código dos Contratos Públicos",11-02-2015,"1.950,00 €",,"",,Não aplicável.,Não aplicável.,FALSE
"Aquisição de Equipamentos para o Serviço de Cirurgia do HDJMG - ULSNA, EPE.",Ajuste Direto Regime Geral,Aquisição de bens móveis,"39100000-3, Mobiliário","Unidade Local de Saúde do Norte Alentejano, E. P. E. (508094461)",Bacelar (500532818),"5.738,00 €",12-03-2015,11-02-2015,1 dias,"Portugal, Portalegre, Portalegre","Artigo 20.º, n.º 1, alínea a) do Código dos Contratos Públicos",11-02-2015,"5.738,00 €",,"",,Não aplicável.,Não aplicável.,FALSE
"PRESTAÇÃO DE SERVIÇOS DE INSPEÇÃO SANITÁRIA DE GENEROS ALIMENTICIOS PARA A ULSNA, EPE",Ajuste Direto Regime Geral,Aquisição de serviços,"85200000-1, Serviços de veterinária","Unidade Local de Saúde do Norte Alentejano, E. P. E. (508094461)",VETAL- CLINICA VETERINARIA DO ALTO ALENTEJO LDA (506789357),"6.600,00 €",12-03-2015,21-01-2015,365 dias,"Portugal, Portalegre, Portalegre","Artigo 20.º, n.º 1, alínea a) do Código dos Contratos Públicos","","",,"",,Não aplicável.,Não aplicável.,FALSE
"Fornecimento de Luvas de Uso Médico, para a ULSNA, EPE, para 2015, no âmbito do AQ - CP 23/2012, da SPMS",Ao abrigo de acordo-quadro (art.º 259.º),Aquisição de bens móveis,"33140000-3, Material médico de consumo","Unidade Local de Saúde do Norte Alentejano, E. P. E. (508094461)",EME ELECTROMEDICA - EZEQUIEL PANAO JORGE (501412727),"225,00 €",11-03-2015,10-12-2014,365 dias,"Portugal, Portalegre",Artigo 259.º do Código dos Contratos Públicos,11-03-2015,"225,00 €",,"",,544071,"CONCURSO PÚBLICO PARA A CELEBRAÇÃO DE CONTRATOS PÚBLICOS DE APROVISIONAMENTO PARA A ÁREA DA SAÚDE, COM VISTA AO FORNECIMENTO DE LUVAS PARA USO MÉDICO, ÀS INSTITUIÇÕES E SERVIÇOS DO SERVIÇO NACIONAL DE SAÚDE",FALSE
"Fornecimento de Luvas de Uso Médico, para a ULSNA, EPE, para 2015, no âmbito do AQ - CP 23/2012, da SPMS",Ao abrigo de acordo-quadro (art.º 259.º),Aquisição de bens móveis,"33140000-3, Material médico de consumo","Unidade Local de Saúde do Norte Alentejano, E. P. E. (508094461)","Docworld, Lda (508592909)","63.749,60 €",11-03-2015,10-12-2014,365 dias,"Portugal, Portalegre",Artigo 259.º do Código dos Contratos Públicos,11-03-2015,"63.749,60 €",,"",,544071,"CONCURSO PÚBLICO PARA A CELEBRAÇÃO DE CONTRATOS PÚBLICOS DE APROVISIONAMENTO PARA A ÁREA DA SAÚDE, COM VISTA AO FORNECIMENTO DE LUVAS PARA USO MÉDICO, ÀS INSTITUIÇÕES E SERVIÇOS DO SERVIÇO NACIONAL DE SAÚDE",FALSE
"Fornecimento de Luvas de Uso Médico, para a ULSNA, EPE, para 2015, no âmbito do AQ - CP 23/2012, da SPMS",Ao abrigo de acordo-quadro (art.º 259.º),Aquisição de bens móveis,"33140000-3, Material médico de consumo","Unidade Local de Saúde do Norte Alentejano, E. P. E. (508094461)",COVIDIEN PORTUGAL (503413410),"1.344,00 €",11-03-2015,10-12-2014,365 dias,"Portugal, Portalegre",Artigo 259.º do Código dos Contratos Públicos,11-03-2015,"1.344,00 €",,"",,544071,"CONCURSO PÚBLICO PARA A CELEBRAÇÃO DE CONTRATOS PÚBLICOS DE APROVISIONAMENTO PARA A ÁREA DA SAÚDE, COM VISTA AO FORNECIMENTO DE LUVAS PARA USO MÉDICO, ÀS INSTITUIÇÕES E SERVIÇOS DO SERVIÇO NACIONAL DE SAÚDE",FALSE
"Fornecimento de luvas de uso médico para a ULSNA, EPE, para 2015, no âmbito do AQ - CP 23/2012, da SPMS",Ao abrigo de acordo-quadro (art.º 259.º),Aquisição de bens móveis,"33140000-3, Material médico de consumo","Unidade Local de Saúde do Norte Alentejano, E. P. E. (508094461)","HR - Hospitalar, Lda. (501895558)","1.644,00 €",11-03-2015,10-12-2014,365 dias,"Portugal, Portalegre",Artigo 259.º do Código dos Contratos Públicos,11-03-2015,"1.644,00 €",,"",,544071,"CONCURSO PÚBLICO PARA A CELEBRAÇÃO DE CONTRATOS PÚBLICOS DE APROVISIONAMENTO PARA A ÁREA DA SAÚDE, COM VISTA AO FORNECIMENTO DE LUVAS PARA USO MÉDICO, ÀS INSTITUIÇÕES E SERVIÇOS DO SERVIÇO NACIONAL DE SAÚDE",FALSE
"Fornecimento de Luvas de Uso Médico para a ULSNA, EPE, para 2015, no âmbito do AQ - CP 23/2012, da SPMS",Ao abrigo de acordo-quadro (art.º 259.º),Aquisição de bens móveis,"33140000-3, Material médico de consumo","Unidade Local de Saúde do Norte Alentejano, E. P. E. (508094461)","Medicinália Cormédica, Lda. (500684324)","13.899,80 €",11-03-2015,10-12-2014,365 dias,"Portugal, Portalegre",Artigo 259.º do Código dos Contratos Públicos,11-03-2015,"13.899,80 €",,"",,544071,"CONCURSO PÚBLICO PARA A CELEBRAÇÃO DE CONTRATOS PÚBLICOS DE APROVISIONAMENTO PARA A ÁREA DA SAÚDE, COM VISTA AO FORNECIMENTO DE LUVAS PARA USO MÉDICO, ÀS INSTITUIÇÕES E SERVIÇOS DO SERVIÇO NACIONAL DE SAÚDE",FALSE
