Objeto do Contrato,Tipo de Procedimento,Tipo(s) de Contrato,CPVs,Entidade(s) Adjudicante(s),Entidade(s) Adjudicatária(s),Preço Contratual,Data de Publicação,Data de Celebração do Contrato,Prazo de Execução,Local de Execução,Fundamentação,Data de Fecho do Contrato,Preço Total Efetivo,Causas das Alterações ao Prazo,Causas das Alterações ao Preço,Estado,N.º registo do Acordo Quadro,Descrição do Acordo Quadro,Procedimento Centralizado
Serviços Médicos Urgência Geral e Cirurgia Maxilo facial,Ajuste Direto Regime Geral,Aquisição de serviços,"85121300-6, Serviços de cirurgia especializada","Centro Hospitalar do Algarve, E. P. E. (510745997)","J. C. Fernandes - Cirurgia Maxilo-Facial, Lda (505515172)","34.260,00 €",07-03-2017,23-02-2017,180 dias,"Portugal, Faro, Faro<BR/>Portugal, Faro, Portimão","Artigo 24.º, n.º 1, alínea e) do Código dos Contratos Públicos",30-06-2017,"30.240,00 €",,"O valor inicial do Contrato teve por base as necessidades estimadas para o período de 1 Janeiro de 2017 a 30 Junho de 2017, o valor final reflecte as necessidades efectivas.",,Não aplicável.,Não aplicável.,FALSE
Serviços Médicos Urgência Geral e Cirurgia Maxilo - Facial,Ajuste Direto Regime Geral,Aquisição de serviços,"85121300-6, Serviços de cirurgia especializada","Centro Hospitalar do Algarve, E. P. E. (510745997)","J. C. Fernandes - Cirurgia Maxilo-Facial, Lda (505515172)","46.800,00 €",29-07-2016,21-07-2016,180 dias,"Portugal, Faro, Portimão<BR/>Portugal, Faro, Faro","Artigo 24.º, n.º 1, alínea c) do Código dos Contratos Públicos",31-12-2016,"40.680,00 €",,"O valor inicial do Contrato teve por base as necessidades estimadas para o período de 1 Julho de 2016 a 31 Dezembro de 2016, o valor final reflecte as necessidades efectivas.",,Não aplicável.,Não aplicável.,FALSE
" Serviços Médicos de Urgência Geral e Básica, Cuidados Inter, Sala Rean, Dec Clinica, Deuci",Ajuste Direto Regime Geral,Aquisição de serviços,"85121100-4, Serviços de médicos de clínica geral","Centro Hospitalar do Algarve, E. P. E. (510745997)","J. C. Fernandes - Cirurgia Maxilo-Facial, Lda (505515172)","23.400,00 €",18-02-2016,04-02-2016,91 dias,"Portugal, Faro, Faro<BR/>Portugal, Faro, Lagos<BR/>Portugal, Faro, Albufeira<BR/>Portugal, Faro, Loulé<BR/>Portugal, Faro, Portimão","Artigo 24.º, n.º 1, alínea c) do Código dos Contratos Públicos",30-06-2016,"27.360,00 €",,"O valor inicial do Contrato teve por base as necessidades estimadas para o período de 1 Janeiro de 2016 a 30 Junho de 2016, o valor final reflecte as necessidades efectivas.",,Não aplicável.,Não aplicável.,FALSE
"Serviços médicos de urgência geral e básica, cuidados intermédios, sala de reanimação decisão clínica, so/obs, deuci",Ajuste Direto Regime Geral,Aquisição de serviços,"85121100-4, Serviços de médicos de clínica geral","Centro Hospitalar do Algarve, E. P. E. (510745997)","J. C. Fernandes - Cirurgia Maxilo - Facial, Lda (505515172)","23.670,00 €",16-10-2015,29-09-2015,92 dias,"Portugal, Faro, Albufeira<BR/>Portugal, Faro, Loulé<BR/>Portugal, Faro, Lagos<BR/>Portugal, Faro, Faro<BR/>Portugal, Faro, Portimão","Artigo 24.º, n.º 1, alínea c) do Código dos Contratos Públicos",31-12-2015,"19.740,00 €",,"O valor inicial do Contrato teve por base as necessidades estimadas para o período de 1 Outubro de 2015 a 31 Dezembro de 2015, o valor final reflecte as necessidades efectivas.",,Não aplicável.,Não aplicável.,FALSE
Serviços Médicos Urgência Geral e Básica,Ajuste Direto Regime Geral,Aquisição de serviços,"85121100-4, Serviços de médicos de clínica geral","Centro Hospitalar do Algarve, E. P. E. (510745997)","J. C. Fernandes - Cirurgia Maxilo - Facial, Lda (505515172)","48.600,00 €",21-04-2015,13-04-2015,183 dias,"Portugal, Faro, Faro<BR/>Portugal, Faro, Portimão","Artigo 24.º, n.º 1, alínea c) do Código dos Contratos Públicos",30-09-2015,"34.560,00 €",,"O valor inicial do Contrato teve por base as necessidades estimadas para o período de 1 Abril de 2015 a 30 de Setembro de 2015, o valor final reflecte as necessidades efectivas.",,Não aplicável.,Não aplicável.,FALSE
Serviços Médicos Urgência Geral e Básica-Processo nº 78/0809/15,Ajuste Direto Regime Geral,Aquisição de serviços,"85121100-4, Serviços de médicos de clínica geral","Centro Hospitalar do Algarve, E.P.E. (510745997)","J.C. Fernandes - Cirurgia Maxilo - Facial, Lda (505515172)","16.200,00 €",16-02-2015,05-02-2015,59 dias,"Portugal, Faro, Albufeira<BR/>Portugal, Faro, Lagos<BR/>Portugal, Faro, Portimão<BR/>Portugal, Faro, Faro<BR/>Portugal, Faro, Loulé","Artigo 24.º, n.º 1, alínea c) do Código dos Contratos Públicos",31-03-2015,"17.280,00 €",,"O valor inicial do Contrato teve por base as necessidades estimadas para o período de 1 Janeiro de 2015 a 31 Março de 2015, o valor final reflecte as necessidades efectivas.",,Não aplicável.,Não aplicável.,FALSE
Serviços médicos urgência geral,Ajuste Direto Regime Geral,Aquisição de serviços,"85121100-4, Serviços de médicos de clínica geral","Centro Hospitalar do Algarve, E. P. E. (510745997)","J. C. Fernandes - Cirurgia Maxilo-Facial, Lda (505515172)","63.000,00 €",16-07-2014,03-03-2014,245 dias,"Portugal, Faro, Lagos<BR/>Portugal, Faro, Faro<BR/>Portugal, Faro, Albufeira","Artigo 20.º, n.º 1, alínea a) do Código dos Contratos Públicos",31-12-2014,"55.350,00 €",,"O valor inicial do Contrato teve por base as necessidades estimadas para o período de 1 de Maio  de 2014 a 31 Dezembro de 2014, o valor final reflecte as necessidades efectivas.",,Não aplicável.,Não aplicável.,FALSE
