Objeto do Contrato,Tipo de Procedimento,Tipo(s) de Contrato,CPVs,Entidade(s) Adjudicante(s),Entidade(s) Adjudicatária(s),Preço Contratual,Data de Publicação,Data de Celebração do Contrato,Prazo de Execução,Local de Execução,Fundamentação,Data de Fecho do Contrato,Preço Total Efetivo,Causas das Alterações ao Prazo,Causas das Alterações ao Preço,Estado,N.º registo do Acordo Quadro,Descrição do Acordo Quadro,Procedimento Centralizado
Aquisição de computadores portateis,Ao abrigo de acordo-quadro (art.º 259.º),Aquisição de bens móveis,"30230000-0, Equipamento informático",Hospital Dr. Francisco Zagalo (501510150),"Informatica El Corte Ingles, S.A. (980079659)","2.020,00 €",31-08-2015,22-07-2015,30 dias,"Portugal, Aveiro, Ovar",Artigo 259.º do Código dos Contratos Públicos,24-08-2015,"2.020,00 €","","",,181482,Concurso limitado por prévia qualificação para a celebração de acordo quadro de equipamento informático.,FALSE
Pagamento de pensão de acidente em serviço,Ajuste Direto Regime Geral,Aquisição de serviços,"66500000-5, Serviços de seguros e pensões",Hospital Dr. Francisco Zagalo (501510150),Caixa Geral de Aposentações (500792968),"5.323,89 €",31-08-2015,13-08-2015,30 dias,"Portugal, Aveiro, Ovar","Artigo 20.º, n.º 1, alínea a) do Código dos Contratos Públicos",14-08-2015,"5.323,89 €","","",,Não aplicável.,Não aplicável.,FALSE
Aquisição de energia eléctrica ao abrigo do AQ-PARA -2015,Ao abrigo de acordo-quadro (art.º 259.º),Aquisição de bens móveis,"09310000-5, Electricidade","Direção-Geral da Saúde (600037100), Centro Hospitalar Cova da Beira, EPE (506361659), Centro Hospitalar Médio Ave, E.P.E.. (508093937), SUCH - Serviço Utilização Comum Hospitais (500900469), CHO - Centro Hospitalar do Oeste (510412009), Administração Regional de Saúde do Alentejo, I. P. (503148768), Unidade Local de Saúde de Matosinhos, EPE (ULSM) (506361390), Administração Regional de Saúde Norte, I.P. (503135593), Hospital Distrital da Figueira da Foz, EPE (506361527), Hospital Arcebispo João Crisóstomo (501626123), Centro Hospitalar do Algarve, E. P. E. (510745997), Centro Hospitalar Póvoa de Varzim - Vila do Conde, E.P.E. (508741823), Hospital Dr. Francisco Zagalo (501510150), Secretaria-Geral do Ministério da Saúde - SNCP (600080684), Administração Regional de Saúde Algarve, I.P. (503148709), Centro Hospitalar Barreiro Montijo, E. P. E. (509186998), Hospital Garcia de Orta, E. P. E. (506361470), Centro Hospitalar Tondela-Viseu, E. P. E. (509822940), Hospital Santa Maria Maior, E. P. E. (506361381), Hospital de Magalhães Lemos, E. P. E. (502828790), Hospital de José Luciano de Castro (501613021), Centro Hospitalar e Universitário de Coimbra, E. P. E. (510103448), Instituto de Oftalmologia Dr. Gama Pinto (600000052), Instituto Nacional de Saúde Dr. Ricardo Jorge, I. P. (501427511), Centro Hospitalar de Lisboa Central, E. P. E. (508080142), SPMS - Serviços Partilhados do Ministério da Saúde, E. P. E. (509540716), Centro de medicina e Reabilitação da Região Centro Rovisco Pais (503767336), Centro Hospitalar do Baixo Vouga, E. P. E (CHBV, E. P. E.) (510123210), Centro Hospitalar Vila Nova de Gaia - Espinho, E. P. E. (508142156), Unidade Local de Saúde de Castelo Branco, E. P. E. (509309844), Unidade Local de Saúde da Guarda, E. P. E. (508752000), Centro Hospitalar do Médio Tejo, E. P. E. (506361608), Centro Hospitalar de Trás-os-Montes e Alto Douro, E. P. E. (508100496), Hospital de Santarém, EPE (506361462), Unidade Local de Saúde do Norte Alentejano, E. P. E. (508094461), Administração Regional de Saúde do Centro, I. P. (503122165), Centro Hospitalar de Setúbal, E. P. E. (507606787), Administração Central do Sistema de Saúde, I. P. (508188423), Centro Hospitalar de Entre o Douro e Vouga, E.P.E. (508878462), Administração Regional de Saúde Lisboa e Vale do Tejo, I.P. (503148776), INFARMED - Autoridade Nacional do Medicamento e Produtos de Saúde I.P. (600037002), Centro Hospitalar Porto, E. P. E. (508331471), Centro Hospitalar Lisboa Norte, E. P. E. (508481287), Instituto Nacional de Emergência Médica, I. P. (501356126), Centro Hospitalar do Alto Ave, EPE (508080827), Instituto Português do Sangue e da Transplantação, I. P. (502423943), Unidade Local de Saúde Nordeste, EPE (509932584), Centro Hospitalar do Tâmega e Sousa, E. P. E. (508318262), Instituto Português de Oncologia de Coimbra - Francisco Gentil E.P.E. (506361438), Unidade Local de Saúde do Litoral Alentejano, E. P. E. (510445152), Hospital do Espírito Santo de Évora, E. P. E. (508085888), Centro Hospitalar de Lisboa Ocidental, E. P. E. (507618319), Unidade Local de Saúde do Alto Minho, E. P. E. (508786193), Centro Hospitalar de São João, E. P. E. (509821197), Centro Hospitalar Psiquiátrico de Lisboa (CHPL) (508338476), Hospital Prof. Doutor Fernando Fonseca E.P.E. (503035416), Instituto Português de Oncologia de Lisboa Francisco Gentil, E. P. E. (506361616), CENTRO HOSPITALAR DE LEIRIA, E.P.E. (509822932), Inspeção-Geral das Atividades em Saúde (600018857), Instituto Português de Oncologia do Porto Francisco Gentil, E. P. E. (506362299), Unidade Local de Saude do Baixo Alentejo, EPE (508754275)","GALP POWER, S.A. (504723456)","807.437,59 €",26-08-2015,13-02-2015,305 dias,"Portugal, Lisboa, Lisboa",Artigo 259.º do Código dos Contratos Públicos,31-12-2015,"807.437,59 €",NÃO APLICÁVEL,NÃO APLICÁVEL,,314294,Acordo quadro para o fornecimento de electricidade em regime de mercado livre para Portugal Continental,TRUE
