Objeto do Contrato,Tipo de Procedimento,Tipo(s) de Contrato,CPVs,Entidade(s) Adjudicante(s),Entidade(s) Adjudicatária(s),Preço Contratual,Data de Publicação,Data de Celebração do Contrato,Prazo de Execução,Local de Execução,Fundamentação,Data de Fecho do Contrato,Preço Total Efetivo,Causas das Alterações ao Prazo,Causas das Alterações ao Preço,Estado,N.º registo do Acordo Quadro,Descrição do Acordo Quadro,Procedimento Centralizado
"Aquisição de Mobiliário para a USF Póvoa 0, USF Póvoa 1 e USF Descobertas",Ajuste Direto Regime Geral,Aquisição de bens móveis,"39100000-3, Mobiliário","Administração Regional de Saúde de Lisboa e Vale do Tejo, I.P. (503148776)","Julcar Mobiliário Integrado, S.A. (501140263)","41.524,94 €",21-05-2013,10-05-2013,20 dias,"Portugal, Lisboa, Lisboa",Artigo 258.º do Código dos Contratos Públicos,,,,,,Não aplicável.,Não aplicável.,
"Aquisição de luvas de nitrilo não esterilizadas, tamanhos P e S",Ajuste Direto Regime Geral,Aquisição de bens móveis,"33000000-0, Equipamento médico, medicamentos e produtos para cuidados pessoais","Administração Regional de Saúde de Lisboa e Vale do Tejo, I.P. (503148776)","Bastos Viegas, SA (500042772)","180,00 €",20-05-2013,08-04-2013,60 dias,"Portugal, Lisboa, Loures","Artigo 24.º, n.º 1, alínea c) do Código dos Contratos Públicos",,,,,,Não aplicável.,Não aplicável.,
Manutenção/Reparação de equipamentos de AVAC,Ajuste Direto Regime Geral,Aquisição de serviços,"50800000-3, Serviços de reparação e manutenção diversos","Administração Regional de Saúde de Lisboa e Vale do Tejo, I.P. (503148776)",Ventifor- Representações (501140751),"9.105,99 €",17-05-2013,24-04-2013,20 dias,"Portugal, Lisboa, Sintra","Artigo 20.º, n.º 1, alínea a) do Código dos Contratos Públicos",,,,,,Não aplicável.,Não aplicável.,
Manutenção/Reparação de edificios,Ajuste Direto Regime Geral,Aquisição de serviços,"50000000-5, Serviços de reparação e manutenção","Administração Regional de Saúde de Lisboa e Vale do Tejo, I.P. (503148776)","Construções MaisCedo, LDA (510216005)","9.990,00 €",17-05-2013,09-04-2013,20 dias,"Portugal, Lisboa, Sintra","Artigo 20.º, n.º 1, alínea a) do Código dos Contratos Públicos",,,,,,Não aplicável.,Não aplicável.,
Aquisição de Vinhetas,Ajuste Direto Regime Geral,Aquisição de bens móveis,"30199761-2, Etiquetas com códigos de barras","Administração Regional de Saúde de Lisboa e Vale do Tejo, I.P. (503148776)","Imprensa Nacional Casa da Moeda, SA (500792887)","20,00 €",17-05-2013,05-04-2013,20 dias,"Portugal, Lisboa, Sintra","Artigo 24.º, n.º 1, alínea e) do Código dos Contratos Públicos",,,,,,Não aplicável.,Não aplicável.,
Aquisição de vinhetas,Ajuste Direto Regime Geral,Aquisição de bens móveis,"30199761-2, Etiquetas com códigos de barras","Administração Regional de Saúde de Lisboa e Vale do Tejo, I.P. (503148776)",Imprensa Nacional Casa da Moeda (500792887),"1.263,00 €",17-05-2013,12-03-2013,20 dias,"Portugal, Lisboa, Sintra","Artigo 24.º, n.º 1, alínea e) do Código dos Contratos Públicos",,,,,,Não aplicável.,Não aplicável.,
Aquisição de vinhetas médicas,Ajuste Direto Regime Geral,Aquisição de bens móveis,"30199761-2, Etiquetas com códigos de barras","Administração Regional de Saúde de Lisboa e Vale do Tejo, I.P. (503148776)","Imprensa Nacional da casa da Moeda, SA (500792887)","945,00 €",17-05-2013,02-05-2013,20 dias,"Portugal, Lisboa, Sintra","Artigo 24.º, n.º 1, alínea e) do Código dos Contratos Públicos",,,,,,Não aplicável.,Não aplicável.,
Equipamento / Mobiliário para a USF Descobertas,Concurso público,Aquisição de bens móveis,"39000000-2, Mobiliário (incl. de escritório), acessórios, aparelhos domésticos (excl. iluminação) e produtos de limpeza","Administração Regional de Saúde de Lisboa e Vale do Tejo, I.P. (503148776)",Intercromo (504058568),"1.010,00 €",16-05-2013,09-05-2013,20 dias,"Portugal, Lisboa, Lisboa","Artigo 21.º, n.º 1, alínea b) do Código dos Contratos Públicos",,,,,,Não aplicável.,Não aplicável.,
Equipamento / Mobiliário para a USF Descobertas,Concurso público,Aquisição de bens móveis,"33100000-1, Equipamento médico","Administração Regional de Saúde de Lisboa e Vale do Tejo, I.P. (503148776)",EPJ Médica (506820513),"90,00 €",16-05-2013,09-05-2013,20 dias,"Portugal, Lisboa, Lisboa","Artigo 21.º, n.º 1, alínea b) do Código dos Contratos Públicos",,,,,,Não aplicável.,Não aplicável.,
Equipamento / Mobiliário para a USF Descobertas,Concurso público,Aquisição de bens móveis,"33100000-1, Equipamento médico","Administração Regional de Saúde de Lisboa e Vale do Tejo, I.P. (503148776)",Sorisa (500990441),"3.033,07 €",16-05-2013,09-05-2013,20 dias,"Portugal, Lisboa, Lisboa","Artigo 21.º, n.º 1, alínea b) do Código dos Contratos Públicos",,,,,,Não aplicável.,Não aplicável.,
Equipamento / Mobiliário Médico para a USF Descobertas,Concurso público,Aquisição de bens móveis,"33192000-2, Mobiliário para fins médicos","Administração Regional de Saúde de Lisboa e Vale do Tejo, I.P. (503148776)",Sano - Técnica (500239819),"11.210,30 €",16-05-2013,08-05-2013,30 dias,"Portugal, Lisboa, Lisboa","Artigo 21.º, n.º 1, alínea b) do Código dos Contratos Públicos",,,,,,Não aplicável.,Não aplicável.,
Serviço noticioso e informativo,Ajuste Direto Regime Geral,Aquisição de serviços,"92400000-5, Serviços das agências noticiosas","Administração Regional de Saúde de Lisboa e Vale do Tejo, I.P. (503148776)",Lusa - Agência de Noticias de Portugal (503935107),"795,48 €",16-05-2013,15-05-2013,365 dias,"Portugal, Lisboa, Lisboa","Artigo 20.º, n.º 1, alínea a) do Código dos Contratos Públicos",,,,,,Não aplicável.,Não aplicável.,
Prestação de Serviços Técnicos de Saúde ACES Arrábida,Concurso público,Aquisição de serviços,"85100000-0, Serviços de saúde","Administração Regional de Saúde de Lisboa e Vale do Tejo, I.P. (503148776)","Kelly Services - Gestão de Processos, Lda. (506434770)","2.730,00 €",15-05-2013,01-04-2013,270 dias,"Portugal, Lisboa",Artigo 259.º do Código dos Contratos Públicos,,,,,,Não aplicável.,Não aplicável.,
"Serviços de Técnicos de Saúde ACES Sintra, Estuário do Tejo, e Oeste Sul",Concurso público,Aquisição de serviços,"85100000-0, Serviços de saúde","Administração Regional de Saúde de Lisboa e Vale do Tejo, I.P. (503148776)",Medicsearch S.A. (508080517),"43.816,50 €",15-05-2013,01-04-2013,270 dias,"Portugal, Lisboa",Artigo 259.º do Código dos Contratos Públicos,,,,,,Não aplicável.,Não aplicável.,
Técnicos de Saúde ACES Médio Tejo,Concurso público,Aquisição de serviços,"85100000-0, Serviços de saúde","Administração Regional de Saúde de Lisboa e Vale do Tejo, I.P. (503148776)",Medicsearch S.A. (508080517),"5.733,00 €",15-05-2013,01-04-2013,270 dias,"Portugal, Lisboa",Artigo 259.º do Código dos Contratos Públicos,,,,,,Não aplicável.,Não aplicável.,
Vinhetas médicas e de locais,Ajuste Direto Regime Geral,Aquisição de bens móveis,"22100000-1, Livros, brochuras e folhetos impressos","Administração Regional de Saúde de Lisboa e Vale do Tejo, I.P. (503148776)",Imprensa Nacional Casa da Moeda (500792887),"1.173,00 €",14-05-2013,07-05-2013,5 dias,"Portugal, Lisboa, Lisboa","Artigo 24.º, n.º 1, alínea e) do Código dos Contratos Públicos",,,,,,Não aplicável.,Não aplicável.,
Vinhetas médicas e de locais,Ajuste Direto Regime Geral,Aquisição de bens móveis,"22100000-1, Livros, brochuras e folhetos impressos","Administração Regional de Saúde de Lisboa e Vale do Tejo, I.P. (503148776)","Imprensa Nacional Casa da Moeda, S.A. (500792887)","1.300,00 €",14-05-2013,03-04-2013,5 dias,"Portugal, Lisboa, Lisboa","Artigo 24.º, n.º 1, alínea e) do Código dos Contratos Públicos",,,,,,Não aplicável.,Não aplicável.,
Comsumíveis de impressão,Ajuste Direto Regime Geral,Aquisição de bens móveis,"30125100-2, Cartuchos de tinta (toner)","Administração Regional de Saúde de Lisboa e Vale do Tejo, I.P. (503148776)","Max One - Material de Escritório, Lda. (507052609)","1.723.369,79 €",14-05-2013,17-09-2012,90 dias,"Portugal, Lisboa",Artigo 258.º do Código dos Contratos Públicos,,,,,,Não aplicável.,Não aplicável.,
Aquisição de seringas s/ agulha p/ insulina 1ML + p/ tuberculina 3 corpos 1ML,Ajuste Direto Regime Geral,Aquisição de bens móveis,"33141310-6, Seringas","Administração Regional de Saúde de Lisboa e Vale do Tejo, I.P. (503148776)",PERGUT PORTUGAL - COMERCIO PRODUTOS HOSPITALARES E MEDICO (501799729),"5.245,64 €",14-05-2013,09-04-2013,20 dias,"Portugal, Lisboa, Lisboa","Artigo 26.º, n.º 1, alínea e) do Código dos Contratos Públicos",,,,,,Não aplicável.,Não aplicável.,
Empreitada de Reparação e  Beneficiação da Fachada da Unidade de Saúde Familiar Oriente,Concurso público,Empreitadas de obras públicas,"45453100-8, Obras de recuperação","Administração Regional de Saúde de Lisboa e Vale do Tejo, I.P. (503148776)",Ramiro e Delgado (501301704),"48.593,24 €",14-05-2013,09-05-2013,60 dias,"Portugal, Lisboa, Lisboa","Artigo 19.º, alínea b) do Código dos Contratos Públicos",,,,,,Não aplicável.,Não aplicável.,
Aquisição de seringas irre. s/ agulha 2 corpos 50ML/100ML,Ajuste Direto Regime Geral,Aquisição de bens móveis,"33141310-6, Seringas","Administração Regional de Saúde de Lisboa e Vale do Tejo, I.P. (503148776)",PERGUT PORTUGAL - COMERCIO PRODUTOS HOSPITALARES E MEDICO (501799729),"5.972,13 €",14-05-2013,09-04-2013,20 dias,"Portugal, Lisboa, Lisboa","Artigo 20.º, n.º 1, alínea a) do Código dos Contratos Públicos",,,,,,Não aplicável.,Não aplicável.,
Aquisição de Álcool 70% - 500ML,Ajuste Direto Regime Geral,Aquisição de bens móveis,"24322510-5, Álcool etílico","Administração Regional de Saúde de Lisboa e Vale do Tejo, I.P. (503148776)",PROCLÍNICA - Equip. Produtos Clínicos Lda (500222665),"23.497,92 €",14-05-2013,28-03-2013,20 dias,"Portugal, Lisboa, Lisboa","Artigo 24.º, n.º 1, alínea e) do Código dos Contratos Públicos",,,,,,Não aplicável.,Não aplicável.,
"Aquisição de Impregnados Iodoforos 9,5x9,5 ",Ajuste Direto Regime Geral,Aquisição de bens móveis,"33141110-4, Pensos","Administração Regional de Saúde de Lisboa e Vale do Tejo, I.P. (503148776)","SMITH & NEPHEW, LDA (503552461)","195.800,00 €",14-05-2013,16-04-2013,20 dias,"Portugal, Lisboa, Lisboa","Artigo 26.º, n.º 1, alínea e) do Código dos Contratos Públicos",,,,,,Não aplicável.,Não aplicável.,
"Awuisição de Etinilestradiol 0,03 + Gestodeno 0,075",Ajuste Direto Regime Geral,Aquisição de bens móveis,"33641410-2, Contraceptivos orais","Administração Regional de Saúde de Lisboa e Vale do Tejo, I.P. (503148776)","BAYER PORTUGAL, S.A (500043256)","180.000,00 €",14-05-2013,24-04-2013,20 dias,"Portugal, Lisboa, Lisboa","Artigo 26.º, n.º 1, alínea e) do Código dos Contratos Públicos",,,,,,Não aplicável.,Não aplicável.,
"Aquisição de Desogestrel 0,075MG",Ajuste Direto Regime Geral,Aquisição de bens móveis,"33641410-2, Contraceptivos orais","Administração Regional de Saúde de Lisboa e Vale do Tejo, I.P. (503148776)","MERCK, SHARP & DOHME, LDA (500191360)","196.800,00 €",14-05-2013,24-04-2013,20 dias,"Portugal, Lisboa, Lisboa","Artigo 26.º, n.º 1, alínea e) do Código dos Contratos Públicos",,,,,,Não aplicável.,Não aplicável.,
"Aquisição de Etinilestradiol 0,03 + Levonorgestrel 0,1",Ajuste Direto Regime Geral,Aquisição de bens móveis,"33641410-2, Contraceptivos orais","Administração Regional de Saúde de Lisboa e Vale do Tejo, I.P. (503148776)","BAYER PORTUGAL, S.A (500043256)","14.000,00 €",14-05-2013,29-04-2013,20 dias,"Portugal, Lisboa, Lisboa","Artigo 26.º, n.º 1, alínea e) do Código dos Contratos Públicos",,,,,,Não aplicável.,Não aplicável.,
"Aquisição de Etinilestradiol 0,02 + Desogestrel 0,15",Ajuste Direto Regime Geral,Aquisição de bens móveis,"33641410-2, Contraceptivos orais","Administração Regional de Saúde de Lisboa e Vale do Tejo, I.P. (503148776)","MERCK, SHARP & DOHME, LDA (500191360)","190.400,00 €",14-05-2013,24-04-2013,20 dias,"Portugal, Lisboa, Lisboa","Artigo 26.º, n.º 1, alínea e) do Código dos Contratos Públicos",,,,,,Não aplicável.,Não aplicável.,
"Aquisição de Desogestrel 0,075MG",Ajuste Direto Regime Geral,Aquisição de bens móveis,"33641410-2, Contraceptivos orais","Administração Regional de Saúde de Lisboa e Vale do Tejo, I.P. (503148776)","MERCK, SHARP & DOHME, LDA (500191360)","65.600,00 €",14-05-2013,24-04-2013,20 dias,"Portugal, Lisboa, Lisboa","Artigo 26.º, n.º 1, alínea e) do Código dos Contratos Públicos",,,,,,Não aplicável.,Não aplicável.,
"Aquisição de Etinilestradiol 0,03 + desogestrel 0,15",Ajuste Direto Regime Geral,Aquisição de bens móveis,"33641410-2, Contraceptivos orais","Administração Regional de Saúde de Lisboa e Vale do Tejo, I.P. (503148776)","MRCK, SHARP & DOHME, LDA (500191360)","68.000,00 €",14-05-2013,24-04-2013,20 dias,"Portugal, Lisboa, Lisboa","Artigo 26.º, n.º 1, alínea e) do Código dos Contratos Públicos",,,,,,Não aplicável.,Não aplicável.,
"Empreitada de Beneficiação dos Pavimentos do Piso -1 (Armazém) e Piso 1 (Exterior e envolvente), no Centro de Saúde de Sete Rios",Concurso público,Empreitadas de obras públicas,"45453100-8, Obras de recuperação","Administração Regional de Saúde de Lisboa e Vale do Tejo, I.P. (503148776)",Comprojecto (501191690),"59.370,00 €",14-05-2013,08-05-2013,50 dias,"Portugal, Lisboa, Lisboa","Artigo 19.º, alínea b) do Código dos Contratos Públicos",,,,,,Não aplicável.,Não aplicável.,
"aQUISIÇÃO DE LEVONORGESTREL 1,5 mg",Ajuste Direto Regime Geral,Aquisição de bens móveis,"33641410-2, Contraceptivos orais","Administração Regional de Saúde de Lisboa e Vale do Tejo, I.P. (503148776)","TECNIFAR - IND. TÉC. FARMACÊUTICOS, S.A. (500280436)","17.000,00 €",14-05-2013,24-04-2013,20 dias,"Portugal, Lisboa, Lisboa","Artigo 26.º, n.º 1, alínea e) do Código dos Contratos Públicos",,,,,,Não aplicável.,Não aplicável.,
Aquisição de vacinas PAPILOMAVIRUS HUMANO,Ajuste Direto Regime Geral,Aquisição de bens móveis,"33651600-4, Vacinas","Administração Regional de Saúde de Lisboa e Vale do Tejo, I.P. (503148776)","SANOFI PASTEUR MSD, S.A. (507632796)","186.875,00 €",14-05-2013,24-04-2013,20 dias,"Portugal, Lisboa, Lisboa","Artigo 24.º, n.º 1, alínea e) do Código dos Contratos Públicos",,,,,,Não aplicável.,Não aplicável.,
Aquiição de vacinas PAPILOMAVIRUS HUMANO,Ajuste Direto Regime Geral,Aquisição de bens móveis,"33651600-4, Vacinas","Administração Regional de Saúde de Lisboa e Vale do Tejo, I.P. (503148776)","SANOFI PASTEUR MSD, S.A. (507632796)","179.400,00 €",14-05-2013,24-04-2013,20 dias,"Portugal, Lisboa, Lisboa","Artigo 24.º, n.º 1, alínea e) do Código dos Contratos Públicos",,,,,,Não aplicável.,Não aplicável.,
Aquisição de vacinas PAPILOMAVIRUS HUMANO,Ajuste Direto Regime Geral,Aquisição de bens móveis,"33651600-4, Vacinas","Administração Regional de Saúde de Lisboa e Vale do Tejo, I.P. (503148776)","SANOFI PASTEUR MSD, S.A (507632796)","179.400,00 €",14-05-2013,24-04-2013,20 dias,"Portugal, Lisboa, Lisboa","Artigo 24.º, n.º 1, alínea e) do Código dos Contratos Públicos",,,,,,Não aplicável.,Não aplicável.,
Aquisição de Amicacina Inj. 250MG/Ml - 2ML,Ajuste Direto Regime Geral,Aquisição de bens móveis,"33690000-3, Medicamentos vários","Administração Regional de Saúde de Lisboa e Vale do Tejo, I.P. (503148776)","LABORATÓRIOS NORMON, SA (505654156)","1.600,00 €",14-05-2013,27-03-2013,20 dias,"Portugal, Lisboa, Lisboa","Artigo 26.º, n.º 1, alínea e) do Código dos Contratos Públicos",,,,,,Não aplicável.,Não aplicável.,
Aquisição de Cloreto de NA INj. 9MG/ML - 10ML,Ajuste Direto Regime Geral,Aquisição de bens móveis,"33690000-3, Medicamentos vários","Administração Regional de Saúde de Lisboa e Vale do Tejo, I.P. (503148776)","LABESFAL - LABORATÓRIOS ALMIRO, S.A. (501169580)","5.560,00 €",14-05-2013,29-04-2013,20 dias,"Portugal, Lisboa, Lisboa","Artigo 26.º, n.º 1, alínea e) do Código dos Contratos Públicos",,,,,,Não aplicável.,Não aplicável.,
Aquisição de água p/ injetáveis - 5ML,Ajuste Direto Regime Geral,Aquisição de bens móveis,"33690000-3, Medicamentos vários","Administração Regional de Saúde de Lisboa e Vale do Tejo, I.P. (503148776)","B. BRAUN MEDICAL, LDA (501506543)","4.000,00 €",14-05-2013,17-04-2013,20 dias,"Portugal, Lisboa, Lisboa","Artigo 26.º, n.º 1, alínea e) do Código dos Contratos Públicos",,,,,,Não aplicável.,Não aplicável.,
Aquisição de Midazolam INJ. 5MG/ML - 3ML,Ajuste Direto Regime Geral,Aquisição de bens móveis,"33690000-3, Medicamentos vários","Administração Regional de Saúde de Lisboa e Vale do Tejo, I.P. (503148776)","HIKMA FARMACÊUTICA (PORTUGAL), S.A. (502266791)","38,40 €",14-05-2013,22-04-2013,20 dias,"Portugal, Lisboa, Lisboa","Artigo 26.º, n.º 1, alínea e) do Código dos Contratos Públicos",,,,,,Não aplicável.,Não aplicável.,
Aquisição de Penicilina G Benz 6 3 3 UI,Ajuste Direto Regime Geral,Aquisição de bens móveis,"33690000-3, Medicamentos vários","Administração Regional de Saúde de Lisboa e Vale do Tejo, I.P. (503148776)","LABORATÓRIOS ATRAL, S.A (500162085)","19.150,00 €",14-05-2013,08-04-2013,20 dias,"Portugal, Lisboa, Lisboa","Artigo 24.º, n.º 1, alínea e) do Código dos Contratos Públicos",,,,,,Não aplicável.,Não aplicável.,
Aquisição de Insulina Hum.Acção Curta 100UI/Ml - 10ML,Ajuste Direto Regime Geral,Aquisição de bens móveis,"33690000-3, Medicamentos vários","Administração Regional de Saúde de Lisboa e Vale do Tejo, I.P. (503148776)",NOVO NORDISK - COMÉRCIO DE PRODUTOS (501485210),"4.120,00 €",14-05-2013,08-05-2013,20 dias,"Portugal, Lisboa, Lisboa","Artigo 24.º, n.º 1, alínea e) do Código dos Contratos Públicos",,,,,,Não aplicável.,Não aplicável.,
Aquisição de Penicilina G BENZ 1.200.000 UI INJ.,Ajuste Direto Regime Geral,Aquisição de bens móveis,"33690000-3, Medicamentos vários","Administração Regional de Saúde de Lisboa e Vale do Tejo, I.P. (503148776)","LABORATÓRIOS ATRAL, S.A. (500162085)","32.100,00 €",13-05-2013,08-04-2013,20 dias,"Portugal, Lisboa, Lisboa","Artigo 24.º, n.º 1, alínea e) do Código dos Contratos Públicos",,,,,,Não aplicável.,Não aplicável.,
Aquisição de Risperidona 1MG/ML - 30ML SOL. ORAL,Ajuste Direto Regime Geral,Aquisição de bens móveis,"33690000-3, Medicamentos vários","Administração Regional de Saúde de Lisboa e Vale do Tejo, I.P. (503148776)","RATIOPHARMA - Cmercio e Industria Produtos Farmacêuticos, Lda (502414910)","1.736,00 €",13-05-2013,30-04-2013,20 dias,"Portugal, Lisboa, Lisboa","Artigo 26.º, n.º 1, alínea e) do Código dos Contratos Públicos",,,,,,Não aplicável.,Não aplicável.,
Aquisição de Metamizol Magnésio Inj. 400MG/ML 5 ML,Ajuste Direto Regime Geral,Aquisição de bens móveis,"33690000-3, Medicamentos vários","Administração Regional de Saúde de Lisboa e Vale do Tejo, I.P. (503148776)","UNILARMA - UNIÃO INTERNACIONAL LABORATÓRIOS FARMACÊUTICOS, LDA (500293023)","2.800,00 €",13-05-2013,24-04-2013,20 dias,"Portugal, Lisboa, Lisboa","Artigo 26.º, n.º 1, alínea e) do Código dos Contratos Públicos",,,,,,Não aplicável.,Não aplicável.,
Aquisição de Capreomicina PO SOL Inj. 1G,Ajuste Direto Regime Geral,Aquisição de bens móveis,"33690000-3, Medicamentos vários","Administração Regional de Saúde de Lisboa e Vale do Tejo, I.P. (503148776)","ETIOPHARMA, S.A (509393357)","5.000,00 €",13-05-2013,18-04-2013,20 dias,"Portugal, Lisboa, Lisboa","Artigo 24.º, n.º 1, alínea e) do Código dos Contratos Públicos",,,,,,Não aplicável.,Não aplicável.,
"Aquisição de naloxona Inj. 0,4 MG/ML 1 ML",Ajuste Direto Regime Geral,Aquisição de bens móveis,"33690000-3, Medicamentos vários","Administração Regional de Saúde de Lisboa e Vale do Tejo, I.P. (503148776)","HIKMA FARMACÊUTICA (PORTUGAL), S.A (502266791)","8.704,00 €",13-05-2013,15-04-2013,20 dias,"Portugal, Lisboa, Lisboa","Artigo 26.º, n.º 1, alínea e) do Código dos Contratos Públicos",,,,,,Não aplicável.,Não aplicável.,
Aquisição de adrenalina Inj 1MG/L 1 ML,Ajuste Direto Regime Geral,Aquisição de bens móveis,"33690000-3, Medicamentos vários","Administração Regional de Saúde de Lisboa e Vale do Tejo, I.P. (503148776)","B. BRAUN MEDICAL, LDA (501506543)","10.600,00 €",13-05-2013,19-04-2013,20 dias,"Portugal, Lisboa, Lisboa","Artigo 20.º, n.º 1, alínea a) do Código dos Contratos Públicos",,,,,,Não aplicável.,Não aplicável.,
"Aquisição de Fornecimento e Montagem de Sinaléticas para as USF's Andreas, Cidadela, Afonsoeiro e Mira Sintra",Ajuste Direto Regime Geral,Aquisição de bens móveis,"31523000-8, Placas sinaléticas e sinais luminosos","Administração Regional de Saúde de Lisboa e Vale do Tejo, I.P. (503148776)","Rascunho Design, Lda (504131770)","9.224,00 €",13-05-2013,13-05-2013,20 dias,"Portugal, Lisboa","Artigo 20.º, n.º 1, alínea a) do Código dos Contratos Públicos",,,,,,Não aplicável.,Não aplicável.,
