freguesia,acronym,validVotesPercentage,votes,dicofre
Margem,PS,60.73,150,120905
Margem,PCP-PEV,14.98,37,120905
Margem,PPD/PSD.CDS-PP,9.72,24,120905
Margem,B.E.,4.86,12,120905
Margem,PCTP/MRPP,4.45,11,120905
Margem,MPT,3.24,8,120905
Margem,PAN,0.81,2,120905
Margem,PND,0.81,2,120905
Margem,MAS,0.4,1,120905
Margem,L,0,0,120905
Margem,PDA,0,0,120905
Margem,PNR,0,0,120905
Margem,POUS,0,0,120905
Margem,PPM,0,0,120905
Margem,PPV,0,0,120905
Margem,PTP,0,0,120905
