freguesia,acronym,validVotesPercentage,votes,dicofre
União das freguesias de Ribafria e Pereiro de Palhacana,PS,47.75,212,110121
União das freguesias de Ribafria e Pereiro de Palhacana,PCP-PEV,20.27,90,110121
União das freguesias de Ribafria e Pereiro de Palhacana,PPD/PSD.CDS-PP,15.77,70,110121
União das freguesias de Ribafria e Pereiro de Palhacana,MPT,5.18,23,110121
União das freguesias de Ribafria e Pereiro de Palhacana,B.E.,4.05,18,110121
União das freguesias de Ribafria e Pereiro de Palhacana,PCTP/MRPP,2.25,10,110121
União das freguesias de Ribafria e Pereiro de Palhacana,PNR,1.13,5,110121
União das freguesias de Ribafria e Pereiro de Palhacana,L,0.9,4,110121
União das freguesias de Ribafria e Pereiro de Palhacana,PAN,0.9,4,110121
União das freguesias de Ribafria e Pereiro de Palhacana,PTP,0.9,4,110121
União das freguesias de Ribafria e Pereiro de Palhacana,PND,0.45,2,110121
União das freguesias de Ribafria e Pereiro de Palhacana,PPV,0.45,2,110121
União das freguesias de Ribafria e Pereiro de Palhacana,MAS,0,0,110121
União das freguesias de Ribafria e Pereiro de Palhacana,PDA,0,0,110121
União das freguesias de Ribafria e Pereiro de Palhacana,POUS,0,0,110121
União das freguesias de Ribafria e Pereiro de Palhacana,PPM,0,0,110121
