Objeto do Contrato,Tipo de Procedimento,Tipo(s) de Contrato,CPVs,Entidade(s) Adjudicante(s),Entidade(s) Adjudicatária(s),Preço Contratual,Data de Publicação,Data de Celebração do Contrato,Prazo de Execução,Local de Execução,Fundamentação,Data de Fecho do Contrato,Preço Total Efetivo,Causas das Alterações ao Prazo,Causas das Alterações ao Preço,Estado,N.º registo do Acordo Quadro,Descrição do Acordo Quadro,Procedimento Centralizado
Aquisição de Feltro Adesivado Rolo,Ajuste Direto Regime Geral,Aquisição de bens móveis,"33140000-3, Material médico de consumo","Administração Regional de Saúde do Algarve, I.P. (503148709)",Overpharma (505792362),"4.860,00 €",10-09-2012,31-08-2012,110 dias,"Portugal, Faro, Faro","Artigo 24.º, n.º 1, alínea e) do Código dos Contratos Públicos","","",,"",,Não aplicável.,Não aplicável.,
Prestação de serviços de transporte de materiais para as Unidades de Saúde dos Agrupamentos dos Centros de Saúde - ACES e dos Serviços da Sede da ARS Algarve,Ajuste Direto Regime Geral,Aquisição de serviços,"60161000-4, Serviços de transporte de encomendas","Administração Regional de Saúde do Algarve, I.P. (503148709)","URBANOS-Soluções, S.A (502392290)","28.563,28 €",10-09-2012,01-09-2012,365 dias,"Portugal, Faro","Artigo 20.º, n.º 1, alínea a) do Código dos Contratos Públicos",31-08-2013,"28.563,22 €",,Arredondamentos de facturação.,,Não aplicável.,Não aplicável.,
"Poliuretano com Rebordo de Silicone 7,5 x 7,5 CM",Ajuste Direto Regime Geral,Aquisição de bens móveis,"33141110-4, Pensos","Administração Regional de Saúde do Algarve, I.P. (503148709)",Smith  e Nephew Ldª (503552461),"15.280,00 €",05-09-2012,12-08-2012,110 dias,"Portugal, Faro, Faro","Artigo 24.º, n.º 1, alínea e) do Código dos Contratos Públicos","","",,"",,Não aplicável.,Não aplicável.,
