freguesia,acronym,validVotesPercentage,votes,dicofre
Santo Quintino,PS,41.87,672,111201
Santo Quintino,PPD/PSD,17.76,285,111201
Santo Quintino,PCP-PEV,16.82,270,111201
Santo Quintino,B.E.,8.54,137,111201
Santo Quintino,CDS-PP,3.24,52,111201
Santo Quintino,PAN,3.05,49,111201
Santo Quintino,PCTP/MRPP,2.31,37,111201
Santo Quintino,IL,1.5,24,111201
Santo Quintino,CH,1.12,18,111201
Santo Quintino,L,1.06,17,111201
Santo Quintino,A,0.69,11,111201
Santo Quintino,PPM,0.56,9,111201
Santo Quintino,R.I.R.,0.44,7,111201
Santo Quintino,PNR,0.31,5,111201
Santo Quintino,MPT,0.25,4,111201
Santo Quintino,NC,0.25,4,111201
Santo Quintino,MAS,0.12,2,111201
Santo Quintino,PDR,0.06,1,111201
Santo Quintino,PTP,0.06,1,111201
Santo Quintino,PURP,0,0,111201
