Objeto do Contrato,Tipo de Procedimento,Tipo(s) de Contrato,CPVs,Entidade(s) Adjudicante(s),Entidade(s) Adjudicatária(s),Preço Contratual,Data de Publicação,Data de Celebração do Contrato,Prazo de Execução,Local de Execução,Fundamentação,Data de Fecho do Contrato,Preço Total Efetivo,Causas das Alterações ao Prazo,Causas das Alterações ao Preço,Estado,N.º registo do Acordo Quadro,Descrição do Acordo Quadro,Procedimento Centralizado
Fornecimento e Montagem de Estantes Metalicas de Carga Pesada para os Serviços de Armazem (6 Modulos 2700x3000x1100mm) e Farmacia (10 Modulos 2700x5000x1100mm).,Ajuste Direto Regime Geral,Aquisição de bens móveis,"39141100-3, Estantes","Administração Regional de Saúde do Algarve, I.P. (503148709)","MECALUX ESTANTES, LDA. (502730129)","9.437,00 €",30-05-2012,24-05-2012,20 dias,"Portugal, Faro","Artigo 20.º, n.º 1, alínea a) do Código dos Contratos Públicos",28-06-2012,"9.437,00 €",,,,Não aplicável.,Não aplicável.,
Papel Branco Fotocópia A4 80 GRS.,Ajuste Direto Regime Geral,Aquisição de bens móveis,"30197643-5, Papel para fotocópia","Administração Regional de Saúde do Algarve, I.P. (503148709)","Inapa Portugal - Distribuição de Papel, S.A. (500156760)","7.340,00 €",22-05-2012,17-05-2012,60 dias,"Portugal, Faro, Faro","Artigo 20.º, n.º 1, alínea a) do Código dos Contratos Públicos",25-06-2012,"7.340,00 €",,,,Não aplicável.,Não aplicável.,
