freguesia,acronym,validVotesPercentage,votes,dicofre
Vilar de Pinheiro,PS,39.1,339,131630
Vilar de Pinheiro,PPD/PSD,29.07,252,131630
Vilar de Pinheiro,B.E.,9.11,79,131630
Vilar de Pinheiro,PAN,6.23,54,131630
Vilar de Pinheiro,CDS-PP,4.84,42,131630
Vilar de Pinheiro,PCP-PEV,3.23,28,131630
Vilar de Pinheiro,A,1.38,12,131630
Vilar de Pinheiro,IL,1.27,11,131630
Vilar de Pinheiro,NC,1.27,11,131630
Vilar de Pinheiro,PPM.PPV/CDC,1.15,10,131630
Vilar de Pinheiro,PCTP/MRPP,0.92,8,131630
Vilar de Pinheiro,L,0.81,7,131630
Vilar de Pinheiro,PTP,0.58,5,131630
Vilar de Pinheiro,MAS,0.35,3,131630
Vilar de Pinheiro,PNR,0.35,3,131630
Vilar de Pinheiro,PDR,0.23,2,131630
Vilar de Pinheiro,PURP,0.12,1,131630
