freguesia,acronym,validVotesPercentage,votes,dicofre
União das freguesias de São Julião e Silva,PPD/PSD,52.08,138,160819
União das freguesias de São Julião e Silva,PS,27.92,74,160819
União das freguesias de São Julião e Silva,CDS-PP,4.53,12,160819
União das freguesias de São Julião e Silva,B.E.,3.4,9,160819
União das freguesias de São Julião e Silva,PAN,2.26,6,160819
União das freguesias de São Julião e Silva,PCP-PEV,2.26,6,160819
União das freguesias de São Julião e Silva,R.I.R.,1.89,5,160819
União das freguesias de São Julião e Silva,CH,1.13,3,160819
União das freguesias de São Julião e Silva,JPP,0.75,2,160819
União das freguesias de São Julião e Silva,L,0.75,2,160819
União das freguesias de São Julião e Silva,A,0.38,1,160819
União das freguesias de São Julião e Silva,IL,0.38,1,160819
União das freguesias de São Julião e Silva,MPT,0.38,1,160819
União das freguesias de São Julião e Silva,NC,0.38,1,160819
União das freguesias de São Julião e Silva,PCTP/MRPP,0.38,1,160819
União das freguesias de São Julião e Silva,PNR,0.38,1,160819
União das freguesias de São Julião e Silva,PTP,0.38,1,160819
União das freguesias de São Julião e Silva,PURP,0.38,1,160819
União das freguesias de São Julião e Silva,PDR,0,0,160819
União das freguesias de São Julião e Silva,PPM,0,0,160819
