freguesia,acronym,validVotesPercentage,votes,dicofre
Bouçoães,PPD/PSD.CDS-PP,69.43,109,171205
Bouçoães,PS,18.47,29,171205
Bouçoães,PND,3.82,6,171205
Bouçoães,PPM,2.55,4,171205
Bouçoães,MPT,1.91,3,171205
Bouçoães,L,1.27,2,171205
Bouçoães,PAN,1.27,2,171205
Bouçoães,B.E.,0.64,1,171205
Bouçoães,PDA,0.64,1,171205
Bouçoães,MAS,0,0,171205
Bouçoães,PCP-PEV,0,0,171205
Bouçoães,PCTP/MRPP,0,0,171205
Bouçoães,PNR,0,0,171205
Bouçoães,POUS,0,0,171205
Bouçoães,PPV,0,0,171205
Bouçoães,PTP,0,0,171205
