freguesia,acronym,validVotesPercentage,votes,dicofre
União das freguesias de Cacém e São Marcos,PS,35.09,2899,111124
União das freguesias de Cacém e São Marcos,PCP-PEV,18.83,1556,111124
União das freguesias de Cacém e São Marcos,PPD/PSD.CDS-PP,17.38,1436,111124
União das freguesias de Cacém e São Marcos,MPT,8.23,680,111124
União das freguesias de Cacém e São Marcos,B.E.,7.5,620,111124
União das freguesias de Cacém e São Marcos,PAN,3.49,288,111124
União das freguesias de Cacém e São Marcos,L,2.89,239,111124
União das freguesias de Cacém e São Marcos,PCTP/MRPP,2.38,197,111124
União das freguesias de Cacém e São Marcos,PTP,0.85,70,111124
União das freguesias de Cacém e São Marcos,PNR,0.79,65,111124
União das freguesias de Cacém e São Marcos,PPM,0.7,58,111124
União das freguesias de Cacém e São Marcos,PPV,0.63,52,111124
União das freguesias de Cacém e São Marcos,MAS,0.54,45,111124
União das freguesias de Cacém e São Marcos,PND,0.48,40,111124
União das freguesias de Cacém e São Marcos,PDA,0.12,10,111124
União das freguesias de Cacém e São Marcos,POUS,0.08,7,111124
