freguesia,acronym,validVotesPercentage,votes,dicofre
União das freguesias de Castanheiro do Norte e Ribalonga,PS,48.02,97,040322
União das freguesias de Castanheiro do Norte e Ribalonga,PPD/PSD,30.69,62,040322
União das freguesias de Castanheiro do Norte e Ribalonga,B.E.,4.95,10,040322
União das freguesias de Castanheiro do Norte e Ribalonga,CDS-PP,3.96,8,040322
União das freguesias de Castanheiro do Norte e Ribalonga,PAN,2.97,6,040322
União das freguesias de Castanheiro do Norte e Ribalonga,PCP-PEV,2.97,6,040322
União das freguesias de Castanheiro do Norte e Ribalonga,A,1.98,4,040322
União das freguesias de Castanheiro do Norte e Ribalonga,PPM.PPV/CDC,1.98,4,040322
União das freguesias de Castanheiro do Norte e Ribalonga,PCTP/MRPP,1.49,3,040322
União das freguesias de Castanheiro do Norte e Ribalonga,PDR,0.5,1,040322
União das freguesias de Castanheiro do Norte e Ribalonga,PURP,0.5,1,040322
União das freguesias de Castanheiro do Norte e Ribalonga,IL,0,0,040322
União das freguesias de Castanheiro do Norte e Ribalonga,L,0,0,040322
União das freguesias de Castanheiro do Norte e Ribalonga,MAS,0,0,040322
União das freguesias de Castanheiro do Norte e Ribalonga,NC,0,0,040322
União das freguesias de Castanheiro do Norte e Ribalonga,PNR,0,0,040322
União das freguesias de Castanheiro do Norte e Ribalonga,PTP,0,0,040322
