Objeto do Contrato,Tipo de Procedimento,Tipo(s) de Contrato,CPVs,Entidade(s) Adjudicante(s),Entidade(s) Adjudicatária(s),Preço Contratual,Data de Publicação,Data de Celebração do Contrato,Prazo de Execução,Local de Execução,Fundamentação,Data de Fecho do Contrato,Preço Total Efetivo,Causas das Alterações ao Prazo,Causas das Alterações ao Preço,Estado,N.º registo do Acordo Quadro,Descrição do Acordo Quadro,Procedimento Centralizado
"Fornecimento de energia elétrica em BTE + MT às unidades de saúde da ARSLVT, IP.",Ajuste Direto Regime Geral,Aquisição de serviços,"65310000-9, Distribuição de electricidade","Administração Regional de Saúde de Lisboa e Vale do Tejo, I. P. (503148776)","EDP COMERCIAL - COMERCIALIZAÇÃO ENERGIA, SA. (503504564)","80.000,00 €",11-12-2017,11-12-2017,180 dias,"Portugal, Setúbal<BR/>Portugal, Lisboa<BR/>Portugal, Santarém<BR/>Portugal, Leiria","Artigo 24.º, n.º 1, alínea e) do Código dos Contratos Públicos",,,,,,Não aplicável.,Não aplicável.,FALSE
"Fornecimento de energia elétrica em BTN + BTE + MT às unidades de saúde da ARSLVT, IP.",Ajuste Direto Regime Geral,Aquisição de serviços,"65310000-9, Distribuição de electricidade","Administração Regional de Saúde de Lisboa e Vale do Tejo, I. P. (503148776)","EDP SERVIÇO UNIVERSAL, S.A. (507846044)","67.500,00 €",11-12-2017,11-12-2017,180 dias,"Portugal, Lisboa<BR/>Portugal, Leiria<BR/>Portugal, Santarém<BR/>Portugal, Setúbal","Artigo 24.º, n.º 1, alínea e) do Código dos Contratos Públicos",,,,,,Não aplicável.,Não aplicável.,FALSE
"Empreitada  de Remodelação e Beneficiação do 3º Piso do Edifício nº75 da ARSLVT,IP.",Ajuste Direto Regime Geral,Empreitadas de obras públicas,"45113000-2, Obras no local","Administração Regional de Saúde de Lisboa e Vale do Tejo, I. P. (503148776)","Santos & Cipriano, Lda (504789112)","44.700,00 €",11-12-2017,28-11-2017,30 dias,"Portugal, Lisboa, Lisboa","Artigo 19.º, alínea a) do Código dos Contratos Públicos",,,,,,Não aplicável.,Não aplicável.,FALSE
"Transferência de equipamento de estomatologia com fornecimento de Fotopolimerizador, para a USF Novo Mirante.",Ajuste Direto Regime Geral,Aquisição de serviços,"60000000-8, Serviços de transporte (excl. transporte de resíduos)","Administração Regional de Saúde de Lisboa e Vale do Tejo, I. P. (503148776)",SUCH- Serviço de Utilização Comum dos Hospitais (500900469),"2.404,00 €",11-12-2017,11-12-2017,10 dias,"Portugal, Lisboa, Odivelas","Artigo 20.º, n.º 1, alínea a) do Código dos Contratos Públicos",,,,,,Não aplicável.,Não aplicável.,FALSE
Aquisição de manga mista com fole para esterilização,Ao abrigo de acordo-quadro (art.º 259.º),Aquisição de bens móveis,"33191000-5, Aparelhos para esterilização, desinfecção e higiene","Administração Regional de Saúde de Lisboa e Vale do Tejo, I. P. (503148776)","3M ESPANA, SL, SUCURSAL PORTUGAL (980560241)","597,50 €",11-12-2017,06-12-2017,2 dias,"Portugal, Lisboa, Lisboa",Artigo 259.º do Código dos Contratos Públicos,,,,,,1974943,CP 2016/43 - Acordo quadro para fornecimento de Material para Empacotamento em Esterilização às Instituições e Serviços do Serviço Nacional de Saúde.,FALSE
Aquisição de manga mista com fole para esterilização,Ao abrigo de acordo-quadro (art.º 259.º),Aquisição de bens móveis,"33191000-5, Aparelhos para esterilização, desinfecção e higiene","Administração Regional de Saúde de Lisboa e Vale do Tejo, I. P. (503148776)",PERGUT (501799729),"457,60 €",11-12-2017,06-12-2017,15 dias,"Portugal, Lisboa, Lisboa",Artigo 259.º do Código dos Contratos Públicos,,,,,,1974943,CP 2016/43 - Acordo quadro para fornecimento de Material para Empacotamento em Esterilização às Instituições e Serviços do Serviço Nacional de Saúde.,FALSE
Aquisição de manga mista com fole para esterilização,Ao abrigo de acordo-quadro (art.º 259.º),Aquisição de bens móveis,"33191000-5, Aparelhos para esterilização, desinfecção e higiene","Administração Regional de Saúde de Lisboa e Vale do Tejo, I. P. (503148776)",DIMOR LUSITANA                                     (500730741),"735,00 €",11-12-2017,06-12-2017,2 dias,"Portugal, Lisboa, Lisboa",Artigo 259.º do Código dos Contratos Públicos,,,,,,1974943,CP 2016/43 - Acordo quadro para fornecimento de Material para Empacotamento em Esterilização às Instituições e Serviços do Serviço Nacional de Saúde.,FALSE
Aquisição de película de contacto para terapia compressiva (Apósito) P1014,Ao abrigo de acordo-quadro (art.º 259.º),Aquisição de bens móveis,"33140000-3, Material médico de consumo","Administração Regional de Saúde de Lisboa e Vale do Tejo, I. P. (503148776)","Queenlabs - Especialidades Farmacêuticas,Lda (503984485)","6.072,00 €",11-12-2017,06-12-2017,2 dias,"Portugal, Lisboa, Lisboa",Artigo 259.º do Código dos Contratos Públicos,,,,,,1315192,Acordo Quadro para fornecimento de material de penso de efeito terapêutico às Instituições e Serviços do Serviço Nacional de Saúde,FALSE
Aquisição de mobiliário para a USF Conchas do Aces Lisboa Norte,Ao abrigo de acordo-quadro (art.º 259.º),Aquisição de bens móveis,"39160000-1, Mobiliário escolar","Administração Regional de Saúde de Lisboa e Vale do Tejo, I. P. (503148776)",Nautilus (503653179),"2.966,67 €",07-12-2017,08-11-2017,53 dias,"Portugal, Lisboa, Lisboa",Artigo 259.º do Código dos Contratos Públicos,,,,,,1260651,Acordo quadro de fornecimento de mobiliário,FALSE
Aquisição de mobiliário para a USF Conchas do Aces Lisboa Norte,Ao abrigo de acordo-quadro (art.º 259.º),Aquisição de bens móveis,"39110000-6, Assentos, cadeiras e produtos afins e peças associadas","Administração Regional de Saúde de Lisboa e Vale do Tejo, I. P. (503148776)","Julcar Mobiliário Integrado, SA (501140263)","798,00 €",07-12-2017,08-11-2017,53 dias,"Portugal, Lisboa, Lisboa",Artigo 259.º do Código dos Contratos Públicos,,,,,,1260651,Acordo quadro de fornecimento de mobiliário,FALSE
Aquisição de mobiliário para a USF Conchas - Aces Lisboa Norte,Ao abrigo de acordo-quadro (art.º 259.º),Aquisição de bens móveis,"39112000-0, Cadeiras","Administração Regional de Saúde de Lisboa e Vale do Tejo, I. P. (503148776)","Julcar Mobiliário Integrado, SA (501140263)","252,00 €",07-12-2017,08-11-2017,53 dias,"Portugal, Lisboa, Lisboa",Artigo 259.º do Código dos Contratos Públicos,,,,,,1260651,Acordo quadro de fornecimento de mobiliário,FALSE
Aquisição de mobiliário para a USF Conchas do Aces Lisboa Norte,Ao abrigo de acordo-quadro (art.º 259.º),Aquisição de bens móveis,"39120000-9, Mesas, aparadores, secretárias e estantes","Administração Regional de Saúde de Lisboa e Vale do Tejo, I. P. (503148776)","Julcar Mobiliário Integrado, SA (501140263)","12.998,52 €",07-12-2017,13-11-2017,53 dias,"Portugal, Lisboa, Lisboa",Artigo 259.º do Código dos Contratos Públicos,,,,,,1260651,Acordo quadro de fornecimento de mobiliário,FALSE
"Aquisição de seguros do ramo automóvel para a frota da ARSLVT, IP",Concurso público,Aquisição de serviços,"66514110-0, Serviços de seguro automóvel","Administração Regional de Saúde de Lisboa e Vale do Tejo, I. P. (503148776)","Fidelidade - Companhia de Seguros, S.A. (500918880)","66.435,54 €",07-12-2017,07-12-2017,365 dias,"Portugal, Lisboa, Lisboa","Artigo 20.º, n.º 1, alínea b) do Código dos Contratos Públicos",,,,,,Não aplicável.,Não aplicável.,FALSE
Aquisição do projeto de recuperação de Quiosques/Soluções de Gestão de Atendimento - Aces Arrábida - USF Santiago Palmela,Ajuste Direto Regime Geral,Aquisição de serviços,"50800000-3, Serviços de reparação e manutenção diversos","Administração Regional de Saúde de Lisboa e Vale do Tejo, I. P. (503148776)",Attendsys - Soluções Globais de Atendimento (510306802),"2.545,31 €",07-12-2017,06-12-2017,15 dias,"Portugal, Setúbal, Palmela","Artigo 20.º, n.º 1, alínea a) do Código dos Contratos Públicos",,,,,,Não aplicável.,Não aplicável.,FALSE
"Aquisição de serviços de higiene e limpeza para os serviços da dependência da ARSLVT, IP, para o período de 01/11/2017 a 31/12/2017",Ajuste Direto Regime Geral,Aquisição de serviços,"90910000-9, Serviços de limpeza","Administração Regional de Saúde de Lisboa e Vale do Tejo, I. P. (503148776)","Fine Facility Services, Lda (509418627)","683.757,74 €",06-12-2017,29-11-2017,61 dias,"Portugal, Lisboa<BR/>Portugal, Setúbal<BR/>Portugal, Leiria<BR/>Portugal, Santarém","Artigo 24.º, n.º 1, alínea c) do Código dos Contratos Públicos",,,,,,Não aplicável.,Não aplicável.,FALSE
Aquisição de solução de gestão de atendimento  - USCP Algueirão Mem-Martins,Ajuste Direto Regime Geral,Aquisição de bens móveis,"32322000-6, Equipamento multimédia","Administração Regional de Saúde de Lisboa e Vale do Tejo, I. P. (503148776)",Attendsys - Soluções Globais de Atendimento (510306802),"6.123,00 €",06-12-2017,06-12-2017,24 dias,"Portugal, Lisboa, Sintra","Artigo 20.º, n.º 1, alínea a) do Código dos Contratos Públicos",,,,,,Não aplicável.,Não aplicável.,FALSE
"Aquisição de serviços de manutenção de 30  sistemas de atendimento com Sclinico das várias Unidades de Saúde da ARSLVT, IP",Ajuste Direto Regime Geral,Aquisição de serviços,"50300000-8, Serviços de reparação e manutenção e serviços conexos relacionados com computadores pessoais e com equipamento burótico, audiovisual e para telecomunicações",Adm.Reg.de Saúde de Lisboa e Vale do Tejo (ARSLVT) (503148776),Attendsys - Soluções Globais de Atendimento (510306802),"9.900,00 €",06-12-2017,06-12-2017,15 dias,"Portugal, Lisboa, Lisboa","Artigo 20.º, n.º 1, alínea a) do Código dos Contratos Públicos",,,,,,Não aplicável.,Não aplicável.,FALSE
"Aquisição de serviços de manutenção e suporte ao PACS Sectra da ARSLVT, IP",Ajuste Direto Regime Geral,Aquisição de bens móveis,"48600000-4, Pacote de software para bases de dados e de software operativo","Administração Regional de Saúde de Lisboa e Vale do Tejo, I. P. (503148776)",ART CES UNIPESSOAL (513270396),"21.750,00 €",06-12-2017,24-10-2017,67 dias,"Portugal, Lisboa, Lisboa","Artigo 24.º, n.º 1, alínea e) do Código dos Contratos Públicos",,,,,,Não aplicável.,Não aplicável.,TRUE
Sol. Alcoólica com dermoprotetor Fr. 500ml,Ao abrigo de acordo-quadro (art.º 259.º),Aquisição de bens móveis,"33600000-6, Produtos farmacêuticos","Administração Regional de Saúde de Lisboa e Vale do Tejo, I. P. (503148776)",B.braun Medical Lda (501506543),"12.960,00 €",05-12-2017,17-10-2017,75 dias,"Portugal, Lisboa, Lisboa",Artigo 259.º do Código dos Contratos Públicos,,,,,,1406003,CP 2015/8,FALSE
"Substituição do equipamento principal de comunicações do centro de dados da Administração Regional de Saúde de Lisboa e Vale do Tejo, IP.",Ajuste Direto Regime Geral,Aquisição de bens móveis,"32500000-8, Equipamento e material para telecomunicações","Administração Regional de Saúde de Lisboa e Vale do Tejo, I. P. (503148776)","INFORMATICA EL CORTE INGLÉS, S.A.-Sucursal em Portugal (980079659)","22.855,89 €",05-12-2017,02-11-2017,30 dias,"Portugal, Lisboa, Lisboa","Artigo 20.º, n.º 1, alínea a) do Código dos Contratos Públicos",,,,,,Não aplicável.,Não aplicável.,TRUE
