freguesia,acronym,validVotesPercentage,votes,dicofre
Cardigos,PPD/PSD.CDS-PP,67.32,311,141303
Cardigos,PS,16.45,76,141303
Cardigos,MPT,4.33,20,141303
Cardigos,PAN,3.9,18,141303
Cardigos,B.E.,1.3,6,141303
Cardigos,PCP-PEV,1.3,6,141303
Cardigos,L,1.08,5,141303
Cardigos,MAS,0.87,4,141303
Cardigos,PND,0.65,3,141303
Cardigos,POUS,0.65,3,141303
Cardigos,PPV,0.65,3,141303
Cardigos,PCTP/MRPP,0.43,2,141303
Cardigos,PPM,0.43,2,141303
Cardigos,PTP,0.43,2,141303
Cardigos,PNR,0.22,1,141303
Cardigos,PDA,0,0,141303
