Objeto do Contrato,Tipo de Procedimento,Tipo(s) de Contrato,CPVs,Entidade(s) Adjudicante(s),Entidade(s) Adjudicatária(s),Preço Contratual,Data de Publicação,Data de Celebração do Contrato,Prazo de Execução,Local de Execução,Fundamentação,Data de Fecho do Contrato,Preço Total Efetivo,Causas das Alterações ao Prazo,Causas das Alterações ao Preço,Estado,N.º registo do Acordo Quadro,Descrição do Acordo Quadro,Procedimento Centralizado
medicamento,Ajuste Direto Regime Geral,Aquisição de bens móveis,"33000000-0, Equipamento médico, medicamentos e produtos para cuidados pessoais","Unidade Local de Saúde do Baixo Alentejo, E. P. E. (508754275)","ABBOTT LABORATORIOS, LDA (500006148)","105,00 €",20-10-2017,28-04-2017,365 dias,"Portugal, Beja, Beja","Artigo 20.º, n.º 1, alínea a) do Código dos Contratos Públicos",,,,,,Não aplicável.,Não aplicável.,FALSE
medicamento,Ajuste Direto Regime Geral,Aquisição de bens móveis,"33000000-0, Equipamento médico, medicamentos e produtos para cuidados pessoais","Unidade Local de Saúde do Baixo Alentejo, E. P. E. (508754275)",BAXTER MEDICO FARMACEUTICA LDA (503347345),"1.296,00 €",20-10-2017,28-04-2017,365 dias,"Portugal, Beja, Beja","Artigo 20.º, n.º 1, alínea a) do Código dos Contratos Públicos",,,,,,Não aplicável.,Não aplicável.,FALSE
medicamento,Ajuste Direto Regime Geral,Aquisição de bens móveis,"33000000-0, Equipamento médico, medicamentos e produtos para cuidados pessoais","Unidade Local de Saúde do Baixo Alentejo, E. P. E. (508754275)",WEP CLINICAL (944893866),"103,35 €",20-10-2017,26-04-2017,365 dias,"Portugal, Beja, Beja","Artigo 20.º, n.º 1, alínea a) do Código dos Contratos Públicos",,,,,,Não aplicável.,Não aplicável.,FALSE
medicamento,Ajuste Direto Regime Geral,Aquisição de bens móveis,"33000000-0, Equipamento médico, medicamentos e produtos para cuidados pessoais","Unidade Local de Saúde do Baixo Alentejo, E. P. E. (508754275)","Fresenius Medical Care, S.A. (503070220)","432,00 €",20-10-2017,28-04-2017,365 dias,"Portugal, Beja, Beja","Artigo 20.º, n.º 1, alínea a) do Código dos Contratos Públicos",,,,,,Não aplicável.,Não aplicável.,FALSE
medicamento,Ajuste Direto Regime Geral,Aquisição de bens móveis,"33000000-0, Equipamento médico, medicamentos e produtos para cuidados pessoais","Unidade Local de Saúde do Baixo Alentejo, E. P. E. (508754275)",WEP CLINICAL (944893866),"296,80 €",20-10-2017,28-04-2017,365 dias,"Portugal, Beja, Beja","Artigo 20.º, n.º 1, alínea a) do Código dos Contratos Públicos",,,,,,Não aplicável.,Não aplicável.,FALSE
medicamento,Ajuste Direto Regime Geral,Aquisição de bens móveis,"33000000-0, Equipamento médico, medicamentos e produtos para cuidados pessoais","Unidade Local de Saúde do Baixo Alentejo, E. P. E. (508754275)","UCB Pharma, Lda. (500291322)","53,40 €",19-10-2017,24-04-2017,365 dias,"Portugal, Beja, Beja","Artigo 20.º, n.º 1, alínea a) do Código dos Contratos Públicos",,,,,,Não aplicável.,Não aplicável.,FALSE
medicamento,Ajuste Direto Regime Geral,Aquisição de bens móveis,"33000000-0, Equipamento médico, medicamentos e produtos para cuidados pessoais","Unidade Local de Saúde do Baixo Alentejo, E. P. E. (508754275)","Linde Portugal, Lda. (500266344)","350,00 €",19-10-2017,02-05-2017,365 dias,"Portugal, Beja, Beja","Artigo 20.º, n.º 1, alínea a) do Código dos Contratos Públicos",,,,,,Não aplicável.,Não aplicável.,FALSE
medicamento,Ajuste Direto Regime Geral,Aquisição de bens móveis,"22000000-0, Material impresso e afins","Unidade Local de Saúde do Baixo Alentejo, E. P. E. (508754275)",BAXTER MEDICO FARMACEUTICA LDA (503347345),"468,00 €",19-10-2017,03-05-2017,365 dias,"Portugal, Beja, Beja","Artigo 20.º, n.º 1, alínea a) do Código dos Contratos Públicos",,,,,,Não aplicável.,Não aplicável.,FALSE
medicamento,Ajuste Direto Regime Geral,Aquisição de bens móveis,"33000000-0, Equipamento médico, medicamentos e produtos para cuidados pessoais","Unidade Local de Saúde do Baixo Alentejo, E. P. E. (508754275)","Fresenius Medical Care, S.A. (503070220)","108,00 €",19-10-2017,05-05-2017,365 dias,"Portugal, Beja, Beja","Artigo 20.º, n.º 1, alínea a) do Código dos Contratos Públicos",,,,,,Não aplicável.,Não aplicável.,FALSE
medicamento,Ajuste Direto Regime Geral,Aquisição de bens móveis,"33000000-0, Equipamento médico, medicamentos e produtos para cuidados pessoais","Unidade Local de Saúde do Baixo Alentejo, E. P. E. (508754275)","Fresenius Medical Care, S.A. (503070220)","271,80 €",19-10-2017,05-05-2017,365 dias,"Portugal, Beja, Beja","Artigo 20.º, n.º 1, alínea a) do Código dos Contratos Públicos",,,,,,Não aplicável.,Não aplicável.,FALSE
medicamento,Ajuste Direto Regime Geral,Aquisição de bens móveis,"33000000-0, Equipamento médico, medicamentos e produtos para cuidados pessoais","Unidade Local de Saúde do Baixo Alentejo, E. P. E. (508754275)","VWR International - Material de Laboratório, Lda (503842770)","216,00 €",19-10-2017,05-05-2017,365 dias,"Portugal, Beja, Beja","Artigo 20.º, n.º 1, alínea a) do Código dos Contratos Públicos",,,,,,Não aplicável.,Não aplicável.,FALSE
medicamento,Ajuste Direto Regime Geral,Aquisição de bens móveis,"33000000-0, Equipamento médico, medicamentos e produtos para cuidados pessoais","Unidade Local de Saúde do Baixo Alentejo, E. P. E. (508754275)","ROCHE FARMACEUTICA QUIMICA, LDA (500233810)","3.377,00 €",19-10-2017,04-05-2017,365 dias,"Portugal, Beja, Beja","Artigo 20.º, n.º 1, alínea a) do Código dos Contratos Públicos",,,,,,Não aplicável.,Não aplicável.,FALSE
medicamento,Ajuste Direto Regime Geral,Aquisição de bens móveis,"33000000-0, Equipamento médico, medicamentos e produtos para cuidados pessoais","Unidade Local de Saúde do Baixo Alentejo, E. P. E. (508754275)","VWR International - Material de Laboratório, Lda (503842770)","268,80 €",19-10-2017,05-05-2017,365 dias,"Portugal, Beja, Beja","Artigo 20.º, n.º 1, alínea a) do Código dos Contratos Públicos",,,,,,Não aplicável.,Não aplicável.,FALSE
medicamento,Ajuste Direto Regime Geral,Aquisição de bens móveis,"33000000-0, Equipamento médico, medicamentos e produtos para cuidados pessoais","Unidade Local de Saúde do Baixo Alentejo, E. P. E. (508754275)",MIGUEL AFONSO FIALHO DE CARVALHO (215589823),"139,80 €",19-10-2017,05-05-2017,365 dias,"Portugal, Beja, Beja","Artigo 20.º, n.º 1, alínea a) do Código dos Contratos Públicos",,,,,,Não aplicável.,Não aplicável.,FALSE
medicamento,Ajuste Direto Regime Geral,Aquisição de bens móveis,"33000000-0, Equipamento médico, medicamentos e produtos para cuidados pessoais","Unidade Local de Saúde do Baixo Alentejo, E. P. E. (508754275)","UCB Pharma, Lda. (500291322)","90,41 €",19-10-2017,05-05-2017,365 dias,"Portugal, Beja, Beja","Artigo 20.º, n.º 1, alínea a) do Código dos Contratos Públicos",,,,,,Não aplicável.,Não aplicável.,FALSE
medicamento,Ajuste Direto Regime Geral,Aquisição de bens móveis,"33000000-0, Equipamento médico, medicamentos e produtos para cuidados pessoais","Unidade Local de Saúde do Baixo Alentejo, E. P. E. (508754275)","Rubeaspharma - Com. Imp. e Exp., Lda (510664040)","978,40 €",18-10-2017,09-05-2017,365 dias,"Portugal, Beja, Beja","Artigo 20.º, n.º 1, alínea a) do Código dos Contratos Públicos",,,,,,Não aplicável.,Não aplicável.,FALSE
medicamento,Ajuste Direto Regime Geral,Aquisição de bens móveis,"33000000-0, Equipamento médico, medicamentos e produtos para cuidados pessoais","Unidade Local de Saúde do Baixo Alentejo, E. P. E. (508754275)","Merck, SA. (500650870)","600,00 €",18-10-2017,09-05-2017,365 dias,"Portugal, Beja, Beja","Artigo 20.º, n.º 1, alínea a) do Código dos Contratos Públicos",,,,,,Não aplicável.,Não aplicável.,FALSE
medicamento,Ajuste Direto Regime Geral,Aquisição de bens móveis,"33000000-0, Equipamento médico, medicamentos e produtos para cuidados pessoais","Unidade Local de Saúde do Baixo Alentejo, E. P. E. (508754275)","IDIS  WORLD  MEDICINES, LDA (700513982)","405,00 €",17-10-2017,09-05-2017,365 dias,"Portugal, Beja, Beja","Artigo 20.º, n.º 1, alínea a) do Código dos Contratos Públicos",,,,,,Não aplicável.,Não aplicável.,FALSE
medicamento,Ajuste Direto Regime Geral,Aquisição de bens móveis,"33000000-0, Equipamento médico, medicamentos e produtos para cuidados pessoais","Unidade Local de Saúde do Baixo Alentejo, E. P. E. (508754275)","GLAXOSMITHKLINE-PROD. FARMACÊUTICOS, LDA.          (500139962)","73,00 €",17-10-2017,10-05-2017,365 dias,"Portugal, Beja, Beja","Artigo 20.º, n.º 1, alínea a) do Código dos Contratos Públicos",,,,,,Não aplicável.,Não aplicável.,FALSE
medicamento,Ajuste Direto Regime Geral,Aquisição de bens móveis,"33000000-0, Equipamento médico, medicamentos e produtos para cuidados pessoais","Unidade Local de Saúde do Baixo Alentejo, E. P. E. (508754275)","Nutricia Advanced Medical Nutrition - Unipessoal, Lda (507558286)","1.935,00 €",17-10-2017,10-05-2017,365 dias,"Portugal, Beja, Beja","Artigo 20.º, n.º 1, alínea a) do Código dos Contratos Públicos",,,,,,Não aplicável.,Não aplicável.,FALSE
medicamento,Ajuste Direto Regime Geral,Aquisição de bens móveis,"33000000-0, Equipamento médico, medicamentos e produtos para cuidados pessoais","Unidade Local de Saúde do Baixo Alentejo, E. P. E. (508754275)"," JOSE MANUEL GOMES DOS SANTOS, LDA (501399224)","96,80 €",17-10-2017,10-05-2017,365 dias,"Portugal, Beja, Beja","Artigo 20.º, n.º 1, alínea a) do Código dos Contratos Públicos",,,,,,Não aplicável.,Não aplicável.,FALSE
medicamento,Ajuste Direto Regime Geral,Aquisição de bens móveis,"33000000-0, Equipamento médico, medicamentos e produtos para cuidados pessoais","Unidade Local de Saúde do Baixo Alentejo, E. P. E. (508754275)",ASTRAZENECA- PRODUTOS FARMACEUTICOS LDA (502942240),"196,58 €",17-10-2017,17-05-2017,365 dias,"Portugal, Beja, Beja","Artigo 20.º, n.º 1, alínea a) do Código dos Contratos Públicos",,,,,,Não aplicável.,Não aplicável.,FALSE
medicamento,Ajuste Direto Regime Geral,Aquisição de bens móveis,"33000000-0, Equipamento médico, medicamentos e produtos para cuidados pessoais","Unidade Local de Saúde do Baixo Alentejo, E. P. E. (508754275)","Roche Farmacêutica Química, Lda. (500233810)","5,88 €",17-10-2017,16-05-2017,365 dias,"Portugal, Beja, Beja","Artigo 20.º, n.º 1, alínea a) do Código dos Contratos Públicos",,,,,,Não aplicável.,Não aplicável.,FALSE
medicamento,Ajuste Direto Regime Geral,Aquisição de bens móveis,"33000000-0, Equipamento médico, medicamentos e produtos para cuidados pessoais","Unidade Local de Saúde do Baixo Alentejo, E. P. E. (508754275)",BAXTER MEDICO - FARMACEUTICA                       (503347345),"1.600,00 €",17-10-2017,16-05-2017,365 dias,"Portugal, Beja, Beja","Artigo 20.º, n.º 1, alínea a) do Código dos Contratos Públicos",,,,,,Não aplicável.,Não aplicável.,FALSE
medicamento,Ajuste Direto Regime Geral,Aquisição de bens móveis,"33000000-0, Equipamento médico, medicamentos e produtos para cuidados pessoais","Unidade Local de Saúde do Baixo Alentejo, E. P. E. (508754275)","FRANKLAB PORTUGAL, LDA (506058654)","233,00 €",17-10-2017,10-05-2017,365 dias,"Portugal, Beja, Beja","Artigo 20.º, n.º 1, alínea a) do Código dos Contratos Públicos",,,,,,Não aplicável.,Não aplicável.,FALSE
medicamento,Ajuste Direto Regime Geral,Aquisição de bens móveis,"33000000-0, Equipamento médico, medicamentos e produtos para cuidados pessoais","Unidade Local de Saúde do Baixo Alentejo, E. P. E. (508754275)",LUNDBECK PORTUGAL - PROD FARMACEUTICOS UNIPESSOAL  (503573922),"85,40 €",16-10-2017,17-05-2017,365 dias,"Portugal, Beja, Beja","Artigo 20.º, n.º 1, alínea a) do Código dos Contratos Públicos",,,,,,Não aplicável.,Não aplicável.,FALSE
medicamento,Ajuste Direto Regime Geral,Aquisição de bens móveis,"33000000-0, Equipamento médico, medicamentos e produtos para cuidados pessoais","Unidade Local de Saúde do Baixo Alentejo, E. P. E. (508754275)",ABBOTT MEDICAL OPTICS SPAIN S.L. (980262364),"2.220,00 €",16-10-2017,17-05-2017,365 dias,"Portugal, Beja, Beja","Artigo 20.º, n.º 1, alínea a) do Código dos Contratos Públicos",,,,,,Não aplicável.,Não aplicável.,FALSE
medicamento,Ajuste Direto Regime Geral,Aquisição de bens móveis,"33000000-0, Equipamento médico, medicamentos e produtos para cuidados pessoais","Unidade Local de Saúde do Baixo Alentejo, E. P. E. (508754275)","JANSSEN CILAG FARMACEUTICA, LDA.                   (500189412)","35,80 €",16-10-2017,17-05-2017,365 dias,"Portugal, Beja, Beja","Artigo 20.º, n.º 1, alínea a) do Código dos Contratos Públicos",,,,,,Não aplicável.,Não aplicável.,FALSE
medicamento,Ajuste Direto Regime Geral,Aquisição de bens móveis,"33000000-0, Equipamento médico, medicamentos e produtos para cuidados pessoais","Unidade Local de Saúde do Baixo Alentejo, E. P. E. (508754275)","BDRPharma, Lda (513077332)","3.614,00 €",16-10-2017,18-05-2017,365 dias,"Portugal, Beja, Beja","Artigo 20.º, n.º 1, alínea a) do Código dos Contratos Públicos",,,,,,Não aplicável.,Não aplicável.,FALSE
medicamento,Ajuste Direto Regime Geral,Aquisição de bens móveis,"33000000-0, Equipamento médico, medicamentos e produtos para cuidados pessoais","Unidade Local de Saúde do Baixo Alentejo, E. P. E. (508754275)",OVERPHARMA - PRODUTOS MEDICOS E FARM.              (505792362),"327,40 €",16-10-2017,23-05-2017,365 dias,"Portugal, Beja, Beja","Artigo 20.º, n.º 1, alínea a) do Código dos Contratos Públicos",,,,,,Não aplicável.,Não aplicável.,FALSE
medicamento,Ajuste Direto Regime Geral,Aquisição de bens móveis,"33000000-0, Equipamento médico, medicamentos e produtos para cuidados pessoais","Unidade Local de Saúde do Baixo Alentejo, E. P. E. (508754275)","DR. FALK PHARMA PORTUGAL,LDA                       (506171612)","154,86 €",16-10-2017,23-05-2017,365 dias,"Portugal, Beja, Beja","Artigo 20.º, n.º 1, alínea a) do Código dos Contratos Públicos",,,,,,Não aplicável.,Não aplicável.,FALSE
medicamento,Ajuste Direto Regime Geral,Aquisição de bens móveis,"33000000-0, Equipamento médico, medicamentos e produtos para cuidados pessoais","Unidade Local de Saúde do Baixo Alentejo, E. P. E. (508754275)","ABBOTT LABORATORIOS, LDA.                          (500006148)","140,00 €",16-10-2017,23-05-2017,365 dias,"Portugal, Beja, Beja","Artigo 20.º, n.º 1, alínea a) do Código dos Contratos Públicos",,,,,,Não aplicável.,Não aplicável.,FALSE
medicamento,Ajuste Direto Regime Geral,Aquisição de bens móveis,"33000000-0, Equipamento médico, medicamentos e produtos para cuidados pessoais","Unidade Local de Saúde do Baixo Alentejo, E. P. E. (508754275)",VWR International - Materiais de Laboratório (503842770),"114,40 €",16-10-2017,29-05-2017,365 dias,"Portugal, Beja, Beja","Artigo 20.º, n.º 1, alínea a) do Código dos Contratos Públicos",,,,,,Não aplicável.,Não aplicável.,FALSE
medicamento,Ajuste Direto Regime Geral,Aquisição de bens móveis,"33000000-0, Equipamento médico, medicamentos e produtos para cuidados pessoais","Unidade Local de Saúde do Baixo Alentejo, E. P. E. (508754275)","Roche Farmacêutica Química, Lda. (500233810)","3.377,00 €",13-10-2017,29-05-2017,365 dias,"Portugal, Beja, Beja","Artigo 20.º, n.º 1, alínea a) do Código dos Contratos Públicos",,,,,,Não aplicável.,Não aplicável.,FALSE
medicamento,Ajuste Direto Regime Geral,Aquisição de bens móveis,"33000000-0, Equipamento médico, medicamentos e produtos para cuidados pessoais","Unidade Local de Saúde do Baixo Alentejo, E. P. E. (508754275)","UCB Pharma, Lda. (500291322)","53,40 €",13-10-2017,30-05-2017,365 dias,"Portugal, Beja, Beja","Artigo 20.º, n.º 1, alínea a) do Código dos Contratos Públicos",,,,,,Não aplicável.,Não aplicável.,FALSE
medicamento,Ajuste Direto Regime Geral,Aquisição de bens móveis,"33000000-0, Equipamento médico, medicamentos e produtos para cuidados pessoais","Unidade Local de Saúde do Baixo Alentejo, E. P. E. (508754275)","Spcare - Especialidades Farmacêuticas, Lda (508284872)","1.496,10 €",12-10-2017,10-03-2017,365 dias,"Portugal, Beja, Beja","Artigo 20.º, n.º 1, alínea a) do Código dos Contratos Públicos",,,,,,Não aplicável.,Não aplicável.,FALSE
medicamento,Ajuste Direto Regime Geral,Aquisição de bens móveis,"33000000-0, Equipamento médico, medicamentos e produtos para cuidados pessoais","Unidade Local de Saúde do Baixo Alentejo, E. P. E. (508754275)",NUTRICIA (507558286),"1.935,00 €",12-10-2017,13-03-2017,365 dias,"Portugal, Beja, Beja","Artigo 20.º, n.º 1, alínea a) do Código dos Contratos Públicos",,,,,,Não aplicável.,Não aplicável.,FALSE
medicamento,Ajuste Direto Regime Geral,Aquisição de bens móveis,"33000000-0, Equipamento médico, medicamentos e produtos para cuidados pessoais","Unidade Local de Saúde do Baixo Alentejo, E. P. E. (508754275)","Biogen, Lda. (506415740)","908,58 €",12-10-2017,13-03-2017,365 dias,"Portugal, Beja, Beja","Artigo 20.º, n.º 1, alínea a) do Código dos Contratos Públicos",,,,,,Não aplicável.,Não aplicável.,FALSE
medicamento,Ajuste Direto Regime Geral,Aquisição de bens móveis,"33000000-0, Equipamento médico, medicamentos e produtos para cuidados pessoais","Unidade Local de Saúde do Baixo Alentejo, E. P. E. (508754275)",LABORATÓRIO MILITAR (600019675),"739,20 €",12-10-2017,14-03-2017,365 dias,"Portugal, Beja, Beja","Artigo 20.º, n.º 1, alínea a) do Código dos Contratos Públicos",,,,,,Não aplicável.,Não aplicável.,FALSE
medicamento,Ajuste Direto Regime Geral,Aquisição de bens móveis,"33000000-0, Equipamento médico, medicamentos e produtos para cuidados pessoais","Unidade Local de Saúde do Baixo Alentejo, E. P. E. (508754275)"," JOSE MANUEL GOMES DOS SANTOS, LDA (501399224)","152,00 €",12-10-2017,13-03-2017,365 dias,"Portugal, Beja, Beja","Artigo 20.º, n.º 1, alínea a) do Código dos Contratos Públicos",,,,,,Não aplicável.,Não aplicável.,FALSE
medicamento,Ajuste Direto Regime Geral,Aquisição de bens móveis,"33000000-0, Equipamento médico, medicamentos e produtos para cuidados pessoais","Unidade Local de Saúde do Baixo Alentejo, E. P. E. (508754275)","Biojam, S.a  (513642749)","1.650,00 €",12-10-2017,15-03-2017,365 dias,"Portugal, Beja, Beja","Artigo 20.º, n.º 1, alínea a) do Código dos Contratos Públicos",,,,,,Não aplicável.,Não aplicável.,FALSE
medicamento,Ajuste Direto Regime Geral,Aquisição de bens móveis,"33000000-0, Equipamento médico, medicamentos e produtos para cuidados pessoais","Unidade Local de Saúde do Baixo Alentejo, E. P. E. (508754275)",ROCHE FARMACEUTICA QUIMICA LDA (500233810),"39,92 €",11-10-2017,15-03-2017,365 dias,"Portugal, Beja, Beja","Artigo 20.º, n.º 1, alínea a) do Código dos Contratos Públicos",,,,,,Não aplicável.,Não aplicável.,FALSE
medicamento,Ajuste Direto Regime Geral,Aquisição de bens móveis,"33000000-0, Equipamento médico, medicamentos e produtos para cuidados pessoais","Unidade Local de Saúde do Baixo Alentejo, E. P. E. (508754275)","Nestlé Portugal, SA (500201307)","102,00 €",11-10-2017,15-03-2017,365 dias,"Portugal, Beja, Beja","Artigo 20.º, n.º 1, alínea a) do Código dos Contratos Públicos",,,,,,Não aplicável.,Não aplicável.,FALSE
medicamento,Ajuste Direto Regime Geral,Aquisição de bens móveis,"33000000-0, Equipamento médico, medicamentos e produtos para cuidados pessoais","Unidade Local de Saúde do Baixo Alentejo, E. P. E. (508754275)",ROCHE FARMACEUTICA QUIMICA LDA (500233810),"3.377,00 €",11-10-2017,16-03-2017,365 dias,"Portugal, Beja, Beja","Artigo 20.º, n.º 1, alínea a) do Código dos Contratos Públicos",,,,,,Não aplicável.,Não aplicável.,FALSE
medicamento,Ajuste Direto Regime Geral,Aquisição de bens móveis,"33000000-0, Equipamento médico, medicamentos e produtos para cuidados pessoais","Unidade Local de Saúde do Baixo Alentejo, E. P. E. (508754275)",Merck SA (500650870),"608,40 €",11-10-2017,16-03-2017,365 dias,"Portugal, Beja, Beja","Artigo 20.º, n.º 1, alínea a) do Código dos Contratos Públicos",,,,,,Não aplicável.,Não aplicável.,FALSE
medicamento,Ajuste Direto Regime Geral,Aquisição de bens móveis,"33000000-0, Equipamento médico, medicamentos e produtos para cuidados pessoais","Unidade Local de Saúde do Baixo Alentejo, E. P. E. (508754275)",OVERPHARMA - PRODUTOS MEDICOS E FARM.              (505792362),"441,60 €",11-10-2017,16-03-2017,365 dias,"Portugal, Beja, Beja","Artigo 20.º, n.º 1, alínea a) do Código dos Contratos Públicos",,,,,,Não aplicável.,Não aplicável.,FALSE
medicamento,Ajuste Direto Regime Geral,Aquisição de bens móveis,"33000000-0, Equipamento médico, medicamentos e produtos para cuidados pessoais","Unidade Local de Saúde do Baixo Alentejo, E. P. E. (508754275)",GENERIS - FARMACEUTICA SA (508107997),"36,48 €",11-10-2017,17-03-2017,365 dias,"Portugal, Beja, Beja","Artigo 20.º, n.º 1, alínea a) do Código dos Contratos Públicos",,,,,,Não aplicável.,Não aplicável.,FALSE
medicamento,Ajuste Direto Regime Geral,Aquisição de bens móveis,"33000000-0, Equipamento médico, medicamentos e produtos para cuidados pessoais","Unidade Local de Saúde do Baixo Alentejo, E. P. E. (508754275)","Omega Pharma Portuguesa Unipessoal, Lda. (506112233)","172,80 €",11-10-2017,17-03-2017,365 dias,"Portugal, Beja, Beja","Artigo 20.º, n.º 1, alínea a) do Código dos Contratos Públicos",,,,,,Não aplicável.,Não aplicável.,FALSE
medicamento,Ajuste Direto Regime Geral,Aquisição de bens móveis,"33000000-0, Equipamento médico, medicamentos e produtos para cuidados pessoais","Unidade Local de Saúde do Baixo Alentejo, E. P. E. (508754275)","UCB Pharma, Lda. (500291322)","53,40 €",11-10-2017,20-03-2017,365 dias,"Portugal, Beja, Beja","Artigo 20.º, n.º 1, alínea a) do Código dos Contratos Públicos",,,,,,Não aplicável.,Não aplicável.,FALSE
medicamento,Ajuste Direto Regime Geral,Aquisição de bens móveis,"33000000-0, Equipamento médico, medicamentos e produtos para cuidados pessoais","Unidade Local de Saúde do Baixo Alentejo, E. P. E. (508754275)",LABORATÓRIO MILITAR (600019675),"44,40 €",11-10-2017,21-03-2017,365 dias,"Portugal, Beja, Beja","Artigo 20.º, n.º 1, alínea a) do Código dos Contratos Públicos",,,,,,Não aplicável.,Não aplicável.,FALSE
