freguesia,acronym,validVotesPercentage,votes,dicofre
Alvelos,PPD/PSD.CDS-PP,44.61,331,030208
Alvelos,PS,34.23,254,030208
Alvelos,MPT,9.43,70,030208
Alvelos,PCP-PEV,2.96,22,030208
Alvelos,B.E.,2.56,19,030208
Alvelos,PND,1.62,12,030208
Alvelos,PTP,1.08,8,030208
Alvelos,L,0.94,7,030208
Alvelos,PCTP/MRPP,0.94,7,030208
Alvelos,PAN,0.67,5,030208
Alvelos,MAS,0.27,2,030208
Alvelos,PNR,0.27,2,030208
Alvelos,PPM,0.27,2,030208
Alvelos,PPV,0.13,1,030208
Alvelos,PDA,0,0,030208
Alvelos,POUS,0,0,030208
