Objeto do Contrato,Tipo de Procedimento,Tipo(s) de Contrato,CPVs,Entidade(s) Adjudicante(s),Entidade(s) Adjudicatária(s),Preço Contratual,Data de Publicação,Data de Celebração do Contrato,Prazo de Execução,Local de Execução,Fundamentação,Data de Fecho do Contrato,Preço Total Efetivo,Causas das Alterações ao Prazo,Causas das Alterações ao Preço,Estado,N.º registo do Acordo Quadro,Descrição do Acordo Quadro,Procedimento Centralizado
"Aquisição de vários consumíveis informáticos ao IPS, IP durante o 1º semestre de 2011",Ao abrigo de acordo-quadro (art.º 258.º),Aquisição de bens móveis,"30124000-4, Peças e acessórios para máquinas de escritório","Instituto Português do Sangue, I.P. (502423943)",Maxone (507052609),"6.972,28 €",08-10-2011,22-03-2011,182 dias,"Portugal, Porto, Porto<BR/>Portugal, Lisboa, Lisboa<BR/>Portugal, Coimbra, Coimbra","Artigo 26.º, n.º 1, alínea e) do Código dos Contratos Públicos",,,,,,Não definido.,Não definido.,
"Prestação de Serviços de Segurança e Vigilância para o CRS do Porto, durante o ano de 2011, ao abrigo do AQ da ANCP 10.13.01",Ajuste Direto Regime Geral,Aquisição de serviços,"79714000-2, Serviços de vigilância","Instituto Português do Sangue, I.P. (502423943)","2045-GALIA - Empresa Segurança, SA (502332905)","41.615,00 €",06-10-2011,01-09-2011,365 dias,"Portugal, Porto, Porto","Artigo 27.º, n.º 1, alínea h) do Código dos Contratos Públicos",,,,,,357839,"Prestação de Serviços de Segurança e Vigilância para o CRS do Porto, durante o ano de 2011, ao abrigo do AQ da ANCP 10.13.01",
"Prestação de Serviços de Saúde, Higiene e Segurança no Trabalho no CRS do Porto, até 31 de Março de 2012.",Ajuste Direto Regime Geral,Aquisição de serviços,"71317200-5, Serviços de saúde e segurança","Instituto Português do Sangue, I.P. (502423943)","Mesdicisforma - Medicina no Trabalho Higiene e Segurança, Lda (503755397)","15.263,75 €",06-10-2011,04-08-2011,365 dias,"Portugal, Porto, Porto","Artigo 20.º, n.º 1, alínea a) do Código dos Contratos Públicos",,,,,,Não aplicável.,Não aplicável.,
"Prestação de Serviços de Tratamento dos Espaços Verdes do CRS do Porto, durante o ano de 2011",Ajuste Direto Regime Geral,Aquisição de serviços,"77310000-6, Serviços de plantação e manutenção de áreas verdes","Instituto Português do Sangue, I.P. (502423943)","Rico Jardim - Unipessoal, Lda (508920680)","1.140,00 €",06-10-2011,12-07-2011,180 dias,"Portugal, Porto, Porto","Artigo 20.º, n.º 1, alínea a) do Código dos Contratos Públicos",,,,,,Não aplicável.,Não aplicável.,
Aquisição e Instalação de uma Câmara de Insonorização no Bastidor Informático instalado no CRS de Lisboa,Ajuste Direto Regime Geral,Aquisição de bens móveis,"30236000-2, Equipamento informático diverso","Instituto Português do Sangue, I.P. (502423943)","Engimatos, Consultadoria em Engenharia Unipessoal, Lda (507000005)","2.145,00 €",06-10-2011,07-07-2011,120 dias,"Portugal, Lisboa, Lisboa","Artigo 20.º, n.º 1, alínea a) do Código dos Contratos Públicos",,,,,,Não aplicável.,Não aplicável.,
"Calibração de vários equipamentos do CRS Porto, durante o ano 2011",Ajuste Direto Regime Geral,Aquisição de serviços,"71356200-0, Serviços de assistência técnica","Instituto Português do Sangue, I.P. (502423943)","Instituto Soldadura e Qualidade (500140022), Normax, Lda (500203130)","4.029,55 €",06-10-2011,08-06-2011,365 dias,"Portugal, Porto, Porto","Artigo 27.º, n.º 1, alínea f) do Código dos Contratos Públicos",,,,,,Não aplicável.,Não aplicável.,
"Prestação de Serviços de Saúde, Higiene e Segurança no Trabalho, no CRS de Coimbra, até 31 de Março de 2012.",Ajuste Direto Regime Geral,Aquisição de serviços,"85142300-9, Serviços de higiene","Instituto Português do Sangue, I.P. (502423943)",Portugal Telecom - Associação de Cuidados de Saúde (503509027),"14.926,21 €",04-10-2011,12-08-2011,240 dias,"Portugal, Coimbra, Coimbra","Artigo 20.º, n.º 1, alínea a) do Código dos Contratos Públicos",,,,,,Não aplicável.,Não aplicável.,
"Prestação de Serviços de Reparação e Lavagem de Roupa, do IPS, IP, durante o ano de 2011",Ajuste Direto Regime Geral,Aquisição de serviços,"98310000-9, Serviços de lavagem e de limpeza a seco","Instituto Português do Sangue, I.P. (502423943)",Such-Serviço de Utilização Comum dos Hospitais (500900469),"21.461,49 €",03-10-2011,07-07-2011,365 dias,"Portugal, Porto, Porto<BR/>Portugal, Lisboa, Lisboa<BR/>Portugal, Coimbra, Coimbra","Artigo 27.º, n.º 1, alínea a) do Código dos Contratos Públicos",,,,,,Não aplicável.,Não aplicável.,
"Prestação  de Serviços de Gestão de Resíduos dos Grupos III, IV e Líquidos do IPS, IP, durante o ano de 2011.",Ajuste Direto Regime Geral,Aquisição de serviços,"90524400-0, Recolha, transporte e eliminação de resíduos hospitalares","Instituto Português do Sangue, I.P. (502423943)","Ambimed- Gestão Ambiental, Lda (503593427)","147.597,50 €",03-10-2011,24-08-2011,365 dias,"Portugal, Coimbra, Coimbra<BR/>Portugal, Porto, Porto<BR/>Portugal, Lisboa, Lisboa","Artigo 27.º, n.º 1, alínea a) do Código dos Contratos Públicos",,,,,,Não aplicável.,Não aplicável.,
"Prestação de Serviços de Consultadoria em Comunicação e Acessoria de Imprensa para o IPS, IP, até 31 de Dezembro de 2011.",Ajuste Direto Regime Geral,Aquisição de serviços,"71621000-7, Serviços técnicos de análise ou consultoria","Instituto Português do Sangue, I.P. (502423943)","First Five Consulting, SA (508296129)","14.000,00 €",03-10-2011,06-09-2011,120 dias,"Portugal, Lisboa, Lisboa","Artigo 20.º, n.º 1, alínea a) do Código dos Contratos Públicos",,,,,,Não aplicável.,Não aplicável.,
Aquisição de Reagentes para o Laboratório de Imunohematologia do CRS Porto,Ajuste Direto Regime Geral,Aquisição de bens móveis,"33696200-7, Reagentes para análises ao sangue","Instituto Português do Sangue, I.P. (502423943)","Diamed Portuguesa, S.A. (501675809)","9.524,00 €",01-10-2011,16-09-2011,120 dias,"Portugal, Porto, Porto","Artigo 26.º, n.º 1, alínea a) do Código dos Contratos Públicos",,,,,,Não aplicável.,Não aplicável.,
Aquisição de Reagentes para o Laboratório de Imunohematologia do CRS Coimbra,Ajuste Direto Regime Geral,Aquisição de bens móveis,"33696200-7, Reagentes para análises ao sangue","Instituto Português do Sangue, I.P. (502423943)","Diamed Portuguesa, S.A. (501675809)","6.379,06 €",01-10-2011,25-08-2011,120 dias,"Portugal, Coimbra, Coimbra","Artigo 20.º, n.º 1, alínea a) do Código dos Contratos Públicos",,,,,,Não aplicável.,Não aplicável.,
Aquisição de Reagentes para o Laboratório de Controlo de Qualidade do CRS Lisboa,Ajuste Direto Regime Geral,Aquisição de bens móveis,"33696200-7, Reagentes para análises ao sangue","Instituto Português do Sangue, I.P. (502423943)","Biomerieux Portugal, Lda (501524177)","54.395,00 €",01-10-2011,23-08-2011,120 dias,"Portugal, Lisboa, Lisboa","Artigo 24.º, n.º 1, alínea e) do Código dos Contratos Públicos",,,,,,Não aplicável.,Não aplicável.,
