freguesia,acronym,validVotesPercentage,votes,dicofre
Monsul,PPD/PSD.CDS-PP,48.24,123,030917
Monsul,PS,38.43,98,030917
Monsul,PCP-PEV,5.1,13,030917
Monsul,MPT,2.75,7,030917
Monsul,B.E.,0.78,2,030917
Monsul,L,0.78,2,030917
Monsul,PCTP/MRPP,0.78,2,030917
Monsul,PND,0.78,2,030917
Monsul,PPM,0.78,2,030917
Monsul,PPV,0.78,2,030917
Monsul,MAS,0.39,1,030917
Monsul,PTP,0.39,1,030917
Monsul,PAN,0,0,030917
Monsul,PDA,0,0,030917
Monsul,PNR,0,0,030917
Monsul,POUS,0,0,030917
