freguesia,acronym,validVotesPercentage,votes,dicofre
Arega,PPD/PSD,45.45,195,100802
Arega,PS,34.97,150,100802
Arega,B.E.,5.13,22,100802
Arega,CDS-PP,4.66,20,100802
Arega,PAN,2.8,12,100802
Arega,CH,1.63,7,100802
Arega,IL,1.4,6,100802
Arega,PCP-PEV,1.17,5,100802
Arega,R.I.R.,0.93,4,100802
Arega,PURP,0.47,2,100802
Arega,L,0.23,1,100802
Arega,MAS,0.23,1,100802
Arega,PDR,0.23,1,100802
Arega,PNR,0.23,1,100802
Arega,PPM,0.23,1,100802
Arega,PTP,0.23,1,100802
Arega,A,0,0,100802
Arega,JPP,0,0,100802
Arega,MPT,0,0,100802
Arega,NC,0,0,100802
Arega,PCTP/MRPP,0,0,100802
