Objeto do Contrato,Tipo de Procedimento,Tipo(s) de Contrato,CPVs,Entidade(s) Adjudicante(s),Entidade(s) Adjudicatária(s),Preço Contratual,Data de Publicação,Data de Celebração do Contrato,Prazo de Execução,Local de Execução,Fundamentação,Data de Fecho do Contrato,Preço Total Efetivo,Causas das Alterações ao Prazo,Causas das Alterações ao Preço,Estado,N.º registo do Acordo Quadro,Descrição do Acordo Quadro,Procedimento Centralizado
"AQUISIÇÃO DE ACETATO DE POTÁSSIO 9,8% 10ML",Ajuste Direto Regime Geral,Aquisição de bens móveis,"33600000-6, Produtos farmacêuticos","Centro Hospitalar de Lisboa Central, E. P. E. (508080142)","LABESFAL-LABORATORIOS ALMIRO, SA (501169580)","185.770,00 €",29-06-2018,06-02-2018,365 dias,"Portugal, Lisboa, Lisboa","Artigo 24.º, n.º 1, alínea e) do Código dos Contratos Públicos",,,,,,Não aplicável.,Não aplicável.,FALSE
Sistema Preservação Pulmão,Concurso público,Aquisição de bens móveis,"33100000-1, Equipamento médico","Centro Hospitalar de Lisboa Central, E. P. E. (508080142)",XVIVO Perfusion AB (556561042401),"110.000,00 €",29-06-2018,08-12-2017,14 dias,"Portugal, Lisboa, Lisboa","Artigo 20.º, n.º 1, alínea b) do Código dos Contratos Públicos",,,,,,Não aplicável.,Não aplicável.,FALSE
AQUISIÇÃO DE BICARBONATO DE SÓDIO 1000 MG CÁPS,Ajuste Direto Regime Geral,Aquisição de bens móveis,"33600000-6, Produtos farmacêuticos","Centro Hospitalar de Lisboa Central, E. P. E. (508080142)",LABESFAL (501169580),"23.361,90 €",29-06-2018,22-01-2018,365 dias,"Portugal, Lisboa, Lisboa","Artigo 24.º, n.º 1, alínea e) do Código dos Contratos Públicos",,,,,,Não aplicável.,Não aplicável.,FALSE
AQUISIÇÃO DE AMIFAMPRIDINA 10 MG COMP,Ajuste Direto Regime Geral,Aquisição de bens móveis,"33600000-6, Produtos farmacêuticos","Centro Hospitalar de Lisboa Central, E. P. E. (508080142)",LOGIFARMA - LOGISTICA FARMACÊUTICA (503934640),"70.581,20 €",29-06-2018,29-01-2018,365 dias,"Portugal, Lisboa, Lisboa","Artigo 24.º, n.º 1, alínea e) do Código dos Contratos Públicos",,,,,,Não aplicável.,Não aplicável.,FALSE
AQUISIÇÃO DE ACETONIDO DE FLUOCINOLONA IMPLANTE INTRAVITREO 19MCG,Ajuste Direto Regime Geral,Aquisição de bens móveis,"33600000-6, Produtos farmacêuticos","Centro Hospitalar de Lisboa Central, E. P. E. (508080142)",ALIMERA SCIENCES (980523192),"35.409,00 €",29-06-2018,01-02-2018,365 dias,"Portugal, Lisboa, Lisboa","Artigo 24.º, n.º 1, alínea e) do Código dos Contratos Públicos",,,,,,Não aplicável.,Não aplicável.,FALSE
1-2.0041/18 - Aquisição de  cateteres endovenosos e centrais para 2018,Concurso público,Aquisição de bens móveis,"33140000-3, Material médico de consumo","Centro Hospitalar de Lisboa Central, E. P. E. (508080142)","TELEFLEX MEDICAL, SAU (EX-ARROW IBÉRICA,  SA) (980249783), SMITHS MEDICAL PORTUGAL UNIPESSOAL, LDA (507445937), VYGON (PORTUGAL), LDA (503232785), Quilaban - Quimica Laboratorial Analitica, SA (500399670), C.R.BARD PORTUGAL, Lda (502438274), B. BRAUN MEDICAL (501506543)","142.993,55 €",28-06-2018,29-05-2018,216 dias,"Portugal, Lisboa, Lisboa","Artigo 20.º, n.º 1, alínea b) do Código dos Contratos Públicos",,,,,,Não aplicável.,Não aplicável.,FALSE
BIVALIRUDINA 250 MG PÓ CONC SOL INJ FR IV/FILGRASTIM 48 M.U.I/FILGRASTIM 30 M.U.I./0.5,Ao abrigo de acordo-quadro (art.º 259.º),Aquisição de bens móveis,"33600000-6, Produtos farmacêuticos","Centro Hospitalar de Lisboa Central, E. P. E. (508080142)","Sandoz Farmacêutica, Lda (506985261)","35.689,60 €",27-06-2018,15-01-2018,365 dias,"Portugal, Lisboa, Lisboa",Artigo 259.º do Código dos Contratos Públicos,,,,,,2489595,CP 2016/18 - Acordo quadro para fornecimento de Medicamentos do Grupo 4: Sangue às Instituições e Serviços do Serviço Nacional de Saúde,FALSE
ÁCIDO FÓLICO 5 MG COMP/TICLOPIDINA 250 MG COMP/TRIFLUSAL 300 MG CÁPS,Ao abrigo de acordo-quadro (art.º 259.º),Aquisição de bens móveis,"33600000-6, Produtos farmacêuticos","Centro Hospitalar de Lisboa Central, E. P. E. (508080142)","Generis Farmacêutica, SA (508107997)","2.613,24 €",27-06-2018,06-02-2018,120261324 dias,"Portugal, Lisboa, Lisboa",Artigo 259.º do Código dos Contratos Públicos,,,,,,2489595,CP 2016/18 - Acordo quadro para fornecimento de Medicamentos do Grupo 4: Sangue às Instituições e Serviços do Serviço Nacional de Saúde,FALSE
AQUISIÇÃO DE ACENOCUMAROL 4 MG COMP,Ao abrigo de acordo-quadro (art.º 259.º),Aquisição de bens móveis,"33600000-6, Produtos farmacêuticos","Centro Hospitalar de Lisboa Central, E. P. E. (508080142)",SOUTH POINT CARE (508284872),"200,40 €",27-06-2018,07-03-2018,120 dias,"Portugal, Lisboa, Lisboa",Artigo 259.º do Código dos Contratos Públicos,,,,,,2489595,CP 2016/18 - Acordo quadro para fornecimento de Medicamentos do Grupo 4: Sangue às Instituições e Serviços do Serviço Nacional de Saúde,FALSE
AQUISIÇÃO DE ALPROSTADILO 0.02 MG PÓ SOL INJ FR IA IV,Ao abrigo de acordo-quadro (art.º 259.º),Aquisição de bens móveis,"33600000-6, Produtos farmacêuticos","Centro Hospitalar de Lisboa Central, E. P. E. (508080142)","U.C.B. - PRODUTOS FARMACEUT, L (500291322)","41.684,97 €",27-06-2018,12-01-2018,120 dias,"Portugal, Lisboa, Lisboa",Artigo 259.º do Código dos Contratos Públicos,,,,,,2489595,CP 2016/18 - Acordo quadro para fornecimento de Medicamentos do Grupo 4: Sangue às Instituições e Serviços do Serviço Nacional de Saúde,FALSE
ÁCIDO ACETILSALICÍLICO 100 E 150MG/CIANOCOBALAMINA 1MG/CLOPIDOGREL 75 MG COMP,Ao abrigo de acordo-quadro (art.º 259.º),Aquisição de bens móveis,"33600000-6, Produtos farmacêuticos","Centro Hospitalar de Lisboa Central, E. P. E. (508080142)","Generis Farmacêutica, SA (508107997)","3.050,08 €",27-06-2018,05-02-2018,120 dias,"Portugal, Lisboa, Lisboa",Artigo 259.º do Código dos Contratos Públicos,,,,,,2489595,CP 2016/18 - Acordo quadro para fornecimento de Medicamentos do Grupo 4: Sangue às Instituições e Serviços do Serviço Nacional de Saúde,FALSE
Concurso Centralizado SPMS - 2015/6 - VÁRIOS MEDICAMENTOS - TEVA PHARMA - P259-AC-2017-157,Ao abrigo de acordo-quadro (art.º 259.º),Aquisição de bens móveis,"33600000-6, Produtos farmacêuticos","Centro Hospitalar de Lisboa Central, E. P. E. (508080142)","TEVA PHARMA - PRODUTOS FARMACÊUTICOS, LDA (507045491)","366.673,33 €",27-06-2018,23-01-2018,365 dias,"Portugal, Lisboa, Lisboa",Artigo 259.º do Código dos Contratos Públicos,,,,,,1771819,CP 2015/6 - Acordo quadro para o fornecimento de Medicamentos do Foro Oncológico,TRUE
ALPROSTADILO 0.5 MG/1 ML SOL INJ FR 1 ML IV,Ao abrigo de acordo-quadro (art.º 259.º),Aquisição de bens móveis,"33600000-6, Produtos farmacêuticos","Centro Hospitalar de Lisboa Central, E. P. E. (508080142)","LABORATORIOS PFIZER, LDA (500162166)","4.224,40 €",27-06-2018,09-01-2018,365 dias,"Portugal, Lisboa, Lisboa",Artigo 259.º do Código dos Contratos Públicos,,,,,,2489595,CP 2016/18 - Acordo quadro para fornecimento de Medicamentos do Grupo 4: Sangue às Instituições e Serviços do Serviço Nacional de Saúde,FALSE
Concurso Centralizado SPMS - VÁRIOS MEDICAMENTOS - NOVARTIS FARMA - P259-AC-2017-159,Ao abrigo de acordo-quadro (art.º 259.º),Aquisição de bens móveis,"33600000-6, Produtos farmacêuticos","Centro Hospitalar de Lisboa Central, E.P.E. (CHLC) (508080142)",NOVARTIS FARMACEUTICA (500063524),"4.349.860,47 €",27-06-2018,08-01-2018,365 dias,"Portugal, Lisboa, Lisboa",Artigo 259.º do Código dos Contratos Públicos,,,,,,1771819,CP 2015/6 - Acordo quadro para o fornecimento de Medicamentos do Foro Oncológico,TRUE
CARBOXIMALTOSE FÉRRICA 50 MG/ML SOL INJ FR 10 ML IV E CARBOXIMALTOSE FÉRRICA 50 MG/ML SOL INJ FR 2 ML IV; COMPLEXO HIDRÓXIDO FÉRRICO-POLIMALTOSE 178.6 MG/ML SOL ORAL FR 30 ML E COMPLEXO HIDRÓXIDO FÉRRICO-POLIMALTOSE 357 MG COMP MAST,Ao abrigo de acordo-quadro (art.º 259.º),Aquisição de bens móveis,"33600000-6, Produtos farmacêuticos","Centro Hospitalar de Lisboa Central, E. P. E. (508080142)",OM PHARMA S.A. (500207410),"103.738,00 €",27-06-2018,05-02-2018,365 dias,"Portugal, Lisboa, Lisboa",Artigo 259.º do Código dos Contratos Públicos,,,,,,2489595,CP 2016/18 - Acordo quadro para fornecimento de Medicamentos do Grupo 4: Sangue às Instituições e Serviços do Serviço Nacional de Saúde,FALSE
4-2.0085/18 - Aquisição de Diverso Papel para Equipamento Médico,Ajuste Direto Regime Geral,Aquisição de bens móveis,"33140000-3, Material médico de consumo","Centro Hospitalar de Lisboa Central, E.P.E. (CHLC) (508080142)","SPECULUM-ARTIGOS MEDICOS, SA (502996323)","63,00 €",27-06-2018,23-05-2018,222 dias,"Portugal, Lisboa, Lisboa","Artigo 20.º, n.º 1, alínea a) do Código dos Contratos Públicos",,,,,,Não aplicável.,Não aplicável.,FALSE
4-2.0085/18 - Aquisição de Diverso Papel para Equipamento Médico,Ajuste Direto Regime Geral,Aquisição de bens móveis,"33140000-3, Material médico de consumo","Centro Hospitalar de Lisboa Central, E.P.E. (CHLC) (508080142)","Medtronic Portugal, Lda (504223933)","300,00 €",27-06-2018,23-05-2018,222 dias,"Portugal, Lisboa, Lisboa","Artigo 20.º, n.º 1, alínea a) do Código dos Contratos Públicos",,,,,,Não aplicável.,Não aplicável.,FALSE
4-2.0085/18 - Aquisição de Diverso Papel para Equipamento Médico,Ajuste Direto Regime Geral,Aquisição de bens móveis,"33140000-3, Material médico de consumo","Centro Hospitalar de Lisboa Central, E.P.E. (CHLC) (508080142)","MEDINFAR SOROLOGICO  PRODUTOS E EQUIPAMENTOS, S.A. (501197052)","11.776,75 €",27-06-2018,23-05-2018,222 dias,"Portugal, Lisboa, Lisboa","Artigo 20.º, n.º 1, alínea a) do Código dos Contratos Públicos",,,,,,Não aplicável.,Não aplicável.,FALSE
4-2.0085/18 - Aquisição de Diverso Papel para Equipamento Médico,Ajuste Direto Regime Geral,Aquisição de bens móveis,"33140000-3, Material médico de consumo","Centro Hospitalar de Lisboa Central, E.P.E. (CHLC) (508080142)","Ezequiel Panão Jorge, Lda (501412727)","537,20 €",27-06-2018,23-05-2018,222 dias,"Portugal, Lisboa, Lisboa","Artigo 20.º, n.º 1, alínea a) do Código dos Contratos Públicos",,,,,,Não aplicável.,Não aplicável.,FALSE
4-2.0085/18 - Aquisição de Diverso Papel para Equipamento Médico,Ajuste Direto Regime Geral,Aquisição de bens móveis,"33140000-3, Material médico de consumo","Centro Hospitalar de Lisboa Central, E.P.E. (CHLC) (508080142)","ANASTACIO SALDANHA,  UNIPESSOAL  LDA (505804441)","227,95 €",27-06-2018,27-06-2018,222 dias,"Portugal, Lisboa, Lisboa","Artigo 20.º, n.º 1, alínea a) do Código dos Contratos Públicos",,,,,,Não aplicável.,Não aplicável.,FALSE
AQUISIÇÃO DE ÁCIDO AMINOCAPRÓICO 2500 MG/10 ML SOL INJ FR E DE ÁCIDO AMINOCAPRÓICO 3000 MG PÓ SOL ORAL SAQ,Ao abrigo de acordo-quadro (art.º 259.º),Aquisição de bens móveis,"33600000-6, Produtos farmacêuticos","Centro Hospitalar de Lisboa Central, E. P. E. (508080142)","Bial - Portela & Cª, S.A. (500220913)","3.653,58 €",27-06-2018,12-01-2018,365 dias,"Portugal, Lisboa, Lisboa",Artigo 259.º do Código dos Contratos Públicos,,,,,,2489595,CP 2016/18 - Acordo quadro para fornecimento de Medicamentos do Grupo 4: Sangue às Instituições e Serviços do Serviço Nacional de Saúde,FALSE
Concurso Centralizado SPMS - LANREOTIDA E TRIPTORRELINA - IPSEN - P259-AC-2017-146,Ao abrigo de acordo-quadro (art.º 259.º),Aquisição de bens móveis,"33600000-6, Produtos farmacêuticos","Centro Hospitalar de Lisboa Central, E. P. E. (508080142)",IPSEN PORTUGAL (502609800),"475.430,27 €",27-06-2018,08-01-2018,365 dias,"Portugal, Lisboa, Lisboa",Artigo 259.º do Código dos Contratos Públicos,,,,,,1771819,CP 2015/6 - Acordo quadro para o fornecimento de Medicamentos do Foro Oncológico,TRUE
Agulha biópsia automática 18G de 10cm e 15cm,Consulta Prévia,Aquisição de bens móveis,"33000000-0, Equipamento médico, medicamentos e produtos para cuidados pessoais","Centro Hospitalar de Lisboa Central, E. P. E. (508080142)",cateter (502914319),"10.665,00 €",26-06-2018,14-06-2018,180 dias,"Portugal, Lisboa, Lisboa","Artigo 20.º, n.º 1, alínea c) do Código dos Contratos Públicos",,,,,,Não aplicável.,Não aplicável.,FALSE
MIRTAZAPINA,Ao abrigo de acordo-quadro (art.º 259.º),Aquisição de bens móveis,"33600000-6, Produtos farmacêuticos","Centro Hospitalar de Lisboa Central, E. P. E. (508080142)",GENERIS (508107997),"409,24 €",26-06-2018,14-02-2018,365 dias,"Portugal, Lisboa, Lisboa",Artigo 259.º do Código dos Contratos Públicos,,,,,,1974985,"Medicamentos Analgésicos, Antipiréticos e Antidepressivos",FALSE
EPOETINA ZETA 20.000,Ao abrigo de acordo-quadro (art.º 259.º),Aquisição de bens móveis,"33600000-6, Produtos farmacêuticos","Centro Hospitalar de Lisboa Central, E. P. E. (508080142)","LABORATORIOS PFIZER, LDA (500162166)","8.400,00 €",26-06-2018,12-02-2018,365 dias,"Portugal, Lisboa, Lisboa",Artigo 259.º do Código dos Contratos Públicos,,,,,,2749216,CP 2017/11 - Acordo quadro para fornecimento de Medicamentos Estimulantes da eritropoiese às Instituições e Serviços do Serviço Nacional de Saúde,FALSE
1-2.0013/18 - Aquisição de Diversas Trouxas para o ano de 2018,Concurso público,Aquisição de bens móveis,"33140000-3, Material médico de consumo","Centro Hospitalar de Lisboa Central, E. P. E. (508080142)","ANASTACIO SALDANHA,  UNIPESSOAL  LDA (505804441), OVERPHARMA-PRODUTOS MÉDICOS E FARMACÉUTICOS,LDA (505792362), MOLNLYCKE HEALTH CARE COM PROD HOSPITALARES, LDA (511101066), Bastos Viegas, S.A. (500042772), OASIPOR - MedicalWear, S.A. (502260750)","213.838,41 €",22-06-2018,15-02-2018,330 dias,"Portugal, Lisboa, Lisboa","Artigo 20.º, n.º 1, alínea b) do Código dos Contratos Públicos",,,,,,Não aplicável.,Não aplicável.,FALSE
0-2.0271/18 - Sacos de Urostomia,Consulta Prévia,Aquisição de bens móveis,"33140000-3, Material médico de consumo","Centro Hospitalar de Lisboa Central, E. P. E. (508080142)","MEDICINALIA CORMEDICA - COMER. PROD. MED. HOSP.,LD (500684324)","1.507,10 €",22-06-2018,19-06-2018,180 dias,"Portugal, Lisboa, Lisboa","Artigo 20.º, n.º 1, alínea c) do Código dos Contratos Públicos",,,,,,Não aplicável.,Não aplicável.,FALSE
BROMETO DE PANCURÓNIO,Ao abrigo de acordo-quadro (art.º 259.º),Aquisição de bens móveis,"33600000-6, Produtos farmacêuticos","Centro Hospitalar de Lisboa Central, E. P. E. (508080142)",LABORATÓRIOS PFIZER (500162166),"3.325,00 €",21-06-2018,12-02-2018,365 dias,"Portugal, Lisboa, Lisboa",Artigo 259.º do Código dos Contratos Públicos,,,,,,2124520,CP 2016/55 - Medicamentos Diversos,FALSE
PEGINTERFERÃO ALFA 2A,Ao abrigo de acordo-quadro (art.º 259.º),Aquisição de bens móveis,"33600000-6, Produtos farmacêuticos","Centro Hospitalar de Lisboa Central, E. P. E. (508080142)",ROCHE FARMACEUTICA QUÍMICA (500233810),"7.972,00 €",21-06-2018,12-02-2018,365 dias,"Portugal, Lisboa, Lisboa",Artigo 259.º do Código dos Contratos Públicos,,,,,,2556219,CP2015/6 MEDICAMENTOS FORO ONCOLOGICO ABERTO PELA SPMS P259-AC-2016-89,FALSE
IDARRUBICINA,Ao abrigo de acordo-quadro (art.º 259.º),Aquisição de bens móveis,"33600000-6, Produtos farmacêuticos","Centro Hospitalar de Lisboa Central, E. P. E. (508080142)","ACCORD HEALTHCARE, UNIPESSOAL, LDA (508622263)","2.979,00 €",21-06-2018,16-01-2018,365 dias,"Portugal, Lisboa, Lisboa",Artigo 259.º do Código dos Contratos Públicos,,,,,,2559183,CONCURSO PUBLICO 2015/06 MEDICAMENTOS FORO ONCOLOGICO ABERTO PELA SPMS - P259-AC-21016-165,FALSE
VINORELBINA,Ao abrigo de acordo-quadro (art.º 259.º),Aquisição de bens móveis,"33600000-6, Produtos farmacêuticos","Centro Hospitalar de Lisboa Central, E. P. E. (508080142)",MEDAC GESELLSCHAFT FUR KLINISCHE SPEZIALPRAPARATE (980369959),"275,00 €",21-06-2018,16-01-2018,365 dias,"Portugal, Lisboa, Lisboa",Artigo 259.º do Código dos Contratos Públicos,,,,,,1771819,CP 2015/6 - Acordo quadro para o fornecimento de Medicamentos do Foro Oncológico,FALSE
CAPECITABINA,Ao abrigo de acordo-quadro (art.º 259.º),Aquisição de bens móveis,"33600000-6, Produtos farmacêuticos","Centro Hospitalar de Lisboa Central, E. P. E. (508080142)","ACCORD HEALTHCARE, UNIPESSOAL, LDA (508622263)","324,00 €",21-06-2018,22-01-2018,365 dias,"Portugal, Lisboa, Lisboa",Artigo 259.º do Código dos Contratos Públicos,,,,,,1771819,CP 2015/6 - Acordo quadro para o fornecimento de Medicamentos do Foro Oncológico,FALSE
DEFERASIROX,Ajuste Direto Regime Geral,Aquisição de bens móveis,"33600000-6, Produtos farmacêuticos","Centro Hospitalar de Lisboa Central, E. P. E. (508080142)","NOVARTIS FARMA - PROD. FARMACEUTICOS,  SA. (500063524)","1.916,76 €",21-06-2018,19-02-2018,365 dias,"Portugal, Lisboa, Lisboa","Artigo 24.º, n.º 1, alínea e), subalínea ii) do Código dos Contratos Públicos",,,,,,Não aplicável.,Não aplicável.,FALSE
PALBOCICLIB,Ajuste Direto Regime Geral,Aquisição de bens móveis,"33600000-6, Produtos farmacêuticos","Centro Hospitalar de Lisboa Central, E. P. E. (508080142)","Pfizer Biofarmaceutica, Sociedade Unipessoal Lda. (513300376)","84.000,01 €",21-06-2018,04-06-2018,365 dias,"Portugal, Lisboa, Lisboa","Artigo 24.º, n.º 1, alínea e), subalínea ii) do Código dos Contratos Públicos",,,,,,Não aplicável.,Não aplicável.,FALSE
"4-2.0097/18 - Aquisição de Pensos Higiniénico, Chupeta e Contentor p/peças anatómicas para 2018",Ajuste Direto Regime Geral,Aquisição de bens móveis,"33140000-3, Material médico de consumo","Centro Hospitalar de Lisboa Central, E.P.E. (CHLC) (508080142)","ESSITY PORTUGAL, LDA (EX. SCA) (503237612)","1.607,04 €",21-06-2018,21-06-2018,160 dias,"Portugal, Lisboa, Lisboa","Artigo 20.º, n.º 1, alínea a) do Código dos Contratos Públicos",,,,,,Não aplicável.,Não aplicável.,FALSE
LEVODOPA+CARBIDOPA,Ajuste Direto Regime Geral,Aquisição de bens móveis,"33600000-6, Produtos farmacêuticos","Centro Hospitalar de Lisboa Central, E. P. E. (508080142)",ABBVIE (510229050),"38.018,40 €",21-06-2018,22-01-2018,365 dias,"Portugal, Lisboa, Lisboa","Artigo 24.º, n.º 1, alínea e), subalínea ii) do Código dos Contratos Públicos",,,,,,Não aplicável.,Não aplicável.,FALSE
DOBUTAMINA,Ajuste Direto Regime Geral,Aquisição de bens móveis,"33000000-0, Equipamento médico, medicamentos e produtos para cuidados pessoais","Centro Hospitalar de Lisboa Central, E. P. E. (508080142)",GENERIS (508107997),"5.460,00 €",21-06-2018,26-01-2018,365 dias,"Portugal, Lisboa, Lisboa","Artigo 21.º, n.º 1, alínea c) do Código dos Contratos Públicos",,,,,,Não aplicável.,Não aplicável.,FALSE
HALOPERIDOL,Ajuste Direto Regime Geral,Aquisição de bens móveis,"33000000-0, Equipamento médico, medicamentos e produtos para cuidados pessoais","Centro Hospitalar de Lisboa Central, E. P. E. (508080142)","JANSSEN CILAG FARMACÊUTICA, LDA (500189412)","537,00 €",21-06-2018,23-01-2018,365 dias,"Portugal, Lisboa, Lisboa","Artigo 24.º, n.º 1, alínea e), subalínea ii) do Código dos Contratos Públicos",,,,,,Não aplicável.,Não aplicável.,FALSE
USTECINUMAB,Ao abrigo de acordo-quadro (art.º 259.º),Aquisição de bens móveis,"33600000-6, Produtos farmacêuticos","Centro Hospitalar de Lisboa Central, E. P. E. (508080142)","JANSSEN CILAG FARMACÊUTICA, LDA (500189412)","24.154,20 €",21-06-2018,08-06-2018,365 dias,"Portugal, Lisboa, Lisboa",Artigo 259.º do Código dos Contratos Públicos,,,,,,2556987,"CP 2017/65 - Acordo Quadro para fornecimento de Medicamentos de Várias áreas Terapêuticas, às Instituições e Serviços do Serviço Nacional de Saúde",FALSE
MOXIFLOXACINA,Ao abrigo de acordo-quadro (art.º 259.º),Aquisição de bens móveis,"33000000-0, Equipamento médico, medicamentos e produtos para cuidados pessoais","Centro Hospitalar de Lisboa Central, E. P. E. (508080142)",NOVARTIS (500063524),"443,00 €",21-06-2018,15-06-2018,365 dias,"Portugal, Lisboa, Lisboa",Artigo 259.º do Código dos Contratos Públicos,,,,,,2124520,CP 2016/55 - Medicamentos Diversos,FALSE
Aquisição de Imunoglobulina Humana Contra a Hepatite B 50UI/ml sol inj fr 40ml IV,Ao abrigo de acordo-quadro (art.º 259.º),Aquisição de bens móveis,"33100000-1, Equipamento médico","Centro Hospitalar de Lisboa Central, E. P. E. (508080142)",SOUTH POINT CARE (508284872),"5.299,20 €",21-06-2018,20-06-2018,30 dias,"Portugal, Lisboa, Lisboa",Artigo 259.º do Código dos Contratos Públicos,,,,,,2800702,CP 2017/9 - Acordo quadro para fornecimento de Derivados do Plasma Humano às Instituições e Serviços do Serviço Nacional de Saúde,FALSE
HIALURONATO DE SÓDIO,Consulta Prévia,Aquisição de bens móveis,"33600000-6, Produtos farmacêuticos","Centro Hospitalar de Lisboa Central, E. P. E. (508080142)",Overpharma (505792362),"270,00 €",21-06-2018,19-06-2018,365 dias,"Portugal, Lisboa, Lisboa","Artigo 20.º, n.º 1, alínea c) do Código dos Contratos Públicos",,,,,,Não aplicável.,Não aplicável.,FALSE
