freguesia,acronym,validVotesPercentage,votes,dicofre
Muro,PPD/PSD,47.65,477,131808
Muro,PS,34.47,345,131808
Muro,B.E.,6.19,62,131808
Muro,CDS-PP,3.4,34,131808
Muro,PAN,2.2,22,131808
Muro,PCP-PEV,1.6,16,131808
Muro,IL,1.3,13,131808
Muro,L,0.7,7,131808
Muro,R.I.R.,0.6,6,131808
Muro,PCTP/MRPP,0.4,4,131808
Muro,PURP,0.4,4,131808
Muro,CH,0.3,3,131808
Muro,A,0.2,2,131808
Muro,NC,0.2,2,131808
Muro,PTP,0.2,2,131808
Muro,PDR,0.1,1,131808
Muro,PPM,0.1,1,131808
Muro,JPP,0,0,131808
Muro,MAS,0,0,131808
Muro,MPT,0,0,131808
Muro,PNR,0,0,131808
