freguesia,acronym,validVotesPercentage,votes,dicofre
Gimonde,PPD/PSD,50,47,040216
Gimonde,PS,34.04,32,040216
Gimonde,CDS-PP,5.32,5,040216
Gimonde,B.E.,3.19,3,040216
Gimonde,PAN,2.13,2,040216
Gimonde,L,1.06,1,040216
Gimonde,NC,1.06,1,040216
Gimonde,PCP-PEV,1.06,1,040216
Gimonde,PCTP/MRPP,1.06,1,040216
Gimonde,PPM.PPV/CDC,1.06,1,040216
Gimonde,A,0,0,040216
Gimonde,IL,0,0,040216
Gimonde,MAS,0,0,040216
Gimonde,PDR,0,0,040216
Gimonde,PNR,0,0,040216
Gimonde,PTP,0,0,040216
Gimonde,PURP,0,0,040216
