Objeto do Contrato,Tipo de Procedimento,Tipo(s) de Contrato,CPVs,Entidade(s) Adjudicante(s),Entidade(s) Adjudicatária(s),Preço Contratual,Data de Publicação,Data de Celebração do Contrato,Prazo de Execução,Local de Execução,Fundamentação,Data de Fecho do Contrato,Preço Total Efetivo,Causas das Alterações ao Prazo,Causas das Alterações ao Preço,Estado,N.º registo do Acordo Quadro,Descrição do Acordo Quadro,Procedimento Centralizado
SC/121/2013 - Aquisição de Luvas,Ao abrigo de acordo-quadro (art.º 259.º),Aquisição de bens móveis,"33141420-0, Luvas para cirurgia","Administração Regional de Saúde do Algarve, I.P. (503148709)","VWR International - Material de Laboratório, Lda. (503842770)","38.482,56 €",31-05-2013,13-05-2013,230 dias,"Portugal, Faro",Artigo 259.º do Código dos Contratos Públicos,10-12-2013,"38.479,68 €",,Quantidade encomendada,,544071,"CONCURSO PÚBLICO PARA A CELEBRAÇÃO DE CONTRATOS PÚBLICOS DE APROVISIONAMENTO PARA A ÁREA DA SAÚDE, COM VISTA AO FORNECIMENTO DE LUVAS PARA USO MÉDICO, ÀS INSTITUIÇÕES E SERVIÇOS DO SERVIÇO NACIONAL DE SAÚDE",
SC/121/2013 - Aquisição de Luvas,Ao abrigo de acordo-quadro (art.º 259.º),Aquisição de bens móveis,"33141420-0, Luvas para cirurgia","Administração Regional de Saúde do Algarve, I.P. (503148709)","Ezequiel Panão Jorge, Lda. (501412727)","143,80 €",31-05-2013,13-05-2013,230 dias,"Portugal, Faro",Artigo 259.º do Código dos Contratos Públicos,11-09-2013,"143,80 €",,"",,544071,"CONCURSO PÚBLICO PARA A CELEBRAÇÃO DE CONTRATOS PÚBLICOS DE APROVISIONAMENTO PARA A ÁREA DA SAÚDE, COM VISTA AO FORNECIMENTO DE LUVAS PARA USO MÉDICO, ÀS INSTITUIÇÕES E SERVIÇOS DO SERVIÇO NACIONAL DE SAÚDE",
SC/121/2013 - Aquisição de Luvas,Ao abrigo de acordo-quadro (art.º 259.º),Aquisição de bens móveis,"33141420-0, Luvas para cirurgia","Administração Regional de Saúde do Algarve, I.P. (503148709)","Pergut Portugal Comércio de Produtos Hospitalares e Médicos, Lda. (501799729)","3.050,40 €",31-05-2013,13-05-2013,230 dias,"Portugal, Faro",Artigo 259.º do Código dos Contratos Públicos,17-12-2013,"3.050,40 €",,"",,544071,"CONCURSO PÚBLICO PARA A CELEBRAÇÃO DE CONTRATOS PÚBLICOS DE APROVISIONAMENTO PARA A ÁREA DA SAÚDE, COM VISTA AO FORNECIMENTO DE LUVAS PARA USO MÉDICO, ÀS INSTITUIÇÕES E SERVIÇOS DO SERVIÇO NACIONAL DE SAÚDE",
"SC/61/2013 - Aquisição de Agulhas, Contentores e Seringas",Ao abrigo de acordo-quadro (art.º 259.º),Aquisição de bens móveis,"33141310-6, Seringas","Administração Regional de Saúde do Algarve, I.P. (503148709)","PMH Produtos Médicos Hospitalares, S.A. (502376899)","1.164,75 €",31-05-2013,17-05-2013,225 dias,"Portugal, Faro",Artigo 259.º do Código dos Contratos Públicos,13-11-2013,"1.024,98 €",,Quantidade encomendada,,448705,"CONCURSO PÚBLICO PARA A CELEBRAÇÃO DE CONTRATOS PÚBLICOS DE APROVISIONAMENTO PARA A ÁREA DA SAÚDE, COM VISTA AO FORNECIMENTO DE SERINGAS, AGULHAS, CONTENTORES E SISTEMAS FECHADOS DE COLHEITA,  ÀS INSTITUIÇÕES E SERVIÇOS DO SERVIÇO NACIONAL DE SAÚDE",
"SC/61/2013 - Aquisição de Agulhas, Contentores e Seringas",Ao abrigo de acordo-quadro (art.º 259.º),Aquisição de bens móveis,"33141123-8, Recipientes para colocar material cortante","Administração Regional de Saúde do Algarve, I.P. (503148709)","Ambimed - Gestão Ambiental, Lda. (503593427)","2.391,00 €",31-05-2013,17-05-2013,225 dias,"Portugal, Faro",Artigo 259.º do Código dos Contratos Públicos,25-11-2013,"2.148,80 €",,Quantidade encomendada,,448705,"CONCURSO PÚBLICO PARA A CELEBRAÇÃO DE CONTRATOS PÚBLICOS DE APROVISIONAMENTO PARA A ÁREA DA SAÚDE, COM VISTA AO FORNECIMENTO DE SERINGAS, AGULHAS, CONTENTORES E SISTEMAS FECHADOS DE COLHEITA,  ÀS INSTITUIÇÕES E SERVIÇOS DO SERVIÇO NACIONAL DE SAÚDE",
"SC/61/2013 - Aquisição de Agulhas, Contentores e Seringas",Ao abrigo de acordo-quadro (art.º 259.º),Aquisição de bens móveis,"33141320-9, Agulhas para fins médicos<BR/>33141310-6, Seringas","Administração Regional de Saúde do Algarve, I.P. (503148709)","Pergut Portugal Comércio Produtos Hospitalares e Médicos, Lda. (501799729)","5.092,93 €",31-05-2013,17-05-2013,225 dias,"Portugal, Faro",Artigo 259.º do Código dos Contratos Públicos,07-12-2013,"3.536,97 €",,Quantidade encomendada,,448705,"CONCURSO PÚBLICO PARA A CELEBRAÇÃO DE CONTRATOS PÚBLICOS DE APROVISIONAMENTO PARA A ÁREA DA SAÚDE, COM VISTA AO FORNECIMENTO DE SERINGAS, AGULHAS, CONTENTORES E SISTEMAS FECHADOS DE COLHEITA,  ÀS INSTITUIÇÕES E SERVIÇOS DO SERVIÇO NACIONAL DE SAÚDE",
"SC/61/2013 - Aquisição de Agulhas, Contentores e Seringas",Ao abrigo de acordo-quadro (art.º 259.º),Aquisição de bens móveis,"33141320-9, Agulhas para fins médicos","Administração Regional de Saúde do Algarve, I.P. (503148709)","B. Braun Medical, Lda. (501506543)","24,75 €",31-05-2013,17-05-2013,225 dias,"Portugal, Faro",Artigo 259.º do Código dos Contratos Públicos,06-11-2013,"24,75 €",,"",,448705,"CONCURSO PÚBLICO PARA A CELEBRAÇÃO DE CONTRATOS PÚBLICOS DE APROVISIONAMENTO PARA A ÁREA DA SAÚDE, COM VISTA AO FORNECIMENTO DE SERINGAS, AGULHAS, CONTENTORES E SISTEMAS FECHADOS DE COLHEITA,  ÀS INSTITUIÇÕES E SERVIÇOS DO SERVIÇO NACIONAL DE SAÚDE",
"SC/61/2013 - Aquisição de Agulhas, Contentores e Seringas",Ao abrigo de acordo-quadro (art.º 259.º),Aquisição de bens móveis,"33141123-8, Recipientes para colocar material cortante<BR/>33141320-9, Agulhas para fins médicos","Administração Regional de Saúde do Algarve, I.P. (503148709)","Overpharma Produtos Médicos e Farmacêuticos, Lda. (505792362)","1.414,00 €",31-05-2013,17-05-2013,225 dias,"Portugal, Faro",Artigo 259.º do Código dos Contratos Públicos,04-12-2013,"1.348,20 €",,Quantidade encomendada,,448705,"CONCURSO PÚBLICO PARA A CELEBRAÇÃO DE CONTRATOS PÚBLICOS DE APROVISIONAMENTO PARA A ÁREA DA SAÚDE, COM VISTA AO FORNECIMENTO DE SERINGAS, AGULHAS, CONTENTORES E SISTEMAS FECHADOS DE COLHEITA,  ÀS INSTITUIÇÕES E SERVIÇOS DO SERVIÇO NACIONAL DE SAÚDE",
