freguesia,acronym,validVotesPercentage,votes,dicofre
Oleiros-Amieira,PPD/PSD.CDS-PP,57.31,447,050614
Oleiros-Amieira,PS,24.23,189,050614
Oleiros-Amieira,MPT,5.9,46,050614
Oleiros-Amieira,B.E.,2.95,23,050614
Oleiros-Amieira,PCP-PEV,2.95,23,050614
Oleiros-Amieira,L,1.54,12,050614
Oleiros-Amieira,PND,1.28,10,050614
Oleiros-Amieira,PCTP/MRPP,1.15,9,050614
Oleiros-Amieira,PNR,0.51,4,050614
Oleiros-Amieira,PTP,0.51,4,050614
Oleiros-Amieira,MAS,0.38,3,050614
Oleiros-Amieira,PAN,0.38,3,050614
Oleiros-Amieira,PPM,0.38,3,050614
Oleiros-Amieira,PPV,0.26,2,050614
Oleiros-Amieira,PDA,0.13,1,050614
Oleiros-Amieira,POUS,0.13,1,050614
