Objeto do Contrato,Tipo de Procedimento,Tipo(s) de Contrato,CPVs,Entidade(s) Adjudicante(s),Entidade(s) Adjudicatária(s),Preço Contratual,Data de Publicação,Data de Celebração do Contrato,Prazo de Execução,Local de Execução,Fundamentação,Data de Fecho do Contrato,Preço Total Efetivo,Causas das Alterações ao Prazo,Causas das Alterações ao Preço,Estado,N.º registo do Acordo Quadro,Descrição do Acordo Quadro,Procedimento Centralizado
Aluguer de auditório e serviços conexos,Ajuste Direto Regime Geral,Aquisição de serviços,"79952000-2, Serviços de eventos","SPMS- Serviços Partilhados do M. da Saúde, E.P.E. (509540716)","Dynamic Place, Lda. (513361707)","74.800,00 €",09-05-2017,30-12-2016,365 dias,Portugal,"Artigo 20.º, n.º 1, alínea a) do Código dos Contratos Públicos",01-01-2018,"74.800,00 €",,,,Não aplicável.,Não aplicável.,FALSE
Aquisição de serviços de consultoria de serviços de comunicação SPMS 2017,Ajuste Direto Regime Geral,Aquisição de serviços,"79413000-2, Serviços de consultoria em matéria de gestão de marketing","SPMS- Serviços Partilhados do M. da Saúde, E.P.E. (509540716)","Connect International, Lda (507574435)","74.900,00 €",09-05-2017,30-12-2016,365 dias,Portugal,"Artigo 20.º, n.º 1, alínea a) do Código dos Contratos Públicos",29-12-2017,"74.900,00 €",,,,Não aplicável.,Não aplicável.,FALSE
Aquisição de serviços de logística e sinalética da SPMS,Ajuste Direto Regime Geral,Aquisição de serviços,"79933000-3, Serviços de assistência em matéria de design","SPMS- Serviços Partilhados do M. da Saúde, E.P.E. (509540716)","Dynamic Place, Lda. (513361707)","72.000,00 €",09-05-2017,30-12-2016,365 dias,Portugal,"Artigo 20.º, n.º 1, alínea a) do Código dos Contratos Públicos",01-01-2018,"72.000,00 €",,,,Não aplicável.,Não aplicável.,FALSE
Aquisição de serviços de higiene sanitária,Ajuste Direto Regime Geral,Outros Tipos (Concessão de exploração de bens do domínio público),"85142300-9, Serviços de higiene","SPMS - Serviços Partilhados do Ministério da Saúde, E. P. E. (509540716)","Rentokil Initial Portugal, Lda (501351167)","9.147,84 €",05-05-2017,12-04-2017,365 dias,Portugal,"Artigo 20.º, n.º 1, alínea a) do Código dos Contratos Públicos","","",,,,Não aplicável.,Não aplicável.,FALSE
Aquisição de serviços de consultoria de negócio de apoio à elaboração do relatório preliminar do plano de transferência,Ajuste Direto Regime Geral,Aquisição de serviços,"72130000-5, Serviços de consultoria em matéria de planeamento de locais informáticos","SPMS - Serviços Partilhados do Ministério da Saúde, E. P. E. (509540716)","Everis Portugal, S.A. (506204650)","8.640,00 €",05-05-2017,12-04-2017,90 dias,Portugal,"Artigo 20.º, n.º 1, alínea a) do Código dos Contratos Públicos",12-07-2017,"8.640,00 €",,,,Não aplicável.,Não aplicável.,FALSE
Fornecimento de equipamento informático,Concurso público,Aquisição de bens móveis,"30200000-1, Equipamento e material informático","SPMS - Serviços Partilhados do Ministério da Saúde, E. P. E. (509540716)"," EXITUS-SOLUÇOES TECNOLOGICAS, LDA (509117660)","20,00 €",05-05-2017,14-02-2017,30 dias,"Portugal, Lisboa, Lisboa","Artigo 20.º, n.º 1, alínea b) do Código dos Contratos Públicos",08-03-2017,"20,00 €",,,,Não aplicável.,Não aplicável.,FALSE
Fornecimento de equipamento informático,Concurso público,Aquisição de bens móveis,"30200000-1, Equipamento e material informático","SPMS - Serviços Partilhados do Ministério da Saúde, E. P. E. (509540716)","BASEDOIS-INFORMÁTICA E TELECOMUNICAÇÕES, LDA (501333401)","12.190,00 €",05-05-2017,14-02-2017,30 dias,"Portugal, Lisboa","Artigo 20.º, n.º 1, alínea b) do Código dos Contratos Públicos",03-04-2017,"12.190,00 €",,,,Não aplicável.,Não aplicável.,FALSE
Aquisição de serviços de consultoria de arquitetura de sistemas de apoio ao mapeamento dos componentes arquiteturais das ARS,Ajuste Direto Regime Geral,Aquisição de serviços,"72514000-1, Serviços de gestão de instalações informáticas","SPMS- Serviços Partilhados do M. da Saúde, E.P.E. (509540716)","Link Consulting, S.A.   (504551221)","6.150,00 €",05-05-2017,12-04-2017,90 dias,Portugal,"Artigo 20.º, n.º 1, alínea a) do Código dos Contratos Públicos",12-07-2017,"6.150,00 €",,,,Não aplicável.,Não aplicável.,FALSE
Aquisição de serviços de manutenção de equipamentos HP,Concurso público,Aquisição de serviços,"72500000-0, Serviços relacionados com a informática","SPMS- Serviços Partilhados do M. da Saúde, E.P.E. (509540716)",INFORMANTEM INFORMATICA MANUTENCAO SA (503670693),"184.990,90 €",04-05-2017,23-03-2017,365 dias,Portugal,"Artigo 21.º, n.º 1, alínea b) do Código dos Contratos Públicos","","",,,,Não aplicável.,Não aplicável.,FALSE
Aquisição de computadores portáteis,Ajuste Direto Regime Geral,Aquisição de bens móveis,"30213000-5, Computadores pessoais","SPMS- Serviços Partilhados do M. da Saúde, E.P.E. (509540716)","Techabit, LDA (513916164)","74.368,80 €",04-05-2017,21-02-2017,30 dias,Portugal,"Artigo 20.º, n.º 1, alínea a) do Código dos Contratos Públicos",08-03-2017,"74.368,80 €",,,,Não aplicável.,Não aplicável.,FALSE
