Objeto do Contrato,Tipo de Procedimento,Tipo(s) de Contrato,CPVs,Entidade(s) Adjudicante(s),Entidade(s) Adjudicatária(s),Preço Contratual,Data de Publicação,Data de Celebração do Contrato,Prazo de Execução,Local de Execução,Fundamentação,Data de Fecho do Contrato,Preço Total Efetivo,Causas das Alterações ao Prazo,Causas das Alterações ao Preço,Estado,N.º registo do Acordo Quadro,Descrição do Acordo Quadro,Procedimento Centralizado
Concurso Público Nº 120046/2018 - Material irrecup. médico-cirúrgico para Imagiologia/Tac,Concurso público,Aquisição de bens móveis,"33000000-0, Equipamento médico, medicamentos e produtos para cuidados pessoais","Hospital Distrital de Santarém, EPE (506361462)","LELEMAN, S.L. (B46193827)","600,00 €",01-12-2018,11-09-2018,152 dias,"Portugal, Santarém, Santarém","Artigo 20.º, n.º 1, alínea b) do Código dos Contratos Públicos",,,,,,Não aplicável.,Não aplicável.,FALSE
Concurso Público Nº 120046/2018 - Material irrecup. médico-cirúrgico para Imagiologia/Tac,Concurso público,Aquisição de bens móveis,"33000000-0, Equipamento médico, medicamentos e produtos para cuidados pessoais","Hospital Distrital de Santarém, EPE (506361462)",H.R. - HOSPITALAR (501895558),"1.165,00 €",01-12-2018,11-09-2018,152 dias,"Portugal, Santarém, Santarém","Artigo 20.º, n.º 1, alínea b) do Código dos Contratos Públicos",,,,,,Não aplicável.,Não aplicável.,FALSE
Concurso Público Nº 120046/2018 - Material irrecup. médico-cirúrgico para Imagiologia/Tac,Concurso público,Aquisição de bens móveis,"33000000-0, Equipamento médico, medicamentos e produtos para cuidados pessoais","Hospital Distrital de Santarém, EPE (506361462)","CLINIFAR, S.A. (503281115)","288,00 €",01-12-2018,11-09-2018,152 dias,"Portugal, Santarém, Santarém","Artigo 20.º, n.º 1, alínea b) do Código dos Contratos Públicos",,,,,,Não aplicável.,Não aplicável.,FALSE
Concurso Público Nº 120046/2018 - Material irrecup. médico-cirúrgico para Imagiologia/Tac,Concurso público,Aquisição de bens móveis,"33000000-0, Equipamento médico, medicamentos e produtos para cuidados pessoais","Hospital Distrital de Santarém, EPE (506361462)","CATETER, LDA (502914319)","7.836,80 €",01-12-2018,11-09-2018,152 dias,"Portugal, Santarém, Santarém","Artigo 20.º, n.º 1, alínea b) do Código dos Contratos Públicos",,,,,,Não aplicável.,Não aplicável.,FALSE
Concurso Público Nº 120046/2018 - Material irrecup. médico-cirúrgico para Imagiologia/Tac,Concurso público,Aquisição de bens móveis,"33000000-0, Equipamento médico, medicamentos e produtos para cuidados pessoais","Hospital Distrital de Santarém, EPE (506361462)","C. R. BARD PORTUGAL, LDA (502438274)","25.000,00 €",01-12-2018,20-09-2018,152 dias,"Portugal, Santarém, Santarém","Artigo 20.º, n.º 1, alínea b) do Código dos Contratos Públicos",,,,,,Não aplicável.,Não aplicável.,FALSE
31103418 - MEDICAMENTOS F.U. GLAXO CONSUMER 2018,Ajuste Direto Regime Geral,Aquisição de bens móveis,"33600000-6, Produtos farmacêuticos","Hospital Distrital de Santarém, EPE (506361462)",GLAXOSMITHKLINE CONSUMER HEALTHCARE (500276994),"11.647,80 €",23-11-2018,08-02-2018,330 dias,"Portugal, Santarém, Santarém","Artigo 24.º, n.º 1, alínea e), subalínea i) do Código dos Contratos Públicos",,,,,,Não aplicável.,Não aplicável.,FALSE
MEDICAMENTOS TRAZTUZUMAB 100 MG E 160 MG 2018,Consulta Prévia,Aquisição de bens móveis,"33000000-0, Equipamento médico, medicamentos e produtos para cuidados pessoais","Hospital Distrital de Santarém, EPE (506361462)",ROCHE FARMACEUTICA QUIMICA (500233810),"65.851,35 €",22-11-2018,03-04-2018,278 dias,"Portugal, Santarém, Santarém","Artigo 24.º, n.º 1, alínea e), subalínea i) do Código dos Contratos Públicos",,,,,,Não aplicável.,Não aplicável.,FALSE
MEDICAMENTO,Consulta Prévia,Aquisição de bens móveis,"33000000-0, Equipamento médico, medicamentos e produtos para cuidados pessoais","Hospital Distrital de Santarém, EPE (506361462)",ROCHE FARMACEUTICA QUIMICA (500233810),"37.179,45 €",22-11-2018,20-02-2018,323 dias,"Portugal, Santarém, Santarém","Artigo 20.º, n.º 1, alínea c) do Código dos Contratos Públicos",,,,,,Não aplicável.,Não aplicável.,FALSE
MEDICAMENTOS DE FORNECEDOR UNICO VEISIL 2018,Ajuste Direto Regime Geral,Aquisição de bens móveis,"33600000-6, Produtos farmacêuticos","Hospital Distrital de Santarém, EPE (506361462)",A. MENDES DA SILVA LDA (502064080),"10.288,58 €",22-11-2018,17-01-2018,365 dias,"Portugal, Santarém, Santarém","Artigo 24.º, n.º 1, alínea e) do Código dos Contratos Públicos",,,,,,Não aplicável.,Não aplicável.,FALSE
MEDICAMENTOS DE FORNECEDOR UNICO TAKEDA 1.1 2018,Consulta Prévia,Aquisição de bens móveis,"33000000-0, Equipamento médico, medicamentos e produtos para cuidados pessoais","Hospital Distrital de Santarém, E. P. E. (506361462)",TAKEDA FARMACÊUTICOS PORTUGAL LDA (502801204),"73.685,76 €",21-11-2018,18-04-2018,300 dias,"Portugal, Santarém, Santarém","Artigo 20.º, n.º 1, alínea c) do Código dos Contratos Públicos",,,,,,Não aplicável.,Não aplicável.,FALSE
