Objeto do Contrato,Tipo de Procedimento,Tipo(s) de Contrato,CPVs,Entidade(s) Adjudicante(s),Entidade(s) Adjudicatária(s),Preço Contratual,Data de Publicação,Data de Celebração do Contrato,Prazo de Execução,Local de Execução,Fundamentação,Data de Fecho do Contrato,Preço Total Efetivo,Causas das Alterações ao Prazo,Causas das Alterações ao Preço,Estado,N.º registo do Acordo Quadro,Descrição do Acordo Quadro,Procedimento Centralizado
"Contratação de serviços em matéria de farmacovigilância no âmbito do SNF, para cobertura da totalidade das regiões de Saúde existentes em Portugal Continental - Lote II / UF Centro (EA n.º 20140000752 - Lote II) ",Ajuste Direto Regime Geral,Aquisição de serviços,"85140000-2, Serviços de saúde diversos","INFARMED - Autoridade Nacional do Medicamento e Produtos de Saúde, I. P. (600037002)",AIBILI - Associação para Investigação Bio medica e Inovação em Luz e Imagem (502288957),"43.290,00 €",10-04-2015,17-03-2015,365 dias,Portugal,"Artigo 27.º, n.º 1, alínea a) do Código dos Contratos Públicos",,,,,,Não aplicável.,Não aplicável.,FALSE
"Contratação de serviços em matéria de farmacovigilância no âmbito do SNF, para cobertura da totalidade das regiões de Saúde existentes em Portugal Continental - Lote I / UF Norte (EA n.º 20140000752 - Lote I)",Ajuste Direto Regime Geral,Aquisição de serviços,"85140000-2, Serviços de saúde diversos","INFARMED - Autoridade Nacional do Medicamento e Produtos de Saúde, I. P. (600037002)",FACULDADE DE MEDICINA DA UNIVERSIDADE DO PORTO (600027546),"83.400,00 €",10-04-2015,17-03-2015,365 dias,Portugal,"Artigo 27.º, n.º 1, alínea a) do Código dos Contratos Públicos",,,,,,Não aplicável.,Não aplicável.,FALSE
"Contratação de Serviços de Cliping de alertas de rádio e Televisão e recortes de imprensa, para o ano 2015_EA20140000630.",Ajuste Direto Regime Geral,Aquisição de serviços,"92400000-5, Serviços das agências noticiosas","INFARMED - Autoridade Nacional do Medicamento e Produtos de Saúde, I. P. (600037002)","Cision Portugal, distribuiçãi de lnformação Geral, S.A. (501355383)","7.603,20 €",10-04-2015,23-03-2015,365 dias,Portugal,"Artigo 20.º, n.º 1, alínea a) do Código dos Contratos Públicos",,,,,,Não aplicável.,Não aplicável.,FALSE
"Aluguer, por 36 meses, de uma solução integrada para gestão de assiduidade (EA n.º 20140000704)",Ajuste Direto Regime Geral,Aquisição de serviços,"72000000-5, Serviços de TI: consultoria, desenvolvimento de software, Internet e apoio","INFARMED - Autoridade Nacional do Medicamento e Produtos de Saúde, I. P. (600037002)","SISQUAL - Empresa de Investigação e Desenvol. Sistemas Informáticos, Lda (502772298)","42.552,00 €",10-04-2015,17-03-2015,1080 dias,Portugal,"Artigo 20.º, n.º 1, alínea a) do Código dos Contratos Públicos",,,,,,Não aplicável.,Não aplicável.,FALSE
Contratação de serviços técnicos especializados para realização de um estudo de apoio à revisão das Orientações Metodológicas para avaliação económica de Medicamentos _EA20150000003,Ajuste Direto Regime Geral,Aquisição de serviços,"79420000-4, Serviços relacionados com a gestão","INFARMED - Autoridade Nacional do Medicamento e Produtos de Saúde, I. P. (600037002)","Escola Nacional de Saúde Pública da Universidade Nova de Lisboa (ENSP/UNL),  (501399003)","60.000,00 €",10-04-2015,23-03-2015,365 dias,Portugal,"Artigo 20.º, n.º 1, alínea a) do Código dos Contratos Públicos",,,,,,Não aplicável.,Não aplicável.,FALSE
Contratação de serviços de manutenção e assistência técnica às UPS¿s_EA20140000617.,Ajuste Direto Regime Geral,Aquisição de bens móveis,"31000000-6, Maquinaria, aparelhagem, equipamento e consumíveis eléctricos; iluminação","INFARMED - Autoridade Nacional do Medicamento e Produtos de Saúde, I. P. (600037002)","SCHNEIDER ELECTRIC PORTUGAL, LDA. (500281858)","10.804,64 €",10-04-2015,17-03-2015,365 dias,Portugal,"Artigo 24.º, n.º 1, alínea e) do Código dos Contratos Públicos",,,,,,Não aplicável.,Não aplicável.,FALSE
Aquisição de serviços de “backup as-a-service” por um período de 25 meses,Ajuste Direto Regime Geral,Aquisição de serviços,"72900000-9, Serviços informáticos de segurança (back-up) e serviços informáticos de conversão de catálogos",INFARMED - Autoridade Nacional do Medicamento e Produtos de Saúde I.P. (600037002),"Refer Telecom, Serviços de Telecomunicações S.A. (505065630)","72.950,00 €",10-04-2015,07-04-2015,750 dias,Portugal,"Artigo 20.º, n.º 1, alínea a) do Código dos Contratos Públicos",,,,,,Não aplicável.,Não aplicável.,FALSE
Aquisição de 12 equipamentos portateis,Ajuste Direto Regime Geral,Locação de bens móveis,"30213000-5, Computadores pessoais","INFARMED - Autoridade Nacional do Medicamento e Produtos de Saúde, I. P. (600037002)",INFORMATICA EL CORTE INGLES (980079659),"9.415,80 €",10-04-2015,20-03-2015,30 dias,Portugal,"Artigo 20.º, n.º 1, alínea a) do Código dos Contratos Públicos",,,,,,Não aplicável.,Não aplicável.,FALSE
