freguesia,acronym,validVotesPercentage,votes,dicofre
Medrões,PS,49.38,80,171106
Medrões,PPD/PSD,30.25,49,171106
Medrões,B.E.,8.64,14,171106
Medrões,CDS-PP,8.64,14,171106
Medrões,PCTP/MRPP,1.23,2,171106
Medrões,MAS,0.62,1,171106
Medrões,NC,0.62,1,171106
Medrões,PCP-PEV,0.62,1,171106
Medrões,A,0,0,171106
Medrões,IL,0,0,171106
Medrões,L,0,0,171106
Medrões,PAN,0,0,171106
Medrões,PDR,0,0,171106
Medrões,PNR,0,0,171106
Medrões,PPM.PPV/CDC,0,0,171106
Medrões,PTP,0,0,171106
Medrões,PURP,0,0,171106
