freguesia,acronym,validVotesPercentage,votes,dicofre
Geraz do Minho,PS,50.51,100,030914
Geraz do Minho,PPD/PSD,29.8,59,030914
Geraz do Minho,CDS-PP,6.06,12,030914
Geraz do Minho,B.E.,5.56,11,030914
Geraz do Minho,PAN,2.53,5,030914
Geraz do Minho,PCP-PEV,2.02,4,030914
Geraz do Minho,L,1.52,3,030914
Geraz do Minho,A,1.01,2,030914
Geraz do Minho,IL,0.51,1,030914
Geraz do Minho,MAS,0.51,1,030914
Geraz do Minho,NC,0,0,030914
Geraz do Minho,PCTP/MRPP,0,0,030914
Geraz do Minho,PDR,0,0,030914
Geraz do Minho,PNR,0,0,030914
Geraz do Minho,PPM.PPV/CDC,0,0,030914
Geraz do Minho,PTP,0,0,030914
Geraz do Minho,PURP,0,0,030914
