Objeto do Contrato,Tipo de Procedimento,Tipo(s) de Contrato,CPVs,Entidade(s) Adjudicante(s),Entidade(s) Adjudicatária(s),Preço Contratual,Data de Publicação,Data de Celebração do Contrato,Prazo de Execução,Local de Execução,Fundamentação,Data de Fecho do Contrato,Preço Total Efetivo,Causas das Alterações ao Prazo,Causas das Alterações ao Preço,Estado,N.º registo do Acordo Quadro,Descrição do Acordo Quadro,Procedimento Centralizado
Aquisição de Computadores e Impressora,Ajuste Direto Regime Geral,Aquisição de bens móveis,"30230000-0, Equipamento informático","Unidade Local de Saúde do Alto Minho, E. P. E. (508786193)","Informática El Corte Inglês, S. A. (980079659)","9.930,22 €",09-02-2015,05-02-2015,5 dias,"Portugal, Viana do Castelo","Artigo 20.º, n.º 1, alínea a) do Código dos Contratos Públicos",,,,,,Não aplicável.,Não aplicável.,FALSE
Aquisição de Computadores e Impressora,Ajuste Direto Regime Geral,Aquisição de bens móveis,"30230000-0, Equipamento informático","Unidade Local de Saúde do Alto Minho, EPE (ULSAM) (508786193)","Informática El Corte Inglês, S. A. (980079659)","9.930,22 €",09-02-2015,05-02-2015,5 dias,"Portugal, Viana do Castelo","Artigo 20.º, n.º 1, alínea a) do Código dos Contratos Públicos",,,,,,Não aplicável.,Não aplicável.,FALSE
