freguesia,acronym,validVotesPercentage,votes,dicofre
União das freguesias de Aricera e Goujoim,PPD/PSD,45.45,50,180121
União das freguesias de Aricera e Goujoim,PS,30,33,180121
União das freguesias de Aricera e Goujoim,CDS-PP,10,11,180121
União das freguesias de Aricera e Goujoim,PPM,5.45,6,180121
União das freguesias de Aricera e Goujoim,B.E.,4.55,5,180121
União das freguesias de Aricera e Goujoim,PCTP/MRPP,1.82,2,180121
União das freguesias de Aricera e Goujoim,IL,0.91,1,180121
União das freguesias de Aricera e Goujoim,JPP,0.91,1,180121
União das freguesias de Aricera e Goujoim,PDR,0.91,1,180121
União das freguesias de Aricera e Goujoim,A,0,0,180121
União das freguesias de Aricera e Goujoim,CH,0,0,180121
União das freguesias de Aricera e Goujoim,L,0,0,180121
União das freguesias de Aricera e Goujoim,MPT,0,0,180121
União das freguesias de Aricera e Goujoim,NC,0,0,180121
União das freguesias de Aricera e Goujoim,PAN,0,0,180121
União das freguesias de Aricera e Goujoim,PCP-PEV,0,0,180121
União das freguesias de Aricera e Goujoim,PNR,0,0,180121
União das freguesias de Aricera e Goujoim,PTP,0,0,180121
União das freguesias de Aricera e Goujoim,PURP,0,0,180121
União das freguesias de Aricera e Goujoim,R.I.R.,0,0,180121
