freguesia,acronym,validVotesPercentage,votes,dicofre
Olhão,PS,33.18,1002,081003
Olhão,PPD/PSD.CDS-PP,20.73,626,081003
Olhão,PCP-PEV,15.96,482,081003
Olhão,B.E.,9.14,276,081003
Olhão,MPT,7.48,226,081003
Olhão,PCTP/MRPP,4.27,129,081003
Olhão,PAN,2.88,87,081003
Olhão,L,2.48,75,081003
Olhão,PPM,0.7,21,081003
Olhão,PND,0.66,20,081003
Olhão,PTP,0.66,20,081003
Olhão,MAS,0.53,16,081003
Olhão,PPV,0.5,15,081003
Olhão,PNR,0.46,14,081003
Olhão,PDA,0.26,8,081003
Olhão,POUS,0.1,3,081003
