freguesia,acronym,validVotesPercentage,votes,dicofre
Ventosa,PS,49.75,494,110113
Ventosa,PPD/PSD,23.06,229,110113
Ventosa,B.E.,7.25,72,110113
Ventosa,PCP-PEV,6.55,65,110113
Ventosa,CDS-PP,4.03,40,110113
Ventosa,PAN,2.22,22,110113
Ventosa,PCTP/MRPP,1.21,12,110113
Ventosa,CH,1.11,11,110113
Ventosa,A,0.91,9,110113
Ventosa,L,0.91,9,110113
Ventosa,IL,0.6,6,110113
Ventosa,R.I.R.,0.6,6,110113
Ventosa,PNR,0.5,5,110113
Ventosa,PPM,0.4,4,110113
Ventosa,PDR,0.3,3,110113
Ventosa,PTP,0.3,3,110113
Ventosa,MPT,0.1,1,110113
Ventosa,NC,0.1,1,110113
Ventosa,PURP,0.1,1,110113
Ventosa,MAS,0,0,110113
