freguesia,acronym,validVotesPercentage,votes,dicofre
Santa Bárbara de Nexe,PS,34.65,290,080503
Santa Bárbara de Nexe,PPD/PSD,18.76,157,080503
Santa Bárbara de Nexe,PCP-PEV,16.97,142,080503
Santa Bárbara de Nexe,B.E.,11.59,97,080503
Santa Bárbara de Nexe,PAN,5.02,42,080503
Santa Bárbara de Nexe,CDS-PP,4.42,37,080503
Santa Bárbara de Nexe,L,1.79,15,080503
Santa Bárbara de Nexe,PCTP/MRPP,1.55,13,080503
Santa Bárbara de Nexe,NC,1.43,12,080503
Santa Bárbara de Nexe,PPM.PPV/CDC,1.43,12,080503
Santa Bárbara de Nexe,A,0.84,7,080503
Santa Bárbara de Nexe,PNR,0.72,6,080503
Santa Bárbara de Nexe,PDR,0.24,2,080503
Santa Bárbara de Nexe,PURP,0.24,2,080503
Santa Bárbara de Nexe,IL,0.12,1,080503
Santa Bárbara de Nexe,MAS,0.12,1,080503
Santa Bárbara de Nexe,PTP,0.12,1,080503
