Objeto do Contrato,Tipo de Procedimento,Tipo(s) de Contrato,CPVs,Entidade(s) Adjudicante(s),Entidade(s) Adjudicatária(s),Preço Contratual,Data de Publicação,Data de Celebração do Contrato,Prazo de Execução,Local de Execução,Fundamentação,Data de Fecho do Contrato,Preço Total Efetivo,Causas das Alterações ao Prazo,Causas das Alterações ao Preço,Estado,N.º registo do Acordo Quadro,Descrição do Acordo Quadro,Procedimento Centralizado
Próteses Vasculares,Concurso público,Aquisição de bens móveis,"33140000-3, Material médico de consumo","Centro Hospitalar de Lisboa Central, E.P.E. (CHLC) (508080142)",Getinge Group (506819698),"14.500,00 €",21-12-2016,13-12-2016,13 dias,"Portugal, Lisboa, Lisboa","Artigo 20.º, n.º 1, alínea b) do Código dos Contratos Públicos",,,,,,Não aplicável.,Não aplicável.,FALSE
Próteses Vasculares,Concurso público,Aquisição de bens móveis,"33140000-3, Material médico de consumo","Centro Hospitalar de Lisboa Central, E.P.E. (CHLC) (508080142)",Medicinália-Cormédica (500684324),"113.308,00 €",21-12-2016,13-12-2016,13 dias,"Portugal, Lisboa, Lisboa","Artigo 20.º, n.º 1, alínea b) do Código dos Contratos Públicos",,,,,,Não aplicável.,Não aplicável.,FALSE
Próteses Vasculares,Concurso público,Aquisição de bens móveis,"33140000-3, Material médico de consumo","Centro Hospitalar de Lisboa Central, E.P.E. (CHLC) (508080142)","LusoPalex, Lda. (503531588)","29.020,00 €",21-12-2016,13-12-2016,19 dias,"Portugal, Lisboa, Lisboa","Artigo 20.º, n.º 1, alínea b) do Código dos Contratos Públicos",,,,,,Não aplicável.,Não aplicável.,FALSE
Luvas de exame de nitrilo,Concurso público,Aquisição de bens móveis,"33140000-3, Material médico de consumo","Centro Hospitalar de Lisboa Central, E. P. E. (508080142)","NORMAX - FABRICA DE VIDROS CIENTIFICOS, LDA (500203130)","149.548,00 €",21-12-2016,13-12-2016,18 dias,"Portugal, Lisboa, Lisboa","Artigo 20.º, n.º 1, alínea b) do Código dos Contratos Públicos",,,,,,Não aplicável.,Não aplicável.,FALSE
Aquisição de Trastuzumab emtansina 100mg pó conc sol inj fr IV,Ajuste Direto Regime Geral,Aquisição de bens móveis,"33000000-0, Equipamento médico, medicamentos e produtos para cuidados pessoais","Centro Hospitalar de Lisboa Central, E. P. E. (508080142)","Roche Farmacêutica Quimica, Lda (500233810)","25.327,50 €",20-12-2016,14-12-2016,17 dias,"Portugal, Lisboa, Lisboa","Artigo 24.º, n.º 1, alínea e) do Código dos Contratos Públicos",,,,,,Não aplicável.,Não aplicável.,FALSE
Hemofiltros e Kits de Cardioplegia,Concurso público,Aquisição de bens móveis,"33190000-8, Dispositivos e produtos médicos variados","Centro Hospitalar de Lisboa Central, E. P. E. (508080142)",Medtronic Portugal (504223933),"61.600,00 €",19-12-2016,24-11-2016,38 dias,"Portugal, Lisboa, Lisboa","Artigo 20.º, n.º 1, alínea b) do Código dos Contratos Públicos",,,,,,Não aplicável.,Não aplicável.,FALSE
Hemofiltros e Kits de Cardioplegia,Concurso público,Aquisição de bens móveis,"33190000-8, Dispositivos e produtos médicos variados","Centro Hospitalar de Lisboa Central, E. P. E. (508080142)",Lusopalex (503531588),"43.920,00 €",19-12-2016,24-11-2016,38 dias,"Portugal, Lisboa, Lisboa","Artigo 20.º, n.º 1, alínea b) do Código dos Contratos Públicos",,,,,,Não aplicável.,Não aplicável.,FALSE
Oxigenadores de Membrana Adulto,Concurso público,Aquisição de bens móveis,"33186100-8, Oxigenador","Centro Hospitalar de Lisboa Central, E. P. E. (508080142)",Medtronic Portugal (504223933),"43.800,00 €",19-12-2016,24-11-2016,38 dias,"Portugal, Lisboa, Lisboa","Artigo 20.º, n.º 1, alínea b) do Código dos Contratos Públicos",,,,,,Não aplicável.,Não aplicável.,FALSE
Oxigenadores de Membrana Adulto,Concurso público,Aquisição de bens móveis,"33186100-8, Oxigenador","Centro Hospitalar de Lisboa Central, E. P. E. (508080142)",Lusopalex (503531588),"136.890,00 €",19-12-2016,24-11-2016,38 dias,"Portugal, Lisboa, Lisboa","Artigo 20.º, n.º 1, alínea b) do Código dos Contratos Públicos",,,,,,Não aplicável.,Não aplicável.,FALSE
"Oxigenadores de Membrana Infantil, Neonatal e Pediátrico.",Concurso público,Aquisição de bens móveis,"33186100-8, Oxigenador","Centro Hospitalar de Lisboa Central, E. P. E. (508080142)",Lusopalex (503531588),"4.500,00 €",19-12-2016,28-10-2016,64 dias,"Portugal, Lisboa, Lisboa","Artigo 20.º, n.º 1, alínea b) do Código dos Contratos Públicos",,,,,,Não aplicável.,Não aplicável.,FALSE
Material de Perfusão para Assistência Cardiopulmonar,Concurso público,Aquisição de bens móveis,"33190000-8, Dispositivos e produtos médicos variados","Centro Hospitalar de Lisboa Central, E. P. E. (508080142)",Medtronic Portugal (504223933),"390,00 €",19-12-2016,28-10-2016,64 dias,"Portugal, Lisboa, Lisboa","Artigo 20.º, n.º 1, alínea b) do Código dos Contratos Públicos",,,,,,Não aplicável.,Não aplicável.,FALSE
Material de Perfusão para Assistência Cardiopulmonar,Concurso público,Aquisição de bens móveis,"33190000-8, Dispositivos e produtos médicos variados","Centro Hospitalar de Lisboa Central, E. P. E. (508080142)",Medicinália Cormédica (500684324),"10.305,75 €",19-12-2016,12-12-2016,20 dias,"Portugal, Lisboa, Lisboa","Artigo 20.º, n.º 1, alínea b) do Código dos Contratos Públicos",,,,,,Não aplicável.,Não aplicável.,FALSE
Material de Perfusão para Assistência Cardiopulmonar,Concurso público,Aquisição de bens móveis,"33190000-8, Dispositivos e produtos médicos variados","Centro Hospitalar de Lisboa Central, E. P. E. (508080142)",St. Jude  Medical Portugal (504180746),"65.812,50 €",19-12-2016,24-11-2016,38 dias,"Portugal, Lisboa, Lisboa","Artigo 20.º, n.º 1, alínea b) do Código dos Contratos Públicos",,,,,,Não aplicável.,Não aplicável.,FALSE
Kits de Trombectomia,Concurso público,Aquisição de bens móveis,"33140000-3, Material médico de consumo","Centro Hospitalar de Lisboa Central, E. P. E. (508080142)",Penumbra Europe Gmbh (815054796),"206.250,00 €",19-12-2016,14-12-2016,18 dias,"Portugal, Lisboa, Lisboa","Artigo 20.º, n.º 1, alínea b) do Código dos Contratos Públicos",,,,,,Não aplicável.,Não aplicável.,FALSE
510916/16 - Aquisição de Adalimumab 40 mg / 0.4 ml sol. inj. caneta 0.4 ml SC,Ao abrigo de acordo-quadro (art.º 259.º),Aquisição de bens móveis,"33600000-6, Produtos farmacêuticos","Centro Hospitalar de Lisboa Central, E.P.E. (CHLC) (508080142)","ABBVIE, LDA (510229050)","630.903,00 €",19-12-2016,14-12-2016,30 dias,"Portugal, Lisboa, Lisboa",Artigo 259.º do Código dos Contratos Públicos,,,,,,1771819,CP 2015/6 - Acordo quadro para o fornecimento de Medicamentos do Foro Oncológico,FALSE
510884/16 -Aquisição de Ustecinumab 45 mg / 0.5 ml sol. inj. ser. 0.5 ml SC,Ao abrigo de acordo-quadro (art.º 259.º),Aquisição de bens móveis,"33600000-6, Produtos farmacêuticos","Centro Hospitalar de Lisboa Central, E.P.E. (CHLC) (508080142)","Janssen Cilag Farmacêutica, Lda (500189412)","376.789,50 €",16-12-2016,16-12-2016,30 dias,"Portugal, Lisboa, Lisboa",Artigo 259.º do Código dos Contratos Públicos,,,,,,1771819,CP 2015/6 - Acordo quadro para o fornecimento de Medicamentos do Foro Oncológico,FALSE
410702/16 - Aquisição de Ombitasvir 12.5 mg + Paritaprevir 75 mg + Ritonavir 50 mg comp. e Dasabuvir 250 mg comp.,Ajuste Direto Regime Geral,Aquisição de bens móveis,"33600000-6, Produtos farmacêuticos","Centro Hospitalar de Lisboa Central, E.P.E. (CHLC) (508080142)","ABBVIE,LDA                                         (510229050)","16.064,01 €",15-12-2016,15-12-2016,84 dias,"Portugal, Lisboa, Lisboa","Artigo 24.º, n.º 1, alínea e) do Código dos Contratos Públicos",,,,,,Não aplicável.,Não aplicável.,FALSE
PENSO CIRURGICO ADESIVO TRANSPARENTE ESTÉRIL S/COMPRESSA 10 X 12CM,Ajuste Direto Regime Geral,Aquisição de bens móveis,"33140000-3, Material médico de consumo","Centro Hospitalar de Lisboa Central, E. P. E. (508080142)",Minnesota 3 M (500193940),"3.663,36 €",15-12-2016,01-02-2016,90 dias,"Portugal, Lisboa, Lisboa","Artigo 24.º, n.º 1, alínea c) do Código dos Contratos Públicos",,,,,,Não aplicável.,Não aplicável.,FALSE
Pensos para queimados,Ajuste Direto Regime Geral,Aquisição de bens móveis,"33100000-1, Equipamento médico","Centro Hospitalar de Lisboa Central, E.P.E. (CHLC) (508080142)","Bastos Viegas, S.A. (500042772)","1.968,00 €",13-12-2016,13-12-2016,18 dias,"Portugal, Lisboa, Lisboa","Artigo 20.º, n.º 1, alínea a) do Código dos Contratos Públicos",,,,,,Não aplicável.,Não aplicável.,FALSE
Pensos para queimados,Ajuste Direto Regime Geral,Aquisição de bens móveis,"33100000-1, Equipamento médico","Centro Hospitalar de Lisboa Central, E.P.E. (CHLC) (508080142)","DOCWORLD, Lda (508592909)","675,00 €",13-12-2016,13-12-2016,18 dias,"Portugal, Lisboa, Lisboa","Artigo 20.º, n.º 1, alínea a) do Código dos Contratos Públicos",,,,,,Não aplicável.,Não aplicável.,FALSE
Compressas de tecido não tecido,Ajuste Direto Regime Geral,Aquisição de bens móveis,"33140000-3, Material médico de consumo","Centro Hospitalar de Lisboa Central, E.P.E. (CHLC) (508080142)",BASTOS VIEGAS SA (500042772),"5.593,20 €",13-12-2016,08-11-2016,44 dias,"Portugal, Lisboa, Lisboa","Artigo 20.º, n.º 1, alínea a) do Código dos Contratos Públicos",,,,,,Não aplicável.,Não aplicável.,FALSE
Compressas de tecido não tecido,Ajuste Direto Regime Geral,Aquisição de bens móveis,"33140000-3, Material médico de consumo","Centro Hospitalar de Lisboa Central, E.P.E. (CHLC) (508080142)","Silva, Gomes & Moura, Lda. (513835717)","44.715,80 €",13-12-2016,17-11-2016,44 dias,"Portugal, Lisboa, Lisboa","Artigo 20.º, n.º 1, alínea a) do Código dos Contratos Públicos",,,,,,Não aplicável.,Não aplicável.,FALSE
510928/16 - Aquisição de Micofenolato de mofetil 500 mg pó sol. inj. fr. IV,Ao abrigo de acordo-quadro (art.º 259.º),Aquisição de bens móveis,"33600000-6, Produtos farmacêuticos","Centro Hospitalar de Lisboa Central, E. P. E. (508080142)","ROCHE FARMACÊUTICA QUIMICA, LDA.                   (500233810)","1.773,75 €",12-12-2016,12-12-2016,30 dias,"Portugal, Lisboa, Lisboa",Artigo 259.º do Código dos Contratos Públicos,,,,,,1771819,CP 2015/6 - Acordo quadro para o fornecimento de Medicamentos do Foro Oncológico,FALSE
