Objeto do Contrato,Tipo de Procedimento,Tipo(s) de Contrato,CPVs,Entidade(s) Adjudicante(s),Entidade(s) Adjudicatária(s),Preço Contratual,Data de Publicação,Data de Celebração do Contrato,Prazo de Execução,Local de Execução,Fundamentação,Data de Fecho do Contrato,Preço Total Efetivo,Causas das Alterações ao Prazo,Causas das Alterações ao Preço,Estado,N.º registo do Acordo Quadro,Descrição do Acordo Quadro,Procedimento Centralizado
Assessoria de comunicação,Ajuste Direto Regime Geral,Aquisição de serviços,"79000000-4, Serviços a empresas: direito, comercialização, consultoria, recrutamento, impressão e segurança","Centro Hospitalar Póvoa de Varzim - Vila do Conde, E. P. E. (508741823)","CONNECT GENERATION-COMUNICAÇÃO E IMAGEM, LDA (509408800)","17.100,00 €",16-01-2017,16-11-2016,365 dias,"Portugal, Porto, Póvoa de Varzim","Artigo 24.º, n.º 1, alínea e) do Código dos Contratos Públicos",,,,,,Não aplicável.,Não aplicável.,FALSE
manutenção do Datacenter,Ajuste Direto Regime Geral,Aquisição de serviços,"50000000-5, Serviços de reparação e manutenção","Centro Hospitalar Póvoa de Varzim - Vila do Conde, E. P. E. (508741823)","ATM - SIST.INFORMAÇÃO SERVIÇOS, SA (509784267)","8.924,00 €",16-01-2017,01-01-2017,365 dias,"Portugal, Porto, Póvoa de Varzim","Artigo 20.º, n.º 1, alínea a) do Código dos Contratos Públicos",,,,,,Não aplicável.,Não aplicável.,FALSE
manutenção do software de gestão da formação Bestgest,Ajuste Direto Regime Geral,Aquisição de serviços,"50000000-5, Serviços de reparação e manutenção","Centro Hospitalar Póvoa de Varzim - Vila do Conde, E. P. E. (508741823)","Vertiriva, Lda (508186994)","590,00 €",16-01-2017,01-01-2017,365 dias,"Portugal, Porto, Póvoa de Varzim","Artigo 24.º, n.º 1, alínea e) do Código dos Contratos Públicos",,,,,,Não aplicável.,Não aplicável.,FALSE
Prestação de serviço de assistência técnica ao instrumental cirúrgico,Ajuste Direto Regime Geral,Aquisição de serviços,"50000000-5, Serviços de reparação e manutenção","Centro Hospitalar Póvoa de Varzim - Vila do Conde, E. P. E. (508741823)",Albersou Unipessoal Lda (507566025),"8.400,00 €",16-01-2017,01-01-2017,365 dias,"Portugal, Porto, Póvoa de Varzim","Artigo 24.º, n.º 1, alínea e) do Código dos Contratos Públicos",,,,,,Não aplicável.,Não aplicável.,FALSE
