Objeto do Contrato,Tipo de Procedimento,Tipo(s) de Contrato,CPVs,Entidade(s) Adjudicante(s),Entidade(s) Adjudicatária(s),Preço Contratual,Data de Publicação,Data de Celebração do Contrato,Prazo de Execução,Local de Execução,Fundamentação,Data de Fecho do Contrato,Preço Total Efetivo,Causas das Alterações ao Prazo,Causas das Alterações ao Preço,Estado,N.º registo do Acordo Quadro,Descrição do Acordo Quadro,Procedimento Centralizado
Aquisição de Material de Saúde Oral ao abrigo do CPA 210/2017,Ao abrigo de acordo-quadro (art.º 259.º),Aquisição de bens móveis,"33100000-1, Equipamento médico","Administração Regional de Saúde do Algarve, I. P. (503148709)","BASTOS VIEGAS,SA (500042772)","98,22 €",11-01-2018,11-12-2017,20 dias,"Portugal, Faro, Faro",Artigo 259.º do Código dos Contratos Públicos,29-12-2017,"98,22 €",,,,2727469,CP 2017/210 - Acordo Quadro para Fornecimento de Dispositivos Médicos de Saúde Oral às Instituições e Serviços do Serviço Nacional de Saúde,FALSE
Aquisição de Material de Saúde Oral ao abrigo do CPA 210/2017,Ao abrigo de acordo-quadro (art.º 259.º),Aquisição de bens móveis,"33100000-1, Equipamento médico","Administração Regional de Saúde do Algarve, I. P. (503148709)","B. Braun Medical, Lda. (501506543)","704,44 €",11-01-2018,11-12-2017,20 dias,"Portugal, Faro, Faro",Artigo 259.º do Código dos Contratos Públicos,29-12-2017,"704,44 €",,,,2727469,CP 2017/210 - Acordo Quadro para Fornecimento de Dispositivos Médicos de Saúde Oral às Instituições e Serviços do Serviço Nacional de Saúde,FALSE
