freguesia,acronym,validVotesPercentage,votes,dicofre
Pedro Miguel,PPD/PSD,38.96,97,470109
Pedro Miguel,PS,38.15,95,470109
Pedro Miguel,B.E.,7.63,19,470109
Pedro Miguel,CDS-PP,5.62,14,470109
Pedro Miguel,PCP-PEV,5.62,14,470109
Pedro Miguel,L,0.8,2,470109
Pedro Miguel,PAN,0.8,2,470109
Pedro Miguel,PPM,0.8,2,470109
Pedro Miguel,PTP,0.8,2,470109
Pedro Miguel,A,0.4,1,470109
Pedro Miguel,PCTP/MRPP,0.4,1,470109
Pedro Miguel,CH,0,0,470109
Pedro Miguel,IL,0,0,470109
Pedro Miguel,MAS,0,0,470109
Pedro Miguel,MPT,0,0,470109
Pedro Miguel,PDR,0,0,470109
Pedro Miguel,PNR,0,0,470109
