Objeto do Contrato,Tipo de Procedimento,Tipo(s) de Contrato,CPVs,Entidade(s) Adjudicante(s),Entidade(s) Adjudicatária(s),Preço Contratual,Data de Publicação,Data de Celebração do Contrato,Prazo de Execução,Local de Execução,Fundamentação,Data de Fecho do Contrato,Preço Total Efetivo,Causas das Alterações ao Prazo,Causas das Alterações ao Preço,Estado,N.º registo do Acordo Quadro,Descrição do Acordo Quadro,Procedimento Centralizado
"Aquisição de  Equipamento hospitalar para unidade de esterilização: Autoclave,  Maquina de lavar instrumentos e diversos ",Concurso público,Aquisição de bens móveis,"33191000-5, Aparelhos para esterilização, desinfecção e higiene","Centro Hospitalar Póvoa de Varzim - Vila do Conde, E. P. E. (508741823)","EUROCASMEDICA - PRODUTOS HOSPITALARES,SA (503322105)","4.940,00 €",10-10-2017,26-09-2017,82 dias,"Portugal, Porto, Póvoa de Varzim","Artigo 20.º, n.º 2, alínea a) do Código dos Contratos Públicos",,,,,,Não aplicável.,Não aplicável.,FALSE
"Aquisição de Seguros de Acidentes de Trabalho para o CHPVVC, EPE.",Ajuste Direto Regime Geral,Aquisição de serviços,"66510000-8, Serviços de seguros","Centro Hospitalar Póvoa de Varzim - Vila do Conde, E. P. E. (508741823)","POPULAR SEGUROS - COMPANHIA DE SEGUROS, S.A (507592034)","149.002,16 €",04-10-2017,30-12-2016,360 dias,"Portugal, Porto, Póvoa de Varzim","Artigo 24.º, n.º 1, alínea b) do Código dos Contratos Públicos",,,,,,Não aplicável.,Não aplicável.,FALSE
"Aquisição de equipamento informático para o CHPVVC, EPE.",Ajuste Direto Regime Geral,Aquisição de bens móveis,"30230000-0, Equipamento informático","Centro Hospitalar Póvoa de Varzim - Vila do Conde, E. P. E. (508741823)",Base 2 (501333401),"78.400,00 €",03-10-2017,08-06-2017,207 dias,"Portugal, Porto, Póvoa de Varzim",Artigo 258.º do Código dos Contratos Públicos,,,,,,Não aplicável.,Não aplicável.,FALSE
Aquisição de Equipamento e instrumental Cirurgico para Ginecologia.,Ajuste Direto Regime Geral,Aquisição de bens móveis,"33100000-1, Equipamento médico","Centro Hospitalar Póvoa de Varzim - Vila do Conde, E. P. E. (508741823)","BACELAR E IRMÃO, LDA (500532818)","28,72 €",03-10-2017,10-03-2017,297 dias,"Portugal, Porto, Póvoa de Varzim","Artigo 20.º, n.º 1, alínea a) do Código dos Contratos Públicos",,,,,,Não aplicável.,Não aplicável.,FALSE
Aquisição de equipamento e instrumental cirurgico para a especialidade de Ginecologia.,Ajuste Direto Regime Geral,Aquisição de bens móveis,"33100000-1, Equipamento médico","Centro Hospitalar Póvoa de Varzim - Vila do Conde, E. P. E. (508741823)","RMV - Produtos Hospitalares, S.A. (507866347)","575,38 €",03-10-2017,10-03-2017,297 dias,"Portugal, Porto, Póvoa de Varzim","Artigo 20.º, n.º 1, alínea a) do Código dos Contratos Públicos",,,,,,Não aplicável.,Não aplicável.,FALSE
Aquisição de equipamento e instrumental Cirurgico para a especialidade de Ginecologia para o CHPVVC.,Ajuste Direto Regime Geral,Aquisição de bens móveis,"33140000-3, Material médico de consumo","Centro Hospitalar Póvoa de Varzim - Vila do Conde, E. P. E. (508741823)","EUROCASMEDICA - PRODUTOS HOSPITALARES,SA (503322105)","40,00 €",03-10-2017,10-03-2017,297 dias,"Portugal, Porto, Póvoa de Varzim","Artigo 20.º, n.º 1, alínea a) do Código dos Contratos Públicos",,,,,,Não aplicável.,Não aplicável.,FALSE
"Aquisição de equipamento e instrumental cirurgico para o CHPVVC, EPE.",Ajuste Direto Regime Geral,Aquisição de bens móveis,"33140000-3, Material médico de consumo","Centro Hospitalar Póvoa de Varzim - Vila do Conde, E. P. E. (508741823)","EUROCASMEDICA - PRODUTOS HOSPITALARES,SA (503322105)","11.821,80 €",03-10-2017,10-03-2017,297 dias,"Portugal, Porto, Póvoa de Varzim","Artigo 20.º, n.º 1, alínea a) do Código dos Contratos Públicos",,,,,,Não aplicável.,Não aplicável.,FALSE
