Objeto do Contrato,Tipo de Procedimento,Tipo(s) de Contrato,CPVs,Entidade(s) Adjudicante(s),Entidade(s) Adjudicatária(s),Preço Contratual,Data de Publicação,Data de Celebração do Contrato,Prazo de Execução,Local de Execução,Fundamentação,Data de Fecho do Contrato,Preço Total Efetivo,Causas das Alterações ao Prazo,Causas das Alterações ao Preço,Estado,N.º registo do Acordo Quadro,Descrição do Acordo Quadro,Procedimento Centralizado
Aquisição de material de consumo na categoria de manutenção para animais,Ajuste Direto Regime Geral,Aquisição de bens móveis,"15700000-5, Alimentos para animais","Instituto Nacional de Saúde Doutor Ricardo Jorge, I. P. (501427511)",Ultragene (508797527),"8.809,80 €",01-10-2015,21-05-2015,300 dias,"Portugal, Lisboa, Lisboa","Artigo 20.º, n.º 1, alínea a) do Código dos Contratos Públicos",,,,,,Não aplicável.,Não aplicável.,FALSE
Aquisição da unidade de climatização para o INSA,Concurso público,Aquisição de bens móveis,"39717200-3, Aparelhos de ar condicionado","Instituto Nacional de Saúde Dr. Ricardo Jorge, I. P. (501427511)","SorJeclima Montagens e Reparação, Lda (508565839)","15.498,98 €",01-10-2015,28-11-2014,90 dias,"Portugal, Lisboa, Lisboa<BR/>Portugal, Porto, Porto<BR/>Portugal, Setúbal, Setúbal","Artigo 20.º, n.º 1, alínea b) do Código dos Contratos Públicos",,,,,,Não aplicável.,Não aplicável.,FALSE
Aquisição da unidade de climatização para o INSA,Concurso público,Aquisição de bens móveis,"39717200-3, Aparelhos de ar condicionado","Instituto Nacional de Saúde Dr. Ricardo Jorge, I. P. (501427511)",Sistavac SA (502808004),"54.994,41 €",01-10-2015,28-11-2014,90 dias,"Portugal, Lisboa, Lisboa<BR/>Portugal, Setúbal, Setúbal<BR/>Portugal, Porto, Porto","Artigo 20.º, n.º 1, alínea b) do Código dos Contratos Públicos",,,,,,Não aplicável.,Não aplicável.,FALSE
Aquisição de equipamento para fins exclusivos de investigação,Ajuste Direto Regime Geral,Aquisição de bens móveis,"38400000-9, Instrumentos para controlo de propriedades físicas","Instituto Nacional de Saúde Doutor Ricardo Jorge, I. P. (501427511)","Fisher Scientific, Lda (506429210)","456,00 €",01-10-2015,31-03-2015,10 dias,"Portugal, Lisboa, Lisboa","Artigo 26.º, n.º 1, alínea b) do Código dos Contratos Públicos",,,,,,Não aplicável.,Não aplicável.,FALSE
Aquisição de material de consumo clinico - para projeto,Ajuste Direto Regime Geral,Aquisição de bens móveis,"33631600-8, Anti-sépticos e desinfectantes","Instituto Nacional de Saúde Doutor Ricardo Jorge, I. P. (501427511)","B Braun Medical, Lda (501506543)","75,00 €",01-10-2015,02-03-2015,20 dias,"Portugal, Lisboa, Lisboa","Artigo 26.º, n.º 1, alínea b) do Código dos Contratos Públicos",,,,,,Não aplicável.,Não aplicável.,FALSE
Aquisição de toner's para impressora RISO,Ajuste Direto Regime Geral,Aquisição de bens móveis,"30125110-5, Tóner para impressoras laser e aparelhos de fax","Instituto Nacional de Saúde Doutor Ricardo Jorge, I. P. (501427511)","RISO IBÉRICA, SA - FILIAL EM PORTUGAL (980087783)","449,00 €",01-10-2015,19-02-2015,15 dias,"Portugal, Lisboa, Lisboa","Artigo 20.º, n.º 1, alínea a) do Código dos Contratos Públicos",,,,,,Não aplicável.,Não aplicável.,FALSE
Aquisição de reagentes hematológicos do INSA,Ajuste Direto Regime Geral,Aquisição de bens móveis,"33100000-1, Equipamento médico","Instituto Nacional de Saúde Doutor Ricardo Jorge, I. P. (501427511)","ILC Instrumentos laboratório Científicos, Lda (500948208)","342,00 €",01-10-2015,24-09-2015,90 dias,"Portugal, Lisboa, Lisboa","Artigo 20.º, n.º 1, alínea a) do Código dos Contratos Públicos",,,,,,Não aplicável.,Não aplicável.,FALSE
Ações de formação 2015 no INSA,Ajuste Direto Regime Geral,Aquisição de serviços,"80530000-8, Serviços de formação profissional","Instituto Nacional de Saúde Doutor Ricardo Jorge, I. P. (501427511)","Gesperitus - Consultoria de Gestão e formação, Lda (507346874)","1.440,00 €",01-10-2015,28-09-2015,90 dias,"Portugal, Setúbal, Setúbal<BR/>Portugal, Lisboa, Lisboa<BR/>Portugal, Porto, Porto","Artigo 20.º, n.º 1, alínea a) do Código dos Contratos Públicos",,,,,,Não aplicável.,Não aplicável.,FALSE
Aquisição de peças/acessórios para colocação em elevadores,Ajuste Direto Regime Geral,Aquisição de bens móveis,"42419510-4, Peças para elevadores",Instituto Nacional de Saúde Dr.Ricardo Jorge(INSA) (501427511),ThyssenKrupp Elevadores (501445226),"664,50 €",01-10-2015,01-09-2015,30 dias,"Portugal, Porto, Porto","Artigo 26.º, n.º 1, alínea a) do Código dos Contratos Públicos",,,,,,Não aplicável.,Não aplicável.,FALSE
Aquisição de peças/acessórios para colocação em elevadores,Ajuste Direto Regime Geral,Aquisição de bens móveis,"42419510-4, Peças para elevadores",Instituto Nacional de Saúde Dr.Ricardo Jorge(INSA) (501427511),ThyssenKrupp Elevadores (501445226),"4.708,00 €",01-10-2015,01-09-2015,30 dias,"Portugal, Lisboa, Lisboa","Artigo 26.º, n.º 1, alínea a) do Código dos Contratos Públicos",,,,,,Não aplicável.,Não aplicável.,FALSE
Aquisição de reagentes,Ajuste Direto Regime Geral,Aquisição de bens móveis,"33696000-5, Reagentes e meios de contraste","Instituto Nacional de Saúde Doutor Ricardo Jorge, I. P. (501427511)",Sigma Aldrich (980148820),"380,00 €",01-10-2015,01-09-2015,157 dias,"Portugal, Lisboa, Lisboa","Artigo 20.º, n.º 1, alínea a) do Código dos Contratos Públicos",,,,,,Não aplicável.,Não aplicável.,FALSE
Aquisição e colocação de filtros para Autoanalisador,Ajuste Direto Regime Geral,Aquisição de bens móveis,"38434000-6, Analisadores",Instituto Nacional de Saúde Dr.Ricardo Jorge(INSA) (501427511),TECNILAB PORTUGAL (500758158),"766,60 €",01-10-2015,27-08-2015,60 dias,"Portugal, Lisboa, Lisboa","Artigo 20.º, n.º 1, alínea a) do Código dos Contratos Públicos",,,,,,Não aplicável.,Não aplicável.,FALSE
Aquisição de serviços para inicio de procedimento tendente à requisição de serviços do INSA,Ajuste Direto Regime Geral,Aquisição de serviços,"50000000-5, Serviços de reparação e manutenção","Instituto Nacional de Saúde Doutor Ricardo Jorge, I. P. (501427511)",Direcção Geral de Qualificação dos Trabalhadores em Funções Publicas -INA  (600084876),"280,00 €",01-10-2015,29-09-2015,90 dias,"Portugal, Lisboa, Lisboa","Artigo 20.º, n.º 1, alínea a) do Código dos Contratos Públicos",,,,,,Não aplicável.,Não aplicável.,FALSE
Aquisição de serviços de manutenção/assistência técnica dos microscópios e lupas,Ajuste Direto Regime Geral,Aquisição de serviços,"50400000-9, Serviços de reparação e manutenção de equipamento médico e de precisão",Instituto Nacional de Saúde Dr.Ricardo Jorge(INSA) (501427511),Duarte Nuno Lopes Clara (221913408),"5.330,00 €",01-10-2015,28-05-2015,270 dias,"Portugal, Setúbal, Setúbal<BR/>Portugal, Lisboa, Lisboa<BR/>Portugal, Porto, Porto","Artigo 20.º, n.º 1, alínea a) do Código dos Contratos Públicos",,,,,,Não aplicável.,Não aplicável.,FALSE
"20150115 - Aquisição de reagentes para consumo no DDI do INSA, I.P.",Ajuste Direto Regime Geral,Aquisição de bens móveis,"33696500-0, Reagentes de laboratório","Instituto Nacional de Saúde Doutor Ricardo Jorge, I. P. (501427511)","Magnamed, Comercialização de Produtos Médicos, lda (503640476)","2.772,00 €",01-10-2015,24-02-2015,2 dias,"Portugal, Lisboa, Lisboa","Artigo 20.º, n.º 1, alínea a) do Código dos Contratos Públicos",,,,,,Não aplicável.,Não aplicável.,FALSE
Aquisição de tinteiros para impressora Riso,Ajuste Direto Regime Geral,Aquisição de bens móveis,"30125120-8, Tóner para fotocopiadoras","Instituto Nacional de Saúde Doutor Ricardo Jorge, I. P. (501427511)","RISO IBÉRICA, S.A. FILIAL EM PORTUGAL (980087783)","2.767,00 €",01-10-2015,30-07-2015,2 dias,"Portugal, Lisboa, Lisboa","Artigo 20.º, n.º 1, alínea a) do Código dos Contratos Públicos",,,,,,Não aplicável.,Não aplicável.,FALSE
"20150141 - Aquisição de reagentes para o DDI do INSA, I.P.",Ajuste Direto Regime Geral,Aquisição de bens móveis,"33696500-0, Reagentes de laboratório","Instituto Nacional de Saúde Doutor Ricardo Jorge, I. P. (501427511)","Fisher Scienetific Unipessoal, Lda (506429210)","730,00 €",01-10-2015,24-02-2015,2 dias,"Portugal, Lisboa, Lisboa","Artigo 20.º, n.º 1, alínea a) do Código dos Contratos Públicos",,,,,,Não aplicável.,Não aplicável.,FALSE
Aquisição de reagentes,Concurso público,Aquisição de bens móveis,"33696500-0, Reagentes de laboratório","Instituto Nacional de Saúde Dr. Ricardo Jorge, I. P. (501427511)",Bioportugal - Químico e Farmacêutica Lda (502380543),"11.473,00 €",30-09-2015,09-06-2015,311 dias,"Portugal, Lisboa, Lisboa","Artigo 20.º, n.º 1, alínea b) do Código dos Contratos Públicos",,,,,,Não aplicável.,Não aplicável.,FALSE
Aquisição de reagentes,Concurso público,Aquisição de bens móveis,"33696500-0, Reagentes de laboratório","Instituto Nacional de Saúde Dr. Ricardo Jorge, I. P. (501427511)",Quilaban - Química Laboratorial Analítica Lda (500399670),"15.519,50 €",30-09-2015,09-06-2015,311 dias,"Portugal, Lisboa, Lisboa","Artigo 20.º, n.º 1, alínea b) do Código dos Contratos Públicos",,,,,,Não aplicável.,Não aplicável.,FALSE
Aquisição de reagentes,Concurso público,Aquisição de bens móveis,"33696500-0, Reagentes de laboratório","Instituto Nacional de Saúde Dr. Ricardo Jorge, I. P. (501427511)",Diagnóstica Longwood S.L. (980475554),"11.360,00 €",30-09-2015,09-06-2015,311 dias,"Portugal, Lisboa, Lisboa","Artigo 20.º, n.º 1, alínea b) do Código dos Contratos Públicos",,,,,,Não aplicável.,Não aplicável.,FALSE
Aquisição de reagentes,Concurso público,Aquisição de bens móveis,"33696500-0, Reagentes de laboratório","Instituto Nacional de Saúde Dr. Ricardo Jorge, I. P. (501427511)","Werfen Portugal, Lda (501086110)","18.611,09 €",30-09-2015,09-06-2015,311 dias,"Portugal, Lisboa, Lisboa","Artigo 20.º, n.º 1, alínea b) do Código dos Contratos Públicos",,,,,,Não aplicável.,Não aplicável.,FALSE
Aquisição de peças para reparação dos elevadores do INSA,Ajuste Direto Regime Geral,Aquisição de bens móveis,"33100000-1, Equipamento médico","Instituto Nacional de Saúde Doutor Ricardo Jorge, I. P. (501427511)","SCHINDLER - ASCENSORES E ESCADAS ROLANTES, S.A. (502353740)","584,97 €",30-09-2015,31-12-2014,90 dias,"Portugal, Porto, Porto","Artigo 26.º, n.º 1, alínea a) do Código dos Contratos Públicos",,,,,,Não aplicável.,Não aplicável.,FALSE
Aquisição com colocação de peças/acessórios em geradores de azoto,Ajuste Direto Regime Geral,Aquisição de bens móveis,"31161800-0, Partes de geradores de gases","Instituto Nacional de Saúde Doutor Ricardo Jorge, I. P. (501427511)",GasMan (505463776),"2.643,20 €",30-09-2015,03-08-2015,60 dias,"Portugal, Lisboa, Lisboa","Artigo 32.º, n.º 2, alínea a) do Código dos Contratos Públicos",,,,,,Não aplicável.,Não aplicável.,FALSE
Aquisição com colocação de peças/acessórios em geradores de azoto,Ajuste Direto Regime Geral,Aquisição de bens móveis,"31161800-0, Partes de geradores de gases","Instituto Nacional de Saúde Doutor Ricardo Jorge, I. P. (501427511)",GasMan (505463776),"2.149,38 €",30-09-2015,03-08-2015,60 dias,"Portugal, Porto, Porto","Artigo 32.º, n.º 2, alínea a) do Código dos Contratos Públicos",,,,,,Não aplicável.,Não aplicável.,FALSE
Aquisição de peças para reparação dos elevares do INSA,Ajuste Direto Regime Geral,Aquisição de bens móveis,"33100000-1, Equipamento médico","Instituto Nacional de Saúde Doutor Ricardo Jorge, I. P. (501427511)","Schindler - Ascensores e escadas Rolantes, SA (502353740)","5.588,42 €",30-09-2015,31-12-2014,90 dias,"Portugal, Lisboa, Lisboa","Artigo 26.º, n.º 1, alínea a) do Código dos Contratos Públicos",,,,,,Não aplicável.,Não aplicável.,FALSE
Aquisição de serviços de reparação do Preparatore Lineare no INSA,Ajuste Direto Regime Geral,Aquisição de serviços,"50000000-5, Serviços de reparação e manutenção","Instituto Nacional de Saúde Doutor Ricardo Jorge, I. P. (501427511)","Alfagene, Novas Tecnologias das Ciências da vida, Lda (503387398)","2.750,00 €",30-09-2015,23-12-2014,90 dias,"Portugal, Lisboa, Lisboa","Artigo 20.º, n.º 1, alínea a) do Código dos Contratos Públicos",,,,,,Não aplicável.,Não aplicável.,FALSE
Aquisição de serviços de reparação de equipamentos no INSA,Ajuste Direto Regime Geral,Aquisição de serviços,"50800000-3, Serviços de reparação e manutenção diversos","Instituto Nacional de Saúde Doutor Ricardo Jorge, I. P. (501427511)","UNICAM - Sistemas Analíticos, Lda (502614625)","2.500,00 €",30-09-2015,23-12-2014,90 dias,"Portugal, Lisboa, Lisboa","Artigo 24.º, n.º 1, alínea e) do Código dos Contratos Públicos",,,,,,Não aplicável.,Não aplicável.,FALSE
Reparação do desgaseificador do cromatógrafo no INSA,Ajuste Direto Regime Geral,Aquisição de serviços,"50800000-3, Serviços de reparação e manutenção diversos",Instituto Nacional de Saúde Dr.Ricardo Jorge(INSA) (501427511),"Waters Tecnologies Portugal, Lda (510433669)","890,85 €",30-09-2015,23-12-2014,90 dias,"Portugal, Lisboa, Lisboa","Artigo 24.º, n.º 1, alínea e) do Código dos Contratos Públicos",,,,,,Não aplicável.,Não aplicável.,FALSE
Aquisição de serviços de revisões automóvel do INSA,Ajuste Direto Regime Geral,Aquisição de serviços,"50800000-3, Serviços de reparação e manutenção diversos","Instituto Nacional de Saúde Doutor Ricardo Jorge, I. P. (501427511)",Nuno Miguel Salgueiro (221334750),"3.016,43 €",30-09-2015,30-12-2014,90 dias,"Portugal, Lisboa, Lisboa","Artigo 20.º, n.º 1, alínea a) do Código dos Contratos Públicos",,,,,,Não aplicável.,Não aplicável.,FALSE
Aquisição de peças para equipamentos de laboratório no INSA,Ajuste Direto Regime Geral,Aquisição de bens móveis,"33100000-1, Equipamento médico","Instituto Nacional de Saúde Doutor Ricardo Jorge, I. P. (501427511)","UNICAM - sistemas Analíticos, Lda (502614625)","3.152,00 €",30-09-2015,23-12-2014,90 dias,"Portugal, Lisboa, Lisboa","Artigo 24.º, n.º 1, alínea e) do Código dos Contratos Públicos",,,,,,Não aplicável.,Não aplicável.,FALSE
Aquisição Consumiveis para impressoras,Ajuste Direto Regime Geral,Aquisição de bens móveis,"30125120-8, Tóner para fotocopiadoras",Instituto Nacional de Saúde Dr.Ricardo Jorge(INSA) (501427511),"Exitus, Soluções Tecnológicas, Lda (509117660)","7.742,00 €",29-09-2015,06-08-2015,30 dias,"Portugal, Lisboa, Lisboa","Artigo 20.º, n.º 1, alínea a) do Código dos Contratos Públicos",,,,,,Não aplicável.,Não aplicável.,FALSE
Aquisição de máquina de lavar e desinfetar vidraria de laboratório,Ajuste Direto Regime Geral,Aquisição de bens móveis,"42959000-3, Máquinas de lavar louça industriais",Instituto Nacional de Saúde Dr.Ricardo Jorge(INSA) (501427511),"Lablad - Tito & Fidalgos, Lda (502629703)","8.385,40 €",29-09-2015,19-06-2015,60 dias,"Portugal, Lisboa, Lisboa","Artigo 20.º, n.º 1, alínea a) do Código dos Contratos Públicos",,,,,,Não aplicável.,Não aplicável.,FALSE
Aquisição de uma Estufa de CO2,Ajuste Direto Regime Geral,Aquisição de bens móveis,"33152000-0, Incubadoras",Instituto Nacional de Saúde Dr.Ricardo Jorge(INSA) (501427511),Frilabo (507958861),"4.445,08 €",29-09-2015,13-07-2015,30 dias,"Portugal, Lisboa, Lisboa","Artigo 20.º, n.º 1, alínea a) do Código dos Contratos Públicos",,,,,,Não aplicável.,Não aplicável.,FALSE
Aquisição de pneus para a viatura Renault Kangoo do INSA,Ajuste Direto Regime Geral,Aquisição de bens móveis,"34000000-7, Equipamento e produtos auxiliares de transporte","Instituto Nacional de Saúde Doutor Ricardo Jorge, I. P. (501427511)","Pneuport - Auto C. Borges, Lda (500434786)","117,14 €",29-09-2015,07-10-2014,90 dias,"Portugal, Lisboa, Lisboa","Artigo 20.º, n.º 1, alínea a) do Código dos Contratos Públicos",,,,,,Não aplicável.,Não aplicável.,FALSE
Aquisição de peças para o detetor de massas do INSA,Ajuste Direto Regime Geral,Aquisição de bens móveis,"33100000-1, Equipamento médico",INSTITUTO NACIONAL DE SAÚDE DR. RICARDO JORGE (501427511),"AB Sciex Portugal Sociedade Unipessoal, Lda (510460771)","1.108,02 €",29-09-2015,30-12-2014,90 dias,"Portugal, Lisboa, Lisboa","Artigo 24.º, n.º 1, alínea e) do Código dos Contratos Públicos",,,,,,Não aplicável.,Não aplicável.,FALSE
Aquisição de serviços de reparação de um leitor de florescência para o INSA,Ajuste Direto Regime Geral,Aquisição de serviços,"50800000-3, Serviços de reparação e manutenção diversos",IN Ricardo Jorge (501427511),"Biogen Cientifica, SL (ESB79539441)","800,00 €",29-09-2015,19-12-2014,90 dias,"Portugal, Lisboa, Lisboa","Artigo 24.º, n.º 1, alínea e) do Código dos Contratos Públicos",,,,,,Não aplicável.,Não aplicável.,FALSE
Aquisição de serviços de assistência técnica ao equipamento Coda Elisa do INSA,Ajuste Direto Regime Geral,Aquisição de serviços,"50800000-3, Serviços de reparação e manutenção diversos","Instituto Nacional de Saúde Doutor Ricardo Jorge, I. P. (501427511)","Bio-Rad laboratories, Lda (501301321)","1.520,00 €",29-09-2015,17-11-2014,90 dias,"Portugal, Setúbal, Setúbal","Artigo 20.º, n.º 1, alínea a) do Código dos Contratos Públicos",,,,,,Não aplicável.,Não aplicável.,FALSE
Aquisição de peças para reparação da máquina de lavar material no INSA,Ajuste Direto Regime Geral,Aquisição de bens móveis,"33100000-1, Equipamento médico","Instituto Nacional de Saúde Doutor Ricardo Jorge, I. P. (501427511)","Miele Portuguesa - Máquinas Industriais e Electrodomésticos, Lda (500193100)","581,03 €",29-09-2015,19-12-2014,90 dias,"Portugal, Lisboa, Lisboa","Artigo 24.º, n.º 1, alínea e) do Código dos Contratos Públicos",,,,,,Não aplicável.,Não aplicável.,FALSE
Aquisição de serviços para reparação de um termociclador,Ajuste Direto Regime Geral,Aquisição de serviços,"50412000-6, Serviços de reparação e manutenção de aparelhos de ensaio",Instituto Nacional de Saúde Dr.Ricardo Jorge(INSA) (501427511),"Alfagene, Lda (503387398)","2.025,00 €",28-09-2015,15-06-2015,20 dias,"Portugal, Setúbal, Setúbal","Artigo 20.º, n.º 1, alínea a) do Código dos Contratos Públicos",,,,,,Não aplicável.,Não aplicável.,FALSE
Serviços de reparação nos terminais de gases laboratoriais,Ajuste Direto Regime Geral,Aquisição de serviços,"50800000-3, Serviços de reparação e manutenção diversos","Instituto Nacional de Saúde Dr. Ricardo Jorge, I. P. (501427511)","Praxair Portugal Gass, SA (501738916)","2.155,00 €",28-09-2015,26-12-2014,90 dias,"Portugal, Lisboa, Lisboa","Artigo 20.º, n.º 1, alínea a) do Código dos Contratos Públicos",,,,,,Não aplicável.,Não aplicável.,FALSE
Aquisição de reagentes,Ajuste Direto Regime Geral,Aquisição de bens móveis,"33696000-5, Reagentes e meios de contraste",Instituto Nacional de Saúde Dr.Ricardo Jorge(INSA) (501427511),"ARIUM - Sistemas de Diagnóstico, Lda (502501880)","250,00 €",28-09-2015,25-08-2015,90 dias,"Portugal, Lisboa, Lisboa","Artigo 20.º, n.º 1, alínea a) do Código dos Contratos Públicos",,,,,,Não aplicável.,Não aplicável.,FALSE
Aquisição de reagentes,Ajuste Direto Regime Geral,Aquisição de bens móveis,"33696000-5, Reagentes e meios de contraste",Instituto Nacional de Saúde Dr.Ricardo Jorge(INSA) (501427511),"Biomerieux portugal, Lda (501524177)","1.699,20 €",28-09-2015,25-08-2015,90 dias,"Portugal, Lisboa, Lisboa","Artigo 20.º, n.º 1, alínea a) do Código dos Contratos Públicos",,,,,,Não aplicável.,Não aplicável.,FALSE
Aquisição de reagentes para o departamento de genética do INSA,Ajuste Direto Regime Geral,Aquisição de bens móveis,"33140000-3, Material médico de consumo","Instituto Nacional de Saúde Doutor Ricardo Jorge, I. P. (501427511)","Alfagene - Novas Tecnologias das Ciências da Vida, Lda (503387398)","237,00 €",28-09-2015,03-09-2015,90 dias,"Portugal, Lisboa, Lisboa","Artigo 20.º, n.º 1, alínea a) do Código dos Contratos Públicos",,,,,,Não aplicável.,Não aplicável.,FALSE
Aquisição de enzima de restrição Xba I para o INSA,Ajuste Direto Regime Geral,Aquisição de bens móveis,"33100000-1, Equipamento médico",Instituto Nacional de Saúde Dr.Ricardo Jorge(INSA) (501427511),"Werfen Portugal,Lda (501086110)","425,00 €",25-09-2015,15-06-2015,90 dias,"Portugal, Lisboa, Lisboa","Artigo 24.º, n.º 1, alínea e) do Código dos Contratos Públicos",,,,,,Não aplicável.,Não aplicável.,FALSE
Aquisição disco de antibiótico para o INSA,Ajuste Direto Regime Geral,Aquisição de bens móveis,"33140000-3, Material médico de consumo","Instituto Nacional de Saúde Doutor Ricardo Jorge, I. P. (501427511)",Fisher Scientific (506429210),"72,00 €",25-09-2015,19-06-2015,90 dias,"Portugal, Lisboa, Lisboa","Artigo 20.º, n.º 1, alínea a) do Código dos Contratos Públicos",,,,,,Não aplicável.,Não aplicável.,FALSE
Aquisição de serviços para reparação de Plotter,Ajuste Direto Regime Geral,Aquisição de serviços,"50000000-5, Serviços de reparação e manutenção","Instituto Nacional de Saúde Doutor Ricardo Jorge, I. P. (501427511)",NLS (505248948),"790,00 €",25-09-2015,24-04-2015,10 dias,"Portugal, Lisboa, Lisboa","Artigo 20.º, n.º 1, alínea a) do Código dos Contratos Públicos",,,,,,Não aplicável.,Não aplicável.,FALSE
Aquisição de serviços de catering para fins exclusivos de investigação,Ajuste Direto Regime Geral,Aquisição de serviços,"55500000-5, Serviços de cantinas e de fornecimento de refeições (catering)","Instituto Nacional de Saúde Doutor Ricardo Jorge, I. P. (501427511)",SUCH - Serviços de Utilização Comum dos Hospitais (500900469),"753,20 €",25-09-2015,24-09-2015,90 dias,"Portugal, Lisboa, Lisboa","Artigo 26.º, n.º 1, alínea b) do Código dos Contratos Públicos",,,,,,Não aplicável.,Não aplicável.,FALSE
Impressão da tradução do manual Food safety,Ajuste Direto Regime Geral,Aquisição de serviços,"79810000-5, Serviços de impressão",Instituto Nacional de Saúde Dr.Ricardo Jorge(INSA) (501427511),"Guide Artes Gráficas, Lda (500131740)","2.662,00 €",24-09-2015,27-03-2015,90 dias,"Portugal, Lisboa, Lisboa","Artigo 20.º, n.º 1, alínea a) do Código dos Contratos Públicos",,,,,,Não aplicável.,Não aplicável.,FALSE
Aquisição de reagentes,Concurso público,Aquisição de bens móveis,"33696500-0, Reagentes de laboratório","Instituto Nacional de Saúde Dr. Ricardo Jorge, I. P. (501427511)",VWR Internacional (503842770),"21.933,72 €",23-09-2015,28-05-2015,311 dias,"Portugal, Lisboa, Lisboa","Artigo 20.º, n.º 1, alínea b) do Código dos Contratos Públicos",,,,,,Não aplicável.,Não aplicável.,FALSE
Aquisição de reagentes,Concurso público,Aquisição de bens móveis,"33696500-0, Reagentes de laboratório","Instituto Nacional de Saúde Dr. Ricardo Jorge, I. P. (501427511)",Alfagene (503387398),"67.289,46 €",23-09-2015,28-05-2015,311 dias,"Portugal, Lisboa, Lisboa","Artigo 20.º, n.º 1, alínea b) do Código dos Contratos Públicos",,,,,,Não aplicável.,Não aplicável.,FALSE
Aquisição de reagentes,Concurso público,Aquisição de bens móveis,"33696500-0, Reagentes de laboratório","Instituto Nacional de Saúde Dr. Ricardo Jorge, I. P. (501427511)",Grupo Taper (506886336),"750,00 €",23-09-2015,28-05-2015,311 dias,"Portugal, Lisboa, Lisboa","Artigo 20.º, n.º 1, alínea b) do Código dos Contratos Públicos",,,,,,Não aplicável.,Não aplicável.,FALSE
Aquisição de reagentes,Concurso público,Aquisição de bens móveis,"33696500-0, Reagentes de laboratório","Instituto Nacional de Saúde Dr. Ricardo Jorge, I. P. (501427511)","Roche Sistemas Diagnóstico, Lda (504282921)","3.739,70 €",23-09-2015,28-05-2015,311 dias,"Portugal, Lisboa, Lisboa","Artigo 20.º, n.º 1, alínea b) do Código dos Contratos Públicos",,,,,,Não aplicável.,Não aplicável.,FALSE
Aquisição de reagentes,Concurso público,Aquisição de bens móveis,"33696500-0, Reagentes de laboratório","Instituto Nacional de Saúde Dr. Ricardo Jorge, I. P. (501427511)","Know-How, Lda (509884296)","32,00 €",23-09-2015,28-05-2015,311 dias,"Portugal, Lisboa, Lisboa","Artigo 20.º, n.º 1, alínea b) do Código dos Contratos Públicos",,,,,,Não aplicável.,Não aplicável.,FALSE
Aquisição de reagentes,Concurso público,Aquisição de bens móveis,"33696500-0, Reagentes de laboratório","Instituto Nacional de Saúde Dr. Ricardo Jorge, I. P. (501427511)",ILC - Instrumentos Laboratório e Científicos Lda (500948208),"101,00 €",23-09-2015,28-05-2015,311 dias,"Portugal, Lisboa, Lisboa","Artigo 20.º, n.º 1, alínea b) do Código dos Contratos Públicos",,,,,,Não aplicável.,Não aplicável.,FALSE
Aquisição de reagentes,Concurso público,Aquisição de bens móveis,"33696500-0, Reagentes de laboratório","Instituto Nacional de Saúde Dr. Ricardo Jorge, I. P. (501427511)",Fisher Scientific Lda (506429210),"2.528,04 €",23-09-2015,28-05-2015,311 dias,"Portugal, Lisboa, Lisboa","Artigo 20.º, n.º 1, alínea b) do Código dos Contratos Públicos",,,,,,Não aplicável.,Não aplicável.,FALSE
Aquisição de reagentes,Concurso público,Aquisição de bens móveis,"33696500-0, Reagentes de laboratório","Instituto Nacional de Saúde Dr. Ricardo Jorge, I. P. (501427511)",Bio-Rad (501301321),"4.157,00 €",23-09-2015,28-05-2015,311 dias,"Portugal, Lisboa, Lisboa","Artigo 20.º, n.º 1, alínea b) do Código dos Contratos Públicos",,,,,,Não aplicável.,Não aplicável.,FALSE
Aquisição de reagentes,Concurso público,Aquisição de bens móveis,"33696500-0, Reagentes de laboratório","Instituto Nacional de Saúde Dr. Ricardo Jorge, I. P. (501427511)","Arium Unip, Lda (502501880)","500,16 €",23-09-2015,28-05-2015,311 dias,"Portugal, Lisboa, Lisboa","Artigo 20.º, n.º 1, alínea b) do Código dos Contratos Públicos",,,,,,Não aplicável.,Não aplicável.,FALSE
Aquisição de reagentes,Concurso público,Aquisição de bens móveis,"33696500-0, Reagentes de laboratório","Instituto Nacional de Saúde Dr. Ricardo Jorge, I. P. (501427511)",Ambifood (505400057),"895,90 €",23-09-2015,28-05-2015,311 dias,"Portugal, Lisboa, Lisboa","Artigo 20.º, n.º 1, alínea b) do Código dos Contratos Públicos",,,,,,Não aplicável.,Não aplicável.,FALSE
Aquisição de reagentes,Concurso público,Aquisição de bens móveis,"33696500-0, Reagentes de laboratório","Instituto Nacional de Saúde Dr. Ricardo Jorge, I. P. (501427511)",Tecnilab Portugal - SA (500758158),"2.532,84 €",23-09-2015,28-05-2015,311 dias,"Portugal, Lisboa, Lisboa","Artigo 20.º, n.º 1, alínea b) do Código dos Contratos Públicos",,,,,,Não aplicável.,Não aplicável.,FALSE
Aquisição de material de proteção individual,Ajuste Direto Regime Geral,Aquisição de bens móveis,"33140000-3, Material médico de consumo","Instituto Nacional de Saúde Doutor Ricardo Jorge, I. P. (501427511)","VWR International - Material de Laboratório, Lda (503842770)","271,00 €",22-09-2015,16-03-2015,8 dias,"Portugal, Lisboa, Lisboa","Artigo 20.º, n.º 1, alínea a) do Código dos Contratos Públicos",,,,,,Não aplicável.,Não aplicável.,FALSE
Aquisição de bens para fins exclusivos de investigação projecto Orque Sudoe,Ajuste Direto Regime Geral,Aquisição de bens móveis,"33140000-3, Material médico de consumo","Instituto Nacional de Saúde Doutor Ricardo Jorge, I. P. (501427511)",Université de Pau et des Pays de l'Adour (FR6919640251),"1.947,42 €",22-09-2015,25-02-2015,90 dias,"Portugal, Lisboa, Lisboa","Artigo 26.º, n.º 1, alínea b) do Código dos Contratos Públicos",,,,,,Não aplicável.,Não aplicável.,FALSE
"Aquisição de gasóleo agrícola no Instituto Ricardo Jorge , IP ",Ajuste Direto Regime Geral,Aquisição de bens móveis,"09100000-0, Combustíveis","Instituto Nacional de Saúde Doutor Ricardo Jorge, I. P. (501427511)","Auto Júlio II - Combustíveis, SA (506927377)","5.678,50 €",22-09-2015,21-09-2015,90 dias,"Portugal, Setúbal, Setúbal<BR/>Portugal, Porto, Porto<BR/>Portugal, Lisboa, Lisboa","Artigo 20.º, n.º 1, alínea a) do Código dos Contratos Públicos",,,,,,Não aplicável.,Não aplicável.,FALSE
Aquisição de medicina curativa para o INSA,Ajuste Direto Regime Geral,Aquisição de serviços,"85100000-0, Serviços de saúde","Instituto Nacional de Saúde Doutor Ricardo Jorge, I. P. (501427511)","Silva Graça - Clínica Médica e do Trabalho, Lda (504942891)","4.800,00 €",22-09-2015,28-07-2015,90 dias,"Portugal, Lisboa, Lisboa","Artigo 20.º, n.º 1, alínea a) do Código dos Contratos Públicos",,,,,,Não aplicável.,Não aplicável.,FALSE
Aquisição de material de consumo clínico na categoria de plásticos,Concurso público,Aquisição de bens móveis,"33140000-3, Material médico de consumo","Instituto Nacional de Saúde Dr. Ricardo Jorge, I. P. (501427511)",Aiatelab (508533104),"666,05 €",22-09-2015,02-06-2015,202 dias,"Portugal, Lisboa, Lisboa","Artigo 20.º, n.º 1, alínea b) do Código dos Contratos Públicos",,,,,,Não aplicável.,Não aplicável.,FALSE
Aquisição de material de consumo clínico na categoria de plásticos,Concurso público,Aquisição de bens móveis,"33140000-3, Material médico de consumo","Instituto Nacional de Saúde Dr. Ricardo Jorge, I. P. (501427511)",Vidrolab 2 (501450629),"720,00 €",22-09-2015,02-06-2015,202 dias,"Portugal, Lisboa, Lisboa","Artigo 20.º, n.º 1, alínea b) do Código dos Contratos Públicos",,,,,,Não aplicável.,Não aplicável.,FALSE
Aquisição de material de consumo clínico na categoria de plásticos,Concurso público,Aquisição de bens móveis,"33140000-3, Material médico de consumo","Instituto Nacional de Saúde Dr. Ricardo Jorge, I. P. (501427511)",Alfagene (503387398),"1.168,30 €",22-09-2015,02-06-2015,202 dias,"Portugal, Lisboa, Lisboa","Artigo 20.º, n.º 1, alínea b) do Código dos Contratos Públicos",,,,,,Não aplicável.,Não aplicável.,FALSE
Aquisição de material de consumo clínico na categoria de plásticos,Concurso público,Aquisição de bens móveis,"33140000-3, Material médico de consumo","Instituto Nacional de Saúde Dr. Ricardo Jorge, I. P. (501427511)",Solítica - Soluções Analíticas Unipessoal Lda (510824641),"1.802,20 €",22-09-2015,02-06-2015,202 dias,"Portugal, Lisboa, Lisboa","Artigo 20.º, n.º 1, alínea b) do Código dos Contratos Públicos",,,,,,Não aplicável.,Não aplicável.,FALSE
Aquisição de material de consumo clínico na categoria de plásticos,Concurso público,Aquisição de bens móveis,"33140000-3, Material médico de consumo","Instituto Nacional de Saúde Dr. Ricardo Jorge, I. P. (501427511)",Quilaban - Química Laboratoril Analítica Lda (500399670),"450,47 €",22-09-2015,02-06-2015,202 dias,"Portugal, Lisboa, Lisboa","Artigo 20.º, n.º 1, alínea b) do Código dos Contratos Públicos",,,,,,Não aplicável.,Não aplicável.,FALSE
Aquisição de material de consumo clínico na categoria de plásticos,Concurso público,Aquisição de bens móveis,"33140000-3, Material médico de consumo","Instituto Nacional de Saúde Dr. Ricardo Jorge, I. P. (501427511)",PVL - Produtos para Laboratório Lda (501411852),"6.519,43 €",22-09-2015,02-06-2015,202 dias,"Portugal, Lisboa, Lisboa","Artigo 20.º, n.º 1, alínea b) do Código dos Contratos Públicos",,,,,,Não aplicável.,Não aplicável.,FALSE
Aquisição de material de consumo clínico na categoria de plásticos,Concurso público,Aquisição de bens móveis,"33140000-3, Material médico de consumo","Instituto Nacional de Saúde Dr. Ricardo Jorge, I. P. (501427511)",Anastácio Saldanha Unipessoal Lda (505804441),"99,50 €",22-09-2015,02-06-2015,202 dias,"Portugal, Lisboa, Lisboa","Artigo 20.º, n.º 1, alínea b) do Código dos Contratos Públicos",,,,,,Não aplicável.,Não aplicável.,FALSE
Aquisição de material de consumo clínico na categoria de plásticos,Concurso público,Aquisição de bens móveis,"33140000-3, Material médico de consumo","Instituto Nacional de Saúde Dr. Ricardo Jorge, I. P. (501427511)","JCM Representações, Lda (502099330)","5.182,97 €",22-09-2015,02-06-2015,202 dias,"Portugal, Lisboa, Lisboa","Artigo 20.º, n.º 1, alínea b) do Código dos Contratos Públicos",,,,,,Não aplicável.,Não aplicável.,FALSE
" Aquisição de serviços para reparação de 4 impressoras para o INSA, I.P.",Ajuste Direto Regime Geral,Aquisição de serviços,"50800000-3, Serviços de reparação e manutenção diversos","Instituto Nacional de Saúde Doutor Ricardo Jorge, I. P. (501427511)","NLS  New Link Solutions - Consultadoria e Engenharia, S.A. (505248948)","2.320,00 €",21-09-2015,28-05-2015,15 dias,"Portugal, Lisboa, Lisboa","Artigo 20.º, n.º 1, alínea a) do Código dos Contratos Públicos",,,,,,Não aplicável.,Não aplicável.,FALSE
Aquisição de publicação (livros) para o INSA,Ajuste Direto Regime Geral,Aquisição de bens móveis,"22100000-1, Livros, brochuras e folhetos impressos","Instituto Nacional de Saúde Doutor Ricardo Jorge, I. P. (501427511)","Marka, Lda (502317124)","223,75 €",21-09-2015,28-07-2015,90 dias,"Portugal, Lisboa, Lisboa","Artigo 20.º, n.º 1, alínea a) do Código dos Contratos Públicos",,,,,,Não aplicável.,Não aplicável.,FALSE
Aquisição de publicação (livros) para o INSA,Ajuste Direto Regime Geral,Aquisição de bens móveis,"22100000-1, Livros, brochuras e folhetos impressos","Instituto Nacional de Saúde Doutor Ricardo Jorge, I. P. (501427511)","Americana - Papelaria, SA (509959008)","322,70 €",21-09-2015,28-07-2015,90 dias,"Portugal, Lisboa, Lisboa","Artigo 20.º, n.º 1, alínea a) do Código dos Contratos Públicos",,,,,,Não aplicável.,Não aplicável.,FALSE
Aquisição de material de colheita do INSA,Concurso público,Locação de bens móveis,"33140000-3, Material médico de consumo","Instituto Nacional de Saúde Doutor Ricardo Jorge, I. P. (501427511)",Sarstedt - Instrumentos e matérias de consumo para a medicina e a ciência (503019461),"13.725,80 €",21-09-2015,05-08-2015,90 dias,"Portugal, Setúbal, Setúbal<BR/>Portugal, Lisboa, Lisboa<BR/>Portugal, Porto, Porto","Artigo 20.º, n.º 1, alínea b) do Código dos Contratos Públicos",,,,,,Não aplicável.,Não aplicável.,FALSE
Aquisição de material de colheita do INSA,Concurso público,Locação de bens móveis,"33140000-3, Material médico de consumo","Instituto Nacional de Saúde Doutor Ricardo Jorge, I. P. (501427511)","Roche sistemas de Diagnóstico, Lda (504282921)","400,00 €",21-09-2015,05-08-2015,90 dias,"Portugal, Setúbal, Setúbal<BR/>Portugal, Lisboa, Lisboa<BR/>Portugal, Porto, Porto","Artigo 20.º, n.º 1, alínea b) do Código dos Contratos Públicos",,,,,,Não aplicável.,Não aplicável.,FALSE
Aquisição de material de colheita do INSA,Concurso público,Locação de bens móveis,"33140000-3, Material médico de consumo","Instituto Nacional de Saúde Doutor Ricardo Jorge, I. P. (501427511)","Anastácio Saldanha Unipessoal, Lda (505804441)","474,98 €",21-09-2015,05-08-2015,90 dias,"Portugal, Setúbal, Setúbal<BR/>Portugal, Porto, Porto<BR/>Portugal, Lisboa, Lisboa","Artigo 20.º, n.º 1, alínea b) do Código dos Contratos Públicos",,,,,,Não aplicável.,Não aplicável.,FALSE
Aquisição de material de colheita para o INSA,Concurso público,Locação de bens móveis,"33140000-3, Material médico de consumo","Instituto Nacional de Saúde Doutor Ricardo Jorge, I. P. (501427511)","Becton Dickinson, SA (980245214)","4.490,70 €",21-09-2015,05-08-2015,90 dias,"Portugal, Porto, Porto<BR/>Portugal, Lisboa, Lisboa<BR/>Portugal, Setúbal, Setúbal","Artigo 20.º, n.º 1, alínea b) do Código dos Contratos Públicos",,,,,,Não aplicável.,Não aplicável.,FALSE
"CP 23 - Aquisição de reagentes para a àrea da Bioquimica Genética do INSA, I.P.",Concurso público,Aquisição de bens móveis,"33696500-0, Reagentes de laboratório","Instituto Nacional de Saúde Dr. Ricardo Jorge, I. P. (501427511)","Potencial Zero - Instrumentação Cientifica, Lda (506704017)","69.750,00 €",21-09-2015,30-04-2015,274 dias,"Portugal, Lisboa, Lisboa","Artigo 20.º, n.º 1, alínea b) do Código dos Contratos Públicos",,,,,,Não aplicável.,Não aplicável.,FALSE
"CP 23-2015- Aquisição de reagentes para a área da bioquímica genética do INSA, I.P.",Concurso público,Aquisição de bens móveis,"33696500-0, Reagentes de laboratório","Instituto Nacional de Saúde Dr. Ricardo Jorge, I. P. (501427511)","ILC - Instrumentos de laboratório e Cientificos, Lda (500948208)","16.980,00 €",21-09-2015,30-04-2015,273 dias,"Portugal, Lisboa, Lisboa","Artigo 20.º, n.º 1, alínea b) do Código dos Contratos Públicos",,,,,,Não aplicável.,Não aplicável.,FALSE
