freguesia,acronym,validVotesPercentage,votes,dicofre
Mões,PS,45.09,225,180312
Mões,PPD/PSD.CDS-PP,40.88,204,180312
Mões,MPT,6.01,30,180312
Mões,PCP-PEV,2.81,14,180312
Mões,PPV,1.2,6,180312
Mões,B.E.,0.8,4,180312
Mões,PCTP/MRPP,0.8,4,180312
Mões,PND,0.8,4,180312
Mões,L,0.4,2,180312
Mões,PTP,0.4,2,180312
Mões,PAN,0.2,1,180312
Mões,PNR,0.2,1,180312
Mões,POUS,0.2,1,180312
Mões,PPM,0.2,1,180312
Mões,MAS,0,0,180312
Mões,PDA,0,0,180312
