Objeto do Contrato,Tipo de Procedimento,Tipo(s) de Contrato,CPVs,Entidade(s) Adjudicante(s),Entidade(s) Adjudicatária(s),Preço Contratual,Data de Publicação,Data de Celebração do Contrato,Prazo de Execução,Local de Execução,Fundamentação,Data de Fecho do Contrato,Preço Total Efetivo,Causas das Alterações ao Prazo,Causas das Alterações ao Preço,Estado,N.º registo do Acordo Quadro,Descrição do Acordo Quadro,Procedimento Centralizado
Pagamento dos serviços de suporte e manutenção preventiva à Central Telefónica referentes a 2012,Ajuste Direto Regime Geral,Aquisição de serviços,"50324200-4, Serviços de manutenção preventiva",Direcção-Geral da Saúde (600037100),"Glintt Business Solutions, Lda. (503502537)","6.273,00 €",08-02-2013,06-02-2013,365 dias,"Portugal, Lisboa, Lisboa","Artigo 20.º, n.º 1, alínea a) do Código dos Contratos Públicos",18-02-2013,"6.273,00 €",,"",,Não aplicável.,Não aplicável.,
"Prorrogação da prestação de serviços, em regime de avença, com Biólogo, para Estudos Médicos Hidrológicos / Vigilância de águas para consumo humano e recreativo / Avaliação de Risco - Implementação de plano de acção de ambiente e saúde",Ajuste Direto Regime Geral,Aquisição de serviços,"71356300-1, Serviços de apoio técnico",Direcção-Geral da Saúde (600037100),Vitor Manuel Antunes Martins (213829533),"18.901,92 €",06-02-2013,01-01-2013,365 dias,"Portugal, Lisboa, Lisboa","Artigo 20.º, n.º 1, alínea a) do Código dos Contratos Públicos",08-11-2013,"18.901,92 €",,"",,Não aplicável.,Não aplicável.,
Adenda ao contrato celebrado em 2012 pela UMC para prestação de serviços de segurança e vigilância para o período de 1 de janeiro a 30 de abril de 2013,Ajuste Direto Regime Geral,Aquisição de serviços,"79710000-4, Serviços de segurança",Direcção-Geral da Saúde (600037100),"Prestibel - Empresa de Segurança, SA (501326456)","26.648,03 €",01-02-2013,02-01-2013,120 dias,"Portugal, Lisboa, Lisboa",Artigo 258.º do Código dos Contratos Públicos,30-04-2013,"26.648,03 €",,"",,Não aplicável.,Não aplicável.,
Adenda ao contrato celebrado em 2012 pela UMC para aquisição de serviços de higiene e limpeza para o período de 1 de janeiro a 30 de abril de 2013,Ajuste Direto Regime Geral,Aquisição de serviços,"90910000-9, Serviços de limpeza",Direcção-Geral da Saúde (600037100),"Conforlimpa (Tejo) - Multiserviços, SA (503172588)","17.724,16 €",01-02-2013,02-01-2013,120 dias,"Portugal, Lisboa, Lisboa",Artigo 258.º do Código dos Contratos Públicos,01-03-2013,"8.862,08 €",,"A empresa Conforlimpa, selecionada no âmbito do A-Q, entrou em processo de insolvência. Efetuou-se o pagamento correspondente ao tempo trabalhado. Este contrato foi substituído por outro realizado com a empresa Interlimpe, o qual foi autorizado previamente pela Unidade Ministerial de Compras- entidade responsável pelo A-Q nesta área no Ministério da Saúde.",,Não aplicável.,Não aplicável.,
