Objeto do Contrato,Tipo de Procedimento,Tipo(s) de Contrato,CPVs,Entidade(s) Adjudicante(s),Entidade(s) Adjudicatária(s),Preço Contratual,Data de Publicação,Data de Celebração do Contrato,Prazo de Execução,Local de Execução,Fundamentação,Data de Fecho do Contrato,Preço Total Efetivo,Causas das Alterações ao Prazo,Causas das Alterações ao Preço,Estado,N.º registo do Acordo Quadro,Descrição do Acordo Quadro,Procedimento Centralizado
Filtros hemodialise;  Kit hemofiltração: Diasafe Plus para monitor 4008H,Ajuste Direto Regime Geral,Aquisição de bens móveis,"33181520-3, Produtos de consumo para hemodiálise renal","Centro Hospitalar e Universitário de Coimbra, E. P. E. (510103448)","Fresenius Medical  Care Portugal, SA (503070220)","51.450,00 €",18-10-2018,20-09-2018,90 dias,"Portugal, Coimbra, Coimbra","Artigo 24.º, n.º 1, alínea e), subalínea ii) do Código dos Contratos Públicos","","",,,,Não aplicável.,Não aplicável.,FALSE
Dois conjuntos de motores com bateria para cirurgias ortopédicas,Consulta Prévia,Aquisição de bens móveis,"33000000-0, Equipamento médico, medicamentos e produtos para cuidados pessoais","Centro Hospitalar e Universitário de Coimbra, E. P. E. (510103448)","Stryker Portugal Produtos Médicos Unipessoal, Lda. (504594214)","31.896,40 €",18-10-2018,02-10-2018,30 dias,"Portugal, Coimbra, Coimbra","Artigo 20.º, n.º 1, alínea c) do Código dos Contratos Públicos","","",,,,Não aplicável.,Não aplicável.,FALSE
PRÓTESE TOTAL DO OMBRO E JOELHO,Ajuste Direto Regime Geral,Aquisição de bens móveis,"33000000-0, Equipamento médico, medicamentos e produtos para cuidados pessoais","Centro Hospitalar e Universitário de Coimbra, E. P. E. (510103448)",JOHNSON & JOHNSON LIMITADA (500153370),"18.350,00 €",18-10-2018,09-07-2018,20 dias,"Portugal, Coimbra, Coimbra","Artigo 24.º, n.º 1, alínea e), subalínea ii) do Código dos Contratos Públicos",26-07-2018,"18.350,00 €",,,,Não aplicável.,Não aplicável.,FALSE
040232172017 - MATERIAL DE CONSUMO CLÍNICO * Packs  para Vitrectomia,Ajuste Direto Regime Geral,Aquisição de bens móveis,"33000000-0, Equipamento médico, medicamentos e produtos para cuidados pessoais","Centro Hospitalar e Universitário de Coimbra, E. P. E. (510103448)",Alcon (501251685),"74.460,00 €",16-10-2018,18-06-2018,180 dias,"Portugal, Coimbra, Coimbra","Artigo 24.º, n.º 1, alínea e) do Código dos Contratos Públicos","","",,,,Não aplicável.,Não aplicável.,FALSE
Implante auditivo de condução óssea,Ajuste Direto Regime Geral,Aquisição de bens móveis,"33000000-0, Equipamento médico, medicamentos e produtos para cuidados pessoais","Centro Hospitalar e Universitário de Coimbra, E. P. E. (510103448)",Coselgi Portugal (509230598),"9.031,39 €",15-10-2018,09-10-2018,20 dias,"Portugal, Coimbra, Coimbra","Artigo 24.º, n.º 1, alínea c) do Código dos Contratos Públicos",19-11-2018,"9.031,39 €",,,,Não aplicável.,Não aplicável.,FALSE
040226432017 - BOTAS ORTOPÉDICAS,Ajuste Direto Regime Geral,Aquisição de bens móveis<br/>Sociedade,"33000000-0, Equipamento médico, medicamentos e produtos para cuidados pessoais","Centro Hospitalar e Universitário de Coimbra, E. P. E. (510103448)","Milplus - Equipamentos Hospitalares e Máquinas Industriais, Unipessoal, lda (507019881)","835,00 €",15-10-2018,04-10-2018,120 dias,"Portugal, Coimbra, Coimbra","Artigo 24.º, n.º 1, alínea e) do Código dos Contratos Públicos",09-10-2018,"835,00 €",,,,Não aplicável.,Não aplicável.,FALSE
MATERIAL GERAL ANGIOGRAFIA,Ajuste Direto Regime Geral,Aquisição de bens móveis,"33000000-0, Equipamento médico, medicamentos e produtos para cuidados pessoais","Centro Hospitalar e Universitário de Coimbra, E. P. E. (510103448)","BOSTON SCIENTIFIC PORTUGAL, LDA (504988964)","27.929,00 €",11-10-2018,28-09-2018,365 dias,"Portugal, Coimbra, Coimbra","Artigo 24.º, n.º 1, alínea e) do Código dos Contratos Públicos","","",,,,Não aplicável.,Não aplicável.,FALSE
Prótese Tumoral,Ajuste Direto Regime Geral,Aquisição de bens móveis,"33000000-0, Equipamento médico, medicamentos e produtos para cuidados pessoais","Centro Hospitalar e Universitário de Coimbra, E. P. E. (510103448)",MBA (504445960),"20.660,00 €",11-10-2018,10-10-2018,20 dias,"Portugal, Coimbra, Coimbra","Artigo 21.º, n.º 1, alínea c) do Código dos Contratos Públicos","","",,,,Não aplicável.,Não aplicável.,FALSE
