freguesia,acronym,validVotesPercentage,votes,dicofre
Penamacor,PS,52.65,238,050710
Penamacor,PPD/PSD.CDS-PP,29.87,135,050710
Penamacor,MPT,8.41,38,050710
Penamacor,PCP-PEV,3.32,15,050710
Penamacor,B.E.,2.21,10,050710
Penamacor,PAN,0.88,4,050710
Penamacor,PND,0.66,3,050710
Penamacor,L,0.44,2,050710
Penamacor,MAS,0.44,2,050710
Penamacor,PPM,0.44,2,050710
Penamacor,PTP,0.44,2,050710
Penamacor,PDA,0.22,1,050710
Penamacor,PCTP/MRPP,0,0,050710
Penamacor,PNR,0,0,050710
Penamacor,POUS,0,0,050710
Penamacor,PPV,0,0,050710
