freguesia,acronym,validVotesPercentage,votes,dicofre
Serrazes,PS,46.02,214,181615
Serrazes,PPD/PSD,31.4,146,181615
Serrazes,B.E.,7.31,34,181615
Serrazes,CDS-PP,6.24,29,181615
Serrazes,PAN,2.37,11,181615
Serrazes,PCP-PEV,1.72,8,181615
Serrazes,R.I.R.,1.72,8,181615
Serrazes,PDR,1.08,5,181615
Serrazes,PCTP/MRPP,0.65,3,181615
Serrazes,CH,0.43,2,181615
Serrazes,PPM,0.43,2,181615
Serrazes,IL,0.22,1,181615
Serrazes,L,0.22,1,181615
Serrazes,PNR,0.22,1,181615
Serrazes,A,0,0,181615
Serrazes,JPP,0,0,181615
Serrazes,MPT,0,0,181615
Serrazes,NC,0,0,181615
Serrazes,PTP,0,0,181615
Serrazes,PURP,0,0,181615
