freguesia,acronym,validVotesPercentage,votes,dicofre
União das freguesias de Bico e Cristelo,PS,56.16,187,160522
União das freguesias de Bico e Cristelo,PPD/PSD,22.52,75,160522
União das freguesias de Bico e Cristelo,B.E.,9.31,31,160522
União das freguesias de Bico e Cristelo,CDS-PP,2.7,9,160522
União das freguesias de Bico e Cristelo,PCP-PEV,2.7,9,160522
União das freguesias de Bico e Cristelo,R.I.R.,2.1,7,160522
União das freguesias de Bico e Cristelo,A,0.9,3,160522
União das freguesias de Bico e Cristelo,PAN,0.9,3,160522
União das freguesias de Bico e Cristelo,CH,0.6,2,160522
União das freguesias de Bico e Cristelo,IL,0.3,1,160522
União das freguesias de Bico e Cristelo,JPP,0.3,1,160522
União das freguesias de Bico e Cristelo,L,0.3,1,160522
União das freguesias de Bico e Cristelo,NC,0.3,1,160522
União das freguesias de Bico e Cristelo,PNR,0.3,1,160522
União das freguesias de Bico e Cristelo,PPM,0.3,1,160522
União das freguesias de Bico e Cristelo,PTP,0.3,1,160522
União das freguesias de Bico e Cristelo,MPT,0,0,160522
União das freguesias de Bico e Cristelo,PCTP/MRPP,0,0,160522
União das freguesias de Bico e Cristelo,PDR,0,0,160522
União das freguesias de Bico e Cristelo,PURP,0,0,160522
