freguesia,acronym,validVotesPercentage,votes,dicofre
União das freguesias de Melres e Medas,PS,45.78,1357,130416
União das freguesias de Melres e Medas,PPD/PSD,26.86,796,130416
União das freguesias de Melres e Medas,B.E.,9.41,279,130416
União das freguesias de Melres e Medas,PCP-PEV,5.94,176,130416
União das freguesias de Melres e Medas,CDS-PP,3,89,130416
União das freguesias de Melres e Medas,PAN,2.83,84,130416
União das freguesias de Melres e Medas,R.I.R.,1.52,45,130416
União das freguesias de Melres e Medas,PCTP/MRPP,0.81,24,130416
União das freguesias de Melres e Medas,CH,0.78,23,130416
União das freguesias de Melres e Medas,L,0.78,23,130416
União das freguesias de Melres e Medas,IL,0.71,21,130416
União das freguesias de Melres e Medas,PNR,0.4,12,130416
União das freguesias de Melres e Medas,A,0.37,11,130416
União das freguesias de Melres e Medas,PURP,0.27,8,130416
União das freguesias de Melres e Medas,NC,0.13,4,130416
União das freguesias de Melres e Medas,PPM,0.13,4,130416
União das freguesias de Melres e Medas,PDR,0.1,3,130416
União das freguesias de Melres e Medas,PTP,0.1,3,130416
União das freguesias de Melres e Medas,JPP,0.03,1,130416
União das freguesias de Melres e Medas,MAS,0.03,1,130416
União das freguesias de Melres e Medas,MPT,0,0,130416
