freguesia,acronym,validVotesPercentage,votes,dicofre
Ribeiradio,PS,44.28,209,181007
Ribeiradio,PPD/PSD,36.65,173,181007
Ribeiradio,B.E.,6.99,33,181007
Ribeiradio,CDS-PP,5.72,27,181007
Ribeiradio,R.I.R.,1.48,7,181007
Ribeiradio,PAN,1.06,5,181007
Ribeiradio,CH,0.85,4,181007
Ribeiradio,PCP-PEV,0.85,4,181007
Ribeiradio,IL,0.42,2,181007
Ribeiradio,L,0.42,2,181007
Ribeiradio,NC,0.42,2,181007
Ribeiradio,PTP,0.42,2,181007
Ribeiradio,PPM,0.21,1,181007
Ribeiradio,PURP,0.21,1,181007
Ribeiradio,A,0,0,181007
Ribeiradio,JPP,0,0,181007
Ribeiradio,MPT,0,0,181007
Ribeiradio,PCTP/MRPP,0,0,181007
Ribeiradio,PDR,0,0,181007
Ribeiradio,PNR,0,0,181007
