Objeto do Contrato,Tipo de Procedimento,Tipo(s) de Contrato,CPVs,Entidade(s) Adjudicante(s),Entidade(s) Adjudicatária(s),Preço Contratual,Data de Publicação,Data de Celebração do Contrato,Prazo de Execução,Local de Execução,Fundamentação,Data de Fecho do Contrato,Preço Total Efetivo,Causas das Alterações ao Prazo,Causas das Alterações ao Preço,Estado,N.º registo do Acordo Quadro,Descrição do Acordo Quadro,Procedimento Centralizado
Água Destilada para Irrigação Fr. 100ml,Ao abrigo de acordo-quadro (art.º 259.º),Aquisição de bens móveis,"33600000-6, Produtos farmacêuticos","Administração Regional de Saúde de Lisboa e Vale do Tejo, I. P. (503148776)",Labesfal - Laboratórios Almiro S.A (501169580),"733,00 €",31-08-2017,21-08-2017,132 dias,"Portugal, Lisboa",Artigo 259.º do Código dos Contratos Públicos,,,,,,1331181,Acordo Quadro para fornecimento de corretivos da volémia e outras soluções estéreis às Instituições e Serviços do Serviço Nacional de Saúde,FALSE
"AQUISIÇÃO DE ETINILESTRADIOL 0,03MG + LEVONORGESTREL (3/6 CICLOS) (E298)",Ao abrigo de acordo-quadro (art.º 259.º),Aquisição de bens móveis,"33641400-9, Contraceptivos","Administração Regional de Saúde de Lisboa e Vale do Tejo, I. P. (503148776)",STALLPHARMA (503732311),"10.500,00 €",30-08-2017,24-08-2017,129 dias,"Portugal, Lisboa",Artigo 259.º do Código dos Contratos Públicos,,,,,,1459323,CP 2015/20,FALSE
MATERIAL DE REANIMAÇÃO,Concurso público,Aquisição de bens móveis,"33171200-1, Material para reanimação","Administração Regional de Saúde de Lisboa e Vale do Tejo, I. P. (503148776)","INTERSURGICAL PORTUGAL, LDA (503480045)","643,20 €",29-08-2017,21-08-2017,132 dias,"Portugal, Lisboa","Artigo 20.º, n.º 1, alínea b) do Código dos Contratos Públicos",,,,,,Não aplicável.,Não aplicável.,FALSE
MATERIAL DE REANIMAÇÃO,Concurso público,Aquisição de bens móveis,"33171200-1, Material para reanimação","Administração Regional de Saúde de Lisboa e Vale do Tejo, I. P. (503148776)","INTERSURGICAL PORTUGAL, LDA (503480045)","395,00 €",29-08-2017,21-08-2017,132 dias,"Portugal, Lisboa","Artigo 20.º, n.º 1, alínea b) do Código dos Contratos Públicos",,,,,,Não aplicável.,Não aplicável.,FALSE
MATERIAL DE REANIMAÇÃO,Concurso público,Aquisição de bens móveis,"33171200-1, Material para reanimação","Administração Regional de Saúde de Lisboa e Vale do Tejo, I. P. (503148776)","OVERPHARMA, PROD. MED. FARMAC., LD (505792362)","517,00 €",29-08-2017,21-08-2017,132 dias,"Portugal, Lisboa","Artigo 20.º, n.º 1, alínea b) do Código dos Contratos Públicos",,,,,,Não aplicável.,Não aplicável.,FALSE
MATERIAL DE REANIMAÇÃO,Concurso público,Aquisição de bens móveis,"33171200-1, Material para reanimação","Administração Regional de Saúde de Lisboa e Vale do Tejo, I. P. (503148776)","INTERSURGICAL PORTUGAL, LDA (503480045)","6.727,50 €",29-08-2017,21-08-2017,132 dias,"Portugal, Lisboa","Artigo 20.º, n.º 1, alínea b) do Código dos Contratos Públicos",,,,,,Não aplicável.,Não aplicável.,FALSE
MATERIAL DE REANIMAÇÃO,Concurso público,Aquisição de bens móveis,"33171200-1, Material para reanimação","Administração Regional de Saúde de Lisboa e Vale do Tejo, I. P. (503148776)","INTERSURGICAL PORTUGAL, LDA (503480045)","1.517,25 €",29-08-2017,21-08-2017,132 dias,"Portugal, Lisboa","Artigo 20.º, n.º 1, alínea b) do Código dos Contratos Públicos",,,,,,Não aplicável.,Não aplicável.,FALSE
MATERIAL DE REANIMAÇÃO,Concurso público,Aquisição de bens móveis,"33171200-1, Material para reanimação","Administração Regional de Saúde de Lisboa e Vale do Tejo, I. P. (503148776)","INTERSURGICAL PORTUGAL, LDA (503480045)","4.335,00 €",29-08-2017,21-08-2017,132 dias,"Portugal, Lisboa","Artigo 20.º, n.º 1, alínea b) do Código dos Contratos Públicos",,,,,,Não aplicável.,Não aplicável.,FALSE
MATERIAL DE REANIMAÇÃO,Concurso público,Aquisição de bens móveis,"33171200-1, Material para reanimação","Administração Regional de Saúde de Lisboa e Vale do Tejo, I. P. (503148776)","MEDTRONIC PORTUGAL, LDA (504223933)","855,60 €",29-08-2017,21-08-2017,132 dias,"Portugal, Lisboa","Artigo 20.º, n.º 1, alínea b) do Código dos Contratos Públicos",,,,,,Não aplicável.,Não aplicável.,FALSE
PRESTAÇÃO DE SERVIÇOS MÉDICOS PARA O ACES MÉDIO TEJO (5 SEMANAS),Ajuste Direto Regime Geral,Aquisição de serviços,"85121100-4, Serviços de médicos de clínica geral","Administração Regional de Saúde de Lisboa e Vale do Tejo, I. P. (503148776)",EHC European Healthcare City lda (509986633),"3.700,00 €",28-08-2017,24-08-2017,129 dias,"Portugal, Lisboa","Artigo 20.º, n.º 1, alínea a) do Código dos Contratos Públicos",,,,,,Não aplicável.,Não aplicável.,FALSE
AQUISIÇÃO DE REDE TUBULAR ELÁSTICA,Ajuste Direto Regime Geral,Aquisição de bens móveis,"33140000-3, Material médico de consumo","Administração Regional de Saúde de Lisboa e Vale do Tejo, I. P. (503148776)","TEXTIL PLANAS OLIVEIRAS PORTUGAL, UNIP.LDA. (509211216)","16.900,00 €",28-08-2017,25-08-2017,128 dias,"Portugal, Lisboa","Artigo 24.º, n.º 1, alínea b) do Código dos Contratos Públicos",,,,,,Não aplicável.,Não aplicável.,FALSE
Aquisição de equipamento: Lote 4 - Frigorifico e Televisor,Ajuste Direto Regime Geral,Aquisição de bens móveis,"33100000-1, Equipamento médico",Adm.Reg.de Saúde de Lisboa e Vale do Tejo (ARSLVT) (503148776),Alfraphar (504223895),"800,00 €",28-08-2017,25-08-2017,20 dias,"Portugal, Lisboa, Odivelas","Artigo 20.º, n.º 1, alínea a) do Código dos Contratos Públicos",,,,,,Não aplicável.,Não aplicável.,FALSE
"Aquisição de equipamento: Lote 3 - Mesa de Apoio, Negatoscópio, Candeeiro de Observação, Apar. Batimentos Cardio Fetais",Ajuste Direto Regime Geral,Aquisição de bens móveis,"33100000-1, Equipamento médico",Adm.Reg.de Saúde de Lisboa e Vale do Tejo (ARSLVT) (503148776),Alfraphar (504223895),"1.538,00 €",28-08-2017,25-08-2017,20 dias,"Portugal, Lisboa, Odivelas","Artigo 20.º, n.º 1, alínea a) do Código dos Contratos Públicos",,,,,,Não aplicável.,Não aplicável.,FALSE
"Aquisição de equipamento: Lote 2 - Balde de lixo, Cadeira de Rodas e Suporte para Dispensador de Solução Alcoólica",Ajuste Direto Regime Geral,Aquisição de bens móveis,"33100000-1, Equipamento médico",Adm.Reg.de Saúde de Lisboa e Vale do Tejo (ARSLVT) (503148776),Alfraphar (504223895),"1.182,00 €",28-08-2017,25-08-2017,20 dias,"Portugal, Lisboa, Loures","Artigo 20.º, n.º 1, alínea a) do Código dos Contratos Públicos",,,,,,Não aplicável.,Não aplicável.,FALSE
Lote 1 - Marquesa e Marquesa Ginecológica,Ajuste Direto Regime Geral,Aquisição de bens móveis,"33100000-1, Equipamento médico",Adm.Reg.de Saúde de Lisboa e Vale do Tejo (ARSLVT) (503148776),Alfraphar (504223895),"3.185,00 €",28-08-2017,25-08-2017,20 dias,"Portugal, Lisboa, Loures","Artigo 20.º, n.º 1, alínea a) do Código dos Contratos Públicos",,,,,,Não aplicável.,Não aplicável.,FALSE
Aquisição de equipamento informático ao abrigo do Lote 2 do Acordo Quadro da ESPAP,Ao abrigo de acordo-quadro (art.º 259.º),Aquisição de bens móveis,"30230000-0, Equipamento informático","Administração Regional de Saúde de Lisboa e Vale do Tejo, I. P. (503148776)","INFORMAMTEM - Informática e Manutenção, S.A. (503670693)","945.920,00 €",24-08-2017,06-06-2017,30 dias,"Portugal, Lisboa, Lisboa",Artigo 259.º do Código dos Contratos Públicos,,,,,,1196657,Acordo Quadro para aquisição e aluguer operacional de equipamento informático,TRUE
Aquisição de equipamento de cópia e impressão para o Núcleo de Informática da ARSLVT,Concurso público,Aquisição de bens móveis,"30121100-4, Fotocopiadoras","Administração Regional de Saúde de Lisboa e Vale do Tejo, I. P. (503148776)","INFORMANTÉM, SA (503670693)","89.712,28 €",24-08-2017,05-07-2017,20 dias,"Portugal, Lisboa, Lisboa","Artigo 20.º, n.º 1, alínea b) do Código dos Contratos Públicos",,,,,,Não aplicável.,Não aplicável.,TRUE
Aquisição de equipamento de climatização para o Aces Almada Seixal e Oeste Sul,Concurso público,Aquisição de bens móveis,"39717200-3, Aparelhos de ar condicionado","Administração Regional de Saúde de Lisboa e Vale do Tejo, I. P. (503148776)","ALEXANDRE BARBOSA BORGES, SA (500553408)","67.999,31 €",24-08-2017,13-07-2017,1000 dias,"Portugal, Setúbal, Almada<BR/>Portugal, Setúbal, Seixal","Artigo 21.º, n.º 1, alínea b) do Código dos Contratos Públicos",,,,,,Não aplicável.,Não aplicável.,FALSE
"Aquisição de equipamento médico dentário, decorrente do Projeto Saúde Oral, II Fase (Grupo II)",Concurso público,Aquisição de bens móveis,"33100000-1, Equipamento médico","Administração Regional de Saúde de Lisboa e Vale do Tejo, I. P. (503148776)",Denta Leader (980187036),"10.633,00 €",24-08-2017,22-06-2017,20 dias,"Portugal, Lisboa, Lisboa","Artigo 20.º, n.º 1, alínea b) do Código dos Contratos Públicos",,,,,,Não aplicável.,Não aplicável.,FALSE
"Aquisição de equipamento médico dentário, decorrente do Projeto Saúde Oral, II Fase (Grupo I)",Concurso público,Aquisição de bens móveis,"33100000-1, Equipamento médico","Administração Regional de Saúde de Lisboa e Vale do Tejo, I. P. (503148776)",Denta Leader (980187036),"11.097,01 €",24-08-2017,22-06-2017,20 dias,"Portugal, Lisboa, Lisboa","Artigo 20.º, n.º 1, alínea b) do Código dos Contratos Públicos",,,,,,Não aplicável.,Não aplicável.,FALSE
Obras de adaptabilidade das instalações do Hospital Pulido Valente para transferência da USF Conchas,Concurso público,Empreitadas de obras públicas,"45113000-2, Obras no local","Administração Regional de Saúde de Lisboa e Vale do Tejo, I. P. (503148776)","Ramiro & Delgado – Construções Civis e Obras Públicas, Lda. (501301704)","258.768,00 €",23-08-2017,09-06-2017,90 dias,"Portugal, Lisboa, Lisboa","Artigo 19.º, alínea b) do Código dos Contratos Públicos",,,,,,Não aplicável.,Não aplicável.,FALSE
Aquisição de material de medicina dentária para projeto piloto,Concurso público,Aquisição de bens móveis,"33130000-0, Instrumentos e dispositivos dentários e de subespecialidade","Administração Regional de Saúde de Lisboa e Vale do Tejo, I. P. (503148776)",MONTELLANO (500196494),"67.131,86 €",23-08-2017,26-06-2017,188 dias,"Portugal, Lisboa",Artigo 155.º do Código dos Contratos Públicos,,,,,,Não aplicável.,Não aplicável.,FALSE
"Aquisição de software para o ano de 2017, para o Núcleo de Informática, ao abrigo de acordo quadro de software e serviços conexos (ESPAP)",Ao abrigo de acordo-quadro (art.º 259.º),Aquisição de bens móveis,"48000000-8, Pacotes de software e sistemas de informação","Administração Regional de Saúde de Lisboa e Vale do Tejo, I. P. (503148776)"," IBERDIGITAL, SERVIÇOS DE INFORMÁTICA LDA (505807343)","1.641,00 €",23-08-2017,02-06-2017,20 dias,"Portugal, Lisboa, Lisboa",Artigo 259.º do Código dos Contratos Públicos,,,,,,2883397,Aquisição de software para o ano de 2017 para o Núcleo de Informática,FALSE
"Aquisição de software para o ano de 2017, para o Núcleo de Informática, ao abrigo de acordo quadro de software e serviços conexos (ESPAP)",Ao abrigo de acordo-quadro (art.º 259.º),Aquisição de bens móveis,"48000000-8, Pacotes de software e sistemas de informação","Administração Regional de Saúde de Lisboa e Vale do Tejo, I. P. (503148776)","Iten Solutions - sistemas de informação,S.A. (510728189)","32.085,00 €",23-08-2017,02-06-2017,20 dias,"Portugal, Lisboa, Lisboa",Artigo 259.º do Código dos Contratos Públicos,,,,,,2883397,Aquisição de software para o ano de 2017 para o Núcleo de Informática,FALSE
"Aquisição de software para o ano de 2017, para o Núcleo de Informática, ao abrigo de acordo quadro de software e serviços conexos (ESPAP)",Ao abrigo de acordo-quadro (art.º 259.º),Aquisição de bens móveis,"48000000-8, Pacotes de software e sistemas de informação","Administração Regional de Saúde de Lisboa e Vale do Tejo, I. P. (503148776)","Iten Solutions - sistemas de informação,S.A. (510728189)","3.840,00 €",23-08-2017,02-06-2017,20 dias,"Portugal, Lisboa, Lisboa",Artigo 259.º do Código dos Contratos Públicos,,,,,,2883397,Aquisição de software para o ano de 2017 para o Núcleo de Informática,FALSE
Intervenção no âmbito do controlo da infeção - CDP Ribeiro Sanches,Ajuste Direto Regime Geral,Empreitadas de obras públicas,"45113000-2, Obras no local","Administração Regional de Saúde de Lisboa e Vale do Tejo, I. P. (503148776)",Tanagra - empreiteiros SA (500278679),"11.018,06 €",23-08-2017,07-07-2017,45 dias,"Portugal, Lisboa, Amadora","Artigo 19.º, alínea a) do Código dos Contratos Públicos",,,,,,Não aplicável.,Não aplicável.,FALSE
"Obras na fachada do edifício Nº75 da ARSLVT, IP.",Ajuste Direto Regime Geral,Empreitadas de obras públicas,"45113000-2, Obras no local",Adm.Reg.de Saúde de Lisboa e Vale do Tejo (ARSLVT) (503148776),"Santomargo, Lda (507598113)","99.650,00 €",23-08-2017,13-07-2017,45 dias,"Portugal, Lisboa, Lisboa","Artigo 19.º, alínea a) do Código dos Contratos Públicos",,,,,,Não aplicável.,Não aplicável.,FALSE
INSTALAÇÃO DE DIVISÓRIAS DA UNIDADE DE SAÚDE COLINA DE ODIVELAS,Ajuste Direto Regime Geral,Empreitadas de obras públicas,"45441000-0, Colocação de vidros",Adm.Reg.de Saúde de Lisboa e Vale do Tejo (ARSLVT) (503148776),"Rascunho Edições Marketing e Publicidade, Lda (504131770)","6.500,00 €",22-08-2017,01-08-2017,30 dias,"Portugal, Lisboa, Odivelas","Artigo 19.º, alínea a) do Código dos Contratos Públicos",,,,,,Não aplicável.,Não aplicável.,FALSE
Obras de beneficiação no interior do Centro de Saúde do Olival,Ajuste Direto Regime Geral,Empreitadas de obras públicas,"45113000-2, Obras no local","Administração Regional de Saúde de Lisboa e Vale do Tejo, I. P. (503148776)","Estabil - Engenheiros Associados, Lda (502522798)","4.990,91 €",22-08-2017,21-07-2017,30 dias,"Portugal, Lisboa, Sintra","Artigo 19.º, alínea a) do Código dos Contratos Públicos",,,,,,Não aplicável.,Não aplicável.,FALSE
Edifício Sede/EUA - ET Parede - Parque Saúde; Manutenções e Reparações,Ajuste Direto Regime Geral,Aquisição de serviços,"50700000-2, Serviços de reparação e manutenção de equipamento em edifícios",Adm.Reg.de Saúde de Lisboa e Vale do Tejo (ARSLVT) (503148776),"Ramiro & Delgado – Construções Civis e Obras Públicas, Lda. (501301704)","4.820,00 €",22-08-2017,07-07-2017,10 dias,"Portugal, Lisboa, Lisboa<BR/>Portugal, Lisboa, Cascais","Artigo 20.º, n.º 1, alínea a) do Código dos Contratos Públicos",,,,,,Não aplicável.,Não aplicável.,FALSE
IMPLEMENTAÇÃO DE PROTEÇÃO DE SALAS ADJACENTES DE HIGIENE ORAL EM DIVERSOS CENTROS DE SAÚDE,Ajuste Direto Regime Geral,Empreitadas de obras públicas,"45113000-2, Obras no local","Administração Regional de Saúde de Lisboa e Vale do Tejo, I. P. (503148776)",Tanagra - empreiteiros SA (500278679),"31.862,79 €",22-08-2017,30-06-2017,174 dias,"Portugal, Lisboa","Artigo 19.º, alínea a) do Código dos Contratos Públicos",,,,,,Não aplicável.,Não aplicável.,FALSE
"Beneficiação do grupo de eletrogéneos dos CS de Vila Franca de Xira, Terraços da Ponte e Cova da Piedade",Ajuste Direto Regime Geral,Aquisição de serviços,"50324200-4, Serviços de manutenção preventiva",Adm.Reg.de Saúde de Lisboa e Vale do Tejo (ARSLVT) (503148776),TURBOMAR Energia (500290946),"4.970,00 €",22-08-2017,05-05-2017,15 dias,"Portugal, Lisboa, Loures<BR/>Portugal, Lisboa, Vila Franca de Xira<BR/>Portugal, Setúbal, Almada","Artigo 20.º, n.º 1, alínea a) do Código dos Contratos Públicos",,,,,,Não aplicável.,Não aplicável.,FALSE
Serviços de suporte e manutenção corretiva e evolutiva dos sistemas medicineone,Ajuste Direto Regime Geral,Aquisição de serviços,"72267100-0, Manutenção de software para as tecnologias da infomação","Administração Regional de Saúde de Lisboa e Vale do Tejo, I. P. (503148776)","MedicineONE, Life Science Compunting, SA (504799541)","162.227,70 €",22-08-2017,24-07-2017,365 dias,"Portugal, Lisboa, Lisboa","Artigo 24.º, n.º 1, alínea e) do Código dos Contratos Públicos",,,,,,Não aplicável.,Não aplicável.,FALSE
"Trabalhos de remodelação para o CS de Torres Vedras do Aces Oeste Sul, no âmbito do projeto de acolhimento saudável",Ajuste Direto Regime Geral,Empreitadas de obras públicas,"45113000-2, Obras no local","Administração Regional de Saúde de Lisboa e Vale do Tejo, I. P. (503148776)",BRUNO JOSE CARDOSO BARREIRA (224762338),"927,00 €",22-08-2017,06-06-2017,15 dias,"Portugal, Lisboa, Torres Vedras","Artigo 19.º, alínea a) do Código dos Contratos Públicos",,,,,,Não aplicável.,Não aplicável.,FALSE
Pequenas obras de remodelação da USF Monte da Caparica,Ajuste Direto Regime Geral,Empreitadas de obras públicas,"45113000-2, Obras no local",Adm.Reg.de Saúde de Lisboa e Vale do Tejo (ARSLVT) (503148776),"Engitom - Engenharia e Construções Unipessoal, Lda (508250501)","22.213,77 €",22-08-2017,14-06-2017,30 dias,"Portugal, Setúbal, Almada","Artigo 19.º, alínea a) do Código dos Contratos Públicos",,,,,,Não aplicável.,Não aplicável.,FALSE
"Trabalhos de remodelação para o Aces Almada Seixal, no âmbito do projeto Acolhimento Saudável, para UCSP Amora e USF Amora Saudável",Ajuste Direto Regime Geral,Empreitadas de obras públicas,"45113000-2, Obras no local",Adm.Reg.de Saúde de Lisboa e Vale do Tejo (ARSLVT) (503148776),"EU REPARO,LDA (513419756)","6.415,00 €",21-08-2017,06-06-2017,30 dias,"Portugal, Setúbal, Seixal","Artigo 19.º, alínea a) do Código dos Contratos Públicos",,,,,,Não aplicável.,Não aplicável.,FALSE
"Remodelações e reparações - Sede ARSLVT, Pav. 41 Parque Saúde, ET Amadora, ET Povoa de Sto. Adião , ET Setúbal",Ajuste Direto Regime Geral,Aquisição de serviços,"50700000-2, Serviços de reparação e manutenção de equipamento em edifícios","Administração Regional de Saúde de Lisboa e Vale do Tejo, I. P. (503148776)",RIBAMINHO - SOCIEDADE DE CONSTRUÇÕES LDA (501848479),"9.761,00 €",21-08-2017,04-07-2017,20 dias,"Portugal, Lisboa, Lisboa<BR/>Portugal, Setúbal, Setúbal<BR/>Portugal, Lisboa, Odivelas<BR/>Portugal, Lisboa, Amadora","Artigo 20.º, n.º 1, alínea a) do Código dos Contratos Públicos",,,,,,Não aplicável.,Não aplicável.,FALSE
Trabalhos de remodelação da Unidade de Medicina  Dentária URAP,Ajuste Direto Regime Geral,Empreitadas de obras públicas,"45113000-2, Obras no local",Adm.Reg.de Saúde de Lisboa e Vale do Tejo (ARSLVT) (503148776),"Ramiro & Delgado – Construções Civis e Obras Públicas, Lda. (501301704)","1.023,10 €",21-08-2017,10-07-2017,10 dias,"Portugal, Lisboa, Lisboa","Artigo 19.º, alínea a) do Código dos Contratos Públicos",,,,,,Não aplicável.,Não aplicável.,FALSE
Fornecimento e instalação de sinalética para a U.S. Marés - Penhiche,Ajuste Direto Regime Geral,Aquisição de bens móveis,"44423450-0, Placas sinaléticas",Adm.Reg.de Saúde de Lisboa e Vale do Tejo (ARSLVT) (503148776),"Infortipo, Lda (502964472)","1.314,70 €",21-08-2017,10-08-2017,1 dias,"Portugal, Leiria, Peniche","Artigo 20.º, n.º 1, alínea a) do Código dos Contratos Públicos",,,,,,Não aplicável.,Não aplicável.,FALSE
