freguesia,acronym,validVotesPercentage,votes,dicofre
Matança,PPD/PSD.CDS-PP,45.26,43,090510
Matança,PS,33.68,32,090510
Matança,MPT,6.32,6,090510
Matança,PCP-PEV,4.21,4,090510
Matança,PND,3.16,3,090510
Matança,MAS,2.11,2,090510
Matança,PAN,2.11,2,090510
Matança,PTP,2.11,2,090510
Matança,L,1.05,1,090510
Matança,B.E.,0,0,090510
Matança,PCTP/MRPP,0,0,090510
Matança,PDA,0,0,090510
Matança,PNR,0,0,090510
Matança,POUS,0,0,090510
Matança,PPM,0,0,090510
Matança,PPV,0,0,090510
