Objeto do Contrato,Tipo de Procedimento,Tipo(s) de Contrato,CPVs,Entidade(s) Adjudicante(s),Entidade(s) Adjudicatária(s),Preço Contratual,Data de Publicação,Data de Celebração do Contrato,Prazo de Execução,Local de Execução,Fundamentação,Data de Fecho do Contrato,Preço Total Efetivo,Causas das Alterações ao Prazo,Causas das Alterações ao Preço,Estado,N.º registo do Acordo Quadro,Descrição do Acordo Quadro,Procedimento Centralizado
Deslocação  em serviço á Grecia; Technical seminars; 1 Participante.,Ajuste Direto Regime Geral,Aquisição de serviços,"63510000-7, Serviços de agências de viagens e serviços similares","INFARMED - Autoridade Nacional do Medicamento e Produtos de Saúde, I.P. (600037002)","TQ - Travel Quality Viagens e Turismo, Lda. (501313915)","86,00 €",11-04-2012,10-04-2012,2 dias,Grécia,"Artigo 27.º, n.º 1, alínea h) do Código dos Contratos Públicos",,,,,,Não aplicável.,Não aplicável.,
Fornecimento e instalação de um compressor isento de òleo,Ajuste Direto Regime Geral,Aquisição de bens móveis,"42120000-6, Bombas e compressores","INFARMED - Autoridade Nacional do Medicamento e Produtos de Saúde, I.P. (600037002)","SOCIEDADE ALTLAS COPCO DE PORTUGAL, LDA. (500254265)","20.650,00 €",11-04-2012,26-03-2012,360 dias,Portugal,"Artigo 20.º, n.º 1, alínea a) do Código dos Contratos Públicos",,,,,,Não aplicável.,Não aplicável.,
