freguesia,acronym,validVotesPercentage,votes,dicofre
"União das freguesias de Aldeia da Ribeira, Vilar Maior e Badamalos",PPD/PSD.CDS-PP,52.24,70,091141
"União das freguesias de Aldeia da Ribeira, Vilar Maior e Badamalos",PS,24.63,33,091141
"União das freguesias de Aldeia da Ribeira, Vilar Maior e Badamalos",PCP-PEV,5.97,8,091141
"União das freguesias de Aldeia da Ribeira, Vilar Maior e Badamalos",MPT,5.22,7,091141
"União das freguesias de Aldeia da Ribeira, Vilar Maior e Badamalos",PND,3.73,5,091141
"União das freguesias de Aldeia da Ribeira, Vilar Maior e Badamalos",L,2.99,4,091141
"União das freguesias de Aldeia da Ribeira, Vilar Maior e Badamalos",PPM,2.24,3,091141
"União das freguesias de Aldeia da Ribeira, Vilar Maior e Badamalos",PAN,1.49,2,091141
"União das freguesias de Aldeia da Ribeira, Vilar Maior e Badamalos",MAS,0.75,1,091141
"União das freguesias de Aldeia da Ribeira, Vilar Maior e Badamalos",PCTP/MRPP,0.75,1,091141
"União das freguesias de Aldeia da Ribeira, Vilar Maior e Badamalos",B.E.,0,0,091141
"União das freguesias de Aldeia da Ribeira, Vilar Maior e Badamalos",PDA,0,0,091141
"União das freguesias de Aldeia da Ribeira, Vilar Maior e Badamalos",PNR,0,0,091141
"União das freguesias de Aldeia da Ribeira, Vilar Maior e Badamalos",POUS,0,0,091141
"União das freguesias de Aldeia da Ribeira, Vilar Maior e Badamalos",PPV,0,0,091141
"União das freguesias de Aldeia da Ribeira, Vilar Maior e Badamalos",PTP,0,0,091141
