freguesia,acronym,validVotesPercentage,votes,dicofre
Souselo,PS,51.46,547,180414
Souselo,PPD/PSD,28.6,304,180414
Souselo,B.E.,5.36,57,180414
Souselo,CDS-PP,4.33,46,180414
Souselo,PAN,3.2,34,180414
Souselo,R.I.R.,2.54,27,180414
Souselo,PCP-PEV,1.69,18,180414
Souselo,PCTP/MRPP,0.94,10,180414
Souselo,CH,0.56,6,180414
Souselo,PDR,0.28,3,180414
Souselo,PNR,0.28,3,180414
Souselo,PPM,0.28,3,180414
Souselo,MPT,0.19,2,180414
Souselo,A,0.09,1,180414
Souselo,IL,0.09,1,180414
Souselo,L,0.09,1,180414
Souselo,JPP,0,0,180414
Souselo,NC,0,0,180414
Souselo,PTP,0,0,180414
Souselo,PURP,0,0,180414
