freguesia,acronym,validVotesPercentage,votes,dicofre
Covelas,PS,41.11,104,030906
Covelas,PPD/PSD,34.39,87,030906
Covelas,B.E.,9.09,23,030906
Covelas,CDS-PP,5.53,14,030906
Covelas,PCP-PEV,3.95,10,030906
Covelas,L,1.58,4,030906
Covelas,A,0.79,2,030906
Covelas,CH,0.79,2,030906
Covelas,PAN,0.79,2,030906
Covelas,IL,0.4,1,030906
Covelas,PCTP/MRPP,0.4,1,030906
Covelas,PTP,0.4,1,030906
Covelas,PURP,0.4,1,030906
Covelas,R.I.R.,0.4,1,030906
Covelas,JPP,0,0,030906
Covelas,MAS,0,0,030906
Covelas,MPT,0,0,030906
Covelas,NC,0,0,030906
Covelas,PDR,0,0,030906
Covelas,PNR,0,0,030906
Covelas,PPM,0,0,030906
