freguesia,acronym,validVotesPercentage,votes,dicofre
Gondar,PS,46.4,670,030821
Gondar,PPD/PSD,21.33,308,030821
Gondar,B.E.,12.6,182,030821
Gondar,PCP-PEV,11.7,169,030821
Gondar,PAN,2.15,31,030821
Gondar,L,1.52,22,030821
Gondar,CDS-PP,1.11,16,030821
Gondar,MAS,0.76,11,030821
Gondar,R.I.R.,0.69,10,030821
Gondar,CH,0.42,6,030821
Gondar,PCTP/MRPP,0.42,6,030821
Gondar,IL,0.28,4,030821
Gondar,A,0.14,2,030821
Gondar,PNR,0.14,2,030821
Gondar,PPM,0.14,2,030821
Gondar,PURP,0.14,2,030821
Gondar,NC,0.07,1,030821
Gondar,JPP,0,0,030821
Gondar,MPT,0,0,030821
Gondar,PDR,0,0,030821
Gondar,PTP,0,0,030821
