Objeto do Contrato,Tipo de Procedimento,Tipo(s) de Contrato,CPVs,Entidade(s) Adjudicante(s),Entidade(s) Adjudicatária(s),Preço Contratual,Data de Publicação,Data de Celebração do Contrato,Prazo de Execução,Local de Execução,Fundamentação,Data de Fecho do Contrato,Preço Total Efetivo,Causas das Alterações ao Prazo,Causas das Alterações ao Preço,Estado,N.º registo do Acordo Quadro,Descrição do Acordo Quadro,Procedimento Centralizado
MCDT´S - ACESSOS VENOSOS,Ajuste Direto Regime Geral,Aquisição de serviços,"85121220-1, Serviços especializados de nefrologia ou do sistema nervoso","Hospital do Espírito Santo de Évora, EPE (508085888)",NEPHROCARE (501127550),"29.600,00 €",04-11-2013,29-08-2013,120 dias,"Portugal, Évora, Évora",Artigo 258.º do Código dos Contratos Públicos,,,,,,Não aplicável.,Não aplicável.,
FONTE DE LUZ PROCESSADOR,Ajuste Direto Regime Geral,Aquisição de bens móveis,"33168000-5, Aparelhos para endoscopia e endocirurgia","Hospital do Espírito Santo de Évora, EPE (508085888)",OLYMPUS IBERIA SAU - SUC PORTUGAL (980474710),"17.950,00 €",04-11-2013,15-10-2013,90 dias,"Portugal, Évora, Évora",Artigo 258.º do Código dos Contratos Públicos,,,,,,Não aplicável.,Não aplicável.,
MATERIAL DE CATETERES,Ao abrigo de acordo-quadro (art.º 259.º),Aquisição de bens móveis,"33190000-8, Dispositivos e produtos médicos variados","Hospital do Espírito Santo de Évora, E. P. E. (508085888)","PMH-PROD MEDICOS HOSPITALARES (502376899), B BRAUN MEDICAL LDA (501506543), PERGUT PORTUGAL (501799729)","26.581,01 €",04-11-2013,26-06-2013,180 dias,"Portugal, Évora, Évora",Artigo 259.º do Código dos Contratos Públicos,,,,,,412727,CONCURSO PÚBLICO PARA A CELEBRAÇÃO DE CONTRATOS PÚBLICOS DE APROVISIONAMENTO PARA AQUISIÇÃO DE MATERIAL CATETERES,
Contratação de serviços médicos na área de cardiologia - hemodinâmica.,Ajuste Direto Regime Geral,Aquisição de serviços,"85121231-1, Serviços de cardiologia","Hospital do Espírito Santo de Évora, E. P. E. (508085888)",Servsad - Serviços Avançados Saúde SA (504260235),"31.680,00 €",04-11-2013,15-10-2013,90 dias,"Portugal, Évora, Évora","Artigo 20.º, n.º 1, alínea a) do Código dos Contratos Públicos",,,,,,Não aplicável.,Não aplicável.,
MEDICAMENTOS DO FORO ONCOLÓGICO II.,Ao abrigo de acordo-quadro (art.º 259.º),Aquisição de bens móveis,"33690000-3, Medicamentos vários","Hospital do Espírito Santo de Évora, E. P. E. (508085888)","ROCHE FARMACEUTICA QUIMICA LDA (500233810), TEVA PHARMA - PRODUTOS FARMACEUTICOS LDA (507045491), MEDAC (980369959)","83.912,85 €",04-11-2013,25-09-2013,120 dias,"Portugal, Évora, Évora",Artigo 259.º do Código dos Contratos Públicos,,,,,,383205,CONCURSO PÚBLICO PARA A CELEBRAÇÃO DE CONTRATOS PÚBLICOS DE APROVISIONAMENTO PARA AQUISIÇÃO MEDICAMENTOS DO FORO ONCOLÓGICO II,
"MEDICAMENTOS DO SISTEMA NERVOSO DO CEREBROESPINAL, EXCEPTO ANESTÉSICOS,RELAXANTES MUSCULARES,ANALGÉSICOS,ANTIPIRÉTICOS,ANTIDEPRESSORES E ANTIPSICÓTICOS.",Ao abrigo de acordo-quadro (art.º 259.º),Aquisição de bens móveis,"33690000-3, Medicamentos vários","Hospital do Espírito Santo de Évora, E. P. E. (508085888)","LAB PFIZER LDA (500162166), TECNIFAR SA (500280436), MEDA PHARMA S A (500082090), SANOFI- PRODUTOS FARMACEUTICOS LDA (500134960), DLA FARMACEUTICA SA (503894427), OVERPHARMA LDA (505792362), HIKMA FARMACEUTICA (502266791), FARMOZ - SOC TECNICO MEDICINAL SA (501505334), GENERIS - FARMACEUTICA SA (508107997), RES MEDICAL (502440163), LABESFAL SA (501169580), COMBINO PHARM PORTUGAL LDA (508622263), MERCK SHARP & DOME LDA (500191360), ACTAVIS AS (980334934), ROCHE FARMACEUTICA QUIMICA LDA (500233810)","32.927,04 €",04-11-2013,25-09-2013,120 dias,"Portugal, Évora, Évora",Artigo 259.º do Código dos Contratos Públicos,,,,,,463786,"P 2012/2 - Medicamentos do Sistema Nervoso Cerebrospinal: exceto anestésicos, relaxantes musculares, analgésicos, antipiréticos, antidepressores e anti-psicóticos",
MEDICAMENTOS DO FORO ONCOLÓGICO.,Ao abrigo de acordo-quadro (art.º 259.º),Aquisição de bens móveis,"33690000-3, Medicamentos vários","Hospital do Espírito Santo de Évora, E. P. E. (508085888)","RES MEDICAL (502440163), ROCHE FARMACEUTICA QUIMICA LDA (500233810), ASTRAZENECA PROD FARM LDA (502942240), HOSPIRA PORTUGAL LDA (502918098)","279.783,72 €",04-11-2013,25-09-2013,120 dias,"Portugal, Évora, Évora",Artigo 259.º do Código dos Contratos Públicos,,,,,,345900,CONCURSO PÚBLICO PARA A CELEBRAÇÃO DE CONTRATOS PÚBLICOS DE APROVISIONAMENTO PARA AQUISIÇÃO MEDICAMENTOS DO FORO ONCOLÓGICO,
MEDICAMENTOS DIVERSOS I- APARELHO DIGESTIVO,Ao abrigo de acordo-quadro (art.º 259.º),Aquisição de bens móveis,"33690000-3, Medicamentos vários","Hospital do Espírito Santo de Évora, E. P. E. (508085888)","LABORATORIOS NORMON SA (505654156), OVERPHARMA LDA (505792362), SIDEFARMA LDA (500717419), SANOFI- PRODUTOS FARMACEUTICOS LDA (500134960), ASTELLAS FARMA LDA (502540249), LABESFAL SA (501169580), PROSPA-LAB FARMACEUTICOS SA (500130248), UNILFARMA (500293023)","9.479,49 €",04-11-2013,23-08-2013,120 dias,"Portugal, Évora, Évora",Artigo 259.º do Código dos Contratos Públicos,,,,,,520788,CONCURSO PUBLICO PARA A CELEBRAÇÃO DE CONTRATOS PUBLICOS DE APROVISIONAMENTO PARA A AREA DA SAUDE  COM VISTA AO FORNECIMENTO DE MEDICAMENTOS PARA O APARELHO DIGESTIVO  AS INSITUIÇÕES DO SERVIÇO NACIONAL DE SAÚDE,
Medicamentos de consumo geral e outros,Ajuste Direto Regime Geral,Aquisição de bens móveis,"33690000-3, Medicamentos vários","Hospital do Espírito Santo de Évora, E. P. E. (508085888)","Astrazeneca Prod Farm Lda (502942240), Lab Vitoria (500162220), Sanofi-Produtos Farmaceuticos Lda (500134960), Alcon Portugal (501251685), B Braun Medical Lda (501506543), Proclinica Lda (500222665), Combino Pharm Portugal Lda (508622263), Lab Pfizer Lda (500162166), Fresenius Kabi Pharma Portugal (504293753), Janssen Cilag Farmaceutica Lda (500189412), Thea Portugal SA (507978358), Angelini Farmaceutica Lda (500583650), Lab Edol - Prod Farmaceuticos SA (507072642), Merck Sharp & Dome Lda (500191360), Labesfal SA (501169580), Sandoz Farmaceutica Lda (506985261), Healthcare Unipessoal Lda (509117961), GlaxoSmithKline Consum Healthc (500276994), Meda Pharma SA (500082090), Generis-Farmaceutica SA (508107997), Teva Pharma-Produtos Farmaceuticos Lda (507045491), Overpharma Lda (505792362), Actavis AS (980334934), Ratiopharm Lda (502414910), Res Medical  (502440163), Bayer Portugal SA (500043256), Lab Medinfar (500384045), Novartis Farma-Prod Farmaceuticos (500063524), Abbot Medical Optics Spain Sl Suc Portugal (980262364), Bristol-Myers Squib Farmac Portuguesa Sa (500048193)","672.143,38 €",31-10-2013,08-05-2013,240 dias,"Portugal, Évora, Évora",Artigo 258.º do Código dos Contratos Públicos,,,,,,Não aplicável.,Não aplicável.,
Medicamentos de consumo geral e outros.,Ajuste Direto Regime Geral,Aquisição de bens móveis,"33690000-3, Medicamentos vários","Hospital do Espírito Santo de Évora, E. P. E. (508085888)","Merck Sharp & Dome Lda (500191360), Generis - Farmaceutica SA (508107997)","7.727,85 €",31-10-2013,27-06-2013,180 dias,"Portugal, Évora, Évora",Artigo 258.º do Código dos Contratos Públicos,,,,,,Não aplicável.,Não aplicável.,
"Dispositivos médicos, material de penso.",Ao abrigo de acordo-quadro (art.º 259.º),Aquisição de bens móveis,"33190000-8, Dispositivos e produtos médicos variados","Hospital do Espírito Santo de Évora, E. P. E. (508085888)",ALBINO DIAS ANDRADE (500013810),"6.560,96 €",31-10-2013,19-08-2013,8 dias,"Portugal, Évora, Évora",Artigo 259.º do Código dos Contratos Públicos,,,,,,534953,"CONCURSO PÚBLICO PARA A CELEBRAÇÃO DE CONTRATOS PÚBLICOS DE APROVISIONAMENTO PARA A ÁREA DA SAÚDE, COM VISTA AO FORNECIMENTO DE MATERIAL DE PENSO TRADICIONAL/CLASSICO - PARTE 1 - ÀS INSTITUIÇÕES E SERVIÇOS DO SERVIÇO NACIONAL DE SAÚDE  ",
Dispositivos médicos.,Ajuste Direto Regime Geral,Aquisição de bens móveis,"33190000-8, Dispositivos e produtos médicos variados","Hospital do Espírito Santo de Évora, E. P. E. (508085888)",JOHNSON & JOHNSON LDA (500153370),"6.874,22 €",31-10-2013,24-09-2013,8 dias,"Portugal, Évora, Évora","Artigo 20.º, n.º 1, alínea a) do Código dos Contratos Públicos",,,,,,Não aplicável.,Não aplicável.,
Dispositivos médicos variados.,Ajuste Direto Regime Geral,Aquisição de bens móveis,"33190000-8, Dispositivos e produtos médicos variados","Hospital do Espírito Santo de Évora, E. P. E. (508085888)",BAUSCH & LOMB S A (980218764),"6.919,93 €",31-10-2013,17-09-2013,8 dias,"Portugal, Évora, Évora","Artigo 20.º, n.º 1, alínea a) do Código dos Contratos Públicos",,,,,,Não aplicável.,Não aplicável.,
Dispositivos médicos.,Ajuste Direto Regime Geral,Aquisição de bens móveis,"33190000-8, Dispositivos e produtos médicos variados","Hospital do Espírito Santo de Évora, E. P. E. (508085888)",B BRAUN MEDICAL LDA (501506543),"9.717,00 €",31-10-2013,12-09-2013,8 dias,"Portugal, Évora, Évora","Artigo 20.º, n.º 1, alínea a) do Código dos Contratos Públicos",,,,,,Não aplicável.,Não aplicável.,
Dispositivos médicos.,Ajuste Direto Regime Geral,Aquisição de bens móveis,"33190000-8, Dispositivos e produtos médicos variados","Hospital do Espírito Santo de Évora, E. P. E. (508085888)",MEDXRAY - SISTEMAS MEDICOS lda (506187071),"7.749,00 €",31-10-2013,04-10-2013,8 dias,"Portugal, Évora, Évora","Artigo 20.º, n.º 1, alínea a) do Código dos Contratos Públicos",,,,,,Não aplicável.,Não aplicável.,
Dispositivos médicos,Ajuste Direto Regime Geral,Aquisição de bens móveis,"33190000-8, Dispositivos e produtos médicos variados","Hospital do Espírito Santo de Évora, E. P. E. (508085888)",B BRAUN MEDICAL LDA (501506543),"6.937,20 €",31-10-2013,16-10-2013,8 dias,"Portugal<BR/>Portugal, Évora, Évora","Artigo 20.º, n.º 1, alínea a) do Código dos Contratos Públicos",,,,,,Não aplicável.,Não aplicável.,
Dispositivos médicos,Ajuste Direto Regime Geral,Aquisição de bens móveis,"33190000-8, Dispositivos e produtos médicos variados","Hospital do Espírito Santo de Évora, E. P. E. (508085888)",VOLCANO EUROPE BVBA (BE0859842345),"5.782,00 €",31-10-2013,21-10-2013,8 dias,"Portugal, Évora, Évora","Artigo 20.º, n.º 1, alínea a) do Código dos Contratos Públicos",,,,,,Não aplicável.,Não aplicável.,
Dispositivos médicos,Ajuste Direto Regime Geral,Aquisição de bens móveis,"33190000-8, Dispositivos e produtos médicos variados","Hospital do Espírito Santo de Évora, E. P. E. (508085888)",TERUMO EUROPE ESPANA SL (PORTUGAL) (980472024),"8.831,40 €",31-10-2013,21-10-2013,8 dias,"Portugal, Évora, Évora","Artigo 20.º, n.º 1, alínea a) do Código dos Contratos Públicos",,,,,,Não aplicável.,Não aplicável.,
