freguesia,acronym,validVotesPercentage,votes,dicofre
Sendas,PPD/PSD,72.27,86,040246
Sendas,PS,15.13,18,040246
Sendas,B.E.,3.36,4,040246
Sendas,PCTP/MRPP,2.52,3,040246
Sendas,CDS-PP,1.68,2,040246
Sendas,L,0.84,1,040246
Sendas,NC,0.84,1,040246
Sendas,PCP-PEV,0.84,1,040246
Sendas,PDR,0.84,1,040246
Sendas,PTP,0.84,1,040246
Sendas,R.I.R.,0.84,1,040246
Sendas,A,0,0,040246
Sendas,CH,0,0,040246
Sendas,IL,0,0,040246
Sendas,PAN,0,0,040246
Sendas,PNR,0,0,040246
Sendas,PPM,0,0,040246
Sendas,PURP,0,0,040246
