Objeto do Contrato,Tipo de Procedimento,Tipo(s) de Contrato,CPVs,Entidade(s) Adjudicante(s),Entidade(s) Adjudicatária(s),Preço Contratual,Data de Publicação,Data de Celebração do Contrato,Prazo de Execução,Local de Execução,Fundamentação,Data de Fecho do Contrato,Preço Total Efetivo,Causas das Alterações ao Prazo,Causas das Alterações ao Preço,Estado,N.º registo do Acordo Quadro,Descrição do Acordo Quadro,Procedimento Centralizado
Medicamentos para aparelho locomotor,Ao abrigo de acordo-quadro (art.º 258.º),Aquisição de bens móveis,"33600000-6, Produtos farmacêuticos","Centro Hospitalar do Algarve, E. P. E. (510745997)","OVERPHARMA-PROD.MED.FARMACEUTICOS,LDA (505792362)","10,24 €",10-01-2014,23-12-2013,365 dias,"Portugal, Faro, Portimão<BR/>Portugal, Faro, Lagos<BR/>Portugal, Faro, Faro",Artigo 258.º do Código dos Contratos Públicos,"","",,"",,520788,CONCURSO PUBLICO PARA A CELEBRAÇÃO DE CONTRATOS PUBLICOS DE APROVISIONAMENTO PARA A AREA DA SAUDE  COM VISTA AO FORNECIMENTO DE MEDICAMENTOS PARA O APARELHO DIGESTIVO  AS INSITUIÇÕES DO SERVIÇO NACIONAL DE SAÚDE,FALSE
Corretivos da Volémia e Alterações Eletroliticas,Ajuste Direto Regime Geral,Aquisição de bens móveis,"33600000-6, Produtos farmacêuticos","Centro Hospitalar do Algarve, E. P. E. (510745997)","SANOFI - PRODUTOS FARMACEUTICOS, LDA (500134960)","139.935,00 €",10-01-2014,21-11-2013,365 dias,"Portugal, Faro, Portimão<BR/>Portugal, Faro, Lagos<BR/>Portugal, Faro, Faro","Artigo 24.º, n.º 1, alínea e) do Código dos Contratos Públicos","","",,"",,Não aplicável.,Não aplicável.,FALSE
Corretivos da Volémia e Alterações Eletroliticas,Ajuste Direto Regime Geral,Aquisição de bens móveis,"33600000-6, Produtos farmacêuticos","Centro Hospitalar do Algarve, E. P. E. (510745997)","FRESENIUS MEDICAL CARE PORTUGAL, SA (503070220)","13.313,60 €",10-01-2014,21-11-2013,365 dias,"Portugal, Faro, Faro<BR/>Portugal, Faro, Portimão<BR/>Portugal, Faro, Lagos","Artigo 24.º, n.º 1, alínea e) do Código dos Contratos Públicos","","",,"",,Não aplicável.,Não aplicável.,FALSE
Corretivos da Volémia e Alterações Eletroliticas,Ajuste Direto Regime Geral,Aquisição de bens móveis,"33600000-6, Produtos farmacêuticos","Centro Hospitalar do Algarve, E. P. E. (510745997)","FRESENIUS KAB PHARMA PORTUGAL, LDA (504293753)","1.488,97 €",10-01-2014,21-11-2013,365 dias,"Portugal, Faro, Portimão<BR/>Portugal, Faro, Lagos<BR/>Portugal, Faro, Faro","Artigo 24.º, n.º 1, alínea e) do Código dos Contratos Públicos","","",,"",,Não aplicável.,Não aplicável.,FALSE
Corretivos da Volémia e Alterações Eletroliticas,Ajuste Direto Regime Geral,Aquisição de bens móveis,"33600000-6, Produtos farmacêuticos","Centro Hospitalar do Algarve, E. P. E. (510745997)",NOVARTIS CONSUMER HEALTH (500268215),"628,00 €",10-01-2014,21-11-2013,365 dias,"Portugal, Faro, Lagos<BR/>Portugal, Faro, Faro<BR/>Portugal, Faro, Portimão","Artigo 24.º, n.º 1, alínea e) do Código dos Contratos Públicos","","",,"",,Não aplicável.,Não aplicável.,FALSE
Corretivos da Volémia e Alterações Eletroliticas,Ajuste Direto Regime Geral,Aquisição de bens móveis,"33600000-6, Produtos farmacêuticos","Centro Hospitalar do Algarve, E. P. E. (510745997)",B.BRAUN MEDICAL (501506543),"168,44 €",10-01-2014,21-11-2013,365 dias,"Portugal, Faro, Lagos<BR/>Portugal, Faro, Portimão<BR/>Portugal, Faro, Faro","Artigo 24.º, n.º 1, alínea e) do Código dos Contratos Públicos","","",,"",,Não aplicável.,Não aplicável.,FALSE
Corretivos da Volémia e Alterações Eletroliticas,Ajuste Direto Regime Geral,Aquisição de bens móveis,"33600000-6, Produtos farmacêuticos","Centro Hospitalar do Algarve, E. P. E. (510745997)","LABESFAL,SA. (501169580)","5.522,57 €",10-01-2014,21-11-2013,365 dias,"Portugal, Faro, Faro<BR/>Portugal, Faro, Portimão<BR/>Portugal, Faro, Lagos","Artigo 24.º, n.º 1, alínea e) do Código dos Contratos Públicos","","",,"",,Não aplicável.,Não aplicável.,FALSE
Atazanavir 200 mg Cáps. e Atazanavir 300 mg Cáps,Ao abrigo de acordo-quadro (art.º 258.º),Aquisição de bens móveis,"33650000-1, Anti-infecciosos gerais de uso sistémico, vacinas, antineoplásicos e imunomoduladores","Centro Hospitalar do Algarve, E. P. E. (510745997)","Bristol-Myers Squibb Farmacêutica Portuguesa, S.A. (500048193)","881.009,94 €",10-01-2014,06-12-2013,365 dias,"Portugal, Faro, Portimão<BR/>Portugal, Faro, Lagos<BR/>Portugal, Faro, Faro",Artigo 258.º do Código dos Contratos Públicos,31-12-2014,"881.009,94 €",,"",,461371,CP 2012/40 - MEDICAMENTOS ANTI-RETROVIRAIS,FALSE
Noradrenalina 1 mg/ml Sol inj Fr 5 ml IV,Ao abrigo de acordo-quadro (art.º 259.º),Aquisição de bens móveis,"33650000-1, Anti-infecciosos gerais de uso sistémico, vacinas, antineoplásicos e imunomoduladores","Centro Hospitalar do Algarve, E. P. E. (510745997)","B. BRAUN MEDICAL,LDA. (501506543)","55.350,00 €",10-01-2014,10-12-2013,365 dias,"Portugal, Faro, Faro<BR/>Portugal, Faro, Lagos<BR/>Portugal, Faro, Portimão",Artigo 259.º do Código dos Contratos Públicos,31-12-2014,"55.350,00 €",,"",,1093903,Fornecimento de «Medicamentos FF OSI - Aparelho Cardiovascular»,FALSE
Noradrenalina 1 mg/ml Sol inj Fr 10 ml IV,Ao abrigo de acordo-quadro (art.º 259.º),Aquisição de bens móveis,"33650000-1, Anti-infecciosos gerais de uso sistémico, vacinas, antineoplásicos e imunomoduladores","Centro Hospitalar do Algarve, E. P. E. (510745997)","LABESFAL-LABORAT.ALMIRO, S.A. (501169580)","300.600,00 €",10-01-2014,10-12-2013,365 dias,"Portugal, Faro, Lagos<BR/>Portugal, Faro, Faro<BR/>Portugal, Faro, Portimão",Artigo 259.º do Código dos Contratos Públicos,31-12-2014,"300.600,00 €",,"",,1093903,Fornecimento de «Medicamentos FF OSI - Aparelho Cardiovascular»,FALSE
Insulina glargina 100 U/ml Acção prolong Sol inj Fr 10 ml SC,Ao abrigo de acordo-quadro (art.º 258.º),Aquisição de bens móveis,"33640000-8, Medicamentos para o aparelho geniturinário e hormonas","Centro Hospitalar do Algarve, E. P. E. (510745997)","Sanofi, Lda. (500134960)","22.399,80 €",09-01-2014,08-01-2014,356 dias,"Portugal, Faro, Lagos<BR/>Portugal, Faro, Faro<BR/>Portugal, Faro, Portimão",Artigo 258.º do Código dos Contratos Públicos,"","",,"",,603979,"CONCURSO PÚBLICO PARA A CELEBRAÇÃO DE CONTRATOS PÚBLICOS DE APROVISIONAMENTO PARA A ÁREA DA SAÚDE, COM VISTA AO FORNECIMENTO DE HORMONAS E OUTROS MEDICAMENTOS USADOS NO TRATAMENTO DAS DOENÇAS ENDÓCRINAS, ÀS INSTITUIÇÕES E SERVIÇOS DO SERVIÇO NACIONAL DE SAÚDE",FALSE
Efavirenz 600 mg + Entricitabina 200 mg + Tenofir 245 mg.,Ao abrigo de acordo-quadro (art.º 258.º),Aquisição de bens móveis,"33650000-1, Anti-infecciosos gerais de uso sistémico, vacinas, antineoplásicos e imunomoduladores","Centro Hospitalar do Algarve, E. P. E. (510745997)","Gilead Sciences, Lda. (503604704)","942.300,00 €",08-01-2014,14-10-2013,365 dias,"Portugal, Faro, Lagos<BR/>Portugal, Faro, Portimão<BR/>Portugal, Faro, Faro",Artigo 258.º do Código dos Contratos Públicos,31-12-2014,"942.300,00 €",,"",,461371,CP 2012/40 - MEDICAMENTOS ANTI-RETROVIRAIS,FALSE
AD 2940.2013 - Ar Condicionado para o Gabinete do Serviço de Alimentação,Ajuste Direto Regime Geral,Aquisição de bens móveis,"39100000-3, Mobiliário","Centro Hospitalar do Algarve, E. P. E. (510745997)","TecnoSpie, SA (500205698)","736,59 €",08-01-2014,15-10-2013,78 dias,"Portugal, Faro, Faro","Artigo 24.º, n.º 1, alínea e) do Código dos Contratos Públicos","","",,"",,Não aplicável.,Não aplicável.,FALSE
AD 2940.2013 - Fornecimento de ar Condicionado para a Area de Redes e Infraestruturas,Ajuste Direto Regime Geral,Aquisição de bens móveis,"39100000-3, Mobiliário","Centro Hospitalar do Algarve, E. P. E. (510745997)","Tecnospie, SA (500205698)","839,65 €",08-01-2014,15-10-2013,78 dias,"Portugal, Faro, Faro","Artigo 24.º, n.º 1, alínea e) do Código dos Contratos Públicos","","",,"",,Não aplicável.,Não aplicável.,FALSE
AD 2619.2013 - Fornecimento de materiais para selagem,Ajuste Direto Regime Geral,Aquisição de serviços,"50000000-5, Serviços de reparação e manutenção","Centro Hospitalar do Algarve, E. P. E. (510745997)","Acciona, SA (503431397)","7.621,63 €",07-01-2014,15-10-2013,78 dias,"Portugal, Faro, Faro","Artigo 24.º, n.º 1, alínea e) do Código dos Contratos Públicos","","",,"",,Não aplicável.,Não aplicável.,FALSE
Golimumab 50 mg/0.5 ml Sol inj Caneta 0.5 ml SC,Ao abrigo de acordo-quadro (art.º 258.º),Aquisição de bens móveis,"33650000-1, Anti-infecciosos gerais de uso sistémico, vacinas, antineoplásicos e imunomoduladores","Centro Hospitalar do Algarve, E. P. E. (510745997)","Merck Sharp & Dohme, Lda. (500191360)","383.367,60 €",07-01-2014,29-10-2013,365 dias,"Portugal, Faro, Lagos<BR/>Portugal, Faro, Faro<BR/>Portugal, Faro, Portimão",Artigo 258.º do Código dos Contratos Públicos,31-12-2014,"383.367,60 €",,"",,345900,CONCURSO PÚBLICO PARA A CELEBRAÇÃO DE CONTRATOS PÚBLICOS DE APROVISIONAMENTO PARA AQUISIÇÃO MEDICAMENTOS DO FORO ONCOLÓGICO,FALSE
Emtricitabina 200 mg + Tenofovir 245 mg Comp.,Ao abrigo de acordo-quadro (art.º 258.º),Aquisição de bens móveis,"33650000-1, Anti-infecciosos gerais de uso sistémico, vacinas, antineoplásicos e imunomoduladores","Centro Hospitalar do Algarve, E. P. E. (510745997)","Gilead Sciences, Lda. (503604704)","908.730,90 €",07-01-2014,14-10-2013,365 dias,"Portugal, Faro, Portimão<BR/>Portugal, Faro, Lagos<BR/>Portugal, Faro, Faro",Artigo 258.º do Código dos Contratos Públicos,31-12-2014,"908.730,90 €",,"",,461371,CP 2012/40 - MEDICAMENTOS ANTI-RETROVIRAIS,FALSE
Aquisição de Medicamentos para o Aparelho Geniturinário,Ao abrigo de acordo-quadro (art.º 258.º),Aquisição de bens móveis,"33640000-8, Medicamentos para o aparelho geniturinário e hormonas","Centro Hospitalar do Algarve, E. P. E. (510745997)","Novartis Farma - Produtos Farmacêuticos, S.A. (500063524)","22,08 €",07-01-2014,18-12-2013,360 dias,"Portugal, Faro, Faro<BR/>Portugal, Faro, Portimão<BR/>Portugal, Faro, Lagos",Artigo 258.º do Código dos Contratos Públicos,"","",,"",,601981,"CONCURSO PÚBLICO PARA A CELEBRAÇÃO DE CONTRATOS PÚBLICOS DE APROVISIONAMENTO PARA A ÁREA DA SAÚDE, COM VISTA AO FORNECIMENTO DE MEDICAMENTOS DE CONSUMO GERAL - APARELHO GENITURINÁRIO ÀS INSTITUIÇÕES E SERVIÇOS DO SERVIÇO NACIONAL DE SAÚDE",FALSE
Aquisição de medicamentos para o aparelho geniturinário,Ao abrigo de acordo-quadro (art.º 258.º),Aquisição de bens móveis,"33640000-8, Medicamentos para o aparelho geniturinário e hormonas","Centro Hospitalar do Algarve, E. P. E. (510745997)","OVERPHARMA,LDA. (505792362)","103,12 €",07-01-2014,18-12-2013,360 dias,"Portugal, Faro, Lagos<BR/>Portugal, Faro, Faro<BR/>Portugal, Faro, Portimão",Artigo 258.º do Código dos Contratos Públicos,"","",,"",,601981,"CONCURSO PÚBLICO PARA A CELEBRAÇÃO DE CONTRATOS PÚBLICOS DE APROVISIONAMENTO PARA A ÁREA DA SAÚDE, COM VISTA AO FORNECIMENTO DE MEDICAMENTOS DE CONSUMO GERAL - APARELHO GENITURINÁRIO ÀS INSTITUIÇÕES E SERVIÇOS DO SERVIÇO NACIONAL DE SAÚDE",FALSE
Aquisição de medicamentos para o aparelho geniturinário,Ao abrigo de acordo-quadro (art.º 258.º),Aquisição de bens móveis,"33640000-8, Medicamentos para o aparelho geniturinário e hormonas","Centro Hospitalar do Algarve, E. P. E. (510745997)","MERCK SHARP & DHOME,LDA. (500191360)","1.003,45 €",07-01-2014,18-12-2013,360 dias,"Portugal, Faro, Faro<BR/>Portugal, Faro, Portimão<BR/>Portugal, Faro, Lagos",Artigo 258.º do Código dos Contratos Públicos,"","",,"",,601981,"CONCURSO PÚBLICO PARA A CELEBRAÇÃO DE CONTRATOS PÚBLICOS DE APROVISIONAMENTO PARA A ÁREA DA SAÚDE, COM VISTA AO FORNECIMENTO DE MEDICAMENTOS DE CONSUMO GERAL - APARELHO GENITURINÁRIO ÀS INSTITUIÇÕES E SERVIÇOS DO SERVIÇO NACIONAL DE SAÚDE",FALSE
Medicamentos Anti-Infecciosos,Ao abrigo de acordo-quadro (art.º 258.º),Aquisição de bens móveis,"33650000-1, Anti-infecciosos gerais de uso sistémico, vacinas, antineoplásicos e imunomoduladores","Centro Hospitalar do Algarve, E. P. E. (510745997)","FRESENIUS KABI PHARMA PORTUGAL, LDA (504293753)","3.999,50 €",07-01-2014,12-12-2013,365 dias,"Portugal, Faro, Portimão<BR/>Portugal, Faro, Faro<BR/>Portugal, Faro, Lagos",Artigo 258.º do Código dos Contratos Públicos,"","",,"",,461371,CP 2012/40 - MEDICAMENTOS ANTI-RETROVIRAIS,FALSE
Medicamentos Anti-Infecciosos,Ao abrigo de acordo-quadro (art.º 258.º),Aquisição de bens móveis,"33650000-1, Anti-infecciosos gerais de uso sistémico, vacinas, antineoplásicos e imunomoduladores","Centro Hospitalar do Algarve, E. P. E. (510745997)","Glaxo SmithKline - Produtos Farmacêutico, Lda.  (500139962)","19.823,26 €",07-01-2014,12-12-2013,365 dias,"Portugal, Faro, Faro<BR/>Portugal, Faro, Portimão<BR/>Portugal, Faro, Lagos",Artigo 258.º do Código dos Contratos Públicos,"","",,"",,461371,CP 2012/40 - MEDICAMENTOS ANTI-RETROVIRAIS,FALSE
Aquisição de medicamentos para o aparelho geniturinário,Ao abrigo de acordo-quadro (art.º 258.º),Aquisição de bens móveis,"33640000-8, Medicamentos para o aparelho geniturinário e hormonas","Centro Hospitalar do Algarve, E. P. E. (510745997)","LABORATÓRIOS PFIZER, LDA. (500162166)","28.659,84 €",07-01-2014,18-12-2013,360 dias,"Portugal, Faro, Faro<BR/>Portugal, Faro, Lagos<BR/>Portugal, Faro, Portimão",Artigo 258.º do Código dos Contratos Públicos,"","",,"",,601981,"CONCURSO PÚBLICO PARA A CELEBRAÇÃO DE CONTRATOS PÚBLICOS DE APROVISIONAMENTO PARA A ÁREA DA SAÚDE, COM VISTA AO FORNECIMENTO DE MEDICAMENTOS DE CONSUMO GERAL - APARELHO GENITURINÁRIO ÀS INSTITUIÇÕES E SERVIÇOS DO SERVIÇO NACIONAL DE SAÚDE",FALSE
Medicamentos Anti-Infecciosos,Ao abrigo de acordo-quadro (art.º 258.º),Aquisição de bens móveis,"33650000-1, Anti-infecciosos gerais de uso sistémico, vacinas, antineoplásicos e imunomoduladores","Centro Hospitalar do Algarve, E. P. E. (510745997)","ViiV Healthcare, Unipessoal Lda (509117961)","33.903,02 €",07-01-2014,12-12-2013,365 dias,"Portugal, Faro, Lagos<BR/>Portugal, Faro, Portimão<BR/>Portugal, Faro, Faro",Artigo 258.º do Código dos Contratos Públicos,"","",,"",,461371,CP 2012/40 - MEDICAMENTOS ANTI-RETROVIRAIS,FALSE
Aquisição de medicamentos para o aparelho geniturinário,Ao abrigo de acordo-quadro (art.º 258.º),Aquisição de bens móveis,"33640000-8, Medicamentos para o aparelho geniturinário e hormonas","Centro Hospitalar do Algarve, E. P. E. (510745997)",Jaba Recordati (500492867),"779,64 €",07-01-2014,18-12-2013,360 dias,"Portugal, Faro, Faro<BR/>Portugal, Faro, Portimão<BR/>Portugal, Faro, Lagos",Artigo 258.º do Código dos Contratos Públicos,"","",,"",,601981,"CONCURSO PÚBLICO PARA A CELEBRAÇÃO DE CONTRATOS PÚBLICOS DE APROVISIONAMENTO PARA A ÁREA DA SAÚDE, COM VISTA AO FORNECIMENTO DE MEDICAMENTOS DE CONSUMO GERAL - APARELHO GENITURINÁRIO ÀS INSTITUIÇÕES E SERVIÇOS DO SERVIÇO NACIONAL DE SAÚDE",FALSE
Medicamentos Anti-Infecciosos,Ao abrigo de acordo-quadro (art.º 258.º),Aquisição de bens móveis,"33650000-1, Anti-infecciosos gerais de uso sistémico, vacinas, antineoplásicos e imunomoduladores","Centro Hospitalar do Algarve, E. P. E. (510745997)","LABESFAL-LABORAT.ALMIRO, S.A. (501169580)","14.487,14 €",07-01-2014,12-12-2013,365 dias,"Portugal, Faro, Lagos<BR/>Portugal, Faro, Faro<BR/>Portugal, Faro, Portimão",Artigo 258.º do Código dos Contratos Públicos,"","",,"",,461371,CP 2012/40 - MEDICAMENTOS ANTI-RETROVIRAIS,FALSE
Aquisição de medicamentos para o aparelho geniturinário,Ao abrigo de acordo-quadro (art.º 258.º),Aquisição de bens móveis,"33640000-8, Medicamentos para o aparelho geniturinário e hormonas","Centro Hospitalar do Algarve, E. P. E. (510745997)","BAYER PORTUGAL,SA (500043256)","15.900,00 €",07-01-2014,18-12-2013,360 dias,"Portugal, Faro, Faro<BR/>Portugal, Faro, Portimão<BR/>Portugal, Faro, Lagos",Artigo 258.º do Código dos Contratos Públicos,"","",,"",,601981,"CONCURSO PÚBLICO PARA A CELEBRAÇÃO DE CONTRATOS PÚBLICOS DE APROVISIONAMENTO PARA A ÁREA DA SAÚDE, COM VISTA AO FORNECIMENTO DE MEDICAMENTOS DE CONSUMO GERAL - APARELHO GENITURINÁRIO ÀS INSTITUIÇÕES E SERVIÇOS DO SERVIÇO NACIONAL DE SAÚDE",FALSE
Medicamentos Anti-Infecciosos,Ao abrigo de acordo-quadro (art.º 258.º),Aquisição de bens móveis,"33650000-1, Anti-infecciosos gerais de uso sistémico, vacinas, antineoplásicos e imunomoduladores","Centro Hospitalar do Algarve, E. P. E. (510745997)","Novartis Farma - Produtos Farmacêuticos, S.A. (500063524)","2.262,00 €",07-01-2014,12-12-2013,365 dias,"Portugal, Faro, Portimão<BR/>Portugal, Faro, Faro<BR/>Portugal, Faro, Lagos",Artigo 258.º do Código dos Contratos Públicos,"","",,"",,461371,CP 2012/40 - MEDICAMENTOS ANTI-RETROVIRAIS,FALSE
Medicamentos Anti-Infecciosos,Ao abrigo de acordo-quadro (art.º 258.º),Aquisição de bens móveis,"33650000-1, Anti-infecciosos gerais de uso sistémico, vacinas, antineoplásicos e imunomoduladores","Centro Hospitalar do Algarve, E. P. E. (510745997)","LABORATÓRIO MEDINFAR - PRODUTOS FARMACÊUTICOS, SA (500384045)","476,00 €",07-01-2014,12-12-2013,365 dias,"Portugal, Faro, Faro<BR/>Portugal, Faro, Lagos<BR/>Portugal, Faro, Portimão",Artigo 258.º do Código dos Contratos Públicos,"","",,"",,461371,CP 2012/40 - MEDICAMENTOS ANTI-RETROVIRAIS,FALSE
Aquisição de medicamentos para o aparelho geniturinário,Ao abrigo de acordo-quadro (art.º 258.º),Aquisição de bens móveis,"33640000-8, Medicamentos para o aparelho geniturinário e hormonas","Centro Hospitalar do Algarve, E. P. E. (510745997)","SANOFI - PRODUTOS FARMACÊUTICOS, LDA. (500134960)","39,10 €",07-01-2014,18-12-2013,360 dias,"Portugal, Faro, Portimão<BR/>Portugal, Faro, Faro<BR/>Portugal, Faro, Lagos",Artigo 258.º do Código dos Contratos Públicos,"","",,"",,601981,"CONCURSO PÚBLICO PARA A CELEBRAÇÃO DE CONTRATOS PÚBLICOS DE APROVISIONAMENTO PARA A ÁREA DA SAÚDE, COM VISTA AO FORNECIMENTO DE MEDICAMENTOS DE CONSUMO GERAL - APARELHO GENITURINÁRIO ÀS INSTITUIÇÕES E SERVIÇOS DO SERVIÇO NACIONAL DE SAÚDE",FALSE
Medicamentos Anti-Infecciosos,Ao abrigo de acordo-quadro (art.º 258.º),Aquisição de bens móveis,"33650000-1, Anti-infecciosos gerais de uso sistémico, vacinas, antineoplásicos e imunomoduladores","Centro Hospitalar do Algarve, E. P. E. (510745997)","ROCHE FARMACÊUTICA E QUÍMICA, LDA. (500233810)","38.410,45 €",07-01-2014,12-12-2013,365 dias,"Portugal, Faro, Faro<BR/>Portugal, Faro, Lagos<BR/>Portugal, Faro, Portimão",Artigo 258.º do Código dos Contratos Públicos,"","",,"",,461371,CP 2012/40 - MEDICAMENTOS ANTI-RETROVIRAIS,FALSE
Medicamentos Anti-Infecciosos,Ao abrigo de acordo-quadro (art.º 258.º),Aquisição de bens móveis,"33650000-1, Anti-infecciosos gerais de uso sistémico, vacinas, antineoplásicos e imunomoduladores","Centro Hospitalar do Algarve, E. P. E. (510745997)",JANSSEN CILAG FARMACEUTICA (500189412),"852,40 €",07-01-2014,12-12-2013,365 dias,"Portugal, Faro, Faro<BR/>Portugal, Faro, Portimão<BR/>Portugal, Faro, Lagos",Artigo 258.º do Código dos Contratos Públicos,"","",,"",,461371,CP 2012/40 - MEDICAMENTOS ANTI-RETROVIRAIS,FALSE
Medicamentos Anti-Infecciosos,Ao abrigo de acordo-quadro (art.º 258.º),Aquisição de bens móveis,"33650000-1, Anti-infecciosos gerais de uso sistémico, vacinas, antineoplásicos e imunomoduladores","Centro Hospitalar do Algarve, E. P. E. (510745997)","MERCK SHARP & DHOME,LDA. (500191360)","1.166,18 €",07-01-2014,12-12-2013,365 dias,"Portugal, Faro, Faro<BR/>Portugal, Faro, Portimão<BR/>Portugal, Faro, Lagos",Artigo 258.º do Código dos Contratos Públicos,"","",,"",,461371,CP 2012/40 - MEDICAMENTOS ANTI-RETROVIRAIS,FALSE
Medicamentos Anti-Infecciosos,Ao abrigo de acordo-quadro (art.º 258.º),Aquisição de bens móveis,"33650000-1, Anti-infecciosos gerais de uso sistémico, vacinas, antineoplásicos e imunomoduladores","Centro Hospitalar do Algarve, E. P. E. (510745997)","LABORATÓRIOS PFIZER, LDA. (500162166)","26.284,78 €",07-01-2014,12-12-2013,365 dias,"Portugal, Faro, Faro<BR/>Portugal, Faro, Portimão<BR/>Portugal, Faro, Lagos",Artigo 258.º do Código dos Contratos Públicos,"","",,"",,461371,CP 2012/40 - MEDICAMENTOS ANTI-RETROVIRAIS,FALSE
Medicamentos Anti-Infecciosos,Ao abrigo de acordo-quadro (art.º 258.º),Aquisição de bens móveis,"33650000-1, Anti-infecciosos gerais de uso sistémico, vacinas, antineoplásicos e imunomoduladores","Centro Hospitalar do Algarve, E. P. E. (510745997)","Gilead Sciences, Lda. (503604704)","46.796,94 €",07-01-2014,12-12-2013,365 dias,"Portugal, Faro, Faro<BR/>Portugal, Faro, Lagos<BR/>Portugal, Faro, Portimão",Artigo 258.º do Código dos Contratos Públicos,"","",,"",,461371,CP 2012/40 - MEDICAMENTOS ANTI-RETROVIRAIS,FALSE
Medicamentos Anti-Infecciosos,Ao abrigo de acordo-quadro (art.º 258.º),Aquisição de bens móveis,"33650000-1, Anti-infecciosos gerais de uso sistémico, vacinas, antineoplásicos e imunomoduladores","Centro Hospitalar do Algarve, E. P. E. (510745997)","FARMOZ - Sociedade Tecnico Medicinal, SA (501505334)","900,00 €",07-01-2014,12-12-2013,365 dias,"Portugal, Faro, Portimão<BR/>Portugal, Faro, Faro<BR/>Portugal, Faro, Lagos",Artigo 258.º do Código dos Contratos Públicos,"","",,"",,461371,CP 2012/40 - MEDICAMENTOS ANTI-RETROVIRAIS,FALSE
Medicamentos Anti-Infecciosos,Ao abrigo de acordo-quadro (art.º 258.º),Aquisição de bens móveis,"33650000-1, Anti-infecciosos gerais de uso sistémico, vacinas, antineoplásicos e imunomoduladores","Centro Hospitalar do Algarve, E. P. E. (510745997)","Unilfarma - União Intern. de Lab. Farmac.,Lda. (500293023)","7.415,28 €",07-01-2014,12-12-2013,365 dias,"Portugal, Faro, Lagos<BR/>Portugal, Faro, Portimão<BR/>Portugal, Faro, Faro",Artigo 258.º do Código dos Contratos Públicos,"","",,"",,461371,CP 2012/40 - MEDICAMENTOS ANTI-RETROVIRAIS,FALSE
Medicamentos Anti-Infecciosos,Ao abrigo de acordo-quadro (art.º 258.º),Aquisição de bens móveis,"33650000-1, Anti-infecciosos gerais de uso sistémico, vacinas, antineoplásicos e imunomoduladores","Centro Hospitalar do Algarve, E. P. E. (510745997)",Actavis A/S Sucursal (980334934),"209,75 €",07-01-2014,12-12-2013,365 dias,"Portugal, Faro, Faro<BR/>Portugal, Faro, Lagos<BR/>Portugal, Faro, Portimão",Artigo 258.º do Código dos Contratos Públicos,"","",,"",,461371,CP 2012/40 - MEDICAMENTOS ANTI-RETROVIRAIS,FALSE
Medicamentos Anti-Infecciosos,Ao abrigo de acordo-quadro (art.º 258.º),Aquisição de bens móveis,"33650000-1, Anti-infecciosos gerais de uso sistémico, vacinas, antineoplásicos e imunomoduladores","Centro Hospitalar do Algarve, E. P. E. (510745997)","BRISTOL-MYERS SQUIBB FARMACÊUTICA PORTUGUESA, S.A. (500048193)","55.389,67 €",07-01-2014,12-12-2013,365 dias,"Portugal, Faro, Portimão<BR/>Portugal, Faro, Lagos<BR/>Portugal, Faro, Faro",Artigo 258.º do Código dos Contratos Públicos,"","",,"",,461371,CP 2012/40 - MEDICAMENTOS ANTI-RETROVIRAIS,FALSE
Medicamentos Anti-Infecciosos,Ao abrigo de acordo-quadro (art.º 258.º),Aquisição de bens móveis,"33650000-1, Anti-infecciosos gerais de uso sistémico, vacinas, antineoplásicos e imunomoduladores","Centro Hospitalar do Algarve, E. P. E. (510745997)","GENERIS FARMACEUTICA,SA (508107997)","22.126,00 €",07-01-2014,12-12-2013,365 dias,"Portugal, Faro, Faro<BR/>Portugal, Faro, Portimão<BR/>Portugal, Faro, Lagos",Artigo 258.º do Código dos Contratos Públicos,"","",,"",,461371,CP 2012/40 - MEDICAMENTOS ANTI-RETROVIRAIS,FALSE
Medicamentos Anti-Infecciosos,Ao abrigo de acordo-quadro (art.º 258.º),Aquisição de bens móveis,"33650000-1, Anti-infecciosos gerais de uso sistémico, vacinas, antineoplásicos e imunomoduladores","Centro Hospitalar do Algarve, E. P. E. (510745997)","SANOFI - PRODUTOS FARMACÊUTICOS, LDA. (500134960)","1.772,01 €",07-01-2014,12-12-2013,365 dias,"Portugal, Faro, Lagos<BR/>Portugal, Faro, Portimão<BR/>Portugal, Faro, Faro",Artigo 258.º do Código dos Contratos Públicos,"","",,"",,461371,CP 2012/40 - MEDICAMENTOS ANTI-RETROVIRAIS,FALSE
Doctor Barbas - Serviços Médicos,Ajuste Direto Regime Geral,Aquisição de serviços,"85121100-4, Serviços de médicos de clínica geral","Centro Hospitalar do Algarve, E. P. E. (510745997)",DoctorBarbas  (508897165),"36.000,00 €",07-01-2014,26-07-2013,180 dias,"Portugal, Faro, Portimão","Artigo 20.º, n.º 1, alínea a) do Código dos Contratos Públicos",31-12-2013,"5.100,00 €",,Valor ajustado face às necessidades reais,,Não aplicável.,Não aplicável.,FALSE
AD 2890/2013 - Prestação de Serviços Médicos Genética Médica (Julho a Dezembro/2013),Ajuste Direto Regime Geral,Aquisição de serviços,"85121200-5, Serviços de medicina especializada","Centro Hospitalar do Algarve, E. P. E. (510745997)","Joaquim de Sá, Genética Médica, Lda. (510258824)","28.800,00 €",07-01-2014,18-12-2013,184 dias,"Portugal, Faro, Faro","Artigo 20.º, n.º 1, alínea a) do Código dos Contratos Públicos","","",,"",,Não aplicável.,Não aplicável.,FALSE
Medibp - Serviços Medicos,Ajuste Direto Regime Geral,Aquisição de serviços,"85121100-4, Serviços de médicos de clínica geral","Centro Hospitalar do Algarve, E. P. E. (510745997)",Medibp - Serviços Médicos Unipessoal Lda  (509860435),"36.000,00 €",07-01-2014,26-07-2013,180 dias,"Portugal, Faro, Portimão","Artigo 20.º, n.º 1, alínea a) do Código dos Contratos Públicos",31-12-2013,"16.200,00 €",,Valor ajustado face às necessidades reais,,Não aplicável.,Não aplicável.,FALSE
Serviços Médicos Dionoctimed,Ajuste Direto Regime Geral,Aquisição de serviços,"85121100-4, Serviços de médicos de clínica geral","Centro Hospitalar do Algarve, E. P. E. (510745997)",Dionoctimed - Serviços Medicos Lda  (507150910),"24.000,00 €",07-01-2014,26-07-2013,180 dias,"Portugal, Faro, Portimão","Artigo 20.º, n.º 1, alínea a) do Código dos Contratos Públicos",30-12-2013,"13.680,00 €",,Valor ajustado às necessidades,,Não aplicável.,Não aplicável.,FALSE
AD 3131/2013 - Prestação de Serviços Médicos Urgência Geral (Julho a Dezembro/2013),Ajuste Direto Regime Geral,Aquisição de serviços,"85121200-5, Serviços de medicina especializada","Centro Hospitalar do Algarve, E. P. E. (510745997)","Marco Dornelles Unipessoal, Lda. (510362656)","28.800,00 €",07-01-2014,30-12-2013,184 dias,"Portugal, Faro, Faro","Artigo 20.º, n.º 1, alínea a) do Código dos Contratos Públicos","","",,"",,Não aplicável.,Não aplicável.,FALSE
Medicamentos Enoxaparina Sódica 40 mg,Ajuste Direto Regime Geral,Aquisição de bens móveis,"33690000-3, Medicamentos vários","Centro Hospitalar do Algarve, E. P. E. (510745997)","Sanofi Produtos Farmacêuticos, Lda. (500134960)","32.762,88 €",07-01-2014,12-12-2013,61 dias,"Portugal, Faro, Faro","Artigo 24.º, n.º 1, alínea e) do Código dos Contratos Públicos","","",,"",,Não aplicável.,Não aplicável.,FALSE
Serviços Médicos,Ajuste Direto Regime Geral,Aquisição de serviços,"85121100-4, Serviços de médicos de clínica geral","Centro Hospitalar do Algarve, E. P. E. (510745997)",Manati Serviços Médicos Unipessoal Lda  (507288726),"74.900,00 €",06-01-2014,26-07-2013,180 dias,"Portugal, Faro, Portimão","Artigo 20.º, n.º 1, alínea a) do Código dos Contratos Públicos",31-12-2013,"78.480,00 €",,Valor ajustado às necessidades reais,,Não aplicável.,Não aplicável.,FALSE
Serviços Médicos,Ajuste Direto Regime Geral,Aquisição de serviços,"85121200-5, Serviços de medicina especializada","Centro Hospitalar do Algarve, E. P. E. (510745997)",Profile - Saude e Turismo Lda  (507982126),"54.000,00 €",06-01-2014,26-07-2013,180 dias,"Portugal, Faro, Portimão","Artigo 20.º, n.º 1, alínea a) do Código dos Contratos Públicos",31-12-2013,"38.825,00 €",,Valor ajustado às necessidades reais,,Não aplicável.,Não aplicável.,FALSE
Interferão alfa-2b 18 M.U.I. Pó sol inj Fr IV SC Interferão alfa-2b 60 M.U.I./1.2 ml Sol inj Cartu SC,Ao abrigo de acordo-quadro (art.º 258.º),Aquisição de bens móveis,"33650000-1, Anti-infecciosos gerais de uso sistémico, vacinas, antineoplásicos e imunomoduladores","Centro Hospitalar do Algarve, E. P. E. (510745997)","Merck Sharp & Dohme, Lda. (500191360)","43.601,76 €",06-01-2014,11-11-2013,365 dias,"Portugal, Faro, Faro<BR/>Portugal, Faro, Lagos<BR/>Portugal, Faro, Portimão",Artigo 258.º do Código dos Contratos Públicos,31-12-2014,"43.601,76 €",,"",,345900,CONCURSO PÚBLICO PARA A CELEBRAÇÃO DE CONTRATOS PÚBLICOS DE APROVISIONAMENTO PARA AQUISIÇÃO MEDICAMENTOS DO FORO ONCOLÓGICO,FALSE
Interferão beta-1a 6 M.U.I./0.5 ml Sol inj Caneta 0.5 ml IM,Ao abrigo de acordo-quadro (art.º 258.º),Aquisição de bens móveis,"33650000-1, Anti-infecciosos gerais de uso sistémico, vacinas, antineoplásicos e imunomoduladores","Centro Hospitalar do Algarve, E. P. E. (510745997)",Biogen Idec Portugal SFU Lda. (506415740),"425.700,00 €",06-01-2014,11-11-2013,365 dias,"Portugal, Faro, Portimão<BR/>Portugal, Faro, Faro<BR/>Portugal, Faro, Lagos",Artigo 258.º do Código dos Contratos Públicos,31-12-2014,"425.700,00 €",,"",,345900,CONCURSO PÚBLICO PARA A CELEBRAÇÃO DE CONTRATOS PÚBLICOS DE APROVISIONAMENTO PARA AQUISIÇÃO MEDICAMENTOS DO FORO ONCOLÓGICO,FALSE
Interferão beta-1a 12 M.U.I./ml Sol inj Cartu 1.5 ml SC      Interferão beta-1a 24 M.U.I./ml Sol inj Cartu 1.5 ml SC,Ao abrigo de acordo-quadro (art.º 258.º),Aquisição de bens móveis,"33650000-1, Anti-infecciosos gerais de uso sistémico, vacinas, antineoplásicos e imunomoduladores","Centro Hospitalar do Algarve, E. P. E. (510745997)","Merck, S.A. (500650870)","353.839,50 €",06-01-2014,11-11-2013,365 dias,"Portugal, Faro, Faro<BR/>Portugal, Faro, Lagos<BR/>Portugal, Faro, Portimão",Artigo 258.º do Código dos Contratos Públicos,31-12-2014,"353.839,50 €",,"",,345900,CONCURSO PÚBLICO PARA A CELEBRAÇÃO DE CONTRATOS PÚBLICOS DE APROVISIONAMENTO PARA AQUISIÇÃO MEDICAMENTOS DO FORO ONCOLÓGICO,FALSE
Serviços Médicos,Ajuste Direto Regime Geral,Aquisição de serviços,"85121100-4, Serviços de médicos de clínica geral","Centro Hospitalar do Algarve, E. P. E. (510745997)",Mérito Equilíbrio - Serviços Médicos Lda  (509176020),"24.000,00 €",06-01-2014,26-07-2013,180 dias,"Portugal, Faro, Portimão","Artigo 20.º, n.º 1, alínea a) do Código dos Contratos Públicos",31-12-2013,"12.138,23 €",,Valor ajustado às necessidades reais,,Não aplicável.,Não aplicável.,FALSE
Serviços Médicos,Ajuste Direto Regime Geral,Aquisição de serviços,"85121200-5, Serviços de medicina especializada","Centro Hospitalar do Algarve, E. P. E. (510745997)",Clinica Oftalmologica Anibal Rodrigues Lda  (500848050),"24.000,00 €",06-01-2014,30-07-2013,180 dias,"Portugal, Faro, Portimão","Artigo 20.º, n.º 1, alínea a) do Código dos Contratos Públicos",31-12-2013,"18.180,00 €",,Valor ajustado às necessidades reais,,Não aplicável.,Não aplicável.,FALSE
Serviços Médicos,Ajuste Direto Regime Geral,Aquisição de serviços,"85121100-4, Serviços de médicos de clínica geral","Centro Hospitalar do Algarve, E. P. E. (510745997)",Naturospa Lda  (507566351),"24.000,00 €",06-01-2014,26-07-2013,180 dias,"Portugal, Faro, Portimão","Artigo 20.º, n.º 1, alínea a) do Código dos Contratos Públicos",31-12-2013,"24.280,76 €",,"o valor do contrato teve por base necessidades estimadas para o 2º semestre, o valor final reflete as necessidades efectivas. ",,Não aplicável.,Não aplicável.,FALSE
Serviços Médicos,Ajuste Direto Regime Geral,Aquisição de serviços,"85121200-5, Serviços de medicina especializada","Centro Hospitalar do Algarve, E. P. E. (510745997)",Oficina Mimos - C. Desenv. Criança e Familia Sul Lda  (508778255),"12.000,00 €",06-01-2014,26-07-2013,180 dias,"Portugal, Faro, Portimão","Artigo 20.º, n.º 1, alínea a) do Código dos Contratos Públicos",31-12-2013,"12.670,00 €",,Valor ajustado às necessidades reais,,Não aplicável.,Não aplicável.,FALSE
Aquisição de Aztreonam e Tetracosactido,Ajuste Direto Regime Geral,Aquisição de bens móveis,"33600000-6, Produtos farmacêuticos","Centro Hospitalar do Algarve, E. P. E. (510745997)",Bristol- Myers Squibb Farmacêutica Portuguesa (500048193),"400,40 €",06-01-2014,06-01-2014,5 dias,"Portugal, Faro, Faro<BR/>Portugal, Faro, Portimão<BR/>Portugal, Faro, Lagos","Artigo 24.º, n.º 1, alínea e) do Código dos Contratos Públicos","","",,"",,Não aplicável.,Não aplicável.,FALSE
Aquisição de Aztreonam e Tetracosactido,Ajuste Direto Regime Geral,Aquisição de bens móveis,"33600000-6, Produtos farmacêuticos","Centro Hospitalar do Algarve, E. P. E. (510745997)",Alloga portugal (504507230),"71,55 €",06-01-2014,06-01-2014,5 dias,"Portugal, Faro, Faro<BR/>Portugal, Faro, Portimão<BR/>Portugal, Faro, Lagos","Artigo 24.º, n.º 1, alínea e) do Código dos Contratos Públicos","","",,"",,Não aplicável.,Não aplicável.,FALSE
Aquisição de Cladribina 10 mg/10 ml inj Fr IV,Ajuste Direto Regime Geral,Aquisição de bens móveis,"33600000-6, Produtos farmacêuticos","Centro Hospitalar do Algarve, E. P. E. (510745997)",Janssen Cilag Farmacêutica (500189412),"2.793,14 €",06-01-2014,06-01-2014,5 dias,"Portugal, Faro, Portimão<BR/>Portugal, Faro, Faro<BR/>Portugal, Faro, Lagos","Artigo 20.º, n.º 1, alínea a) do Código dos Contratos Públicos","","",,"",,Não aplicável.,Não aplicável.,FALSE
Aquisição de Tenectepase 10000 e 8000,Ajuste Direto Regime Geral,Aquisição de bens móveis,"33600000-6, Produtos farmacêuticos","Centro Hospitalar do Algarve, E. P. E. (510745997)",Unilfarma (500293023),"9.337,48 €",06-01-2014,06-01-2014,5 dias,"Portugal, Faro, Lagos<BR/>Portugal, Faro, Faro<BR/>Portugal, Faro, Portimão","Artigo 20.º, n.º 1, alínea a) do Código dos Contratos Públicos","","",,"",,Não aplicável.,Não aplicável.,FALSE
Aquisição de Bicarbonato de sódio e solução ácida para hemodiálise,Ajuste Direto Regime Geral,Aquisição de bens móveis,"33600000-6, Produtos farmacêuticos","Centro Hospitalar do Algarve, E. P. E. (510745997)",FRESENIUS MEDICAL CARE (503070220),"9.292,00 €",06-01-2014,06-01-2014,5 dias,"Portugal, Faro, Faro<BR/>Portugal, Faro, Lagos","Artigo 20.º, n.º 1, alínea a) do Código dos Contratos Públicos","","",,"",,Não aplicável.,Não aplicável.,FALSE
AD 2933.2013 - Material Electrico a aplicar na Remodelação Balcões urgência Portimão,Ajuste Direto Regime Geral,Aquisição de serviços,"50000000-5, Serviços de reparação e manutenção","Centro Hospitalar do Algarve, E. P. E. (510745997)","Acciona, Sa (503431397)","826,72 €",06-01-2014,17-10-2013,76 dias,"Portugal, Faro, Faro","Artigo 24.º, n.º 1, alínea e) do Código dos Contratos Públicos","","",,"",,Não aplicável.,Não aplicável.,FALSE
AD 2876.2013 - Fornecimento e Instalação de Valvula de descalcificaçõa volumétrica,Ajuste Direto Regime Geral,Aquisição de serviços,"50000000-5, Serviços de reparação e manutenção","Centro Hospitalar do Algarve, E. P. E. (510745997)","Watercare, Lda (506550672)","438,05 €",06-01-2014,24-09-2013,99 dias,"Portugal, Faro, Faro","Artigo 24.º, n.º 1, alínea e) do Código dos Contratos Públicos","","",,"",,Não aplicável.,Não aplicável.,FALSE
Viatura,Ajuste Direto Regime Geral,Aquisição de bens móveis,"34110000-1, Automóveis de passageiros","Centro Hospitalar do Algarve, E. P. E. (510745997)",MSCAR-Comercio de Automóveis S.A (507114540),"6.707,32 €",06-01-2014,26-12-2013,4 dias,"Portugal, Faro, Portimão","Artigo 20.º, n.º 1, alínea a) do Código dos Contratos Públicos",30-12-2013,"6.707,32 €",,"",,Não aplicável.,Não aplicável.,FALSE
AD 3010.2013 - Material para as Obras de Reaqualificação do Serviço de Urgência Portimão,Ajuste Direto Regime Geral,Aquisição de serviços,"50000000-5, Serviços de reparação e manutenção","Centro Hospitalar do Algarve, E. P. E. (510745997)",Acciona (503431397),"3.279,20 €",06-01-2014,15-10-2013,78 dias,"Portugal, Faro, Faro","Artigo 24.º, n.º 1, alínea e) do Código dos Contratos Públicos","","",,"",,Não aplicável.,Não aplicável.,FALSE
AD 2833/2013 - Substituição filtro da maquina de lavar endoscópios,Ajuste Direto Regime Geral,Aquisição de serviços,"50000000-5, Serviços de reparação e manutenção","Centro Hospitalar do Algarve, E. P. E. (510745997)",MM-Endocare (510093124),"420,00 €",03-01-2014,09-09-2013,5 dias,"Portugal, Faro, Faro","Artigo 24.º, n.º 1, alínea e) do Código dos Contratos Públicos","","",,"",,Não aplicável.,Não aplicável.,FALSE
AD 3432/2013 - Subscrição da plataforma Vortalgov de Janeiro a Julho 2013,Ajuste Direto Regime Geral,Aquisição de serviços,"71356200-0, Serviços de assistência técnica","Centro Hospitalar do Algarve, E. P. E. (510745997)",VortalHealt-Connecting Business (505141019),"5.827,50 €",03-01-2014,19-12-2013,5 dias,"Portugal, Faro, Faro","Artigo 20.º, n.º 1, alínea a) do Código dos Contratos Públicos","","",,"",,Não aplicável.,Não aplicável.,FALSE
Trastuzumab 150 mg pó conc sol inj Fr IV,Ao abrigo de acordo-quadro (art.º 258.º),Aquisição de bens móveis,"33650000-1, Anti-infecciosos gerais de uso sistémico, vacinas, antineoplásicos e imunomoduladores","Centro Hospitalar do Algarve, E. P. E. (510745997)","Roche Farmacêutica Química, Lda. (500233810)","865.538,00 €",03-01-2014,28-10-2013,365 dias,"Portugal, Faro, Lagos<BR/>Portugal, Faro, Portimão<BR/>Portugal, Faro, Faro",Artigo 258.º do Código dos Contratos Públicos,31-12-2014,"865.538,00 €",,"",,345900,CONCURSO PÚBLICO PARA A CELEBRAÇÃO DE CONTRATOS PÚBLICOS DE APROVISIONAMENTO PARA AQUISIÇÃO MEDICAMENTOS DO FORO ONCOLÓGICO,FALSE
Rituximab 500 mg/50 ml Sol inj Fr 50 ml IV,Ao abrigo de acordo-quadro (art.º 258.º),Aquisição de bens móveis,"33650000-1, Anti-infecciosos gerais de uso sistémico, vacinas, antineoplásicos e imunomoduladores","Centro Hospitalar do Algarve, E. P. E. (510745997)","Roche Farmacêutica Química, Lda. (500233810)","854.197,50 €",03-01-2014,06-11-2013,365 dias,"Portugal, Faro, Faro<BR/>Portugal, Faro, Lagos<BR/>Portugal, Faro, Portimão",Artigo 258.º do Código dos Contratos Públicos,31-12-2014,"854.197,50 €",,"",,345900,CONCURSO PÚBLICO PARA A CELEBRAÇÃO DE CONTRATOS PÚBLICOS DE APROVISIONAMENTO PARA AQUISIÇÃO MEDICAMENTOS DO FORO ONCOLÓGICO,FALSE
Darunavir 400 mg + Darunavir 600 mg,Ao abrigo de acordo-quadro (art.º 258.º),Aquisição de bens móveis,"33650000-1, Anti-infecciosos gerais de uso sistémico, vacinas, antineoplásicos e imunomoduladores","Centro Hospitalar do Algarve, E. P. E. (510745997)","Janssen-Cilag Farmacêutica, Lda. (500189412)","456.032,25 €",03-01-2014,28-10-2013,365 dias,"Portugal, Faro, Portimão<BR/>Portugal, Faro, Faro<BR/>Portugal, Faro, Lagos",Artigo 258.º do Código dos Contratos Públicos,31-12-2014,"456.032,25 €",,"",,461371,CP 2012/40 - MEDICAMENTOS ANTI-RETROVIRAIS,FALSE
Bortezomib 3.5 mg Pó sol inj Fr IV,Ao abrigo de acordo-quadro (art.º 258.º),Aquisição de bens móveis,"33650000-1, Anti-infecciosos gerais de uso sistémico, vacinas, antineoplásicos e imunomoduladores","Centro Hospitalar do Algarve, E. P. E. (510745997)","Janssen-Cilag Farmacêutica, Lda. (500189412)","351.928,80 €",03-01-2014,23-10-2013,365 dias,"Portugal, Faro, Portimão<BR/>Portugal, Faro, Lagos<BR/>Portugal, Faro, Faro",Artigo 258.º do Código dos Contratos Públicos,31-12-2014,"351.928,80 €",,"",,345900,CONCURSO PÚBLICO PARA A CELEBRAÇÃO DE CONTRATOS PÚBLICOS DE APROVISIONAMENTO PARA AQUISIÇÃO MEDICAMENTOS DO FORO ONCOLÓGICO,FALSE
Medicamentos Interferão Beta 1B,Ao abrigo de acordo-quadro (art.º 259.º),Aquisição de bens móveis,"33690000-3, Medicamentos vários","Centro Hospitalar do Algarve, E. P. E. (510745997)","Novartis Farma - Produtos Farmacêuticos, S.A. (500063524)","20.925,00 €",02-01-2014,30-12-2013,2 dias,"Portugal, Faro, Faro",Artigo 259.º do Código dos Contratos Públicos,"","",,"",,1130382,AQ3170/2013 - Medicamentos Interferão beta 1 B,FALSE
"Enoxaparina sódica 100 mg/1 ml Sol inj Ser 1 ml SC, Enoxaparina sódica 20 mg/0.2 ml Sol inj Ser 0.2 ml SC, Enoxaparina sódica 40 mg/0.4 ml Sol inj Ser 0.4 ml SC, Enoxaparina sódica 60 mg/0.6 ml Sol inj Ser 0.6 ml SC e Enoxaparina sódica 80 mg/0.8 ml Sol inj Ser 0.8 ml SC",Ao abrigo de acordo-quadro (art.º 258.º),Aquisição de bens móveis,"33620000-2, Medicamentos para o sangue, para os órgãos hematopoiéticos e para o aparelho cardiovascular","Centro Hospitalar do Algarve, E. P. E. (510745997)","Sanofi, Lda. (500134960)","369.390,84 €",02-01-2014,03-12-2013,365 dias,"Portugal, Faro, Lagos<BR/>Portugal, Faro, Portimão<BR/>Portugal, Faro, Faro",Artigo 258.º do Código dos Contratos Públicos,31-12-2014,"369.390,84 €",,"",,599473,"CONCURSO PÚBLICO PARA A CELEBRAÇÃO DE CONTRATOS PÚBLICOS DE APROVISIONAMENTO PARA A ÁREA DA SAÚDE, COM VISTA AO FORNECIMENTO DE MEDICAMENTOS DE CONSUMO GERAL, GRUPO 4: SANGUE ÀS INSTITUIÇÕES E SERVIÇOS DO SERVIÇO NACIONAL DE SAÚDE",
Revisão de Prótese do Joelho,Ajuste Direto Regime Geral,Aquisição de bens móveis,"33183100-7, Implantes ortopédicos","Centro Hospitalar do Algarve, E. P. E. (510745997)",Smith & Nephew Lda. (503552461),"8.034,05 €",31-12-2013,20-12-2013,2 dias,"Portugal, Faro, Portimão","Artigo 24.º, n.º 1, alínea e) do Código dos Contratos Públicos","","",,"",,Não aplicável.,Não aplicável.,
