Objeto do Contrato,Tipo de Procedimento,Tipo(s) de Contrato,CPVs,Entidade(s) Adjudicante(s),Entidade(s) Adjudicatária(s),Preço Contratual,Data de Publicação,Data de Celebração do Contrato,Prazo de Execução,Local de Execução,Fundamentação,Data de Fecho do Contrato,Preço Total Efetivo,Causas das Alterações ao Prazo,Causas das Alterações ao Preço,Estado,N.º registo do Acordo Quadro,Descrição do Acordo Quadro,Procedimento Centralizado
ALUGUER DE EQUIPAMENTO DE VENTILAÇÃO NÃO INVASIVA PARA URGÊNCIA GERAL,Ajuste Direto Regime Geral,Aquisição de bens móveis,"33157000-5, Aparelhos para assistência respiratória e oxigenoterapia","Centro Hospitalar Tondela-Viseu, E. P. E. (509822940)","VITALAIRE, S.A. (509681840)","5.657,50 €",06-08-2018,04-07-2018,365 dias,"Portugal, Viseu, Viseu","Artigo 20.º, n.º 1, alínea d) do Código dos Contratos Públicos",,,,,,Não aplicável.,Não aplicável.,FALSE
PALBOCICLIB 125MG CAPS,Ajuste Direto Regime Geral,Aquisição de bens móveis,"33600000-6, Produtos farmacêuticos","Centro Hospitalar Tondela-Viseu, E. P. E. (509822940)","PFIZER BIOFARMACÊUTICA, SOCIEDADE UNIPESSOAL,LDA. (513300376)","42.000,01 €",06-08-2018,31-07-2018,90 dias,"Portugal, Viseu, Viseu","Artigo 24.º, n.º 1, alínea e), subalínea iii) do Código dos Contratos Públicos",,,,,,Não aplicável.,Não aplicável.,FALSE
FACTOR ANTI-HEMOFILICO VIII 1000UI RECOMB INJ AMP,Ajuste Direto Regime Geral,Aquisição de bens móveis,"33600000-6, Produtos farmacêuticos","Centro Hospitalar Tondela-Viseu, E. P. E. (509822940)","CSL BEHRING, LDA (503047201)","35.000,00 €",06-08-2018,03-08-2018,20 dias,"Portugal, Viseu, Viseu","Artigo 24.º, n.º 1, alínea c) do Código dos Contratos Públicos",,,,,,Não aplicável.,Não aplicável.,FALSE
RUXOLITINIB 10MG COMP,Ajuste Direto Regime Geral,Aquisição de bens móveis,"33600000-6, Produtos farmacêuticos","Centro Hospitalar Tondela-Viseu, E. P. E. (509822940)",NOVARTIS FARMA (500063524),"58.776,10 €",03-08-2018,27-07-2018,30 dias,"Portugal, Viseu, Viseu","Artigo 24.º, n.º 1, alínea e), subalínea iii) do Código dos Contratos Públicos",,,,,,Não aplicável.,Não aplicável.,FALSE
CARFILZOMIB 60MG AMP,Ajuste Direto Regime Geral,Aquisição de bens móveis,"33600000-6, Produtos farmacêuticos","Centro Hospitalar Tondela-Viseu, E. P. E. (509822940)","AMGEN BIOFARMACEUTICA, LDA. (502942959)","33.586,80 €",03-08-2018,02-08-2018,180 dias,"Portugal, Viseu, Viseu","Artigo 24.º, n.º 1, alínea e), subalínea iii) do Código dos Contratos Públicos",,,,,,Não aplicável.,Não aplicável.,FALSE
