Objeto do Contrato,Tipo de Procedimento,Tipo(s) de Contrato,CPVs,Entidade(s) Adjudicante(s),Entidade(s) Adjudicatária(s),Preço Contratual,Data de Publicação,Data de Celebração do Contrato,Prazo de Execução,Local de Execução,Fundamentação,Data de Fecho do Contrato,Preço Total Efetivo,Causas das Alterações ao Prazo,Causas das Alterações ao Preço,Estado,N.º registo do Acordo Quadro,Descrição do Acordo Quadro,Procedimento Centralizado
MANUTENÇÃO DO LICENCIAMENTO SAP (22 LICENÇAS),Ajuste Direto Regime Geral,Aquisição de serviços,"72267100-0, Manutenção de software para as tecnologias da infomação","Administração Regional de Saúde de Lisboa e Vale do Tejo, I. P. (503148776)","Sap Portugal - Sistemas, Aplicações e Produtos Informáticos, Sociedade Unipessoal Lda. (504569759)","31.820,80 €",09-06-2014,15-05-2014,230 dias,"Portugal, Lisboa, Lisboa","Artigo 20.º, n.º 1, alínea a) do Código dos Contratos Públicos","","",,,,Não aplicável.,Não aplicável.,FALSE
COPOS DE PLÁSTICO,Ajuste Direto Regime Geral,Aquisição de bens móveis,"19520000-7, Produtos de plástico","Administração Regional de Saúde de Lisboa e Vale do Tejo, I. P. (503148776)","Fitisan - Produtos de Higiene e Embalagem, Lda. (506320073)","15.400,00 €",09-06-2014,14-05-2014,231 dias,"Portugal, Lisboa, Lisboa","Artigo 20.º, n.º 1, alínea a) do Código dos Contratos Públicos","","",,,,Não aplicável.,Não aplicável.,FALSE
Concurso Público nº14K00014,Concurso público,Aquisição de bens móveis,"33192000-2, Mobiliário para fins médicos","Administração Regional de Saúde de Lisboa e Vale do Tejo, I. P. (503148776)",Ezequiel Panão Jorge Lda. (501412727),"1.054,71 €",09-06-2014,09-06-2014,30 dias,"Portugal, Lisboa, Sintra","Artigo 20.º, n.º 1, alínea b) do Código dos Contratos Públicos","","",,,,Não aplicável.,Não aplicável.,FALSE
Concurso Público nº14K00014,Concurso público,Aquisição de bens móveis,"33192000-2, Mobiliário para fins médicos","Administração Regional de Saúde de Lisboa e Vale do Tejo, I. P. (503148776)","Paramedica, Equipamentos Medicos Lda. (501393005)","2.372,80 €",09-06-2014,09-06-2014,30 dias,"Portugal, Setúbal, Barreiro","Artigo 20.º, n.º 1, alínea b) do Código dos Contratos Públicos","","",,,,Não aplicável.,Não aplicável.,FALSE
Concurso Público nº14K00014,Concurso público,Aquisição de bens móveis,"33192000-2, Mobiliário para fins médicos","Administração Regional de Saúde de Lisboa e Vale do Tejo, I. P. (503148776)","Eugénio Pereira, Lda. (503989525)","14,28 €",09-06-2014,09-06-2014,30 dias,"Portugal, Santarém, Entroncamento","Artigo 20.º, n.º 1, alínea b) do Código dos Contratos Públicos","","",,,,Não aplicável.,Não aplicável.,FALSE
Concurso Público nº14K00014,Concurso público,Aquisição de bens móveis,"33192000-2, Mobiliário para fins médicos","Administração Regional de Saúde de Lisboa e Vale do Tejo, I. P. (503148776)","Paramedica, Equipamentos Medicos Lda. (501393005)","2.343,00 €",09-06-2014,09-06-2014,30 dias,"Portugal, Lisboa, Lisboa","Artigo 20.º, n.º 1, alínea b) do Código dos Contratos Públicos","","",,,,Não aplicável.,Não aplicável.,FALSE
Concurso Público nº14K00014,Concurso público,Aquisição de bens móveis,"33192000-2, Mobiliário para fins médicos","Administração Regional de Saúde de Lisboa e Vale do Tejo, I. P. (503148776)","Paramedica, Equipamentos Medicos Lda. (501393005)","1.236,00 €",09-06-2014,09-06-2014,30 dias,"Portugal, Setúbal, Almada","Artigo 20.º, n.º 1, alínea b) do Código dos Contratos Públicos","","",,,,Não aplicável.,Não aplicável.,FALSE
Concurso Público nº14K00014,Concurso público,Aquisição de bens móveis,"33192000-2, Mobiliário para fins médicos","Administração Regional de Saúde de Lisboa e Vale do Tejo, I. P. (503148776)","Paramedica, Equipamentos Medicos Lda. (501393005)","1.124,00 €",09-06-2014,09-06-2014,30 dias,"Portugal, Lisboa, Loures","Artigo 20.º, n.º 1, alínea b) do Código dos Contratos Públicos","","",,,,Não aplicável.,Não aplicável.,FALSE
Concurso Público nº14K00014,Concurso público,Aquisição de bens móveis,"33192000-2, Mobiliário para fins médicos","Administração Regional de Saúde de Lisboa e Vale do Tejo, I. P. (503148776)","Sano - Técnica, Lda. (500239819)","907,91 €",09-06-2014,09-06-2014,30 dias,"Portugal, Santarém, Ourém","Artigo 20.º, n.º 1, alínea b) do Código dos Contratos Públicos","","",,,,Não aplicável.,Não aplicável.,FALSE
Concurso Público nº14K00014,Concurso público,Aquisição de bens móveis,"33192000-2, Mobiliário para fins médicos","Administração Regional de Saúde de Lisboa e Vale do Tejo, I. P. (503148776)","Eugénio Pereira, Lda. (503989525)","1.831,51 €",09-06-2014,09-06-2014,30 dias,"Portugal, Lisboa, Amadora","Artigo 20.º, n.º 1, alínea b) do Código dos Contratos Públicos","","",,,,Não aplicável.,Não aplicável.,FALSE
Concurso Público nº14K00014,Concurso público,Aquisição de bens móveis,"33192000-2, Mobiliário para fins médicos","Administração Regional de Saúde de Lisboa e Vale do Tejo, I. P. (503148776)","Duekipa - Comércio de Equipamentos Médicos - Hospitalares, Unipessoal Lda. (508690102)","813,25 €",09-06-2014,09-06-2014,30 dias,"Portugal, Lisboa, Sintra","Artigo 20.º, n.º 1, alínea b) do Código dos Contratos Públicos","","",,,,Não aplicável.,Não aplicável.,FALSE
Concurso Público nº14K00014,Concurso público,Aquisição de bens móveis,"33192000-2, Mobiliário para fins médicos","Administração Regional de Saúde de Lisboa e Vale do Tejo, I. P. (503148776)",Ezequiel Panão Jorge Lda. (501412727),"775,72 €",09-06-2014,09-06-2014,30 dias,"Portugal, Leiria, Caldas da Rainha","Artigo 20.º, n.º 1, alínea b) do Código dos Contratos Públicos","","",,,,Não aplicável.,Não aplicável.,FALSE
Concurso Público nº14K00014,Concurso público,Aquisição de bens móveis,"33192000-2, Mobiliário para fins médicos","Administração Regional de Saúde de Lisboa e Vale do Tejo, I. P. (503148776)","Eugénio Pereira, Lda. (503989525)","619,18 €",09-06-2014,09-06-2014,30 dias,"Portugal, Lisboa, Sobral de Monte Agraço","Artigo 20.º, n.º 1, alínea b) do Código dos Contratos Públicos","","",,,,Não aplicável.,Não aplicável.,FALSE
Concurso Público nº14K00014,Concurso público,Aquisição de bens móveis,"33192000-2, Mobiliário para fins médicos","Administração Regional de Saúde de Lisboa e Vale do Tejo, I. P. (503148776)","Eugénio Pereira, Lda. (503989525)","7.505,32 €",09-06-2014,09-06-2014,30 dias,"Portugal, Santarém","Artigo 20.º, n.º 1, alínea b) do Código dos Contratos Públicos","","",,,,Não aplicável.,Não aplicável.,FALSE
AQUISIÇÃO DE MOBILIÁRIO HOSPITALAR PARA VÁRIAS UNIDADES DO ACES  LISBOA CENTRAL,Ajuste Direto Regime Geral,Aquisição de bens móveis,"33192000-2, Mobiliário para fins médicos","Administração Regional de Saúde de Lisboa e Vale do Tejo, I. P. (503148776)","Duekipa - Comércio de Equipamentos Médicos - Hospitalares, Unipessoal Lda. (508690102)","5.435,00 €",06-06-2014,02-06-2014,30 dias,"Portugal, Lisboa, Lisboa","Artigo 20.º, n.º 1, alínea a) do Código dos Contratos Públicos","","",,,,Não aplicável.,Não aplicável.,FALSE
PAPEL DE MARQUESA,Concurso público,Aquisição de bens móveis,"33140000-3, Material médico de consumo","Administração Regional de Saúde de Lisboa e Vale do Tejo, I. P. (503148776)","Jocalu - Higiene Industrial, Lda. (502999900)","91.980,00 €",06-06-2014,23-05-2014,222 dias,"Portugal, Lisboa, Lisboa","Artigo 20.º, n.º 1, alínea b) do Código dos Contratos Públicos","","",,,,Não aplicável.,Não aplicável.,FALSE
Concurdo Público nº14A00005,Concurso público,Aquisição de bens móveis,"33192000-2, Mobiliário para fins médicos","Administração Regional de Saúde de Lisboa e Vale do Tejo, I. P. (503148776)","Angosaúde - Equipamentos de Saúde, S.A. (507016882)","110,00 €",06-06-2014,04-06-2014,25 dias,"Portugal, Lisboa, Amadora","Artigo 21.º, n.º 1, alínea b) do Código dos Contratos Públicos","","",,,,Não aplicável.,Não aplicável.,FALSE
Concurdo Público nº14A00005,Concurso público,Aquisição de bens móveis,"33192000-2, Mobiliário para fins médicos","Administração Regional de Saúde de Lisboa e Vale do Tejo, I. P. (503148776)","Sano - Técnica, Lda. (500239819)","79,80 €",06-06-2014,04-06-2014,25 dias,"Portugal, Santarém, Entroncamento","Artigo 21.º, n.º 1, alínea b) do Código dos Contratos Públicos","","",,,,Não aplicável.,Não aplicável.,FALSE
Concurdo Público nº14A00005,Concurso público,Aquisição de bens móveis,"33192000-2, Mobiliário para fins médicos","Administração Regional de Saúde de Lisboa e Vale do Tejo, I. P. (503148776)","Angosaúde - Equipamentos de Saúde, S.A. (507016882)","2.187,37 €",06-06-2014,04-06-2014,25 dias,"Portugal, Lisboa, Sintra","Artigo 21.º, n.º 1, alínea b) do Código dos Contratos Públicos","","",,,,Não aplicável.,Não aplicável.,FALSE
Concurdo Público nº14A00005,Concurso público,Aquisição de bens móveis,"33192000-2, Mobiliário para fins médicos","Administração Regional de Saúde de Lisboa e Vale do Tejo, I. P. (503148776)","Alpia2 - New Concept, Lda. (510105327)","1.888,00 €",06-06-2014,04-06-2014,25 dias,"Portugal, Lisboa, Sobral de Monte Agraço","Artigo 21.º, n.º 1, alínea b) do Código dos Contratos Públicos","","",,,,Não aplicável.,Não aplicável.,FALSE
Concurdo Público nº14A00005,Concurso público,Aquisição de bens móveis,"33192000-2, Mobiliário para fins médicos","Administração Regional de Saúde de Lisboa e Vale do Tejo, I. P. (503148776)","Angosaúde - Equipamentos de Saúde, S.A. (507016882)","9.446,49 €",06-06-2014,04-06-2014,25 dias,"Portugal, Setúbal, Barreiro","Artigo 21.º, n.º 1, alínea b) do Código dos Contratos Públicos","","",,,,Não aplicável.,Não aplicável.,FALSE
Concurdo Público nº14A00005,Concurso público,Aquisição de bens móveis,"33192000-2, Mobiliário para fins médicos","Administração Regional de Saúde de Lisboa e Vale do Tejo, I. P. (503148776)","Angosaúde - Equipamentos de Saúde, S.A. (507016882)","6.628,32 €",06-06-2014,04-06-2014,25 dias,"Portugal, Lisboa, Sintra","Artigo 21.º, n.º 1, alínea b) do Código dos Contratos Públicos","","",,,,Não aplicável.,Não aplicável.,FALSE
Concurdo Público nº14A00005,Concurso público,Aquisição de bens móveis,"33192000-2, Mobiliário para fins médicos","Administração Regional de Saúde de Lisboa e Vale do Tejo, I. P. (503148776)","BACELAR & IRMÃO, LDA. (500532818)","692,00 €",06-06-2014,04-06-2014,25 dias,"Portugal, Santarém, Ourém","Artigo 21.º, n.º 1, alínea b) do Código dos Contratos Públicos","","",,,,Não aplicável.,Não aplicável.,FALSE
Concurdo Público nº14A00005,Concurso público,Aquisição de bens móveis,"33192000-2, Mobiliário para fins médicos","Administração Regional de Saúde de Lisboa e Vale do Tejo, I. P. (503148776)","Alpia2 - New Concept, Lda. (510105327)","2.430,00 €",06-06-2014,04-06-2014,25 dias,"Portugal, Santarém, Entroncamento","Artigo 21.º, n.º 1, alínea b) do Código dos Contratos Públicos","","",,,,Não aplicável.,Não aplicável.,FALSE
Concurdo Público nº14A00005,Concurso público,Aquisição de bens móveis,"33192000-2, Mobiliário para fins médicos","Administração Regional de Saúde de Lisboa e Vale do Tejo, I. P. (503148776)",Cenatolim Lda. (507397924),"24.699,87 €",06-06-2014,27-05-2014,25 dias,"Portugal, Lisboa, Lisboa","Artigo 21.º, n.º 1, alínea b) do Código dos Contratos Públicos","","",,,,Não aplicável.,Não aplicável.,FALSE
Concurdo Público nº14A00005,Concurso público,Aquisição de bens móveis,"33192000-2, Mobiliário para fins médicos","Administração Regional de Saúde de Lisboa e Vale do Tejo, I. P. (503148776)","Alpia2 - New Concept, Lda. (510105327)","13.500,00 €",06-06-2014,27-05-2014,25 dias,"Portugal, Setúbal, Almada","Artigo 21.º, n.º 1, alínea b) do Código dos Contratos Públicos","","",,,,Não aplicável.,Não aplicável.,FALSE
Concurdo Público nº14A00005,Concurso público,Aquisição de bens móveis,"33192000-2, Mobiliário para fins médicos","Administração Regional de Saúde de Lisboa e Vale do Tejo, I. P. (503148776)",Cenatolim Lda. (507397924),"9.050,76 €",06-06-2014,04-06-2014,25 dias,"Portugal, Lisboa, Loures","Artigo 21.º, n.º 1, alínea b) do Código dos Contratos Públicos","","",,,,Não aplicável.,Não aplicável.,FALSE
Concurdo Público nº14A00005,Concurso público,Aquisição de bens móveis,"33192000-2, Mobiliário para fins médicos","Administração Regional de Saúde de Lisboa e Vale do Tejo, I. P. (503148776)",Cenatolim Lda. (507397924),"1.529,97 €",06-06-2014,04-06-2014,25 dias,"Portugal, Santarém, Santarém","Artigo 21.º, n.º 1, alínea b) do Código dos Contratos Públicos","","",,,,Não aplicável.,Não aplicável.,FALSE
"Aquisição de Detergentes pré-lavagem, detergente, desinfetante ",Ajuste Direto Regime Geral,Aquisição de bens móveis,"24000000-4, Produtos químicos","Administração Regional de Saúde de Lisboa e Vale do Tejo, I. P. (503148776)","AGUINHAS, Lda. (508306019)","4.049,00 €",05-06-2014,03-06-2014,15 dias,"Portugal, Lisboa, Loures","Artigo 20.º, n.º 1, alínea a) do Código dos Contratos Públicos","","",,,,Não aplicável.,Não aplicável.,FALSE
Aquisição de ferramentas de desgaste rápido,Ajuste Direto Regime Geral,Aquisição de bens móveis,"34000000-7, Equipamento e produtos auxiliares de transporte","Administração Regional de Saúde de Lisboa e Vale do Tejo, I. P. (503148776)","ENGELS LOGISTICA E AMBIENTE UNIPESSOAL, LDA (507736915)","972,23 €",05-06-2014,30-04-2014,5 dias,"Portugal, Lisboa, Loures","Artigo 20.º, n.º 1, alínea a) do Código dos Contratos Públicos","","",,,,Não aplicável.,Não aplicável.,FALSE
"Aquisição de Flumazenilo 0,1MG/ML Sol Inj FR 5ML IV",Ajuste Direto Regime Geral,Aquisição de bens móveis,"33690000-3, Medicamentos vários","Administração Regional de Saúde de Lisboa e Vale do Tejo, I. P. (503148776)","Combino Pharm Portugal, Unipessoal, Lda. (508622263)","192,00 €",04-06-2014,27-05-2014,20 dias,"Portugal, Lisboa","Artigo 26.º, n.º 1, alínea e) do Código dos Contratos Públicos","","",,,,Não aplicável.,Não aplicável.,FALSE
Serviço de Segurnça e vigilância,Ajuste Direto Regime Geral,Aquisição de serviços,"79000000-4, Serviços a empresas: direito, comercialização, consultoria, recrutamento, impressão e segurança","Administração Regional de Saúde de Lisboa e Vale do Tejo, I. P. (503148776)",Prestibel - Emp de Segurança SA (501326456),"1.626,00 €",03-06-2014,05-05-2014,5 dias,"Portugal, Lisboa, Loures","Artigo 20.º, n.º 1, alínea a) do Código dos Contratos Públicos","","",,,,Não aplicável.,Não aplicável.,FALSE
Detergentes e mão de obra,Ajuste Direto Regime Geral,Aquisição de serviços,"55000000-0, Serviços de hotelaria, restauração e comércio a retalho","Administração Regional de Saúde de Lisboa e Vale do Tejo, I. P. (503148776)","Aguinhas, Lda (508306019)","3.655,22 €",03-06-2014,23-05-2014,5 dias,"Portugal, Lisboa, Loures","Artigo 20.º, n.º 1, alínea a) do Código dos Contratos Públicos",20-05-2014,"3.655,22 €",,,,Não aplicável.,Não aplicável.,FALSE
EMPREITADA DE BENEFICIAÇÃO E REPARAÇÃO DA USF SANTO CONDESTÁVEL,Ajuste Direto Regime Geral,Empreitadas de obras públicas,"45113000-2, Obras no local","Administração Regional de Saúde de Lisboa e Vale do Tejo, I. P. (503148776)",A.P.I. - Construções Lda. (503411558),"11.686,52 €",03-06-2014,03-06-2014,30 dias,"Portugal, Lisboa, Lisboa","Artigo 19.º, alínea a) do Código dos Contratos Públicos","","",,,,Não aplicável.,Não aplicável.,FALSE
Serviços de acreditação de gestão clinica de acordo com o programa nacional de acreditação em saúde - USF Descobertas,Ajuste Direto Regime Geral,Aquisição de serviços,"79132000-8, Serviços de certificação","Administração Regional de Saúde de Lisboa e Vale do Tejo, I. P. (503148776)",Direção Geral de Saúde (600037100),"4.950,00 €",03-06-2014,21-04-2014,30 dias,"Portugal, Lisboa, Lisboa","Artigo 24.º, n.º 1, alínea e) do Código dos Contratos Públicos","","",,,,Não aplicável.,Não aplicável.,FALSE
Serviços de acreditação de gestão clinica de acordo com o programa nacional de acreditação em saúde - USF ARS Médica,Ajuste Direto Regime Geral,Aquisição de serviços,"79132000-8, Serviços de certificação","Administração Regional de Saúde de Lisboa e Vale do Tejo, I. P. (503148776)",Direção Geral de Saúde (600037100),"4.950,00 €",03-06-2014,10-04-2014,30 dias,"Portugal, Lisboa, Loures","Artigo 24.º, n.º 1, alínea e) do Código dos Contratos Públicos","","",,,,Não aplicável.,Não aplicável.,FALSE
Serviços de acreditação de gestão clinica de acordo com o programa nacional de acreditação em saúde - USF Marginal,Ajuste Direto Regime Geral,Aquisição de serviços,"79132000-8, Serviços de certificação","Administração Regional de Saúde de Lisboa e Vale do Tejo, I. P. (503148776)",Direção Geral de Saúde (600037100),"4.950,00 €",03-06-2014,30-04-2014,30 dias,"Portugal, Lisboa, Cascais","Artigo 24.º, n.º 1, alínea e) do Código dos Contratos Públicos","","",,,,Não aplicável.,Não aplicável.,FALSE
EMPREITADA DE REMODELAÇÃO/BENEFICIAÇÃO DAS INSTALAÇÕES SANITÁRIAS DO PISO 7º DO Nº75 DA ARSLVT,Ajuste Direto Regime Geral,Empreitadas de obras públicas,"45113000-2, Obras no local","Administração Regional de Saúde de Lisboa e Vale do Tejo, I. P. (503148776)",A.P.I. - Construções Lda. (503411558),"5.117,28 €",03-06-2014,02-06-2014,28 dias,"Portugal, Lisboa, Lisboa","Artigo 19.º, alínea a) do Código dos Contratos Públicos","","",,,,Não aplicável.,Não aplicável.,FALSE
Reparação e manutenção da frota de automóvel com substituição de peças,Ajuste Direto Regime Geral,Aquisição de serviços,"50000000-5, Serviços de reparação e manutenção","Administração Regional de Saúde de Lisboa e Vale do Tejo, I. P. (503148776)","A.H.Almeida, Lda (500303525)","5.000,00 €",02-06-2014,09-01-2014,5 dias,"Portugal, Lisboa, Loures","Artigo 20.º, n.º 1, alínea a) do Código dos Contratos Públicos","","",,,,Não aplicável.,Não aplicável.,FALSE
AQUISIÇÃO DA PRESTAÇÃO DE SERVIÇO DE ASSISTÊNCIA TÉCNICA E  MANUTENÇÃO PREVENTIVA DAS ISNTALAÇÕES AVAC DA C.S. ALCÂNTARA - ACES LISBOA OCIDENTAL E OEIRAS - PERÍODO DE GARANTIA.,Ajuste Direto Regime Geral,Aquisição de serviços,"50000000-5, Serviços de reparação e manutenção","Administração Regional de Saúde de Lisboa e Vale do Tejo, I. P. (503148776)",Condar - Condicionamento de Ar e Ventilaçao Lda. (500070148),"1.770,00 €",02-06-2014,28-05-2014,213 dias,"Portugal, Lisboa, Lisboa","Artigo 24.º, n.º 1, alínea e) do Código dos Contratos Públicos","","",,,,Não aplicável.,Não aplicável.,FALSE
PRESTAÇÃO DE SERVIÇOS DE PARAMETRIZAÇÃO DAS CENTRAIS DE INTRUSÃO DOS EDIFÍCIOS DA PÓVOA DE SANTO ADRIÃO E RAMADA - ACES LOURES-ODIVELAS,Ajuste Direto Regime Geral,Aquisição de serviços,"79711000-1, Serviços de controlo de alarmes","Administração Regional de Saúde de Lisboa e Vale do Tejo, I. P. (503148776)",Domingos da Silva Teixeira S.A. (501489126),"680,00 €",02-06-2014,28-05-2014,20 dias,"Portugal, Lisboa, Loures","Artigo 24.º, n.º 1, alínea e) do Código dos Contratos Públicos","","",,,,Não aplicável.,Não aplicável.,FALSE
AQUISIÇÃO DE MATERIAIS PARA OS ELEVADORES SITOS NO CS DA AMORA  E USF MONTE DA CAPARICA - ACES ALMADA/SEIXAL E CS QUELUZ/MASSAMÁ - ACES SINTRA,Ajuste Direto Regime Geral,Aquisição de bens móveis,"42419510-4, Peças para elevadores","Administração Regional de Saúde de Lisboa e Vale do Tejo, I. P. (503148776)",Grupnor - Grupo Portugues de Elevadores do Norte Lda. (500959579),"669,94 €",02-06-2014,27-05-2014,20 dias,"Portugal, Setúbal, Almada<BR/>Portugal, Lisboa, Sintra","Artigo 24.º, n.º 1, alínea e) do Código dos Contratos Públicos","","",,,,Não aplicável.,Não aplicável.,FALSE
VINHETAS E RECEITAS MÉDICAS PARA O SERVIÇO DE SEGURANÇA E SAÚDE DO TRABALHO,Ajuste Direto Regime Geral,Aquisição de bens móveis,"22100000-1, Livros, brochuras e folhetos impressos","Administração Regional de Saúde de Lisboa e Vale do Tejo, I. P. (503148776)",Imprensa Nacional - Casa da Moeda S.A. (500792887),"300,00 €",02-06-2014,27-05-2014,20 dias,"Portugal, Lisboa, Lisboa","Artigo 24.º, n.º 1, alínea e) do Código dos Contratos Públicos","","",,,,Não aplicável.,Não aplicável.,FALSE
EQUIPAMENTO MÉDICO PARA UCSP LUZ SORIANO,Ajuste Direto Regime Geral,Aquisição de bens móveis,"33100000-1, Equipamento médico","Administração Regional de Saúde de Lisboa e Vale do Tejo, I. P. (503148776)","Sano - Técnica, Lda. (500239819)","4.875,00 €",02-06-2014,02-06-2014,15 dias,"Portugal, Lisboa, Lisboa","Artigo 20.º, n.º 1, alínea a) do Código dos Contratos Públicos","","",,,,Não aplicável.,Não aplicável.,FALSE
CONCURSO PÚBLICO N.º 14K00011,Concurso público,Locação de bens móveis,"33140000-3, Material médico de consumo","Administração Regional de Saúde de Lisboa e Vale do Tejo, I. P. (503148776)","Speculum, Artigos Medicos S.A. (502996323)","53.644,20 €",02-06-2014,19-05-2014,226 dias,"Portugal, Lisboa, Lisboa","Artigo 20.º, n.º 1, alínea b) do Código dos Contratos Públicos","","",,,,Não aplicável.,Não aplicável.,FALSE
CONCURSO PÚBLICO N.º 14K00011,Concurso público,Locação de bens móveis,"33140000-3, Material médico de consumo","Administração Regional de Saúde de Lisboa e Vale do Tejo, I. P. (503148776)",Bastos Viegas S.A. (500042772),"6.296,98 €",02-06-2014,19-05-2014,226 dias,"Portugal, Lisboa, Lisboa","Artigo 20.º, n.º 1, alínea b) do Código dos Contratos Públicos","","",,,,Não aplicável.,Não aplicável.,FALSE
Cuncurso Público nº14A00004,Concurso público,Aquisição de bens móveis,"33192000-2, Mobiliário para fins médicos","Administração Regional de Saúde de Lisboa e Vale do Tejo, I. P. (503148776)","Paramedica, Equipamentos Medicos Lda. (501393005)","3.585,16 €",02-06-2014,29-05-2014,30 dias,"Portugal, Setúbal, Barreiro","Artigo 21.º, n.º 1, alínea b) do Código dos Contratos Públicos","","",,,,Não aplicável.,Não aplicável.,FALSE
"Aquisição de Mepivacaína 36MG + Adrenalina 18MCG 1,8ML Inj",Ajuste Direto Regime Geral,Aquisição de bens móveis,"33690000-3, Medicamentos vários","Administração Regional de Saúde de Lisboa e Vale do Tejo, I. P. (503148776)","Laboratórios Inibsa, S.A. (500139571)","726,40 €",02-06-2014,29-05-2014,20 dias,"Portugal, Lisboa","Artigo 24.º, n.º 1, alínea e) do Código dos Contratos Públicos","","",,,,Não aplicável.,Não aplicável.,FALSE
Aquisição de Testes Rápidos para Diagnóstico de VIH 1 e 2,Ajuste Direto Regime Geral,Aquisição de bens móveis,"33190000-8, Dispositivos e produtos médicos variados","Administração Regional de Saúde de Lisboa e Vale do Tejo, I. P. (503148776)","Bio-Rad Laboratories, Lda. (501301321)","2.000,00 €",02-06-2014,28-05-2014,20 dias,"Portugal, Lisboa","Artigo 26.º, n.º 1, alínea e) do Código dos Contratos Públicos","","",,,,Não aplicável.,Não aplicável.,FALSE
Cuncurso Público nº14A00004,Concurso público,Aquisição de bens móveis,"33192000-2, Mobiliário para fins médicos","Administração Regional de Saúde de Lisboa e Vale do Tejo, I. P. (503148776)","BACELAR & IRMÃO, LDA. (500532818)","1.883,07 €",02-06-2014,29-05-2014,30 dias,"Portugal, Lisboa, Amadora","Artigo 21.º, n.º 1, alínea b) do Código dos Contratos Públicos","","",,,,Não aplicável.,Não aplicável.,FALSE
Cuncurso Público nº14A00004,Concurso público,Aquisição de bens móveis,"33192000-2, Mobiliário para fins médicos","Administração Regional de Saúde de Lisboa e Vale do Tejo, I. P. (503148776)","BACELAR & IRMÃO, LDA. (500532818)","398,40 €",02-06-2014,29-05-2014,30 dias,"Portugal, Santarém, Santarém","Artigo 21.º, n.º 1, alínea b) do Código dos Contratos Públicos","","",,,,Não aplicável.,Não aplicável.,FALSE
Cuncurso Público nº14A00004,Concurso público,Aquisição de bens móveis,"33192000-2, Mobiliário para fins médicos","Administração Regional de Saúde de Lisboa e Vale do Tejo, I. P. (503148776)","Paramedica, Equipamentos Medicos Lda. (501393005)","6.851,85 €",02-06-2014,29-05-2014,30 dias,"Portugal, Lisboa, Sintra","Artigo 21.º, n.º 1, alínea b) do Código dos Contratos Públicos","","",,,,Não aplicável.,Não aplicável.,FALSE
