freguesia,acronym,validVotesPercentage,votes,dicofre
Enxames,PS,47.01,63,050431
Enxames,PPD/PSD.CDS-PP,17.16,23,050431
Enxames,PCP-PEV,8.96,12,050431
Enxames,B.E.,8.21,11,050431
Enxames,PTP,7.46,10,050431
Enxames,MPT,2.99,4,050431
Enxames,PCTP/MRPP,2.99,4,050431
Enxames,PAN,1.49,2,050431
Enxames,PPM,1.49,2,050431
Enxames,L,0.75,1,050431
Enxames,PND,0.75,1,050431
Enxames,POUS,0.75,1,050431
Enxames,MAS,0,0,050431
Enxames,PDA,0,0,050431
Enxames,PNR,0,0,050431
Enxames,PPV,0,0,050431
