freguesia,acronym,validVotesPercentage,votes,dicofre
São Teotónio,PS,39.62,695,021121
São Teotónio,PCP-PEV,24.8,435,021121
São Teotónio,PPD/PSD.CDS-PP,9.86,173,021121
São Teotónio,B.E.,5.47,96,021121
São Teotónio,MPT,5.02,88,021121
São Teotónio,PCTP/MRPP,4.79,84,021121
São Teotónio,L,3.14,55,021121
São Teotónio,PAN,1.82,32,021121
São Teotónio,PND,1.14,20,021121
São Teotónio,PNR,0.97,17,021121
São Teotónio,PPM,0.91,16,021121
São Teotónio,PTP,0.68,12,021121
São Teotónio,MAS,0.57,10,021121
São Teotónio,PPV,0.57,10,021121
São Teotónio,POUS,0.4,7,021121
São Teotónio,PDA,0.23,4,021121
