freguesia,acronym,validVotesPercentage,votes,dicofre
Sobreira,PS,54.63,743,131020
Sobreira,PPD/PSD,19.26,262,131020
Sobreira,B.E.,6.99,95,131020
Sobreira,PAN,4.93,67,131020
Sobreira,PCP-PEV,3.68,50,131020
Sobreira,CDS-PP,3.46,47,131020
Sobreira,L,1.47,20,131020
Sobreira,PPM.PPV/CDC,1.03,14,131020
Sobreira,IL,0.88,12,131020
Sobreira,A,0.81,11,131020
Sobreira,NC,0.74,10,131020
Sobreira,PCTP/MRPP,0.44,6,131020
Sobreira,PDR,0.44,6,131020
Sobreira,PURP,0.44,6,131020
Sobreira,PNR,0.37,5,131020
Sobreira,PTP,0.29,4,131020
Sobreira,MAS,0.15,2,131020
