freguesia,acronym,validVotesPercentage,votes,dicofre
Airães,PPD/PSD.CDS-PP,42.82,337,130302
Airães,PS,39.77,313,130302
Airães,MPT,6.61,52,130302
Airães,PCP-PEV,3.94,31,130302
Airães,B.E.,1.65,13,130302
Airães,PND,1.14,9,130302
Airães,L,0.89,7,130302
Airães,PAN,0.64,5,130302
Airães,PCTP/MRPP,0.51,4,130302
Airães,PPM,0.51,4,130302
Airães,PTP,0.51,4,130302
Airães,PDA,0.25,2,130302
Airães,POUS,0.25,2,130302
Airães,PPV,0.25,2,130302
Airães,MAS,0.13,1,130302
Airães,PNR,0.13,1,130302
