freguesia,acronym,validVotesPercentage,votes,dicofre
"União das freguesias de Brogueira, Parceiros de Igreja e Alcorochel",PS,47.24,564,141918
"União das freguesias de Brogueira, Parceiros de Igreja e Alcorochel",PPD/PSD,17.42,208,141918
"União das freguesias de Brogueira, Parceiros de Igreja e Alcorochel",B.E.,12.56,150,141918
"União das freguesias de Brogueira, Parceiros de Igreja e Alcorochel",PCP-PEV,8.12,97,141918
"União das freguesias de Brogueira, Parceiros de Igreja e Alcorochel",CDS-PP,3.43,41,141918
"União das freguesias de Brogueira, Parceiros de Igreja e Alcorochel",PAN,2.93,35,141918
"União das freguesias de Brogueira, Parceiros de Igreja e Alcorochel",CH,1.51,18,141918
"União das freguesias de Brogueira, Parceiros de Igreja e Alcorochel",A,0.92,11,141918
"União das freguesias de Brogueira, Parceiros de Igreja e Alcorochel",PCTP/MRPP,0.92,11,141918
"União das freguesias de Brogueira, Parceiros de Igreja e Alcorochel",L,0.84,10,141918
"União das freguesias de Brogueira, Parceiros de Igreja e Alcorochel",R.I.R.,0.75,9,141918
"União das freguesias de Brogueira, Parceiros de Igreja e Alcorochel",NC,0.67,8,141918
"União das freguesias de Brogueira, Parceiros de Igreja e Alcorochel",IL,0.59,7,141918
"União das freguesias de Brogueira, Parceiros de Igreja e Alcorochel",PDR,0.5,6,141918
"União das freguesias de Brogueira, Parceiros de Igreja e Alcorochel",MPT,0.42,5,141918
"União das freguesias de Brogueira, Parceiros de Igreja e Alcorochel",PURP,0.42,5,141918
"União das freguesias de Brogueira, Parceiros de Igreja e Alcorochel",PPM,0.34,4,141918
"União das freguesias de Brogueira, Parceiros de Igreja e Alcorochel",PNR,0.25,3,141918
"União das freguesias de Brogueira, Parceiros de Igreja e Alcorochel",PTP,0.17,2,141918
