Objeto do Contrato,Tipo de Procedimento,Tipo(s) de Contrato,CPVs,Entidade(s) Adjudicante(s),Entidade(s) Adjudicatária(s),Preço Contratual,Data de Publicação,Data de Celebração do Contrato,Prazo de Execução,Local de Execução,Fundamentação,Data de Fecho do Contrato,Preço Total Efetivo,Causas das Alterações ao Prazo,Causas das Alterações ao Preço,Estado,N.º registo do Acordo Quadro,Descrição do Acordo Quadro,Procedimento Centralizado
Equipamento de ondas de choque,Ajuste Direto Regime Geral,Aquisição de bens móveis,"33000000-0, Equipamento médico, medicamentos e produtos para cuidados pessoais",Centro de Medicina de Reabilitação da Região Centro - Rovisco Pais (503767336),Salutec (506380408),"9.500,00 €",20-10-2015,31-12-2014,1 dias,"Portugal, Coimbra, Cantanhede","Artigo 26.º, n.º 1, alínea a) do Código dos Contratos Públicos",31-12-2014,"9.500,00 €",,,,Não aplicável.,Não aplicável.,FALSE
COBERTURA E DIVISORIAS,Ajuste Direto Regime Geral,Aquisição de bens móveis,"44000000-0, Estruturas e materiais de construção; produtos auxiliares de construção (excepto aparelhos eléctricos)",Centro de Medicina de Reabilitação da Região Centro - Rovisco Pais (503767336),ACALINO (503623652),"9.215,47 €",16-10-2015,30-12-2014,1 dias,"Portugal, Coimbra, Cantanhede","Artigo 26.º, n.º 1, alínea a) do Código dos Contratos Públicos",31-12-2014,"9.215,47 €",,,,Não aplicável.,Não aplicável.,FALSE
Computadores,Ajuste Direto Regime Geral,Aquisição de bens móveis,"30000000-9, Máquinas, equipamento e material de escritório e de informática, excepto mobiliário e pacotes de programas (software)",Centro de Medicina de Reabilitação da Região Centro - Rovisco Pais (503767336),CPC (501267255),"8.054,00 €",16-10-2015,08-04-2014,90 dias,"Portugal, Coimbra, Cantanhede",Artigo 258.º do Código dos Contratos Públicos,30-04-2014,"8.054,00 €",,,,Não aplicável.,Não aplicável.,FALSE
