freguesia,acronym,validVotesPercentage,votes,dicofre
Sedielos,PS,47.65,81,170809
Sedielos,PPD/PSD.CDS-PP,37.65,64,170809
Sedielos,PCP-PEV,3.53,6,170809
Sedielos,PCTP/MRPP,2.94,5,170809
Sedielos,B.E.,2.35,4,170809
Sedielos,PND,1.76,3,170809
Sedielos,L,1.18,2,170809
Sedielos,MPT,1.18,2,170809
Sedielos,PDA,0.59,1,170809
Sedielos,PNR,0.59,1,170809
Sedielos,PPM,0.59,1,170809
Sedielos,MAS,0,0,170809
Sedielos,PAN,0,0,170809
Sedielos,POUS,0,0,170809
Sedielos,PPV,0,0,170809
Sedielos,PTP,0,0,170809
