Objeto do Contrato,Tipo de Procedimento,Tipo(s) de Contrato,CPVs,Entidade(s) Adjudicante(s),Entidade(s) Adjudicatária(s),Preço Contratual,Data de Publicação,Data de Celebração do Contrato,Prazo de Execução,Local de Execução,Fundamentação,Data de Fecho do Contrato,Preço Total Efetivo,Causas das Alterações ao Prazo,Causas das Alterações ao Preço,Estado,N.º registo do Acordo Quadro,Descrição do Acordo Quadro,Procedimento Centralizado
PRESTAÇÃO SERVIÇOS MEDICOS-ESP.DE OTORRINOLARINGOLOGIA,Ajuste Direto Regime Geral,Aquisição de serviços,"85100000-0, Serviços de saúde",Centro Hospitalar do Oeste (510412009),AMS BREVISMED SERVIÇOS MEDICOS UNIP LDA (510488498),"9.794,50 €",30-06-2017,10-03-2016,306 dias,"Portugal, Leiria, Caldas da Rainha","Artigo 20.º, n.º 1, alínea a) do Código dos Contratos Públicos",20-01-2017,"9.794,50 €",,,,Não aplicável.,Não aplicável.,FALSE
Prestação de serviços médico na especialidade de Otorrinolaringologia,Ajuste Direto Regime Geral,Aquisição de serviços,"85121200-5, Serviços de medicina especializada",Hospital de José Luciano de Castro (501613021),AMS Brevismed (510488498),"10.800,00 €",06-05-2014,02-01-2014,365 dias,"Portugal, Aveiro, Anadia","Artigo 20.º, n.º 1, alínea a) do Código dos Contratos Públicos","","",,,,Não aplicável.,Não aplicável.,FALSE
