Objeto do Contrato,Tipo de Procedimento,Tipo(s) de Contrato,CPVs,Entidade(s) Adjudicante(s),Entidade(s) Adjudicatária(s),Preço Contratual,Data de Publicação,Data de Celebração do Contrato,Prazo de Execução,Local de Execução,Fundamentação,Data de Fecho do Contrato,Preço Total Efetivo,Causas das Alterações ao Prazo,Causas das Alterações ao Preço,Estado,N.º registo do Acordo Quadro,Descrição do Acordo Quadro,Procedimento Centralizado
Serviços médicos,Ajuste Direto Regime Geral,Aquisição de serviços,"85000000-9, Serviços de saúde e acção social","Administração Regional de Saúde do Centro, I. P. (503122165)","Priority Awakning - Medical Services, Unipessoal, Lda (270512780)","32.475,00 €",15-12-2017,31-08-2017,123 dias,"Portugal, Viseu, São Pedro do Sul","Artigo 20.º, n.º 1, alínea a) do Código dos Contratos Públicos",31-10-2017,"12.000,00 €",rescisão do contrato por parte do prestador,rescisão do contrato,,Não aplicável.,Não aplicável.,FALSE
Serviços médicos,Ajuste Direto Regime Geral,Aquisição de serviços,"85000000-9, Serviços de saúde e acção social","Administração Regional de Saúde do Centro, I. P. (503122165)",Ana Maria Ribeiro Fernandes da Silva Couchinho (153977965),"11.700,00 €",14-12-2017,11-04-2017,263 dias,"Portugal, Leiria, Marinha Grande","Artigo 20.º, n.º 1, alínea a) do Código dos Contratos Públicos",31-12-2017,"27.300,00 €","","Realização de trabalhos a mais, traduzidos em adenda, a que corresponde as deliberações do Conselho Directivo de 18-05-201 e 28-07-2017.",,Não aplicável.,Não aplicável.,FALSE
Serviços médicos,Ajuste Direto Regime Geral,Aquisição de serviços,"85000000-9, Serviços de saúde e acção social","Administração Regional de Saúde do Centro, I. P. (503122165)",Cláudio Rodrigues oliveira (237674254),"38.970,00 €",14-12-2017,23-03-2017,284 dias,"Portugal, Leiria, Marinha Grande","Artigo 20.º, n.º 1, alínea a) do Código dos Contratos Públicos",31-12-2017,"14.675,00 €","",Redução do número de horas contratadas conforme adenda a que corresponde a deliberação do Conselho Directivo de 18-05-2017.,,Não aplicável.,Não aplicável.,FALSE
Serviços médicos,Ajuste Direto Regime Geral,Aquisição de serviços,"85000000-9, Serviços de saúde e acção social","Administração Regional de Saúde do Centro, I. P. (503122165)",Maria Fernanda Ferreira Cardoso e Silva Valado (211681741),"19.787,28 €",14-12-2017,05-01-2017,361 dias,"Portugal, Leiria, Pedrogão Grande","Artigo 20.º, n.º 1, alínea a) do Código dos Contratos Públicos",30-10-2017,"23.015,61 €","",Realização de trabalhos a mais,,Não aplicável.,Não aplicável.,FALSE
Serviços médicos,Ajuste Direto Regime Geral,Aquisição de serviços,"85000000-9, Serviços de saúde e acção social","Administração Regional de Saúde do Centro, I. P. (503122165)",Marina Vasina (262066963),"19.787,28 €",14-12-2017,04-01-2017,362 dias,"Portugal, Aveiro","Artigo 20.º, n.º 1, alínea a) do Código dos Contratos Públicos",31-12-2017,"22.176,64 €","","Realização de trabalhos a mais, traduzidos em adenda a que corresponde a deliberação do Conselho Directivo de 18-05-2017.",,Não aplicável.,Não aplicável.,FALSE
Serviços médicos,Ajuste Direto Regime Geral,Aquisição de serviços,"85000000-9, Serviços de saúde e acção social","Administração Regional de Saúde do Centro, I. P. (503122165)",Ilka Martins Rosa (264669770),"11.456,52 €",14-12-2017,01-01-2017,365 dias,"Portugal, Aveiro","Artigo 20.º, n.º 1, alínea a) do Código dos Contratos Públicos",31-12-2017,"11.933,87 €","","Realização de trabalhos a mais, traduzido em adenda a que corresponde a deliberação do Conselho Directivo de 29-06-2017.",,Não aplicável.,Não aplicável.,FALSE
Serviços médicos,Ajuste Direto Regime Geral,Aquisição de serviços,"85000000-9, Serviços de saúde e acção social","Administração Regional de Saúde do Centro, I. P. (503122165)",Cristina Martins Gama Pereira (228422493),"9.893,64 €",14-12-2017,19-01-2017,347 dias,"Portugal, Aveiro, Aveiro","Artigo 20.º, n.º 1, alínea a) do Código dos Contratos Públicos",31-12-2017,"9.398,96 €","",Realização de um número de horas inferior face ao contratado.,,Não aplicável.,Não aplicável.,FALSE
Serviços de psicologia clínica,Ajuste Direto Regime Geral,Aquisição de serviços,"85000000-9, Serviços de saúde e acção social","Administração Regional de Saúde do Centro, I. P. (503122165)",Fernanda da Piedade Rodrigues Almeida (252362691),"7.315,61 €",14-12-2017,22-08-2017,137 dias,"Portugal, Leiria, Pedrogão Grande","Artigo 20.º, n.º 1, alínea a) do Código dos Contratos Públicos",31-12-2017,"7.318,80 €","",Realização de trabalhos a mais.,,Não aplicável.,Não aplicável.,FALSE
Serviços de psicologia clínica,Ajuste Direto Regime Geral,Aquisição de serviços,"85000000-9, Serviços de saúde e acção social","Administração Regional de Saúde do Centro, I. P. (503122165)",Ana Margarida Barata Salgueiro Pires Teixeira (204976715),"8.941,29 €",14-12-2017,22-08-2017,167 dias,"Portugal, Leiria, Castanheira de Pera","Artigo 20.º, n.º 1, alínea a) do Código dos Contratos Públicos",31-12-2017,"8.426,95 €","",Realização de horas em número inferior face ao contratado.,,Não aplicável.,Não aplicável.,FALSE
Serviços médicos,Ajuste Direto Regime Geral,Aquisição de serviços,"85000000-9, Serviços de saúde e acção social","Administração Regional de Saúde do Centro, I. P. (503122165)",José Manuel Urbano Nogueira Ilharco (136015379),"18.705,60 €",14-12-2017,22-03-2017,285 dias,"Portugal, Coimbra, Coimbra","Artigo 20.º, n.º 1, alínea a) do Código dos Contratos Públicos",31-12-2017,"17.420,77 €","",Realização de número de horas inferior ao contratado.,,Não aplicável.,Não aplicável.,FALSE
Serviços médicos,Ajuste Direto Regime Geral,Aquisição de serviços,"85000000-9, Serviços de saúde e acção social","Administração Regional de Saúde do Centro, I. P. (503122165)",Ivan Colesnic (236436490),"31.538,64 €",14-12-2017,16-01-2017,350 dias,"Portugal, Viseu","Artigo 20.º, n.º 1, alínea a) do Código dos Contratos Públicos",31-12-2017,"30.224,53 €","",Realização de número de horas inferior face ao contratado.,,Não aplicável.,Não aplicável.,FALSE
Serviços médicos,Ajuste Direto Regime Geral,Aquisição de serviços,"85000000-9, Serviços de saúde e acção social","Administração Regional de Saúde do Centro, I. P. (503122165)",Joaquín Salsoso Morón (212055658),"11.456,52 €",14-12-2017,11-01-2017,355 dias,"Portugal, Aveiro","Artigo 20.º, n.º 1, alínea a) do Código dos Contratos Públicos",31-12-2017,"11.361,00 €","",Realização de número de horas inferior ao contratado.,,Não aplicável.,Não aplicável.,FALSE
Serviços médicos,Ajuste Direto Regime Geral,Aquisição de serviços,"85000000-9, Serviços de saúde e acção social","Administração Regional de Saúde do Centro, I. P. (503122165)",David Manuel Fernandes Brandão (117080500),"32.750,64 €",14-12-2017,01-01-2017,365 dias,"Portugal, Aveiro","Artigo 20.º, n.º 1, alínea a) do Código dos Contratos Públicos",31-12-2017,"31.015,50 €","",Realização de horas em número inferior ao contratado.,,Não aplicável.,Não aplicável.,FALSE
Aquisição de contentores - C.P. 2014022,Ao abrigo de acordo-quadro (art.º 259.º),Aquisição de bens móveis,"33000000-0, Equipamento médico, medicamentos e produtos para cuidados pessoais","Administração Regional de Saúde do Centro, I. P. (503122165)",AMBIMED (503593427),"7.381,50 €",13-12-2017,03-04-2017,275 dias,"Portugal, Coimbra, Coimbra",Artigo 259.º do Código dos Contratos Públicos,25-08-2017,"7.381,50 €","","",,1341769,"ACORDO QUADRO PARA FORNECIMENTO DE SERINGAS, AGULHAS E CONTENTORES ÀS INSTITUIÇÕES E SERVIÇOS DO SERVIÇO NACIONAL DE SAÚDE PROGRAMA DE CONCURSO",FALSE
Aquisição de contentores - C.P. 2014022,Ao abrigo de acordo-quadro (art.º 259.º),Aquisição de bens móveis,"33000000-0, Equipamento médico, medicamentos e produtos para cuidados pessoais","Administração Regional de Saúde do Centro, I. P. (503122165)",AMBIMED (503593427),"5.040,00 €",13-12-2017,02-05-2017,256 dias,"Portugal, Coimbra, Coimbra",Artigo 259.º do Código dos Contratos Públicos,31-10-2017,"5.040,00 €","","",,1341769,"ACORDO QUADRO PARA FORNECIMENTO DE SERINGAS, AGULHAS E CONTENTORES ÀS INSTITUIÇÕES E SERVIÇOS DO SERVIÇO NACIONAL DE SAÚDE PROGRAMA DE CONCURSO",FALSE
Aquisição de contentores - C.P. 2014022,Ao abrigo de acordo-quadro (art.º 259.º),Aquisição de bens móveis,"33000000-0, Equipamento médico, medicamentos e produtos para cuidados pessoais","Administração Regional de Saúde do Centro, I. P. (503122165)","CSP Saúde - Centro Serviços Partilhados, SA  (508440246)","11.160,00 €",13-12-2017,02-05-2017,256 dias,"Portugal, Coimbra, Coimbra",Artigo 259.º do Código dos Contratos Públicos,17-11-2017,"11.160,00 €","","",,1341769,"ACORDO QUADRO PARA FORNECIMENTO DE SERINGAS, AGULHAS E CONTENTORES ÀS INSTITUIÇÕES E SERVIÇOS DO SERVIÇO NACIONAL DE SAÚDE PROGRAMA DE CONCURSO",FALSE
Serviços médicos,Ajuste Direto Regime Geral,Aquisição de serviços,"85000000-9, Serviços de saúde e acção social","Administração Regional de Saúde do Centro, I. P. (503122165)",Alfredo Salvaterra Bandeira (204648599),"21.123,72 €",13-12-2017,01-01-2017,365 dias,"Portugal, Leiria","Artigo 20.º, n.º 1, alínea a) do Código dos Contratos Públicos",31-12-2017,"21.123,72 €","","",,Não aplicável.,Não aplicável.,FALSE
Serviços médicos,Ajuste Direto Regime Geral,Aquisição de serviços,"85000000-9, Serviços de saúde e acção social","Administração Regional de Saúde do Centro, I. P. (503122165)",Karolina Zofia Borowska (279742835),"39.574,68 €",12-12-2017,01-01-2017,365 dias,"Portugal, Leiria","Artigo 20.º, n.º 1, alínea a) do Código dos Contratos Públicos",30-10-2017,"31.799,29 €",Rescisão do contrato por parte do prestador,Rescisão do contrato,,Não aplicável.,Não aplicável.,FALSE
Consultadoria e representação junto dos Tribunais,Ajuste Direto Regime Geral,Aquisição de serviços,"79000000-4, Serviços a empresas: direito, comercialização, consultoria, recrutamento, impressão e segurança","Administração Regional de Saúde do Centro, I. P. (503122165)",Filipe Pato Veiga de Oliveira (174307462),"18.000,00 €",12-12-2017,06-01-2017,360 dias,"Portugal, Coimbra, Coimbra","Artigo 20.º, n.º 1, alínea a) do Código dos Contratos Públicos",31-12-2017,"18.000,00 €","","",,Não aplicável.,Não aplicável.,FALSE
serviços de auditoria e controlo interno na área financeira e contabilística,Ajuste Direto Regime Geral,Aquisição de serviços,"75000000-6, Serviços relacionados com a administração pública, a defesa e a segurança social","Administração Regional de Saúde do Centro, I. P. (503122165)",Anabela Lopes Pinto (219446857),"16.746,48 €",12-12-2017,30-12-2016,365 dias,"Portugal, Coimbra, Coimbra","Artigo 20.º, n.º 1, alínea a) do Código dos Contratos Públicos",31-12-2017,"15.636,50 €","",Realização de número de horas inferior ao contratado.,,Não aplicável.,Não aplicável.,FALSE
Serviços de controlo interno na área de aquisição de serviços,Ajuste Direto Regime Geral,Aquisição de serviços,"75000000-6, Serviços relacionados com a administração pública, a defesa e a segurança social","Administração Regional de Saúde do Centro, I. P. (503122165)",Andreia catarina Valente dos Santos Lopes (227337859),"9.768,78 €",12-12-2017,01-01-2017,212 dias,"Portugal, Leiria","Artigo 20.º, n.º 1, alínea a) do Código dos Contratos Públicos",31-07-2017,"9.446,74 €","",Não realização integral do número de horas contratadas,,Não aplicável.,Não aplicável.,FALSE
Serviços de assessoria técnica na área de administração,Ajuste Direto Regime Geral,Aquisição de serviços,"75000000-6, Serviços relacionados com a administração pública, a defesa e a segurança social","Administração Regional de Saúde do Centro, I. P. (503122165)",Vera Lúcia Vieira Vala (239414624),"9.768,78 €",12-12-2017,01-01-2017,212 dias,"Portugal, Leiria","Artigo 20.º, n.º 1, alínea a) do Código dos Contratos Públicos",31-07-2017,"9.768,78 €","","",,Não aplicável.,Não aplicável.,FALSE
Aquisição de material hoteleiro para reposição de stock,Ajuste Direto Regime Geral,Aquisição de bens móveis,"39830000-9, Produtos de limpeza","Administração Regional de Saúde do Centro,IP(ARSC) (503122165)",Visipapel (502020733),"15.406,38 €",12-12-2017,11-05-2017,365 dias,"Portugal, Coimbra, Coimbra","Artigo 20.º, n.º 1, alínea a) do Código dos Contratos Públicos",20-12-2017,"15.406,38 €","","",,Não aplicável.,Não aplicável.,FALSE
Aquisição de material hoteleiro para reposição de stock,Ajuste Direto Regime Geral,Aquisição de bens móveis,"39830000-9, Produtos de limpeza","Administração Regional de Saúde do Centro,IP(ARSC) (503122165)","Higimarto - Indústria e Comércio de Higiene e Limpeza, Lda. (504512218)","11.127,60 €",12-12-2017,11-05-2017,365 dias,"Portugal, Coimbra, Coimbra","Artigo 20.º, n.º 1, alínea a) do Código dos Contratos Públicos",12-12-2017,"11.127,60 €","","",,Não aplicável.,Não aplicável.,FALSE
Aquisição de material hoteleiro para reposiçaõ de stock,Ajuste Direto Regime Geral,Aquisição de bens móveis,"39830000-9, Produtos de limpeza","Administração Regional de Saúde do Centro,IP(ARSC) (503122165)","Bastos Viegas, S.A. (500042772)","3.062,40 €",12-12-2017,03-08-2017,365 dias,"Portugal, Coimbra, Coimbra","Artigo 20.º, n.º 1, alínea a) do Código dos Contratos Públicos",12-12-2017,"3.062,40 €","","",,Não aplicável.,Não aplicável.,FALSE
Serviços de enfermagem,Ajuste Direto Regime Geral,Aquisição de serviços,"85000000-9, Serviços de saúde e acção social","Administração Regional de Saúde do Centro, I. P. (503122165)",Tiago Filipe Pereira da Silva (217905684),"14.653,20 €",11-12-2017,10-01-2017,356 dias,"Portugal, Coimbra, Coimbra","Artigo 20.º, n.º 1, alínea a) do Código dos Contratos Públicos",30-09-2017,"10.989,90 €",rescisão do contrato por parte do prestador,rescisão do contrato,,Não aplicável.,Não aplicável.,FALSE
Serviços de enfermagem,Ajuste Direto Regime Geral,Aquisição de serviços,"85000000-9, Serviços de saúde e acção social","Administração Regional de Saúde do Centro, I. P. (503122165)",Suzi Isabel Rodriues Corgas (231945310),"16.746,48 €",11-12-2017,09-02-2017,357 dias,"Portugal, Viseu","Artigo 20.º, n.º 1, alínea a) do Código dos Contratos Públicos",31-12-2017,"16.484,41 €","",Realização de número de horas em número inferior ao contratado.,,Não aplicável.,Não aplicável.,FALSE
Serviços de enfermagem,Ajuste Direto Regime Geral,Aquisição de serviços,"85000000-9, Serviços de saúde e acção social","Administração Regional de Saúde do Centro, I. P. (503122165)",Patricia Alexandra Constança Morais (237881993),"16.746,48 €",11-12-2017,06-01-2017,365 dias,"Portugal, Viseu","Artigo 20.º, n.º 1, alínea a) do Código dos Contratos Públicos",31-12-2017,"15.691,93 €","",Realização de número de horas em número inferior ao contratado.,,Não aplicável.,Não aplicável.,FALSE
Serviços de enfermagem,Ajuste Direto Regime Geral,Aquisição de serviços,"85000000-9, Serviços de saúde e acção social","Administração Regional de Saúde do Centro, I. P. (503122165)",António José Tereso da Silva (193064723),"16.746,48 €",11-12-2017,30-12-2016,365 dias,"Portugal, Leiria","Artigo 20.º, n.º 1, alínea a) do Código dos Contratos Públicos",31-12-2017,"16.416,39 €","",Realização de numero inferior de horas face ao contratado.,,Não aplicável.,Não aplicável.,FALSE
Serviços de enfermagem,Ajuste Direto Regime Geral,Aquisição de serviços,"85000000-9, Serviços de saúde e acção social","Administração Regional de Saúde do Centro, I. P. (503122165)",Ana Margarida Pala Mendes (223365807),"16.746,48 €",11-12-2017,01-01-2017,365 dias,"Portugal, Leiria","Artigo 20.º, n.º 1, alínea a) do Código dos Contratos Públicos",31-12-2017,"16.432,49 €","",Realização de número inferior de horas face ao contrato,,Não aplicável.,Não aplicável.,FALSE
Serviços de enfermagem,Ajuste Direto Regime Geral,Aquisição de serviços,"85000000-9, Serviços de saúde e acção social","Administração Regional de Saúde do Centro, I. P. (503122165)",Ana Sofia Matos Soares (217590969),"16.746,48 €",11-12-2017,01-01-2017,365 dias,"Portugal, Leiria","Artigo 20.º, n.º 1, alínea a) do Código dos Contratos Públicos",31-12-2017,"15.732,06 €","",Realização de número inferior de horas face ao contrato.,,Não aplicável.,Não aplicável.,FALSE
Serviços de enfermagem,Ajuste Direto Regime Geral,Aquisição de serviços,"85000000-9, Serviços de saúde e acção social","Administração Regional de Saúde do Centro, I. P. (503122165)",Ana Sofia Carreira (254263054),"16.746,48 €",11-12-2017,01-01-2017,365 dias,"Portugal, Leiria","Artigo 20.º, n.º 1, alínea a) do Código dos Contratos Públicos",31-12-2017,"12.401,52 €","",Realização de horas em número inferior face ao contratado.,,Não aplicável.,Não aplicável.,FALSE
Serviços de enfermagem,Ajuste Direto Regime Geral,Aquisição de serviços,"85000000-9, Serviços de saúde e acção social","Administração Regional de Saúde do Centro, I. P. (503122165)",Joana dos Santos Domingos (236563734),"16.746,48 €",11-12-2017,01-01-2017,365 dias,"Portugal, Leiria","Artigo 20.º, n.º 1, alínea a) do Código dos Contratos Públicos",31-12-2017,"16.300,55 €","",Realização de número de horas inferior ao contratado.,,Não aplicável.,Não aplicável.,FALSE
Serviços de enfermagem,Ajuste Direto Regime Geral,Aquisição de serviços,"85000000-9, Serviços de saúde e acção social","Administração Regional de Saúde do Centro, I. P. (503122165)",Joana Leitão da Silva Malho (251453324),"16.746,48 €",11-12-2017,01-01-2017,365 dias,"Portugal, Leiria","Artigo 20.º, n.º 1, alínea a) do Código dos Contratos Públicos",31-12-2017,"15.575,50 €","",Realização de horas em número inferior ao contratado.,,Não aplicável.,Não aplicável.,FALSE
Serviços de enfermagem,Ajuste Direto Regime Geral,Aquisição de serviços,"85000000-9, Serviços de saúde e acção social","Administração Regional de Saúde do Centro, I. P. (503122165)",Rita Quélia Chaveiro Romão Carreira Panaca (215823842),"16.746,48 €",11-12-2017,01-01-2017,365 dias,"Portugal, Leiria","Artigo 20.º, n.º 1, alínea a) do Código dos Contratos Públicos",31-12-2017,"16.071,08 €","",Realização de horas em número inferior ao contratado.,,Não aplicável.,Não aplicável.,FALSE
Serviços de enfermagem,Ajuste Direto Regime Geral,Aquisição de serviços,"85000000-9, Serviços de saúde e acção social","Administração Regional de Saúde do Centro, I. P. (503122165)",Mafalda Mariana Correia Santos (248945742),"16.746,48 €",11-12-2017,01-01-2017,365 dias,"Portugal, Leiria","Artigo 20.º, n.º 1, alínea a) do Código dos Contratos Públicos",31-12-2017,"15.868,92 €","",Realização de numero inferior de horas face ao contratado.,,Não aplicável.,Não aplicável.,FALSE
Serviços de enfermagem,Ajuste Direto Regime Geral,Aquisição de serviços,"85000000-9, Serviços de saúde e acção social","Administração Regional de Saúde do Centro, I. P. (503122165)",Rute André Malagueta Ferreira (267428383),"16.746,48 €",11-12-2017,01-01-2017,365 dias,"Portugal, Leiria","Artigo 20.º, n.º 1, alínea a) do Código dos Contratos Públicos",31-12-2017,"16.512,99 €","",Realização de horas em número inferior ao contratado.,,Não aplicável.,Não aplicável.,FALSE
Serviços de enfermagem,Ajuste Direto Regime Geral,Aquisição de serviços,"85000000-9, Serviços de saúde e acção social","Administração Regional de Saúde do Centro, I. P. (503122165)",Rita Silva Domingues (215176405),"16.746,48 €",11-12-2017,01-01-2017,365 dias,"Portugal, Leiria","Artigo 20.º, n.º 1, alínea a) do Código dos Contratos Públicos",31-12-2017,"16.360,03 €","",Realização de número de horas em número inferior ao contratado.,,Não aplicável.,Não aplicável.,FALSE
Serviços de enfermagem,Ajuste Direto Regime Geral,Aquisição de serviços,"85000000-9, Serviços de saúde e acção social","Administração Regional de Saúde do Centro, I. P. (503122165)",Sara Rodrigues Carreira (223917940),"16.746,48 €",11-12-2017,01-01-2017,365 dias,"Portugal, Leiria","Artigo 20.º, n.º 1, alínea a) do Código dos Contratos Públicos",31-12-2017,"16.384,19 €","",Realização de número de horas em número inferior ao contratado.,,Não aplicável.,Não aplicável.,FALSE
Serviços de enfermagem,Ajuste Direto Regime Geral,Aquisição de serviços,"85000000-9, Serviços de saúde e acção social","Administração Regional de Saúde do Centro, I. P. (503122165)",Sara Margarida Ferreira Dias (241290961),"16.746,48 €",11-12-2017,01-01-2017,365 dias,"Portugal, Leiria","Artigo 20.º, n.º 1, alínea a) do Código dos Contratos Públicos",31-12-2017,"16.488,85 €","",Realização de horas em nome inferior face ao contratado.,,Não aplicável.,Não aplicável.,FALSE
Serviços de enfermagem,Ajuste Direto Regime Geral,Aquisição de serviços,"85000000-9, Serviços de saúde e acção social","Administração Regional de Saúde do Centro, I. P. (503122165)",Daniel Pedro Martins Lopes (219989877),"14.653,20 €",11-12-2017,30-12-2016,365 dias,"Portugal, Coimbra, Coimbra","Artigo 20.º, n.º 1, alínea a) do Código dos Contratos Públicos",20-11-2017,"13.432,11 €",rescisão por parte do prestador,rescisão do contrato,,Não aplicável.,Não aplicável.,FALSE
Serviços de enfermagem,Ajuste Direto Regime Geral,Aquisição de serviços,"85000000-9, Serviços de saúde e acção social","Administração Regional de Saúde do Centro, I. P. (503122165)",Andreia Liliana Marques Abade (235514977),"14.653,20 €",11-12-2017,05-01-2017,361 dias,"Portugal, Coimbra, Coimbra","Artigo 20.º, n.º 1, alínea a) do Código dos Contratos Públicos",31-12-2017,"14.653,20 €","","",,Não aplicável.,Não aplicável.,FALSE
Processo 17100117-Aquisição de reagentes,Ajuste Direto Regime Geral,Aquisição de bens móveis,"33000000-0, Equipamento médico, medicamentos e produtos para cuidados pessoais","Administração Regional de Saúde do Centro, I. P. (503122165)","ALERE, LDA. (502518863)","1.560,00 €",11-12-2017,28-03-2017,360 dias,"Portugal, Coimbra, Coimbra","Artigo 20.º, n.º 1, alínea a) do Código dos Contratos Públicos",04-12-2017,"1.560,00 €","","",,Não aplicável.,Não aplicável.,FALSE
Processo 17100117-Aquisição de reagentes,Ajuste Direto Regime Geral,Aquisição de bens móveis,"33000000-0, Equipamento médico, medicamentos e produtos para cuidados pessoais","Administração Regional de Saúde do Centro, I. P. (503122165)","Quilaban- Química Laboratorial Analítica, SA (500399670)","446,04 €",11-12-2017,28-03-2017,360 dias,"Portugal, Coimbra, Coimbra","Artigo 20.º, n.º 1, alínea a) do Código dos Contratos Públicos",04-12-2017,"446,04 €","","",,Não aplicável.,Não aplicável.,FALSE
PROCESSO 17100118-Aquisição de reagentes,Ajuste Direto Regime Geral,Aquisição de bens móveis,"33600000-6, Produtos farmacêuticos","Administração Regional de Saúde do Centro,IP(ARSC) (503122165)",MED TRUST PORTUGAL  (510862993),"15.761,45 €",11-12-2017,03-04-2017,360 dias,"Portugal, Coimbra, Coimbra","Artigo 20.º, n.º 1, alínea a) do Código dos Contratos Públicos",02-11-2017,"15.761,45 €","","",,Não aplicável.,Não aplicável.,FALSE
Aquisição de reagentes,Ajuste Direto Regime Geral,Aquisição de bens móveis,"33600000-6, Produtos farmacêuticos","Administração Regional de Saúde do Centro,IP(ARSC) (503122165)","Iberlab & Imunoreage, Lda. (503406694)","9.410,00 €",11-12-2017,03-04-2017,360 dias,"Portugal, Coimbra, Coimbra","Artigo 20.º, n.º 1, alínea a) do Código dos Contratos Públicos",02-11-2017,"9.410,00 €","","",,Não aplicável.,Não aplicável.,FALSE
processo 17100121-Aquisição de ligadura de zinco,Ajuste Direto Regime Geral,Aquisição de bens móveis,"33700000-7, Produtos para cuidados pessoais","Administração Regional de Saúde do Centro,IP(ARSC) (503122165)","Paul Hartmann, Lda (502271728)","25.500,00 €",11-12-2017,09-05-2017,360 dias,"Portugal, Coimbra, Coimbra","Artigo 20.º, n.º 1, alínea a) do Código dos Contratos Públicos",02-11-2017,"25.500,00 €","","",,Não aplicável.,Não aplicável.,FALSE
