Objeto do Contrato,Tipo de Procedimento,Tipo(s) de Contrato,CPVs,Entidade(s) Adjudicante(s),Entidade(s) Adjudicatária(s),Preço Contratual,Data de Publicação,Data de Celebração do Contrato,Prazo de Execução,Local de Execução,Fundamentação,Data de Fecho do Contrato,Preço Total Efetivo,Causas das Alterações ao Prazo,Causas das Alterações ao Preço,Estado,N.º registo do Acordo Quadro,Descrição do Acordo Quadro,Procedimento Centralizado
SPMS (2015/006) MED DO FORO ONCOL - P259-AC-2017-104,Ao abrigo de acordo-quadro (art.º 259.º),Aquisição de bens móveis,"33600000-6, Produtos farmacêuticos","Instituto Português de Oncologia de Coimbra Francisco Gentil, E. P. E. (506361438)","LILLY PORTUGAL-PROD.FARMACEUTICOS, LDA (500165602)","8.267,84 €",22-06-2017,29-05-2017,365 dias,"Portugal, Coimbra, Coimbra",Artigo 259.º do Código dos Contratos Públicos,,,,,,1771819,CP 2015/6 - Acordo quadro para o fornecimento de Medicamentos do Foro Oncológico,FALSE
SPMS(2015/006) MED DO FORO ONCOL - P259-AC-2017-64,Ao abrigo de acordo-quadro (art.º 259.º),Aquisição de bens móveis,"33600000-6, Produtos farmacêuticos","Instituto Português de Oncologia de Coimbra Francisco Gentil, E. P. E. (506361438)",ASTRAZENECA-PRODUTOS FARMACEUTICOS LDA (502942240),"207.340,20 €",22-06-2017,23-05-2017,365 dias,"Portugal, Coimbra, Coimbra",Artigo 259.º do Código dos Contratos Públicos,,,,,,1771819,CP 2015/6 - Acordo quadro para o fornecimento de Medicamentos do Foro Oncológico,FALSE
"PROTESES MAMARIAS, EXPANSORES MAMÁRIOS  E SIZERS ",Concurso público,Aquisição de bens móveis,"33184400-7, Próteses mamárias",Instituto Português de Oncologia de Coimbra - Francisco Gentil E.P.E. (506361438),"EXPOMEDICA - SOC. EXP. IMP. MAT. MEDICO, LDA. (501886621)","28.687,50 €",21-06-2017,26-09-2016,365 dias,"Portugal, Coimbra, Coimbra","Artigo 20.º, n.º 1, alínea b) do Código dos Contratos Públicos",,,,,,Não aplicável.,Não aplicável.,FALSE
