Objeto do Contrato,Tipo de Procedimento,Tipo(s) de Contrato,CPVs,Entidade(s) Adjudicante(s),Entidade(s) Adjudicatária(s),Preço Contratual,Data de Publicação,Data de Celebração do Contrato,Prazo de Execução,Local de Execução,Fundamentação,Data de Fecho do Contrato,Preço Total Efetivo,Causas das Alterações ao Prazo,Causas das Alterações ao Preço,Estado,N.º registo do Acordo Quadro,Descrição do Acordo Quadro,Procedimento Centralizado
Aquisição de Gás Natural,Concurso público,Aquisição de bens móveis,"09123000-7, Gás natural","Hospital de Santa Maria Maior, E. P. E. (506361381)","Galp Power, S.A. (504723456)","36.152,52 €",05-06-2017,01-02-2016,365 dias,"Portugal, Braga, Barcelos","Artigo 20.º, n.º 1, alínea b) do Código dos Contratos Públicos",31-12-2016,"36.152,52 €",,,,Não aplicável.,Não aplicável.,TRUE
Aquisição de Gases Medicinais ( Renovação),Ajuste Direto Regime Geral,Aquisição de bens móveis,"24110000-8, Gases industriais","Hospital de Santa Maria Maior, E. P. E. (506361381)","ACAÍL, GÁS, S.A. (503789151)","24.628,75 €",31-05-2017,06-03-2015,365 dias,"Portugal, Braga, Barcelos","Artigo 20.º, n.º 1, alínea a) do Código dos Contratos Públicos","","",,,,Não aplicável.,Não aplicável.,FALSE
