freguesia,acronym,validVotesPercentage,votes,dicofre
Alqueidão,PS,42.96,186,060502
Alqueidão,PPD/PSD.CDS-PP,26.79,116,060502
Alqueidão,PCP-PEV,11.32,49,060502
Alqueidão,MPT,7.39,32,060502
Alqueidão,B.E.,3.46,15,060502
Alqueidão,PCTP/MRPP,2.08,9,060502
Alqueidão,L,1.62,7,060502
Alqueidão,PAN,1.39,6,060502
Alqueidão,PTP,1.39,6,060502
Alqueidão,PNR,0.46,2,060502
Alqueidão,MAS,0.23,1,060502
Alqueidão,PDA,0.23,1,060502
Alqueidão,PND,0.23,1,060502
Alqueidão,POUS,0.23,1,060502
Alqueidão,PPM,0.23,1,060502
Alqueidão,PPV,0,0,060502
