freguesia,acronym,validVotesPercentage,votes,dicofre
Lamas,PPD/PSD,41.43,191,030322
Lamas,PS,36.44,168,030322
Lamas,B.E.,7.59,35,030322
Lamas,CDS-PP,4.99,23,030322
Lamas,PCP-PEV,3.47,16,030322
Lamas,PAN,2.17,10,030322
Lamas,A,1.08,5,030322
Lamas,R.I.R.,0.87,4,030322
Lamas,IL,0.43,2,030322
Lamas,PCTP/MRPP,0.43,2,030322
Lamas,PPM,0.43,2,030322
Lamas,CH,0.22,1,030322
Lamas,MPT,0.22,1,030322
Lamas,NC,0.22,1,030322
Lamas,JPP,0,0,030322
Lamas,L,0,0,030322
Lamas,MAS,0,0,030322
Lamas,PDR,0,0,030322
Lamas,PNR,0,0,030322
Lamas,PTP,0,0,030322
Lamas,PURP,0,0,030322
