freguesia,acronym,validVotesPercentage,votes,dicofre
Regadas,PPD/PSD.CDS-PP,44.32,269,030723
Regadas,PS,36.74,223,030723
Regadas,MPT,7.58,46,030723
Regadas,PCP-PEV,2.97,18,030723
Regadas,B.E.,1.48,9,030723
Regadas,PCTP/MRPP,1.48,9,030723
Regadas,PPM,1.32,8,030723
Regadas,PTP,0.99,6,030723
Regadas,PND,0.82,5,030723
Regadas,L,0.66,4,030723
Regadas,PAN,0.49,3,030723
Regadas,PNR,0.33,2,030723
Regadas,POUS,0.33,2,030723
Regadas,PPV,0.33,2,030723
Regadas,MAS,0.16,1,030723
Regadas,PDA,0,0,030723
