Objeto do Contrato,Tipo de Procedimento,Tipo(s) de Contrato,CPVs,Entidade(s) Adjudicante(s),Entidade(s) Adjudicatária(s),Preço Contratual,Data de Publicação,Data de Celebração do Contrato,Prazo de Execução,Local de Execução,Fundamentação,Data de Fecho do Contrato,Preço Total Efetivo,Causas das Alterações ao Prazo,Causas das Alterações ao Preço,Estado,N.º registo do Acordo Quadro,Descrição do Acordo Quadro,Procedimento Centralizado
REPARAÇÃO DO GRUPO GERADOR DE EMERGÊNCIA DO EDIFÍCIO 1 DO HSFX,Ajuste Direto Regime Geral,Aquisição de serviços,"50000000-5, Serviços de reparação e manutenção","Centro Hospitalar de Lisboa Ocidental, E. P. E. (507618319)","TURBOGRUPO - SOCIEDADE DE MANUTENÇÃO DE GRUPOS GERADORES, LDA  (501555510)","8.230,92 €",21-04-2017,31-03-2017,30 dias,"Portugal, Lisboa, Lisboa","Artigo 20.º, n.º 1, alínea a) do Código dos Contratos Públicos",,,,,,Não aplicável.,Não aplicável.,FALSE
ALTERAÇÃO DAS INSTALAÇÕES DO SERVIÇO DE ESTERILIZAÇÃO DO HSC,Ajuste Direto Regime Geral,Aquisição de serviços,"50000000-5, Serviços de reparação e manutenção","Centro Hospitalar de Lisboa Ocidental, E. P. E. (507618319)","SOCODEFIL - SOCIEDADE DE CONSTRUÇÕES MANUEL DELGADO & FILHOS, LDA (500742219)","9.500,00 €",21-04-2017,31-03-2017,15 dias,"Portugal, Lisboa, Lisboa","Artigo 20.º, n.º 1, alínea a) do Código dos Contratos Públicos",,,,,,Não aplicável.,Não aplicável.,FALSE
Serviços de suporte e manutenção da rede dados do CHLO até ao final de 2017,Ajuste Direto Regime Geral,Aquisição de serviços,"50300000-8, Serviços de reparação e manutenção e serviços conexos relacionados com computadores pessoais e com equipamento burótico, audiovisual e para telecomunicações","Centro Hospitalar de Lisboa Ocidental, EPE (CHLO) (507618319)","CONVEX - Consultadoria e Integração de Sistemas, Lda (502145838)","15.500,00 €",20-04-2017,27-03-2017,306 dias,"Portugal, Lisboa, Lisboa","Artigo 20.º, n.º 1, alínea a) do Código dos Contratos Públicos",,,,,,Não aplicável.,Não aplicável.,FALSE
SERVIÇOS DE TRATAMENTO DE RESIDUOS HOSPITALARES NO CHLO EPE – de janeiro e fevereiro de 2017,Ajuste Direto Regime Geral,Aquisição de serviços,"90500000-2, Serviços relativos a resíduos e lixos","Centro Hospitalar de Lisboa Ocidental, E. P. E. (507618319)",SUCH - SERVIÇO DE UTILIZAÇÃO COMUM DOS HOSPITAIS (500900469),"103.467,38 €",20-04-2017,10-02-2017,59 dias,"Portugal, Lisboa, Oeiras<BR/>Portugal, Lisboa, Lisboa","Artigo 27.º, n.º 1, alínea a) do Código dos Contratos Públicos",,,,,,Não aplicável.,Não aplicável.,FALSE
"PRESTAÇÃO DE SERVIÇOS JURÍDICOS AO DEPARTAMENTO DE RECURSOS HUMANOS DO CHLO – CENTRO HOSPITALAR DE LISBOA OCIDENTAL, E.P.E.",Ajuste Direto Regime Geral,Aquisição de serviços,"79100000-5, Serviços jurídicos","Centro Hospitalar de Lisboa Ocidental, E. P. E. (507618319)",CARLA CRISTINA TEIXEIRA MORGADO (206746636),"25.000,00 €",20-04-2017,22-03-2017,306 dias,"Portugal, Lisboa, Lisboa","Artigo 20.º, n.º 1, alínea a) do Código dos Contratos Públicos",,,,,,Não aplicável.,Não aplicável.,FALSE
