Objeto do Contrato,Tipo de Procedimento,Tipo(s) de Contrato,CPVs,Entidade(s) Adjudicante(s),Entidade(s) Adjudicatária(s),Preço Contratual,Data de Publicação,Data de Celebração do Contrato,Prazo de Execução,Local de Execução,Fundamentação,Data de Fecho do Contrato,Preço Total Efetivo,Causas das Alterações ao Prazo,Causas das Alterações ao Preço,Estado,N.º registo do Acordo Quadro,Descrição do Acordo Quadro,Procedimento Centralizado
Prestação de Serviços Médicos de Especialidade Médica Dentista e Assistentes de Dentista para o Centro de Saúde da Lourinhã e para o Centro de Saúde de Mafra – Ericeira,Ajuste Direto Regime Geral,Aquisição de serviços,"75122000-7, Serviços administrativos na área da saúde","Administração Regional de Saúde de Lisboa e Vale do Tejo, I. P. (503148776)","Precise, SA (513993274)","20.833,34 €",29-09-2017,25-09-2017,120 dias,"Portugal, Lisboa, Lourinhã","Artigo 20.º, n.º 1, alínea a) do Código dos Contratos Públicos",,,,,,Não aplicável.,Não aplicável.,FALSE
Prestação de Serviços Médicos de Especialidade Médica Dentista e Assistentes de Dentista para o Centro de Saúde do Monte da Caparica,Ajuste Direto Regime Geral,Aquisição de serviços,"75122000-7, Serviços administrativos na área da saúde","Administração Regional de Saúde de Lisboa e Vale do Tejo, I. P. (503148776)","Precise, SA (513993274)","10.304,53 €",29-09-2017,25-09-2017,120 dias,"Portugal, Setúbal, Almada","Artigo 20.º, n.º 1, alínea a) do Código dos Contratos Públicos",,,,,,Não aplicável.,Não aplicável.,FALSE
Prestação de Serviços Médicos de Especialidade Médica Dentista e Assistentes de Dentista para o Centro de Saúde da Moita,Ajuste Direto Regime Geral,Aquisição de serviços,"75122000-7, Serviços administrativos na área da saúde","Administração Regional de Saúde de Lisboa e Vale do Tejo, I. P. (503148776)","Precise, SA (513993274)","10.304,53 €",29-09-2017,25-09-2017,120 dias,"Portugal, Setúbal, Moita","Artigo 20.º, n.º 1, alínea a) do Código dos Contratos Públicos",,,,,,Não aplicável.,Não aplicável.,FALSE
1. Procedimento AD/2017-69 2. Prazo de Execução: 31/12/2017 3. Nas Guias de Remessa e faturas deverá constar o número do nosso pedido de compra,Ajuste Direto Regime Geral,Aquisição de serviços,"50700000-2, Serviços de reparação e manutenção de equipamento em edifícios","Administração Regional de Saúde de Lisboa e Vale do Tejo, I. P. (503148776)",Ramiro & Delgado (501301704),"12.320,05 €",29-09-2017,29-09-2017,20 dias,"Portugal, Setúbal, Almada","Artigo 20.º, n.º 1, alínea a) do Código dos Contratos Públicos",,,,,,Não aplicável.,Não aplicável.,FALSE
Prestação de serviços de higiene e limpeza para a Região de Lisboa e Vale do Tejo,Ajuste Direto Regime Geral,Aquisição de serviços,"90910000-9, Serviços de limpeza","Administração Regional de Saúde de Lisboa e Vale do Tejo, I. P. (503148776)","Interlimpe - Facility Services, SA (502611057)","907.214,34 €",28-09-2017,01-09-2017,92 dias,"Portugal, Leiria<BR/>Portugal, Lisboa<BR/>Portugal, Setúbal<BR/>Portugal, Santarém","Artigo 24.º, n.º 1, alínea c) do Código dos Contratos Públicos",,,,,,Não aplicável.,Não aplicável.,FALSE
Aquisição de 15.000 frascos de Cloreto Sódio 9mg/ ml Sol Inj 100ml IV,Ao abrigo de acordo-quadro (art.º 259.º),Aquisição de bens móveis,"33690000-3, Medicamentos vários","Administração Regional de Saúde de Lisboa e Vale do Tejo, I. P. (503148776)","Overpharma - Produtos Médicos e Farmacêuticos, Lda (505792362)","6.300,00 €",27-09-2017,18-09-2017,104 dias,"Portugal, Lisboa",Artigo 259.º do Código dos Contratos Públicos,,,,,,2570766,Contratos Públicos de Aprovisionamento relativos ao fornecimento de medicamentos corretivos de volémia e outras soluções estéreis às Unidades de Saúde da Região Autónoma dos Açores,FALSE
Aquisição 2.000 ampolas de Adrenalina 1mg/ 1ml Sol Inj IM IV IC SC,Ao abrigo de acordo-quadro (art.º 259.º),Aquisição de bens móveis,"33690000-3, Medicamentos vários","Administração Regional de Saúde de Lisboa e Vale do Tejo, I. P. (503148776)","Labesfal - Laboratório Almiro, SA (501169580)","1.496,00 €",27-09-2017,20-09-2017,102 dias,"Portugal, Lisboa",Artigo 259.º do Código dos Contratos Públicos,,,,,,2335591,CP 2016/01 - Acordo Quadro para fornecimento de Medicamentos do Aparelho Cardiovascular   às Instituições e Serviços do Serviço Nacional de Saúde,FALSE
Aquisição de 2.000 cápsulas de Cicloserina 250mg,Ajuste Direto Regime Geral,Aquisição de bens móveis,"33690000-3, Medicamentos vários","Administração Regional de Saúde de Lisboa e Vale do Tejo, I. P. (503148776)","Dux Pharma - Unipessoal, Lda  (510803679)","7.900,00 €",27-09-2017,18-09-2017,104 dias,"Portugal, Lisboa","Artigo 24.º, n.º 1, alínea e) do Código dos Contratos Públicos",,,,,,Não aplicável.,Não aplicável.,FALSE
Capreomicina 1000mg Pó Sol. Inj.,Ajuste Direto Regime Geral,Aquisição de bens móveis,"33600000-6, Produtos farmacêuticos","Administração Regional de Saúde de Lisboa e Vale do Tejo, I. P. (503148776)","Biojam, S.a  (513642749)","8.820,00 €",27-09-2017,26-09-2017,96 dias,"Portugal, Lisboa","Artigo 24.º, n.º 1, alínea e) do Código dos Contratos Públicos",,,,,,Não aplicável.,Não aplicável.,FALSE
Clofazimina 100mg cápsulas,Ajuste Direto Regime Geral,Aquisição de bens móveis,"33600000-6, Produtos farmacêuticos","Administração Regional de Saúde de Lisboa e Vale do Tejo, I. P. (503148776)","Dux Pharma, Unipessoal Lda  (510803679)","2.521,80 €",27-09-2017,18-09-2017,104 dias,"Portugal, Lisboa","Artigo 24.º, n.º 1, alínea e) do Código dos Contratos Públicos",,,,,,Não aplicável.,Não aplicável.,FALSE
Óxido de Zinco 500mg/g SUsp. Cut. Fr. 150g,Ao abrigo de acordo-quadro (art.º 259.º),Aquisição de bens móveis,"33600000-6, Produtos farmacêuticos","Administração Regional de Saúde de Lisboa e Vale do Tejo, I. P. (503148776)",Laboratório Edol - Produtos Farmacêuticos S.a (507072642),"6.320,00 €",27-09-2017,14-09-2017,108 dias,"Portugal, Lisboa",Artigo 259.º do Código dos Contratos Públicos,,,,,,1370278,CP 2015/51 - Acordo quadro para fornecimento de medicamentos usados nas afeções cutâneas às instituições e serviços do serviço nacional de saúde,FALSE
Prestação de serviços de especialidade Médica Dentista e Assistentes de Dentista para o ACES Médio Tejo – Centro de Saúde de Fátima.,Ajuste Direto Regime Geral,Aquisição de serviços,"75122000-7, Serviços administrativos na área da saúde","Administração Regional de Saúde de Lisboa e Vale do Tejo, I. P. (503148776)",Medipeople (508543436),"5.150,97 €",25-09-2017,25-09-2017,98 dias,"Portugal, Leiria, Batalha","Artigo 20.º, n.º 1, alínea a) do Código dos Contratos Públicos",,,,,,Não aplicável.,Não aplicável.,FALSE
Obra de reparação exterior do edifício USF Charneca do Sol e Nova Caparica (Aces Almada Seixal),Ajuste Direto Regime Geral,Empreitadas de obras públicas,"45113000-2, Obras no local",Adm.Reg.de Saúde de Lisboa e Vale do Tejo (ARSLVT) (503148776),"Luzecon - Sociedade de Construção e Restauro, Lda. (504400673)","17.454,00 €",25-09-2017,04-09-2017,20 dias,"Portugal, Setúbal, Almada","Artigo 19.º, alínea a) do Código dos Contratos Públicos",,,,,,Não aplicável.,Não aplicável.,FALSE
"Obras no âmbito do projeto acolhimento saudável , na unidade de Charneca da Caparica",Ajuste Direto Regime Geral,Empreitadas de obras públicas,"45113000-2, Obras no local","Administração Regional de Saúde de Lisboa e Vale do Tejo, I. P. (503148776)","VAMARO - CONSTRUÇÃO CIVIL, S.A. (501649557)","20.948,60 €",25-09-2017,04-08-2017,20 dias,"Portugal, Setúbal, Almada","Artigo 19.º, alínea a) do Código dos Contratos Públicos",,,,,,Não aplicável.,Não aplicável.,FALSE
Obras de Manutenção interior e exterior da UCSP Montijo,Concurso público,Empreitadas de obras públicas,"45113000-2, Obras no local","Administração Regional de Saúde de Lisboa e Vale do Tejo, I. P. (503148776)","Tecnaco - Técnicos de Construção, S.A. (511237219)","39.000,01 €",25-09-2017,15-09-2017,60 dias,"Portugal, Setúbal, Montijo","Artigo 19.º, alínea b) do Código dos Contratos Públicos",,,,,,Não aplicável.,Não aplicável.,FALSE
Substituição de chiller do centro de saúde da Lourinhã do Aces Oeste Sul,Ajuste Direto Regime Geral,Aquisição de bens móveis,"39717200-3, Aparelhos de ar condicionado","Administração Regional de Saúde de Lisboa e Vale do Tejo, I. P. (503148776)","INAR - Caneira & Almeida, Lda. (509617980)","54.950,00 €",22-09-2017,30-08-2017,100 dias,"Portugal, Lisboa, Lourinhã","Artigo 24.º, n.º 1, alínea b) do Código dos Contratos Públicos",,,,,,Não aplicável.,Não aplicável.,FALSE
Aquisição de fornecimento e montagem de reclames de fachada para edifícios,Ajuste Direto Regime Geral,Aquisição de bens móveis,"22460000-2, Suportes de publicidade, manuais e catálogos comerciais",Adm.Reg.de Saúde de Lisboa e Vale do Tejo (ARSLVT) (503148776),"Infortipo, Lda (502964472)","10.200,00 €",21-09-2017,18-09-2017,30 dias,"Portugal, Lisboa, Lisboa","Artigo 20.º, n.º 1, alínea a) do Código dos Contratos Públicos",,,,,,Não aplicável.,Não aplicável.,FALSE
