Objeto do Contrato,Tipo de Procedimento,Tipo(s) de Contrato,CPVs,Entidade(s) Adjudicante(s),Entidade(s) Adjudicatária(s),Preço Contratual,Data de Publicação,Data de Celebração do Contrato,Prazo de Execução,Local de Execução,Fundamentação,Data de Fecho do Contrato,Preço Total Efetivo,Causas das Alterações ao Prazo,Causas das Alterações ao Preço,Estado,N.º registo do Acordo Quadro,Descrição do Acordo Quadro,Procedimento Centralizado
Aquisição de 13 nebulizadores para o ACES Baixo Vouga,Ajuste Direto Regime Geral,Aquisição de bens móveis,"33000000-0, Equipamento médico, medicamentos e produtos para cuidados pessoais","Administração Regional de Saúde do Centro, I. P. (503122165)","Medical Plus - Produtos Médicos e Hospitalares, Lda (506658066)","1.244,10 €",11-03-2014,03-01-2014,30 dias,"Portugal, Aveiro","Artigo 20.º, n.º 1, alínea a) do Código dos Contratos Públicos",28-01-2014,"1.244,10 €","","",,Não aplicável.,Não aplicável.,FALSE
Aquisição de mobiliário de escritório para a ES Abiúl,Ao abrigo de acordo-quadro (art.º 259.º),Aquisição de bens móveis,"39000000-2, Mobiliário (incl. de escritório), acessórios, aparelhos domésticos (excl. iluminação) e produtos de limpeza","Administração Regional de Saúde do Centro, I. P. (503122165)","Haworth Portugal - Mobiliário de Escritório, SA (500077622)","1.084,00 €",11-03-2014,09-04-2013,30 dias,"Portugal, Leiria, Pombal",Artigo 259.º do Código dos Contratos Públicos,13-05-2013,"1.084,00 €","","",,600257,Concurso limitado por prévia qualificação para a celebração de Acordo Quadro para o fornecimento de bens de  mobiliário.,FALSE
Aquisição de mobiliário de escritório para a ES Abiúl,Ao abrigo de acordo-quadro (art.º 259.º),Aquisição de bens móveis,"39000000-2, Mobiliário (incl. de escritório), acessórios, aparelhos domésticos (excl. iluminação) e produtos de limpeza","Administração Regional de Saúde do Centro, I. P. (503122165)","Jeset Portugal - Mobiliário de Escritório, grandes Espaços e Cultura, Lda (503775878), Tripolo - Soluções de Escritório e Armazenagem, Lda (501264124)","33,50 €",11-03-2014,05-08-2013,30 dias,"Portugal, Leiria, Pombal",Artigo 259.º do Código dos Contratos Públicos,21-02-2014,"33,50 €","","",,600257,Concurso limitado por prévia qualificação para a celebração de Acordo Quadro para o fornecimento de bens de  mobiliário.,FALSE
Aquisição de mobiliário de escritório para a ES Abiúl,Ao abrigo de acordo-quadro (art.º 259.º),Aquisição de bens móveis,"39000000-2, Mobiliário (incl. de escritório), acessórios, aparelhos domésticos (excl. iluminação) e produtos de limpeza","Administração Regional de Saúde do Centro, I. P. (503122165)","Julcar - Mobiliário Integrado, SA (501140263)","2.387,00 €",11-03-2014,09-04-2013,10 dias,"Portugal, Leiria, Pombal",Artigo 259.º do Código dos Contratos Públicos,30-04-2013,"2.387,00 €","","",,600257,Concurso limitado por prévia qualificação para a celebração de Acordo Quadro para o fornecimento de bens de  mobiliário.,FALSE
"Aquisição de equipamento médico para a USF Rainha Santa Isabel, USF Fernando Namora e USF Araceti",Ajuste Direto Regime Geral,Aquisição de bens móveis,"33000000-0, Equipamento médico, medicamentos e produtos para cuidados pessoais","Administração Regional de Saúde do Centro, I. P. (503122165)","Promei Centro - Montagem e Assistência Técnica Equipamentos e Electromédicos, Lda (506470113)","2.984,23 €",10-03-2014,16-04-2013,30 dias,"Portugal, Coimbra, Coimbra","Artigo 20.º, n.º 1, alínea a) do Código dos Contratos Públicos",08-07-2013,"2.984,23 €","","",,Não aplicável.,Não aplicável.,FALSE
"Aquisição de equipamento médico para a USF Rainha Santa Isabel, USF Fernando Namora e USF Araceti",Ajuste Direto Regime Geral,Aquisição de bens móveis,"33000000-0, Equipamento médico, medicamentos e produtos para cuidados pessoais","Administração Regional de Saúde do Centro, I. P. (503122165)","Medical Plus - Produtos Médicos e Hospitalares, Lda (506658066)","3.525,22 €",10-03-2014,16-04-2013,30 dias,"Portugal, Coimbra, Coimbra","Artigo 20.º, n.º 1, alínea a) do Código dos Contratos Públicos",23-05-2013,"3.525,22 €","","",,Não aplicável.,Não aplicável.,FALSE
"Aquisição de equipamento médico para a USF Rainha Santa Isabel, USF Fernando Namora e USF Araceti",Ajuste Direto Regime Geral,Aquisição de bens móveis,"33000000-0, Equipamento médico, medicamentos e produtos para cuidados pessoais","Administração Regional de Saúde do Centro, I. P. (503122165)","Bacelar & Irmão, Lda (500532818)","3.419,48 €",10-03-2014,16-04-2013,30 dias,"Portugal, Coimbra, Coimbra","Artigo 20.º, n.º 1, alínea a) do Código dos Contratos Públicos",16-05-2013,"3.419,48 €","","",,Não aplicável.,Não aplicável.,FALSE
"Equipamento médico para a USF Rainha Santa Isabel, USF Fernando Namora e USF Araceti",Ajuste Direto Regime Geral,Aquisição de bens móveis,"33000000-0, Equipamento médico, medicamentos e produtos para cuidados pessoais","Administração Regional de Saúde do Centro, I. P. (503122165)","EPJMédica - Artigos Médicos e Hospitalares, Lda (506820513)","9.044,30 €",10-03-2014,15-04-2013,30 dias,"Portugal, Coimbra, Coimbra","Artigo 20.º, n.º 1, alínea a) do Código dos Contratos Públicos",28-05-2013,"8.956,90 €",Alguns equipamentos não ficaram disponíveis para entrega nos 30 dias previstos,Descontinuidade do artigo presente no Lote 29 - craveira pediátrica,,Não aplicável.,Não aplicável.,FALSE
Aquisição de medicamentos,Ao abrigo de acordo-quadro (art.º 259.º),Aquisição de bens móveis,"33690000-3, Medicamentos vários","Administração Regional de Saúde do Centro, I. P. (503122165)",MEDA PHARMA-PRODUTOS FARMACEUTICOS SA (500082090),"3.825,00 €",06-03-2014,04-03-2014,90 dias,"Portugal, Coimbra, Coimbra",Artigo 259.º do Código dos Contratos Públicos,"","","","",,178089,"CONCURSO PÚBLICO PARA A CELEBRAÇÃO DE CONTRATOS PÚBLICOS DE APROVISIONAMENTO PARA AQUISIÇÃO DE ANTISSÉPTICOS, DESINFECTANTES E OUTROS ",FALSE
Aquisição de medicamentos,Ao abrigo de acordo-quadro (art.º 259.º),Aquisição de bens móveis,"33690000-3, Medicamentos vários","Administração Regional de Saúde do Centro, I. P. (503122165)",PROCLINICA-EQUIP E PRODUTOS CLINICOS LDA (500222665),"3.214,00 €",06-03-2014,04-03-2014,90 dias,"Portugal, Coimbra, Coimbra",Artigo 259.º do Código dos Contratos Públicos,"","","","",,178089,"CONCURSO PÚBLICO PARA A CELEBRAÇÃO DE CONTRATOS PÚBLICOS DE APROVISIONAMENTO PARA AQUISIÇÃO DE ANTISSÉPTICOS, DESINFECTANTES E OUTROS ",FALSE
Aquisição de medicamentos,Ao abrigo de acordo-quadro (art.º 259.º),Aquisição de bens móveis,"33622000-6, Medicamentos para o aparelho cardiovascular","Administração Regional de Saúde do Centro, I. P. (503122165)",LABESFAL LABORATORIOS ALMIRO SA (501169580),"1.259,70 €",06-03-2014,27-02-2014,90 dias,"Portugal, Coimbra, Coimbra",Artigo 259.º do Código dos Contratos Públicos,"","","","",,513025,"CONCURSO PÚBLICO PARA A CELEBRAÇÃO DE CONTRATOS PÚBLICOS DE APROVISIONAMENTO PARA A ÁREA DA SAÚDE, COM VISTA AO FORNECIMENTO DE MEDICAMENTOS DE CONSUMO GERAL  (FFOSI)- APARELHO CARDIOVASCULAR., ÀS INSTITUIÇÕES E SERVIÇOS DO SERVIÇO NACIONAL DE SAÚDE",FALSE
Aquisição de medicamentos,Ao abrigo de acordo-quadro (art.º 259.º),Aquisição de bens móveis,"33622000-6, Medicamentos para o aparelho cardiovascular","Administração Regional de Saúde do Centro, I. P. (503122165)",HUKMA FARMACEUTICA LDA (502266791),"303,20 €",06-03-2014,05-03-2014,90 dias,"Portugal, Coimbra, Coimbra",Artigo 259.º do Código dos Contratos Públicos,"","","","",,513025,"CONCURSO PÚBLICO PARA A CELEBRAÇÃO DE CONTRATOS PÚBLICOS DE APROVISIONAMENTO PARA A ÁREA DA SAÚDE, COM VISTA AO FORNECIMENTO DE MEDICAMENTOS DE CONSUMO GERAL  (FFOSI)- APARELHO CARDIOVASCULAR., ÀS INSTITUIÇÕES E SERVIÇOS DO SERVIÇO NACIONAL DE SAÚDE",FALSE
Aquisição de equipamento médico para a UCC de Anadia (ACES Baixo Vouga),Ajuste Direto Regime Geral,Aquisição de bens móveis,"33000000-0, Equipamento médico, medicamentos e produtos para cuidados pessoais","Administração Regional de Saúde do Centro, I. P. (503122165)",EPJMÉDICA LDA (506820513),"544,63 €",06-03-2014,16-12-2013,30 dias,"Portugal, Aveiro, Anadia","Artigo 20.º, n.º 1, alínea a) do Código dos Contratos Públicos","","","","",,Não aplicável.,Não aplicável.,FALSE
Aquisição de equipamento médico para a UCC de Anadia (ACES Baixo Vouga),Ajuste Direto Regime Geral,Aquisição de bens móveis,"33000000-0, Equipamento médico, medicamentos e produtos para cuidados pessoais","Administração Regional de Saúde do Centro, I. P. (503122165)","SORISA, SA (500990441)","1.142,92 €",06-03-2014,16-12-2013,30 dias,"Portugal, Aveiro, Anadia","Artigo 20.º, n.º 1, alínea a) do Código dos Contratos Públicos","","","","",,Não aplicável.,Não aplicável.,FALSE
"Aquisição de testes de Hematologia, VS Urina II e Hemoglobina A1C",Ajuste Direto Regime Geral,Aquisição de bens móveis,"33696500-0, Reagentes de laboratório","Administração Regional de Saúde do Centro, I. P. (503122165)","Menarini Diagnósticos, Lda (502610069)","24.950,00 €",03-03-2014,17-02-2014,365 dias,"Portugal, Coimbra, Arganil","Artigo 20.º, n.º 1, alínea a) do Código dos Contratos Públicos",12-12-2014,"24.950,00 €","","",,Não aplicável.,Não aplicável.,FALSE
Aquisição de medicamentos,Ao abrigo de acordo-quadro (art.º 259.º),Aquisição de bens móveis,"33690000-3, Medicamentos vários","Administração Regional de Saúde do Centro, I. P. (503122165)","Laboratórios Normon, S.A. (505654156)","90,00 €",03-03-2014,03-03-2014,90 dias,"Portugal, Coimbra, Coimbra",Artigo 259.º do Código dos Contratos Públicos,"","","","",,455180,"CONCURSO PÚBLICO PARA A CELEBRAÇÃO DE CONTRATOS PÚBLICOS DE APROVISIONAMENTO PARA A ÁREA DA SAÚDE, COM VISTA AO FORNECIMENTO DE MEDICAMENTOS ANTI-INFECIOSOS: ANTIVÍRICOS E ANTIFÚNGICOS, ÀS INSTITUIÇÕES E SERVIÇOS DO SERVIÇO NACIONAL DE SAÚDE  ",FALSE
Aquisição de medicamentos,Ao abrigo de acordo-quadro (art.º 259.º),Aquisição de bens móveis,"33690000-3, Medicamentos vários","Administração Regional de Saúde do Centro, I. P. (503122165)","Sanofi-Produtos Farmacêuticos,Lda (500134960)","5.478,00 €",03-03-2014,03-03-2014,90 dias,"Portugal, Coimbra, Coimbra",Artigo 259.º do Código dos Contratos Públicos,"","","","",,455180,"CONCURSO PÚBLICO PARA A CELEBRAÇÃO DE CONTRATOS PÚBLICOS DE APROVISIONAMENTO PARA A ÁREA DA SAÚDE, COM VISTA AO FORNECIMENTO DE MEDICAMENTOS ANTI-INFECIOSOS: ANTIVÍRICOS E ANTIFÚNGICOS, ÀS INSTITUIÇÕES E SERVIÇOS DO SERVIÇO NACIONAL DE SAÚDE  ",FALSE
Manutenção preventiva e evolutiva da aplicação informática SAMESTAT,Ajuste Direto Regime Geral,Aquisição de serviços,"72000000-5, Serviços de TI: consultoria, desenvolvimento de software, Internet e apoio","Administração Regional de Saúde do Centro, I. P. (503122165)",timestamp bwin (507295960),"9.880,00 €",03-03-2014,13-11-2013,26 dias,"Portugal, Coimbra, Coimbra","Artigo 20.º, n.º 1, alínea a) do Código dos Contratos Públicos","","","","",,Não aplicável.,Não aplicável.,FALSE
Aquisição de split p/ bastidor (aparelho de ar condicionado),Ajuste Direto Regime Geral,Aquisição de bens móveis,"30200000-1, Equipamento e material informático","Administração Regional de Saúde do Centro, I. P. (503122165)","CLIMACARE, LDA (510269710)","1.100,00 €",03-03-2014,20-12-2013,7 dias,"Portugal, Leiria, Marinha Grande","Artigo 20.º, n.º 1, alínea a) do Código dos Contratos Públicos","","","","",,Não aplicável.,Não aplicável.,FALSE
