Objeto do Contrato,Tipo de Procedimento,Tipo(s) de Contrato,CPVs,Entidade(s) Adjudicante(s),Entidade(s) Adjudicatária(s),Preço Contratual,Data de Publicação,Data de Celebração do Contrato,Prazo de Execução,Local de Execução,Fundamentação,Data de Fecho do Contrato,Preço Total Efetivo,Causas das Alterações ao Prazo,Causas das Alterações ao Preço,Estado,N.º registo do Acordo Quadro,Descrição do Acordo Quadro,Procedimento Centralizado
190025/19 - PS MCDT's Radiologia,Concurso público,Aquisição de serviços,"85100000-0, Serviços de saúde","Hospital do Espírito Santo de Évora, E. P. E. (508085888)","CDI - CLINICA DIAGNOSTICO POR IMAGEM (502830654), CRX Centro Radiodiagnóstico de Évora, Lda. (501706097)","393.726,15 €",30-01-2019,24-01-2019,365 dias,"Portugal, Évora, Évora","Artigo 20.º, n.º 1, alínea a) do Código dos Contratos Públicos",,,,,,Não aplicável.,Não aplicável.,FALSE
prestação de serviços de aluguer de sala operatória,Consulta Prévia,Aquisição de serviços,"85100000-0, Serviços de saúde","Hospital do Espírito Santo de Évora, E. P. E. (508085888)",CDI - CLINICA DIAGNOSTICO POR IMAGEM (502830654),"50.000,00 €",14-12-2018,15-11-2018,45 dias,"Portugal, Évora, Évora","Artigo 20.º, n.º 1, alínea c) do Código dos Contratos Públicos",,,,,,Não aplicável.,Não aplicável.,FALSE
Prestação de serviços de aluguer de sala operatória,Ajuste Direto Regime Geral,Aquisição de serviços,"85100000-0, Serviços de saúde","Hospital do Espírito Santo de Évora, E. P. E. (508085888)",CDI - CLINICA DIAGNOSTICO POR IMAGEM (502830654),"19.500,00 €",13-12-2018,15-11-2018,45 dias,"Portugal, Évora, Évora","Artigo 20.º, n.º 1, alínea d) do Código dos Contratos Públicos",,,,,,Não aplicável.,Não aplicável.,FALSE
MCDT's de Cardiologia Pediátrica,Concurso público,Aquisição de serviços,"85150000-5, Serviços de imagiologia médica","Hospital do Espírito Santo de Évora, E. P. E. (508085888)",CDI - CLINICA DIAGNOSTICO POR IMAGEM (502830654),"22.954,25 €",24-04-2018,31-01-2018,365 dias,"Portugal, Évora, Évora","Artigo 20.º, n.º 1, alínea b) do Código dos Contratos Públicos",,,,,,Não aplicável.,Não aplicável.,FALSE
Prestação de serviços de MCDT's de Urologia,Ajuste Direto Regime Geral,Aquisição de serviços,"85121292-6, Serviços de urologia","Hospital do Espírito Santo de Évora, E. P. E. (508085888)",CDI - CLINICA DIAGNOSTICO POR IMAGEM (502830654),"11.400,00 €",24-04-2018,08-02-2018,330 dias,"Portugal, Évora, Évora","Artigo 20.º, n.º 1, alínea a) do Código dos Contratos Públicos",,,,,,Não aplicável.,Não aplicável.,FALSE
Aquisição de MCDT's de radiologia no exterior,Concurso público,Aquisição de serviços,"85121200-5, Serviços de medicina especializada","Hospital do Espírito Santo de Évora, E. P. E. (508085888)",CDI - CLINICA DIAGNOSTICO POR IMAGEM (502830654),"64.895,45 €",05-04-2018,28-12-2017,60 dias,"Portugal, Évora, Évora",Artigo 155.º do Código dos Contratos Públicos,,,,,,Não aplicável.,Não aplicável.,FALSE
MCDT's de Radiologia no Exterior,Concurso público,Aquisição de serviços,"85150000-5, Serviços de imagiologia médica","Hospital do Espírito Santo de Évora, EPE (508085888)",CDI - CLINICA DIAGNOSTICO POR IMAGEM (502830654),"289.152,01 €",19-03-2018,07-02-2018,300 dias,"Portugal, Évora, Évora","Artigo 20.º, n.º 1, alínea b) do Código dos Contratos Públicos",,,,,,Não aplicável.,Não aplicável.,FALSE
"Aquisição de exames de EMG para a ULSNA, EPE",Ajuste Direto Regime Geral,Aquisição de serviços,"85100000-0, Serviços de saúde","Unidade Local de Saúde do Norte Alentejano, E. P. E. (508094461)",CDI (502830654),"8.632,25 €",30-06-2017,25-05-2017,365 dias,"Portugal, Portalegre","Artigo 20.º, n.º 1, alínea a) do Código dos Contratos Públicos",,,,,,Não aplicável.,Não aplicável.,FALSE
MCDT's de Radiologia,Concurso público,Aquisição de serviços,"85150000-5, Serviços de imagiologia médica","Hospital do Espírito Santo de Évora, E. P. E. (508085888)","CRX Centro Radiodiagnóstico de Évora, Lda. (501706097), CDI - CLINICA DIAGNOSTICO POR IMAGEM (502830654)","359.688,35 €",01-03-2017,18-01-2017,310 dias,"Portugal, Évora, Évora","Artigo 20.º, n.º 1, alínea b) do Código dos Contratos Públicos",,,,,,Não aplicável.,Não aplicável.,FALSE
Prestação de Serviços :MCDT's de Radiologia,Ajuste Direto Regime Geral,Aquisição de serviços,"85150000-5, Serviços de imagiologia médica","Hospital do Espírito Santo de Évora, E. P. E. (508085888)",CDI - CLINICA DIAGNOSTICO POR IMAGEM (502830654),"33.661,30 €",16-02-2017,04-01-2017,360 dias,"Portugal, Évora, Évora","Artigo 20.º, n.º 1, alínea a) do Código dos Contratos Públicos",,,,,,Não aplicável.,Não aplicável.,FALSE
Prestação de Serviços de Radiologia no Exterior,Concurso público,Aquisição de serviços,"85150000-5, Serviços de imagiologia médica","Hospital do Espírito Santo de Évora, E. P. E. (508085888)","CDI - CLINICA DIAGNOSTICO POR IMAGEM (502830654), CRX - CENTRO RADIODIAGNOSTICO EVORA (501706097)","183.274,65 €",21-06-2016,12-03-2015,300 dias,"Portugal, Évora, Évora","Artigo 20.º, n.º 1, alínea b) do Código dos Contratos Públicos",,,,,,Não aplicável.,Não aplicável.,FALSE
Aquisição de MCDT´s Neurologia no exterior,Concurso público,Aquisição de serviços,"85121220-1, Serviços especializados de nefrologia ou do sistema nervoso","Hospital do Espírito Santo de Évora, E. P. E. (508085888)",CDI - CLINICA DIAGNOSTICO POR IMAGEM (502830654),"3.960,00 €",13-06-2016,28-01-2016,330 dias,"Portugal, Évora, Évora","Artigo 20.º, n.º 1, alínea b) do Código dos Contratos Públicos",,,,,,Não aplicável.,Não aplicável.,FALSE
Prestação de Serviço de MCDT'S de Radiologia,Concurso público,Aquisição de serviços,"85150000-5, Serviços de imagiologia médica","Hospital do Espírito Santo de Évora, E. P. E. (508085888)",CDI - CLINICA DIAGNOSTICO POR IMAGEM (502830654),"317.346,15 €",21-03-2016,23-12-2015,365 dias,"Portugal, Évora, Évora","Artigo 20.º, n.º 1, alínea b) do Código dos Contratos Públicos",,,,,,Não aplicável.,Não aplicável.,FALSE
Prestação de MCDT´s de Urologia,Ajuste Direto Regime Geral,Aquisição de serviços,"85120000-6, Serviços de prática médica e serviços conexos","Hospital do Espírito Santo de Évora, E. P. E. (508085888)",CDI - CLINICA DIAGNOSTICO POR IMAGEM (502830654),"34.200,00 €",10-02-2016,18-11-2015,365 dias,"Portugal, Évora, Évora","Artigo 20.º, n.º 1, alínea a) do Código dos Contratos Públicos",,,,,,Não aplicável.,Não aplicável.,FALSE
Prestação de serviços de imagiologia médica,Ajuste Direto Regime Geral,Aquisição de serviços,"85150000-5, Serviços de imagiologia médica","Hospital do Espírito Santo de Évora, E. P. E. (508085888)","CLINICA DO CORAÇÃO DO ALENTEJO SA (502376457), CRX - CENTRO RADIODIAGNOSTICO EVORA (501706097), CDI - CLINICA DIAGNOSTICO POR IMAGEM (502830654)","187.603,90 €",04-02-2016,17-09-2015,100 dias,"Portugal, Évora, Évora","Artigo 24.º, n.º 1, alínea c) do Código dos Contratos Públicos",,,,,,Não aplicável.,Não aplicável.,FALSE
Prestação de MCDT de Neurologia e Urologia,Concurso público,Aquisição de serviços,"85121220-1, Serviços especializados de nefrologia ou do sistema nervoso","Hospital do Espírito Santo de Évora, E. P. E. (508085888)",CDI - CLINICA DIAGNOSTICO POR IMAGEM (502830654),"66.950,00 €",07-08-2015,15-01-2015,350 dias,"Portugal, Évora, Évora","Artigo 20.º, n.º 1, alínea b) do Código dos Contratos Públicos",,,,,,Não aplicável.,Não aplicável.,FALSE
MCDT Gastroenterologia,Concurso público,Aquisição de serviços,"85121251-7, Serviços de gastroenterologia","Hospital do Espírito Santo de Évora, E. P. E. (508085888)","DR JOAQUIM CHAVES LAB ANAL CLINICAS SA (500753636), CDI - CLINICA DIAGNOSTICO POR IMAGEM (502830654)","33.035,00 €",07-08-2015,08-01-2015,365 dias,"Portugal, Évora, Évora","Artigo 20.º, n.º 1, alínea b) do Código dos Contratos Públicos",,,,,,Não aplicável.,Não aplicável.,FALSE
Aquisição de MCDT na área da Radiologia,Ajuste Direto Regime Geral,Aquisição de serviços,"85150000-5, Serviços de imagiologia médica",Hospital do Espírito Santo de Évora E.P.E. (508085888),"Clínica Diagnóstico por Imagem (502830654), Clínica Coração do Alentejo (502376457)","185.752,10 €",08-06-2015,12-03-2015,300 dias,"Portugal<BR/>Portugal, Évora, Évora","Artigo 20.º, n.º 1, alínea a) do Código dos Contratos Públicos",,,,,,Não aplicável.,Não aplicável.,FALSE
Aquisição de prestação de serviços-MCDT,Ajuste Direto Regime Geral,Aquisição de serviços,"85150000-5, Serviços de imagiologia médica","Hospital do Espírito Santo de Évora, E. P. E. (508085888)",Clinica de Diagnostico por Imagem (502830654),"28.712,36 €",08-04-2015,29-10-2014,60 dias,"Portugal, Évora, Évora","Artigo 20.º, n.º 1, alínea a) do Código dos Contratos Públicos",,,,,,Não aplicável.,Não aplicável.,FALSE
Aquisição de serviços de imagiologia,Ajuste Direto Regime Geral,Aquisição de serviços,"85150000-5, Serviços de imagiologia médica",Hospital do Espirito Santo Evora EPE (508085888),CDI Clinica de Diagnostico por Imagem (502830654),"9.349,10 €",25-03-2015,07-01-2015,8 dias,"Portugal, Évora, Évora","Artigo 20.º, n.º 1, alínea a) do Código dos Contratos Públicos",,,,,,Não aplicável.,Não aplicável.,FALSE
"Aquisição de serviços, MCDT, Gastro",Concurso público,Aquisição de serviços,"85121251-7, Serviços de gastroenterologia","Hospital do Espírito Santo de Évora, E. P. E. (508085888)","CDI (502830654), Quadrantes (504148850)","55.932,60 €",19-05-2014,28-04-2014,240 dias,"Portugal, Lisboa, Lisboa<BR/>Portugal, Évora, Évora","Artigo 20.º, n.º 1, alínea b) do Código dos Contratos Públicos",,,,,,Não aplicável.,Não aplicável.,FALSE
MCDT's - Biópsia / exame histológico,Ajuste Direto Regime Geral,Aquisição de serviços,"85140000-2, Serviços de saúde diversos","Hospital do Espírito Santo de Évora, E. P. E. (508085888)",CDI - Clinica Diagnóstico pela  Imagem (502830654),"8.880,00 €",06-05-2014,18-03-2014,8 dias,"Portugal, Évora, Évora","Artigo 20.º, n.º 1, alínea a) do Código dos Contratos Públicos",,,,,,Não aplicável.,Não aplicável.,FALSE
MCDT's,Ajuste Direto Regime Geral,Aquisição de serviços,"85121292-6, Serviços de urologia","Hospital do Espírito Santo de Évora, E. P. E. (508085888)",CDI - clinica Diagnóstico pela Imagem (502830654),"8.550,00 €",06-05-2014,07-03-2014,8 dias,"Portugal, Évora, Évora","Artigo 20.º, n.º 1, alínea a) do Código dos Contratos Públicos",,,,,,Não aplicável.,Não aplicável.,FALSE
Aquisição de MCDT Radiologia,Concurso público,Aquisição de serviços,"85150000-5, Serviços de imagiologia médica","Hospital do Espírito Santo de Évora, E. P. E. (508085888)",CDI (502830654),"162.721,71 €",04-04-2014,11-03-2014,311 dias,"Portugal, Évora, Évora","Artigo 20.º, n.º 1, alínea b) do Código dos Contratos Públicos",,,,,,Não aplicável.,Não aplicável.,FALSE
"AQUISIÇÃO DE MEIOS COMPLEMENTARES DE DIAGNÓSTICO NO EXTERIOR DE IMAGIOLOGIA: T´S, ECOGRAFIAS/MAMOGRAFIA, ESTUDO DOPPLER E RADIOLOGIA DE INTERVENÇÃO",Ajuste Direto Regime Geral,Aquisição de serviços,"85150000-5, Serviços de imagiologia médica","Hospital do Espírito Santo de Évora, E. P. E. (508085888)","CLINICA DO CORAÇÃO DO ALENTEJO SA (502376457), CDI - CLINICA DIAGNOSTICO POR IMAGEM (502830654)","46.788,31 €",21-11-2013,29-08-2013,120 dias,"Portugal, Évora, Évora","Artigo 20.º, n.º 1, alínea a) do Código dos Contratos Públicos",,,,,,Não aplicável.,Não aplicável.,
MCDT's,Ajuste Direto Regime Geral,Aquisição de serviços,"85150000-5, Serviços de imagiologia médica","Hospital do Espírito Santo de Évora, E.P.E. (508085888)",CDI - CLINICA DIAGNOSTICO POR IMAGEM               (502830654),"158.293,00 €",04-06-2013,02-01-2013,365 dias,"Portugal, Évora, Évora","Artigo 24.º, n.º 1, alínea e) do Código dos Contratos Públicos",,,,,,Não aplicável.,Não aplicável.,
