freguesia,acronym,validVotesPercentage,votes,dicofre
Vascões,PPD/PSD.CDS-PP,50.98,26,160521
Vascões,PS,31.37,16,160521
Vascões,MPT,5.88,3,160521
Vascões,PCP-PEV,5.88,3,160521
Vascões,PAN,1.96,1,160521
Vascões,PCTP/MRPP,1.96,1,160521
Vascões,PNR,1.96,1,160521
Vascões,B.E.,0,0,160521
Vascões,L,0,0,160521
Vascões,MAS,0,0,160521
Vascões,PDA,0,0,160521
Vascões,PND,0,0,160521
Vascões,POUS,0,0,160521
Vascões,PPM,0,0,160521
Vascões,PPV,0,0,160521
Vascões,PTP,0,0,160521
