freguesia,acronym,validVotesPercentage,votes,dicofre
União das freguesias de Vila Seca e Santo Adrião,PS,33.77,52,180123
União das freguesias de Vila Seca e Santo Adrião,PPD/PSD.CDS-PP,27.27,42,180123
União das freguesias de Vila Seca e Santo Adrião,PCP-PEV,15.58,24,180123
União das freguesias de Vila Seca e Santo Adrião,MPT,10.39,16,180123
União das freguesias de Vila Seca e Santo Adrião,PCTP/MRPP,4.55,7,180123
União das freguesias de Vila Seca e Santo Adrião,PND,1.95,3,180123
União das freguesias de Vila Seca e Santo Adrião,B.E.,1.3,2,180123
União das freguesias de Vila Seca e Santo Adrião,L,1.3,2,180123
União das freguesias de Vila Seca e Santo Adrião,MAS,0.65,1,180123
União das freguesias de Vila Seca e Santo Adrião,PAN,0.65,1,180123
União das freguesias de Vila Seca e Santo Adrião,POUS,0.65,1,180123
União das freguesias de Vila Seca e Santo Adrião,PPM,0.65,1,180123
União das freguesias de Vila Seca e Santo Adrião,PPV,0.65,1,180123
União das freguesias de Vila Seca e Santo Adrião,PTP,0.65,1,180123
União das freguesias de Vila Seca e Santo Adrião,PDA,0,0,180123
União das freguesias de Vila Seca e Santo Adrião,PNR,0,0,180123
