freguesia,acronym,validVotesPercentage,votes,dicofre
União de freguesias de São Martinho de Anta e Paradela de Guiães,PS,51.08,166,171017
União de freguesias de São Martinho de Anta e Paradela de Guiães,PPD/PSD.CDS-PP,28.62,93,171017
União de freguesias de São Martinho de Anta e Paradela de Guiães,MPT,6.15,20,171017
União de freguesias de São Martinho de Anta e Paradela de Guiães,PCP-PEV,3.38,11,171017
União de freguesias de São Martinho de Anta e Paradela de Guiães,PCTP/MRPP,1.85,6,171017
União de freguesias de São Martinho de Anta e Paradela de Guiães,B.E.,1.54,5,171017
União de freguesias de São Martinho de Anta e Paradela de Guiães,MAS,1.54,5,171017
União de freguesias de São Martinho de Anta e Paradela de Guiães,PND,1.23,4,171017
União de freguesias de São Martinho de Anta e Paradela de Guiães,PPM,1.23,4,171017
União de freguesias de São Martinho de Anta e Paradela de Guiães,L,0.92,3,171017
União de freguesias de São Martinho de Anta e Paradela de Guiães,PNR,0.62,2,171017
União de freguesias de São Martinho de Anta e Paradela de Guiães,PPV,0.62,2,171017
União de freguesias de São Martinho de Anta e Paradela de Guiães,PTP,0.62,2,171017
União de freguesias de São Martinho de Anta e Paradela de Guiães,PAN,0.31,1,171017
União de freguesias de São Martinho de Anta e Paradela de Guiães,POUS,0.31,1,171017
União de freguesias de São Martinho de Anta e Paradela de Guiães,PDA,0,0,171017
