freguesia,acronym,validVotesPercentage,votes,dicofre
Vilarandelo,PPD/PSD.CDS-PP,55,154,171231
Vilarandelo,PS,27.14,76,171231
Vilarandelo,MPT,7.5,21,171231
Vilarandelo,B.E.,2.14,6,171231
Vilarandelo,L,1.79,5,171231
Vilarandelo,PCP-PEV,1.43,4,171231
Vilarandelo,PCTP/MRPP,1.43,4,171231
Vilarandelo,PND,1.43,4,171231
Vilarandelo,PNR,0.71,2,171231
Vilarandelo,PPM,0.71,2,171231
Vilarandelo,PAN,0.36,1,171231
Vilarandelo,PPV,0.36,1,171231
Vilarandelo,MAS,0,0,171231
Vilarandelo,PDA,0,0,171231
Vilarandelo,POUS,0,0,171231
Vilarandelo,PTP,0,0,171231
