Objeto do Contrato,Tipo de Procedimento,Tipo(s) de Contrato,CPVs,Entidade(s) Adjudicante(s),Entidade(s) Adjudicatária(s),Preço Contratual,Data de Publicação,Data de Celebração do Contrato,Prazo de Execução,Local de Execução,Fundamentação,Data de Fecho do Contrato,Preço Total Efetivo,Causas das Alterações ao Prazo,Causas das Alterações ao Preço,Estado,N.º registo do Acordo Quadro,Descrição do Acordo Quadro,Procedimento Centralizado
AQUISIÇÃO MATERIAL CONSUMO CLINICO,Ajuste Direto Regime Geral,Aquisição de bens móveis,"33140000-3, Material médico de consumo",Hospital Dr. Francisco Zagalo (501510150),GRUPO VITALINO (513083162),"24,14 €",13-08-2015,16-06-2015,30 dias,"Portugal, Aveiro, Ovar","Artigo 20.º, n.º 1, alínea a) do Código dos Contratos Públicos",28-07-2015,"24,14 €",,,,Não aplicável.,Não aplicável.,FALSE
AQUISIÇÃO MATERIAL CONSUMO CLINICO,Ajuste Direto Regime Geral,Aquisição de bens móveis,"33140000-3, Material médico de consumo",Hospital Dr. Francisco Zagalo (501510150),TEPREL (502262184),"860,00 €",13-08-2015,16-06-2015,30 dias,"Portugal, Aveiro, Ovar","Artigo 20.º, n.º 1, alínea a) do Código dos Contratos Públicos",28-07-2015,"860,00 €",,,,Não aplicável.,Não aplicável.,FALSE
AQUISIÇÃO MATERIAL CONSUMO CLINICO,Ajuste Direto Regime Geral,Aquisição de bens móveis,"33140000-3, Material médico de consumo",Hospital Dr. Francisco Zagalo (501510150),FEIRAMEDICA (503731900),"32,00 €",13-08-2015,16-06-2015,30 dias,"Portugal, Aveiro, Ovar","Artigo 20.º, n.º 1, alínea a) do Código dos Contratos Públicos",28-07-2015,"32,00 €",,,,Não aplicável.,Não aplicável.,FALSE
AQUISIÇÃO MATERIAL CONSUMO CLINICO,Ajuste Direto Regime Geral,Aquisição de bens móveis,"33140000-3, Material médico de consumo",Hospital Dr. Francisco Zagalo (501510150),EUROCASMEDICA (503322105),"39,00 €",13-08-2015,16-06-2015,30 dias,"Portugal, Aveiro, Ovar","Artigo 20.º, n.º 1, alínea a) do Código dos Contratos Públicos",28-07-2015,"39,00 €",,,,Não aplicável.,Não aplicável.,FALSE
