Objeto do Contrato,Tipo de Procedimento,Tipo(s) de Contrato,CPVs,Entidade(s) Adjudicante(s),Entidade(s) Adjudicatária(s),Preço Contratual,Data de Publicação,Data de Celebração do Contrato,Prazo de Execução,Local de Execução,Fundamentação,Data de Fecho do Contrato,Preço Total Efetivo,Causas das Alterações ao Prazo,Causas das Alterações ao Preço,Estado,N.º registo do Acordo Quadro,Descrição do Acordo Quadro,Procedimento Centralizado
Aquisição de At´s para o CMRSul,Ajuste Direto Regime Geral,Aquisição de bens móveis,"33000000-0, Equipamento médico, medicamentos e produtos para cuidados pessoais","Administração Regional de Saúde do Algarve, I. P. (503148709)","IACESS, Lda (513542434)","2.954,33 €",21-12-2016,03-11-2016,365 dias,"Portugal, Faro, Faro","Artigo 20.º, n.º 1, alínea a) do Código dos Contratos Públicos","","","","",,Não aplicável.,Não aplicável.,FALSE
AD/261/2016 - Empreitada de Substituição das Redes de Águas do Centro de Saúde de Vila Real de Santo António,Ajuste Direto Regime Geral,Empreitadas de obras públicas,"45332200-5, Instalação de canalizações de água","Administração Regional de Saúde do Algarve, I. P. (503148709)","Guadiclima - Instalação de Ar Condicionado, Lda (504985701)","18.355,60 €",20-12-2016,22-09-2016,30 dias,"Portugal, Faro, Vila Real Sto Antonio","Artigo 19.º, alínea a) do Código dos Contratos Públicos","","18.355,60 €",A obra estava em condições de rececionar antes do fim do prazo estipulado,"",,Não aplicável.,Não aplicável.,FALSE
AD/237/2016 - Substituição de Equipamentos Centralizados de Ar Condicionado e Ventilação do Centro de Saúde de Faro,Ajuste Direto Regime Geral,Aquisição de bens móveis,"39717200-3, Aparelhos de ar condicionado","Administração Regional de Saúde do Algarve, I. P. (503148709)",Carlos Lopes Gouveia Lda   (501522603),"34.279,49 €",20-12-2016,22-08-2016,30 dias,"Portugal, Faro, Faro","Artigo 20.º, n.º 1, alínea a) do Código dos Contratos Públicos",21-09-2016,"34.279,49 €","","",,Não aplicável.,Não aplicável.,FALSE
Aquisição de Material de Consumo Clínico e Diverso,Concurso público,Aquisição de bens móveis,"33140000-3, Material médico de consumo","Administração Regional de Saúde do Algarve, I. P. (503148709)","Coloplast Portugal, Lda (503989037)","1.224,00 €",20-12-2016,20-12-2016,11 dias,"Portugal, Faro, Faro","Artigo 20.º, n.º 1, alínea b) do Código dos Contratos Públicos","","","","",,Não aplicável.,Não aplicável.,FALSE
SC/301/2016 - Aquisição de Material de Penso de Efeito Terapêutico,Ao abrigo de acordo-quadro (art.º 259.º),Aquisição de bens móveis,"33140000-3, Material médico de consumo","Administração Regional de Saúde do Algarve, I. P. (503148709)","SPC South Point Care Especialidades Farmacêuticas, Lda. (508284872)","10.176,00 €",20-12-2016,20-12-2016,10 dias,"Portugal, Faro, Faro",Artigo 259.º do Código dos Contratos Públicos,"","","","",,1315192,Acordo Quadro para fornecimento de material de penso de efeito terapêutico às Instituições e Serviços do Serviço Nacional de Saúde,FALSE
SC/301/2016 - Aquisição de Material de Penso de Efeito Terapêutico,Ao abrigo de acordo-quadro (art.º 259.º),Aquisição de bens móveis,"33140000-3, Material médico de consumo","Administração Regional de Saúde do Algarve, I. P. (503148709)","Smith e Nephew, Lda. (503552461)","10.821,00 €",20-12-2016,20-12-2016,10 dias,"Portugal, Faro, Faro",Artigo 259.º do Código dos Contratos Públicos,"","","","",,1315192,Acordo Quadro para fornecimento de material de penso de efeito terapêutico às Instituições e Serviços do Serviço Nacional de Saúde,FALSE
SC/301/2016 - Aquisição de Material de Penso de Efeito Terapêutico,Ao abrigo de acordo-quadro (art.º 259.º),Aquisição de bens móveis,"33140000-3, Material médico de consumo","Administração Regional de Saúde do Algarve, I. P. (503148709)","Medicinália Cormédica - MCMedical, Lda. (500684324)","1.090,00 €",20-12-2016,20-12-2016,10 dias,"Portugal, Faro, Faro",Artigo 259.º do Código dos Contratos Públicos,"","","","",,1315192,Acordo Quadro para fornecimento de material de penso de efeito terapêutico às Instituições e Serviços do Serviço Nacional de Saúde,FALSE
SC/301/2016 - Aquisição de Material de Penso de Efeito Terapêutico,Ao abrigo de acordo-quadro (art.º 259.º),Aquisição de bens móveis,"33140000-3, Material médico de consumo","Administração Regional de Saúde do Algarve, I. P. (503148709)","B. Braun Medical, Lda. (501506543)","5.688,00 €",20-12-2016,20-12-2016,10 dias,"Portugal, Faro, Faro",Artigo 259.º do Código dos Contratos Públicos,"","","","",,1315192,Acordo Quadro para fornecimento de material de penso de efeito terapêutico às Instituições e Serviços do Serviço Nacional de Saúde,FALSE
SC/301/2016 - Aquisição de Material de Penso de Efeito Terapêutico,Ao abrigo de acordo-quadro (art.º 259.º),Aquisição de bens móveis,"33140000-3, Material médico de consumo","Administração Regional de Saúde do Algarve, I. P. (503148709)","3 M Portugal, Lda. (500193940)","7.408,20 €",20-12-2016,20-12-2016,10 dias,"Portugal, Faro, Faro",Artigo 259.º do Código dos Contratos Públicos,"","","","",,1315192,Acordo Quadro para fornecimento de material de penso de efeito terapêutico às Instituições e Serviços do Serviço Nacional de Saúde,FALSE
SC/301/2016 - Aquisição de Material de Penso de Efeito Terapêutico,Ao abrigo de acordo-quadro (art.º 259.º),Aquisição de bens móveis,"33140000-3, Material médico de consumo","Administração Regional de Saúde do Algarve, I. P. (503148709)","Queenlabs - Especialidades Farmacêuticas, Lda. (503984485)","3.490,00 €",19-12-2016,19-12-2016,12 dias,"Portugal, Faro, Faro",Artigo 259.º do Código dos Contratos Públicos,"","","","",,1315192,Acordo Quadro para fornecimento de material de penso de efeito terapêutico às Instituições e Serviços do Serviço Nacional de Saúde,FALSE
SC/301/2016 - Aquisição de Material de Penso de Efeito Terapêutico,Ao abrigo de acordo-quadro (art.º 259.º),Aquisição de bens móveis,"33140000-3, Material médico de consumo","Administração Regional de Saúde do Algarve, I. P. (503148709)","Paul Hartmann, Lda. (502271728)","1.294,00 €",19-12-2016,19-12-2016,12 dias,"Portugal, Faro, Faro",Artigo 259.º do Código dos Contratos Públicos,"","","","",,1315192,Acordo Quadro para fornecimento de material de penso de efeito terapêutico às Instituições e Serviços do Serviço Nacional de Saúde,FALSE
SP/289/2016 - Aquisição de vacinas PNV 2016 - quantidades adicionais,Ao abrigo de acordo-quadro (art.º 259.º),Aquisição de bens móveis,"33651600-4, Vacinas","Administração Regional de Saúde do Algarve, I. P. (503148709)","Sanofi Pasteur MSD, S.A. (507632796)","60.970,00 €",15-12-2016,15-12-2016,16 dias,"Portugal, Faro, Faro",Artigo 259.º do Código dos Contratos Públicos,"","","","",,1923518,CP 2016/13 - Acordo Quadro para fornecimento de Vacinas e Tuberculinas   às Instituições e Serviços do Serviço Nacional de Saúde,FALSE
Aquisição de babetes descartáveis,Ao abrigo de acordo-quadro (art.º 259.º),Aquisição de bens móveis,"33140000-3, Material médico de consumo","Administração Regional de Saúde do Algarve, I. P. (503148709)","Bastos Viegas, SA (500042772)","320,00 €",15-12-2016,15-12-2016,16 dias,"Portugal, Faro, Faro",Artigo 259.º do Código dos Contratos Públicos,"","","","",,598830,"CONCURSO PÚBLICO PARA A CELEBRAÇÃO DE CONTRATOS PÚBLICOS DE APROVISIONAMENTO PARA A ÁREA DA SAÚDE, COM VISTA AO FORNECIMENTO DE MATERIAL DE INCONTINÊNCIA, PROTEÇÃO CUTÂNEA E ALÍVIO DE PRESSÃO, ÀS INSTITUIÇÕES E SERVIÇOS DO SERVIÇO NACIONAL DE SAÚDE",FALSE
Prestação de Serviços em Regime de Avença de Jurista para o DC e UCL,Ajuste Direto Regime Geral,Aquisição de serviços,"79100000-5, Serviços jurídicos","Administração Regional de Saúde do Algarve, I. P. (503148709)",Rita Isabel de Azevedo Santinho Martins (214763897),"18.022,20 €",15-12-2016,29-11-2016,365 dias,"Portugal, Faro, Faro","Artigo 20.º, n.º 1, alínea a) do Código dos Contratos Públicos",31-12-2016,"1.601,95 €","Cessação do contrato por mutuo acordo, tendo em conta o disposto na Cláusula 5.ª do contrato.",Não cumprimento do prazo máximo possível de vigência do contrato,,Não aplicável.,Não aplicável.,FALSE
Aquisição de Ajudas Técnicas,Ajuste Direto Regime Geral,Aquisição de bens móveis,"33000000-0, Equipamento médico, medicamentos e produtos para cuidados pessoais","Administração Regional de Saúde do Algarve, I. P. (503148709)",Mobilitec (506343910),"4.644,64 €",13-12-2016,12-04-2016,365 dias,"Portugal, Faro, São Brás de Alportel","Artigo 20.º, n.º 1, alínea a) do Código dos Contratos Públicos","","","","",,Não aplicável.,Não aplicável.,FALSE
Aquisição de Ajudas técnicas,Ajuste Direto Regime Geral,Aquisição de bens móveis,"33000000-0, Equipamento médico, medicamentos e produtos para cuidados pessoais","Administração Regional de Saúde do Algarve, I. P. (503148709)",Ergométrica (502111216),"2.991,32 €",13-12-2016,11-04-2016,365 dias,"Portugal, Faro, São Brás de Alportel","Artigo 20.º, n.º 1, alínea a) do Código dos Contratos Públicos","","","","",,Não aplicável.,Não aplicável.,FALSE
Aquisição de Ajudas técnicas,Ajuste Direto Regime Geral,Aquisição de bens móveis,"33000000-0, Equipamento médico, medicamentos e produtos para cuidados pessoais","Administração Regional de Saúde do Algarve, I. P. (503148709)","Gome se Castro, Lda (509550606)","990,00 €",13-12-2016,12-04-2016,365 dias,"Portugal, Faro, São Brás de Alportel","Artigo 20.º, n.º 1, alínea a) do Código dos Contratos Públicos","","","","",,Não aplicável.,Não aplicável.,FALSE
Aquisição de Ajudas Técnicas,Ajuste Direto Regime Geral,Aquisição de bens móveis,"33000000-0, Equipamento médico, medicamentos e produtos para cuidados pessoais","Administração Regional de Saúde do Algarve, I. P. (503148709)",Mobilitec (506343910),"1.187,69 €",13-12-2016,30-05-2016,365 dias,"Portugal, Faro, São Brás de Alportel","Artigo 20.º, n.º 1, alínea a) do Código dos Contratos Públicos","","","","",,Não aplicável.,Não aplicável.,FALSE
Aquisição de cadeiras de rodas para o Cmrsul,Ajuste Direto Regime Geral,Aquisição de bens móveis,"33000000-0, Equipamento médico, medicamentos e produtos para cuidados pessoais","Administração Regional de Saúde do Algarve, I. P. (503148709)",Oltmed Unipessoal (510639631),"8.011,76 €",12-12-2016,08-11-2016,30 dias,"Portugal, Faro, Faro","Artigo 20.º, n.º 1, alínea a) do Código dos Contratos Públicos","","","","",,Não aplicável.,Não aplicável.,FALSE
