freguesia,acronym,validVotesPercentage,votes,dicofre
Vila Chã,PPD/PSD,49.7,165,030615
Vila Chã,PS,24.4,81,030615
Vila Chã,CDS-PP,7.83,26,030615
Vila Chã,B.E.,4.52,15,030615
Vila Chã,PAN,4.52,15,030615
Vila Chã,IL,2.41,8,030615
Vila Chã,PPM.PPV/CDC,1.51,5,030615
Vila Chã,L,0.9,3,030615
Vila Chã,PCP-PEV,0.9,3,030615
Vila Chã,A,0.6,2,030615
Vila Chã,PCTP/MRPP,0.6,2,030615
Vila Chã,PDR,0.6,2,030615
Vila Chã,PTP,0.6,2,030615
Vila Chã,MAS,0.3,1,030615
Vila Chã,NC,0.3,1,030615
Vila Chã,PNR,0.3,1,030615
Vila Chã,PURP,0,0,030615
