Objeto do Contrato,Tipo de Procedimento,Tipo(s) de Contrato,CPVs,Entidade(s) Adjudicante(s),Entidade(s) Adjudicatária(s),Preço Contratual,Data de Publicação,Data de Celebração do Contrato,Prazo de Execução,Local de Execução,Fundamentação,Data de Fecho do Contrato,Preço Total Efetivo,Causas das Alterações ao Prazo,Causas das Alterações ao Preço,Estado,N.º registo do Acordo Quadro,Descrição do Acordo Quadro,Procedimento Centralizado
Aquisição de baterias para UPS dos Centros de Saúde de Condeixa e Eiras,Ajuste Direto Regime Geral,Aquisição de bens móveis,"31400000-0, Acumuladores, pilhas e baterias eléctricas","ADMINISTRAÇÃO REGIONAL DE SAÚDE DO CENTRO, I. P. (503122165)",LÂMPADA DE CORES (509231608),"3.700,00 €",10-04-2014,10-04-2014,7 dias,"Portugal, Coimbra, Coimbra","Artigo 20.º, n.º 1, alínea a) do Código dos Contratos Públicos",10-04-2014,"3.700,00 €",,"",,Não aplicável.,Não aplicável.,FALSE
Equipamento diverso para a USF Araceti,Ajuste Direto Regime Geral,Aquisição de bens móveis,"44000000-0, Estruturas e materiais de construção; produtos auxiliares de construção (excepto aparelhos eléctricos)","Administração Regional de Saúde do Centro, I. P. (503122165)","Carlos Ribau, Unipessoal, Lda (506249794)","423,00 €",10-04-2014,27-05-2013,30 dias,"Portugal, Coimbra, Montemor-o-Velho","Artigo 20.º, n.º 1, alínea a) do Código dos Contratos Públicos",07-06-2013,"423,00 €",,"",,Não aplicável.,Não aplicável.,FALSE
Equipamento diverso para a USF Araceti,Ajuste Direto Regime Geral,Aquisição de bens móveis,"33000000-0, Equipamento médico, medicamentos e produtos para cuidados pessoais","Administração Regional de Saúde do Centro, I. P. (503122165)","Medical Plus - Produtos Médicos e Hospitalares, Lda (506658066)","222,00 €",10-04-2014,03-06-2013,30 dias,"Portugal, Coimbra, Montemor-o-Velho","Artigo 20.º, n.º 1, alínea a) do Código dos Contratos Públicos",11-06-2013,"222,00 €",,"",,Não aplicável.,Não aplicável.,FALSE
Equipamento diverso para a USF Araceti,Ajuste Direto Regime Geral,Aquisição de bens móveis,"33000000-0, Equipamento médico, medicamentos e produtos para cuidados pessoais","Administração Regional de Saúde do Centro, I. P. (503122165)","Higimarto - Indústria e Comércio de Higiene e Limpeza, Lda (504512218)","32,85 €",10-04-2014,22-08-2013,30 dias,"Portugal, Coimbra, Montemor-o-Velho","Artigo 20.º, n.º 1, alínea a) do Código dos Contratos Públicos",26-08-2013,"32,85 €",,"",,Não aplicável.,Não aplicável.,FALSE
Equipamento diverso para a USF Araceti,Ajuste Direto Regime Geral,Aquisição de bens móveis,"30000000-9, Máquinas, equipamento e material de escritório e de informática, excepto mobiliário e pacotes de programas (software)<BR/>33000000-0, Equipamento médico, medicamentos e produtos para cuidados pessoais","Administração Regional de Saúde do Centro, I. P. (503122165)","Movelobo - Mobiliário e Expositores, Lda (502786400)","405,00 €",10-04-2014,16-12-2013,30 dias,"Portugal, Coimbra, Montemor-o-Velho","Artigo 20.º, n.º 1, alínea a) do Código dos Contratos Públicos",07-01-2014,"405,00 €",,"",,Não aplicável.,Não aplicável.,FALSE
Aquisição de testes IGRA,Ajuste Direto Regime Geral,Aquisição de bens móveis,"33696500-0, Reagentes de laboratório","Administração Regional de Saúde do Centro, I. P. (503122165)","Quilaban - Quimica Laboratorial Analítica, Lda (500399670)","46.108,48 €",04-04-2014,24-03-2014,365 dias,"Portugal, Coimbra, Coimbra","Artigo 24.º, n.º 1, alínea e) do Código dos Contratos Públicos",07-11-2014,"46.108,48 €",,"",,Não aplicável.,Não aplicável.,FALSE
Aquisição de parafina+lanolina,Ao abrigo de acordo-quadro (art.º 259.º),Aquisição de bens móveis,"33690000-3, Medicamentos vários","Administração Regional de Saúde do Centro, I. P. (503122165)",LABORATORIO MEDINFAR (500384045),"2.900,00 €",02-04-2014,02-04-2014,30 dias,"Portugal, Coimbra, Coimbra",Artigo 259.º do Código dos Contratos Públicos,"","",,"",,549298,"Concurso Público para a celebração de Contratos Publicos de Aprovisionamento para a área da saúde com vista ao fornecimento de Antisepticos, Desinfetantes e Outros, às Instituições e Serviços do Serviço Nacional de Saúde.",FALSE
Mobiliário médico para a USF Trevim Sol,Ajuste Direto Regime Geral,Aquisição de bens móveis,"33192000-2, Mobiliário para fins médicos","Administração Regional de Saúde do Centro, I. P. (503122165)","Promei Centro - Compra e Venda, Montagem e Assitência Técnica de Equipamentos Hospitalares, Lda (506470113)","595,20 €",02-04-2014,13-03-2014,30 dias,"Portugal, Coimbra, Lousã","Artigo 20.º, n.º 1, alínea a) do Código dos Contratos Públicos",03-04-2014,"595,20 €",,"",,Não aplicável.,Não aplicável.,FALSE
Mobiliário médico para a USF Trevim Sol,Ajuste Direto Regime Geral,Aquisição de bens móveis,"33192000-2, Mobiliário para fins médicos","Administração Regional de Saúde do Centro, I. P. (503122165)","EPJMédica - Artigos Médicos e Hospitalares, Lda (506820513)","1.914,40 €",02-04-2014,13-03-2014,30 dias,"Portugal, Coimbra, Lousã","Artigo 20.º, n.º 1, alínea a) do Código dos Contratos Públicos",11-04-2014,"1.914,40 €",,"",,Não aplicável.,Não aplicável.,FALSE
Mobiliário médico para a USF Trevim Sol,Ajuste Direto Regime Geral,Aquisição de bens móveis,"33192000-2, Mobiliário para fins médicos","Administração Regional de Saúde do Centro, I. P. (503122165)","Bacelar  Irmão, Lda (500532818)","1.803,00 €",02-04-2014,13-03-2014,30 dias,"Portugal, Coimbra, Lousã","Artigo 20.º, n.º 1, alínea a) do Código dos Contratos Públicos",29-05-2014,"1.803,00 €",,"",,Não aplicável.,Não aplicável.,FALSE
Material podologia,Ajuste Direto Regime Geral,Aquisição de bens móveis,"33000000-0, Equipamento médico, medicamentos e produtos para cuidados pessoais","ADMINISTRAÇÃO REGIONAL DE SAÚDE DO CENTRO, I. P. (503122165)",BASTOS VIEGAS (500042772),"1.929,45 €",02-04-2014,13-03-2014,30 dias,"Portugal, Coimbra, Coimbra","Artigo 20.º, n.º 1, alínea a) do Código dos Contratos Públicos","","",,"",,Não aplicável.,Não aplicável.,FALSE
Material podologia,Ajuste Direto Regime Geral,Aquisição de bens móveis,"33000000-0, Equipamento médico, medicamentos e produtos para cuidados pessoais","ADMINISTRAÇÃO REGIONAL DE SAÚDE DO CENTRO, I. P. (503122165)",VITALCARE (505381206),"3.733,38 €",02-04-2014,13-03-2014,30 dias,"Portugal, Coimbra, Coimbra","Artigo 20.º, n.º 1, alínea a) do Código dos Contratos Públicos","","",,"",,Não aplicável.,Não aplicável.,FALSE
Material clinico saude oral,Ajuste Direto Regime Geral,Aquisição de bens móveis,"33000000-0, Equipamento médico, medicamentos e produtos para cuidados pessoais","ADMINISTRAÇÃO REGIONAL DE SAÚDE DO CENTRO, I. P. (503122165)",DENTALEADER (980187036),"430,19 €",02-04-2014,21-03-2014,30 dias,"Portugal, Coimbra, Coimbra","Artigo 20.º, n.º 1, alínea a) do Código dos Contratos Públicos","","",,"",,Não aplicável.,Não aplicável.,FALSE
Aquisição de material clinico,Ajuste Direto Regime Geral,Aquisição de bens móveis,"33000000-0, Equipamento médico, medicamentos e produtos para cuidados pessoais","ADMINISTRAÇÃO REGIONAL DE SAÚDE DO CENTRO, I. P. (503122165)",DENTINA (502335335),"169,69 €",02-04-2014,21-03-2014,30 dias,"Portugal, Coimbra, Coimbra","Artigo 20.º, n.º 1, alínea a) do Código dos Contratos Públicos","","",,"",,Não aplicável.,Não aplicável.,FALSE
Material clinico saude oral,Ajuste Direto Regime Geral,Aquisição de bens móveis,"33000000-0, Equipamento médico, medicamentos e produtos para cuidados pessoais","ADMINISTRAÇÃO REGIONAL DE SAÚDE DO CENTRO, I. P. (503122165)",VITALCARE (505381206),"617,74 €",02-04-2014,21-03-2014,30 dias,"Portugal, Coimbra, Coimbra","Artigo 20.º, n.º 1, alínea a) do Código dos Contratos Públicos","","",,"",,Não aplicável.,Não aplicável.,FALSE
Aquisição de material de penso,Ao abrigo de acordo-quadro (art.º 259.º),Aquisição de bens móveis,"33141110-4, Pensos","Administração Regional de Saúde do Centro, I. P. (503122165)",B.Braun (501506543),"18.525,00 €",02-04-2014,02-04-2014,180 dias,"Portugal, Coimbra, Coimbra",Artigo 259.º do Código dos Contratos Públicos,"","",,"",,490160,"CONCURSO PÚBLICO PARA A CELEBRAÇÃO DE CONTRATOS PÚBLICOS DE APROVISIONAMENTO PARA A ÁREA DA SAÚDE, COM VISTA AO FORNECIMENTO DE MATERIAL PENSO DE EFEITO TERAPÊUTICO - ÀS INSTITUIÇÕES E SERVIÇOS DO SERVIÇO NACIONAL DE SAÚDE",FALSE
Aquisição de material de penso,Ao abrigo de acordo-quadro (art.º 259.º),Aquisição de bens móveis,"33141110-4, Pensos","Administração Regional de Saúde do Centro, I. P. (503122165)",Lineamédica (505148676),"15.394,56 €",02-04-2014,02-04-2014,180 dias,"Portugal, Coimbra, Coimbra",Artigo 259.º do Código dos Contratos Públicos,"","",,"",,490160,"CONCURSO PÚBLICO PARA A CELEBRAÇÃO DE CONTRATOS PÚBLICOS DE APROVISIONAMENTO PARA A ÁREA DA SAÚDE, COM VISTA AO FORNECIMENTO DE MATERIAL PENSO DE EFEITO TERAPÊUTICO - ÀS INSTITUIÇÕES E SERVIÇOS DO SERVIÇO NACIONAL DE SAÚDE",FALSE
Aquisição de Papel para fotocópia e Impressão,Ao abrigo de acordo-quadro (art.º 259.º),Aquisição de bens móveis,"30197643-5, Papel para fotocópia","Instituto Nacional de Emergência Médica, IP (501356126), Centro Hospitalar do Alto Ave, EPE (508080827), Instituto de Oftalmologia Dr. Gama Pinto (600000052), Administração Regional de Saúde do Norte, IP (503135593), Hospital de Magalhães Lemos, EPE (502828790), Centro Hospitalar e Universitário de Coimbra, EPE (510103448), Serviços Partilhados do Ministério da Saúde, EPE (509540716), Unidade Local de Saúde de Matosinhos, EPE (506361390), Centro Hospitalar do Médio Tejo, EPE (506361608), Centro Hospitalar de Trás-os-Montes e Alto Douro, EPE (508100496), Centro Hospitalar do Porto, EPE (508331471), Administração Regional de Saúde do Centro, IP (503122165), Unidade Local de saúde da Guarda, EPE (508752000), Centro Hospitalar do Algarve, EPE (510745997), Centro Hospitalar Barreiro Montijo, EPE (509186998), Instituto Nacional de Saúde Dr. Ricardo Jorge, IP (501427511), Instituto Português de Oncologia do Porto Francisco Gentil, EPE (506362299), Centro Hospitalar de S. João, EPE (509821197), Inspeção-Geral das Atividades em Saúde (600018857), Instituto Português de Oncologia de Coimbra Francisco Gentil, EPE (506361438), Centro Hospitalar de Lisboa Ocidental, EPE (507618319), Administração Regional de Saúde do Algarve, IP (503148709), Hospital José Luciano de Castro (501613021), Secretaria-Geral do Ministério da Saúde (600080684), Hospital Espírito Santo, EPE (508085888), Unidade Local de Saúde do Alto Minho, EPE (508786193), Centro Hospitalar Cova da Beira, EPE (506361659), Hospital de Santarém, EPE (506361462), Administração Regional de Saúde de Lisboa e Vale do Tejo, IP (503148776), Centro Hospitalar Vila Nova de Gaia/Espinho, EPE (508142156), Hospital Santa Maria Maior, EPE (506361381), Administração Central do Sistema de Saúde, IP (508188423), Centro Hospitalar Tondela-Viseu, EPE (509822940), Hospital Dr. Francisco Zagalo (507846044), Direção-Geral da Saúde (600037100), Centro Hospitalar Tâmega e Sousa, EPE (508318262), Centro Hospitalar do Médio Ave, EPE (508093937), Unidade Local de Saúde do Norte Alentejano, EPE (508094461), Hospital Distrital Figueira da Foz, EPE (506361527), Centro Hospitalar do Oeste (510412009), Unidade Local de Saúde de Castelo Branco, EPE (509309844), Unidade Local de Saúde do Baixo Alentejo, EPE (508754275), Centro Hospitalar Lisboa Central, EPE (508080142), Unidade Local de Saúde do Nordeste, EPE (509932584), Centro Hospitalar Psiquiátrico de Lisboa (508338476), Centro Medicina de Reabilitação da Região Centro Rovisco Pais (503767336), Centro Hospitalar de Entre Douro e Vouga,  EPE (508878462), Hospital Garcia de Orta, EPE (506361470), Serviço de Intervenção nos Comportamentos Aditivos e nas Dependências (600084884), Hospital Professor Doutor Fernando Fonseca, EPE (503035416), Instituto Português do Sangue e da Transplantação, IP (502423943), Centro Hospitalar de Setúbal, EPE (507606787), Centro Hospitalar de Lisboa Norte, EPE (508481287), Hospital Arcebispo João Crisóstomo (501626123), Autoridade Nacional do Medicamento e Produtos de Saúde, IP (600037002), Administração Regional de Saúde do Alentejo, IP (503148768), Centro Hospitalar de Leiria-Pombal, EPE (509822932)","Staples Portugal, S.A. (503789372)","1.678.737,97 €",01-04-2014,02-01-2014,365 dias,Portugal,Artigo 259.º do Código dos Contratos Públicos,30-01-2014,"5.443,80 €",,O total efetivo corresponde apenas a este Centro Hospitalar.,,162548,"Concurso limitado por prévia qualificação para a celebração de Acordo Quadro para fornecimento de papel, economato e consumíveis de impressão.",TRUE
"Aquisição de eletricidade englobando BTE, MT, AT e MAT",Ao abrigo de acordo-quadro (art.º 259.º),Aquisição de bens móveis,"09310000-5, Electricidade","Inspeção-Geral das Atividades em Saúde (600018857), Centro Hospitalar Vila Nova de Gaia - Espinho, E. P. E. (508142156), Hospital Garcia de Orta, E.P.E. (506361470), Administração Regional de Saúde do Alentejo, I. P. (503148768), Hospital José Luciano de Castro - Anadia (501613021), Centro Hospitalar Cova da Beira, EPE (506361659), Centro Hospitalar do Porto, E.P.E. (508331471), Centro Hospitalar Barreiro Montijo, E.P.E. (509186998), Instituto de Oftalmologia Dr. Gama Pinto (600000052), Hospital Dr. Francisco Zagalo - Ovar (501510150), Centro Hospitalar e Universitário de Coimbra, E. P. E. (510103448), Secretaria-Geral do Ministério da Saúde (600080684), Administração Central do Sistema de Saúde, I.P. (508188423), CENTRO HOSPITALAR DO ALGARVE (508718872), Centro Hospitalar de Lisboa Ocidental, E.P.E. (507618319), Centro Hospitalar Psiquiátrico de Lisboa (508338476), Hospital Professor Doutor Fernando Fonseca, E.P.E. (503035416), Centro Hospitalar de Entre o Douro e Vouga, E.P.E. (508878462), Serviço Partilhados do Ministério da Saúde, E. P. E. (509540716), Unidade Local de Saúde do Litoral Alentejano, E.P.E. (510445152), Insituto Nacional de Saúde Dr. Ricardo Jorge, I.P. (501427511), Instituto Português Oncologia do Porto Francisco Gentil, E.P.E. (506362299), Centro Hospitalar do Tâmega e Sousa, E. P. E. (508318262), Administração Regional de Saúde Algarve, I.P. (503148709), Centro Hospitalar de Setúbal, E. P. E. (507606787), Administração Regional de Saúde do Norte, I. P. (503135593), Hospital de Magalhães Lemos, E. P. E. (502828790), Unidade Local de Saúde da Guarda, E.P.E. (508752000), Centro Hospitalar do Médio Tejo, E. P. E. (506361608), Centro Hospitalar de Leiria, E.P.E. (509822932), INFARMED - Autoridade Nacional do Medicamento e Produtos de Saúde I.P. (600037002), Centro Medicina de Reabilitação da Região Centro Rovisco Pais (503767336), CHO - Centro Hospitalar do Oeste (510412009), Centro Hospitalar Tondela-Viseu, E.P.E. (509822940), Centro Hospitalar Póvoa de Varzim - Vila do Conde, E.P.E. (508741823), SUCH - Serviço de Utilização Comum dos Hospitais (500900469), Centro Hospitalar do Alto Ave, E.P.E. (508080827), Unidade Local de Saúde do Alto Minho, E. P. E. (508786193), Unidade Local de Saúde do Baixo Alentejo, E.P.E. (508754275), Instituto Português do sangue (502423943), Unidade Local de Saúde de Castelo Branco, E.P.E. (509309844), Instituto Nacional de Emergência Médica, I.P. (501356126), Centro Hospitalar de Lisboa Central, E. P. E. (508080142), Hospital de Santarém, E.P.E. (506361462), Unidade Local de Saúde de Matosinhos, E.P.E. (506361390), Centro Hospitalar Lisboa Norte, E. P. E. (508481287), Hospital Santa Maria Maior, E.P.E. - Barcelos (506361381), Administração Regional de Saúde do Centro, I. P. (503122165), Administração Regional de Saúde de Lisboa e Vale do Tejo, I. P. (503148776), Centro Hospitalar de Trás-os-Montes e Alto Douro, E. P. E. (508100496), Unidade Local de Saúde do Nordeste, E. P. E (509932584), Direcção-Geral da Saúde (600037100), Centro Hospitalar do Médio Ave, E.P.E. (508093937), Centro Hospitalar do Baixo Vouga, E.P.E. (510123210), Instituto Português Oncologia de Coimbra Francisco Gentil, E.P.E. (506361438), Hospital do Espírito Santo de Évora, E. P. E. (508085888)","EDP Comercial, SA (503504564)","23.711.683,78 €",01-04-2014,01-03-2014,365 dias,Portugal,Artigo 259.º do Código dos Contratos Públicos,30-12-2014,"356.327,09 €",,diminuicao das necessidades,,314294,Acordo quadro para o fornecimento de electricidade em regime de mercado livre para Portugal Continental,TRUE
Aquisição de Economato,Ao abrigo de acordo-quadro (art.º 259.º),Aquisição de bens móveis,"30192000-1, Material de escritório","Instituto Português do Sangue e da Transplantação, I.P. (502423943), Instituto Nacional de Saúde Dr. Ricardo Jorge, IP (501427511), Administração Regional de Saúde Algarve, IP (503148709), Secretaria-Geral do Ministério da Saúde (600080684), Administração Regional de Saúde Alentejo, IP  (503148768), Administração Regional de Saúde Lisboa e Vale do Tejo, IP (503148776), Autoridade Nacional do Medicamento e Produtos de Saúde (600037002), Administração Central do Sistema de Saúde, I.P. (508188423), Direção-Geral da Saúde (600037100), Inspeção-Geral das Atividades em Saúde (600018857), Administração Regional de Saúde Centro, IP (503122165), Inatituto Nacional de Emergência Médica, I.P. (501356126), Administração Regional de Saúde Norte, IP (503135593), Serviço de Intervenção nos Comportamentos Aditivos e nas Dependências (600084884)","Olmar - Artigos de Papelaria, Lda. (508831989)","267.744,78 €",01-04-2014,22-02-2013,365 dias,Portugal,Artigo 259.º do Código dos Contratos Públicos,31-12-2013,"267.744,78 €",,"",,162548,"Concurso limitado por prévia qualificação para a celebração de Acordo Quadro para fornecimento de papel, economato e consumíveis de impressão.",TRUE
AQUISIÇÃO DE COMBUSTIVEL RODOVIÁRIO EM POSTOS DE ABASTECIMENTO PUBLICOS,Ao abrigo de acordo-quadro (art.º 259.º),Aquisição de bens móveis,"09100000-0, Combustíveis","Gabinete do Secretário de Estado da Saúde  (600052290), Gabinete do Secretário de Estado Adjunto do Ministro da Saúde  (600071006), Secretaria-Geral do Ministério da Saúde (600080684), Instituto Nacional de Emergência Médica, I.P. (501356126), Infarmed - Autoridade Nacional do Medicamento e Produtos de Saúde, I.P. (600037002), Administração Regional de Saúde Alentejo, I.P. (503148768), Administração Central do Sistema de Saúde, I.P. (508188423), Inspeção-Geral das Atividades em Saúde (600018857), Instituto Português do Sangue e da Transplantação, I.P. (502423943), Instituto Nacional de Saúde Dr. Ricardo Jorge, I.P. (501427511), Administração Regional de Saúde Centro, I.P. (503122165), Serviço de Intervenção nos Comportamentos Aditivos e nas Dependências (600084884), Direção-Geral da Saúde (600037100), Gabinete do Ministro da Saúde  (600052303), Administração Regional de Saúde Algarve, I.P. (503148709), Administração Regional de Saúde Norte, I.P. (503135593), Administração Regional de Saúde Lisboa e Vale do Tejo, I.P. (503148776)",Petroleos de Portugal SA (500697370),"3.483.417,76 €",01-04-2014,14-01-2013,365 dias,Portugal,Artigo 259.º do Código dos Contratos Públicos,14-01-2014,"3.483.417,76 €",,"",,1189847,FORNECIMENTO DE ENERGIA ELÉCTRICA PARA DIVERSAS INSTALAÇÕES OU INFRA-ESTRUTURAS DO MUNICÍPIO DE MATOSINHOS,TRUE
