Objeto do Contrato,Tipo de Procedimento,Tipo(s) de Contrato,CPVs,Entidade(s) Adjudicante(s),Entidade(s) Adjudicatária(s),Preço Contratual,Data de Publicação,Data de Celebração do Contrato,Prazo de Execução,Local de Execução,Fundamentação,Data de Fecho do Contrato,Preço Total Efetivo,Causas das Alterações ao Prazo,Causas das Alterações ao Preço,Estado,N.º registo do Acordo Quadro,Descrição do Acordo Quadro,Procedimento Centralizado
aquisição de equipamentro informático,Ao abrigo de acordo-quadro (art.º 259.º),Aquisição de bens móveis,"30000000-9, Máquinas, equipamento e material de escritório e de informática, excepto mobiliário e pacotes de programas (software)","Centro Hospitalar do Médio Tejo, E. P. E. (506361608)","BASE2, LDA (501333401)","4.872,00 €",24-04-2018,19-02-2018,60 dias,"Portugal, Santarém, Torres Novas",Artigo 259.º do Código dos Contratos Públicos,,,,,,1196657,Acordo Quadro para aquisição e aluguer operacional de equipamento informático,FALSE
"Manutenção Sistemas SGCIM, Radio, Sislab, Sibas, Anapat e EPR-OR",Ajuste Direto Regime Geral,Aquisição de serviços,"72000000-5, Serviços de TI: consultoria, desenvolvimento de software, Internet e apoio","Centro Hospitalar do Médio Tejo, E. P. E. (506361608)","Glintt - Healthcare Solutions, S.  A. (502479418)","62.974,77 €",24-04-2018,28-03-2018,365 dias,"Portugal, Santarém, Torres Novas","Artigo 24.º, n.º 1, alínea e), subalínea i) do Código dos Contratos Públicos",,,,,,Não aplicável.,Não aplicável.,FALSE
Projeto para Instalação de Painéis Solares Fotovoltaicos,Consulta Prévia,Aquisição de serviços,"71000000-8, Serviços de arquitectura, construção, engenharia e inspecção","Centro Hospitalar do Médio Tejo, E. P. E. (506361608)","S317 Consulting, Lda- (513560491)","45.000,00 €",23-04-2018,03-04-2018,90 dias,"Portugal, Santarém, Abrantes<BR/>Portugal, Santarém, Torres Novas<BR/>Portugal, Santarém, Tomar","Artigo 20.º, n.º 1, alínea c) do Código dos Contratos Públicos",,,,,,Não aplicável.,Não aplicável.,FALSE
Projeto Isolamento Térmico das Fachadas e Cobertura,Consulta Prévia,Aquisição de serviços,"71000000-8, Serviços de arquitectura, construção, engenharia e inspecção","Centro Hospitalar do Médio Tejo, E. P. E. (506361608)",SUCH | Serviço de Utilização Comum dos Hospitais (500900469),"54.300,00 €",23-04-2018,23-03-2018,90 dias,"Portugal, Santarém, Tomar<BR/>Portugal, Santarém, Abrantes<BR/>Portugal, Santarém, Torres Novas","Artigo 20.º, n.º 1, alínea c) do Código dos Contratos Públicos",,,,,,Não aplicável.,Não aplicável.,FALSE
Projeto Sistemas de Avac e Água Quente  Sanitária,Consulta Prévia,Aquisição de serviços,"71000000-8, Serviços de arquitectura, construção, engenharia e inspecção","Centro Hospitalar do Médio Tejo, E. P. E. (506361608)",SUCH | Serviço de Utilização Comum dos Hospitais (500900469),"56.850,00 €",23-04-2018,03-04-2018,120 dias,"Portugal, Santarém, Abrantes<BR/>Portugal, Santarém, Torres Novas<BR/>Portugal, Santarém, Tomar","Artigo 20.º, n.º 1, alínea c) do Código dos Contratos Públicos",,,,,,Não aplicável.,Não aplicável.,FALSE
Projeto para Iluminação Led e Instalação de Sensores de Movimento,Consulta Prévia,Aquisição de serviços,"71000000-8, Serviços de arquitectura, construção, engenharia e inspecção","Centro Hospitalar do Médio Tejo, E. P. E. (506361608)","S317 Consulting, Lda- (513560491)","17.000,00 €",23-04-2018,03-04-2018,60 dias,"Portugal, Santarém, Torres Novas","Artigo 20.º, n.º 1, alínea c) do Código dos Contratos Públicos",,,,,,Não aplicável.,Não aplicável.,FALSE
