Objeto do Contrato,Tipo de Procedimento,Tipo(s) de Contrato,CPVs,Entidade(s) Adjudicante(s),Entidade(s) Adjudicatária(s),Preço Contratual,Data de Publicação,Data de Celebração do Contrato,Prazo de Execução,Local de Execução,Fundamentação,Data de Fecho do Contrato,Preço Total Efetivo,Causas das Alterações ao Prazo,Causas das Alterações ao Preço,Estado,N.º registo do Acordo Quadro,Descrição do Acordo Quadro,Procedimento Centralizado
AQUISIÇÃO DE MEDICAMENTOS,Ajuste Direto Regime Geral,Aquisição de bens móveis,"33600000-6, Produtos farmacêuticos",Centro de Medicina de Reabilitação da Região Centro - Rovisco Pais (503767336),Ipsen (502609800),"9.841,00 €",02-11-2015,30-05-2014,30 dias,"Portugal, Coimbra, Cantanhede","Artigo 26.º, n.º 1, alínea a) do Código dos Contratos Públicos",24-06-2014,"9.841,00 €",,,,Não aplicável.,Não aplicável.,FALSE
AQUISIÇÃO DE MEDICAMENTOS,Ajuste Direto Regime Geral,Aquisição de bens móveis,"33600000-6, Produtos farmacêuticos",Centro de Medicina de Reabilitação da Região Centro - Rovisco Pais (503767336),Ipsen (502609800),"9.841,00 €",02-11-2015,18-04-2014,30 dias,"Portugal, Coimbra, Cantanhede","Artigo 26.º, n.º 1, alínea a) do Código dos Contratos Públicos",21-04-2015,"9.841,00 €",,,,Não aplicável.,Não aplicável.,FALSE
AQUISIÇÃO DE MEDICAMENTOS,Ajuste Direto Regime Geral,Aquisição de bens móveis,"33600000-6, Produtos farmacêuticos",Centro de Medicina de Reabilitação da Região Centro - Rovisco Pais (503767336),Ipsen (502609800),"9.841,00 €",02-11-2015,13-03-2014,30 dias,"Portugal, Coimbra, Cantanhede","Artigo 26.º, n.º 1, alínea a) do Código dos Contratos Públicos",17-03-2014,"9.841,00 €",,,,Não aplicável.,Não aplicável.,FALSE
AQUISIÇÃO DE MEDICAMENTOS,Ajuste Direto Regime Geral,Aquisição de bens móveis,"33600000-6, Produtos farmacêuticos",Centro de Medicina de Reabilitação da Região Centro - Rovisco Pais (503767336),Ipsen (502609800),"9.841,00 €",02-11-2015,10-02-2014,30 dias,"Portugal, Coimbra, Cantanhede","Artigo 26.º, n.º 1, alínea a) do Código dos Contratos Públicos",11-02-2014,"9.841,00 €",,,,Não aplicável.,Não aplicável.,FALSE
AQUISIÇÃO DE MEDICAMENTOS,Ajuste Direto Regime Geral,Aquisição de bens móveis,"33600000-6, Produtos farmacêuticos",Centro de Medicina de Reabilitação da Região Centro - Rovisco Pais (503767336),Profarin (500223238),"6.890,00 €",02-11-2015,28-03-2014,30 dias,"Portugal, Coimbra, Cantanhede","Artigo 26.º, n.º 1, alínea a) do Código dos Contratos Públicos",31-03-2014,"6.890,00 €",,,,Não aplicável.,Não aplicável.,FALSE
AQUISIÇÃO DE MEDICAMENTOS,Ajuste Direto Regime Geral,Aquisição de bens móveis,"33600000-6, Produtos farmacêuticos",Centro de Medicina de Reabilitação da Região Centro - Rovisco Pais (503767336),Ipsen (502609800),"8.345,17 €",02-11-2015,24-11-2014,30 dias,"Portugal, Coimbra, Cantanhede","Artigo 26.º, n.º 1, alínea a) do Código dos Contratos Públicos",24-11-2014,"8.345,17 €",,,,Não aplicável.,Não aplicável.,FALSE
AQUISIÇÃO DE MEDICAMENTOS,Ajuste Direto Regime Geral,Aquisição de bens móveis,"33600000-6, Produtos farmacêuticos",Centro de Medicina de Reabilitação da Região Centro - Rovisco Pais (503767336),Ipsen (502609800),"6.258,88 €",02-11-2015,27-10-2014,30 dias,"Portugal, Coimbra, Cantanhede","Artigo 26.º, n.º 1, alínea a) do Código dos Contratos Públicos",27-10-2014,"6.258,88 €",,,,Não aplicável.,Não aplicável.,FALSE
Fornecimento de gas e gasoleo para aquecimento,Ajuste Direto Regime Geral,Aquisição de serviços,"76000000-3, Serviços relacionados com as indústrias do gás e do petróleo",Centro de Medicina de Reabilitação da Região Centro - Rovisco Pais (503767336),PETROGAL (500697370),"229.172,70 €",02-11-2015,16-01-2014,365 dias,"Portugal, Coimbra, Cantanhede","Artigo 26.º, n.º 1, alínea a) do Código dos Contratos Públicos",31-12-2014,"229.172,70 €",,,,Não aplicável.,Não aplicável.,FALSE
Fornecimento de agua,Ajuste Direto Regime Geral,Aquisição de serviços,"65000000-3, Serviços públicos",Centro de Medicina de Reabilitação da Região Centro - Rovisco Pais (503767336),Inova (506091481),"50.440,61 €",02-11-2015,16-01-2014,365 dias,"Portugal, Coimbra, Cantanhede","Artigo 26.º, n.º 1, alínea a) do Código dos Contratos Públicos",31-12-2014,"50.440,61 €",,,,Não aplicável.,Não aplicável.,FALSE
AQUISIÇÃO DE MEDICAMENTOS,Ajuste Direto Regime Geral,Aquisição de bens móveis,"33600000-6, Produtos farmacêuticos",Centro de Medicina de Reabilitação da Região Centro - Rovisco Pais (503767336),Ipsen (502609800),"8.345,17 €",02-11-2015,22-07-2014,30 dias,"Portugal, Coimbra, Cantanhede","Artigo 26.º, n.º 1, alínea a) do Código dos Contratos Públicos",23-07-2014,"8.345,17 €",,,,Não aplicável.,Não aplicável.,FALSE
AQUISIÇÃO DE MEDICAMENTOS,Ajuste Direto Regime Geral,Aquisição de bens móveis,"33600000-6, Produtos farmacêuticos",Centro de Medicina de Reabilitação da Região Centro - Rovisco Pais (503767336),IPSEN (502609800),"6.258,88 €",02-11-2015,22-07-2014,30 dias,"Portugal, Coimbra, Cantanhede","Artigo 26.º, n.º 1, alínea a) do Código dos Contratos Públicos",23-07-2014,"6.258,88 €",,,,Não aplicável.,Não aplicável.,FALSE
Consultas de especialidades,Ajuste Direto Regime Geral,Aquisição de serviços,"85000000-9, Serviços de saúde e acção social",Centro de Medicina de Reabilitação da Região Centro - Rovisco Pais (503767336),HDFF (506361527),"23.234,78 €",02-11-2015,16-01-2014,365 dias,"Portugal, Coimbra, Cantanhede","Artigo 26.º, n.º 1, alínea a) do Código dos Contratos Públicos",31-12-2014,"23.234,78 €",,,,Não aplicável.,Não aplicável.,FALSE
Exames medicos,Ajuste Direto Regime Geral,Aquisição de serviços,"85000000-9, Serviços de saúde e acção social",Centro de Medicina de Reabilitação da Região Centro - Rovisco Pais (503767336),HDFF (506361527),"5.460,83 €",02-11-2015,31-12-2014,365 dias,"Portugal, Coimbra, Cantanhede","Artigo 26.º, n.º 1, alínea a) do Código dos Contratos Públicos",31-12-2014,"5.460,83 €",,,,Não aplicável.,Não aplicável.,FALSE
Tratamento de roupa,Ajuste Direto Regime Geral,Aquisição de serviços,"90000000-7, Serviços relativos a águas residuais, resíduos, limpeza e ambiente",Centro de Medicina de Reabilitação da Região Centro - Rovisco Pais (503767336),SUCH (500900469),"28.225,66 €",02-11-2015,31-12-2014,365 dias,"Portugal, Coimbra, Cantanhede","Artigo 26.º, n.º 1, alínea a) do Código dos Contratos Públicos",31-12-2014,"28.225,66 €",,,,Não aplicável.,Não aplicável.,FALSE
Serviços de limpeza jan e feve,Ajuste Direto Regime Geral,Aquisição de serviços,"55000000-0, Serviços de hotelaria, restauração e comércio a retalho",Centro de Medicina de Reabilitação da Região Centro - Rovisco Pais (503767336),SUCH (500900469),"34.491,42 €",02-11-2015,14-01-2014,60 dias,"Portugal, Coimbra, Cantanhede","Artigo 26.º, n.º 1, alínea a) do Código dos Contratos Públicos",28-02-2014,"34.491,42 €",,,,Não aplicável.,Não aplicável.,FALSE
Prestação de serviços de gestao de equipamentos,Ajuste Direto Regime Geral,Aquisição de serviços,"50000000-5, Serviços de reparação e manutenção",Centro de Medicina de Reabilitação da Região Centro - Rovisco Pais (503767336),SUCH (500900469),"96.500,00 €",02-11-2015,16-01-2014,365 dias,"Portugal, Coimbra, Cantanhede","Artigo 26.º, n.º 1, alínea a) do Código dos Contratos Públicos",31-12-2014,"96.500,00 €",,,,Não aplicável.,Não aplicável.,FALSE
Prestação de serviços de alimentação,Ajuste Direto Regime Geral,Aquisição de serviços,"55000000-0, Serviços de hotelaria, restauração e comércio a retalho",Centro de Medicina de Reabilitação da Região Centro - Rovisco Pais (503767336),SUCH (500900469),"820.325,22 €",02-11-2015,16-01-2014,365 dias,"Portugal, Coimbra, Cantanhede","Artigo 26.º, n.º 1, alínea a) do Código dos Contratos Públicos",31-12-2014,"820.325,22 €",,,,Não aplicável.,Não aplicável.,FALSE
