Objeto do Contrato,Tipo de Procedimento,Tipo(s) de Contrato,CPVs,Entidade(s) Adjudicante(s),Entidade(s) Adjudicatária(s),Preço Contratual,Data de Publicação,Data de Celebração do Contrato,Prazo de Execução,Local de Execução,Fundamentação,Data de Fecho do Contrato,Preço Total Efetivo,Causas das Alterações ao Prazo,Causas das Alterações ao Preço,Estado,N.º registo do Acordo Quadro,Descrição do Acordo Quadro,Procedimento Centralizado
"Aquisição de Serviços de Alimentação para o CHLO, EPE no 1º semestre de 2015",Ajuste Direto Regime Geral,Aquisição de serviços,"55320000-9, Serviços de provimento de refeições","Centro Hospitalar de Lisboa Ocidental, EPE (CHLO) (507618319)",Uniself SA (501323325),"858.941,58 €",09-01-2015,23-12-2014,183 dias,"Portugal, Lisboa, Lisboa","Artigo 27.º, n.º 1, alínea a) do Código dos Contratos Públicos",,,,,,Não aplicável.,Não aplicável.,FALSE
Renovação de licenciamento de Software VMWARE para 2015.,Ajuste Direto Regime Geral,Aquisição de serviços,"72000000-5, Serviços de TI: consultoria, desenvolvimento de software, Internet e apoio","Centro Hospitalar de Lisboa Ocidental, E. P. E. (507618319)",ITEN SOLUTIONS (510728189),"11.099,98 €",07-01-2015,31-12-2014,30 dias,"Portugal, Lisboa, Lisboa","Artigo 20.º, n.º 1, alínea a) do Código dos Contratos Públicos",,,,,,Não aplicável.,Não aplicável.,FALSE
Serviços de controlo de pragas no CHLO em 2015,Ajuste Direto Regime Geral,Aquisição de serviços,"77231200-0, Serviços de controlo de pragas florestais","Centro Hospitalar de Lisboa Ocidental, EPE (CHLO) (507618319)","Higicontrol, Lda (503808881)","5.100,00 €",06-01-2015,01-01-2015,365 dias,"Portugal, Lisboa, Oeiras<BR/>Portugal, Lisboa, Lisboa","Artigo 21.º, n.º 1, alínea a) do Código dos Contratos Públicos",,,,,,Não aplicável.,Não aplicável.,FALSE
Manutenção e Assistência Técnica às Portas Automáticas do CHLO durante 2015,Ajuste Direto Regime Geral,Aquisição de serviços,"50700000-2, Serviços de reparação e manutenção de equipamento em edifícios","Centro Hospitalar de Lisboa Ocidental, EPE (CHLO) (507618319)","ENTREDOOR, LDA (509282547)","9.280,00 €",06-01-2015,01-01-2015,365 dias,"Portugal, Lisboa, Oeiras<BR/>Portugal, Lisboa, Lisboa","Artigo 21.º, n.º 1, alínea a) do Código dos Contratos Públicos",,,,,,Não aplicável.,Não aplicável.,FALSE
"Serviços de manutenção e assistência técnica aos equipamentos e terminais de gases medicinais (ar comprimido, vácuo, protóxido de azoto, dióxido de carbono e oxigénio), existentes no CHLO",Ajuste Direto Regime Geral,Aquisição de serviços,"85110000-3, Serviços hospitalares e afins","Centro Hospitalar de Lisboa Ocidental, EPE (CHLO) (507618319)","Vedolis, Lda (501260170)","79.596,00 €",06-01-2015,30-12-2014,365 dias,"Portugal, Lisboa, Oeiras<BR/>Portugal, Lisboa, Lisboa","Artigo 27.º, n.º 1, alínea a) do Código dos Contratos Públicos",,,,,,Não aplicável.,Não aplicável.,FALSE
Substituição da rede águas do B. Operatório e recobro do HSFX,Ajuste Direto Regime Geral,Concessão de obras públicas,"50000000-5, Serviços de reparação e manutenção","Centro Hospitalar de Lisboa Ocidental, E. P. E. (507618319)","NJP, Lda (509699910)","16.147,00 €",05-01-2015,20-11-2014,15 dias,"Portugal, Lisboa, Lisboa","Artigo 19.º, alínea a) do Código dos Contratos Públicos",,,,,,Não aplicável.,Não aplicável.,FALSE
Aquisição de serviços de suporte e assistência técnica ao PICIS instalado no CHLO até ao final de 2014,Ajuste Direto Regime Geral,Aquisição de serviços,"72000000-5, Serviços de TI: consultoria, desenvolvimento de software, Internet e apoio","Centro Hospitalar de Lisboa Ocidental, E. P. E. (507618319)","Siemens, SA (500247480)","8.798,68 €",05-01-2015,26-09-2014,96 dias,"Portugal, Lisboa, Lisboa","Artigo 24.º, n.º 1, alínea a) do Código dos Contratos Públicos",,,,,,Não aplicável.,Não aplicável.,FALSE
"AD710314 - Serviços de Up-Grade do OCT do CHLO, EPE",Ajuste Direto Regime Geral,Aquisição de serviços,"72000000-5, Serviços de TI: consultoria, desenvolvimento de software, Internet e apoio","Centro Hospitalar de Lisboa Ocidental, E. P. E. (507618319)","Grupo Taper, Lda (506886336)","6.079,28 €",05-01-2015,07-10-2014,1 dias,"Portugal, Lisboa, Lisboa","Artigo 24.º, n.º 1, alínea a) do Código dos Contratos Públicos",,,,,,Não aplicável.,Não aplicável.,FALSE
