freguesia,acronym,validVotesPercentage,votes,dicofre
Gostei,PS,41.24,40,040218
Gostei,PPD/PSD,31.96,31,040218
Gostei,B.E.,6.19,6,040218
Gostei,CDS-PP,5.15,5,040218
Gostei,PCP-PEV,5.15,5,040218
Gostei,PPM.PPV/CDC,3.09,3,040218
Gostei,PAN,2.06,2,040218
Gostei,PCTP/MRPP,2.06,2,040218
Gostei,A,1.03,1,040218
Gostei,PDR,1.03,1,040218
Gostei,PTP,1.03,1,040218
Gostei,IL,0,0,040218
Gostei,L,0,0,040218
Gostei,MAS,0,0,040218
Gostei,NC,0,0,040218
Gostei,PNR,0,0,040218
Gostei,PURP,0,0,040218
