Objeto do Contrato,Tipo de Procedimento,Tipo(s) de Contrato,CPVs,Entidade(s) Adjudicante(s),Entidade(s) Adjudicatária(s),Preço Contratual,Data de Publicação,Data de Celebração do Contrato,Prazo de Execução,Local de Execução,Fundamentação,Data de Fecho do Contrato,Preço Total Efetivo,Causas das Alterações ao Prazo,Causas das Alterações ao Preço,Estado,N.º registo do Acordo Quadro,Descrição do Acordo Quadro,Procedimento Centralizado
37000318_Aquisição de 2 Microscopios para consulta de ORL,Ajuste Direto Regime Geral,Aquisição de bens móveis,"38511000-0, Microscópios electrónicos","Unidade Local de Saúde de Castelo Branco, E. P. E. (509309844)","LEICA MICROSISTEMAS, S.U., LDA (500301921)","28.000,00 €",01-03-2018,16-02-2018,15 dias,"Portugal, Castelo Branco, Castelo Branco","Artigo 20.º, n.º 1, alínea a) do Código dos Contratos Públicos",,,,,,Não aplicável.,Não aplicável.,FALSE
"P259-AC-2017-213_AQUISIÇÃO DE MEDICAMENTOS DESENCADEADA PELA SPMS, EPE NO ÂMBITO DO DESPACHO 1571/B DE 2016 AO ABRIGO DO ACORDO QUADRO 2015/006 - Medicamentos do Foro Oncológico",Ao abrigo de acordo-quadro (art.º 259.º),Aquisição de bens móveis,"33600000-6, Produtos farmacêuticos","Unidade Local de Saúde de Castelo Branco, E. P. E. (509309844)","Farmoz  - Sociedade Técnico Medicinal, SA (501505334)","53,28 €",21-02-2018,09-02-2018,365 dias,"Portugal, Castelo Branco, Castelo Branco",Artigo 259.º do Código dos Contratos Públicos,,,,,,1771819,CP 2015/6 - Acordo quadro para o fornecimento de Medicamentos do Foro Oncológico,FALSE
