freguesia,acronym,validVotesPercentage,votes,dicofre
Ribeira Quente,PS,47.83,110,420406
Ribeira Quente,PPD/PSD,23.91,55,420406
Ribeira Quente,B.E.,13.48,31,420406
Ribeira Quente,PAN,5.22,12,420406
Ribeira Quente,CDS-PP,3.91,9,420406
Ribeira Quente,PPM,1.3,3,420406
Ribeira Quente,PCP-PEV,0.87,2,420406
Ribeira Quente,PCTP/MRPP,0.87,2,420406
Ribeira Quente,PTP,0.87,2,420406
Ribeira Quente,IL,0.43,1,420406
Ribeira Quente,L,0.43,1,420406
Ribeira Quente,MPT,0.43,1,420406
Ribeira Quente,PNR,0.43,1,420406
Ribeira Quente,A,0,0,420406
Ribeira Quente,CH,0,0,420406
Ribeira Quente,MAS,0,0,420406
Ribeira Quente,PDR,0,0,420406
