Objeto do Contrato,Tipo de Procedimento,Tipo(s) de Contrato,CPVs,Entidade(s) Adjudicante(s),Entidade(s) Adjudicatária(s),Preço Contratual,Data de Publicação,Data de Celebração do Contrato,Prazo de Execução,Local de Execução,Fundamentação,Data de Fecho do Contrato,Preço Total Efetivo,Causas das Alterações ao Prazo,Causas das Alterações ao Preço,Estado,N.º registo do Acordo Quadro,Descrição do Acordo Quadro,Procedimento Centralizado
Aquisição de Mat. Consumo Clínico - Kits para Inativação de Plasma.,Ajuste Direto Regime Geral,Aquisição de bens móveis,"33141520-1, Derivados do plasma","Instituto Português do Sangue e da Transplantação, I. P. (502423943)",Cerus Europe B.V. (815623938),"917.935,20 €",10-06-2017,16-05-2017,210 dias,"Portugal, Coimbra, Coimbra<BR/>Portugal, Lisboa, Lisboa","Artigo 24.º, n.º 1, alínea e) do Código dos Contratos Públicos",,,,,,Não aplicável.,Não aplicável.,FALSE
Aquisição de Sistemas de Recolha de Sangue.,Ajuste Direto Regime Geral,Aquisição de bens móveis,"33141500-5, Produtos hematológicos","Instituto Português do Sangue e da Transplantação, I. P. (502423943)","Becton Dickinson Unipessoal, Ldª (514239743)","11.027,00 €",09-06-2017,29-05-2017,45 dias,"Portugal, Porto, Porto<BR/>Portugal, Lisboa, Lisboa<BR/>Portugal, Coimbra, Coimbra","Artigo 26.º, n.º 1, alínea a) do Código dos Contratos Públicos",,,,,,Não aplicável.,Não aplicável.,FALSE
Aquisição de Reagentes p/ Pesq. de Ácidos Nucleicos Virais HIV1/2/HCV/HBV p/ o Lab. Doenças Transmissíveis do CST Porto - Sangue,Ajuste Direto Regime Geral,Aquisição de bens móveis,"33696200-7, Reagentes para análises ao sangue","Instituto Português do Sangue e da Transplantação, I. P. (502423943)","Roche S. Diagnósticos, Lda (504282921)","129.384,00 €",08-06-2017,30-03-2017,270 dias,"Portugal, Porto, Porto","Artigo 26.º, n.º 1, alínea a) do Código dos Contratos Públicos",,,,,,Não aplicável.,Não aplicável.,FALSE
Aquisição de Reagentes p/ Pesq. de Ácidos Nucleicos Virais HIV1/2/HCV/HBV p/ o Lab. Doenças Transmissíveis do CST Lisboa - Sangue,Ajuste Direto Regime Geral,Aquisição de bens móveis,"33696200-7, Reagentes para análises ao sangue","Instituto Português do Sangue e da Transplantação, I. P. (502423943)","Roche S. Diagnósticos, Lda (504282921)","71.880,00 €",08-06-2017,09-05-2017,210 dias,"Portugal, Lisboa, Lisboa","Artigo 26.º, n.º 1, alínea a) do Código dos Contratos Públicos",,,,,,Não aplicável.,Não aplicável.,FALSE
Aquisição de Reagentes p/ Pesq. de Ácidos Nucleicos Virais HIV1/2/HCV/HBV p/ o Lab. Doenças Transmissíveis do CST Porto - Sangue,Ajuste Direto Regime Geral,Aquisição de bens móveis,"33696200-7, Reagentes para análises ao sangue","Instituto Português do Sangue e da Transplantação, I. P. (502423943)","Roche S. Diagnósticos, Lda (504282921)","129.384,00 €",08-06-2017,17-05-2017,210 dias,"Portugal, Porto, Porto","Artigo 26.º, n.º 1, alínea a) do Código dos Contratos Públicos",,,,,,Não aplicável.,Não aplicável.,FALSE
Kits para Preparação de Pools de Plaquetas,Concurso público,Aquisição de bens móveis,"33141500-5, Produtos hematológicos","Instituto Português do Sangue e da Transplantação, I. P. (502423943)","Terumo BCT Portugal, Unipessoal Ldª (510627048)","530.000,00 €",08-06-2017,16-05-2017,215 dias,"Portugal, Coimbra, Coimbra<BR/>Portugal, Lisboa, Lisboa","Artigo 20.º, n.º 1, alínea b) do Código dos Contratos Públicos",,,,,,Não aplicável.,Não aplicável.,FALSE
