freguesia,acronym,validVotesPercentage,votes,dicofre
Tolosa,PS,54.58,167,121210
Tolosa,PPD/PSD,17.65,54,121210
Tolosa,PCP-PEV,12.42,38,121210
Tolosa,B.E.,3.59,11,121210
Tolosa,PAN,2.94,9,121210
Tolosa,CDS-PP,2.61,8,121210
Tolosa,PPM.PPV/CDC,1.63,5,121210
Tolosa,PNR,0.98,3,121210
Tolosa,PCTP/MRPP,0.65,2,121210
Tolosa,PDR,0.65,2,121210
Tolosa,PTP,0.65,2,121210
Tolosa,PURP,0.65,2,121210
Tolosa,A,0.33,1,121210
Tolosa,L,0.33,1,121210
Tolosa,NC,0.33,1,121210
Tolosa,IL,0,0,121210
Tolosa,MAS,0,0,121210
