freguesia,acronym,validVotesPercentage,votes,dicofre
Figueira,PPD/PSD,43.31,55,180509
Figueira,PS,29.92,38,180509
Figueira,CDS-PP,11.02,14,180509
Figueira,B.E.,6.3,8,180509
Figueira,CH,1.57,2,180509
Figueira,PAN,1.57,2,180509
Figueira,PCP-PEV,1.57,2,180509
Figueira,R.I.R.,1.57,2,180509
Figueira,L,0.79,1,180509
Figueira,PCTP/MRPP,0.79,1,180509
Figueira,PDR,0.79,1,180509
Figueira,PNR,0.79,1,180509
Figueira,A,0,0,180509
Figueira,IL,0,0,180509
Figueira,JPP,0,0,180509
Figueira,MPT,0,0,180509
Figueira,NC,0,0,180509
Figueira,PPM,0,0,180509
Figueira,PTP,0,0,180509
Figueira,PURP,0,0,180509
