Objeto do Contrato,Tipo de Procedimento,Tipo(s) de Contrato,CPVs,Entidade(s) Adjudicante(s),Entidade(s) Adjudicatária(s),Preço Contratual,Data de Publicação,Data de Celebração do Contrato,Prazo de Execução,Local de Execução,Fundamentação,Data de Fecho do Contrato,Preço Total Efetivo,Causas das Alterações ao Prazo,Causas das Alterações ao Preço,Estado,N.º registo do Acordo Quadro,Descrição do Acordo Quadro,Procedimento Centralizado
Aquisição de serviços  de assessoria especializada em gestão risco e segurança,Ajuste Direto Regime Geral,Aquisição de serviços,"72220000-3, Serviços de consultoria técnica e em matéria de sistemas","SPMS - Serviços Partilhados do Ministério da Saúde, E. P. E. - SNCP (509540716)","Govaas - Governance Advisors AS-A-Service, Lda (513563733)","15.000,00 €",27-04-2016,18-12-2015,43 dias,Portugal,"Artigo 20.º, n.º 1, alínea a) do Código dos Contratos Públicos","","",,,,Não aplicável.,Não aplicável.,FALSE
"Aquisição de serviços de adequação da solução aos novos indicadores SIARS para as USF'S, à Interação com a PEM e migração de dados referentes ás USF's da ARS Algarve ",Ajuste Direto Regime Geral,Aquisição de serviços,"72320000-4, Serviços relacionados com bases de dados","SPMS- Serviços Partilhados do M. da Saúde, E.P.E. (509540716)","HIS-E-HEALTH Innovation Systems, SA (508071321)","73.040,00 €",22-04-2016,30-12-2015,92 dias,Portugal,"Artigo 20.º, n.º 1, alínea a) do Código dos Contratos Públicos","","",,,,Não aplicável.,Não aplicável.,FALSE
Aquisição de combustíveis rodoviários em postos públicos para Portugal Continental,Ao abrigo de acordo-quadro (art.º 259.º),Aquisição de bens móveis,"09100000-0, Combustíveis","SPMS- Serviços Partilhados do M. da Saúde, E.P.E. (509540716)",Petroleos de Portugal - Petrogal S.A. (500697370),"9.097,60 €",22-04-2016,10-03-2016,296 dias,Portugal,Artigo 259.º do Código dos Contratos Públicos,"","",,,,400324,Acordo quadro de fornecimento de combustíveis rodoviários,TRUE
Aquisição de sistema de informação integrado,Ajuste Direto Regime Geral,Aquisição de bens móveis,"48440000-4, Pacote de software para análise financeira e contabilidade","SPMS- Serviços Partilhados do M. da Saúde, E.P.E. (509540716)","Incentea - Tecnologia de gestão, S.A. (501968326)","66.627,44 €",22-04-2016,08-04-2016,365 dias,Portugal,"Artigo 20.º, n.º 1, alínea a) do Código dos Contratos Públicos",10-04-2017,"66.627,44 €",,,,Não aplicável.,Não aplicável.,FALSE
Aquisição de serviços de manutenção do catálogo público de aprovisionamento de saúde,Ajuste Direto Regime Geral,Aquisição de serviços,"72600000-6, Serviços de consultoria e assistência informáticas","SPMS- Serviços Partilhados do M. da Saúde, E.P.E. (509540716)","SVDI - Serviços e Tecnologias de Informação,lda (504308289)","25.000,00 €",22-04-2016,17-03-2016,288 dias,Portugal,"Artigo 20.º, n.º 1, alínea a) do Código dos Contratos Públicos","","",,,,Não aplicável.,Não aplicável.,FALSE
