freguesia,acronym,validVotesPercentage,votes,dicofre
Sortelha,PS,41.18,49,091133
Sortelha,PPD/PSD,27.73,33,091133
Sortelha,B.E.,7.56,9,091133
Sortelha,CDS-PP,6.72,8,091133
Sortelha,A,5.88,7,091133
Sortelha,PAN,2.52,3,091133
Sortelha,PCP-PEV,2.52,3,091133
Sortelha,PPM.PPV/CDC,2.52,3,091133
Sortelha,NC,0.84,1,091133
Sortelha,PCTP/MRPP,0.84,1,091133
Sortelha,PDR,0.84,1,091133
Sortelha,PURP,0.84,1,091133
Sortelha,IL,0,0,091133
Sortelha,L,0,0,091133
Sortelha,MAS,0,0,091133
Sortelha,PNR,0,0,091133
Sortelha,PTP,0,0,091133
