Objeto do Contrato,Tipo de Procedimento,Tipo(s) de Contrato,CPVs,Entidade(s) Adjudicante(s),Entidade(s) Adjudicatária(s),Preço Contratual,Data de Publicação,Data de Celebração do Contrato,Prazo de Execução,Local de Execução,Fundamentação,Data de Fecho do Contrato,Preço Total Efetivo,Causas das Alterações ao Prazo,Causas das Alterações ao Preço,Estado,N.º registo do Acordo Quadro,Descrição do Acordo Quadro,Procedimento Centralizado
Contrato de Prestação de Serviços Médicos,Ajuste Direto Regime Geral,Aquisição de serviços,"85141000-9, Serviços prestados pelo pessoal médico","Hospital Professor Doutor Fernando Fonseca, E. P. E. (503035416)",João Carlos Gomes Sanca (228371341),"11.700,00 €",19-05-2016,10-05-2016,90 dias,"Portugal, Lisboa, Amadora","Artigo 20.º, n.º 1, alínea a) do Código dos Contratos Públicos",,,,,,Não aplicável.,Não aplicável.,FALSE
Instalação e actualização do Osteodensitómetro Halogic,Ajuste Direto Regime Geral,Aquisição de serviços,"51413000-0, Serviços de instalação de equipamento de radioterapia",Hospital Prof. Doutor Fernando Fonseca E.P.E. (503035416),"RADILAN, LDA. (506015181)","7.698,00 €",18-05-2016,24-11-2015,30 dias,"Portugal, Lisboa, Amadora","Artigo 24.º, n.º 1, alínea e) do Código dos Contratos Públicos",,,,,,Não aplicável.,Não aplicável.,FALSE
SERVIÇOS MÉDICOS,Ajuste Direto Regime Geral,Aquisição de serviços,"85121200-5, Serviços de medicina especializada","Hospital Professor Doutor Fernando Fonseca, E. P. E. (503035416)",Ana Filomena Tavares e Castro (234359765),"7.200,00 €",17-05-2016,28-04-2016,135 dias,"Portugal, Lisboa, Amadora","Artigo 20.º, n.º 1, alínea a) do Código dos Contratos Públicos",,,,,,Não aplicável.,Não aplicável.,FALSE
SERVIÇOS MÉDICOS,Ajuste Direto Regime Geral,Aquisição de serviços,"85141000-9, Serviços prestados pelo pessoal médico","Hospital Professor Doutor Fernando Fonseca, E. P. E. (503035416)",Felicidade Fernandes - Unipessoal Lda (510398570),"9.360,00 €",13-05-2016,03-05-2016,180 dias,"Portugal, Lisboa, Amadora","Artigo 20.º, n.º 1, alínea a) do Código dos Contratos Públicos",,,,,,Não aplicável.,Não aplicável.,FALSE
Serviço de Apoio da Segurança ao Balcão dos Não Urgentes,Ajuste Direto Regime Geral,Aquisição de serviços,"79710000-4, Serviços de segurança","Hospital Professor Doutor Fernando Fonseca, E. P. E. (503035416)","Prosegur - Companhia de Segurança, Lda. (501290567)","15.261,29 €",12-05-2016,21-03-2016,136 dias,"Portugal, Lisboa, Amadora","Artigo 20.º, n.º 1, alínea a) do Código dos Contratos Públicos",,,,,,Não aplicável.,Não aplicável.,FALSE
Contrato de Prestação de Serviços Médicos.,Ajuste Direto Regime Geral,Aquisição de serviços,"85141000-9, Serviços prestados pelo pessoal médico","Hospital Professor Doutor Fernando Fonseca, E. P. E. (503035416)","Medseng, Lda. (510159761)","12.960,00 €",11-05-2016,30-03-2016,121 dias,"Portugal, Lisboa, Amadora","Artigo 20.º, n.º 1, alínea a) do Código dos Contratos Públicos",,,,,,Não aplicável.,Não aplicável.,FALSE
