freguesia,acronym,validVotesPercentage,votes,dicofre
Chave,PPD/PSD.CDS-PP,47.16,199,010407
Chave,PS,22.51,95,010407
Chave,MPT,11.85,50,010407
Chave,PCP-PEV,5.45,23,010407
Chave,B.E.,3.32,14,010407
Chave,PND,2.13,9,010407
Chave,PCTP/MRPP,1.9,8,010407
Chave,PTP,1.18,5,010407
Chave,PAN,0.95,4,010407
Chave,PPM,0.95,4,010407
Chave,PPV,0.95,4,010407
Chave,L,0.71,3,010407
Chave,PNR,0.71,3,010407
Chave,PDA,0.24,1,010407
Chave,MAS,0,0,010407
Chave,POUS,0,0,010407
