Objeto do Contrato,Tipo de Procedimento,Tipo(s) de Contrato,CPVs,Entidade(s) Adjudicante(s),Entidade(s) Adjudicatária(s),Preço Contratual,Data de Publicação,Data de Celebração do Contrato,Prazo de Execução,Local de Execução,Fundamentação,Data de Fecho do Contrato,Preço Total Efetivo,Causas das Alterações ao Prazo,Causas das Alterações ao Preço,Estado,N.º registo do Acordo Quadro,Descrição do Acordo Quadro,Procedimento Centralizado
Aquisição de serviços de implementação de um call center para atendimento de 1ª linha da Entidade Reguladora da Saúde (ERS) para os Regulados (prestadores) e Utentes.,Ajuste Direto Regime Geral,Aquisição de serviços,"64200000-8, Serviços de telecomunicações",Entidade Reguladora da Saúde (507021266),"Nos Cominicações, S.A. (502604751)","65.842,00 €",28-01-2016,25-09-2015,150 dias,"Portugal, Porto, Porto","Artigo 20.º, n.º 1, alínea a) do Código dos Contratos Públicos",,,,,,Não aplicável.,Não aplicável.,FALSE
"Aquisição de serviços para a realização de melhorias, manutenção preventiva e corretiva na infraestrutura de informática.",Ajuste Direto Regime Geral,Aquisição de serviços,"72610000-9, Serviços de assistência informática",Entidade Reguladora da Saúde (507021266),"Gonksys, S.A. (510874169)","24.700,00 €",28-01-2016,01-12-2015,365 dias,"Portugal, Porto, Porto","Artigo 20.º, n.º 1, alínea a) do Código dos Contratos Públicos",,,,,,Não aplicável.,Não aplicável.,FALSE
"Aquisição de serviços destinados à transferência dos sistemas de informação constantes das plataformas tecnológicas em que assenta o Sistema Nacional de Avaliação em Saúde (SINAS), bem como a manutenção e resolução de incidentes naquelas plataformas, reportados pela ERS.",Ajuste Direto Regime Geral,Aquisição de serviços,"72600000-6, Serviços de consultoria e assistência informáticas",Entidade Reguladora da Saúde (507021266),"Cerner Portugal, Unipessoal, Lda (513269843)","20.059,00 €",28-01-2016,13-10-2015,365 dias,"Portugal, Porto, Porto","Artigo 20.º, n.º 1, alínea a) do Código dos Contratos Públicos",,,,,,Não aplicável.,Não aplicável.,FALSE
"Aquisição de serviços para o desenvolvimento necessário para capacitar e melhorar a forma de comunicação dos softwares do sistema informático, denominados SRER e SGREC, bem como do Site Institucional.",Ajuste Direto Regime Geral,Aquisição de serviços,"72230000-6, Serviços de desenvolvimento de software à medida",Entidade Reguladora da Saúde (507021266),"Change Tomorrow, Lda. (513104640)","10.374,00 €",28-01-2016,02-11-2015,25 dias,"Portugal, Porto, Porto","Artigo 20.º, n.º 1, alínea a) do Código dos Contratos Públicos",,,,,,Não aplicável.,Não aplicável.,FALSE
