Objeto do Contrato,Tipo de Procedimento,Tipo(s) de Contrato,CPVs,Entidade(s) Adjudicante(s),Entidade(s) Adjudicatária(s),Preço Contratual,Data de Publicação,Data de Celebração do Contrato,Prazo de Execução,Local de Execução,Fundamentação,Data de Fecho do Contrato,Preço Total Efetivo,Causas das Alterações ao Prazo,Causas das Alterações ao Preço,Estado,N.º registo do Acordo Quadro,Descrição do Acordo Quadro,Procedimento Centralizado
"Aquisição de Alteplase, B. Tiotrópio, Int. Gama, Nevirapina sol oral e Tipranavir para 2013",Ajuste Direto Regime Geral,Aquisição de bens móveis,"33621100-0, Antitrombóticos","Centro Hospitalar de Lisboa Ocidental, EPE (507618319)",UNILFARMA (500293023),"87.742,69 €",20-02-2013,20-02-2013,315 dias,"Portugal, Lisboa, Lisboa","Artigo 24.º, n.º 1, alínea e) do Código dos Contratos Públicos",,,,,,Não aplicável.,Não aplicável.,
FORNECIMENTO E MONTAGEM DE 55 ESTORES DE MOLA PARA O INT. PSIQUIATRIA DO HEM,Ajuste Direto Regime Geral,Aquisição de serviços,"98390000-3, Outros serviços","Centro Hospitalar de Lisboa Ocidental, EPE (507618319)","Viesa- Vias e Saneamento, Lda (504393987)","8.580,00 €",20-02-2013,20-02-2013,30 dias,"Portugal, Lisboa, Lisboa","Artigo 21.º, n.º 1, alínea a) do Código dos Contratos Públicos",,,,,,Não aplicável.,Não aplicável.,
"Aquisição de Antiarrítmicos, Pancreatina e Anti-retroviral para 2013",Ajuste Direto Regime Geral,Aquisição de bens móveis,"33600000-6, Produtos farmacêuticos","Centro Hospitalar de Lisboa Ocidental, EPE (507618319)","ABBVIE, LDA (510229050)","5.171,76 €",18-02-2013,18-02-2013,317 dias,"Portugal, Lisboa, Lisboa","Artigo 24.º, n.º 1, alínea e) do Código dos Contratos Públicos",,,,,,Não aplicável.,Não aplicável.,
Prestação de Serviços de Manutenção e Assistência Técnica às Viaturas do CHLO durante o ano de 2013,Ajuste Direto Regime Geral,Aquisição de serviços,"50111110-0, Serviços de assistência a frotas de veículos","Centro Hospitalar de Lisboa Ocidental, EPE (507618319)","RP Drive, Lda (509088821)","60.000,00 €",15-02-2013,15-02-2013,289 dias,"Portugal, Lisboa, Oeiras<BR/>Portugal, Lisboa, Lisboa","Artigo 21.º, n.º 1, alínea a) do Código dos Contratos Públicos",,,,,,Não aplicável.,Não aplicável.,
"Prestação de Serviços de Subscrição da Micromedex - Bases Dados Drugdex e Kinitidex ao CHLO, EPE durante o ano de 2013",Ajuste Direto Regime Geral,Aquisição de serviços,"72416000-9, Fornecedores de aplicações","Centro Hospitalar de Lisboa Ocidental, EPE (507618319)","Logiser, SA (501486852)","23.920,00 €",14-02-2013,13-02-2013,322 dias,"Portugal, Lisboa, Lisboa","Artigo 27.º, n.º 1, alínea a) do Código dos Contratos Públicos",,,,,,Não aplicável.,Não aplicável.,
Reparação do Ventilador Maquet 300 do HSC,Ajuste Direto Regime Geral,Aquisição de serviços,"50000000-5, Serviços de reparação e manutenção","Centro Hospitalar de Lisboa Ocidental, EPE (507618319)","Maquet Portugal, Lda (506819698)","5.060,76 €",11-02-2013,08-02-2013,30 dias,"Portugal, Lisboa, Lisboa","Artigo 24.º, n.º 1, alínea e) do Código dos Contratos Públicos",,,,,,Não aplicável.,Não aplicável.,
