freguesia,acronym,validVotesPercentage,votes,dicofre
Águas Belas,PPD/PSD,41.3,38,091101
Águas Belas,PS,31.52,29,091101
Águas Belas,CDS-PP,13.04,12,091101
Águas Belas,B.E.,7.61,7,091101
Águas Belas,PCP-PEV,2.17,2,091101
Águas Belas,PTP,2.17,2,091101
Águas Belas,IL,1.09,1,091101
Águas Belas,PNR,1.09,1,091101
Águas Belas,A,0,0,091101
Águas Belas,CH,0,0,091101
Águas Belas,L,0,0,091101
Águas Belas,MPT,0,0,091101
Águas Belas,NC,0,0,091101
Águas Belas,PAN,0,0,091101
Águas Belas,PCTP/MRPP,0,0,091101
Águas Belas,PDR,0,0,091101
Águas Belas,PPM,0,0,091101
Águas Belas,PURP,0,0,091101
Águas Belas,R.I.R.,0,0,091101
