freguesia,acronym,validVotesPercentage,votes,dicofre
"União das freguesias de Vila Real (Nossa Senhora da Conceição, São Pedro e São Dinis)",PS,38.48,2095,171438
"União das freguesias de Vila Real (Nossa Senhora da Conceição, São Pedro e São Dinis)",PPD/PSD.CDS-PP,30.03,1635,171438
"União das freguesias de Vila Real (Nossa Senhora da Conceição, São Pedro e São Dinis)",MPT,8.91,485,171438
"União das freguesias de Vila Real (Nossa Senhora da Conceição, São Pedro e São Dinis)",PCP-PEV,7.95,433,171438
"União das freguesias de Vila Real (Nossa Senhora da Conceição, São Pedro e São Dinis)",B.E.,3.99,217,171438
"União das freguesias de Vila Real (Nossa Senhora da Conceição, São Pedro e São Dinis)",L,2.72,148,171438
"União das freguesias de Vila Real (Nossa Senhora da Conceição, São Pedro e São Dinis)",PPV,2.37,129,171438
"União das freguesias de Vila Real (Nossa Senhora da Conceição, São Pedro e São Dinis)",PCTP/MRPP,1.65,90,171438
"União das freguesias de Vila Real (Nossa Senhora da Conceição, São Pedro e São Dinis)",PAN,1.45,79,171438
"União das freguesias de Vila Real (Nossa Senhora da Conceição, São Pedro e São Dinis)",PPM,0.59,32,171438
"União das freguesias de Vila Real (Nossa Senhora da Conceição, São Pedro e São Dinis)",PTP,0.57,31,171438
"União das freguesias de Vila Real (Nossa Senhora da Conceição, São Pedro e São Dinis)",PND,0.48,26,171438
"União das freguesias de Vila Real (Nossa Senhora da Conceição, São Pedro e São Dinis)",PNR,0.42,23,171438
"União das freguesias de Vila Real (Nossa Senhora da Conceição, São Pedro e São Dinis)",MAS,0.28,15,171438
"União das freguesias de Vila Real (Nossa Senhora da Conceição, São Pedro e São Dinis)",PDA,0.07,4,171438
"União das freguesias de Vila Real (Nossa Senhora da Conceição, São Pedro e São Dinis)",POUS,0.06,3,171438
