freguesia,acronym,validVotesPercentage,votes,dicofre
Bairro,PS,39.45,692,031204
Bairro,PPD/PSD,37.8,663,031204
Bairro,B.E.,8.95,157,031204
Bairro,CDS-PP,3.76,66,031204
Bairro,PCP-PEV,3.65,64,031204
Bairro,PAN,2,35,031204
Bairro,IL,0.91,16,031204
Bairro,PCTP/MRPP,0.8,14,031204
Bairro,CH,0.63,11,031204
Bairro,R.I.R.,0.63,11,031204
Bairro,PNR,0.34,6,031204
Bairro,L,0.29,5,031204
Bairro,MPT,0.29,5,031204
Bairro,MAS,0.11,2,031204
Bairro,NC,0.11,2,031204
Bairro,PTP,0.11,2,031204
Bairro,JPP,0.06,1,031204
Bairro,PDR,0.06,1,031204
Bairro,PURP,0.06,1,031204
Bairro,A,0,0,031204
Bairro,PPM,0,0,031204
