Objeto do Contrato,Tipo de Procedimento,Tipo(s) de Contrato,CPVs,Entidade(s) Adjudicante(s),Entidade(s) Adjudicatária(s),Preço Contratual,Data de Publicação,Data de Celebração do Contrato,Prazo de Execução,Local de Execução,Fundamentação,Data de Fecho do Contrato,Preço Total Efetivo,Causas das Alterações ao Prazo,Causas das Alterações ao Preço,Estado,N.º registo do Acordo Quadro,Descrição do Acordo Quadro,Procedimento Centralizado
DESMOBILIZAÇÃO DE MÓDULOS PRÉ-FABRICADOS DA UNIDADE DE SAÚDE FAMILIAR DE CARNIDE.,Ajuste Direto Regime Geral,Aquisição de bens móveis,"44619000-2, Outros contentores","Administração Regional de Saúde de Lisboa e Vale do Tejo, I. P. (503148776)",Algeco - Construções Pré - Fabricadas S.A. (502721871),"3.973,00 €",11-09-2014,11-09-2014,7 dias,"Portugal, Lisboa, Lisboa","Artigo 24.º, n.º 1, alínea e) do Código dos Contratos Públicos",,,,,,Não aplicável.,Não aplicável.,FALSE
"FORNECIMENTO DE TELECOMUNICAÇÕES FIXAS DE VOZ PARA AS INSTALAÇÕES DA ARSLVT, IP.",Ajuste Direto Regime Geral,Aquisição de serviços,"64200000-8, Serviços de telecomunicações","Administração Regional de Saúde de Lisboa e Vale do Tejo, I. P. (503148776)",Pt Comunicações S.A. (504615947),"14.700,56 €",11-09-2014,11-09-2014,61 dias,"Portugal, Lisboa","Artigo 24.º, n.º 1, alínea e) do Código dos Contratos Públicos",,,,,,Não aplicável.,Não aplicável.,FALSE
AQUISIÇÃO DE VINHETAS MÉDICAS: LOCAL - CONFRARIA N.ª S.ª DA NAZARÉ,Ajuste Direto Regime Geral,Aquisição de bens móveis,"22100000-1, Livros, brochuras e folhetos impressos","Administração Regional de Saúde de Lisboa e Vale do Tejo, I. P. (503148776)",Imprensa Nacional - Casa da Moeda S.A. (500792887),"100,00 €",10-09-2014,10-09-2014,1 dias,"Portugal, Lisboa, Lisboa","Artigo 24.º, n.º 1, alínea e) do Código dos Contratos Públicos",,,,,,Não aplicável.,Não aplicável.,FALSE
FORNECIMENTO DE COMUNICAÇÕES FIXAS DE DADOS PARA AS INSTALAÇÕES DO DICAD. PERIODO DE SETEMBRO EOUTUBRO,Ajuste Direto Regime Geral,Aquisição de serviços,"64200000-8, Serviços de telecomunicações","Administração Regional de Saúde de Lisboa e Vale do Tejo, I. P. (503148776)",Pt Comunicações S.A. (504615947),"1.950,00 €",10-09-2014,08-09-2014,61 dias,"Portugal, Lisboa, Lisboa","Artigo 24.º, n.º 1, alínea e) do Código dos Contratos Públicos",,,,,,Não aplicável.,Não aplicável.,FALSE
"FORNECIMENTO DE TELECOMUNICAÇÕES FIXAS DE VOZ PARA AS INSTALAÇÕES DA ARSLVT, IP (USF BOAVISTA, USF QUINTA DO CONDE, SEDE DA ARS, SANIDADE MARITIMA, CDP DR. RIBEIRO SANCHES, UCSP ALAMEDA, UCSP GOLEGÃ,",Ajuste Direto Regime Geral,Aquisição de serviços,"64200000-8, Serviços de telecomunicações","Administração Regional de Saúde de Lisboa e Vale do Tejo, I. P. (503148776)",Pt Comunicações S.A. (504615947),"7.350,28 €",10-09-2014,10-09-2014,31 dias,"Portugal, Setúbal, Sesimbra<BR/>Portugal, Lisboa","Artigo 24.º, n.º 1, alínea e) do Código dos Contratos Públicos",,,,,,Não aplicável.,Não aplicável.,FALSE
FORNECIMENTO DE COMUNICAÇÕES FIXAS DE DADOS PARA AS INSTALAÇÕES DO DICAD. PERIODO DE AGOSTO DE 2014,Ajuste Direto Regime Geral,Aquisição de serviços,"64200000-8, Serviços de telecomunicações","Administração Regional de Saúde de Lisboa e Vale do Tejo, I. P. (503148776)",Pt Comunicações S.A. (504615947),"975,00 €",10-09-2014,10-09-2014,31 dias,"Portugal, Lisboa, Lisboa","Artigo 24.º, n.º 1, alínea e) do Código dos Contratos Públicos",,,,,,Não aplicável.,Não aplicável.,FALSE
"AQUISIÇÃO DE VÁRIOS APARELHOS DE AR CONDICIONADO, INSTALAÇÃO E LIGAÇÃO À REDE ELÉCTRICA E DE",Ajuste Direto Regime Geral,Aquisição de bens móveis,"39712000-6, Aparelhos domésticos para a higiene corporal","Administração Regional de Saúde de Lisboa e Vale do Tejo, I. P. (503148776)","Ventifor - Representações, Equipamentos e Assistência Técnica, Lda. (501140751)","7.602,62 €",10-09-2014,09-09-2014,20 dias,"Portugal, Lisboa, Lisboa","Artigo 20.º, n.º 1, alínea a) do Código dos Contratos Públicos",,,,,,Não aplicável.,Não aplicável.,FALSE
"PRESTAÇÃO DE SERVIÇOS DE AUDITORIA CLÍNICA À PRESTAÇÃO DE CUIDADOS DE SAÚDE DOS HOSPITAIS EM REGIME PPP, PARA A ARSLVT,IP.",Ajuste Direto Regime Geral,Aquisição de serviços,"79212000-3, Serviços de auditoria","Administração Regional de Saúde de Lisboa e Vale do Tejo, I. P. (503148776)",Shortcut - Consultadoria e Serviços de Tecnologias de Informação Lda. (505106841),"39.600,00 €",10-09-2014,30-07-2014,163 dias,"Portugal, Lisboa, Lisboa","Artigo 27.º, n.º 1, alínea b) do Código dos Contratos Públicos",,,,,,Não aplicável.,Não aplicável.,FALSE
FRASCOS PARA TRANSPORTE DE METADONA,Ajuste Direto Regime Geral,Aquisição de bens móveis,"33140000-3, Material médico de consumo","Administração Regional de Saúde de Lisboa e Vale do Tejo, I. P. (503148776)",Coliplas - Industria Transformadora de Plasticos Lda. (500738734),"22.393,00 €",09-09-2014,02-09-2014,120 dias,"Portugal, Lisboa, Lisboa","Artigo 20.º, n.º 1, alínea a) do Código dos Contratos Públicos",,,,,,Não aplicável.,Não aplicável.,FALSE
Empreitada de Remodelação e Beneficiação de espaços do edifício da USF Cruzeiro,Ajuste Direto Regime Geral,Empreitadas de obras públicas,"45113000-2, Obras no local","Administração Regional de Saúde de Lisboa e Vale do Tejo, I. P. (503148776)","Ramiro & Delgado - Construções Civís e Obras Públicas, Lda (501301704)","18.190,00 €",09-09-2014,09-09-2014,30 dias,"Portugal, Lisboa, Odivelas","Artigo 19.º, alínea a) do Código dos Contratos Públicos",,,,,,Não aplicável.,Não aplicável.,FALSE
Empreitada para a execução da Academia da Mobilidade no Centro de Saúde de Oeiras,Ajuste Direto Regime Geral,Empreitadas de obras públicas,"45113000-2, Obras no local","Administração Regional de Saúde de Lisboa e Vale do Tejo, I. P. (503148776)","Estabil - Engenheiros Associados, Lda (502522798)","74.832,00 €",09-09-2014,22-08-2014,22 dias,"Portugal, Lisboa, Oeiras","Artigo 19.º, alínea a) do Código dos Contratos Públicos",,,,,,Não aplicável.,Não aplicável.,FALSE
"Cloreto de Sódio 0,9% - FR 10ML",Ajuste Direto Regime Geral,Aquisição de bens móveis,"33600000-6, Produtos farmacêuticos","Administração Regional de Saúde de Lisboa e Vale do Tejo, I. P. (503148776)","Labesfal - Laboratórios Almiro, S.A. (501169580)","2.760,00 €",09-09-2014,05-09-2014,20 dias,"Portugal, Lisboa","Artigo 26.º, n.º 1, alínea e) do Código dos Contratos Públicos",,,,,,Não aplicável.,Não aplicável.,FALSE
"PRESTAÇÃO DE SERVIÇOS DE CONSULTADORIA DE GESTÃO E REENGENHARIA DE PROCESSOS DA ARSLVT, IP. - ANO",Ajuste Direto Regime Geral,Aquisição de serviços,"79412000-5, Serviços de consultoria em matéria de gestão financeira","Administração Regional de Saúde de Lisboa e Vale do Tejo, I. P. (503148776)",Strix Lda. (505793644),"28.440,00 €",08-09-2014,28-08-2014,365 dias,"Portugal, Lisboa, Lisboa","Artigo 27.º, n.º 1, alínea b) do Código dos Contratos Públicos",,,,,,Não aplicável.,Não aplicável.,FALSE
OUTRO MATERIAL DE ANESTESIA,Ajuste Direto Regime Geral,Aquisição de bens móveis,"33140000-3, Material médico de consumo","Administração Regional de Saúde de Lisboa e Vale do Tejo, I. P. (503148776)",Factormed - Comércio e Distribuição Produtos Médicos Lda. (506986918),"456,42 €",05-09-2014,05-09-2014,5 dias,"Portugal, Lisboa, Lisboa","Artigo 20.º, n.º 1, alínea a) do Código dos Contratos Públicos",,,,,,Não aplicável.,Não aplicável.,FALSE
"Aquisição de Diazepam 5MG/2,5ML Sol Retal",Ajuste Direto Regime Geral,Aquisição de bens móveis,"33690000-3, Medicamentos vários","Administração Regional de Saúde de Lisboa e Vale do Tejo, I. P. (503148776)","Aurovitas Unipessoal, Lda. (513053239)","81,80 €",05-09-2014,03-09-2014,20 dias,"Portugal, Lisboa","Artigo 26.º, n.º 1, alínea e) do Código dos Contratos Públicos",,,,,,Não aplicável.,Não aplicável.,FALSE
Aquisição de Solução Polimérica para Reforço do Estrato Córneo,Ajuste Direto Regime Geral,Aquisição de bens móveis,"33690000-3, Medicamentos vários","Administração Regional de Saúde de Lisboa e Vale do Tejo, I. P. (503148776)",Smith & Nephew Lda. (503552461),"3.974,04 €",05-09-2014,03-09-2014,20 dias,"Portugal, Lisboa","Artigo 26.º, n.º 1, alínea e) do Código dos Contratos Públicos",,,,,,Não aplicável.,Não aplicável.,FALSE
Aquisição de Água para Preparações Injetáveis 5ML Sol Inj,Ajuste Direto Regime Geral,Aquisição de bens móveis,"33692500-2, Soluções injectáveis","Administração Regional de Saúde de Lisboa e Vale do Tejo, I. P. (503148776)","Labesfal - Laboratórios Almiro, S.A. (501169580)","2.198,00 €",05-09-2014,03-09-2014,20 dias,"Portugal, Lisboa","Artigo 26.º, n.º 1, alínea e) do Código dos Contratos Públicos",,,,,,Não aplicável.,Não aplicável.,FALSE
Aquisição de Cloreto de Sódio 9MG/ML Sol Inj 100ML IV,Ajuste Direto Regime Geral,Aquisição de bens móveis,"33600000-6, Produtos farmacêuticos","Administração Regional de Saúde de Lisboa e Vale do Tejo, I.P. (503148776)","Labesfal - Laboratórios Almiro, S.A. (501169580)","14.250,00 €",05-09-2014,03-09-2014,20 dias,"Portugal, Lisboa","Artigo 26.º, n.º 1, alínea e) do Código dos Contratos Públicos",,,,,,Não aplicável.,Não aplicável.,FALSE
Aquisição de Sulfato de Protamina 1400UI/ML FR 5ML IV,Ajuste Direto Regime Geral,Aquisição de bens móveis,"33690000-3, Medicamentos vários","Administração Regional de Saúde de Lisboa e Vale do Tejo, I. P. (503148776)","R2MC - Rangel Produtos Farmacêuticos, S.A. (510599818)","189,00 €",05-09-2014,03-09-2014,20 dias,"Portugal, Lisboa","Artigo 24.º, n.º 1, alínea e) do Código dos Contratos Públicos",,,,,,Não aplicável.,Não aplicável.,FALSE
Empreitada de Readaptação e Beneficiação de espaços para a instalação da futura USF S. João do Estoril,Ajuste Direto Regime Geral,Empreitadas de obras públicas,"45113000-2, Obras no local","Administração Regional de Saúde de Lisboa e Vale do Tejo, I. P. (503148776)","Renascimóvel - Formação Técnica e Realização de Projetos Imobiliários, Lda (504480456)","7.468,43 €",02-09-2014,02-09-2014,20 dias,"Portugal, Lisboa, Cascais","Artigo 19.º, alínea a) do Código dos Contratos Públicos",,,,,,Não aplicável.,Não aplicável.,FALSE
AQUISIÇÃO DE TIRAS DE REAGENTES DE DETERMINAÇÃO DE 10 PARÂMETROS DE URINA,Concurso público,Locação de bens móveis,"33694000-1, Meios de diagnóstico","Administração Regional de Saúde de Lisboa e Vale do Tejo, I. P. (503148776)","Siemens Healthcare Diagnostics, Lda. (507925173)","62.500,00 €",02-09-2014,23-07-2014,161 dias,"Portugal, Lisboa, Lisboa","Artigo 20.º, n.º 1, alínea b) do Código dos Contratos Públicos",,,,,,Não aplicável.,Não aplicável.,FALSE
AQUISIÇÃO DE TIRAS DE REAGENTES DE DETERMINAÇÃO DE TEMPO DE PROTROMBINA,Concurso público,Locação de bens móveis,"33694000-1, Meios de diagnóstico","Administração Regional de Saúde de Lisboa e Vale do Tejo, I. P. (503148776)",Izasa Portugal - Distribuições Tecnicas Lda. (501086110),"70.000,00 €",02-09-2014,23-07-2014,161 dias,"Portugal, Lisboa, Lisboa","Artigo 20.º, n.º 1, alínea b) do Código dos Contratos Públicos",,,,,,Não aplicável.,Não aplicável.,FALSE
AQUISIÇÃO DE TIRAS DE REAGENTES DE DETERMINAÇÃO DE GLICOSE NO SANGUE,Concurso público,Locação de bens móveis,"33694000-1, Meios de diagnóstico","Administração Regional de Saúde de Lisboa e Vale do Tejo, I. P. (503148776)","Roche, Sistemas de Diagnosticos, Sociedade Unipessoal Lda. (504282921)","33.000,00 €",02-09-2014,31-07-2014,153 dias,"Portugal, Lisboa, Lisboa","Artigo 20.º, n.º 1, alínea b) do Código dos Contratos Públicos",,,,,,Não aplicável.,Não aplicável.,FALSE
CIPROFLOXACINA 750MG COMP,Ajuste Direto Regime Geral,Aquisição de bens móveis,"33690000-3, Medicamentos vários","Administração Regional de Saúde de Lisboa e Vale do Tejo, I. P. (503148776)",Labesfal - Laboratórios Almiro S.A. (501169580),"379,98 €",01-09-2014,28-08-2014,1 dias,"Portugal, Lisboa, Lisboa","Artigo 26.º, n.º 1, alínea e) do Código dos Contratos Públicos",,,,,,Não aplicável.,Não aplicável.,FALSE
RISPERIDONA 1MG/ML SOL ORAL FR 30ML,Ajuste Direto Regime Geral,Aquisição de bens móveis,"33690000-3, Medicamentos vários","Administração Regional de Saúde de Lisboa e Vale do Tejo, I. P. (503148776)",RATIOPHARM - COMÉRCIO E INDÚSTRIA DE PRODUTOS FARMACÊUTICOS LDA (502414910),"1.482,00 €",01-09-2014,29-08-2014,20 dias,"Portugal, Lisboa, Lisboa","Artigo 26.º, n.º 1, alínea e) do Código dos Contratos Públicos",,,,,,Não aplicável.,Não aplicável.,FALSE
"VACINA ANTI GRIPE INATIVADA SUSP. INJETÁVEL 0,5ML IM/SC",Ajuste Direto Regime Geral,Aquisição de bens móveis,"33651600-4, Vacinas","Administração Regional de Saúde de Lisboa e Vale do Tejo, I. P. (503148776)","Sanofi Pasteur Msd, S.A. (507632796)","705.018,24 €",01-09-2014,29-08-2014,120 dias,"Portugal, Lisboa, Lisboa","Artigo 26.º, n.º 1, alínea e) do Código dos Contratos Públicos",,,,,,Não aplicável.,Não aplicável.,FALSE
LIGADURA ELÁSTICA COESIVA,Ajuste Direto Regime Geral,Aquisição de bens móveis,"33141126-9, Ligaduras","Administração Regional de Saúde de Lisboa e Vale do Tejo, I. P. (503148776)",Bastos Viegas S.A. (500042772),"3.133,00 €",01-09-2014,06-08-2014,3 dias,"Portugal, Lisboa, Lisboa","Artigo 24.º, n.º 1, alínea b) do Código dos Contratos Públicos",,,,,,Não aplicável.,Não aplicável.,FALSE
VACINA PNEUMOCOCICA POLISSACARIDA UNIDOSE,Ajuste Direto Regime Geral,Aquisição de bens móveis,"33651600-4, Vacinas","Administração Regional de Saúde de Lisboa e Vale do Tejo, I. P. (503148776)","Sanofi Pasteur Msd, S.A. (507632796)","164,40 €",01-09-2014,11-08-2014,30 dias,"Portugal, Lisboa, Lisboa","Artigo 26.º, n.º 1, alínea e) do Código dos Contratos Públicos",,,,,,Não aplicável.,Não aplicável.,FALSE
