freguesia,acronym,validVotesPercentage,votes,dicofre
União das freguesias de Arouca e Burgo,PPD/PSD.CDS-PP,44.31,608,010421
União das freguesias de Arouca e Burgo,PS,28.64,393,010421
União das freguesias de Arouca e Burgo,MPT,9.4,129,010421
União das freguesias de Arouca e Burgo,PCP-PEV,5.83,80,010421
União das freguesias de Arouca e Burgo,B.E.,2.84,39,010421
União das freguesias de Arouca e Burgo,PPV,1.97,27,010421
União das freguesias de Arouca e Burgo,PAN,1.46,20,010421
União das freguesias de Arouca e Burgo,PCTP/MRPP,1.17,16,010421
União das freguesias de Arouca e Burgo,L,1.02,14,010421
União das freguesias de Arouca e Burgo,PND,0.95,13,010421
União das freguesias de Arouca e Burgo,PTP,0.87,12,010421
União das freguesias de Arouca e Burgo,PPM,0.58,8,010421
União das freguesias de Arouca e Burgo,PNR,0.44,6,010421
União das freguesias de Arouca e Burgo,MAS,0.36,5,010421
União das freguesias de Arouca e Burgo,PDA,0.15,2,010421
União das freguesias de Arouca e Burgo,POUS,0,0,010421
