Objeto do Contrato,Tipo de Procedimento,Tipo(s) de Contrato,CPVs,Entidade(s) Adjudicante(s),Entidade(s) Adjudicatária(s),Preço Contratual,Data de Publicação,Data de Celebração do Contrato,Prazo de Execução,Local de Execução,Fundamentação,Data de Fecho do Contrato,Preço Total Efetivo,Causas das Alterações ao Prazo,Causas das Alterações ao Preço,Estado,N.º registo do Acordo Quadro,Descrição do Acordo Quadro,Procedimento Centralizado
"Fornecimento de 20 resmas de papel para fotocopia A3, 80gr. e 3000 resmas de papel para fotocopia A4, 80gr.",Ao abrigo de acordo-quadro (art.º 258.º),Aquisição de bens móveis,"30197643-5, Papel para fotocópia","Instituto Nacional de Emergência Médica, IP (501356126)",STAPLES PORTUGAL (503789372),"5.749,80 €",11-03-2013,01-03-2013,30 dias,"Portugal, Lisboa, Lisboa","Artigo 26.º, n.º 1, alínea e) do Código dos Contratos Públicos","","",,"",,Não definido.,Não definido.,
Reparação de um monitor nonin sn 500689086.,Ajuste Direto Regime Geral,Aquisição de serviços,"50000000-5, Serviços de reparação e manutenção","Instituto Nacional de Emergência Médica, IP (501356126)","SPACE, LDA. (507662407)","305,00 €",11-03-2013,01-03-2013,30 dias,"Portugal, Lisboa, Lisboa","Artigo 24.º, n.º 1, alínea e) do Código dos Contratos Públicos","","",,"",,Não aplicável.,Não aplicável.,
Reparação de um aspirador weinmann sn 18068.,Ajuste Direto Regime Geral,Aquisição de serviços,"50000000-5, Serviços de reparação e manutenção","Instituto Nacional de Emergência Médica, IP (501356126)","FUTURVIDA, LDA. (504260510)","138,48 €",11-03-2013,01-03-2013,30 dias,"Portugal, Lisboa, Lisboa","Artigo 24.º, n.º 1, alínea e) do Código dos Contratos Públicos","","",,"",,Não aplicável.,Não aplicável.,
Reparação de um aspirador Weinamnn sn 18489.,Ajuste Direto Regime Geral,Aquisição de serviços,"50000000-5, Serviços de reparação e manutenção","Instituto Nacional de Emergência Médica, IP (501356126)","FUTURVIDA, LDA. (504260510)","349,60 €",11-03-2013,01-03-2013,30 dias,"Portugal, Lisboa, Lisboa","Artigo 24.º, n.º 1, alínea e) do Código dos Contratos Públicos","","",,"",,Não aplicável.,Não aplicável.,
Reparação de um aspirador Weinmann sn 21124.,Ajuste Direto Regime Geral,Aquisição de serviços,"50000000-5, Serviços de reparação e manutenção","Instituto Nacional de Emergência Médica, IP (501356126)","FUTURVIDA, LDA. (504260510)","222,40 €",11-03-2013,01-03-2013,30 dias,"Portugal, Lisboa, Lisboa","Artigo 24.º, n.º 1, alínea e) do Código dos Contratos Públicos","","",,"",,Não aplicável.,Não aplicável.,
Reparação de um aspirador Weinmann sn 20627.,Ajuste Direto Regime Geral,Aquisição de serviços,"50000000-5, Serviços de reparação e manutenção","Instituto Nacional de Emergência Médica, IP (501356126)","FUTURVIDA, LDA. (504260510)","252,05 €",11-03-2013,01-03-2013,30 dias,"Portugal, Lisboa, Lisboa","Artigo 24.º, n.º 1, alínea e) do Código dos Contratos Públicos","","",,"",,Não aplicável.,Não aplicável.,
Reparação de um aspirador Weinmann Accuvac Basic sn 20994.,Ajuste Direto Regime Geral,Aquisição de serviços,"50000000-5, Serviços de reparação e manutenção","Instituto Nacional de Emergência Médica, IP (501356126)","FUTURVIDA, LDA. (504260510)","138,48 €",11-03-2013,01-03-2013,30 dias,"Portugal, Lisboa, Lisboa","Artigo 24.º, n.º 1, alínea e) do Código dos Contratos Públicos","","",,"",,Não aplicável.,Não aplicável.,
Reparação de um aspirador Weinamann Accuvac Basic sn 20994.,Ajuste Direto Regime Geral,Aquisição de serviços,"50000000-5, Serviços de reparação e manutenção","Instituto Nacional de Emergência Médica, IP (501356126)","FUTURVIDA, LDA. (504260510)","138,48 €",11-03-2013,01-03-2013,30 dias,"Portugal, Lisboa, Lisboa","Artigo 24.º, n.º 1, alínea e) do Código dos Contratos Públicos","","",,"",,Não aplicável.,Não aplicável.,
Reparação de um aspirador Weinmann sn 3891.,Ajuste Direto Regime Geral,Aquisição de serviços,"50000000-5, Serviços de reparação e manutenção","Instituto Nacional de Emergência Médica, IP (501356126)","FUTURVIDA, LDA. (504260510)","173,00 €",11-03-2013,01-03-2013,30 dias,"Portugal, Lisboa, Lisboa","Artigo 24.º, n.º 1, alínea e) do Código dos Contratos Públicos","","",,"",,Não aplicável.,Não aplicável.,
Reparação de um monitor nonin sn 500238990.,Ajuste Direto Regime Geral,Aquisição de serviços,"50000000-5, Serviços de reparação e manutenção","Instituto Nacional de Emergência Médica, IP (501356126)","SPACE, LDA. (507662407)","500,00 €",11-03-2013,01-03-2013,30 dias,"Portugal, Lisboa, Lisboa","Artigo 24.º, n.º 1, alínea e) do Código dos Contratos Públicos","","",,"",,Não aplicável.,Não aplicável.,
Reparação de um monitor nonin sn 500683389.,Ajuste Direto Regime Geral,Aquisição de serviços,"50000000-5, Serviços de reparação e manutenção","Instituto Nacional de Emergência Médica, IP (501356126)","SPACE, LDA. (507662407)","393,09 €",11-03-2013,01-03-2013,30 dias,"Portugal, Lisboa, Lisboa","Artigo 24.º, n.º 1, alínea e) do Código dos Contratos Públicos","","",,"",,Não aplicável.,Não aplicável.,
Reparação de um LP1000 sn 40071324.,Ajuste Direto Regime Geral,Aquisição de serviços,"50000000-5, Serviços de reparação e manutenção","Instituto Nacional de Emergência Médica, IP (501356126)",PHYSIO PORTUGAL SALES (510137946),"30,00 €",11-03-2013,01-03-2013,30 dias,"Portugal, Lisboa, Lisboa","Artigo 24.º, n.º 1, alínea e) do Código dos Contratos Públicos","","",,"",,Não aplicável.,Não aplicável.,
Reparação de uma incubadora TI500 sn WC01152.,Ajuste Direto Regime Geral,Aquisição de serviços,"50000000-5, Serviços de reparação e manutenção","Instituto Nacional de Emergência Médica, IP (501356126)","SANO-TÉCNICA, LDA. (500239819)","1.467,80 €",11-03-2013,01-03-2013,30 dias,"Portugal, Lisboa, Lisboa","Artigo 24.º, n.º 1, alínea e) do Código dos Contratos Públicos","","",,"",,Não aplicável.,Não aplicável.,
Reparação de um aspirador accuvac basic sn 21013.,Ajuste Direto Regime Geral,Aquisição de serviços,"50000000-5, Serviços de reparação e manutenção","Instituto Nacional de Emergência Médica, IP (501356126)","FUTURVIDA, LDA. (504260510)","36,48 €",11-03-2013,01-03-2013,30 dias,"Portugal, Lisboa, Lisboa","Artigo 24.º, n.º 1, alínea e) do Código dos Contratos Públicos","","",,"",,Não aplicável.,Não aplicável.,
"Reparação de incubadora de transporte, modelo TI500 sn RC00894.",Ajuste Direto Regime Geral,Aquisição de serviços,"50000000-5, Serviços de reparação e manutenção","Instituto Nacional de Emergência Médica, IP (501356126)","SANO-TÉCNICA, LDA. (500239819)","364,87 €",11-03-2013,01-03-2013,30 dias,"Portugal, Lisboa, Lisboa","Artigo 24.º, n.º 1, alínea e) do Código dos Contratos Públicos","","",,"",,Não aplicável.,Não aplicável.,
Reparação de monitor Nonin sn 500250490.,Ajuste Direto Regime Geral,Aquisição de serviços,"50000000-5, Serviços de reparação e manutenção","Instituto Nacional de Emergência Médica, IP (501356126)","SPACE, LDA. (507662407)","500,00 €",11-03-2013,01-03-2013,30 dias,"Portugal, Lisboa, Lisboa","Artigo 24.º, n.º 1, alínea e) do Código dos Contratos Públicos","","",,"",,Não aplicável.,Não aplicável.,
Fornecimento de produtos de higiene e serviços de limpeza.,Ao abrigo de acordo-quadro (art.º 258.º),Aquisição de serviços,"90919200-4, Serviços de limpeza de escritórios","Instituto Nacional de Emergência Médica, IP (501356126)","CONFORLIMPA (Tejo) - MULTISERVIÇOS, S.A. (503172588)","21.209,19 €",08-03-2013,28-02-2013,31 dias,"Portugal, Lisboa, Lisboa<BR/>Portugal, Coimbra, Coimbra<BR/>Portugal, Porto, Vila Nova de Gaia<BR/>Portugal, Porto, Porto<BR/>Portugal, Faro, Faro","Artigo 27.º, n.º 1, alínea h) do Código dos Contratos Públicos",27-05-2013,"21.121,04 €",,Preço contratual referente aos consumíveis é montante estimado.,,Não definido.,Não definido.,
Reparação de um LP12 sn 35810147.,Ajuste Direto Regime Geral,Aquisição de serviços,"50000000-5, Serviços de reparação e manutenção","Instituto Nacional de Emergência Médica, IP (501356126)",PHYSIO PORTUGAL SALES (510137946),"497,16 €",08-03-2013,01-03-2013,30 dias,"Portugal, Lisboa, Lisboa","Artigo 24.º, n.º 1, alínea e) do Código dos Contratos Públicos","","",,"",,Não aplicável.,Não aplicável.,
Reparação de um LP12 sn 35810152.,Ajuste Direto Regime Geral,Aquisição de serviços,"50000000-5, Serviços de reparação e manutenção","Instituto Nacional de Emergência Médica, IP (501356126)",PHYSIO PORTUGAL SALES (510137946),"270,61 €",08-03-2013,01-03-2013,30 dias,"Portugal, Lisboa, Lisboa","Artigo 24.º, n.º 1, alínea e) do Código dos Contratos Públicos","","",,"",,Não aplicável.,Não aplicável.,
Reparação de um LP12 sn 30290026.,Ajuste Direto Regime Geral,Aquisição de serviços,"50000000-5, Serviços de reparação e manutenção","Instituto Nacional de Emergência Médica, IP (501356126)",PHYSIO PORTUGAL SALES (510137946),"1.957,75 €",08-03-2013,01-03-2013,30 dias,"Portugal, Lisboa, Lisboa","Artigo 24.º, n.º 1, alínea e) do Código dos Contratos Públicos","","",,"",,Não aplicável.,Não aplicável.,
Reparação de um aspirador weinmann sn 14214.,Ajuste Direto Regime Geral,Aquisição de serviços,"50000000-5, Serviços de reparação e manutenção","Instituto Nacional de Emergência Médica, IP (501356126)","FUTURVIDA, LDA. (504260510)","190,24 €",08-03-2013,01-03-2013,30 dias,"Portugal, Lisboa, Lisboa","Artigo 24.º, n.º 1, alínea e) do Código dos Contratos Públicos","","",,"",,Não aplicável.,Não aplicável.,
Reparação de um aspirador weinmann sn 17838.,Ajuste Direto Regime Geral,Aquisição de serviços,"50000000-5, Serviços de reparação e manutenção","Instituto Nacional de Emergência Médica, IP (501356126)","FUTURVIDA, LDA. (504260510)","190,88 €",08-03-2013,01-03-2013,30 dias,"Portugal, Lisboa, Lisboa","Artigo 24.º, n.º 1, alínea e) do Código dos Contratos Públicos","","",,"",,Não aplicável.,Não aplicável.,
Reparação de um aspirador weinmann sn 15407.,Ajuste Direto Regime Geral,Aquisição de serviços,"50000000-5, Serviços de reparação e manutenção","Instituto Nacional de Emergência Médica, IP (501356126)","FUTURVIDA, LDA. (504260510)","157,42 €",08-03-2013,01-03-2013,30 dias,"Portugal, Lisboa, Lisboa","Artigo 24.º, n.º 1, alínea e) do Código dos Contratos Públicos","","",,"",,Não aplicável.,Não aplicável.,
Reparação de um aspirador weinmann sn 17789.,Ajuste Direto Regime Geral,Aquisição de serviços,"50000000-5, Serviços de reparação e manutenção","Instituto Nacional de Emergência Médica, IP (501356126)","FUTURVIDA, LDA. (504260510)","235,24 €",08-03-2013,01-03-2013,30 dias,"Portugal, Lisboa, Lisboa","Artigo 24.º, n.º 1, alínea e) do Código dos Contratos Públicos","","",,"",,Não aplicável.,Não aplicável.,
Reparação de um aspirador weinmann sn 18480.,Ajuste Direto Regime Geral,Aquisição de serviços,"50000000-5, Serviços de reparação e manutenção","Instituto Nacional de Emergência Médica, IP (501356126)","FUTURVIDA, LDA. (504260510)","349,60 €",08-03-2013,01-03-2013,30 dias,"Portugal, Lisboa, Lisboa","Artigo 24.º, n.º 1, alínea e) do Código dos Contratos Públicos","","",,"",,Não aplicável.,Não aplicável.,
Reparação de um LP 12 sn 35810142.,Ajuste Direto Regime Geral,Aquisição de serviços,"50000000-5, Serviços de reparação e manutenção","Instituto Nacional de Emergência Médica, IP (501356126)",PHYSIO PORTUGAL SALES (510137946),"692,60 €",08-03-2013,01-03-2013,30 dias,"Portugal, Lisboa, Lisboa","Artigo 24.º, n.º 1, alínea e) do Código dos Contratos Públicos","","",,"",,Não aplicável.,Não aplicável.,
Fornecimento de produtos de higiene e serviços de limpeza.,Ao abrigo de acordo-quadro (art.º 258.º),Aquisição de serviços,"90919200-4, Serviços de limpeza de escritórios","Instituto Nacional de Emergência Médica, IP (501356126)","CONFORLIMPA (Tejo) - MULTISERVIÇOS, S.A. (503172588)","21.209,19 €",08-03-2013,01-02-2013,28 dias,"Portugal, Porto, Porto<BR/>Portugal, Faro, Faro<BR/>Portugal, Lisboa, Lisboa<BR/>Portugal, Coimbra, Coimbra<BR/>Portugal, Porto, Vila Nova de Gaia","Artigo 27.º, n.º 1, alínea h) do Código dos Contratos Públicos",27-05-2013,"21.133,32 €",,Preço contratual referente aos consumíveis é montante estimado.,,Não definido.,Não definido.,
"Prestação de serviço de gestão de frota do INEM, IP., serviços estes que englobam a gestão da assistência, manutenção e reparação da frota de viaturas do Instituto, em qualquer ponto do território do continente.",Ajuste Direto Regime Geral,Aquisição de serviços,"50111000-6, Serviços de gestão, reparação e manutenção de frota de veículos","Instituto Nacional de Emergência Médica, IP (501356126)","FINLOG - Aluguer e Comércio de Automóveis, S.A. (502584866), PT PRO Serviços Administrativos e de Gestão Partilhados, S.A. (505322145)","190.379,40 €",08-03-2013,28-02-2013,31 dias,"Portugal, Portugal Continental","Artigo 27.º, n.º 1, alínea a) do Código dos Contratos Públicos","","",,"",,Não aplicável.,Não aplicável.,
Serviços combinados de vigilância e segurança humana e de ligação a central de receção e monitorização de alarmes.,Ao abrigo de acordo-quadro (art.º 258.º),Aquisição de serviços,"79714000-2, Serviços de vigilância","Instituto Nacional de Emergência Médica, IP (501356126)","PRESTIBEL - Empresa de Segurança, S.A. (501326456)","40.128,90 €",08-03-2013,28-02-2013,31 dias,"Portugal, Coimbra, Coimbra<BR/>Portugal, Porto, Porto<BR/>Portugal, Lisboa, Lisboa<BR/>Portugal, Porto, Vila Nova de Gaia","Artigo 27.º, n.º 1, alínea h) do Código dos Contratos Públicos",26-04-2013,"40.128,90 €",,"",,Não definido.,Não definido.,
Serviços combinados de vigilância a segurança humana e de ligação a central de receção e monitorização de alarmes.,Ao abrigo de acordo-quadro (art.º 258.º),Aquisição de serviços,"79714000-2, Serviços de vigilância","Instituto Nacional de Emergência Médica, IP (501356126)","PRESTIBEL - Empresa de Segurança, S.A. (501326456)","40.128,90 €",08-03-2013,01-02-2013,28 dias,"Portugal, Porto, Porto<BR/>Portugal, Porto, Vila Nova de Gaia<BR/>Portugal, Coimbra, Coimbra<BR/>Portugal, Lisboa, Lisboa","Artigo 27.º, n.º 1, alínea h) do Código dos Contratos Públicos",22-04-2013,"40.128,90 €",,"",,Não definido.,Não definido.,
Pagamento de portagens a concessionária Ascendi Norte.,Ajuste Direto Regime Geral,Aquisição de serviços,"63712210-8, Serviços de portagem em auto-estradas","Instituto Nacional de Emergência Médica, IP (501356126)","ASCENDI NORTE, SA (504488643)","560,00 €",07-03-2013,28-02-2013,30 dias,"Portugal, Lisboa, Lisboa","Artigo 24.º, n.º 1, alínea e) do Código dos Contratos Públicos","","",,"",,Não aplicável.,Não aplicável.,
Pagamento de passagens em barreiras de portagens á concessionária Brisa.,Ajuste Direto Regime Geral,Aquisição de serviços,"63712200-5, Serviços de exploração de auto-estradas","Instituto Nacional de Emergência Médica, IP (501356126)","BRISA CONCESSÃO RODOVIÁRIA, SA (502790024)","37.800,00 €",07-03-2013,01-03-2013,30 dias,"Portugal, Lisboa, Lisboa","Artigo 24.º, n.º 1, alínea e) do Código dos Contratos Públicos","","",,"",,Não aplicável.,Não aplicável.,
Assistencia tecnica aos geradores para o ano 2013.,Ajuste Direto Regime Geral,Aquisição de serviços,"50532300-6, Serviços de reparação e manutenção de geradores","Instituto Nacional de Emergência Médica, IP (501356126)","TURBOMAR ENERGIA, LDA. (500290946)","6.284,38 €",07-03-2013,05-03-2013,66 dias,"Portugal, Lisboa, Lisboa","Artigo 20.º, n.º 1, alínea a) do Código dos Contratos Públicos","","",,"",,Não aplicável.,Não aplicável.,
"Fornecimento de 2500 sacos de Cloreto de Sodio 0,9% sol. inj. 9mg/ml, saco 500ml.",Ao abrigo de acordo-quadro (art.º 258.º),Aquisição de bens móveis,"33690000-3, Medicamentos vários","Instituto Nacional de Emergência Médica, IP (501356126)","BAXTER, LDA. (503347345)","2.045,75 €",07-03-2013,05-03-2013,30 dias,"Portugal, Lisboa, Lisboa","Artigo 26.º, n.º 1, alínea e) do Código dos Contratos Públicos","","",,"",,Não definido.,Não definido.,
Fronecimento de 300 comprimidos de Paracetamol 500mg e 336 comprimidos de Clopidogrel 75mg.,Ao abrigo de acordo-quadro (art.º 258.º),Aquisição de bens móveis,"33690000-3, Medicamentos vários","Instituto Nacional de Emergência Médica, IP (501356126)","LABESFAL, SA (501169580)","128,52 €",07-03-2013,05-03-2013,30 dias,"Portugal, Lisboa, Lisboa","Artigo 26.º, n.º 1, alínea e) do Código dos Contratos Públicos","","",,"",,Não definido.,Não definido.,
AQUISIÇÃO DE SERVIÇOS DE MEDIA CLIPPING - ANO DE 2013,Ajuste Direto Regime Geral,Aquisição de serviços,"92400000-5, Serviços das agências noticiosas","Instituto Nacional de Emergência Médica, IP (501356126)","CISION, SA (501355383)","4.980,00 €",07-03-2013,05-03-2013,30 dias,"Portugal, Lisboa, Lisboa","Artigo 20.º, n.º 1, alínea a) do Código dos Contratos Públicos","","",,"",,Não aplicável.,Não aplicável.,
"Prestação de serviço de helitransporte de doentes e serviços conexos, composta pela locação de três aeronaves iguais tendo em vista a execução de operações primárias e secundárias de transporte de doentes, compreendendo designadamente, o transporte de equipas de emergência médica, do equipamento clínico e de quaisquer outras pessoas e objetos, que sejam necessários ou convenientes para a realização daquelas operações. A prestação de serviço inclui ainda a disponibilidade de tripulantes pilotos, de combustível e dos serviços de manutenção necessários ao funcionamento das aeronaves e à execução das missões.",Ajuste Direto Regime Geral,Aquisição de serviços,"60424120-3, Aluguer de helicópteros, com tripulação","Instituto Nacional de Emergência Médica, IP (501356126)","INAER HELICOPTER PORTUGAL, LDA. (503546054)","398.003,00 €",05-03-2013,28-02-2013,31 dias,"Portugal, Portugal Continental","Artigo 24.º, n.º 1, alínea c) do Código dos Contratos Públicos","","",,"",,Não aplicável.,Não aplicável.,
