freguesia,acronym,validVotesPercentage,votes,dicofre
A dos Francos,PPD/PSD,44.03,310,100601
A dos Francos,PS,31.82,224,100601
A dos Francos,B.E.,8.1,57,100601
A dos Francos,CDS-PP,5.54,39,100601
A dos Francos,PCP-PEV,3.27,23,100601
A dos Francos,PAN,1.85,13,100601
A dos Francos,CH,0.99,7,100601
A dos Francos,L,0.85,6,100601
A dos Francos,R.I.R.,0.71,5,100601
A dos Francos,PCTP/MRPP,0.57,4,100601
A dos Francos,A,0.43,3,100601
A dos Francos,IL,0.28,2,100601
A dos Francos,MPT,0.28,2,100601
A dos Francos,PDR,0.28,2,100601
A dos Francos,PNR,0.28,2,100601
A dos Francos,PPM,0.28,2,100601
A dos Francos,NC,0.14,1,100601
A dos Francos,PTP,0.14,1,100601
A dos Francos,PURP,0.14,1,100601
A dos Francos,JPP,0,0,100601
A dos Francos,MAS,0,0,100601
