Objeto do Contrato,Tipo de Procedimento,Tipo(s) de Contrato,CPVs,Entidade(s) Adjudicante(s),Entidade(s) Adjudicatária(s),Preço Contratual,Data de Publicação,Data de Celebração do Contrato,Prazo de Execução,Local de Execução,Fundamentação,Data de Fecho do Contrato,Preço Total Efetivo,Causas das Alterações ao Prazo,Causas das Alterações ao Preço,Estado,N.º registo do Acordo Quadro,Descrição do Acordo Quadro,Procedimento Centralizado
"Dasatinib 20MG, 50MG, 100 MG, 140 MG - Aquisição centralizada de medicamentos ao abrigo do Despacho 1571/B de 2016 - Acordo Quadro 2015/6",Ao abrigo de acordo-quadro (art.º 259.º),Aquisição de bens móveis,"33000000-0, Equipamento médico, medicamentos e produtos para cuidados pessoais","Instituto Português de Oncologia do Porto Francisco Gentil, E. P. E. (506362299)","BRISTOL-MYERS SQUIBB FARMACÊUTICA PORTUGUESA, S.A. (500048193)","347.880,71 €",20-09-2017,22-06-2017,180 dias,"Portugal, Porto, Porto",Artigo 259.º do Código dos Contratos Públicos,,,,,,1771819,CP 2015/6 - Acordo quadro para o fornecimento de Medicamentos do Foro Oncológico,FALSE
Bussulfano - Aquisição centralizada de medicamentos ao abrigo do Despacho 1571/B de 2016 - Acordo Quadro 2015/6,Ao abrigo de acordo-quadro (art.º 259.º),Aquisição de bens móveis,"33000000-0, Equipamento médico, medicamentos e produtos para cuidados pessoais","Instituto Português de Oncologia do Porto Francisco Gentil, E. P. E. (506362299)",Fresenius Kabi Pharma Portugal (504293753),"21.068,60 €",20-09-2017,22-06-2017,180 dias,"Portugal, Porto, Porto",Artigo 259.º do Código dos Contratos Públicos,,,,,,1771819,CP 2015/6 - Acordo quadro para o fornecimento de Medicamentos do Foro Oncológico,FALSE
"Enoxaparina 20MG, 40MG, Enoxaparina sódica 60MG, 80MG - Aquisição centralizada de medicamentos ao abrigo do Despacho 1571/B de 2016 - Acordo quadro 2015/6; Acordo quadro 2014/18 ",Ao abrigo de acordo-quadro (art.º 259.º),Aquisição de bens móveis,"33000000-0, Equipamento médico, medicamentos e produtos para cuidados pessoais","Instituto Português de Oncologia do Porto Francisco Gentil, E. P. E. (506362299)","Sanofi - Produtos Farmacêuticos, Lda. (500134960)","113.532,30 €",19-09-2017,29-06-2017,180 dias,"Portugal, Porto, Porto",Artigo 259.º do Código dos Contratos Públicos,,,,,,1771819,CP 2015/6 - Acordo quadro para o fornecimento de Medicamentos do Foro Oncológico,FALSE
Tamoxifeno - Aquisição centralizada de medicamentos ao abrigo do Despacho 1571/B de 2016 - Acordo Quadro 2015/6,Ao abrigo de acordo-quadro (art.º 259.º),Aquisição de bens móveis,"33000000-0, Equipamento médico, medicamentos e produtos para cuidados pessoais","Instituto Português de Oncologia do Porto Francisco Gentil, E. P. E. (506362299)","Farmoz - Sociedade Técnico Medicinal, S.A. (501505334)","33.362,16 €",19-09-2017,31-07-2017,150 dias,"Portugal, Porto, Porto",Artigo 259.º do Código dos Contratos Públicos,,,,,,1771819,CP 2015/6 - Acordo quadro para o fornecimento de Medicamentos do Foro Oncológico,FALSE
