freguesia,acronym,validVotesPercentage,votes,dicofre
Água de Pau,PS,59.18,145,420101
Água de Pau,PPD/PSD,13.06,32,420101
Água de Pau,CDS-PP,6.94,17,420101
Água de Pau,B.E.,6.53,16,420101
Água de Pau,PAN,5.31,13,420101
Água de Pau,PCTP/MRPP,2.04,5,420101
Água de Pau,A,1.63,4,420101
Água de Pau,L,1.22,3,420101
Água de Pau,NC,1.22,3,420101
Água de Pau,PCP-PEV,1.22,3,420101
Água de Pau,PPM.PPV/CDC,0.82,2,420101
Água de Pau,PURP,0.82,2,420101
Água de Pau,IL,0,0,420101
Água de Pau,MAS,0,0,420101
Água de Pau,PDR,0,0,420101
Água de Pau,PNR,0,0,420101
Água de Pau,PTP,0,0,420101
