freguesia,acronym,validVotesPercentage,votes,dicofre
União das freguesias de Canelas e Fermelã,PPD/PSD.CDS-PP,40.87,349,010809
União das freguesias de Canelas e Fermelã,PS,22.95,196,010809
União das freguesias de Canelas e Fermelã,PCP-PEV,12.41,106,010809
União das freguesias de Canelas e Fermelã,MPT,11.12,95,010809
União das freguesias de Canelas e Fermelã,B.E.,3.98,34,010809
União das freguesias de Canelas e Fermelã,PCTP/MRPP,2.58,22,010809
União das freguesias de Canelas e Fermelã,L,1.52,13,010809
União das freguesias de Canelas e Fermelã,PAN,1.41,12,010809
União das freguesias de Canelas e Fermelã,PPM,0.82,7,010809
União das freguesias de Canelas e Fermelã,PND,0.7,6,010809
União das freguesias de Canelas e Fermelã,PTP,0.7,6,010809
União das freguesias de Canelas e Fermelã,MAS,0.35,3,010809
União das freguesias de Canelas e Fermelã,PDA,0.23,2,010809
União das freguesias de Canelas e Fermelã,PPV,0.23,2,010809
União das freguesias de Canelas e Fermelã,PNR,0.12,1,010809
União das freguesias de Canelas e Fermelã,POUS,0,0,010809
