Objeto do Contrato,Tipo de Procedimento,Tipo(s) de Contrato,CPVs,Entidade(s) Adjudicante(s),Entidade(s) Adjudicatária(s),Preço Contratual,Data de Publicação,Data de Celebração do Contrato,Prazo de Execução,Local de Execução,Fundamentação,Data de Fecho do Contrato,Preço Total Efetivo,Causas das Alterações ao Prazo,Causas das Alterações ao Preço,Estado,N.º registo do Acordo Quadro,Descrição do Acordo Quadro,Procedimento Centralizado
Aquisição de Equipamentos e Obras,Concurso público,Empreitadas de obras públicas<br/>Aquisição de bens móveis,"33100000-1, Equipamento médico","Hospital de Santa Maria Maior, E. P. E. (506361381)","A SIMENS HEALTHCARE UNIPESSOAL, LDA (507925173)","305.656,45 €",04-10-2018,07-09-2018,60 dias,"Portugal, Braga, Barcelos","Artigo 19.º, alínea a) do Código dos Contratos Públicos",,,,,,Não aplicável.,Não aplicável.,FALSE
Aquisição de Máquina Embaladora e de Identificação de Medicamentos.,Consulta Prévia,Aquisição de bens móveis,"33100000-1, Equipamento médico","Hospital de Santa Maria Maior, E. P. E. (506361381)","Aviquimica - Importações e Manufacturas, Lda (500039720)","15.850,00 €",04-10-2018,19-04-2018,66 dias,"Portugal, Braga, Barcelos","Artigo 20.º, n.º 1, alínea c) do Código dos Contratos Públicos",,,,,,Não aplicável.,Não aplicável.,FALSE
"Prestação serviços de Assistência e Manutenção dos Equipamentos de Aquecimento, Ventilação e Ar Condicionado.",Concurso público,Aquisição de serviços,"50000000-5, Serviços de reparação e manutenção","Hospital Santa Maria Maior, EPE (506361381)",Such (500900469),"20.403,00 €",03-10-2018,20-03-2018,313 dias,"Portugal, Braga, Barcelos","Artigo 20.º, n.º 1, alínea b) do Código dos Contratos Públicos",,,,,,Não aplicável.,Não aplicável.,FALSE
