freguesia,acronym,validVotesPercentage,votes,dicofre
União das freguesias de Lourinhã e Atalaia,PPD/PSD.CDS-PP,38.85,1255,110812
União das freguesias de Lourinhã e Atalaia,PS,28.73,928,110812
União das freguesias de Lourinhã e Atalaia,MPT,8.89,287,110812
União das freguesias de Lourinhã e Atalaia,PCP-PEV,8.33,269,110812
União das freguesias de Lourinhã e Atalaia,B.E.,5.02,162,110812
União das freguesias de Lourinhã e Atalaia,PAN,2.26,73,110812
União das freguesias de Lourinhã e Atalaia,PCTP/MRPP,1.98,64,110812
União das freguesias de Lourinhã e Atalaia,L,1.76,57,110812
União das freguesias de Lourinhã e Atalaia,PND,0.96,31,110812
União das freguesias de Lourinhã e Atalaia,PNR,0.93,30,110812
União das freguesias de Lourinhã e Atalaia,PTP,0.71,23,110812
União das freguesias de Lourinhã e Atalaia,PPM,0.56,18,110812
União das freguesias de Lourinhã e Atalaia,MAS,0.5,16,110812
União das freguesias de Lourinhã e Atalaia,PPV,0.34,11,110812
União das freguesias de Lourinhã e Atalaia,PDA,0.12,4,110812
União das freguesias de Lourinhã e Atalaia,POUS,0.06,2,110812
