Objeto do Contrato,Tipo de Procedimento,Tipo(s) de Contrato,CPVs,Entidade(s) Adjudicante(s),Entidade(s) Adjudicatária(s),Preço Contratual,Data de Publicação,Data de Celebração do Contrato,Prazo de Execução,Local de Execução,Fundamentação,Data de Fecho do Contrato,Preço Total Efetivo,Causas das Alterações ao Prazo,Causas das Alterações ao Preço,Estado,N.º registo do Acordo Quadro,Descrição do Acordo Quadro,Procedimento Centralizado
"4D0705/2014 CD,S",Ajuste Direto Regime Geral,Aquisição de bens móveis,"30000000-9, Máquinas, equipamento e material de escritório e de informática, excepto mobiliário e pacotes de programas (software)","Centro Hospitalar Barreiro Montijo, E. P. E. (509186998)",ECOSINFOR (504232550),"595,00 €",10-09-2015,13-08-2014,360 dias,"Portugal, Setúbal, Barreiro","Artigo 20.º, n.º 1, alínea a) do Código dos Contratos Públicos",31-12-2014,"595,00 €","","",,Não aplicável.,Não aplicável.,FALSE
4D0705/2014 CD´S,Ajuste Direto Regime Geral,Aquisição de bens móveis,"30000000-9, Máquinas, equipamento e material de escritório e de informática, excepto mobiliário e pacotes de programas (software)","Centro Hospitalar Barreiro Montijo, E. P. E. (509186998)",STAPLES (503789372),"300,20 €",10-09-2015,13-08-2014,360 dias,"Portugal, Setúbal, Barreiro","Artigo 20.º, n.º 1, alínea a) do Código dos Contratos Públicos",31-12-2014,"300,20 €","","",,Não aplicável.,Não aplicável.,FALSE
4SI0019/2014 SERVIÇOS MÉDICOS DE GINECOLOGIA,Ao abrigo de acordo-quadro (art.º 259.º),Aquisição de serviços,"79625000-1, Serviços de fornecimento de pessoal médico","Centro Hospitalar Barreiro Montijo, E. P. E. (509186998)","RANDSTAD CLINICAL-CUIDADOS SAUDE, LDA. (505121247)","2.100,00 €",10-09-2015,06-11-2014,61 dias,"Portugal, Setúbal, Barreiro","Artigo 20.º, n.º 1, alínea b) do Código dos Contratos Públicos",31-12-2014,"2.078,30 €","",Nº horas realizadas inferior ao inicilamente estimado,,454020,"CONCURSO PÚBLICO PARA A CELEBRAÇÃO DE CONTRATOS PÚBLICOS DE APROVISIONAMENTO PARA A ÁREA DA SAÚDE, COM VISTA À PRESTAÇÃO DE SERVIÇOS MÉDICOS ÀS INSTITUIÇÕES E SERVIÇOS DO SERVIÇO NACIONAL DE SAÚDE",FALSE
4EXC0031/2015  DIVERSO MATERIAL P RADIOTERAPIA,Ajuste Direto Regime Geral,Aquisição de bens móveis,"33000000-0, Equipamento médico, medicamentos e produtos para cuidados pessoais","Centro Hospitalar Barreiro Montijo, E. P. E. (509186998)","SOCIEDADE AVANÇO,S.A (500264236)","8.669,80 €",10-09-2015,07-09-2015,90 dias,"Portugal, Setúbal, Barreiro","Artigo 20.º, n.º 1, alínea a) do Código dos Contratos Públicos",07-09-2015,"8.669,80 €","","",,Não aplicável.,Não aplicável.,FALSE
4D0066/2014 TINTA DUPLICADOR,Ajuste Direto Regime Geral,Aquisição de bens móveis,"30000000-9, Máquinas, equipamento e material de escritório e de informática, excepto mobiliário e pacotes de programas (software)","Centro Hospitalar Barreiro Montijo, E. P. E. (509186998)",REPRO MASTER (510308775),"364,10 €",10-09-2015,16-01-2014,360 dias,"Portugal, Setúbal, Barreiro","Artigo 20.º, n.º 1, alínea a) do Código dos Contratos Públicos",31-12-2014,"364,10 €","","",,Não aplicável.,Não aplicável.,FALSE
4D0066/2014 TINTA DUPLICADOR,Ajuste Direto Regime Geral,Aquisição de bens móveis,"30000000-9, Máquinas, equipamento e material de escritório e de informática, excepto mobiliário e pacotes de programas (software)","Centro Hospitalar Barreiro Montijo, E. P. E. (509186998)",RISO (980087783),"526,40 €",10-09-2015,16-01-2014,360 dias,"Portugal, Setúbal, Barreiro","Artigo 20.º, n.º 1, alínea a) do Código dos Contratos Públicos",31-12-2014,"526,40 €","","",,Não aplicável.,Não aplicável.,FALSE
4CPS0002/2014 SERVIÇOS MÉDICOS DE MCDT - ECOGRAFIAS OBSTETRICAS E GINECOLOGICAS,Ajuste Direto Regime Geral,Aquisição de serviços,"85121210-8, Serviços de ginecologia ou obstetrícia","Centro Hospitalar Barreiro Montijo, E. P. E. (509186998)","CLINICA MÉDICA CARO BARJAS, LDA. (507856708)","6.579,25 €",10-09-2015,22-01-2014,365 dias,"Portugal, Setúbal, Barreiro","Artigo 27.º, n.º 1, alínea a) do Código dos Contratos Públicos",28-02-2014,"1.186,03 €",Não chegou a ser assinado,Só houve prestação de serviços por 2 meses,,Não aplicável.,Não aplicável.,FALSE
40061/2015 MONITORES MULTIPARAMETROS,Ajuste Direto Regime Geral,Aquisição de bens móveis,"33000000-0, Equipamento médico, medicamentos e produtos para cuidados pessoais","Centro Hospitalar Barreiro Montijo, E. P. E. (509186998)",CLINIFAR (503281115),"20.999,94 €",07-09-2015,28-07-2015,20 dias,"Portugal, Setúbal, Barreiro","Artigo 20.º, n.º 1, alínea a) do Código dos Contratos Públicos",17-08-2015,"20.999,94 €","","",,Não aplicável.,Não aplicável.,FALSE
4EXC0026/2015 -  AMPOLA P TC,Ajuste Direto Regime Geral,Aquisição de bens móveis,"33000000-0, Equipamento médico, medicamentos e produtos para cuidados pessoais","Centro Hospitalar Barreiro Montijo, E. P. E. (509186998)",SIEMENS SA (500247480),"60.000,00 €",07-09-2015,19-03-2015,90 dias,"Portugal, Setúbal, Barreiro","Artigo 20.º, n.º 1, alínea a) do Código dos Contratos Públicos",01-09-2015,"60.000,00 €","","",,Não aplicável.,Não aplicável.,FALSE
