freguesia,acronym,validVotesPercentage,votes,dicofre
Beringel,PS,39.95,149,020503
Beringel,PCP-PEV,31.9,119,020503
Beringel,PPD/PSD,9.38,35,020503
Beringel,B.E.,6.43,24,020503
Beringel,CDS-PP,4.56,17,020503
Beringel,PCTP/MRPP,2.14,8,020503
Beringel,A,1.61,6,020503
Beringel,PAN,1.61,6,020503
Beringel,L,1.07,4,020503
Beringel,PPM.PPV/CDC,0.54,2,020503
Beringel,MAS,0.27,1,020503
Beringel,NC,0.27,1,020503
Beringel,PURP,0.27,1,020503
Beringel,IL,0,0,020503
Beringel,PDR,0,0,020503
Beringel,PNR,0,0,020503
Beringel,PTP,0,0,020503
