Objeto do Contrato,Tipo de Procedimento,Tipo(s) de Contrato,CPVs,Entidade(s) Adjudicante(s),Entidade(s) Adjudicatária(s),Preço Contratual,Data de Publicação,Data de Celebração do Contrato,Prazo de Execução,Local de Execução,Fundamentação,Data de Fecho do Contrato,Preço Total Efetivo,Causas das Alterações ao Prazo,Causas das Alterações ao Preço,Estado,N.º registo do Acordo Quadro,Descrição do Acordo Quadro,Procedimento Centralizado
41/3441/2015 Medicamentos Fluconazol,Ao abrigo de acordo-quadro (art.º 259.º),Aquisição de bens móveis,"33690000-3, Medicamentos vários","Centro Hospitalar do Algarve, E. P. E. (510745997)","Fresenius Kabi Pharma Portugal, Lda. (504293753)","686,00 €",11-12-2015,01-12-2015,28 dias,"Portugal, Faro, Faro",Artigo 259.º do Código dos Contratos Públicos,,,,,,1422736,CP 2015/41 - ACORDO QUADRO PARA FORNECIMENTO DE MEDICAMENTOS ANTI-INFECIOSOS: ANTIVÍRICOS E ANTIFÚNGICOS ÀS INSTITUIÇÕES E SERVIÇOS DO SERVIÇO NACIONAL DE SAÚDE,FALSE
61/3259/2015 Elvitegravir+Cobicistate+Emtricitabina+Tenofovir 150mg+150mg+200 mg,Ajuste Direto Regime Geral,Aquisição de bens móveis,"33690000-3, Medicamentos vários","Centro Hospitalar do Algarve, E. P. E. (510745997)","Gilead Sciences, Lda. (503604704)","23.687,10 €",11-12-2015,04-12-2015,27 dias,"Portugal, Faro, Faro","Artigo 24.º, n.º 1, alínea e) do Código dos Contratos Públicos",,,,,,Não aplicável.,Não aplicável.,FALSE
41/3437/2015 Medicamentos Midazolam 50mg/10 ml e Zolpidem 10 mg,Ao abrigo de acordo-quadro (art.º 259.º),Aquisição de bens móveis,"33690000-3, Medicamentos vários","Centro Hospitalar do Algarve, E. P. E. (510745997)","D.L.A FARMACEUTICA (503894427), Accord Healthcare, Unipessoal Lda (508622263)","707,97 €",11-12-2015,01-12-2015,28 dias,"Portugal, Faro, Faro",Artigo 259.º do Código dos Contratos Públicos,,,,,,1179911,"CONCURSO PÚBLICO PARA A CELEBRAÇÃO DE CONTRATOS PÚBLICOS DE APROVISIONAMENTO PARA A ÁREA DA SAÚDE, MEDICAMENTOS DO SISTEMA NERVOSO CEREBROSPINAL, EXCETO: ANESTÉSICOS, RELAXANTES MUSCULARES, ANALGÉSICOS, ANTIPIRÉTICOS, ANTIDEPRESSORES E ANTIPSICÓTICOS, ÀS INSTITUIÇÕES E SERVIÇOS DO SERVIÇO NACIONAL DE SAÚDE",FALSE
41/34036/2015 Medicamentos Lipidos 200mg/ml e A.A. 5.7g N +Glucose 80g+lipidos 50g,Ao abrigo de acordo-quadro (art.º 259.º),Aquisição de bens móveis,"33690000-3, Medicamentos vários","Centro Hospitalar do Algarve, E. P. E. (510745997)","B. Braun Medical, Lda. (501506543)","10.307,00 €",11-12-2015,02-12-2015,29 dias,"Portugal, Faro, Faro",Artigo 259.º do Código dos Contratos Públicos,,,,,,1377429,Acordo Quadro para fornecimento de medicamentos para Nutrição Parentérica às Instituições e Serviços do Serviço Nacional de Saúde,FALSE
41/3374/2015 Medicamento Folinato de cálcio 300mg/30ml sol inj Fr IM IV,Ao abrigo de acordo-quadro (art.º 259.º),Aquisição de bens móveis,"33690000-3, Medicamentos vários","Centro Hospitalar do Algarve, E. P. E. (510745997)","Teva Pharma - Produtos Farmacêuticos, Lda (507045491)","3.850,00 €",11-12-2015,25-11-2015,36 dias,"Portugal, Faro, Faro",Artigo 259.º do Código dos Contratos Públicos,,,,,,1338581,"Acordo quadro para fornecimento de Medicação antialérgica, medicamentos usados no tratamento de intoxicações, vitaminas e sais minerais e grupo 20.9 - outros produtos às instituições e serviços do serviço nacional de saúde",FALSE
41/3340/2015 Medicamentos Paclitaxel,Ao abrigo de acordo-quadro (art.º 259.º),Locação de bens móveis,"33690000-3, Medicamentos vários","Centro Hospitalar do Algarve, E. P. E. (510745997)","Fresenius Kabi Pharma Portugal, Lda. (504293753)","2.505,60 €",11-12-2015,12-11-2015,49 dias,"Portugal, Faro, Faro",Artigo 259.º do Código dos Contratos Públicos,,,,,,1119467,"CONCURSO PÚBLICO PARA A CELEBRAÇÃO DE CONTRATOS PÚBLICOS DE APROVISIONAMENTO PARA A ÁREA DA SAÚDE, COM VISTA AO FORNECIMENTO DE MEDICAMENTOS DO FORO ONCOLÓGICO, ÀS INSTITUIÇÕES E SERVIÇOS DO SERVIÇO NACIONAL DE SAÚDE",FALSE
Aquisição de Penso Adesivo e Compressa não Tecido Esteril,Ao abrigo de acordo-quadro (art.º 259.º),Aquisição de bens móveis,"33140000-3, Material médico de consumo","Centro Hospitalar do Algarve, E. P. E. (510745997)",ALBINO DIAS ANDRADE LDA (500013810),"810,00 €",10-12-2015,09-12-2015,23 dias,"Portugal, Faro, Portimão<BR/>Portugal, Faro, Lagos<BR/>Portugal, Faro, Faro","Artigo 20.º, n.º 1, alínea b) do Código dos Contratos Públicos",,,,,,534953,"CONCURSO PÚBLICO PARA A CELEBRAÇÃO DE CONTRATOS PÚBLICOS DE APROVISIONAMENTO PARA A ÁREA DA SAÚDE, COM VISTA AO FORNECIMENTO DE MATERIAL DE PENSO TRADICIONAL/CLASSICO - PARTE 1 - ÀS INSTITUIÇÕES E SERVIÇOS DO SERVIÇO NACIONAL DE SAÚDE  ",FALSE
72/3561/2015 - AQUISIÇÃO DE MATERIAL DE CONSUMO CLINICO,Ajuste Direto Regime Geral,Aquisição de bens móveis,"33140000-3, Material médico de consumo","Centro Hospitalar do Algarve, E. P. E. (510745997)","HELDER GONÇALVES Assistência Técnica de Equipamentos LDA,  (503855421)","171,00 €",10-12-2015,03-12-2015,28 dias,"Portugal, Faro, Lagos<BR/>Portugal, Faro, Portimão<BR/>Portugal, Faro, Faro","Artigo 20.º, n.º 1, alínea a) do Código dos Contratos Públicos",,,,,,Não aplicável.,Não aplicável.,FALSE
72/3561/2015 - AQUISIÇÃO DE MATERIAL DE CONSUMO CLINICO,Ajuste Direto Regime Geral,Aquisição de bens móveis,"33140000-3, Material médico de consumo","Centro Hospitalar do Algarve, E. P. E. (510745997)","MEDTRONIC PORTUGAL, LDA. (504223933)","332,00 €",10-12-2015,03-12-2015,28 dias,"Portugal, Faro, Faro<BR/>Portugal, Faro, Lagos<BR/>Portugal, Faro, Portimão","Artigo 20.º, n.º 1, alínea a) do Código dos Contratos Públicos",,,,,,Não aplicável.,Não aplicável.,FALSE
72/3561/2015 - AQUISIÇÃO DE MATERIAL DE CONSUMO CLINICO,Ajuste Direto Regime Geral,Aquisição de bens móveis,"33140000-3, Material médico de consumo","Centro Hospitalar do Algarve, E. P. E. (510745997)","COVIDIEN PORTUGAL - PRODUTOS  DE SAUDE, UNIPESSOAL, LDA. (503413410)","1.340,00 €",10-12-2015,03-12-2015,28 dias,"Portugal, Faro, Portimão<BR/>Portugal, Faro, Lagos<BR/>Portugal, Faro, Faro","Artigo 20.º, n.º 1, alínea a) do Código dos Contratos Públicos",,,,,,Não aplicável.,Não aplicável.,FALSE
72/3561/2015 - AQUISIÇÃO DE MATERIAL DE CONSUMO CLINICO,Ajuste Direto Regime Geral,Aquisição de bens móveis,"33140000-3, Material médico de consumo","Centro Hospitalar do Algarve, E. P. E. (510745997)","BIOSONDA,LDA. (501463313)","530,00 €",10-12-2015,03-12-2015,28 dias,"Portugal, Faro, Portimão<BR/>Portugal, Faro, Lagos<BR/>Portugal, Faro, Faro","Artigo 20.º, n.º 1, alínea a) do Código dos Contratos Públicos",,,,,,Não aplicável.,Não aplicável.,FALSE
72/3561/2015 - AQUISIÇÃO DE MATERIAL DE CONSUMO CLINICO,Ajuste Direto Regime Geral,Aquisição de bens móveis,"33140000-3, Material médico de consumo","Centro Hospitalar do Algarve, E. P. E. (510745997)","VYGON (PORTUGAL),LDA. (503232785)","386,58 €",10-12-2015,03-12-2015,28 dias,"Portugal, Faro, Lagos<BR/>Portugal, Faro, Faro<BR/>Portugal, Faro, Portimão","Artigo 20.º, n.º 1, alínea a) do Código dos Contratos Públicos",,,,,,Não aplicável.,Não aplicável.,FALSE
72/3561/2015 - AQUISIÇÃO DE MATERIAL DE CONSUMO CLINICO,Ajuste Direto Regime Geral,Aquisição de bens móveis,"33140000-3, Material médico de consumo","Centro Hospitalar do Algarve, E. P. E. (510745997)",ANASTACIO SALDANHA UNIPESSOAL (505804441),"224,70 €",10-12-2015,03-12-2015,28 dias,"Portugal, Faro, Lagos<BR/>Portugal, Faro, Portimão<BR/>Portugal, Faro, Faro","Artigo 20.º, n.º 1, alínea a) do Código dos Contratos Públicos",,,,,,Não aplicável.,Não aplicável.,FALSE
72/3561/2015 - AQUISIÇÃO DE MATERIAL DE CONSUMO CLINICO,Ajuste Direto Regime Geral,Aquisição de bens móveis,"33140000-3, Material médico de consumo","Centro Hospitalar do Algarve, E. P. E. (510745997)","SARSTEDT TECNOL.DE LABORATORIO, LDA (503019461)","172,00 €",10-12-2015,03-12-2015,28 dias,"Portugal, Faro, Lagos<BR/>Portugal, Faro, Portimão<BR/>Portugal, Faro, Faro","Artigo 20.º, n.º 1, alínea a) do Código dos Contratos Públicos",,,,,,Não aplicável.,Não aplicável.,FALSE
72/3561/2015 - AQUISIÇÃO DE MATERIAL DE CONSUMO CLINICO,Ajuste Direto Regime Geral,Aquisição de bens móveis,"33140000-3, Material médico de consumo","Centro Hospitalar do Algarve, E. P. E. (510745997)",PMH-PROD.MEDICO-HOSPITALARES (502376899),"87,00 €",10-12-2015,03-12-2015,28 dias,"Portugal, Faro, Lagos<BR/>Portugal, Faro, Portimão<BR/>Portugal, Faro, Faro","Artigo 20.º, n.º 1, alínea a) do Código dos Contratos Públicos",,,,,,Não aplicável.,Não aplicável.,FALSE
72/3561/2015 - AQUISIÇÃO DE MATERIAL DE CONSUMO CLINICO,Ajuste Direto Regime Geral,Aquisição de bens móveis,"33140000-3, Material médico de consumo","Centro Hospitalar do Algarve, E. P. E. (510745997)","B. Braun Medical, Lda. (501506543)","235,00 €",10-12-2015,03-12-2015,28 dias,"Portugal, Faro, Faro<BR/>Portugal, Faro, Lagos<BR/>Portugal, Faro, Portimão","Artigo 20.º, n.º 1, alínea a) do Código dos Contratos Públicos",,,,,,Não aplicável.,Não aplicável.,FALSE
72/3561/2015 - AQUISIÇÃO DE MATERIAL DE CONSUMO CLINICO,Ajuste Direto Regime Geral,Aquisição de bens móveis,"33140000-3, Material médico de consumo","Centro Hospitalar do Algarve, E. P. E. (510745997)","LINEAMEDICA,S.A. (505148676)","294,56 €",10-12-2015,03-12-2015,28 dias,"Portugal, Faro, Faro<BR/>Portugal, Faro, Lagos<BR/>Portugal, Faro, Portimão","Artigo 20.º, n.º 1, alínea a) do Código dos Contratos Públicos",,,,,,Não aplicável.,Não aplicável.,FALSE
72/3561/2015 - AQUISIÇÃO DE MATERIAL DE CONSUMO CLINICO,Ajuste Direto Regime Geral,Aquisição de bens móveis,"33140000-3, Material médico de consumo","Centro Hospitalar do Algarve, E. P. E. (510745997)",BIAL -  PORTELA & Cª S.A. (500220913),"81,75 €",10-12-2015,03-12-2015,28 dias,"Portugal, Faro, Faro<BR/>Portugal, Faro, Lagos<BR/>Portugal, Faro, Portimão","Artigo 20.º, n.º 1, alínea a) do Código dos Contratos Públicos",,,,,,Não aplicável.,Não aplicável.,FALSE
72/3561/2015 - AQUISIÇÃO DE MATERIAL DE CONSUMO CLINICO,Ajuste Direto Regime Geral,Aquisição de bens móveis,"33140000-3, Material médico de consumo","Centro Hospitalar do Algarve, E. P. E. (510745997)",JMV-PRODUTOS HOSPITALARES (501887148),"155,00 €",10-12-2015,03-12-2015,28 dias,"Portugal, Faro, Lagos<BR/>Portugal, Faro, Portimão<BR/>Portugal, Faro, Faro","Artigo 20.º, n.º 1, alínea a) do Código dos Contratos Públicos",,,,,,Não aplicável.,Não aplicável.,FALSE
72/3561/2015 - AQUISIÇÃO DE MATERIAL DE CONSUMO CLINICO,Ajuste Direto Regime Geral,Aquisição de bens móveis,"33140000-3, Material médico de consumo","Centro Hospitalar do Algarve, E. P. E. (510745997)","INTERSURGICAL PORTUGAL,LDA. (503480045)","157,50 €",10-12-2015,03-12-2015,28 dias,"Portugal, Faro, Portimão<BR/>Portugal, Faro, Lagos<BR/>Portugal, Faro, Faro","Artigo 20.º, n.º 1, alínea a) do Código dos Contratos Públicos",,,,,,Não aplicável.,Não aplicável.,FALSE
72/3561/2015 - AQUISIÇÃO DE MATERIAL DE CONSUMO CLINICO,Ajuste Direto Regime Geral,Aquisição de bens móveis,"33140000-3, Material médico de consumo","Centro Hospitalar do Algarve, E. P. E. (510745997)","HR  HOSPITALAR,Unipessoal, LDA (501895558)","2,20 €",10-12-2015,03-12-2015,28 dias,"Portugal, Faro, Portimão<BR/>Portugal, Faro, Lagos<BR/>Portugal, Faro, Faro","Artigo 20.º, n.º 1, alínea a) do Código dos Contratos Públicos",,,,,,Não aplicável.,Não aplicável.,FALSE
72/3561/2015 - AQUISIÇÃO DE MATERIAL DE CONSUMO CLINICO,Ajuste Direto Regime Geral,Aquisição de bens móveis,"33140000-3, Material médico de consumo","Centro Hospitalar do Algarve, E. P. E. (510745997)",FARMA2 IMP.EXP.MATERIAL CLINIC (502636041),"160,00 €",10-12-2015,03-12-2015,28 dias,"Portugal, Faro, Faro<BR/>Portugal, Faro, Lagos<BR/>Portugal, Faro, Portimão","Artigo 20.º, n.º 1, alínea a) do Código dos Contratos Públicos",,,,,,Não aplicável.,Não aplicável.,FALSE
72/3561/2015 - AQUISIÇÃO DE MATERIAL DE CONSUMO CLINICO,Ajuste Direto Regime Geral,Aquisição de bens móveis,"33140000-3, Material médico de consumo","Centro Hospitalar do Algarve, E. P. E. (510745997)",EPJMEDICA-ARTIGOS MED.HOSPITAL (506820513),"53,50 €",10-12-2015,03-12-2015,28 dias,"Portugal, Faro, Faro<BR/>Portugal, Faro, Portimão","Artigo 20.º, n.º 1, alínea a) do Código dos Contratos Públicos",,,,,,Não aplicável.,Não aplicável.,FALSE
72/3561/2015 - AQUISIÇÃO DE MATERIAL DE CONSUMO CLINICO,Ajuste Direto Regime Geral,Aquisição de bens móveis,"33140000-3, Material médico de consumo","Centro Hospitalar do Algarve, E. P. E. (510745997)",ENDOTÉCNICA - Soluções Hospitalares  (503818348),"1.050,00 €",10-12-2015,03-12-2015,28 dias,"Portugal, Faro, Faro<BR/>Portugal, Faro, Portimão<BR/>Portugal, Faro, Lagos","Artigo 20.º, n.º 1, alínea a) do Código dos Contratos Públicos",,,,,,Não aplicável.,Não aplicável.,FALSE
72/3561/2015 - AQUISIÇÃO DE MATERIAL DE CONSUMO CLINICO,Ajuste Direto Regime Geral,Aquisição de bens móveis,"33140000-3, Material médico de consumo","Centro Hospitalar do Algarve, E. P. E. (510745997)",CATETER-PROD.MEDICOS HOSP.LDA. (502914319),"539,04 €",10-12-2015,03-12-2015,28 dias,"Portugal, Faro, Lagos<BR/>Portugal, Faro, Faro<BR/>Portugal, Faro, Portimão","Artigo 20.º, n.º 1, alínea a) do Código dos Contratos Públicos",,,,,,Não aplicável.,Não aplicável.,FALSE
72/3561/2015 - AQUISIÇÃO DE MATERIAL DE CONSUMO CLINICO,Ajuste Direto Regime Geral,Aquisição de bens móveis,"33140000-3, Material médico de consumo","Centro Hospitalar do Algarve, E. P. E. (510745997)",ANDITEC. (502551097),"200,00 €",10-12-2015,03-12-2015,28 dias,"Portugal, Faro, Portimão<BR/>Portugal, Faro, Faro<BR/>Portugal, Faro, Lagos","Artigo 20.º, n.º 1, alínea a) do Código dos Contratos Públicos",,,,,,Não aplicável.,Não aplicável.,FALSE
72/3561/2015 - AQUISIÇÃO DE MATERIAL DE CONSUMO CLINICO,Ajuste Direto Regime Geral,Aquisição de bens móveis,"33140000-3, Material médico de consumo","Centro Hospitalar do Algarve, E. P. E. (510745997)","A.MARTINS & FERNANDES,SA (501172114)","70,00 €",10-12-2015,03-12-2015,28 dias,"Portugal, Faro, Portimão<BR/>Portugal, Faro, Faro<BR/>Portugal, Faro, Lagos","Artigo 20.º, n.º 1, alínea a) do Código dos Contratos Públicos",,,,,,Não aplicável.,Não aplicável.,FALSE
Proc.58/3492/2015- Fornecimento de materiais para reparação de Chiller e Bomba Circuladora,Ajuste Direto Regime Geral,Aquisição de serviços,"50530000-9, Serviços de reparação e manutenção de máquinas","Centro Hospitalar do Algarve, E. P. E. (510745997)",Tecnospie (500205698),"4.373,69 €",10-12-2015,11-11-2015,60 dias,"Portugal, Faro, Faro","Artigo 20.º, n.º 1, alínea a) do Código dos Contratos Públicos",,,,,,Não aplicável.,Não aplicável.,FALSE
Proc. 67/3490/2015 - Reparação de Tesoura Microcirurgia,Ajuste Direto Regime Geral,Aquisição de serviços,"50422000-9, Serviços de reparação e manutenção de equipamento cirúrgico","Centro Hospitalar do Algarve, E. P. E. (510745997)","B.Braun Medical,Lda (501506543)","198,70 €",10-12-2015,11-11-2015,60 dias,"Portugal, Faro, Faro","Artigo 24.º, n.º 1, alínea e) do Código dos Contratos Públicos",,,,,,Não aplicável.,Não aplicável.,FALSE
Proc. 77/3481/2015- Reparação dos equipamentos de segurança contra incendios,Ajuste Direto Regime Geral,Aquisição de serviços,"50610000-4, Serviços de reparação e manutenção de equipamento de segurança","Centro Hospitalar do Algarve, E. P. E. (510745997)",Interfire (509033237),"6.896,50 €",10-12-2015,16-11-2015,60 dias,"Portugal, Faro, Faro","Artigo 20.º, n.º 1, alínea a) do Código dos Contratos Públicos",,,,,,Não aplicável.,Não aplicável.,FALSE
72/3598/2015 - AQUISIÇÃO DE MATERIAL CONSUMO CLINICOQ,Ajuste Direto Regime Geral,Aquisição de bens móveis,"33140000-3, Material médico de consumo","Centro Hospitalar do Algarve, E. P. E. (510745997)","COVIDIEN PORTUGAL - PRODUTOS  DE SAUDE, UNIPESSOAL, LDA. (503413410)","1.788,80 €",10-12-2015,02-12-2015,29 dias,"Portugal, Faro, Portimão<BR/>Portugal, Faro, Faro<BR/>Portugal, Faro, Lagos","Artigo 20.º, n.º 1, alínea a) do Código dos Contratos Públicos",,,,,,Não aplicável.,Não aplicável.,FALSE
72/3598/2015 - AQUISIÇÃO DE MATERIAL CONSUMO CLINICOQ,Ajuste Direto Regime Geral,Aquisição de bens móveis,"33140000-3, Material médico de consumo","Centro Hospitalar do Algarve, E. P. E. (510745997)",ANASTACIO SALDANHA UNIPESSOAL (505804441),"10,80 €",10-12-2015,02-12-2015,29 dias,"Portugal, Faro, Faro<BR/>Portugal, Faro, Portimão<BR/>Portugal, Faro, Lagos","Artigo 20.º, n.º 1, alínea a) do Código dos Contratos Públicos",,,,,,Não aplicável.,Não aplicável.,FALSE
72/3598/2015 - AQUISIÇÃO DE MATERIAL CONSUMO CLINICOQ,Ajuste Direto Regime Geral,Aquisição de bens móveis,"33140000-3, Material médico de consumo","Centro Hospitalar do Algarve, E. P. E. (510745997)","B. Braun Medical, Lda. (501506543)","271,80 €",10-12-2015,02-12-2015,29 dias,"Portugal, Faro, Lagos<BR/>Portugal, Faro, Faro<BR/>Portugal, Faro, Portimão","Artigo 20.º, n.º 1, alínea a) do Código dos Contratos Públicos",,,,,,Não aplicável.,Não aplicável.,FALSE
72/3598/2015 - AQUISIÇÃO DE MATERIAL CONSUMO CLINICOQ,Ajuste Direto Regime Geral,Aquisição de bens móveis,"33140000-3, Material médico de consumo","Centro Hospitalar do Algarve, E. P. E. (510745997)","HR  HOSPITALAR,Unipessoal, LDA (501895558)","252,00 €",10-12-2015,02-12-2015,29 dias,"Portugal, Faro, Faro<BR/>Portugal, Faro, Portimão<BR/>Portugal, Faro, Lagos","Artigo 20.º, n.º 1, alínea a) do Código dos Contratos Públicos",,,,,,Não aplicável.,Não aplicável.,FALSE
Proc. 77/3474/2015 - Reparação de Sistema de Detecção de Incendios-Unid.Faro,Ajuste Direto Regime Geral,Aquisição de serviços,"50532000-3, Serviços de reparação e manutenção de máquinas e aparelhos eléctricos e de equipamento afim","Centro Hospitalar do Algarve, E. P. E. (510745997)","Gunnebo Portugal,SA (500649430)","10.000,00 €",10-12-2015,11-11-2015,60 dias,"Portugal, Faro, Faro","Artigo 20.º, n.º 1, alínea a) do Código dos Contratos Públicos",,,,,,Não aplicável.,Não aplicável.,FALSE
Proc. 67/3460/2015-Aquisição p/ substituição de Pinça de Calculos de Urologia,Ajuste Direto Regime Geral,Aquisição de bens móveis,"33125000-2, Material para exploração urológica","Centro Hospitalar do Algarve, E. P. E. (510745997)","Teprel,Lda (502262184)","458,10 €",10-12-2015,12-11-2015,30 dias,"Portugal, Faro, Portimão","Artigo 24.º, n.º 1, alínea e) do Código dos Contratos Públicos",,,,,,Não aplicável.,Não aplicável.,FALSE
72/3575/2015 - Aquisição de Material consumo clínico Rub. 23,Ajuste Direto Regime Geral,Aquisição de bens móveis,"33140000-3, Material médico de consumo","Centro Hospitalar do Algarve, E. P. E. (510745997)","OFTALDATA, LDA. (504887459)","82,80 €",10-12-2015,02-12-2015,29 dias,"Portugal, Faro, Portimão<BR/>Portugal, Faro, Faro","Artigo 20.º, n.º 1, alínea a) do Código dos Contratos Públicos",,,,,,Não aplicável.,Não aplicável.,FALSE
72/3575/2015 - Aquisição de Material consumo clínico Rub. 23,Ajuste Direto Regime Geral,Aquisição de bens móveis,"33140000-3, Material médico de consumo","Centro Hospitalar do Algarve, E. P. E. (510745997)","MEDTRONIC PORTUGAL, LDA. (504223933)","61,50 €",10-12-2015,02-12-2015,29 dias,"Portugal, Faro, Lagos<BR/>Portugal, Faro, Faro<BR/>Portugal, Faro, Portimão","Artigo 20.º, n.º 1, alínea a) do Código dos Contratos Públicos",,,,,,Não aplicável.,Não aplicável.,FALSE
72/3575/2015 - Aquisição de Material consumo clínico Rub. 23,Ajuste Direto Regime Geral,Aquisição de bens móveis,"33140000-3, Material médico de consumo","Centro Hospitalar do Algarve, E. P. E. (510745997)","COVIDIEN PORTUGAL - PRODUTOS  DE SAUDE, UNIPESSOAL, LDA. (503413410)","531,50 €",10-12-2015,02-12-2015,29 dias,"Portugal, Faro, Portimão<BR/>Portugal, Faro, Faro<BR/>Portugal, Faro, Lagos","Artigo 20.º, n.º 1, alínea a) do Código dos Contratos Públicos",,,,,,Não aplicável.,Não aplicável.,FALSE
72/3575/2015 - Aquisição de Material consumo clínico Rub. 23,Ajuste Direto Regime Geral,Aquisição de bens móveis,"33140000-3, Material médico de consumo","Centro Hospitalar do Algarve, E. P. E. (510745997)",ANASTACIO SALDANHA UNIPESSOAL (505804441),"309,30 €",10-12-2015,02-12-2015,29 dias,"Portugal, Faro, Faro<BR/>Portugal, Faro, Lagos<BR/>Portugal, Faro, Portimão","Artigo 20.º, n.º 1, alínea a) do Código dos Contratos Públicos",,,,,,Não aplicável.,Não aplicável.,FALSE
72/3575/2015 - Aquisição de Material consumo clínico Rub. 23,Ajuste Direto Regime Geral,Aquisição de bens móveis,"33140000-3, Material médico de consumo","Centro Hospitalar do Algarve, E. P. E. (510745997)","VYGON (PORTUGAL),LDA. (503232785)","497,70 €",10-12-2015,02-12-2015,29 dias,"Portugal, Faro, Faro<BR/>Portugal, Faro, Portimão<BR/>Portugal, Faro, Lagos","Artigo 20.º, n.º 1, alínea a) do Código dos Contratos Públicos",,,,,,Não aplicável.,Não aplicável.,FALSE
72/3575/2015 - Aquisição de Material consumo clínico Rub. 23,Ajuste Direto Regime Geral,Aquisição de bens móveis,"33140000-3, Material médico de consumo","Centro Hospitalar do Algarve, E. P. E. (510745997)",GRUPO VITALINO SA. (513083162),"79,20 €",10-12-2015,02-12-2015,29 dias,"Portugal, Faro, Lagos<BR/>Portugal, Faro, Portimão<BR/>Portugal, Faro, Faro","Artigo 20.º, n.º 1, alínea a) do Código dos Contratos Públicos",,,,,,Não aplicável.,Não aplicável.,FALSE
72/3575/2015 - Aquisição de Material consumo clínico Rub. 23,Ajuste Direto Regime Geral,Aquisição de bens móveis,"33140000-3, Material médico de consumo","Centro Hospitalar do Algarve, E. P. E. (510745997)","SMITHS MEDICAL(PORTUGAL),LDA. (507445937)","131,54 €",10-12-2015,02-12-2015,29 dias,"Portugal, Faro, Faro<BR/>Portugal, Faro, Lagos<BR/>Portugal, Faro, Portimão","Artigo 20.º, n.º 1, alínea a) do Código dos Contratos Públicos",,,,,,Não aplicável.,Não aplicável.,FALSE
72/3575/2015 - Aquisição de Material consumo clínico Rub. 23,Ajuste Direto Regime Geral,Aquisição de bens móveis,"33140000-3, Material médico de consumo","Centro Hospitalar do Algarve, E. P. E. (510745997)","SPCARE, Especialidades Farmacêuticas, Ldª (508284872)","518,00 €",10-12-2015,02-12-2015,29 dias,"Portugal, Faro, Faro<BR/>Portugal, Faro, Portimão<BR/>Portugal, Faro, Lagos","Artigo 20.º, n.º 1, alínea a) do Código dos Contratos Públicos",,,,,,Não aplicável.,Não aplicável.,FALSE
72/3575/2015 - Aquisição de Material consumo clínico Rub. 23,Ajuste Direto Regime Geral,Aquisição de bens móveis,"33140000-3, Material médico de consumo","Centro Hospitalar do Algarve, E. P. E. (510745997)",PMH-PROD.MEDICO-HOSPITALARES (502376899),"1.606,50 €",10-12-2015,02-12-2015,29 dias,"Portugal, Faro, Portimão<BR/>Portugal, Faro, Lagos<BR/>Portugal, Faro, Faro","Artigo 20.º, n.º 1, alínea a) do Código dos Contratos Públicos",,,,,,Não aplicável.,Não aplicável.,FALSE
72/3575/2015 - Aquisição de Material consumo clínico Rub. 23,Ajuste Direto Regime Geral,Aquisição de bens móveis,"33140000-3, Material médico de consumo","Centro Hospitalar do Algarve, E. P. E. (510745997)","COLOPLAST PORTUGAL, SOCIEDADE UNIPESSOAL LDA. (503989037)","655,42 €",10-12-2015,02-12-2015,29 dias,"Portugal, Faro, Faro<BR/>Portugal, Faro, Lagos<BR/>Portugal, Faro, Portimão","Artigo 20.º, n.º 1, alínea a) do Código dos Contratos Públicos",,,,,,Não aplicável.,Não aplicável.,FALSE
72/3575/2015 - Aquisição de Material consumo clínico Rub. 23,Ajuste Direto Regime Geral,Aquisição de bens móveis,"33140000-3, Material médico de consumo","Centro Hospitalar do Algarve, E. P. E. (510745997)","MUNDINTER,S.A. (500199906)","15,78 €",10-12-2015,02-12-2015,29 dias,"Portugal, Faro, Lagos<BR/>Portugal, Faro, Portimão<BR/>Portugal, Faro, Faro","Artigo 20.º, n.º 1, alínea a) do Código dos Contratos Públicos",,,,,,Não aplicável.,Não aplicável.,FALSE
72/3575/2015 - Aquisição de Material consumo clínico Rub. 23,Ajuste Direto Regime Geral,Aquisição de bens móveis,"33140000-3, Material médico de consumo","Centro Hospitalar do Algarve, E. P. E. (510745997)","GRIFOLS PORTUGAL, LDA. (502041285)","280,00 €",10-12-2015,02-12-2015,29 dias,"Portugal, Faro, Portimão<BR/>Portugal, Faro, Lagos<BR/>Portugal, Faro, Faro","Artigo 20.º, n.º 1, alínea a) do Código dos Contratos Públicos",,,,,,Não aplicável.,Não aplicável.,FALSE
72/3575/2015 - Aquisição de Material consumo clínico Rub. 23,Ajuste Direto Regime Geral,Aquisição de bens móveis,"33140000-3, Material médico de consumo","Centro Hospitalar do Algarve, E. P. E. (510745997)","MEDINFAR - SEROLÓGICO PRODUTOS E EQUIPAMENTOS, S.A. (501197052)","750,00 €",10-12-2015,02-12-2015,29 dias,"Portugal, Faro, Faro<BR/>Portugal, Faro, Portimão","Artigo 20.º, n.º 1, alínea a) do Código dos Contratos Públicos",,,,,,Não aplicável.,Não aplicável.,FALSE
72/3575/2015 - Aquisição de Material consumo clínico Rub. 23,Ajuste Direto Regime Geral,Aquisição de bens móveis,"33140000-3, Material médico de consumo","Centro Hospitalar do Algarve, E. P. E. (510745997)","B. Braun Medical, Lda. (501506543)","857,60 €",10-12-2015,02-12-2015,29 dias,"Portugal, Faro, Lagos<BR/>Portugal, Faro, Portimão<BR/>Portugal, Faro, Faro","Artigo 20.º, n.º 1, alínea a) do Código dos Contratos Públicos",,,,,,Não aplicável.,Não aplicável.,FALSE
72/3575/2015 - Aquisição de Material consumo clínico Rub. 23,Ajuste Direto Regime Geral,Aquisição de bens móveis,"33140000-3, Material médico de consumo","Centro Hospitalar do Algarve, E. P. E. (510745997)","INTERSURGICAL PORTUGAL,LDA. (503480045)","92,80 €",10-12-2015,02-12-2015,29 dias,"Portugal, Faro, Faro<BR/>Portugal, Faro, Portimão<BR/>Portugal, Faro, Lagos","Artigo 20.º, n.º 1, alínea a) do Código dos Contratos Públicos",,,,,,Não aplicável.,Não aplicável.,FALSE
72/3575/2015 - Aquisição de Material consumo clínico Rub. 23,Ajuste Direto Regime Geral,Aquisição de bens móveis,"33140000-3, Material médico de consumo","Centro Hospitalar do Algarve, E. P. E. (510745997)","HR  HOSPITALAR,Unipessoal, LDA (501895558)","20,00 €",10-12-2015,02-12-2015,29 dias,"Portugal, Faro, Lagos<BR/>Portugal, Faro, Portimão<BR/>Portugal, Faro, Faro","Artigo 20.º, n.º 1, alínea a) do Código dos Contratos Públicos",,,,,,Não aplicável.,Não aplicável.,FALSE
72/3575/2015 - Aquisição de Material consumo clínico Rub. 23,Ajuste Direto Regime Geral,Aquisição de bens móveis,"33140000-3, Material médico de consumo","Centro Hospitalar do Algarve, E. P. E. (510745997)","EXPOMEDICA,LDA. (501886621)","73,60 €",10-12-2015,02-12-2015,29 dias,"Portugal, Faro, Portimão<BR/>Portugal, Faro, Lagos<BR/>Portugal, Faro, Faro","Artigo 20.º, n.º 1, alínea a) do Código dos Contratos Públicos",,,,,,Não aplicável.,Não aplicável.,FALSE
72/3575/2015 - Aquisição de Material consumo clínico Rub. 23,Ajuste Direto Regime Geral,Aquisição de bens móveis,"33140000-3, Material médico de consumo","Centro Hospitalar do Algarve, E. P. E. (510745997)","BASTOS VIEGAS,SA (500042772)","18,90 €",10-12-2015,02-12-2015,29 dias,"Portugal, Faro, Portimão<BR/>Portugal, Faro, Faro<BR/>Portugal, Faro, Lagos","Artigo 20.º, n.º 1, alínea a) do Código dos Contratos Públicos",,,,,,Não aplicável.,Não aplicável.,FALSE
72/3575/2015 - Aquisição de Material consumo clínico Rub. 23,Ajuste Direto Regime Geral,Aquisição de bens móveis,"33140000-3, Material médico de consumo","Centro Hospitalar do Algarve, E. P. E. (510745997)",AVIQUIMICA IMPORT E MANUFATURA (500039720),"638,40 €",10-12-2015,02-12-2015,29 dias,"Portugal, Faro, Lagos<BR/>Portugal, Faro, Faro<BR/>Portugal, Faro, Portimão","Artigo 20.º, n.º 1, alínea a) do Código dos Contratos Públicos",,,,,,Não aplicável.,Não aplicável.,FALSE
72/3575/2015 - Aquisição de Material consumo clínico Rub. 23,Ajuste Direto Regime Geral,Aquisição de bens móveis,"33140000-3, Material médico de consumo","Centro Hospitalar do Algarve, E. P. E. (510745997)","Teleflex Medical, S.A. (980249783)","600,46 €",10-12-2015,02-12-2015,29 dias,"Portugal, Faro, Faro<BR/>Portugal, Faro, Lagos<BR/>Portugal, Faro, Portimão","Artigo 20.º, n.º 1, alínea a) do Código dos Contratos Públicos",,,,,,Não aplicável.,Não aplicável.,FALSE
41/3339/2015 Medicamentos Tiocolquicosido,Ao abrigo de acordo-quadro (art.º 259.º),Aquisição de bens móveis,"33690000-3, Medicamentos vários","Centro Hospitalar do Algarve, E. P. E. (510745997)","Generis Farmacêutica, S.A. (508107997)","90,00 €",09-12-2015,12-11-2015,49 dias,"Portugal, Faro, Faro",Artigo 259.º do Código dos Contratos Públicos,,,,,,611371,"CONCURSO PÚBLICO PARA A CELEBRAÇÃO DE CONTRATOS PÚBLICOS DE APROVISIONAMENTO PARA A ÁREA DA SAÚDE, COM VISTA AO FORNECIMENTO DE MEDICAMENTOS ANESTÉSICOS E RELAXANTES MUSCULARES, ÀS INSTITUIÇÕES E SERVIÇOS DO SERVIÇO NACIONAL DE SAÚDE    ",FALSE
41/3338/2015 Medicamentos Diltiazem 180 mg,Ao abrigo de acordo-quadro (art.º 259.º),Aquisição de bens móveis,"33690000-3, Medicamentos vários","Centro Hospitalar do Algarve, E. P. E. (510745997)","FARMOZ - Sociedade Tecnico Medicinal, SA (501505334)","183,60 €",09-12-2015,12-11-2015,49 dias,"Portugal, Faro, Faro",Artigo 259.º do Código dos Contratos Públicos,,,,,,1179915,"CONCURSO PÚBLICO PARA A CELEBRAÇÃO DE CONTRATOS PÚBLICOS DE APROVISIONAMENTO PARA A ÁREA DA SAÚDE, COM VISTA AO FORNECIMENTO DE MEDICAMENTOS DO APARELHO CARDIOVASCULAR, ÀS INSTITUIÇÕES E SERVIÇOS DO SERVIÇO NACIONAL DE SAÚDE",FALSE
41/3337/2015 Medicamentos Cloreto sódio 0.9%,Ao abrigo de acordo-quadro (art.º 259.º),Aquisição de bens móveis,"33690000-3, Medicamentos vários","Centro Hospitalar do Algarve, E. P. E. (510745997)","OVERPHARMA,LDA. (505792362)","12.805,80 €",09-12-2015,12-11-2015,49 dias,"Portugal, Faro, Faro",Artigo 259.º do Código dos Contratos Públicos,,,,,,1331181,Acordo Quadro para fornecimento de corretivos da volémia e outras soluções estéreis às Instituições e Serviços do Serviço Nacional de Saúde,FALSE
"31/2876/2015 - Medicamento """"Imiglucerase 400U Pó Sol. Inj. Fr IV""""",Ao abrigo de acordo-quadro (art.º 258.º),Aquisição de bens móveis,"33600000-6, Produtos farmacêuticos","Centro Hospitalar do Algarve, E. P. E. (510745997)","Sanofi Produtos Farmacêuticos, Lda (500134960)","646.828,80 €",09-12-2015,09-09-2015,125 dias,"Portugal, Faro, Faro","Artigo 26.º, n.º 1, alínea e) do Código dos Contratos Públicos",,,,,,602067,"ONCURSO PÚBLICO PARA A CELEBRAÇÃO DE CONTRATOS PÚBLICOS DE APROVISIONAMENTO PARA A ÁREA DA SAÚDE, COM VISTA AO FORNECIMENTO DE MEDICAMENTOS DE CONSUMO GERAL - MEDICAÇÃO ANTIALÉRGICA, MEDICAMENTOS USADOS NO TRATAMENTO DE INTOXICAÇÕES, VITAMINAS E SAIS MINERAIS  E GRUPO 20.9 - OUTROS PRODUTOS, ÀS INSTITUIÇÕES E SERVIÇOS DO SERVIÇO NACIONAL DE SAÚDE",FALSE
41/2822/2015 - Dialise Peritoneal,Ao abrigo de acordo-quadro (art.º 259.º),Aquisição de bens móveis,"33600000-6, Produtos farmacêuticos","Centro Hospitalar do Algarve, E. P. E. (510745997)","Baxter Médico Farmacêutica, Lda (503347345)","323.291,55 €",09-12-2015,11-09-2015,131 dias,"Portugal, Faro, Faro",Artigo 259.º do Código dos Contratos Públicos,,,,,,601978,"CONCURSO PÚBLICO PARA A CELEBRAÇÃO DE CONTRATOS PÚBLICOS DE APROVISIONAMENTO PARA A ÁREA DA SAÚDE, COM VISTA AO FORNECIMENTO DE BENS DE DÁLISE PERITONEAL ÀS INSTITUIÇÕES E SERVIÇOS DO SERVIÇO NACIONAL DE SAÚDE",FALSE
41/3336/2015 Medicamentos A.A. 9 g/l N + Glucose 110 g/l + Lípidos 40 g/l Emul inj Sac triplo 1000 ml IV,Ao abrigo de acordo-quadro (art.º 259.º),Aquisição de bens móveis,"33690000-3, Medicamentos vários","Centro Hospitalar do Algarve, E. P. E. (510745997)","BAXTER MEDICO-FARMACEUTICA,LDA (503347345)","15.762,60 €",09-12-2015,12-11-2015,49 dias,"Portugal, Faro, Faro",Artigo 259.º do Código dos Contratos Públicos,,,,,,1377429,Acordo Quadro para fornecimento de medicamentos para Nutrição Parentérica às Instituições e Serviços do Serviço Nacional de Saúde,FALSE
41/3334/2015 Medicamentos Terlipressina,Ao abrigo de acordo-quadro (art.º 259.º),Aquisição de bens móveis,"33690000-3, Medicamentos vários","Centro Hospitalar do Algarve, E. P. E. (510745997)",D.L.A FARMACEUTICA (503894427),"2.940,00 €",09-12-2015,29-10-2015,63 dias,"Portugal, Faro, Faro",Artigo 259.º do Código dos Contratos Públicos,,,,,,1415640,CP 2015/7 - ACORDO QUADRO PARA FORNECIMENTO DE HORMONAS E OUTROS MEDICAMENTOS USADOS NO TRATAMENTO DAS DOENÇAS ENDÓCRINAS ÀS INSTITUIÇÕES E SERVIÇOS DO SERVIÇO NACIONAL DE SAÚDE,FALSE
"31/2641/2015 - Medicamento """"Etanercept 50mg/ml Sol. Inj. Caneta 1ml SC""""",Ao abrigo de acordo-quadro (art.º 258.º),Locação de bens móveis,"33600000-6, Produtos farmacêuticos","Centro Hospitalar do Algarve, E. P. E. (510745997)","Pfizer Biofarmacêutica, Sociedade Unipessoal, Lda (513300376)","569.510,50 €",09-12-2015,27-08-2015,141 dias,"Portugal, Faro, Faro","Artigo 26.º, n.º 1, alínea e) do Código dos Contratos Públicos",,,,,,1119467,"CONCURSO PÚBLICO PARA A CELEBRAÇÃO DE CONTRATOS PÚBLICOS DE APROVISIONAMENTO PARA A ÁREA DA SAÚDE, COM VISTA AO FORNECIMENTO DE MEDICAMENTOS DO FORO ONCOLÓGICO, ÀS INSTITUIÇÕES E SERVIÇOS DO SERVIÇO NACIONAL DE SAÚDE",FALSE
41/3257/2015 Fentanilo 0.25 mg/5ml Sol inj Fr 5 ml IM IV e Fentanilo 0.5 mg/10 ml sol inj,Ao abrigo de acordo-quadro (art.º 259.º),Aquisição de bens móveis,"33690000-3, Medicamentos vários","Centro Hospitalar do Algarve, E. P. E. (510745997)","LABESFAL, Laboratório AlmiroS.A. (501169580), OVERPHARMA,LDA. (505792362)","7.640,00 €",09-12-2015,01-12-2015,30 dias,"Portugal, Faro, Faro",Artigo 259.º do Código dos Contratos Públicos,,,,,,613285,"CONCURSO PÚBLICO PARA A CELEBRAÇÃO DE CONTRATOS PÚBLICOS DE APROVISIONAMENTO PARA A ÁREA DA SAÚDE, COM VISTA AO FORNECIMENTO DE MEDICAMENTOS ANALGÉSICOS, ANTIPIRÉTICOS E ANTIDEPRESSORES, ÀS INSTITUIÇÕES E SERVIÇOS DO SERVIÇO NACIONAL DE SAÚDE",FALSE
"41/3256/2015 Oxaliplatina 100mg, Exemestano 25 mg e Fluorouracilo 5000 mg",Ao abrigo de acordo-quadro (art.º 259.º),Locação de bens móveis,"33690000-3, Medicamentos vários","Centro Hospitalar do Algarve, E. P. E. (510745997)","Hospira Portugal, Lda. (502918098), LABORATÓRIOS PFIZER, LDA. (500162166)","7.315,50 €",09-12-2015,12-11-2015,49 dias,"Portugal, Faro, Faro",Artigo 259.º do Código dos Contratos Públicos,,,,,,1119467,"CONCURSO PÚBLICO PARA A CELEBRAÇÃO DE CONTRATOS PÚBLICOS DE APROVISIONAMENTO PARA A ÁREA DA SAÚDE, COM VISTA AO FORNECIMENTO DE MEDICAMENTOS DO FORO ONCOLÓGICO, ÀS INSTITUIÇÕES E SERVIÇOS DO SERVIÇO NACIONAL DE SAÚDE",FALSE
"31/2212/2015 - Medicamentos """"Emtricitabina 200mg + Tenofovir 245mg""""",Ao abrigo de acordo-quadro (art.º 258.º),Aquisição de bens móveis,"33600000-6, Produtos farmacêuticos","Centro Hospitalar do Algarve, E. P. E. (510745997)","Gilead Sciences, Lda (503604704)","949.616,82 €",09-12-2015,21-08-2015,167 dias,"Portugal, Faro, Faro","Artigo 26.º, n.º 1, alínea e) do Código dos Contratos Públicos",,,,,,1120578,"CONCURSO PÚBLICO PARA A CELEBRAÇÃO DE CONTRATOS PÚBLICOS DE APROVISIONAMENTO PARA A ÁREA DA SAÚDE, COM VISTA AO FORNECIMENTO DE MEDICAMENTOS ANTI-RETROVIRAIS, ÀS INSTITUIÇÕES E SERVIÇOS DO SERVIÇO NACIONAL DE SAÚDE  ",FALSE
41/3252/2015 Medicamento Ceftazidima 1000mg Pó sol inj Fr IM IV,Ao abrigo de acordo-quadro (art.º 259.º),Aquisição de bens móveis,"33690000-3, Medicamentos vários","Centro Hospitalar do Algarve, E. P. E. (510745997)","LABESFAL, Laboratório AlmiroS.A. (501169580)","2.420,00 €",09-12-2015,13-11-2015,48 dias,"Portugal, Faro, Faro",Artigo 259.º do Código dos Contratos Públicos,,,,,,1326195,ACORDO QUADRO PARA FORNECIMENTO DE MEDICAMENTOS ANTI-INFECIOSOS: EXCETO ANTIVÍRICOS E ANTIFÚNGICOS ÀS INSTITUIÇÕES E SERVIÇOS DO SERVIÇO NACIONAL DE SAÚDE,FALSE
Proc. 68/3454/2015- Reparações -Caldeira e Geradores,Ajuste Direto Regime Geral,Aquisição de serviços,"50510000-3, Serviços de reparação e manutenção de bombas, válvulas, torneiras e contentores de metal","Centro Hospitalar do Algarve, E. P. E. (510745997)","Tecniqueima,Lda (503706604)","1.137,24 €",07-12-2015,12-11-2015,30 dias,"Portugal, Faro, Faro","Artigo 24.º, n.º 1, alínea e) do Código dos Contratos Públicos",,,,,,Não aplicável.,Não aplicável.,FALSE
41/3251/2015 Medicamento Carvedilol 6.25 mg comp,Ao abrigo de acordo-quadro (art.º 259.º),Aquisição de bens móveis,"33690000-3, Medicamentos vários","Centro Hospitalar do Algarve, E. P. E. (510745997)","FARMOZ - Sociedade Tecnico Medicinal, SA (501505334)","252,00 €",07-12-2015,12-11-2015,49 dias,"Portugal, Faro, Faro",Artigo 259.º do Código dos Contratos Públicos,,,,,,1179915,"CONCURSO PÚBLICO PARA A CELEBRAÇÃO DE CONTRATOS PÚBLICOS DE APROVISIONAMENTO PARA A ÁREA DA SAÚDE, COM VISTA AO FORNECIMENTO DE MEDICAMENTOS DO APARELHO CARDIOVASCULAR, ÀS INSTITUIÇÕES E SERVIÇOS DO SERVIÇO NACIONAL DE SAÚDE",FALSE
41/3247/2015 Imunoglobulina humana normal 165 mg/ml Sol inj Fr 10 ml IM SC,Ao abrigo de acordo-quadro (art.º 259.º),Aquisição de bens móveis,"33690000-3, Medicamentos vários","Centro Hospitalar do Algarve, E. P. E. (510745997)",OCTAFHARMA- PROD. FARMACEUTICO (502820780),"7.524,00 €",07-12-2015,29-10-2015,63 dias,"Portugal, Faro, Faro",Artigo 259.º do Código dos Contratos Públicos,,,,,,1423488,ACORDO QUADRO PARA FORNECIMENTO DE DERIVADOS DO PLASMA HUMANO ÀS INSTITUIÇÕES E SERVIÇOS DO SERVIÇO NACIONAL DE SAÚDE CP 2015/9,FALSE
Proc. 68/3389/2015-Serviço de Portagens,Ajuste Direto Regime Geral,Aquisição de serviços,"98390000-3, Outros serviços","Centro Hospitalar do Algarve, E. P. E. (510745997)","Via Livre,SA (509447058)","3,02 €",07-12-2015,03-11-2015,6 dias,"Portugal, Faro, Faro","Artigo 24.º, n.º 1, alínea e) do Código dos Contratos Públicos",,,,,,Não aplicável.,Não aplicável.,FALSE
72/3678/15 - Aquisição de Recargas P/ Agrafador,Ajuste Direto Regime Geral,Aquisição de bens móveis,"33140000-3, Material médico de consumo","Centro Hospitalar do Algarve, E. P. E. (510745997)","B. Braun Medical, Lda. (501506543)","204,00 €",07-12-2015,07-12-2015,24 dias,"Portugal, Faro, Faro<BR/>Portugal, Faro, Lagos<BR/>Portugal, Faro, Portimão","Artigo 20.º, n.º 1, alínea a) do Código dos Contratos Públicos",,,,,,Não aplicável.,Não aplicável.,FALSE
72/3678/15 - Aquisições de Recarga p/ agrafador,Ajuste Direto Regime Geral,Aquisição de bens móveis,"33140000-3, Material médico de consumo","Centro Hospitalar do Algarve, E. P. E. (510745997)","COVIDIEN PORTUGAL - PRODUTOS  DE SAUDE, UNIPESSOAL, LDA. (503413410)","5.340,00 €",07-12-2015,07-12-2015,24 dias,"Portugal, Faro, Faro<BR/>Portugal, Faro, Lagos<BR/>Portugal, Faro, Portimão","Artigo 20.º, n.º 1, alínea a) do Código dos Contratos Públicos",,,,,,Não aplicável.,Não aplicável.,FALSE
Proc. 67/3047/2015-Aquisição por substituição de Nefroscopio,Ajuste Direto Regime Geral,Aquisição de bens móveis,"33162100-4, Aparelhos para blocos operatórios","Centro Hospitalar do Algarve, E. P. E. (510745997)","TEPREL,LDA (502262184)","1.591,00 €",07-12-2015,11-09-2015,60 dias,"Portugal, Faro, Faro","Artigo 20.º, n.º 1, alínea a) do Código dos Contratos Públicos",,,,,,Não aplicável.,Não aplicável.,FALSE
41/3209/2015 Medicamento Infliximab 100 mg pó sol inj Fr IV,Ao abrigo de acordo-quadro (art.º 259.º),Locação de bens móveis,"33690000-3, Medicamentos vários","Centro Hospitalar do Algarve, E. P. E. (510745997)","PharmaKern Portugal - Produtos Farmacêuticos, Lda (507002571)","25.734,50 €",07-12-2015,29-10-2015,63 dias,"Portugal, Faro, Faro",Artigo 259.º do Código dos Contratos Públicos,,,,,,1119467,"CONCURSO PÚBLICO PARA A CELEBRAÇÃO DE CONTRATOS PÚBLICOS DE APROVISIONAMENTO PARA A ÁREA DA SAÚDE, COM VISTA AO FORNECIMENTO DE MEDICAMENTOS DO FORO ONCOLÓGICO, ÀS INSTITUIÇÕES E SERVIÇOS DO SERVIÇO NACIONAL DE SAÚDE",FALSE
"41/3195/2015 Medic A.A. 5,7 g N + Glucose 80 g + Lípidos 50 g + Electrólitos Emul inj Sac triplo 1250 ml IV",Ao abrigo de acordo-quadro (art.º 259.º),Aquisição de bens móveis,"33690000-3, Medicamentos vários","Centro Hospitalar do Algarve, E. P. E. (510745997)","B. Braun Medical, Lda. (501506543)","7.417,50 €",07-12-2015,29-10-2015,63 dias,"Portugal, Faro, Faro",Artigo 259.º do Código dos Contratos Públicos,,,,,,1377429,Acordo Quadro para fornecimento de medicamentos para Nutrição Parentérica às Instituições e Serviços do Serviço Nacional de Saúde,FALSE
72/3641/2015 - Aquisição de Placas  - Material de Osteossintese,Ajuste Direto Regime Geral,Aquisição de bens móveis,"33140000-3, Material médico de consumo","Centro Hospitalar do Algarve, E. P. E. (510745997)",JOHNSON & JOHNSON PROD.PROF. (500153370),"8.990,00 €",07-12-2015,02-12-2015,30 dias,"Portugal, Faro, Portimão<BR/>Portugal, Faro, Faro<BR/>Portugal, Faro, Lagos","Artigo 20.º, n.º 1, alínea a) do Código dos Contratos Públicos",,,,,,Não aplicável.,Não aplicável.,FALSE
41/3190/2015 Medicamento Metformina 1000 mg comp,Ao abrigo de acordo-quadro (art.º 259.º),Aquisição de bens móveis,"33690000-3, Medicamentos vários","Centro Hospitalar do Algarve, E. P. E. (510745997)","PharmaKern Portugal - Produtos Farmacêuticos, Lda (507002571)","20,28 €",07-12-2015,29-10-2015,63 dias,"Portugal, Faro, Faro",Artigo 259.º do Código dos Contratos Públicos,,,,,,1415640,CP 2015/7 - ACORDO QUADRO PARA FORNECIMENTO DE HORMONAS E OUTROS MEDICAMENTOS USADOS NO TRATAMENTO DAS DOENÇAS ENDÓCRINAS ÀS INSTITUIÇÕES E SERVIÇOS DO SERVIÇO NACIONAL DE SAÚDE,FALSE
41/3186/2015 Medicamentos Ciprofloxacina 200 mg e Flucloxacilina 500 mg,Ao abrigo de acordo-quadro (art.º 259.º),Aquisição de bens móveis,"33690000-3, Medicamentos vários","Centro Hospitalar do Algarve, E. P. E. (510745997)","FARMOZ - Sociedade Tecnico Medicinal, SA (501505334), LABESFAL, Laboratório AlmiroS.A. (501169580)","3.419,15 €",07-12-2015,29-10-2015,63 dias,"Portugal, Faro, Faro",Artigo 259.º do Código dos Contratos Públicos,,,,,,1326195,ACORDO QUADRO PARA FORNECIMENTO DE MEDICAMENTOS ANTI-INFECIOSOS: EXCETO ANTIVÍRICOS E ANTIFÚNGICOS ÀS INSTITUIÇÕES E SERVIÇOS DO SERVIÇO NACIONAL DE SAÚDE,FALSE
4182/2015 Medicamento Cetamina 500mg/10 ml SOl inj Fr 10ml IMIV,Ao abrigo de acordo-quadro (art.º 259.º),Aquisição de bens móveis,"33690000-3, Medicamentos vários","Centro Hospitalar do Algarve, E. P. E. (510745997)","HIKMA FARMACEUTICA,LDA (502266791)","4.680,00 €",07-12-2015,29-10-2015,63 dias,"Portugal, Faro, Faro",Artigo 259.º do Código dos Contratos Públicos,,,,,,611371,"CONCURSO PÚBLICO PARA A CELEBRAÇÃO DE CONTRATOS PÚBLICOS DE APROVISIONAMENTO PARA A ÁREA DA SAÚDE, COM VISTA AO FORNECIMENTO DE MEDICAMENTOS ANESTÉSICOS E RELAXANTES MUSCULARES, ÀS INSTITUIÇÕES E SERVIÇOS DO SERVIÇO NACIONAL DE SAÚDE    ",FALSE
Aquisição de Material Administrativo - 75/00003557/2015,Ajuste Direto Regime Geral,Aquisição de bens móveis,"30192700-8, Artigos de papelaria<BR/>30199000-0, Artigos de papelaria e outros artigos de papel<BR/>30125100-2, Cartuchos de tinta (toner)<BR/>30192100-2, Borrachas","Centro Hospitalar do Algarve, E. P. E. (510745997)",PAPELARIA E LIVRARIA SAGRES (501212973),"368,40 €",07-12-2015,03-12-2015,28 dias,"Portugal, Faro, Lagos<BR/>Portugal, Faro, Portimão<BR/>Portugal, Faro, Faro","Artigo 20.º, n.º 1, alínea a) do Código dos Contratos Públicos",,,,,,Não aplicável.,Não aplicável.,FALSE
Aquisição de Material Administrativo - 75/00003557/2015,Ajuste Direto Regime Geral,Aquisição de bens móveis,"30192800-9, Etiquetas autocolantes","Centro Hospitalar do Algarve, E. P. E. (510745997)",TOPLABEL (194608310),"165,75 €",07-12-2015,03-12-2015,28 dias,"Portugal, Faro, Portimão<BR/>Portugal, Faro, Lagos<BR/>Portugal, Faro, Faro","Artigo 20.º, n.º 1, alínea a) do Código dos Contratos Públicos",,,,,,Não aplicável.,Não aplicável.,FALSE
Aquisição de Material Administrativo - 75/00003557/2015,Ajuste Direto Regime Geral,Aquisição de bens móveis,"30192121-5, Canetas esferográficas<BR/>30197320-5, Agrafadores<BR/>30192000-1, Material de escritório<BR/>30192930-9, Canetas correctoras<BR/>30192110-5, Produtos de tinta<BR/>30192130-1, Lápis<BR/>30234400-2, Discos versáteis digitais (DVD)<BR/>30192700-8, Artigos de papelaria<BR/>30234300-1, Discos compactos (CD)<BR/>30192125-3, Marcadores<BR/>30192800-9, Etiquetas autocolantes","Centro Hospitalar do Algarve, E. P. E. (510745997)",OLMAR.FERNADO G.OLIVEIRA & CA. (500440263),"470,47 €",07-12-2015,03-12-2015,28 dias,"Portugal, Faro, Portimão<BR/>Portugal, Faro, Faro<BR/>Portugal, Faro, Lagos","Artigo 20.º, n.º 1, alínea a) do Código dos Contratos Públicos",,,,,,Não aplicável.,Não aplicável.,FALSE
Aquisição de Material Administrativo - 75/00003557/2015,Ajuste Direto Regime Geral,Aquisição de bens móveis,"30192800-9, Etiquetas autocolantes","Centro Hospitalar do Algarve, E. P. E. (510745997)",Marcos de Azevedo Dias (108701476),"747,00 €",07-12-2015,03-12-2015,28 dias,"Portugal, Faro, Portimão<BR/>Portugal, Faro, Lagos<BR/>Portugal, Faro, Faro","Artigo 20.º, n.º 1, alínea a) do Código dos Contratos Públicos",,,,,,Não aplicável.,Não aplicável.,FALSE
Aquisição de Material Administrativo - 75/00003557/2015,Ajuste Direto Regime Geral,Aquisição de bens móveis,"30125100-2, Cartuchos de tinta (toner)","Centro Hospitalar do Algarve, E. P. E. (510745997)","PRN INFORMÁTICA, LDA (504100327)","2.835,50 €",07-12-2015,03-12-2015,28 dias,"Portugal, Faro, Faro<BR/>Portugal, Faro, Portimão<BR/>Portugal, Faro, Lagos","Artigo 20.º, n.º 1, alínea a) do Código dos Contratos Públicos",,,,,,Não aplicável.,Não aplicável.,FALSE
Aquisição de Material Administrativo - 75/00003557/2015,Ajuste Direto Regime Geral,Aquisição de bens móveis,"30192800-9, Etiquetas autocolantes","Centro Hospitalar do Algarve, E. P. E. (510745997)",A.MENDES DA SILVA LDA (502064080),"118,08 €",07-12-2015,03-12-2015,28 dias,"Portugal, Faro, Faro<BR/>Portugal, Faro, Lagos<BR/>Portugal, Faro, Portimão","Artigo 20.º, n.º 1, alínea a) do Código dos Contratos Públicos",,,,,,Não aplicável.,Não aplicável.,FALSE
Aquisição de Material Administrativo - 75/00003557/2015,Ajuste Direto Regime Geral,Aquisição de bens móveis,"30192700-8, Artigos de papelaria","Centro Hospitalar do Algarve, E. P. E. (510745997)","A.R.S. ALGARVE, I.P. (503148709)","39,62 €",07-12-2015,03-12-2015,28 dias,"Portugal, Faro, Faro<BR/>Portugal, Faro, Portimão<BR/>Portugal, Faro, Lagos","Artigo 20.º, n.º 1, alínea a) do Código dos Contratos Públicos",,,,,,Não aplicável.,Não aplicável.,FALSE
61/3582/2015 Medicamento Dolutegravir 50 mg comp,Ajuste Direto Regime Geral,Aquisição de bens móveis,"33690000-3, Medicamentos vários","Centro Hospitalar do Algarve, E. P. E. (510745997)","ViiV Healthcare, Unipessoal Lda (509117961)","13.200,03 €",07-12-2015,02-12-2015,29 dias,"Portugal, Faro, Faro","Artigo 24.º, n.º 1, alínea e) do Código dos Contratos Públicos",,,,,,Não aplicável.,Não aplicável.,FALSE
Aquisição de Seringas e Contentores,Ao abrigo de acordo-quadro (art.º 259.º),Aquisição de bens móveis,"33140000-3, Material médico de consumo","Centro Hospitalar do Algarve, E. P. E. (510745997)","PERGUT PORTUGAL,LDA. (501799729)","808,00 €",07-12-2015,03-12-2015,29 dias,"Portugal, Faro, Lagos<BR/>Portugal, Faro, Faro<BR/>Portugal, Faro, Portimão","Artigo 20.º, n.º 1, alínea b) do Código dos Contratos Públicos",,,,,,448705,"CONCURSO PÚBLICO PARA A CELEBRAÇÃO DE CONTRATOS PÚBLICOS DE APROVISIONAMENTO PARA A ÁREA DA SAÚDE, COM VISTA AO FORNECIMENTO DE SERINGAS, AGULHAS, CONTENTORES E SISTEMAS FECHADOS DE COLHEITA,  ÀS INSTITUIÇÕES E SERVIÇOS DO SERVIÇO NACIONAL DE SAÚDE",FALSE
Aquisição de Seringas e Contentores,Ao abrigo de acordo-quadro (art.º 259.º),Aquisição de bens móveis,"33140000-3, Material médico de consumo","Centro Hospitalar do Algarve, E. P. E. (510745997)","NORMAX,LDA. (500203130)","96,60 €",07-12-2015,03-12-2015,29 dias,"Portugal, Faro, Lagos<BR/>Portugal, Faro, Portimão<BR/>Portugal, Faro, Faro","Artigo 20.º, n.º 1, alínea b) do Código dos Contratos Públicos",,,,,,448705,"CONCURSO PÚBLICO PARA A CELEBRAÇÃO DE CONTRATOS PÚBLICOS DE APROVISIONAMENTO PARA A ÁREA DA SAÚDE, COM VISTA AO FORNECIMENTO DE SERINGAS, AGULHAS, CONTENTORES E SISTEMAS FECHADOS DE COLHEITA,  ÀS INSTITUIÇÕES E SERVIÇOS DO SERVIÇO NACIONAL DE SAÚDE",FALSE
Aquisição de Seringas e Contentores,Ao abrigo de acordo-quadro (art.º 259.º),Aquisição de bens móveis,"33140000-3, Material médico de consumo","Centro Hospitalar do Algarve, E. P. E. (510745997)","BECTON DISKINSON, S.A. - SUCURSAL EM PORTUGAL (980245214)","1.661,22 €",07-12-2015,03-12-2015,29 dias,"Portugal, Faro, Portimão<BR/>Portugal, Faro, Lagos<BR/>Portugal, Faro, Faro","Artigo 20.º, n.º 1, alínea b) do Código dos Contratos Públicos",,,,,,448705,"CONCURSO PÚBLICO PARA A CELEBRAÇÃO DE CONTRATOS PÚBLICOS DE APROVISIONAMENTO PARA A ÁREA DA SAÚDE, COM VISTA AO FORNECIMENTO DE SERINGAS, AGULHAS, CONTENTORES E SISTEMAS FECHADOS DE COLHEITA,  ÀS INSTITUIÇÕES E SERVIÇOS DO SERVIÇO NACIONAL DE SAÚDE",FALSE
Aquisição de Seringas e Contentores,Ao abrigo de acordo-quadro (art.º 259.º),Aquisição de bens móveis,"33140000-3, Material médico de consumo","Centro Hospitalar do Algarve, E. P. E. (510745997)",AMBIMED (503593427),"493,50 €",07-12-2015,03-12-2015,29 dias,"Portugal, Faro, Lagos<BR/>Portugal, Faro, Portimão<BR/>Portugal, Faro, Faro","Artigo 20.º, n.º 1, alínea b) do Código dos Contratos Públicos",,,,,,448705,"CONCURSO PÚBLICO PARA A CELEBRAÇÃO DE CONTRATOS PÚBLICOS DE APROVISIONAMENTO PARA A ÁREA DA SAÚDE, COM VISTA AO FORNECIMENTO DE SERINGAS, AGULHAS, CONTENTORES E SISTEMAS FECHADOS DE COLHEITA,  ÀS INSTITUIÇÕES E SERVIÇOS DO SERVIÇO NACIONAL DE SAÚDE",FALSE
7/3350/2015 - Medicamentos Bonsentano 125 mg,Ajuste Direto Regime Geral,Aquisição de bens móveis,"33690000-3, Medicamentos vários","Centro Hospitalar do Algarve, E. P. E. (510745997)","Actelion Pharmaceuticals Portugal, lda (507336488)","5.926,20 €",04-12-2015,29-10-2015,64 dias,"Portugal, Faro, Faro","Artigo 20.º, n.º 1, alínea a) do Código dos Contratos Públicos",,,,,,Não aplicável.,Não aplicável.,FALSE
"41/3174/2015 Água esterilizada para irrigação 500 ml, frasco rosca",Ao abrigo de acordo-quadro (art.º 259.º),Aquisição de bens móveis,"33690000-3, Medicamentos vários","Centro Hospitalar do Algarve, E. P. E. (510745997)","LABESFAL, Laboratório AlmiroS.A. (501169580)","1.081,08 €",04-12-2015,29-10-2015,63 dias,"Portugal, Faro, Faro",Artigo 259.º do Código dos Contratos Públicos,,,,,,1331181,Acordo Quadro para fornecimento de corretivos da volémia e outras soluções estéreis às Instituições e Serviços do Serviço Nacional de Saúde,FALSE
72/3617/2015 - Aquisição de Material de Consumo clinico,Ajuste Direto Regime Geral,Aquisição de bens móveis,"33140000-3, Material médico de consumo","Centro Hospitalar do Algarve, E. P. E. (510745997)","B. Braun Medical, Lda. (501506543)","370,00 €",04-12-2015,30-11-2015,5 dias,"Portugal, Faro, Lagos<BR/>Portugal, Faro, Portimão<BR/>Portugal, Faro, Faro","Artigo 20.º, n.º 1, alínea a) do Código dos Contratos Públicos",,,,,,Não aplicável.,Não aplicável.,FALSE
72/3617/2015 - Aquisição de Material de Consumo clinico,Ajuste Direto Regime Geral,Aquisição de bens móveis,"33184000-3, Próteses","Centro Hospitalar do Algarve, E. P. E. (510745997)",ENDOTÉCNICA - Soluções Hospitalares  (503818348),"795,00 €",04-12-2015,30-11-2015,5 dias,"Portugal, Faro, Lagos<BR/>Portugal, Faro, Faro<BR/>Portugal, Faro, Portimão","Artigo 20.º, n.º 1, alínea a) do Código dos Contratos Públicos",,,,,,Não aplicável.,Não aplicável.,FALSE
72/3617/15 - Aquisição de Material de Consumo clinico,Ajuste Direto Regime Geral,Aquisição de bens móveis,"33185000-0, Próteses auditivas","Centro Hospitalar do Algarve, E. P. E. (510745997)","ATOS MEDICAL SPAIN, SL - SUCURSAL EM PORTUGAL (980435978)","280,00 €",04-12-2015,30-11-2015,5 dias,"Portugal, Faro, Portimão<BR/>Portugal, Faro, Faro<BR/>Portugal, Faro, Lagos","Artigo 20.º, n.º 1, alínea a) do Código dos Contratos Públicos",,,,,,Não aplicável.,Não aplicável.,FALSE
72/3587/2015 - AQUISIÇÃO DE MATERIAL DE CONSUMO CLINICO,Ajuste Direto Regime Geral,Aquisição de bens móveis,"33140000-3, Material médico de consumo","Centro Hospitalar do Algarve, E. P. E. (510745997)","COVIDIEN PORTUGAL - PRODUTOS  DE SAUDE, UNIPESSOAL, LDA. (503413410)","2.162,00 €",04-12-2015,02-12-2015,29 dias,"Portugal, Faro, Portimão<BR/>Portugal, Faro, Faro<BR/>Portugal, Faro, Lagos","Artigo 20.º, n.º 1, alínea a) do Código dos Contratos Públicos",,,,,,Não aplicável.,Não aplicável.,FALSE
72/3587/2015 - AQUISIÇÃO DE MATERIAL DE CONSUMO CLINICO,Ajuste Direto Regime Geral,Aquisição de bens móveis,"33140000-3, Material médico de consumo","Centro Hospitalar do Algarve, E. P. E. (510745997)","EZEQUIEL PANAO JORGE,LDA (501412727)","133,00 €",04-12-2015,02-12-2015,29 dias,"Portugal, Faro, Portimão<BR/>Portugal, Faro, Lagos<BR/>Portugal, Faro, Faro","Artigo 20.º, n.º 1, alínea a) do Código dos Contratos Públicos",,,,,,Não aplicável.,Não aplicável.,FALSE
72/3587/2015 - AQUISIÇÃO DE MATERIAL DE CONSUMO CLINICO,Ajuste Direto Regime Geral,Aquisição de bens móveis,"33140000-3, Material médico de consumo","Centro Hospitalar do Algarve, E. P. E. (510745997)","VACUETTE PORTUGAL, S.A. (505348470)","13,50 €",04-12-2015,02-12-2015,29 dias,"Portugal, Faro, Faro<BR/>Portugal, Faro, Portimão<BR/>Portugal, Faro, Lagos","Artigo 20.º, n.º 1, alínea a) do Código dos Contratos Públicos",,,,,,Não aplicável.,Não aplicável.,FALSE
72/3587/2015 - AQUISIÇÃO DE MATERIAL DE CONSUMO CLINICO,Ajuste Direto Regime Geral,Aquisição de bens móveis,"33140000-3, Material médico de consumo","Centro Hospitalar do Algarve, E. P. E. (510745997)",MUC.MATERIAL DE UTILID.CLINICA (502379308),"110,00 €",04-12-2015,02-12-2015,29 dias,"Portugal, Faro, Portimão<BR/>Portugal, Faro, Lagos<BR/>Portugal, Faro, Faro","Artigo 20.º, n.º 1, alínea a) do Código dos Contratos Públicos",,,,,,Não aplicável.,Não aplicável.,FALSE
72/3587/2015 - AQUISIÇÃO DE MATERIAL DE CONSUMO CLINICO,Ajuste Direto Regime Geral,Aquisição de bens móveis,"33140000-3, Material médico de consumo","Centro Hospitalar do Algarve, E. P. E. (510745997)","Medline international Portugal, Unipessoal, Lda. (510533515)","45,00 €",04-12-2015,02-12-2015,29 dias,"Portugal, Faro, Portimão<BR/>Portugal, Faro, Lagos<BR/>Portugal, Faro, Faro","Artigo 20.º, n.º 1, alínea a) do Código dos Contratos Públicos",,,,,,Não aplicável.,Não aplicável.,FALSE
72/3587/2015 - AQUISIÇÃO DE MATERIAL DE CONSUMO CLINICO,Ajuste Direto Regime Geral,Aquisição de bens móveis,"33140000-3, Material médico de consumo","Centro Hospitalar do Algarve, E. P. E. (510745997)","LINEAMEDICA,S.A. (505148676)","227,20 €",04-12-2015,02-12-2015,29 dias,"Portugal, Faro, Lagos<BR/>Portugal, Faro, Faro<BR/>Portugal, Faro, Portimão","Artigo 20.º, n.º 1, alínea a) do Código dos Contratos Públicos",,,,,,Não aplicável.,Não aplicável.,FALSE
72/3587/2015 - AQUISIÇÃO DE MATERIAL DE CONSUMO CLINICO,Ajuste Direto Regime Geral,Aquisição de bens móveis,"33140000-3, Material médico de consumo","Centro Hospitalar do Algarve, E. P. E. (510745997)",JMV-PRODUTOS HOSPITALARES (501887148),"100,79 €",04-12-2015,02-12-2015,29 dias,"Portugal, Faro, Faro<BR/>Portugal, Faro, Portimão","Artigo 20.º, n.º 1, alínea a) do Código dos Contratos Públicos",,,,,,Não aplicável.,Não aplicável.,FALSE
72/3587/2015 - AQUISIÇÃO DE MATERIAL DE CONSUMO CLINICO,Ajuste Direto Regime Geral,Aquisição de bens móveis,"33140000-3, Material médico de consumo","Centro Hospitalar do Algarve, E. P. E. (510745997)","INTERSURGICAL PORTUGAL,LDA. (503480045)","112,20 €",04-12-2015,02-12-2015,29 dias,"Portugal, Faro, Lagos<BR/>Portugal, Faro, Portimão<BR/>Portugal, Faro, Faro","Artigo 20.º, n.º 1, alínea a) do Código dos Contratos Públicos",,,,,,Não aplicável.,Não aplicável.,FALSE
72/3587/2015 - AQUISIÇÃO DE MATERIAL DE CONSUMO CLINICO,Ajuste Direto Regime Geral,Aquisição de bens móveis,"33140000-3, Material médico de consumo","Centro Hospitalar do Algarve, E. P. E. (510745997)","HR  HOSPITALAR,Unipessoal, LDA (501895558)","699,00 €",04-12-2015,02-12-2015,29 dias,"Portugal, Faro, Portimão<BR/>Portugal, Faro, Lagos<BR/>Portugal, Faro, Faro","Artigo 20.º, n.º 1, alínea a) do Código dos Contratos Públicos",,,,,,Não aplicável.,Não aplicável.,FALSE
Aquisição de Adesivo Suporte Pano Com Cola Latex,Ao abrigo de acordo-quadro (art.º 259.º),Aquisição de bens móveis,"33140000-3, Material médico de consumo","Centro Hospitalar do Algarve, E. P. E. (510745997)","PAUL HARTMANN, LDA. (502271728)","655,20 €",04-12-2015,01-12-2015,31 dias,"Portugal, Faro, Portimão<BR/>Portugal, Faro, Faro","Artigo 20.º, n.º 1, alínea b) do Código dos Contratos Públicos",,,,,,534953,"CONCURSO PÚBLICO PARA A CELEBRAÇÃO DE CONTRATOS PÚBLICOS DE APROVISIONAMENTO PARA A ÁREA DA SAÚDE, COM VISTA AO FORNECIMENTO DE MATERIAL DE PENSO TRADICIONAL/CLASSICO - PARTE 1 - ÀS INSTITUIÇÕES E SERVIÇOS DO SERVIÇO NACIONAL DE SAÚDE  ",FALSE
72/3587/2015 - AQUISIÇÃO DE MATERIAL DE CONSUMO CLINICO,Ajuste Direto Regime Geral,Aquisição de bens móveis,"33140000-3, Material médico de consumo","Centro Hospitalar do Algarve, E. P. E. (510745997)","FILSAT EQUIPAMENTOS MÉDICO-CIENTIFICOS, LDA (506708616)","80,00 €",04-12-2015,02-12-2015,29 dias,"Portugal, Faro, Portimão<BR/>Portugal, Faro, Lagos<BR/>Portugal, Faro, Faro","Artigo 20.º, n.º 1, alínea a) do Código dos Contratos Públicos",,,,,,Não aplicável.,Não aplicável.,FALSE
72/3587/2015 - AQUISIÇÃO DE MATERIAL DE CONSUMO CLINICO,Ajuste Direto Regime Geral,Aquisição de bens móveis,"33140000-3, Material médico de consumo","Centro Hospitalar do Algarve, E. P. E. (510745997)",EPJMEDICA-ARTIGOS MED.HOSPITAL (506820513),"52,00 €",04-12-2015,02-12-2015,29 dias,"Portugal, Faro, Portimão<BR/>Portugal, Faro, Faro<BR/>Portugal, Faro, Lagos","Artigo 20.º, n.º 1, alínea a) do Código dos Contratos Públicos",,,,,,Não aplicável.,Não aplicável.,FALSE
72/3587/2015 - AQUISIÇÃO DE MATERIAL DE CONSUMO CLINICO,Ajuste Direto Regime Geral,Aquisição de bens móveis,"33140000-3, Material médico de consumo","Centro Hospitalar do Algarve, E. P. E. (510745997)",ENDOTÉCNICA - Soluções Hospitalares  (503818348),"400,00 €",04-12-2015,02-12-2015,29 dias,"Portugal, Faro, Lagos<BR/>Portugal, Faro, Faro<BR/>Portugal, Faro, Portimão","Artigo 20.º, n.º 1, alínea a) do Código dos Contratos Públicos",,,,,,Não aplicável.,Não aplicável.,FALSE
72/3587/2015 - AQUISIÇÃO DE MATERIAL DE CONSUMO CLINICO,Ajuste Direto Regime Geral,Aquisição de bens móveis,"33140000-3, Material médico de consumo","Centro Hospitalar do Algarve, E. P. E. (510745997)","BASTOS VIEGAS,SA (500042772)","229,20 €",04-12-2015,02-12-2015,29 dias,"Portugal, Faro, Portimão<BR/>Portugal, Faro, Faro<BR/>Portugal, Faro, Lagos","Artigo 20.º, n.º 1, alínea a) do Código dos Contratos Públicos",,,,,,Não aplicável.,Não aplicável.,FALSE
Aquisição de Prolongador Venoso 100cm,Ao abrigo de acordo-quadro (art.º 259.º),Aquisição de bens móveis,"33140000-3, Material médico de consumo","Centro Hospitalar do Algarve, E. P. E. (510745997)",CareFusion Portugal 332  (503898554),"250,00 €",04-12-2015,02-12-2015,30 dias,"Portugal, Faro, Portimão<BR/>Portugal, Faro, Lagos<BR/>Portugal, Faro, Faro","Artigo 20.º, n.º 1, alínea b) do Código dos Contratos Públicos",,,,,,1212278,"CONCURSO PÚBLICO PARA A CELEBRAÇÃO DE CONTRATOS PÚBLICOS DE APROVISIONAMENTO PARA A ÁREA DA SAÚDE, COM VISTA AO FORNECIMENTO DE CATETERES, ÀS INSTITUIÇÕES E SERVIÇOS DO SERVIÇO NACIONAL DE SAÚDE",FALSE
"71/3291/2015 - Poliuretano c/silicone super absorvente 10x10cm, ",Ajuste Direto Regime Geral,Aquisição de bens móveis,"33690000-3, Medicamentos vários","Centro Hospitalar do Algarve, E. P. E. (510745997)","Smith & Nephew, Lda (503552461)","11.480,40 €",04-12-2015,27-11-2015,35 dias,"Portugal, Faro, Faro","Artigo 20.º, n.º 1, alínea a) do Código dos Contratos Públicos",,,,,,Não aplicável.,Não aplicável.,FALSE
72/3506/2015 - Aquisição de Material de Consumo Clinico,Ajuste Direto Regime Geral,Aquisição de bens móveis,"33140000-3, Material médico de consumo","Centro Hospitalar do Algarve, E. P. E. (510745997)","BIOSONDA,LDA. (501463313)","462,00 €",04-12-2015,11-11-2015,50 dias,"Portugal, Faro, Lagos<BR/>Portugal, Faro, Portimão<BR/>Portugal, Faro, Faro","Artigo 20.º, n.º 1, alínea a) do Código dos Contratos Públicos",,,,,,Não aplicável.,Não aplicável.,FALSE
72/3506/2015 - Aquisição de Material de Consumo Clinico,Ajuste Direto Regime Geral,Aquisição de bens móveis,"33140000-3, Material médico de consumo","Centro Hospitalar do Algarve, E. P. E. (510745997)","Medline international Portugal, Unipessoal, Lda. (510533515)","340,80 €",04-12-2015,11-11-2015,50 dias,"Portugal, Faro, Lagos<BR/>Portugal, Faro, Portimão<BR/>Portugal, Faro, Faro","Artigo 20.º, n.º 1, alínea a) do Código dos Contratos Públicos",,,,,,Não aplicável.,Não aplicável.,FALSE
72/3506/2015 - Aquisição de Material de Consumo Clinico,Ajuste Direto Regime Geral,Aquisição de bens móveis,"33140000-3, Material médico de consumo","Centro Hospitalar do Algarve, E. P. E. (510745997)","BOSTON SCIENTIFIC PORTUGAL-DISPOSITIVOS MÉDICOS, LDA. (504988964)","9.650,00 €",04-12-2015,11-11-2015,50 dias,"Portugal, Faro, Faro<BR/>Portugal, Faro, Portimão<BR/>Portugal, Faro, Lagos","Artigo 20.º, n.º 1, alínea a) do Código dos Contratos Públicos",,,,,,Não aplicável.,Não aplicável.,FALSE
72/3506/2015 - Aquisição de Material de Consumo Clinico,Ajuste Direto Regime Geral,Aquisição de bens móveis,"33140000-3, Material médico de consumo","Centro Hospitalar do Algarve, E. P. E. (510745997)","ALVES & CA(IRMAOS),LDA. (500310068)","550,00 €",04-12-2015,11-11-2015,50 dias,"Portugal, Faro, Faro<BR/>Portugal, Faro, Portimão<BR/>Portugal, Faro, Lagos","Artigo 20.º, n.º 1, alínea a) do Código dos Contratos Públicos",,,,,,Não aplicável.,Não aplicável.,FALSE
Aquisição Material Hoteleiro - 74/00003599/2015,Ajuste Direto Regime Geral,Aquisição de bens móveis,"39224300-1, Vassouras, escovas e outros artigos para limpeza doméstica<BR/>33711710-7, Escovas de dentes<BR/>33711810-8, Creme de barbear","Centro Hospitalar do Algarve, E. P. E. (510745997)","FITISAN - PRODUTOS DE HIGIENE EMBALAGEM, LDA (506320073)","294,55 €",03-12-2015,30-11-2015,30 dias,"Portugal, Faro, Lagos<BR/>Portugal, Faro, Portimão<BR/>Portugal, Faro, Faro","Artigo 20.º, n.º 1, alínea a) do Código dos Contratos Públicos",,,,,,Não aplicável.,Não aplicável.,FALSE
Aquisição Material Hoteleiro - 74/00003599/2015,Ajuste Direto Regime Geral,Aquisição de bens móveis,"33760000-5, Papel higiénico, lenços, toalhas de mão e guardanapos","Centro Hospitalar do Algarve, E. P. E. (510745997)",SERVISAN-PROD HIGIENE S.A (500246530),"57,90 €",03-12-2015,30-11-2015,30 dias,"Portugal, Faro, Lagos<BR/>Portugal, Faro, Portimão<BR/>Portugal, Faro, Faro","Artigo 20.º, n.º 1, alínea a) do Código dos Contratos Públicos",,,,,,Não aplicável.,Não aplicável.,FALSE
Aquisição Material Hoteleiro - 74/00003599/2015,Ajuste Direto Regime Geral,Aquisição de bens móveis,"44617000-8, Caixas","Centro Hospitalar do Algarve, E. P. E. (510745997)","Plásticos Industriais e Domésticos, SA (500219672)","29,00 €",03-12-2015,30-11-2015,30 dias,"Portugal, Faro, Portimão<BR/>Portugal, Faro, Faro<BR/>Portugal, Faro, Lagos","Artigo 20.º, n.º 1, alínea a) do Código dos Contratos Públicos",,,,,,Não aplicável.,Não aplicável.,FALSE
Aquisição Material Hoteleiro - 74/00003599/2015,Ajuste Direto Regime Geral,Aquisição de bens móveis,"39831200-8, Detergentes","Centro Hospitalar do Algarve, E. P. E. (510745997)",LUSOQUIMICA-PRO.QUIMICOS M.LDA (504133802),"457,50 €",03-12-2015,30-11-2015,30 dias,"Portugal, Faro, Faro<BR/>Portugal, Faro, Lagos<BR/>Portugal, Faro, Portimão","Artigo 20.º, n.º 1, alínea a) do Código dos Contratos Públicos",,,,,,Não aplicável.,Não aplicável.,FALSE
Aquisição Material Hoteleiro - 74/00003599/2015,Ajuste Direto Regime Geral,Aquisição de bens móveis,"39831200-8, Detergentes","Centro Hospitalar do Algarve, E. P. E. (510745997)","ASC- Arménio Salgado Costa- Comércio de Produtos de Higiene, Lda  (505495414)","350,80 €",03-12-2015,30-11-2015,30 dias,"Portugal, Faro, Faro<BR/>Portugal, Faro, Portimão<BR/>Portugal, Faro, Lagos","Artigo 20.º, n.º 1, alínea a) do Código dos Contratos Públicos",,,,,,Não aplicável.,Não aplicável.,FALSE
Aquisição Material Hoteleiro - 74/00003599/2015,Ajuste Direto Regime Geral,Aquisição de bens móveis,"33764000-3, Guardanapos de papel","Centro Hospitalar do Algarve, E. P. E. (510745997)","MEILEX, LDA (501759441)","46,00 €",03-12-2015,30-11-2015,30 dias,"Portugal, Faro, Lagos<BR/>Portugal, Faro, Portimão<BR/>Portugal, Faro, Faro","Artigo 20.º, n.º 1, alínea a) do Código dos Contratos Públicos",,,,,,Não aplicável.,Não aplicável.,FALSE
Aquisição Material Hoteleiro - 74/00003599/2015,Ajuste Direto Regime Geral,Aquisição de bens móveis,"39221120-4, Chávenas e copos<BR/>39223100-2, Colheres<BR/>39222100-5, Material descartável para fornecimento de refeições (catering)","Centro Hospitalar do Algarve, E. P. E. (510745997)","MARIFISCO - COMERCIO E SERVIÇOS UNIPESSOAL, LDA. (502292105)","126,50 €",03-12-2015,30-11-2015,30 dias,"Portugal, Faro, Lagos<BR/>Portugal, Faro, Faro<BR/>Portugal, Faro, Portimão","Artigo 20.º, n.º 1, alínea a) do Código dos Contratos Públicos",,,,,,Não aplicável.,Não aplicável.,FALSE
Aquisição Material Hoteleiro - 74/00003599/2015,Ajuste Direto Regime Geral,Aquisição de bens móveis,"33711900-6, Sabão","Centro Hospitalar do Algarve, E. P. E. (510745997)","PRODYALCA - COMÉRCIO DE PRODUTOS QUIMICOS, LDA. (506565165)","0,78 €",03-12-2015,30-11-2015,30 dias,"Portugal, Faro, Portimão<BR/>Portugal, Faro, Faro<BR/>Portugal, Faro, Lagos","Artigo 20.º, n.º 1, alínea a) do Código dos Contratos Públicos",,,,,,Não aplicável.,Não aplicável.,FALSE
Aquisição Material Hoteleiro - 74/00003599/2015,Ajuste Direto Regime Geral,Aquisição de bens móveis,"19640000-4, Sacos de polietileno para recolha de lixo e resíduos","Centro Hospitalar do Algarve, E. P. E. (510745997)","JOALPLAS, IND.PLASTICOS LDA (501891960)","9.318,80 €",03-12-2015,30-11-2015,30 dias,"Portugal, Faro, Lagos<BR/>Portugal, Faro, Faro<BR/>Portugal, Faro, Portimão","Artigo 20.º, n.º 1, alínea a) do Código dos Contratos Públicos",,,,,,Não aplicável.,Não aplicável.,FALSE
Aquisição Material Hoteleiro - 74/00003599/2015,Ajuste Direto Regime Geral,Aquisição de bens móveis,"39224300-1, Vassouras, escovas e outros artigos para limpeza doméstica<BR/>39300000-5, Equipamento diverso<BR/>33711610-6, Champôs<BR/>33761000-2, Papel higiénico","Centro Hospitalar do Algarve, E. P. E. (510745997)","JBSHIGI, Lda. (513110461)","4.075,12 €",03-12-2015,30-11-2015,30 dias,"Portugal, Faro, Lagos<BR/>Portugal, Faro, Faro<BR/>Portugal, Faro, Portimão","Artigo 20.º, n.º 1, alínea a) do Código dos Contratos Públicos",,,,,,Não aplicável.,Não aplicável.,FALSE
Aquisição Material Hoteleiro - 74/00003599/2015,Ajuste Direto Regime Geral,Aquisição de bens móveis,"39512300-7, Resguardos para colchões","Centro Hospitalar do Algarve, E. P. E. (510745997)","FLEX2000-PRODUTOS FLEXIVEIS,SA (504663232)","875,00 €",03-12-2015,30-11-2015,30 dias,"Portugal, Faro, Faro<BR/>Portugal, Faro, Portimão<BR/>Portugal, Faro, Lagos","Artigo 20.º, n.º 1, alínea a) do Código dos Contratos Públicos",,,,,,Não aplicável.,Não aplicável.,FALSE
Aquisição Material Hoteleiro - 74/00003599/2015,Ajuste Direto Regime Geral,Aquisição de bens móveis,"33711810-8, Creme de barbear","Centro Hospitalar do Algarve, E. P. E. (510745997)","DOMOTEL-MAQ EPROD DE LIMPEZA,L (501772367)","110,08 €",03-12-2015,30-11-2015,30 dias,"Portugal, Faro, Lagos<BR/>Portugal, Faro, Faro<BR/>Portugal, Faro, Portimão","Artigo 20.º, n.º 1, alínea a) do Código dos Contratos Públicos",,,,,,Não aplicável.,Não aplicável.,FALSE
Aquisição Material Hoteleiro - 74/00003599/2015,Ajuste Direto Regime Geral,Aquisição de bens móveis,"39830000-9, Produtos de limpeza<BR/>39560000-5, Artigos têxteis diversos","Centro Hospitalar do Algarve, E. P. E. (510745997)",Cleancheck Lda. (507225252),"1.187,20 €",03-12-2015,30-11-2015,30 dias,"Portugal, Faro, Portimão<BR/>Portugal, Faro, Lagos<BR/>Portugal, Faro, Faro","Artigo 20.º, n.º 1, alínea a) do Código dos Contratos Públicos",,,,,,Não aplicável.,Não aplicável.,FALSE
Aquisição Material Hoteleiro - 74/00003599/2015,Ajuste Direto Regime Geral,Aquisição de bens móveis,"33711620-9, Pentes<BR/>19520000-7, Produtos de plástico","Centro Hospitalar do Algarve, E. P. E. (510745997)",AVIQUIMICA IMPORT E MANUFATURA (500039720),"1.145,00 €",03-12-2015,30-11-2015,30 dias,"Portugal, Faro, Portimão<BR/>Portugal, Faro, Lagos<BR/>Portugal, Faro, Faro","Artigo 20.º, n.º 1, alínea a) do Código dos Contratos Públicos",,,,,,Não aplicável.,Não aplicável.,FALSE
Aquisição Material Hoteleiro - 74/00003599/2015,Ajuste Direto Regime Geral,Aquisição de bens móveis,"39831200-8, Detergentes","Centro Hospitalar do Algarve, E. P. E. (510745997)",A.MENDES DA SILVA LDA (502064080),"55,82 €",03-12-2015,30-11-2015,30 dias,"Portugal, Faro, Faro<BR/>Portugal, Faro, Portimão<BR/>Portugal, Faro, Lagos","Artigo 20.º, n.º 1, alínea a) do Código dos Contratos Públicos",,,,,,Não aplicável.,Não aplicável.,FALSE
61/3302/2015 - Reagentes,Ajuste Direto Regime Geral,Aquisição de bens móveis,"33696500-0, Reagentes de laboratório","Centro Hospitalar do Algarve, E. P. E. (510745997)",Roche Sistemas Diagnostico Lda (504282921),"11.325,00 €",03-12-2015,30-10-2015,67 dias,"Portugal, Faro, Faro","Artigo 24.º, n.º 1, alínea e) do Código dos Contratos Públicos",,,,,,Não aplicável.,Não aplicável.,FALSE
61/3307/2015 - Medicamentos Nivolumab 10 mg,Ajuste Direto Regime Geral,Aquisição de bens móveis,"33690000-3, Medicamentos vários","Centro Hospitalar do Algarve, E. P. E. (510745997)","Bristol Myers Squibb Farmacêutica Portuguesa, SA (500048193)","21.000,00 €",03-12-2015,03-11-2015,67 dias,"Portugal, Faro, Faro","Artigo 24.º, n.º 1, alínea e) do Código dos Contratos Públicos",,,,,,Não aplicável.,Não aplicável.,FALSE
61/3344/2015 - Medicamentos Gentamicina 130 mg,Ajuste Direto Regime Geral,Aquisição de bens móveis,"33690000-3, Medicamentos vários","Centro Hospitalar do Algarve, E. P. E. (510745997)",Eusapharma SAS (424347011),"9.600,00 €",03-12-2015,13-11-2015,49 dias,"Portugal, Faro, Faro","Artigo 24.º, n.º 1, alínea e) do Código dos Contratos Públicos",,,,,,Não aplicável.,Não aplicável.,FALSE
61/3364/2015 - Medicamentos Acamprosato 333 mg,Ajuste Direto Regime Geral,Aquisição de bens móveis,"33690000-3, Medicamentos vários","Centro Hospitalar do Algarve, E. P. E. (510745997)",Merck SA (500650870),"55,14 €",03-12-2015,28-10-2015,65 dias,"Portugal, Faro, Faro","Artigo 24.º, n.º 1, alínea e) do Código dos Contratos Públicos",,,,,,Não aplicável.,Não aplicável.,FALSE
61/3369/2015 - Reagentes para Bioquimica,Ajuste Direto Regime Geral,Aquisição de bens móveis,"33696500-0, Reagentes de laboratório","Centro Hospitalar do Algarve, E. P. E. (510745997)","Roche Sistemas Diagnostico, Lda (504282921)","14.064,97 €",03-12-2015,11-11-2015,58 dias,"Portugal, Faro, Faro","Artigo 24.º, n.º 1, alínea e) do Código dos Contratos Públicos",,,,,,Não aplicável.,Não aplicável.,FALSE
61/3376/2015 - Reagentes para citometria de fluxo,Ajuste Direto Regime Geral,Aquisição de bens móveis,"33696500-0, Reagentes de laboratório","Centro Hospitalar do Algarve, E. P. E. (510745997)",Enzifarma (503636975),"5.850,00 €",03-12-2015,03-11-2015,58 dias,"Portugal, Faro, Faro","Artigo 24.º, n.º 1, alínea e) do Código dos Contratos Públicos",,,,,,Não aplicável.,Não aplicável.,FALSE
61/3443/2015 - Medicamentos Fumarato de climetilo 240 mg,Ajuste Direto Regime Geral,Aquisição de bens móveis,"33690000-3, Medicamentos vários","Centro Hospitalar do Algarve, E. P. E. (510745997)",Biogen Idec Portugal (506415740),"12.676,30 €",03-12-2015,27-11-2015,35 dias,"Portugal, Faro, Faro","Artigo 24.º, n.º 1, alínea e) do Código dos Contratos Públicos",,,,,,Não aplicável.,Não aplicável.,FALSE
61/3500/2015 - reagentes para citometria de fluxo,Ajuste Direto Regime Geral,Aquisição de bens móveis,"33696500-0, Reagentes de laboratório","Centro Hospitalar do Algarve, E. P. E. (510745997)",Enzifarma (503636975),"13.650,00 €",03-12-2015,30-11-2015,32 dias,"Portugal, Faro, Faro","Artigo 24.º, n.º 1, alínea e) do Código dos Contratos Públicos",,,,,,Não aplicável.,Não aplicável.,FALSE
61/3547/2015 - Reagentes para gasimetrias,Ajuste Direto Regime Geral,Aquisição de bens móveis,"33696500-0, Reagentes de laboratório","Centro Hospitalar do Algarve, E. P. E. (510745997)",Radiometer (980201667),"6.309,07 €",03-12-2015,02-12-2015,35 dias,"Portugal, Faro, Faro","Artigo 24.º, n.º 1, alínea e) do Código dos Contratos Públicos",,,,,,Não aplicável.,Não aplicável.,FALSE
61/3602/2015 - Medicamentos Lenalidomida 25 mg,Ajuste Direto Regime Geral,Aquisição de bens móveis,"33690000-3, Medicamentos vários","Centro Hospitalar do Algarve, E. P. E. (510745997)","Celgene Sociedade Unipessoal, Lda (507791690)","16.251,42 €",03-12-2015,27-11-2015,35 dias,"Portugal, Faro, Faro","Artigo 24.º, n.º 1, alínea e) do Código dos Contratos Públicos",,,,,,Não aplicável.,Não aplicável.,FALSE
61/3202/2015 - Medicamentos Dolutegravir 50 mg,Ajuste Direto Regime Geral,Aquisição de bens móveis,"33690000-3, Medicamentos vários","Centro Hospitalar do Algarve, E. P. E. (510745997)","ViiV Healthcare Unipessoal, lda (509117961)","21.120,05 €",03-12-2015,14-10-2015,88 dias,"Portugal, Faro, Faro","Artigo 24.º, n.º 1, alínea e) do Código dos Contratos Públicos",,,,,,Não aplicável.,Não aplicável.,FALSE
61/3219/2015 - Medicamentos Daclatasvir 60 mg,Ajuste Direto Regime Geral,Aquisição de bens móveis,"33690000-3, Medicamentos vários","Centro Hospitalar do Algarve, E. P. E. (510745997)",Bristol Squibb Farmacêutica Portuguesa (500048193),"62.078,12 €",03-12-2015,14-10-2015,88 dias,"Portugal, Faro, Faro","Artigo 24.º, n.º 1, alínea e) do Código dos Contratos Públicos",,,,,,Não aplicável.,Não aplicável.,FALSE
