freguesia,acronym,validVotesPercentage,votes,dicofre
Valpedre,PPD/PSD,50.64,275,131136
Valpedre,PS,25.97,141,131136
Valpedre,PAN,4.05,22,131136
Valpedre,B.E.,3.87,21,131136
Valpedre,CDS-PP,2.95,16,131136
Valpedre,PCP-PEV,2.21,12,131136
Valpedre,A,1.84,10,131136
Valpedre,L,1.66,9,131136
Valpedre,IL,1.29,7,131136
Valpedre,PCTP/MRPP,1.29,7,131136
Valpedre,PPM.PPV/CDC,1.29,7,131136
Valpedre,PDR,0.92,5,131136
Valpedre,MAS,0.55,3,131136
Valpedre,PTP,0.55,3,131136
Valpedre,NC,0.37,2,131136
Valpedre,PNR,0.37,2,131136
Valpedre,PURP,0.18,1,131136
