freguesia,acronym,validVotesPercentage,votes,dicofre
União das freguesias de Penedono e Granja,PPD/PSD.CDS-PP,36.3,106,181211
União das freguesias de Penedono e Granja,PS,35.27,103,181211
União das freguesias de Penedono e Granja,MPT,8.22,24,181211
União das freguesias de Penedono e Granja,PCP-PEV,7.88,23,181211
União das freguesias de Penedono e Granja,B.E.,2.74,8,181211
União das freguesias de Penedono e Granja,L,2.4,7,181211
União das freguesias de Penedono e Granja,PAN,2.05,6,181211
União das freguesias de Penedono e Granja,PCTP/MRPP,1.71,5,181211
União das freguesias de Penedono e Granja,PND,1.37,4,181211
União das freguesias de Penedono e Granja,MAS,0.68,2,181211
União das freguesias de Penedono e Granja,PTP,0.68,2,181211
União das freguesias de Penedono e Granja,POUS,0.34,1,181211
União das freguesias de Penedono e Granja,PPM,0.34,1,181211
União das freguesias de Penedono e Granja,PDA,0,0,181211
União das freguesias de Penedono e Granja,PNR,0,0,181211
União das freguesias de Penedono e Granja,PPV,0,0,181211
