Objeto do Contrato,Tipo de Procedimento,Tipo(s) de Contrato,CPVs,Entidade(s) Adjudicante(s),Entidade(s) Adjudicatária(s),Preço Contratual,Data de Publicação,Data de Celebração do Contrato,Prazo de Execução,Local de Execução,Fundamentação,Data de Fecho do Contrato,Preço Total Efetivo,Causas das Alterações ao Prazo,Causas das Alterações ao Preço,Estado,N.º registo do Acordo Quadro,Descrição do Acordo Quadro,Procedimento Centralizado
42048717 - Revisão de PTJ,Ajuste Direto Regime Geral,Aquisição de bens móveis,"33140000-3, Material médico de consumo","Unidade Local de Saúde do Norte Alentejano, E. P. E. (508094461)","JOHNSON & JOHNSON, LDA (500153370)","16.511,00 €",29-09-2017,22-09-2017,1 dias,"Portugal, Portalegre, Portalegre","Artigo 20.º, n.º 1, alínea a) do Código dos Contratos Públicos",29-09-2017,"16.511,00 €",,"",,Não aplicável.,Não aplicável.,FALSE
"51001417 - P259-AC-2017- 113 - AQUISIÇÃO DE MEDICAMENTOS DESENCADEADA PELA SPMS,EPE NO ÂMBITO DO DESPACHO 1571/B 2016 - E365 - EFAVIRENZ+ENTRICITABINA+TENOFOVIR",Ao abrigo de acordo-quadro (art.º 259.º),Aquisição de bens móveis,"33000000-0, Equipamento médico, medicamentos e produtos para cuidados pessoais","Unidade Local de Saúde do Norte Alentejano, E. P. E. (508094461)",GILEAD SCIENCES LDA (503604704),"95.294,88 €",26-09-2017,03-07-2017,180 dias,"Portugal, Portalegre, Portalegre<BR/>Portugal, Portalegre, Elvas",Artigo 259.º do Código dos Contratos Públicos,31-12-2017,"23.529,60 €",,Não foi adquirida a totalidade estimada.,,2183729,Medicamentos antirretrovíricos para o tratamento da infeção por VIH,FALSE
"Fornecimento de Diverso Material de Penso, à ULSNA, EPE, para 2017",Ajuste Direto Regime Geral,Aquisição de bens móveis,"33140000-3, Material médico de consumo","Unidade Local de Saúde do N. Alentejano,EPE(ULSNA) (508094461)",PAUL HARTMANN (502271728),"3.259,95 €",22-09-2017,24-08-2017,120 dias,"Portugal, Portalegre","Artigo 20.º, n.º 1, alínea a) do Código dos Contratos Públicos",31-12-2017,"1.634,00 €",,Não foram adquiridas todas as quantidades estimadas.,,Não aplicável.,Não aplicável.,FALSE
"Fornecimento de Diverso Material de Penso à ULSNA, EPE, para 2017",Ajuste Direto Regime Geral,Aquisição de bens móveis,"33140000-3, Material médico de consumo","Unidade Local de Saúde do N. Alentejano,EPE(ULSNA) (508094461)",BSN MEDICAL S.A (505385058),"1.882,80 €",22-09-2017,24-08-2017,120 dias,"Portugal, Portalegre","Artigo 20.º, n.º 1, alínea a) do Código dos Contratos Públicos",31-12-2017,"673,80 €",,Não foram adquiridas todas as quantidades estimadas.,,Não aplicável.,Não aplicável.,FALSE
"Fornecimento de Diverso material de Penso à ULSNA, EPE, para 2017",Ajuste Direto Regime Geral,Aquisição de bens móveis,"33140000-3, Material médico de consumo","Unidade Local de Saúde do N. Alentejano,EPE(ULSNA) (508094461)",3M ESPANA S.L. SUCURSAL EM PORTUGAL (980560241),"1.051,99 €",22-09-2017,24-08-2017,120 dias,"Portugal, Portalegre","Artigo 20.º, n.º 1, alínea a) do Código dos Contratos Públicos",31-12-2017,"644,93 €",,Não foram adquiridas todas as quantidades estimadas.,,Não aplicável.,Não aplicável.,FALSE
"Fornecimento de Diverso Material de Penso à ULSNA, EPE, para 2017",Ajuste Direto Regime Geral,Aquisição de bens móveis,"33140000-3, Material médico de consumo","Unidade Local de Saúde do N. Alentejano,EPE(ULSNA) (508094461)","Abilio Freire, Lda (500432600)","4.880,47 €",22-09-2017,24-08-2017,120 dias,"Portugal, Portalegre","Artigo 20.º, n.º 1, alínea a) do Código dos Contratos Públicos",31-12-2017,"2.830,91 €",,Não foram adquiridas todas as quantidades estimadas.,,Não aplicável.,Não aplicável.,FALSE
"Fornecimento de Diverso material de Penso para a ULSNA, EPE, para 2017",Ajuste Direto Regime Geral,Aquisição de bens móveis,"33140000-3, Material médico de consumo","Unidade Local de Saúde do N. Alentejano,EPE(ULSNA) (508094461)","BASTOS VIEGAS, SA (500042772)","4.756,00 €",22-09-2017,24-08-2017,120 dias,"Portugal, Portalegre","Artigo 20.º, n.º 1, alínea a) do Código dos Contratos Públicos",31-12-2017,"2.811,64 €",,Não foram adquiridas todas as quantidades estimadas.,,Não aplicável.,Não aplicável.,FALSE
