freguesia,acronym,validVotesPercentage,votes,dicofre
"União das freguesias de Pousafoles do Bispo, Pena Lobo e Lomba",PPD/PSD.CDS-PP,48.07,87,091143
"União das freguesias de Pousafoles do Bispo, Pena Lobo e Lomba",PS,26.52,48,091143
"União das freguesias de Pousafoles do Bispo, Pena Lobo e Lomba",MPT,11.05,20,091143
"União das freguesias de Pousafoles do Bispo, Pena Lobo e Lomba",PCP-PEV,3.87,7,091143
"União das freguesias de Pousafoles do Bispo, Pena Lobo e Lomba",B.E.,2.21,4,091143
"União das freguesias de Pousafoles do Bispo, Pena Lobo e Lomba",PPM,2.21,4,091143
"União das freguesias de Pousafoles do Bispo, Pena Lobo e Lomba",PND,1.66,3,091143
"União das freguesias de Pousafoles do Bispo, Pena Lobo e Lomba",MAS,1.1,2,091143
"União das freguesias de Pousafoles do Bispo, Pena Lobo e Lomba",PAN,1.1,2,091143
"União das freguesias de Pousafoles do Bispo, Pena Lobo e Lomba",PCTP/MRPP,0.55,1,091143
"União das freguesias de Pousafoles do Bispo, Pena Lobo e Lomba",PNR,0.55,1,091143
"União das freguesias de Pousafoles do Bispo, Pena Lobo e Lomba",POUS,0.55,1,091143
"União das freguesias de Pousafoles do Bispo, Pena Lobo e Lomba",PTP,0.55,1,091143
"União das freguesias de Pousafoles do Bispo, Pena Lobo e Lomba",L,0,0,091143
"União das freguesias de Pousafoles do Bispo, Pena Lobo e Lomba",PDA,0,0,091143
"União das freguesias de Pousafoles do Bispo, Pena Lobo e Lomba",PPV,0,0,091143
