freguesia,acronym,validVotesPercentage,votes,dicofre
Carvalhas,PPD/PSD,45.36,166,030221
Carvalhas,PS,36.89,135,030221
Carvalhas,B.E.,4.92,18,030221
Carvalhas,CDS-PP,4.64,17,030221
Carvalhas,PAN,2.19,8,030221
Carvalhas,R.I.R.,2.19,8,030221
Carvalhas,MPT,0.82,3,030221
Carvalhas,PCP-PEV,0.82,3,030221
Carvalhas,L,0.55,2,030221
Carvalhas,A,0.27,1,030221
Carvalhas,CH,0.27,1,030221
Carvalhas,IL,0.27,1,030221
Carvalhas,NC,0.27,1,030221
Carvalhas,PCTP/MRPP,0.27,1,030221
Carvalhas,PURP,0.27,1,030221
Carvalhas,JPP,0,0,030221
Carvalhas,MAS,0,0,030221
Carvalhas,PDR,0,0,030221
Carvalhas,PNR,0,0,030221
Carvalhas,PPM,0,0,030221
Carvalhas,PTP,0,0,030221
