Objeto do Contrato,Tipo de Procedimento,Tipo(s) de Contrato,CPVs,Entidade(s) Adjudicante(s),Entidade(s) Adjudicatária(s),Preço Contratual,Data de Publicação,Data de Celebração do Contrato,Prazo de Execução,Local de Execução,Fundamentação,Data de Fecho do Contrato,Preço Total Efetivo,Causas das Alterações ao Prazo,Causas das Alterações ao Preço,Estado,N.º registo do Acordo Quadro,Descrição do Acordo Quadro,Procedimento Centralizado
O presente contrato tem por objecto o fornecimento de Membranas para aparelho de gases ABL735GL.,Ajuste Direto Regime Geral,Aquisição de bens móveis,"33696000-5, Reagentes e meios de contraste",Centro Hospitalar de Lisboa Central E.P.E. (508080142),"Radiometer Ibérica, S.L. (980201667)","11.216,99 €",28-08-2012,23-07-2012,162 dias,"Portugal, Lisboa, Lisboa","Artigo 24.º, n.º 1, alínea e) do Código dos Contratos Públicos",,,,,,Não aplicável.,Não aplicável.,
O presente contrato tem por objecto o fornecimento de reagentes para aparelho de gases ABL735GL.,Ajuste Direto Regime Geral,Aquisição de bens móveis,"33696000-5, Reagentes e meios de contraste",Centro Hospitalar de Lisboa Central E.P.E. (508080142),"Radiometer Ibérica, S.L. (980201667)","11.969,63 €",28-08-2012,24-07-2012,161 dias,"Portugal, Lisboa, Lisboa","Artigo 24.º, n.º 1, alínea e) do Código dos Contratos Públicos",,,,,,Não aplicável.,Não aplicável.,
Reagentes para aparelho de Gases ABL735GL,Ajuste Direto Regime Geral,Aquisição de bens móveis,"33696000-5, Reagentes e meios de contraste",Centro Hospitalar de Lisboa Central E.P.E. (508080142),"Radiometer Ibérica, S.L. (980201667)","11.969,63 €",27-08-2012,28-03-2012,279 dias,"Portugal, Lisboa, Lisboa","Artigo 24.º, n.º 1, alínea e) do Código dos Contratos Públicos",,,,,,Não aplicável.,Não aplicável.,
"Prestação de Serviços de Custódia e Gestão dos Arquivos Intermédios da Maternidade Dr. Alfredo da Costa, Janeiro a Junho 2012.",Ajuste Direto Regime Geral,Aquisição de serviços,"66162000-3, Serviços de custódia",Centro Hospitalar de Lisboa Central E.P.E. (508080142),"EAD - Empresa de Arquivo e Documentação, S.A. (507616944)","6.181,76 €",27-08-2012,16-05-2012,182 dias,"Portugal, Lisboa, Lisboa","Artigo 24.º, n.º 1, alínea e) do Código dos Contratos Públicos",,,,,,Não aplicável.,Não aplicável.,
"Prestação de Serviços de Técnica de Audiologia na Maternidade Dr. Alfredo da Costa, durante o ano de 2012.",Ajuste Direto Regime Geral,Aquisição de serviços,"85121240-7, Serviços de otorrinolaringologia ou audiologia",Centro Hospitalar de Lisboa Central E.P.E. (508080142),Nance Diana Rosa Neves (226959619),"14.560,00 €",27-08-2012,04-05-2012,365 dias,"Portugal, Lisboa, Lisboa","Artigo 20.º, n.º 1, alínea a) do Código dos Contratos Públicos",,,,,,Não aplicável.,Não aplicável.,
"Aquisição de Serviços de Assistentes Operacionais, de 1 de Abril a 30 de Setembro de 2012, para a Maternidade Dr. Alfredo da Costa",Ajuste Direto Regime Geral,Aquisição de serviços,"79610000-3, Serviços de colocação de pessoal",Centro Hospitalar de Lisboa Central E.P.E. (508080142),"Helped, Prestação de Serviços de Saúde, Lda. (506069010)","165.408,60 €",27-08-2012,24-04-2012,183 dias,"Portugal, Lisboa, Lisboa","Artigo 27.º, n.º 1, alínea a) do Código dos Contratos Públicos",,,,,,Não aplicável.,Não aplicável.,
"Prestação de serviços de alimentação a utentes e colaboradores da Maternidade Dr. Alfredo da Costa, durante o mês de Março de 2012.",Ajuste Direto Regime Geral,Aquisição de serviços,"55510000-8, Serviços de cantinas",Centro Hospitalar de Lisboa Central E.P.E. (508080142),"Solnave - Restaurantes e Alimentação, S.A. (500272328)","35.751,31 €",27-08-2012,26-04-2012,31 dias,"Portugal, Lisboa, Lisboa","Artigo 20.º, n.º 1, alínea a) do Código dos Contratos Públicos",,,,,,Não aplicável.,Não aplicável.,
