freguesia,acronym,validVotesPercentage,votes,dicofre
Sendim,PPD/PSD.CDS-PP,46.07,41,181913
Sendim,PS,35.96,32,181913
Sendim,MPT,12.36,11,181913
Sendim,PCP-PEV,3.37,3,181913
Sendim,B.E.,1.12,1,181913
Sendim,PCTP/MRPP,1.12,1,181913
Sendim,L,0,0,181913
Sendim,MAS,0,0,181913
Sendim,PAN,0,0,181913
Sendim,PDA,0,0,181913
Sendim,PND,0,0,181913
Sendim,PNR,0,0,181913
Sendim,POUS,0,0,181913
Sendim,PPM,0,0,181913
Sendim,PPV,0,0,181913
Sendim,PTP,0,0,181913
