freguesia,acronym,validVotesPercentage,votes,dicofre
União das freguesias de Travassô e Óis da Ribeira,PS,38.23,268,010125
União das freguesias de Travassô e Óis da Ribeira,PPD/PSD,32.67,229,010125
União das freguesias de Travassô e Óis da Ribeira,CDS-PP,9.99,70,010125
União das freguesias de Travassô e Óis da Ribeira,B.E.,7.42,52,010125
União das freguesias de Travassô e Óis da Ribeira,PAN,3.42,24,010125
União das freguesias de Travassô e Óis da Ribeira,PCP-PEV,1.71,12,010125
União das freguesias de Travassô e Óis da Ribeira,PPM.PPV/CDC,1.57,11,010125
União das freguesias de Travassô e Óis da Ribeira,A,0.86,6,010125
União das freguesias de Travassô e Óis da Ribeira,NC,0.86,6,010125
União das freguesias de Travassô e Óis da Ribeira,L,0.71,5,010125
União das freguesias de Travassô e Óis da Ribeira,IL,0.57,4,010125
União das freguesias de Travassô e Óis da Ribeira,PCTP/MRPP,0.57,4,010125
União das freguesias de Travassô e Óis da Ribeira,PDR,0.57,4,010125
União das freguesias de Travassô e Óis da Ribeira,PNR,0.57,4,010125
União das freguesias de Travassô e Óis da Ribeira,MAS,0.14,1,010125
União das freguesias de Travassô e Óis da Ribeira,PTP,0.14,1,010125
União das freguesias de Travassô e Óis da Ribeira,PURP,0,0,010125
