freguesia,acronym,validVotesPercentage,votes,dicofre
Baltar,PS,43.93,662,131003
Baltar,PPD/PSD,26.28,396,131003
Baltar,B.E.,6.77,102,131003
Baltar,CDS-PP,6.44,97,131003
Baltar,PAN,4.51,68,131003
Baltar,PCP-PEV,3.12,47,131003
Baltar,NC,1.33,20,131003
Baltar,A,1.26,19,131003
Baltar,L,1.13,17,131003
Baltar,PCTP/MRPP,1.13,17,131003
Baltar,PPM.PPV/CDC,1.13,17,131003
Baltar,IL,0.8,12,131003
Baltar,PDR,0.66,10,131003
Baltar,PNR,0.46,7,131003
Baltar,PTP,0.4,6,131003
Baltar,PURP,0.4,6,131003
Baltar,MAS,0.27,4,131003
