Objeto do Contrato,Tipo de Procedimento,Tipo(s) de Contrato,CPVs,Entidade(s) Adjudicante(s),Entidade(s) Adjudicatária(s),Preço Contratual,Data de Publicação,Data de Celebração do Contrato,Prazo de Execução,Local de Execução,Fundamentação,Data de Fecho do Contrato,Preço Total Efetivo,Causas das Alterações ao Prazo,Causas das Alterações ao Preço,Estado,N.º registo do Acordo Quadro,Descrição do Acordo Quadro,Procedimento Centralizado
AD 3178-2016 Prestação de Serviços de Assessoria Jurídica Corrente,Ajuste Direto Regime Geral,Aquisição de serviços,"79111000-5, Serviços de assessoria jurídica","Centro Hospitalar de Trás-os-Montes e Alto Douro, E. P. E. (508100496)",CUATRECASAS GONÇALVES PEREIRA E ASSOCIADOS - SOC. ADVOGADOS RL (502101210),"5.000,00 €",02-01-2017,04-08-2016,365 dias,"Portugal, Vila Real, Vila Real","Artigo 20.º, n.º 1, alínea a) do Código dos Contratos Públicos",14-12-2016,"5.000,00 €",,,,Não aplicável.,Não aplicável.,FALSE
AD 3144-2016 Fornecimento e Instalação de Rede de Gases Medicinais  da Urgência do NHPL,Ajuste Direto Regime Geral,Aquisição de bens móveis,"24111500-0, Gases médicos","Centro Hospitalar de Trás-os-Montes e Alto Douro, E. P. E. (508100496)","Gasin II - Gases Industriais, Unipessoal, Lda (510183751)","6.754,90 €",02-01-2017,22-07-2016,365 dias,"Portugal, Viseu, Lamego","Artigo 20.º, n.º 1, alínea a) do Código dos Contratos Públicos",23-09-2016,"6.754,90 €",,,,Não aplicável.,Não aplicável.,FALSE
