Objeto do Contrato,Tipo de Procedimento,Tipo(s) de Contrato,CPVs,Entidade(s) Adjudicante(s),Entidade(s) Adjudicatária(s),Preço Contratual,Data de Publicação,Data de Celebração do Contrato,Prazo de Execução,Local de Execução,Fundamentação,Data de Fecho do Contrato,Preço Total Efetivo,Causas das Alterações ao Prazo,Causas das Alterações ao Preço,Estado,N.º registo do Acordo Quadro,Descrição do Acordo Quadro,Procedimento Centralizado
"Prestação de Serviços Médicos na UCI do HDJMG, na ULSNA, EPE (Período máximo jan a dez 2018)",Ajuste Direto Regime Geral,Aquisição de serviços,"85100000-0, Serviços de saúde","Unidade Local de Saúde do Norte Alentejano, E. P. E. (508094461)","Honorismédica, Lda (509799191)","43.680,00 €",09-02-2018,02-02-2018,365 dias,"Portugal, Portalegre, Portalegre","Artigo 24.º, n.º 1, alínea c) do Código dos Contratos Públicos","","",,,,Não aplicável.,Não aplicável.,FALSE
"Contrato - Prestação de Serviços Médicos no Centro de Saúde de Ponte de Sôr, na ULSNA, EPE ( Ano 2018)",Ajuste Direto Regime Geral,Aquisição de serviços,"85100000-0, Serviços de saúde","Unidade Local de Saúde do Norte Alentejano, E. P. E. (508094461)","Honorismédica, Lda (509799191)","110.880,00 €",09-02-2018,02-02-2018,365 dias,"Portugal, Portalegre, Ponte de Sor","Artigo 27.º, n.º 1, alínea a) do Código dos Contratos Públicos","","",,,,Não aplicável.,Não aplicável.,FALSE
"Contrato - Prestação de Serviços Médicos no Serviço de Urgência Básica de Ponte de Sôr, na ULSNA, EPE (Período máx jan a jun 2018)",Ajuste Direto Regime Geral,Aquisição de serviços,"85100000-0, Serviços de saúde","Unidade Local de Saúde do Norte Alentejano, E. P. E. (508094461)","Honorismédica, Lda (509799191)","137.148,00 €",09-02-2018,01-02-2018,181 dias,"Portugal, Portalegre, Ponte de Sor","Artigo 24.º, n.º 1, alínea c) do Código dos Contratos Públicos","","",,,,Não aplicável.,Não aplicável.,FALSE
"Contrato - Prestação de Serviços Médicos no Centro de Saúde de Nisa, na ULSNA, EPE (Período máximo Janeiro a Junho 2018)",Ajuste Direto Regime Geral,Aquisição de serviços,"85100000-0, Serviços de saúde","Unidade Local de Saúde do Norte Alentejano, E. P. E. (508094461)","Honorismédica, Lda (509799191)","9.240,00 €",09-02-2018,01-02-2018,181 dias,"Portugal, Portalegre, Portalegre","Artigo 24.º, n.º 1, alínea c) do Código dos Contratos Públicos","","",,,,Não aplicável.,Não aplicável.,FALSE
PRESTAÇÃO DE SERVIÇOS DE SEGURO DE ACIDENTES DE TRABALHO ANO 2018,Ajuste Direto Regime Geral,Aquisição de serviços,"66000000-0, Serviços de finanças e seguros","Unidade Local de Saúde do Norte Alentejano, E. P. E. (508094461)",COMPANHIA DE SEGUROS TRANQUILIDADE (500940231),"175.000,00 €",08-02-2018,11-01-2018,365 dias,"Portugal, Portalegre, Portalegre","Artigo 27.º, n.º 1, alínea a) do Código dos Contratos Públicos",11-01-2018,"175.000,00 €",,,,Não aplicável.,Não aplicável.,FALSE
"Aquisição de Produtos de Nutrição para a ULSNA, em 2018.",Ajuste Direto Regime Geral,Aquisição de bens móveis,"33600000-6, Produtos farmacêuticos","Unidade Local de Saúde do N. Alentejano,EPE(ULSNA) (508094461)","FRESENIUS KABI PHARMA PORTUGAL, LDA. (504293753)","717,23 €",08-02-2018,08-02-2018,365 dias,"Portugal, Portalegre, Elvas","Artigo 20.º, n.º 1, alínea a) do Código dos Contratos Públicos","","",,,,Não aplicável.,Não aplicável.,FALSE
"Aquisição de Produtos de Nutrição para a ULSNA, em 2018.",Ajuste Direto Regime Geral,Aquisição de bens móveis,"33600000-6, Produtos farmacêuticos","Unidade Local de Saúde do N. Alentejano,EPE(ULSNA) (508094461)","Nestlé Portugal, S.A. (500201307)","757,36 €",08-02-2018,08-02-2018,365 dias,"Portugal, Portalegre, Elvas","Artigo 20.º, n.º 1, alínea a) do Código dos Contratos Públicos","","",,,,Não aplicável.,Não aplicável.,FALSE
"Aquisição de Produtos de Nutrição para a ULSNA, em 2018.",Ajuste Direto Regime Geral,Aquisição de bens móveis,"33600000-6, Produtos farmacêuticos","Unidade Local de Saúde do N. Alentejano,EPE(ULSNA) (508094461)","Nutricia Advanced Medical Nutrition Unipessoal, Lda (507558286)","6.608,16 €",08-02-2018,08-02-2018,365 dias,"Portugal, Portalegre, Elvas","Artigo 20.º, n.º 1, alínea a) do Código dos Contratos Públicos","","",,,,Não aplicável.,Não aplicável.,FALSE
"51006718-P259-AC-2017-196-AQUISIÇÃO DE MEDICAMENTOS DESENCADEADA PELA SPMS,EPE NO ÂMBITO DO DESPACHO 1571/b 2016 - S348.",Ao abrigo de acordo-quadro (art.º 259.º),Aquisição de bens móveis,"33600000-6, Produtos farmacêuticos","Unidade Local de Saúde do Norte Alentejano, E. P. E. (508094461)","PFIZER BIOFARMACEUTICA, SOCIEDADE UNIPESSOAL, LDA (513300376)","3.760,40 €",07-02-2018,07-02-2018,365 dias,"Portugal, Portalegre, Elvas",Artigo 259.º do Código dos Contratos Públicos,"","",,,,1771819,CP 2015/6 - Acordo quadro para o fornecimento de Medicamentos do Foro Oncológico,FALSE
"Fornecimento de Agulhas, Seringas e Contentores, à ULSNA, EPE, em 2018",Ao abrigo de acordo-quadro (art.º 259.º),Aquisição de bens móveis,"33140000-3, Material médico de consumo","Unidade Local de Saúde do Norte Alentejano, E. P. E. (508094461)","B. BRAUN MEDICAL, LDA (501506543)","5.696,75 €",02-02-2018,25-01-2018,365 dias,"Portugal, Portalegre",Artigo 259.º do Código dos Contratos Públicos,"","",,,,1341769,"ACORDO QUADRO PARA FORNECIMENTO DE SERINGAS, AGULHAS E CONTENTORES ÀS INSTITUIÇÕES E SERVIÇOS DO SERVIÇO NACIONAL DE SAÚDE PROGRAMA DE CONCURSO",FALSE
Fornecimento de Pensos Especiais á ULSNA EPE (2017) -Acordo Quadro 81/2016 da SPMS,Ao abrigo de acordo-quadro (art.º 259.º),Aquisição de bens móveis,"33000000-0, Equipamento médico, medicamentos e produtos para cuidados pessoais","Unidade Local de Saúde do Norte Alentejano, E. P. E. (508094461)",3M ESPANHA S.L. SUCURSAL EM PORTUGAL (980560241),"626,40 €",02-02-2018,01-06-2017,214 dias,"Portugal, Portalegre, Portalegre",Artigo 259.º do Código dos Contratos Públicos,31-12-2017,"626,40 €",,,,2183748,Pensos especiais,FALSE
"Fornecimento de Agulhas, Seringas e Contentores, à ULSNA, EPE, em 2018",Ao abrigo de acordo-quadro (art.º 259.º),Aquisição de bens móveis,"33140000-3, Material médico de consumo","Unidade Local de Saúde do Norte Alentejano, E. P. E. (508094461)","OVERPHARMA - PROD. MÉDICOS E FARMACÊUTICOS, LDA. (505792362)","1.640,00 €",02-02-2018,25-01-2018,365 dias,"Portugal, Portalegre",Artigo 259.º do Código dos Contratos Públicos,"","",,,,1341769,"ACORDO QUADRO PARA FORNECIMENTO DE SERINGAS, AGULHAS E CONTENTORES ÀS INSTITUIÇÕES E SERVIÇOS DO SERVIÇO NACIONAL DE SAÚDE PROGRAMA DE CONCURSO",FALSE
"Fornecimento de Agulhas, Seringas e Contentores, à ULSNA, EPE, em 2018",Ao abrigo de acordo-quadro (art.º 259.º),Aquisição de bens móveis,"33140000-3, Material médico de consumo","Unidade Local de Saúde do Norte Alentejano, E. P. E. (508094461)","BECTON DICKINSON PORTUGAL, UNIPESSOAL, LDA (514239743)","6.273,60 €",02-02-2018,25-01-2018,365 dias,"Portugal, Portalegre",Artigo 259.º do Código dos Contratos Públicos,"","",,,,1341769,"ACORDO QUADRO PARA FORNECIMENTO DE SERINGAS, AGULHAS E CONTENTORES ÀS INSTITUIÇÕES E SERVIÇOS DO SERVIÇO NACIONAL DE SAÚDE PROGRAMA DE CONCURSO",FALSE
"Fornecimento de Seringas, Agulhas e Contentores, à ULSNA, EPE, em 2018",Ao abrigo de acordo-quadro (art.º 259.º),Aquisição de bens móveis,"33140000-3, Material médico de consumo","Unidade Local de Saúde do Norte Alentejano, E. P. E. (508094461)",Anastácio Saldanha Unipessoal Lda. (505804441),"2.255,50 €",02-02-2018,25-01-2018,365 dias,"Portugal, Portalegre",Artigo 259.º do Código dos Contratos Públicos,"","",,,,1341769,"ACORDO QUADRO PARA FORNECIMENTO DE SERINGAS, AGULHAS E CONTENTORES ÀS INSTITUIÇÕES E SERVIÇOS DO SERVIÇO NACIONAL DE SAÚDE PROGRAMA DE CONCURSO",FALSE
"Prestação de Serviços Médicos na Triagem do Serviço de Urgência do HDJMG, na ULSNA, EPE (Período máximo de Janeiro a Dezembro de 2018)",Ajuste Direto Regime Geral,Aquisição de serviços,"85100000-0, Serviços de saúde","Unidade Local de Saúde do Norte Alentejano, E. P. E. (508094461)","Betwin Universe, Unipessoal, Lda (510272380)","54.912,00 €",02-02-2018,01-02-2018,365 dias,"Portugal, Portalegre, Portalegre","Artigo 24.º, n.º 1, alínea c) do Código dos Contratos Públicos","","",,,,Não aplicável.,Não aplicável.,FALSE
"Prestação de Serviços Médicos na Triagem do Serviço de Urgência do HDJMG, na ULSNA, EPE (Período máximo de Janeiro a Dezembro de 2018)",Ajuste Direto Regime Geral,Aquisição de serviços,"85100000-0, Serviços de saúde","Unidade Local de Saúde do Norte Alentejano, E. P. E. (508094461)","Palpite Garantido Actividades Médicas, Lda (514494964)","82.368,00 €",02-02-2018,01-02-2018,365 dias,"Portugal, Portalegre, Portalegre","Artigo 24.º, n.º 1, alínea c) do Código dos Contratos Públicos","","",,,,Não aplicável.,Não aplicável.,FALSE
"Prestação de Serviços Médicos no Serviço de Urgência do HDJMG, na ULSNA, EPE (Periodo máximo Janeiro a Dezembro de 2018)",Ajuste Direto Regime Geral,Aquisição de serviços,"85100000-0, Serviços de saúde","Unidade Local de Saúde do Norte Alentejano, E. P. E. (508094461)","DMGF-Serviços Médicos, Lda (514435283)","109.824,00 €",02-02-2018,31-01-2018,365 dias,"Portugal, Portalegre, Portalegre","Artigo 24.º, n.º 1, alínea c) do Código dos Contratos Públicos","","",,,,Não aplicável.,Não aplicável.,FALSE
"Prestação de Serviços Médicos para a Triagem dos Serviços de Urgência - HSLE, na ULSNA, EPE (Ano 2018)",Ajuste Direto Regime Geral,Aquisição de serviços,"85100000-0, Serviços de saúde","Unidade Local de Saúde do Norte Alentejano, E. P. E. (508094461)","FELICIANO PIRES- SERVIÇOS MÉDICOS, LDA. (513893822)","22.608,00 €",01-02-2018,31-01-2018,365 dias,"Portugal, Portalegre, Elvas","Artigo 24.º, n.º 1, alínea c) do Código dos Contratos Públicos","","",,,,Não aplicável.,Não aplicável.,FALSE
"Fornecimento de Seringas, Agulhas e Contentores, à ULSNA, EPE, em 2018",Ao abrigo de acordo-quadro (art.º 259.º),Aquisição de bens móveis,"33140000-3, Material médico de consumo","Unidade Local de Saúde do Norte Alentejano, E. P. E. (508094461)","DOCWORLD, Lda (508592909)","1.567,18 €",01-02-2018,25-01-2018,365 dias,"Portugal, Portalegre",Artigo 259.º do Código dos Contratos Públicos,"","",,,,1341769,"ACORDO QUADRO PARA FORNECIMENTO DE SERINGAS, AGULHAS E CONTENTORES ÀS INSTITUIÇÕES E SERVIÇOS DO SERVIÇO NACIONAL DE SAÚDE PROGRAMA DE CONCURSO",FALSE
"Fornecimento de Seringas, Agulhas e Contentores, à ULSNA, EPE, em 2018",Ao abrigo de acordo-quadro (art.º 259.º),Aquisição de bens móveis,"33140000-3, Material médico de consumo","Unidade Local de Saúde do Norte Alentejano, E. P. E. (508094461)","Ambimed-Gestão Ambiental, Lda (503593427)","5.797,10 €",01-02-2018,25-01-2018,365 dias,"Portugal, Portalegre",Artigo 259.º do Código dos Contratos Públicos,"","",,,,1341769,"ACORDO QUADRO PARA FORNECIMENTO DE SERINGAS, AGULHAS E CONTENTORES ÀS INSTITUIÇÕES E SERVIÇOS DO SERVIÇO NACIONAL DE SAÚDE PROGRAMA DE CONCURSO",FALSE
"51006318-P259-AC-2017-176-AQUISIÇÃO DE MEDICAMENTOS DESENCADEADA PELA SPMS,EPE NO ÂMBITO DO DESPACHO 1571/b 2016 - E552, L526.",Ao abrigo de acordo-quadro (art.º 259.º),Aquisição de bens móveis,"33000000-0, Equipamento médico, medicamentos e produtos para cuidados pessoais","Unidade Local de Saúde do Norte Alentejano, E. P. E. (508094461)",ASTELLAS FARMA LDA (502540249),"473.505,00 €",01-02-2018,01-02-2018,365 dias,"Portugal, Portalegre, Elvas",Artigo 259.º do Código dos Contratos Públicos,"","",,,,1771819,CP 2015/6 - Acordo quadro para o fornecimento de Medicamentos do Foro Oncológico,FALSE
"Fornecimento de Seringas, Agulhas e Contentores, à ULSNA, EPE, em 2018",Ao abrigo de acordo-quadro (art.º 259.º),Aquisição de bens móveis,"33140000-3, Material médico de consumo","Unidade Local de Saúde do Norte Alentejano, E. P. E. (508094461)","PERGUT PORTUGAL COM  PRODUTOS HOSPIT. MEDICOS, LDA (501799729)","1.108,15 €",01-02-2018,25-01-2018,365 dias,"Portugal, Portalegre",Artigo 259.º do Código dos Contratos Públicos,"","",,,,1341769,"ACORDO QUADRO PARA FORNECIMENTO DE SERINGAS, AGULHAS E CONTENTORES ÀS INSTITUIÇÕES E SERVIÇOS DO SERVIÇO NACIONAL DE SAÚDE PROGRAMA DE CONCURSO",FALSE
REAGENTES HEMATOLOGIA (EQUIPAMENTO NOVO),Ajuste Direto Regime Geral,Aquisição de bens móveis,"33000000-0, Equipamento médico, medicamentos e produtos para cuidados pessoais","Unidade Local de Saúde do Norte Alentejano, E. P. E. (508094461)",EMILIO DE AZEVEDO CAMPOS SA (500094853),"6.962,00 €",01-02-2018,21-12-2017,365 dias,"Portugal, Portalegre, Portalegre<BR/>Portugal, Portalegre, Elvas","Artigo 24.º, n.º 1, alínea e) do Código dos Contratos Públicos","","",,,,Não aplicável.,Não aplicável.,FALSE
REAGENTES,Ajuste Direto Regime Geral,Aquisição de bens móveis,"33000000-0, Equipamento médico, medicamentos e produtos para cuidados pessoais","Unidade Local de Saúde do Norte Alentejano, E. P. E. (508094461)",ROCHE SISTEMA DE DIAGNOSTICOS (504282921),"6.307,80 €",01-02-2018,21-12-2017,365 dias,"Portugal, Portalegre, Elvas<BR/>Portugal, Portalegre, Portalegre","Artigo 24.º, n.º 1, alínea e) do Código dos Contratos Públicos","","",,,,Não aplicável.,Não aplicável.,FALSE
"Fornecimento de Seringas, Agulhas e Contentores, à ULSNA, EPE, em 2018",Ao abrigo de acordo-quadro (art.º 259.º),Aquisição de bens móveis,"33140000-3, Material médico de consumo","Unidade Local de Saúde do Norte Alentejano, E. P. E. (508094461)","Normax - Fabrica de Vidros Cientificos, Lda. (500203130)","636,00 €",01-02-2018,25-01-2018,365 dias,"Portugal, Portalegre",Artigo 259.º do Código dos Contratos Públicos,"","",,,,1341769,"ACORDO QUADRO PARA FORNECIMENTO DE SERINGAS, AGULHAS E CONTENTORES ÀS INSTITUIÇÕES E SERVIÇOS DO SERVIÇO NACIONAL DE SAÚDE PROGRAMA DE CONCURSO",FALSE
"Fornecimento de Seringas, Agulhas e Contentores, à ULSNA, EPE, em 2018",Ao abrigo de acordo-quadro (art.º 259.º),Aquisição de bens móveis,"33140000-3, Material médico de consumo","Unidade Local de Saúde do Norte Alentejano, E. P. E. (508094461)",QUILABAN QUIMICA LAB ANALITICA (500399670),"9.177,80 €",01-02-2018,25-01-2018,365 dias,"Portugal, Portalegre",Artigo 259.º do Código dos Contratos Públicos,"","",,,,1341769,"ACORDO QUADRO PARA FORNECIMENTO DE SERINGAS, AGULHAS E CONTENTORES ÀS INSTITUIÇÕES E SERVIÇOS DO SERVIÇO NACIONAL DE SAÚDE PROGRAMA DE CONCURSO",FALSE
REAGENTES,Ajuste Direto Regime Geral,Aquisição de bens móveis,"33000000-0, Equipamento médico, medicamentos e produtos para cuidados pessoais","Unidade Local de Saúde do Norte Alentejano, E. P. E. (508094461)",ROCHE SISTEMA DE DIAGNOSTICOS (504282921),"9.355,56 €",01-02-2018,14-12-2017,365 dias,"Portugal, Portalegre, Portalegre<BR/>Portugal, Portalegre, Elvas","Artigo 24.º, n.º 1, alínea e) do Código dos Contratos Públicos","","",,,,Não aplicável.,Não aplicável.,FALSE
MEDICAMENTOS,Ajuste Direto Regime Geral,Aquisição de bens móveis,"33000000-0, Equipamento médico, medicamentos e produtos para cuidados pessoais","Unidade Local de Saúde do Norte Alentejano, E. P. E. (508094461)",ROCHE SISTEMA DE DIAGNOSTICOS (504282921),"8.031,60 €",01-02-2018,14-12-2017,365 dias,"Portugal, Portalegre, Portalegre<BR/>Portugal, Portalegre, Elvas","Artigo 24.º, n.º 1, alínea e) do Código dos Contratos Públicos","","",,,,Não aplicável.,Não aplicável.,FALSE
"PRESTAÇÃO DE SERVIÇOS DE MANUTENÇÃO DO SISTEMA DE INFORMAÇÃO ALERT – EDIS NA ULSNA, EPE",Ajuste Direto Regime Geral,Aquisição de serviços,"72000000-5, Serviços de TI: consultoria, desenvolvimento de software, Internet e apoio","Unidade Local de Saúde do Norte Alentejano, E. P. E. (508094461)","Alert, SA (507567455)","51.894,00 €",01-02-2018,30-11-2017,365 dias,"Portugal, Portalegre, Portalegre","Artigo 24.º, n.º 1, alínea e) do Código dos Contratos Públicos","","",,,,Não aplicável.,Não aplicável.,FALSE
REAGENTES,Ajuste Direto Regime Geral,Aquisição de bens móveis,"33000000-0, Equipamento médico, medicamentos e produtos para cuidados pessoais","Unidade Local de Saúde do Norte Alentejano, E. P. E. (508094461)",THERMO FISHER DIAGNOSTICS (506916243),"5.938,32 €",01-02-2018,03-11-2017,365 dias,"Portugal, Portalegre, Portalegre<BR/>Portugal, Portalegre, Elvas","Artigo 24.º, n.º 1, alínea e) do Código dos Contratos Públicos","","",,,,Não aplicável.,Não aplicável.,FALSE
MEDICAMENTOS,Ajuste Direto Regime Geral,Aquisição de bens móveis,"33000000-0, Equipamento médico, medicamentos e produtos para cuidados pessoais","Unidade Local de Saúde do N. Alentejano,EPE(ULSNA) (508094461)",ROCHE SISTEMA DE DIAGNOSTICOS (504282921),"8.031,60 €",01-02-2018,03-11-2017,365 dias,"Portugal, Portalegre, Portalegre<BR/>Portugal, Portalegre, Elvas","Artigo 24.º, n.º 1, alínea e) do Código dos Contratos Públicos","","",,,,Não aplicável.,Não aplicável.,FALSE
REAGENTES,Ajuste Direto Regime Geral,Aquisição de bens móveis,"33000000-0, Equipamento médico, medicamentos e produtos para cuidados pessoais","Unidade Local de Saúde do Norte Alentejano, E. P. E. (508094461)",ROCHE SISTEMA DE DIAGNOSTICOS (504282921),"5.722,56 €",01-02-2018,03-11-2017,365 dias,"Portugal, Portalegre, Portalegre<BR/>Portugal, Portalegre, Elvas","Artigo 24.º, n.º 1, alínea e) do Código dos Contratos Públicos","","",,,,Não aplicável.,Não aplicável.,FALSE
REAGENTES,Ajuste Direto Regime Geral,Aquisição de bens móveis,"33000000-0, Equipamento médico, medicamentos e produtos para cuidados pessoais","Unidade Local de Saúde do Norte Alentejano, E. P. E. (508094461)",THERMO FISHER DIAGNOSTICS (506916243),"7.299,11 €",01-02-2018,17-10-2017,365 dias,"Portugal, Portalegre, Portalegre<BR/>Portugal, Portalegre, Elvas","Artigo 24.º, n.º 1, alínea e) do Código dos Contratos Públicos","","",,,,Não aplicável.,Não aplicável.,FALSE
MEDICAMENTOS,Ajuste Direto Regime Geral,Aquisição de bens móveis,"33000000-0, Equipamento médico, medicamentos e produtos para cuidados pessoais","Unidade Local de Saúde do Norte Alentejano, E. P. E. (508094461)",BRISTOL - MYERS SQUIBB SA. (500048193),"6.864,00 €",01-02-2018,17-10-2017,365 dias,"Portugal, Portalegre, Elvas<BR/>Portugal, Portalegre, Portalegre","Artigo 24.º, n.º 1, alínea e) do Código dos Contratos Públicos","","",,,,Não aplicável.,Não aplicável.,FALSE
MEDICAMENTOS,Ajuste Direto Regime Geral,Aquisição de bens móveis,"33000000-0, Equipamento médico, medicamentos e produtos para cuidados pessoais","Unidade Local de Saúde do Norte Alentejano, E. P. E. (508094461)",BRISTOL - MYERS SQUIBB SA. (500048193),"9.768,00 €",01-02-2018,17-10-2017,365 dias,"Portugal, Portalegre, Portalegre<BR/>Portugal, Portalegre, Elvas","Artigo 24.º, n.º 1, alínea e) do Código dos Contratos Públicos","","",,,,Não aplicável.,Não aplicável.,FALSE
