Objeto do Contrato,Tipo de Procedimento,Tipo(s) de Contrato,CPVs,Entidade(s) Adjudicante(s),Entidade(s) Adjudicatária(s),Preço Contratual,Data de Publicação,Data de Celebração do Contrato,Prazo de Execução,Local de Execução,Fundamentação,Data de Fecho do Contrato,Preço Total Efetivo,Causas das Alterações ao Prazo,Causas das Alterações ao Preço,Estado,N.º registo do Acordo Quadro,Descrição do Acordo Quadro,Procedimento Centralizado
Aquisição de serviços para apoio interno a área de Informática do DAG da ACSS.,Consulta Prévia,Aquisição de serviços,"71356300-1, Serviços de apoio técnico","Administração Central do Sistema de Saúde, I. P. (508188423)",João Pedro Amado Ferreira Durão (216164150),"12.014,80 €",27-03-2018,01-03-2018,305 dias,"Portugal, Lisboa, Lisboa","Artigo 20.º, n.º 1, alínea c) do Código dos Contratos Públicos",30-11-2018,"10.813,32 €",,Revogação de contrato entre as partes,,Não aplicável.,Não aplicável.,FALSE
"Aquisição de material de Economato, ao abrigo do Lote 1 e Lote 2 do Acordo Quadro  da ESPAP ",Ao abrigo de acordo-quadro (art.º 259.º),Aquisição de bens móveis,"30190000-7, Equipamento e material de escritório diverso","Administração Central do Sistema de Saúde, I. P. (508188423)","OHMTécnica - Representações de Marcas, LDA (504059521)","3.921,22 €",21-03-2018,19-01-2018,346 dias,"Portugal, Lisboa, Lisboa",Artigo 259.º do Código dos Contratos Públicos,31-12-2018,"1.336,67 €",,Valor da execução,,1351201,Acordo quadro de fornecimento de papel e economato,FALSE
