freguesia,acronym,validVotesPercentage,votes,dicofre
Barqueiros,PS,62.78,113,170401
Barqueiros,PPD/PSD.CDS-PP,23.33,42,170401
Barqueiros,PCP-PEV,4.44,8,170401
Barqueiros,MPT,3.33,6,170401
Barqueiros,B.E.,1.67,3,170401
Barqueiros,L,1.67,3,170401
Barqueiros,PAN,1.11,2,170401
Barqueiros,PCTP/MRPP,1.11,2,170401
Barqueiros,PND,0.56,1,170401
Barqueiros,MAS,0,0,170401
Barqueiros,PDA,0,0,170401
Barqueiros,PNR,0,0,170401
Barqueiros,POUS,0,0,170401
Barqueiros,PPM,0,0,170401
Barqueiros,PPV,0,0,170401
Barqueiros,PTP,0,0,170401
