freguesia,acronym,validVotesPercentage,votes,dicofre
Nespereira,PS,39.69,179,180409
Nespereira,PPD/PSD,36.81,166,180409
Nespereira,CDS-PP,6.87,31,180409
Nespereira,B.E.,4.21,19,180409
Nespereira,PCP-PEV,2.88,13,180409
Nespereira,PDR,2.22,10,180409
Nespereira,PAN,1.55,7,180409
Nespereira,PCTP/MRPP,1.55,7,180409
Nespereira,NC,0.67,3,180409
Nespereira,PTP,0.67,3,180409
Nespereira,IL,0.44,2,180409
Nespereira,L,0.44,2,180409
Nespereira,MAS,0.44,2,180409
Nespereira,PNR,0.44,2,180409
Nespereira,PPM.PPV/CDC,0.44,2,180409
Nespereira,PURP,0.44,2,180409
Nespereira,A,0.22,1,180409
