Objeto do Contrato,Tipo de Procedimento,Tipo(s) de Contrato,CPVs,Entidade(s) Adjudicante(s),Entidade(s) Adjudicatária(s),Preço Contratual,Data de Publicação,Data de Celebração do Contrato,Prazo de Execução,Local de Execução,Fundamentação,Data de Fecho do Contrato,Preço Total Efetivo,Causas das Alterações ao Prazo,Causas das Alterações ao Preço,Estado,N.º registo do Acordo Quadro,Descrição do Acordo Quadro,Procedimento Centralizado
Renovação - AD ao abrigo do AQ 12001015 - Protese do Joelho - AjD 42403816,Ao abrigo de acordo-quadro (art.º 258.º),Aquisição de bens móveis,"33183200-8, Próteses ortopédicas",Centro Hospitalar do Oeste (510412009),"STRYKER PORTUGAL, LDA. (504594214)","8.668,00 €",31-03-2017,19-10-2016,90 dias,"Portugal, Leiria, Caldas da Rainha",Artigo 258.º do Código dos Contratos Públicos,19-10-2016,"8.668,00 €",,"",,1393214,12001015,FALSE
Renovação - AD ao abrigo do AQ 12001015 - Próteses do Joelho AJD 42374816,Ao abrigo de acordo-quadro (art.º 258.º),Aquisição de bens móveis,"33183200-8, Próteses ortopédicas",Centro Hospitalar do Oeste (510412009),"Biomet Portugal Unipessoal, Lda. (500254990)","2.036,00 €",31-03-2017,07-10-2016,90 dias,"Portugal, Leiria, Caldas da Rainha",Artigo 258.º do Código dos Contratos Públicos,07-10-2016,"2.036,00 €",,"",,1393214,12001015,FALSE
Renovação - AD ao abrigo do AQ 12001015 - Próteses do Joelho AJD 42374816,Ao abrigo de acordo-quadro (art.º 258.º),Aquisição de bens móveis,"33183200-8, Próteses ortopédicas",Centro Hospitalar do Oeste (510412009),"STRYKER PORTUGAL, LDA. (504594214)","20.489,00 €",31-03-2017,07-10-2016,90 dias,"Portugal, Leiria, Caldas da Rainha","Artigo 20.º, n.º 1, alínea a) do Código dos Contratos Públicos",07-10-2016,"20.489,00 €",,"",,1393214,12001015,FALSE
Renovação - AD ao abrigo do AQ 12001015- Aquisição prótese do joelho - AjD 42309116,Ao abrigo de acordo-quadro (art.º 258.º),Aquisição de bens móveis,"33183200-8, Próteses ortopédicas",Centro Hospitalar do Oeste (510412009),"STRYKER PORTUGAL, LDA. (504594214)","18.914,00 €",31-03-2017,08-08-2016,90 dias,"Portugal, Leiria, Caldas da Rainha",Artigo 258.º do Código dos Contratos Públicos,08-08-2016,"18.914,00 €",,"",,1393214,12001015,FALSE
AD ao abrigo do AQ 12001015 - Aquisição Próteses Joelho - AjD 42005916,Ao abrigo de acordo-quadro (art.º 258.º),Aquisição de bens móveis,"33183200-8, Próteses ortopédicas",CHO - Centro Hospitalar do Oeste (510412009),"Biomet Portugal Unipessoal, Lda. (500254990)","1.018,00 €",31-03-2017,22-02-2016,90 dias,"Portugal, Leiria, Caldas da Rainha",Artigo 258.º do Código dos Contratos Públicos,22-02-2016,"1.018,00 €",,"",,1393214,12001015,FALSE
AD ao abrigo do AQ 12001015 - Aquisição Próteses Joelho - AjD 42005916,Ao abrigo de acordo-quadro (art.º 258.º),Aquisição de bens móveis,"33183200-8, Próteses ortopédicas",CHO - Centro Hospitalar do Oeste (510412009),"STRYKER PORTUGAL, LDA. (504594214)","25.217,00 €",31-03-2017,22-02-2016,90 dias,"Portugal, Leiria, Caldas da Rainha",Artigo 258.º do Código dos Contratos Públicos,22-02-2016,"25.217,00 €",,"",,1393214,12001015,FALSE
Renovação - AD ao abrigo do AQ 12000915 - Aquisição de próteses da anca AjD 42509416,Ao abrigo de acordo-quadro (art.º 258.º),Aquisição de bens móveis,"33183200-8, Próteses ortopédicas",Centro Hospitalar do Oeste (510412009),"STRYKER PORTUGAL, LDA. (504594214)","240,00 €",31-03-2017,10-01-2017,1 dias,"Portugal, Leiria, Caldas da Rainha",Artigo 258.º do Código dos Contratos Públicos,10-01-2017,"240,00 €",,"",,1390632,12000915,FALSE
Renovação - AD ao abrigo do AQ 12000915 - Aquisição de próteses da anca AjD 42509416,Ao abrigo de acordo-quadro (art.º 258.º),Aquisição de bens móveis,"33183200-8, Próteses ortopédicas",Centro Hospitalar do Oeste (510412009),BIOMET PORTUGAL (500254990),"220,00 €",31-03-2017,10-01-2017,1 dias,"Portugal, Leiria, Caldas da Rainha",Artigo 258.º do Código dos Contratos Públicos,10-01-2017,"220,00 €",,"",,1390632,12000915,FALSE
Renovação - AD ao abrigo do AQ 12000915 - Aquisição de próteses da anca AjD 42509416,Ao abrigo de acordo-quadro (art.º 258.º),Aquisição de bens móveis,"33183200-8, Próteses ortopédicas",Centro Hospitalar do Oeste (510412009),"ARTUR SALGADO, S.A. (503612600)","2.720,00 €",31-03-2017,10-01-2017,1 dias,"Portugal, Leiria, Caldas da Rainha",Artigo 258.º do Código dos Contratos Públicos,10-01-2017,"2.720,00 €",,"",,1390632,12000915,FALSE
Renovação - AD ao abrigo do AQ 12000915 - Aquisição de próteses da anca AjD 42509416,Ao abrigo de acordo-quadro (art.º 258.º),Aquisição de bens móveis,"33183200-8, Próteses ortopédicas",Centro Hospitalar do Oeste (510412009),"STRYKER PORTUGAL, LDA. (504594214)","2.472,00 €",31-03-2017,10-01-2017,1 dias,"Portugal, Leiria, Caldas da Rainha",Artigo 258.º do Código dos Contratos Públicos,10-01-2017,"2.472,00 €",,"",,1390632,12000915,FALSE
Renovação - AD ao abrigo do AQ 12000915 - Aquisição de próteses da anca AjD 42509416,Ao abrigo de acordo-quadro (art.º 258.º),Aquisição de bens móveis,"33183200-8, Próteses ortopédicas",Centro Hospitalar do Oeste (510412009),BIOMET PORTUGAL (500254990),"341,00 €",31-03-2017,10-01-2017,1 dias,"Portugal, Leiria, Caldas da Rainha",Artigo 258.º do Código dos Contratos Públicos,10-01-2017,"341,00 €",,"",,1390632,12000915,FALSE
Renovação - AD ao abrigo do AQ 12000915 - Aquisição prótese da anca AjD 42504616,Ao abrigo de acordo-quadro (art.º 258.º),Aquisição de bens móveis,"33183200-8, Próteses ortopédicas",Centro Hospitalar do Oeste (510412009),"STRYKER PORTUGAL, LDA. (504594214)","60,00 €",31-03-2017,30-12-2016,1 dias,"Portugal, Leiria, Caldas da Rainha",Artigo 258.º do Código dos Contratos Públicos,30-12-2016,"60,00 €",,"",,1390632,12000915,FALSE
Renovação - AD ao abrigo do AQ 12000915 - Aquisição prótese da anca AjD 42504616,Ao abrigo de acordo-quadro (art.º 258.º),Aquisição de bens móveis,"33183200-8, Próteses ortopédicas",Centro Hospitalar do Oeste (510412009),"ARTUR SALGADO, S.A. (503612600)","1.700,00 €",31-03-2017,30-12-2016,1 dias,"Portugal, Leiria, Caldas da Rainha",Artigo 258.º do Código dos Contratos Públicos,30-12-2016,"1.700,00 €",,"",,1390632,12000915,FALSE
Renovação - AD ao abrigo do AQ 12000915 - Aquisição prótese da anca AjD 42504616,Ao abrigo de acordo-quadro (art.º 258.º),Aquisição de bens móveis,"33183200-8, Próteses ortopédicas",Centro Hospitalar do Oeste (510412009),"STRYKER PORTUGAL, LDA. (504594214)","2.472,00 €",31-03-2017,30-12-2016,1 dias,"Portugal, Leiria, Caldas da Rainha",Artigo 258.º do Código dos Contratos Públicos,30-12-2016,"2.472,00 €",,"",,1390632,12000915,FALSE
Renovação - AD ao abrigo do AQ 12000915 - Próteses da anca - AjD 42476316,Ao abrigo de acordo-quadro (art.º 258.º),Aquisição de bens móveis,"33183200-8, Próteses ortopédicas",Centro Hospitalar do Oeste (510412009),"ARTUR SALGADO, S.A. (503612600)","2.380,00 €",30-03-2017,05-12-2016,30 dias,"Portugal, Leiria, Caldas da Rainha",Artigo 258.º do Código dos Contratos Públicos,05-12-2016,"2.380,00 €",,"",,1390632,12000915,FALSE
Renovação - AD ao abrigo do AQ 12000915 - Próteses da anca - AjD 42476316,Ao abrigo de acordo-quadro (art.º 258.º),Aquisição de bens móveis,"33183200-8, Próteses ortopédicas",Centro Hospitalar do Oeste (510412009),"STRYKER PORTUGAL, LDA. (504594214)","13.176,00 €",30-03-2017,05-12-2016,30 dias,"Portugal, Leiria, Caldas da Rainha",Artigo 258.º do Código dos Contratos Públicos,05-12-2016,"13.176,00 €",,"",,1390632,12000915,FALSE
Renovação - AD ao abrigo do AQ 12000915-Aquisição de proteses da anca - AjD 42329216,Ao abrigo de acordo-quadro (art.º 258.º),Aquisição de bens móveis,"33183200-8, Próteses ortopédicas",Centro Hospitalar do Oeste (510412009),"STRYKER PORTUGAL, LDA. (504594214)","920,00 €",30-03-2017,20-09-2016,90 dias,"Portugal, Leiria, Caldas da Rainha",Artigo 258.º do Código dos Contratos Públicos,20-09-2016,"920,00 €",,"",,1390632,12000915,FALSE
Renovação - AD ao abrigo do AQ 12000915-Aquisição de proteses da anca - AjD 42329216,Ao abrigo de acordo-quadro (art.º 258.º),Aquisição de bens móveis,"33183200-8, Próteses ortopédicas",Centro Hospitalar do Oeste (510412009),BIOMET PORTUGAL (500254990),"1.870,00 €",30-03-2017,20-09-2016,90 dias,"Portugal, Leiria, Caldas da Rainha",Artigo 258.º do Código dos Contratos Públicos,20-09-2016,"1.870,00 €",,"",,1390632,12000915,FALSE
Renovação - AD ao abrigo do AQ 12000915-Aquisição de proteses da anca - AjD 42329216,Ao abrigo de acordo-quadro (art.º 258.º),Aquisição de bens móveis,"33183200-8, Próteses ortopédicas",Centro Hospitalar do Oeste (510412009),"ARTUR SALGADO, S.A. (503612600)","2.380,00 €",30-03-2017,20-09-2016,90 dias,"Portugal, Leiria, Caldas da Rainha",Artigo 258.º do Código dos Contratos Públicos,20-09-2016,"2.380,00 €",,"",,1390632,12000915,FALSE
Renovação - AD ao abrigo do AQ 12000915-Aquisição de proteses da anca - AjD 42329216,Ao abrigo de acordo-quadro (art.º 258.º),Aquisição de bens móveis,"33183200-8, Próteses ortopédicas",Centro Hospitalar do Oeste (510412009),"STRYKER PORTUGAL, LDA. (504594214)","16.332,00 €",30-03-2017,20-09-2016,90 dias,"Portugal, Leiria, Caldas da Rainha",Artigo 258.º do Código dos Contratos Públicos,20-09-2016,"16.332,00 €",,"",,1390632,12000915,FALSE
Renovação - AD ao abrigo do AQ 12000915-Aquisição de proteses da anca - AjD 42329216,Ao abrigo de acordo-quadro (art.º 258.º),Aquisição de bens móveis,"33183200-8, Próteses ortopédicas",Centro Hospitalar do Oeste (510412009),BIOMET PORTUGAL (500254990),"1.705,00 €",30-03-2017,20-09-2016,90 dias,"Portugal, Leiria, Caldas da Rainha",Artigo 258.º do Código dos Contratos Públicos,20-09-2016,"1.705,00 €",,"",,1390632,12000915,FALSE
AD ao abrigo do AQ 12000915 - Próteses da anca - AJD 42006216,Ao abrigo de acordo-quadro (art.º 258.º),Aquisição de bens móveis,"33183200-8, Próteses ortopédicas",Centro Hospitalar do Oeste (510412009),"STRYKER PORTUGAL, LDA. (504594214)","420,00 €",30-03-2017,30-05-2016,90 dias,"Portugal, Leiria, Caldas da Rainha",Artigo 258.º do Código dos Contratos Públicos,30-05-2016,"420,00 €",,"",,1390632,12000915,FALSE
AD ao abrigo do AQ 12000915 - Próteses da anca - AJD 42006216,Ao abrigo de acordo-quadro (art.º 258.º),Aquisição de bens móveis,"33183200-8, Próteses ortopédicas",Centro Hospitalar do Oeste (510412009),"BIOMET PORTUGAL UNIPESSOAL, LDA. (500254990)","880,00 €",30-03-2017,30-05-2016,90 dias,"Portugal, Leiria, Caldas da Rainha",Artigo 258.º do Código dos Contratos Públicos,30-05-2016,"880,00 €",,"",,1390632,12000915,FALSE
AD ao abrigo do AQ 12000915 - Próteses da anca - AJD 42006216,Ao abrigo de acordo-quadro (art.º 258.º),Aquisição de bens móveis,"33183200-8, Próteses ortopédicas",Centro Hospitalar do Oeste (510412009),"ARTUR SALGADO, S.A. (503612600)","2.380,00 €",30-03-2017,30-05-2016,90 dias,"Portugal, Leiria, Caldas da Rainha",Artigo 258.º do Código dos Contratos Públicos,30-05-2016,"2.380,00 €",,"",,1390632,12000915,FALSE
AD ao abrigo do AQ 12000915 - Próteses da anca - AJD 42006216,Ao abrigo de acordo-quadro (art.º 258.º),Aquisição de bens móveis,"33183200-8, Próteses ortopédicas",Centro Hospitalar do Oeste (510412009),"STRYKER PORTUGAL, LDA. (504594214)","13.126,00 €",30-03-2017,30-05-2016,90 dias,"Portugal, Leiria, Caldas da Rainha",Artigo 258.º do Código dos Contratos Públicos,30-05-2016,"13.126,00 €",,"",,1390632,12000915,FALSE
AD ao abrigo do AQ 12000915 - Próteses da anca - AJD 42006216,Ao abrigo de acordo-quadro (art.º 258.º),Aquisição de bens móveis,"33183200-8, Próteses ortopédicas",Centro Hospitalar do Oeste (510412009),"BIOMET PORTUGAL UNIPESSOAL, LDA. (500254990)","2.387,00 €",30-03-2017,30-05-2016,90 dias,"Portugal, Leiria, Caldas da Rainha",Artigo 258.º do Código dos Contratos Públicos,30-05-2016,"2.387,00 €",,"",,1390632,12000915,FALSE
AD ao abrigo do AQ 12001115-Aquisição de redes hérnia e útero - AJD 42218516,Ajuste Direto Regime Geral,Aquisição de bens móveis,"33140000-3, Material médico de consumo",Centro Hospitalar do Oeste (510412009),C.R. Bard Portugal (502438274),"224,00 €",30-03-2017,01-08-2016,180 dias,"Portugal, Leiria, Caldas da Rainha",Artigo 258.º do Código dos Contratos Públicos,01-08-2016,"224,00 €",,"",,Não aplicável.,Não aplicável.,FALSE
AD ao abrigo do AQ 12001115-Aquisição de redes hérnia e útero - AJD 42218516,Ajuste Direto Regime Geral,Aquisição de bens móveis,"33140000-3, Material médico de consumo",Centro Hospitalar do Oeste (510412009),"MEDTRONIC PORTUGAL - COM. E DIST. APARELHOS MEDICOS, LDA (504223933)","240,00 €",30-03-2017,01-08-2016,180 dias,"Portugal, Leiria, Caldas da Rainha",Artigo 258.º do Código dos Contratos Públicos,01-08-2016,"240,00 €",,"",,Não aplicável.,Não aplicável.,FALSE
AD ao abrigo do AQ 12001115-Aquisição de redes hérnia e útero - AJD 42218516,Ajuste Direto Regime Geral,Aquisição de bens móveis,"33140000-3, Material médico de consumo",Centro Hospitalar do Oeste (510412009),"MEDTRONIC PORTUGAL - COM. E DIST. APARELHOS MEDICOS, LDA (504223933)","560,00 €",30-03-2017,01-08-2016,180 dias,"Portugal, Leiria, Caldas da Rainha",Artigo 258.º do Código dos Contratos Públicos,01-08-2016,"560,00 €",,"",,Não aplicável.,Não aplicável.,FALSE
AD ao abrigo do AQ 12001115-Aquisição de redes hérnia e útero - AJD 42218516,Ajuste Direto Regime Geral,Aquisição de bens móveis,"33140000-3, Material médico de consumo",Centro Hospitalar do Oeste (510412009),"MEDTRONIC PORTUGAL - COM. E DIST. APARELHOS MEDICOS, LDA (504223933)","260,00 €",30-03-2017,01-08-2016,180 dias,"Portugal, Leiria, Caldas da Rainha",Artigo 258.º do Código dos Contratos Públicos,01-08-2016,"260,00 €",,"",,Não aplicável.,Não aplicável.,FALSE
AD ao abrigo do AQ 12001115-Aquisição de redes hérnia e útero - AJD 42218516,Ajuste Direto Regime Geral,Aquisição de bens móveis,"33140000-3, Material médico de consumo",Centro Hospitalar do Oeste (510412009),"MEDTRONIC PORTUGAL - COM. E DIST. APARELHOS MEDICOS, LDA (504223933)","812,00 €",30-03-2017,01-08-2016,180 dias,"Portugal, Leiria, Caldas da Rainha",Artigo 258.º do Código dos Contratos Públicos,01-08-2016,"812,00 €",,"",,Não aplicável.,Não aplicável.,FALSE
AD ao abrigo do AQ 12001115-Aquisição de redes hérnia e útero - AJD 42218516,Ajuste Direto Regime Geral,Aquisição de bens móveis,"33140000-3, Material médico de consumo",Centro Hospitalar do Oeste (510412009),Moonsurge (506657035),"236,40 €",30-03-2017,01-08-2016,180 dias,"Portugal, Leiria, Caldas da Rainha",Artigo 258.º do Código dos Contratos Públicos,01-08-2016,"236,40 €",,"",,Não aplicável.,Não aplicável.,FALSE
AD ao abrigo do AQ 12001115-Aquisição de redes hérnia e útero - AJD 42218516,Ajuste Direto Regime Geral,Aquisição de bens móveis,"33140000-3, Material médico de consumo",Centro Hospitalar do Oeste (510412009),Moonsurge (506657035),"2.800,00 €",30-03-2017,01-08-2016,180 dias,"Portugal, Leiria, Caldas da Rainha",Artigo 258.º do Código dos Contratos Públicos,01-08-2016,"175,00 €",,Não se adquiriu as quantidades todas adjudicadas inicialmente,,Não aplicável.,Não aplicável.,FALSE
Renovação - AD ao abrigo do AQ 12001115-Aquisição de redes hérnia e útero - AJD 42485116,Ao abrigo de acordo-quadro (art.º 258.º),Aquisição de bens móveis,"33140000-3, Material médico de consumo",Centro Hospitalar do Oeste (510412009),Moonsurge (506657035),"1.050,00 €",30-03-2017,12-12-2016,1 dias,"Portugal, Leiria, Caldas da Rainha",Artigo 258.º do Código dos Contratos Públicos,12-12-2016,"1.050,00 €",,"",,1346857,12001115,FALSE
Luvas,Ajuste Direto Regime Geral,Aquisição de bens móveis,"33141420-0, Luvas para cirurgia",Centro Hospitalar do Oeste (510412009),"H. R. Hospitalar, Lda (501895558)","5.100,00 €",30-03-2017,15-04-2016,1 dias,"Portugal, Leiria, Caldas da Rainha","Artigo 20.º, n.º 1, alínea a) do Código dos Contratos Públicos",15-04-2016,"5.100,00 €",,"",,Não aplicável.,Não aplicável.,FALSE
Cateteres,Ajuste Direto Regime Geral,Aquisição de bens móveis,"33141200-2, Cateteres",Centro Hospitalar do Oeste (510412009),"B BRAUN MEDICAL, LDA.                              (501506543)","5.752,80 €",24-03-2017,31-03-2016,1 dias,"Portugal, Leiria, Caldas da Rainha","Artigo 20.º, n.º 1, alínea a) do Código dos Contratos Públicos",31-03-2016,"5.752,80 €",,"",,Não aplicável.,Não aplicável.,FALSE
