Objeto do Contrato,Tipo de Procedimento,Tipo(s) de Contrato,CPVs,Entidade(s) Adjudicante(s),Entidade(s) Adjudicatária(s),Preço Contratual,Data de Publicação,Data de Celebração do Contrato,Prazo de Execução,Local de Execução,Fundamentação,Data de Fecho do Contrato,Preço Total Efetivo,Causas das Alterações ao Prazo,Causas das Alterações ao Preço,Estado,N.º registo do Acordo Quadro,Descrição do Acordo Quadro,Procedimento Centralizado
Aquisição de tablets com capa e teclado,Consulta Prévia,Aquisição de bens móveis,"30236000-2, Equipamento informático diverso",Entidade Reguladora da Saúde (507021266),"Pamafe Informática, Lda (504099388)","5.393,86 €",02-02-2019,14-12-2018,15 dias,"Portugal, Porto, Porto","Artigo 20.º, n.º 1, alínea c) do Código dos Contratos Públicos",,,,,,Não aplicável.,Não aplicável.,FALSE
"Aquisição de computadores portáteis e fixos, monitores, teclados e tapetes para ratos",Consulta Prévia,Aquisição de bens móveis,"30236000-2, Equipamento informático diverso",Entidade Reguladora da Saúde (507021266),"Pamafe Informática, Lda. (504099388)","19.155,85 €",02-02-2019,14-12-2018,15 dias,"Portugal, Porto, Porto","Artigo 20.º, n.º 1, alínea c) do Código dos Contratos Públicos",,,,,,Não aplicável.,Não aplicável.,FALSE
"Aquisição de computadores fixos, monitores, teclados, ratos e tapetes para rato.",Consulta Prévia,Aquisição de bens móveis,"30236000-2, Equipamento informático diverso",Entidade Reguladora da Saúde (507021266),"Pamafe Informática, lda (504099388)","20.878,30 €",01-02-2019,09-11-2018,20 dias,"Portugal, Porto, Porto","Artigo 20.º, n.º 1, alínea c) do Código dos Contratos Públicos",,,,,,Não aplicável.,Não aplicável.,FALSE
"Fornecimento de combustíveis rodoviários (gasóleos), em postos de abastecimento públicos em Portugal Continental.",Consulta Prévia,Aquisição de bens móveis,"09134000-7, Gasóleos",Entidade Reguladora da Saúde (507021266),"Petróleos de Portugal - Petrogal, S.A. (500697370)","25.000,00 €",01-02-2019,14-08-2018,1095 dias,Portugal,"Artigo 20.º, n.º 1, alínea c) do Código dos Contratos Públicos",,,,,,Não aplicável.,Não aplicável.,FALSE
Aquisição de serviços para integração de uma nova imagem institucional na ERS,Ajuste Direto Regime Geral,Aquisição de serviços,"79930000-2, Serviços de concepção de modelos especializados",Entidade Reguladora da Saúde (507021266),"Rui Álvaro Silva - Design Unipessoal, Lda. (510033628)","10.750,00 €",01-02-2019,21-12-2018,10 dias,Portugal,"Artigo 20.º, n.º 1, alínea d) do Código dos Contratos Públicos",,,,,,Não aplicável.,Não aplicável.,FALSE
Criação e implementação de um portal institucional para a Entidade Reguladora da Saúde (ERS),Consulta Prévia,Aquisição de serviços,"72413000-8, Serviços de concepção de sítios da World Wide Web (WWW)",Entidade Reguladora da Saúde (507021266),"PontoPR - Serviços de Publicidade e Robótica, Lda (504794108)","27.870,00 €",01-02-2019,19-11-2018,60 dias,Portugal,"Artigo 20.º, n.º 1, alínea c) do Código dos Contratos Públicos",,,,,,Não aplicável.,Não aplicável.,FALSE
"Aquisição de serviços informáticos para: a)	a manutenção preventiva e corretiva, bem como a resolução de incidentes nas plataformas informáticas atualmente existentes de suporte ao Sistema Nacional de Avaliação em Saúde (SINAS) – plataforma de recolha de dados (SINAS.data) e plataforma tecnológica de cálculo de indicadores; b)	a revisão, atualização e introdução de novos indicadores no SINAS@Hospitais através de uma bolsa de 300 horas de serviços, prestados por acesso remoto por um programador sénior, com capacidade para dominar a solução. ",Consulta Prévia,Aquisição de serviços,"50324200-4, Serviços de manutenção preventiva",Entidade Reguladora da Saúde (507021266),"Cerner Portugal, Unipessoal, Lda (513269843)","34.000,00 €",01-02-2019,25-07-2018,365 dias,Portugal,"Artigo 20.º, n.º 1, alínea c) do Código dos Contratos Públicos",,,,,,Não aplicável.,Não aplicável.,FALSE
Aquisição de apólice de seguro de Acidentes de Trabalho,Consulta Prévia,Aquisição de serviços,"66512000-2, Serviços de seguros de acidentes e de saúde",Entidade Reguladora da Saúde (507021266),"Fidelidade - Companhia de Seguros, S.A. (500918880)","49.861,92 €",01-02-2019,18-12-2018,730 dias,Portugal,"Artigo 20.º, n.º 1, alínea c) do Código dos Contratos Públicos",,,,,,Não aplicável.,Não aplicável.,FALSE
Aquisição de serviços especializados para apoio à otimização do processo de tratamento de queixas e reclamações do utente do sistema de saúde,Ajuste Direto Regime Geral,Aquisição de serviços,"79930000-2, Serviços de concepção de modelos especializados",Entidade Reguladora da Saúde (507021266),"Kaizen Institute Portugal Training Unipessoal, Lda (508830001)","11.200,00 €",01-02-2019,27-08-2018,60 dias,"Portugal, Porto, Porto","Artigo 20.º, n.º 1, alínea d) do Código dos Contratos Públicos",,,,,,Não aplicável.,Não aplicável.,FALSE
"Desenvolvimento de funcionalidades no sistema informático, denominado SRER, com vista à conformidade com as normas do RGPD",Consulta Prévia,Aquisição de serviços,"72000000-5, Serviços de TI: consultoria, desenvolvimento de software, Internet e apoio",Entidade Reguladora da Saúde (507021266),"Ubiquity Tecnology, Lda (510134696)","74.400,00 €",01-02-2019,26-10-2018,150 dias,"Portugal, Porto, Porto","Artigo 20.º, n.º 1, alínea c) do Código dos Contratos Públicos",,,,,,Não aplicável.,Não aplicável.,FALSE
Aquisição de serviços de limpeza para as instalações da Entidade Reguladora da Saúde,Consulta Prévia,Aquisição de serviços,"98300000-6, Serviços diversos",Entidade Reguladora da Saúde (507021266),"Euromex - Facility Services, Lda (502629428)","65.819,88 €",01-02-2019,17-09-2018,1095 dias,"Portugal, Porto, Porto","Artigo 20.º, n.º 1, alínea c) do Código dos Contratos Públicos",,,,,,Não aplicável.,Não aplicável.,FALSE
Aquisição de serviços administrativos de apoio aos processos de registo e licenciamento dos estabelecimentos prestadores de cuidados de saúde,Ajuste Direto Regime Geral,Aquisição de serviços,"73000000-2, Serviços de investigação e desenvolvimento e serviços de consultoria conexos",Entidade Reguladora da Saúde (507021266),Vânea Marisa da Silva Pereira (221678034),"9.600,00 €",31-01-2019,15-05-2018,365 dias,Portugal,"Artigo 27.º, n.º 1, alínea b) e n.º 3 do Código dos Contratos Públicos",,,,,,Não aplicável.,Não aplicável.,FALSE
Aquisição de serviços de assessoria jurídica para os Serviços Jurídicos,Ajuste Direto Regime Geral,Aquisição de serviços,"73000000-2, Serviços de investigação e desenvolvimento e serviços de consultoria conexos",Entidade Reguladora da Saúde (507021266),Ricardo Filipe Ferreira Lima (212958380),"19.978,92 €",31-01-2019,15-05-2018,365 dias,Portugal,"Artigo 27.º, n.º 1, alínea b) e n.º 3 do Código dos Contratos Públicos",,,,,,Não aplicável.,Não aplicável.,FALSE
Aquisição de serviços administrativos de apoio aos processos de registo e licenciamento dos estabelecimentos prestadores de cuidados de saúde,Ajuste Direto Regime Geral,Aquisição de serviços,"73000000-2, Serviços de investigação e desenvolvimento e serviços de consultoria conexos",Entidade Reguladora da Saúde (507021266),Rita Sofia de Magalhães e Meneses Castelo Branco Magalhães (230238084),"9.600,00 €",31-01-2019,30-04-2018,365 dias,Portugal,"Artigo 27.º, n.º 1, alínea b) e n.º 3 do Código dos Contratos Públicos",,,,,,Não aplicável.,Não aplicável.,FALSE
Aquisição de serviços administrativos de apoio aos processos de registo e licenciamento dos estabelecimentos prestadores de cuidados de saúde.,Ajuste Direto Regime Geral,Aquisição de serviços,"73000000-2, Serviços de investigação e desenvolvimento e serviços de consultoria conexos",Entidade Reguladora da Saúde (507021266),Ana Carolina Ornelas Vieira (228413095),"9.600,00 €",31-01-2019,26-04-2018,365 dias,Portugal,"Artigo 27.º, n.º 1, alínea b) do Código dos Contratos Públicos",,,,,,Não aplicável.,Não aplicável.,FALSE
Aquisição de serviços de suporte de apoio técnico e manutenção aos programas informáticos denominados SRER e SGREC,Ajuste Direto Regime Geral,Aquisição de serviços,"72600000-6, Serviços de consultoria e assistência informáticas",Entidade Reguladora da Saúde (507021266),"Ubiquity Tecnology, Lda. (510134696)","19.900,00 €",31-01-2019,23-04-2018,365 dias,Portugal,"Artigo 24.º, n.º 1, alínea c) do Código dos Contratos Públicos",,,,,,Não aplicável.,Não aplicável.,FALSE
Aquisição de serviços de assessoria jurídica para o Departamento de Intervenção Administrativa e Sancionatória,Ajuste Direto Regime Geral,Aquisição de serviços,"73200000-4, Serviços de consultoria em matéria de investigação e desenvolvimento",Entidade Reguladora da Saúde (507021266),Filipa Alexandra Monteiro dos Santos (253651441),"19.978,92 €",31-01-2019,05-04-2018,365 dias,Portugal,"Artigo 27.º, n.º 1, alínea b) do Código dos Contratos Públicos",,,,,,Não aplicável.,Não aplicável.,FALSE
Aquisição de licenças para o sistema de informação geográfico,Ajuste Direto Regime Geral,Aquisição de bens móveis,"22456000-1, Licenças",Entidade Reguladora da Saúde (507021266),"Esri Portugal - Sistemas e Informação Geográfica, S.A. (501941231)","10.000,00 €",31-01-2019,21-12-2018,5 dias,Portugal,"Artigo 21.º, n.º 2 do Código dos Contratos Públicos",,,,,,Não aplicável.,Não aplicável.,FALSE
Instalação e configuração de um sistema de informação geográfico,Ajuste Direto Regime Geral,Aquisição de serviços,"79714110-6, Serviços de localização de fugitivos",Entidade Reguladora da Saúde (507021266),"Mapis - Mapping Intelligent Solutions, Lda (513294082)","19.950,00 €",31-01-2019,20-12-2018,10 dias,Portugal,"Artigo 21.º, n.º 2 do Código dos Contratos Públicos",,,,,,Não aplicável.,Não aplicável.,FALSE
"Aquisição de serviços de suporte, manutenção corretiva e evolutiva aos programas informáticos denominados SRER e SGREC",Ajuste Direto Regime Geral,Aquisição de serviços,"72267000-4, Serviços de manutenção e reparação de software",Entidade Reguladora da Saúde (507021266),"Ubiquity Tecnology, Lda. (510134696)","39.990,00 €",31-01-2019,03-12-2018,365 dias,Portugal,"Artigo 26.º, n.º 1, alínea e) do Código dos Contratos Públicos",,,,,,Não aplicável.,Não aplicável.,FALSE
Aquisição de serviços de formação interna nas áreas da inteligência emocional em contexto laboral e do regime jurídico da urbanização e edificação,Ajuste Direto Regime Geral,Aquisição de serviços,"80530000-8, Serviços de formação profissional",Entidade Reguladora da Saúde (507021266),"Quadros e Metas - Consultores de Gestão de Formação, Lda (503586730)","6.460,00 €",31-01-2019,15-11-2018,70 dias,Portugal,"Artigo 20.º, n.º 1, alínea d) do Código dos Contratos Públicos",,,,,,Não aplicável.,Não aplicável.,FALSE
"Aquisição de serviços de suporte técnico e manutenção, no âmbito das aplicações do software ERP Primavera",Ajuste Direto Regime Geral,Aquisição de serviços,"72267000-4, Serviços de manutenção e reparação de software",Entidade Reguladora da Saúde (507021266),"Primavera - Business Software Solutions, S.A. (503140600)","14.021,00 €",31-01-2019,01-10-2018,365 dias,Portugal,"Artigo 24.º, n.º 1, alínea e), subalínea iii) do Código dos Contratos Públicos",,,,,,Não aplicável.,Não aplicável.,FALSE
"Aquisição de serviços para a realização de melhorias, manutenção preventiva e corretiva na infraestrutura de informática",Consulta Prévia,Aquisição de serviços,"50324100-3, Serviços de manutenção de sistemas",Entidade Reguladora da Saúde (507021266),"Gonksys, S.A (510874169)","25.940,00 €",31-01-2019,26-10-2018,365 dias,Portugal,"Artigo 20.º, n.º 1, alínea c) do Código dos Contratos Públicos",,,,,,Não aplicável.,Não aplicável.,FALSE
"Aquisição de serviços de registo, tipificação, análise técnica simplificada, gestão documental, de 76.000 queixas e reclamações dos utentes ",Consulta Prévia,Aquisição de serviços,"65000000-3, Serviços públicos",Entidade Reguladora da Saúde (507021266),"Fernandes  e Canhoto, Lda (504157639)","74.480,00 €",31-01-2019,26-10-2018,150 dias,Portugal,"Artigo 20.º, n.º 1, alínea c) do Código dos Contratos Públicos",,,,,,Não aplicável.,Não aplicável.,FALSE
Realização de desenvolvimentos informáticos para integração do sistema de faturação e gestão de créditos do ERP Primavera com o SRER,Ajuste Direto Regime Geral,Aquisição de serviços,"72262000-9, Serviços de desenvolvimento de software",Entidade Reguladora da Saúde (507021266),"Ubiquity Tecnology, Lda (510134696)","33.345,00 €",31-01-2019,17-09-2018,70 dias,Portugal,"Artigo 26.º, n.º 1, alínea a) do Código dos Contratos Públicos",,,,,,Não aplicável.,Não aplicável.,FALSE
Realização de desenvolvimentos informáticos para implementar no ERP Primavera a gestão de faturação e controle de créditos da ERS,Ajuste Direto Regime Geral,Aquisição de serviços,"72212443-6, Serviços de desenvolvimento de software para contabilidade",Entidade Reguladora da Saúde (507021266),"Primavera - Business Software Solutions, Lda. (503140600)","31.890,00 €",31-01-2019,17-09-2018,70 dias,"Portugal, Porto, Porto","Artigo 26.º, n.º 1, alínea a) do Código dos Contratos Públicos",,,,,,Não aplicável.,Não aplicável.,FALSE
"Aquisição de serviços de consultoria clínica por um profissional licenciado em enfermagem, inscrito na respetiva ordem profissional.",Ajuste Direto Regime Geral,Aquisição de serviços,"73000000-2, Serviços de investigação e desenvolvimento e serviços de consultoria conexos",Entidade Reguladora da Saúde (507021266),José António Pinho da Silva (151635099),"4.000,00 €",31-01-2019,15-03-2018,365 dias,"Portugal, Porto, Porto","Artigo 20.º, n.º 1, alínea d) do Código dos Contratos Públicos",,,,,,Não aplicável.,Não aplicável.,FALSE
"Aquisição de serviços de consultoria clínica por um profissional licenciado em medicina, inscrito na respetiva ordem profissional.",Ajuste Direto Regime Geral,Aquisição de serviços,"73000000-2, Serviços de investigação e desenvolvimento e serviços de consultoria conexos",Entidade Reguladora da Saúde (507021266),"Stomachion, Lda (508994977)","9.600,00 €",31-01-2019,15-03-2018,365 dias,"Portugal, Porto, Porto","Artigo 20.º, n.º 1, alínea d) do Código dos Contratos Públicos",,,,,,Não aplicável.,Não aplicável.,FALSE
