freguesia,acronym,validVotesPercentage,votes,dicofre
Encosta do Sol,PS,38.73,2987,111514
Encosta do Sol,PCP-PEV,20.42,1575,111514
Encosta do Sol,PPD/PSD.CDS-PP,17.13,1321,111514
Encosta do Sol,MPT,6.73,519,111514
Encosta do Sol,B.E.,5.6,432,111514
Encosta do Sol,L,2.63,203,111514
Encosta do Sol,PCTP/MRPP,2.37,183,111514
Encosta do Sol,PAN,2.36,182,111514
Encosta do Sol,PTP,0.69,53,111514
Encosta do Sol,PND,0.67,52,111514
Encosta do Sol,PPM,0.66,51,111514
Encosta do Sol,PPV,0.65,50,111514
Encosta do Sol,MAS,0.61,47,111514
Encosta do Sol,PNR,0.57,44,111514
Encosta do Sol,POUS,0.09,7,111514
Encosta do Sol,PDA,0.08,6,111514
