freguesia,acronym,validVotesPercentage,votes,dicofre
Ponta Delgada (São José),PS,34.34,751,420313
Ponta Delgada (São José),PPD/PSD,33.47,732,420313
Ponta Delgada (São José),B.E.,12.16,266,420313
Ponta Delgada (São José),CDS-PP,4.62,101,420313
Ponta Delgada (São José),PAN,3.75,82,420313
Ponta Delgada (São José),PCP-PEV,2.79,61,420313
Ponta Delgada (São José),L,2.01,44,420313
Ponta Delgada (São José),A,1.78,39,420313
Ponta Delgada (São José),IL,1.55,34,420313
Ponta Delgada (São José),CH,0.82,18,420313
Ponta Delgada (São José),PPM,0.73,16,420313
Ponta Delgada (São José),PCTP/MRPP,0.69,15,420313
Ponta Delgada (São José),PNR,0.46,10,420313
Ponta Delgada (São José),MPT,0.32,7,420313
Ponta Delgada (São José),PTP,0.23,5,420313
Ponta Delgada (São José),MAS,0.18,4,420313
Ponta Delgada (São José),PDR,0.09,2,420313
