Objeto do Contrato,Tipo de Procedimento,Tipo(s) de Contrato,CPVs,Entidade(s) Adjudicante(s),Entidade(s) Adjudicatária(s),Preço Contratual,Data de Publicação,Data de Celebração do Contrato,Prazo de Execução,Local de Execução,Fundamentação,Data de Fecho do Contrato,Preço Total Efetivo,Causas das Alterações ao Prazo,Causas das Alterações ao Preço,Estado,N.º registo do Acordo Quadro,Descrição do Acordo Quadro,Procedimento Centralizado
Aquisição de Reagentes para o Serviço de Patologia Clinica - Setor de Hormonologia,Ajuste Direto Regime Geral,Aquisição de bens móveis,"33000000-0, Equipamento médico, medicamentos e produtos para cuidados pessoais","Instituto Português de Oncologia de Coimbra Francisco Gentil, E. P. E. (506361438)","Diasorin Iberia, SA - Sucursal Portugal (980379563)","9.711,00 €",14-02-2014,14-01-2014,365 dias,"Portugal, Coimbra, Coimbra","Artigo 26.º, n.º 1, alínea a) do Código dos Contratos Públicos",23-12-2014,"9.087,00 €",,diminuição das quantidades previstas,,Não aplicável.,Não aplicável.,FALSE
Aquisição de Reagentes para o Serviço de Patologia Clinica - Setor de Hormonologia,Ajuste Direto Regime Geral,Aquisição de bens móveis,"33000000-0, Equipamento médico, medicamentos e produtos para cuidados pessoais","Instituto Português de Oncologia de Coimbra Francisco Gentil, E. P. E. (506361438)","Meditecno - Medicos e Sistemas de Diagnostico, Lda (505025990)","7.615,00 €",14-02-2014,14-01-2014,365 dias,"Portugal, Coimbra, Coimbra","Artigo 26.º, n.º 1, alínea a) do Código dos Contratos Públicos",15-12-2014,"8.950,00 €",,aumento das quantidades previstas em função do numero de doentes,,Não aplicável.,Não aplicável.,FALSE
Aquisição de Reagentes para o Serviço de Patologia Clinica - Setor de Hormonologia,Ajuste Direto Regime Geral,Aquisição de bens móveis,"33000000-0, Equipamento médico, medicamentos e produtos para cuidados pessoais","Instituto Português de Oncologia de Coimbra Francisco Gentil, E. P. E. (506361438)","Siemens Healthcare Diagnostics, Unipessoal, Lda. (507925173)","63.385,68 €",14-02-2014,14-01-2014,365 dias,"Portugal, Coimbra, Coimbra","Artigo 26.º, n.º 1, alínea a) do Código dos Contratos Públicos",16-12-2014,"66.139,14 €",,aumento das quantidades previstas,,Não aplicável.,Não aplicável.,FALSE
Aquisição de Reagentes para o Serviço de Patologia Clinica - Setor de Hormonologia,Ajuste Direto Regime Geral,Aquisição de bens móveis,"33000000-0, Equipamento médico, medicamentos e produtos para cuidados pessoais","Instituto Português de Oncologia de Coimbra Francisco Gentil, E. P. E. (506361438)","Arium - Sistemas de Diagnostico, Lda. (502501880)","2.462,00 €",14-02-2014,14-01-2014,365 dias,"Portugal, Coimbra, Coimbra","Artigo 26.º, n.º 1, alínea a) do Código dos Contratos Públicos",10-12-2014,"2.520,00 €",,aumento das quantidades previstas,,Não aplicável.,Não aplicável.,FALSE
Aquisição de Reagentes para o Serviço de Patologia Clinica - Setor de Hormonologia,Ajuste Direto Regime Geral,Aquisição de bens móveis,"33000000-0, Equipamento médico, medicamentos e produtos para cuidados pessoais","Instituto Português de Oncologia de Coimbra Francisco Gentil, E. P. E. (506361438)","Fardiotop - Produtos e Serviços Farmaceuticos, Lda. (508033128)","6.942,00 €",14-02-2014,14-01-2014,365 dias,"Portugal, Coimbra, Coimbra","Artigo 26.º, n.º 1, alínea a) do Código dos Contratos Públicos",16-12-2014,"9.648,00 €",,aumento das quantidades previstas,,Não aplicável.,Não aplicável.,FALSE
Aquisição de Reagentes para o Serviço de Patologia Clinica - Setor de Hormonologia,Ajuste Direto Regime Geral,Aquisição de bens móveis,"33000000-0, Equipamento médico, medicamentos e produtos para cuidados pessoais","Instituto Português de Oncologia de Coimbra Francisco Gentil, E. P. E. (506361438)","Roche Sistemas de Diagnosticos, Lda. (504282921)","37.237,51 €",14-02-2014,14-01-2014,365 dias,"Portugal, Coimbra, Coimbra","Artigo 26.º, n.º 1, alínea a) do Código dos Contratos Públicos",16-12-2014,"32.749,97 €",,diminuição das quantidades previstas,,Não aplicável.,Não aplicável.,FALSE
Aquisição de Reagentes para o Serviço de Patologia Clinica - Setor de Hormonologia,Ajuste Direto Regime Geral,Aquisição de bens móveis,"33000000-0, Equipamento médico, medicamentos e produtos para cuidados pessoais","Instituto Português de Oncologia de Coimbra Francisco Gentil, E. P. E. (506361438)","BDPL Cientifica - Reagentes e Instrumentos, Lda. (504527584)","1.158,90 €",14-02-2014,14-01-2014,365 dias,"Portugal, Coimbra, Coimbra","Artigo 26.º, n.º 1, alínea a) do Código dos Contratos Públicos",09-12-2014,"1.397,59 €",,aumento das quantidades previstas,,Não aplicável.,Não aplicável.,FALSE
Aquisição de Reagentes para o Serviço de Patologia Clinica - Setor de Hormonologia,Ajuste Direto Regime Geral,Aquisição de bens móveis,"33000000-0, Equipamento médico, medicamentos e produtos para cuidados pessoais","Instituto Português de Oncologia de Coimbra Francisco Gentil, E. P. E. (506361438)","Bio-Rad Laboratories, Lda (501301321)","5.540,00 €",14-02-2014,14-01-2014,365 dias,"Portugal, Coimbra, Coimbra","Artigo 26.º, n.º 1, alínea a) do Código dos Contratos Públicos",27-10-2014,"3.670,00 €",,diminuição das quantidades previstas,,Não aplicável.,Não aplicável.,FALSE
Aquisição de Anticorpos para Anatomia Patológica - Histopatologia,Ajuste Direto Regime Geral,Aquisição de bens móveis,"33000000-0, Equipamento médico, medicamentos e produtos para cuidados pessoais","Instituto Português de Oncologia de Coimbra Francisco Gentil, E. P. E. (506361438)","Leica microsistemas, Lda. (500301921)","6.344,47 €",14-02-2014,02-01-2014,365 dias,"Portugal, Coimbra, Coimbra","Artigo 20.º, n.º 1, alínea a) do Código dos Contratos Públicos",25-03-2014,"1.269,95 €",,Diminuição das necessidades,,Não aplicável.,Não aplicável.,FALSE
Aquisição de Anticorpos para Anatomia Patológica - Histopatologia,Ajuste Direto Regime Geral,Aquisição de bens móveis,"33000000-0, Equipamento médico, medicamentos e produtos para cuidados pessoais","Instituto Português de Oncologia de Coimbra Francisco Gentil, E. P. E. (506361438)","Menarini Diagnosticos, Lda (502610069)","240,00 €",14-02-2014,02-01-2014,365 dias,"Portugal, Coimbra, Coimbra","Artigo 20.º, n.º 1, alínea a) do Código dos Contratos Públicos",18-08-2014,"650,00 €",,necssidade do aumento das quantidades consumidas em virtude do aumento do número de doentes,,Não aplicável.,Não aplicável.,FALSE
Aquisição de Anticorpos para Anatomia Patológica - Histopatologia,Ajuste Direto Regime Geral,Aquisição de bens móveis,"33000000-0, Equipamento médico, medicamentos e produtos para cuidados pessoais","Instituto Português de Oncologia de Coimbra Francisco Gentil, E. P. E. (506361438)","Roche Sistemas de Diagnosticos, Lda. (504282921)","4.800,00 €",14-02-2014,02-01-2014,365 dias,"Portugal, Coimbra, Coimbra","Artigo 20.º, n.º 1, alínea a) do Código dos Contratos Públicos",23-12-2014,"9.550,00 €",,Necessidade do aumento das quantidades consumidas em virtude do aumento do número de doentes,,Não aplicável.,Não aplicável.,FALSE
Aquisição de Anticorpos para Anatomia Patológica - Histopatologia,Ajuste Direto Regime Geral,Aquisição de bens móveis,"33000000-0, Equipamento médico, medicamentos e produtos para cuidados pessoais","Instituto Português de Oncologia de Coimbra Francisco Gentil, E. P. E. (506361438)","Grupo Taper - Equip. Prec. Cientifica, Lda. (506886336)","2.548,00 €",14-02-2014,02-01-2014,365 dias,"Portugal, Coimbra, Coimbra","Artigo 20.º, n.º 1, alínea a) do Código dos Contratos Públicos",20-10-2014,"1.911,00 €",,diminuição das necessidades,,Não aplicável.,Não aplicável.,FALSE
Aquisição de Anticorpos para Anatomia Patológica - Histopatologia,Ajuste Direto Regime Geral,Aquisição de bens móveis,"33000000-0, Equipamento médico, medicamentos e produtos para cuidados pessoais","Instituto Português de Oncologia de Coimbra Francisco Gentil, E. P. E. (506361438)",Alfagene (503387398),"1.344,42 €",14-02-2014,02-01-2014,365 dias,"Portugal, Coimbra, Coimbra","Artigo 20.º, n.º 1, alínea a) do Código dos Contratos Públicos",13-11-2014,"1.344,42 €",,"",,Não aplicável.,Não aplicável.,FALSE
Aquisição de Anticorpos para Anatomia Patológica - Histopatologia,Ajuste Direto Regime Geral,Aquisição de bens móveis,"33000000-0, Equipamento médico, medicamentos e produtos para cuidados pessoais","Instituto Português de Oncologia de Coimbra Francisco Gentil, E. P. E. (506361438)","Lusopalex, Lda. (503531588)","1.710,76 €",14-02-2014,02-01-2014,365 dias,"Portugal, Coimbra, Coimbra","Artigo 20.º, n.º 1, alínea a) do Código dos Contratos Públicos",31-12-2014,"",,Diminuição das necessidades,,Não aplicável.,Não aplicável.,FALSE
Aquisição de Anticorpos para Anatomia Patológica - Histopatologia,Ajuste Direto Regime Geral,Aquisição de bens móveis,"33000000-0, Equipamento médico, medicamentos e produtos para cuidados pessoais","Instituto Português de Oncologia de Coimbra Francisco Gentil, E. P. E. (506361438)","Inopat, SA (503294420)","1.388,00 €",14-02-2014,02-01-2014,365 dias,"Portugal, Coimbra, Coimbra","Artigo 20.º, n.º 1, alínea a) do Código dos Contratos Públicos",10-04-2014,"694,00 €",,Diminuição das necessidades,,Não aplicável.,Não aplicável.,FALSE
Aquisição de Marcadores Virais,Ajuste Direto Regime Geral,Aquisição de bens móveis,"33000000-0, Equipamento médico, medicamentos e produtos para cuidados pessoais","Instituto Português de Oncologia de Coimbra Francisco Gentil, E. P. E. (506361438)","Biomérieux Portugal - Aparelhos e Reagentes de Laboratório, Lda. (501524177)","17.935,60 €",13-02-2014,19-12-2013,365 dias,"Portugal, Coimbra, Coimbra","Artigo 20.º, n.º 1, alínea a) do Código dos Contratos Públicos",18-12-2014,"17.935,61 €",,aumento das quantidades,,Não aplicável.,Não aplicável.,FALSE
Aquisição de Marcadores Virais,Ajuste Direto Regime Geral,Aquisição de bens móveis,"33000000-0, Equipamento médico, medicamentos e produtos para cuidados pessoais","Instituto Português de Oncologia de Coimbra Francisco Gentil, E. P. E. (506361438)","Abbott Laboratórios, Lda. (500006148)","44.721,20 €",13-02-2014,19-12-2013,365 dias,"Portugal, Coimbra, Coimbra","Artigo 20.º, n.º 1, alínea a) do Código dos Contratos Públicos",19-12-2014,"45.145,58 €",,aumento das quantidades previstas,,Não aplicável.,Não aplicável.,FALSE
Aquisição de Marcadores Virais,Ajuste Direto Regime Geral,Aquisição de bens móveis,"33000000-0, Equipamento médico, medicamentos e produtos para cuidados pessoais","Instituto Português de Oncologia de Coimbra Francisco Gentil, E. P. E. (506361438)","Bio-Rad Laboratories, Lda. (501301321)","5.840,52 €",13-02-2014,19-12-2013,365 dias,"Portugal, Coimbra, Coimbra","Artigo 20.º, n.º 1, alínea a) do Código dos Contratos Públicos",09-12-2014,"7.787,36 €",,aumento das quantidades previstas,,Não aplicável.,Não aplicável.,FALSE
Serviço de monitorização dos trabalhadores profissionalmente expostos a radiação ionizante externa por dosimetria individual,Ajuste Direto Regime Geral,Aquisição de serviços,"90000000-7, Serviços relativos a águas residuais, resíduos, limpeza e ambiente","Instituto Português de Oncologia de Coimbra Francisco Gentil, E. P. E. (506361438)","Plurirad, Lda (508627265)","4.805,61 €",13-02-2014,22-01-2014,365 dias,"Portugal, Coimbra, Coimbra","Artigo 20.º, n.º 1, alínea a) do Código dos Contratos Públicos",19-02-2015,"4.558,00 €",,diminuicao das necessidades,,Não aplicável.,Não aplicável.,FALSE
Manutenção do Acelerador Linear Clinac 600C e do Colimador MMLC - 80,Ajuste Direto Regime Geral,Aquisição de serviços,"50000000-5, Serviços de reparação e manutenção","Instituto Português de Oncologia de Coimbra Francisco Gentil, E. P. E. (506361438)",Varian Medical Systems Iberica S.L. (980236436),"77.886,24 €",13-02-2014,31-01-2014,365 dias,"Portugal, Coimbra, Coimbra","Artigo 24.º, n.º 1, alínea e) do Código dos Contratos Públicos",31-01-2015,"77.886,24 €",,"",,Não aplicável.,Não aplicável.,FALSE
Manutenção Sistema Informático,Ajuste Direto Regime Geral,Aquisição de serviços,"50000000-5, Serviços de reparação e manutenção","Instituto Português de Oncologia de Coimbra Francisco Gentil, E. P. E. (506361438)","SHI, Software Hospitalar Integrado, Lda (507603907)","19.356,00 €",13-02-2014,07-02-2014,365 dias,"Portugal, Coimbra, Coimbra","Artigo 20.º, n.º 1, alínea a) do Código dos Contratos Públicos",19-12-2014,"19.356,00 €",,"",,Não aplicável.,Não aplicável.,FALSE
Manutenção do Microcolimador,Ajuste Direto Regime Geral,Aquisição de serviços,"50000000-5, Serviços de reparação e manutenção","Instituto Português de Oncologia de Coimbra Francisco Gentil, E. P. E. (506361438)",BrainLab Sales GmbH (198159823),"21.500,00 €",13-02-2014,07-02-2014,365 dias,"Portugal, Coimbra, Coimbra","Artigo 24.º, n.º 1, alínea e) do Código dos Contratos Públicos",01-10-2014,"21.500,00 €",,"",,Não aplicável.,Não aplicável.,FALSE
Aquisição de pescado - 1º Trimestre,Ajuste Direto Regime Geral,Aquisição de bens móveis,"15000000-8, Produtos alimentares, bebidas, tabaco e produtos afins","Instituto Português de Oncologia de Coimbra Francisco Gentil, E. P. E. (506361438)","Nova Gel - Industria, Comercio, Produtos Alimentares, Lda. (501296999)","2.767,00 €",12-02-2014,19-12-2013,90 dias,"Portugal, Coimbra, Coimbra","Artigo 20.º, n.º 1, alínea a) do Código dos Contratos Públicos",25-03-2014,"1.218,50 €",,Diminuição das necessidades,,Não aplicável.,Não aplicável.,FALSE
Aquisição de pescado - 1º Trimestre,Ajuste Direto Regime Geral,Aquisição de bens móveis,"15000000-8, Produtos alimentares, bebidas, tabaco e produtos afins","Instituto Português de Oncologia de Coimbra Francisco Gentil, E. P. E. (506361438)","Litofish, Lda. (507825470)","3.069,30 €",12-02-2014,19-12-2013,90 dias,"Portugal, Coimbra, Coimbra","Artigo 20.º, n.º 1, alínea a) do Código dos Contratos Públicos",22-03-2014,"3.843,29 €",,"",,Não aplicável.,Não aplicável.,FALSE
Aquisição de pescado - 1º Trimestre,Ajuste Direto Regime Geral,Aquisição de bens móveis,"15000000-8, Produtos alimentares, bebidas, tabaco e produtos afins","Instituto Português de Oncologia de Coimbra Francisco Gentil, E. P. E. (506361438)","Indubeira - Industria Alimentar, SA (503501875)","2.284,60 €",12-02-2014,19-12-2013,90 dias,"Portugal, Coimbra, Coimbra","Artigo 20.º, n.º 1, alínea a) do Código dos Contratos Públicos",25-03-2014,"1.067,06 €",,Diminuição das necessidades,,Não aplicável.,Não aplicável.,FALSE
Aquisição de pescado - 1º Trimestre,Ajuste Direto Regime Geral,Aquisição de bens móveis,"15000000-8, Produtos alimentares, bebidas, tabaco e produtos afins","Instituto Português de Oncologia de Coimbra Francisco Gentil, E. P. E. (506361438)","Deltagel - Produtos Alimentares, SA (505477882)","6.906,36 €",12-02-2014,19-12-2013,90 dias,"Portugal, Coimbra, Coimbra","Artigo 20.º, n.º 1, alínea a) do Código dos Contratos Públicos",25-03-2014,"6.213,91 €",,Diminuição das necessidades,,Não aplicável.,Não aplicável.,FALSE
AQUISIÇÃO DE CONTROLO DE QUALIDADE EXTERNO,Ajuste Direto Regime Geral,Aquisição de bens móveis,"33000000-0, Equipamento médico, medicamentos e produtos para cuidados pessoais","Instituto Português de Oncologia de Coimbra Francisco Gentil, E. P. E. (506361438)","Biognóstica . Distribuição de Produtos e Equipamentos Técnicos, Lda. (504441256)","3.666,00 €",12-02-2014,19-12-2013,365 dias,"Portugal, Coimbra, Coimbra","Artigo 20.º, n.º 1, alínea a) do Código dos Contratos Públicos",09-05-2014,"3.666,00 €",,"",,Não aplicável.,Não aplicável.,FALSE
Aquisição de Fruta e Legumes Frescos e Congelados - 1º Trimestre,Ajuste Direto Regime Geral,Aquisição de bens móveis,"15000000-8, Produtos alimentares, bebidas, tabaco e produtos afins","Instituto Português de Oncologia de Coimbra Francisco Gentil, E. P. E. (506361438)",Adriano Manuel Ventura A. Carvalho (172405890),"5.400,10 €",11-02-2014,19-12-2013,90 dias,"Portugal, Coimbra, Coimbra","Artigo 20.º, n.º 1, alínea a) do Código dos Contratos Públicos",28-03-2014,"3.781,53 €",,Diminuição das necessidades,,Não aplicável.,Não aplicável.,FALSE
Aquisição de Fruta e Legumes Frescos e Congelados - 1º Trimestre,Ajuste Direto Regime Geral,Aquisição de bens móveis,"15000000-8, Produtos alimentares, bebidas, tabaco e produtos afins","Instituto Português de Oncologia de Coimbra Francisco Gentil, E. P. E. (506361438)","Frutibairrada, Com. Frutas e Legumes, Lda. (504314750)","2.592,60 €",11-02-2014,19-12-2013,90 dias,"Portugal, Coimbra, Coimbra","Artigo 20.º, n.º 1, alínea a) do Código dos Contratos Públicos",28-03-2014,"3.276,19 €",,"",,Não aplicável.,Não aplicável.,FALSE
Aquisição de Fruta e Legumes Frescos e Congelados - 1º Trimestre,Ajuste Direto Regime Geral,Aquisição de bens móveis,"15000000-8, Produtos alimentares, bebidas, tabaco e produtos afins","Instituto Português de Oncologia de Coimbra Francisco Gentil, E. P. E. (506361438)",Maria Isabel Ribeiro Gaspar (146220935),"3.492,90 €",11-02-2014,19-12-2013,90 dias,"Portugal, Coimbra, Coimbra","Artigo 20.º, n.º 1, alínea a) do Código dos Contratos Públicos",28-03-2014,"2.816,14 €",,Diminuição das necessidades,,Não aplicável.,Não aplicável.,FALSE
Aquisição de Fruta e Legumes Frescos e Congelados - 1º Trimestre,Ajuste Direto Regime Geral,Aquisição de bens móveis,"15000000-8, Produtos alimentares, bebidas, tabaco e produtos afins","Instituto Português de Oncologia de Coimbra Francisco Gentil, E. P. E. (506361438)",Nova Gel (501296999),"156,88 €",11-02-2014,19-12-2013,90 dias,"Portugal, Coimbra, Coimbra","Artigo 20.º, n.º 1, alínea a) do Código dos Contratos Públicos",20-02-2014,"12,80 €",,Diminuição das necessidades,,Não aplicável.,Não aplicável.,FALSE
Aquisição de Fruta e Legumes Frescos e Congelados - 1º Trimestre,Ajuste Direto Regime Geral,Aquisição de bens móveis,"15000000-8, Produtos alimentares, bebidas, tabaco e produtos afins","Instituto Português de Oncologia de Coimbra Francisco Gentil, E. P. E. (506361438)","JPP Frutas, Lda.  (506946916)","2.582,50 €",11-02-2014,19-12-2013,90 dias,"Portugal, Coimbra, Coimbra","Artigo 20.º, n.º 1, alínea a) do Código dos Contratos Públicos",28-03-2014,"2.305,33 €",,Diminuição das necessidades,,Não aplicável.,Não aplicável.,FALSE
Aquisição de Fruta e Legumes Frescos e Congelados - 1º Trimestre,Ajuste Direto Regime Geral,Aquisição de bens móveis,"15000000-8, Produtos alimentares, bebidas, tabaco e produtos afins","Instituto Português de Oncologia de Coimbra Francisco Gentil, E. P. E. (506361438)","Indubeira - Industria Alimentar, SA (503501875)","2.496,00 €",11-02-2014,19-12-2013,90 dias,"Portugal, Coimbra, Coimbra","Artigo 20.º, n.º 1, alínea a) do Código dos Contratos Públicos",21-03-2014,"654,82 €",,Diminuição das necessidades,,Não aplicável.,Não aplicável.,FALSE
Aquisição de Fruta e Legumes Frescos e Congelados - 1º Trimestre,Ajuste Direto Regime Geral,Aquisição de bens móveis,"15000000-8, Produtos alimentares, bebidas, tabaco e produtos afins","Instituto Português de Oncologia de Coimbra Francisco Gentil, E. P. E. (506361438)",Fernando Jorge de Jesus Póvoa (209909951),"3.859,60 €",11-02-2014,19-12-2013,90 dias,"Portugal, Coimbra, Coimbra","Artigo 20.º, n.º 1, alínea a) do Código dos Contratos Públicos",28-03-2014,"3.045,61 €",,Diminuição das necessidades,,Não aplicável.,Não aplicável.,FALSE
Aquisição de Fruta e Legumes Frescos e Congelados - 1º Trimestre,Ajuste Direto Regime Geral,Aquisição de bens móveis,"15000000-8, Produtos alimentares, bebidas, tabaco e produtos afins","Instituto Português de Oncologia de Coimbra Francisco Gentil, E. P. E. (506361438)",Frutas do Bispo (506284204),"4.578,90 €",11-02-2014,19-12-2013,90 dias,"Portugal, Coimbra, Coimbra","Artigo 20.º, n.º 1, alínea a) do Código dos Contratos Públicos",27-03-2014,"4.916,70 €",,Necessidade de aumento das quantidades consumidas em virtude do aumento do nº de doentes,,Não aplicável.,Não aplicável.,FALSE
Aquisição de Fruta e Legumes Frescos e Congelados - 1º Trimestre,Ajuste Direto Regime Geral,Aquisição de bens móveis,"15000000-8, Produtos alimentares, bebidas, tabaco e produtos afins","Instituto Português de Oncologia de Coimbra Francisco Gentil, E. P. E. (506361438)","Deltagel - Produtos Alimentares, SA (505477882)","4.071,85 €",11-02-2014,19-11-2013,90 dias,"Portugal, Coimbra, Coimbra","Artigo 20.º, n.º 1, alínea a) do Código dos Contratos Públicos",25-03-2014,"2.144,70 €",,Diminuição das necessidades,,Não aplicável.,Não aplicável.,FALSE
Aquisição de Suplementos Aimentares para Adultos,Ajuste Direto Regime Geral,Aquisição de bens móveis,"15000000-8, Produtos alimentares, bebidas, tabaco e produtos afins","Instituto Português de Oncologia de Coimbra Francisco Gentil, E. P. E. (506361438)","Netlé Portugal, SA. (500201307)","5.956,00 €",11-02-2014,07-02-2014,365 dias,"Portugal, Coimbra, Coimbra","Artigo 20.º, n.º 1, alínea a) do Código dos Contratos Públicos",22-12-2014,"4.813,42 €",,Diminuição das necessidades,,Não aplicável.,Não aplicável.,FALSE
AQUISICAO DE MATERIAL DE ELETROMEDICINA,Ajuste Direto Regime Geral,Aquisição de bens móveis,"33000000-0, Equipamento médico, medicamentos e produtos para cuidados pessoais","Instituto Português de Oncologia de Coimbra Francisco Gentil, E. P. E. (506361438)",PROMEICENTRO LDA (506470113),"12.057,74 €",11-02-2014,15-01-2014,365 dias,"Portugal, Coimbra, Coimbra","Artigo 20.º, n.º 1, alínea a) do Código dos Contratos Públicos",31-12-2014,"3.898,61 €",,DIMINUICAO DAS NECESSIDADES,,Não aplicável.,Não aplicável.,FALSE
MANUTENCAO DE ESPACOS VERDES,Ajuste Direto Regime Geral,Aquisição de serviços,"77000000-0, Serviços de agricultura, silvicultura, horticultura, aquicultura e apicultura","Instituto Português de Oncologia de Coimbra Francisco Gentil, E. P. E. (506361438)",FORTE&GOMES LDA (506288510),"3.960,00 €",11-02-2014,13-01-2014,365 dias,"Portugal, Coimbra, Coimbra","Artigo 20.º, n.º 1, alínea a) do Código dos Contratos Públicos",29-12-2014,"3.960,00 €",,"",,Não aplicável.,Não aplicável.,FALSE
SERVICOS DE OXIGENOTERAPIA POR CONCENTRADOR PORTATIL,Ajuste Direto Regime Geral,Aquisição de serviços,"85000000-9, Serviços de saúde e acção social","Instituto Português de Oncologia de Coimbra Francisco Gentil, E. P. E. (506361438)",VITALAIRE S.A. (509681840),"4.000,00 €",11-02-2014,31-01-2014,365 dias,"Portugal, Coimbra, Coimbra","Artigo 20.º, n.º 1, alínea a) do Código dos Contratos Públicos",11-07-2014,"351,00 €",,DIMINUICAO DAS NECESSIDADES,,Não aplicável.,Não aplicável.,FALSE
SERVICOS DE CONTROLE DE QUALIDADE ALIMENTAR,Ajuste Direto Regime Geral,Aquisição de serviços,"90000000-7, Serviços relativos a águas residuais, resíduos, limpeza e ambiente","Instituto Português de Oncologia de Coimbra Francisco Gentil, E. P. E. (506361438)",SILLIKER PORTUGAL S.A. (502640081),"740,00 €",11-02-2014,19-12-2013,365 dias,"Portugal, Coimbra, Coimbra","Artigo 20.º, n.º 1, alínea a) do Código dos Contratos Públicos",12-12-2014,"718,22 €",,DIMINUICAO DAS NECESSIDADES,,Não aplicável.,Não aplicável.,FALSE
MANUTENCAO APARELHO INCLUSAO/MESA DE MACROSCOPIA E CONTROLO AMBIENTAL,Ajuste Direto Regime Geral,Aquisição de serviços,"50000000-5, Serviços de reparação e manutenção","Instituto Português de Oncologia de Coimbra Francisco Gentil, E. P. E. (506361438)",SUCH-SERV. UTIL. COMUM DOS HOSPITAIS (500900469),"4.811,76 €",11-02-2014,22-01-2014,365 dias,"Portugal, Coimbra, Coimbra","Artigo 20.º, n.º 1, alínea a) do Código dos Contratos Públicos",09-12-2014,"4.811,76 €",,"",,Não aplicável.,Não aplicável.,FALSE
