freguesia,acronym,validVotesPercentage,votes,dicofre
Ermesinde,PS,39.94,4939,131503
Ermesinde,PPD/PSD,20.09,2484,131503
Ermesinde,B.E.,13.9,1719,131503
Ermesinde,PAN,7.29,902,131503
Ermesinde,PCP-PEV,5.26,650,131503
Ermesinde,CDS-PP,4.12,510,131503
Ermesinde,L,1.69,209,131503
Ermesinde,NC,1.51,187,131503
Ermesinde,A,1.3,161,131503
Ermesinde,IL,1.16,143,131503
Ermesinde,PPM.PPV/CDC,1.16,143,131503
Ermesinde,PCTP/MRPP,0.86,106,131503
Ermesinde,PNR,0.53,66,131503
Ermesinde,PDR,0.49,61,131503
Ermesinde,PURP,0.45,56,131503
Ermesinde,MAS,0.13,16,131503
Ermesinde,PTP,0.11,14,131503
