Objeto do Contrato,Tipo de Procedimento,Tipo(s) de Contrato,CPVs,Entidade(s) Adjudicante(s),Entidade(s) Adjudicatária(s),Preço Contratual,Data de Publicação,Data de Celebração do Contrato,Prazo de Execução,Local de Execução,Fundamentação,Data de Fecho do Contrato,Preço Total Efetivo,Causas das Alterações ao Prazo,Causas das Alterações ao Preço,Estado,N.º registo do Acordo Quadro,Descrição do Acordo Quadro,Procedimento Centralizado
4S0029/2018 SERV MED ANESTESIA P ANO 2018,Ajuste Direto Regime Geral,Aquisição de serviços,"85100000-0, Serviços de saúde","Centro Hospitalar Barreiro Montijo, E. P. E. (509186998)","Marco Dornelles Unipessoal, Lda. (510362656)","47.621,50 €",06-06-2018,14-02-2018,365 dias,"Portugal, Setúbal, Barreiro","Artigo 24.º, n.º 1, alínea a) do Código dos Contratos Públicos",31-12-2018,"41.047,97 €","",Consumo efetivo inferior ao estimado,,Não aplicável.,Não aplicável.,FALSE
4S0056/2017 SERV MED ANESTESIA P/ ANO 2017,Ajuste Direto Regime Geral,Aquisição de serviços,"85100000-0, Serviços de saúde","Centro Hospitalar Barreiro Montijo, E. P. E. (509186998)","Marco Dornelles Unipessoal, Lda. (510362656)","48.400,00 €",23-10-2017,13-02-2017,365 dias,"Portugal, Setúbal, Barreiro","Artigo 20.º, n.º 1, alínea a) do Código dos Contratos Públicos",31-12-2017,"53.695,01 €","",Consumo efetivo superior ao estimado,,Não aplicável.,Não aplicável.,FALSE
Aquisição de serviços médicos de anestesiologia,Ajuste Direto Regime Geral,Aquisição de serviços,"85121000-3, Serviços de prática médica","Centro Hospitalar Cova da Beira, E. P. E. (506361659)","Marco Dornelles Unipessoal, Lda. (510362656)","31.099,20 €",21-03-2017,29-04-2016,244 dias,"Portugal, Castelo Branco, Covilhã","Artigo 20.º, n.º 1, alínea a) do Código dos Contratos Públicos","","","","",,Não aplicável.,Não aplicável.,FALSE
4S0035/2016 SERV MÉD ANESTESIA P ANO 2016,Ajuste Direto Regime Geral,Aquisição de serviços,"85140000-2, Serviços de saúde diversos","Centro Hospitalar Barreiro Montijo, E. P. E. (509186998)","MARCO DORNELLES UNIPESSOAL, LDA. (510362656)","36.960,00 €",14-02-2017,19-02-2016,334 dias,"Portugal, Setúbal, Barreiro","Artigo 20.º, n.º 1, alínea a) do Código dos Contratos Públicos",31-12-2016,"41.823,84 €","",Consumo efetivo superior ao inicialmente estimado,,Não aplicável.,Não aplicável.,FALSE
PRESTAÇÃO DE SERVIÇOS MÉDICOS DE ANESTESIOLOGIA - Ajuste Directo nº 8405325,Ajuste Direto Regime Geral,Aquisição de serviços,"85141000-9, Serviços prestados pelo pessoal médico","Hospital Garcia de Orta, E. P. E. (506361470)","MARCO DORNELLES UNIPESSOAL, LDA. (510362656)","48.880,00 €",17-11-2016,23-07-2015,365 dias,"Portugal, Setúbal, Almada","Artigo 20.º, n.º 1, alínea a) do Código dos Contratos Públicos","","","","",,Não aplicável.,Não aplicável.,FALSE
"Serviços Médicos urgência e básica, cuidados intensivos e intermédios",Ajuste Direto Regime Geral,Aquisição de serviços,"85121100-4, Serviços de médicos de clínica geral","Centro Hospitalar do Algarve, E. P. E. (510745997)","Marco Dornelles Unipessoal, Lda (510362656)","11.160,00 €",04-06-2015,18-05-2015,214 dias,"Portugal, Faro, Faro<BR/>Portugal, Faro, Portimão","Artigo 24.º, n.º 1, alínea c) do Código dos Contratos Públicos",31-10-2015,"1.440,00 €","","O valor inicial do Contrato teve por base as necessidades estimadas para o período de 1 Abril de 2015 a 31 Outubro de 2015, o valor final reflecte as necessidades efectivas.",,Não aplicável.,Não aplicável.,FALSE
Serviços Médicos de Anestesiologia,Ajuste Direto Regime Geral,Aquisição de serviços,"85121000-3, Serviços de prática médica","Centro Hospitalar do Algarve, E. P. E. (510745997)","Marco Dornelles Unipessoal, Lda (510362656)","82.560,00 €",18-03-2015,16-03-2015,306 dias,"Portugal, Faro, Portimão<BR/>Portugal, Faro, Faro","Artigo 24.º, n.º 1, alínea c) do Código dos Contratos Públicos",17-11-2015,"15.662,00 €",Profissional indisponível para continuar a prestar serviços de Anestesiologia,"O valor inicial do Contrato teve por base as necessidades estimadas para o período de 1 Março de 2015 a 31 Dezembro de 2015, o valor final reflecte as necessidades efectivas e o profissional deixou de prestar serviço a partir do mês de Outubro de 2015",,Não aplicável.,Não aplicável.,FALSE
"Serviços Médicos de Urgência Geral e Básica, Cuidados Intensivos e Intermédios e Anestesiologia",Ajuste Direto Regime Geral,Aquisição de serviços,"85100000-0, Serviços de saúde","Centro Hospitalar do Algarve, E. P. E. (510745997)","Marco Dornelles Unipessoal, Lda (510362656)","20.520,00 €",09-03-2015,25-02-2015,59 dias,"Portugal, Faro, Faro<BR/>Portugal, Faro, Lagos<BR/>Portugal, Faro, Portimão","Artigo 24.º, n.º 1, alínea c) do Código dos Contratos Públicos",28-02-2015,"14.280,00 €","","O valor inicial do Contrato teve por base as necessidades estimadas para o período de 1 Janeiro de 2015 a 28 Fevereiro de 2015, o valor final reflecte as necessidades efectivas.",,Não aplicável.,Não aplicável.,FALSE
"Serviços Médicos Departamento de Emergência, Urgência e Cuidados Intensivos e Urgência Geral no âmbito da Especialidade de Anestesiologia",Ajuste Direto Regime Geral,Aquisição de serviços,"85121200-5, Serviços de medicina especializada","Centro Hospitalar do Algarve, E. P. E. (510745997)","Marco Dornelles Unipessoal, Lda. (510362656)","64.800,00 €",03-04-2014,06-03-2014,365 dias,"Portugal, Faro, Faro<BR/>Portugal, Faro, Lagos<BR/>Portugal, Faro, Portimão","Artigo 20.º, n.º 1, alínea a) do Código dos Contratos Públicos",31-12-2014,"40.815,00 €","","O valor inicial do Contrato teve por base as necessidades estimadas para o período de 1 Janeiro de 2014 a 31 Dezembro de 2014, o valor final reflecte as necessidades efectivas.",,Não aplicável.,Não aplicável.,FALSE
AD 3131/2013 - Prestação de Serviços Médicos Urgência Geral (Julho a Dezembro/2013),Ajuste Direto Regime Geral,Aquisição de serviços,"85121200-5, Serviços de medicina especializada","Centro Hospitalar do Algarve, E. P. E. (510745997)","Marco Dornelles Unipessoal, Lda. (510362656)","28.800,00 €",07-01-2014,30-12-2013,184 dias,"Portugal, Faro, Faro","Artigo 20.º, n.º 1, alínea a) do Código dos Contratos Públicos","","","","",,Não aplicável.,Não aplicável.,FALSE
AD 1979/2013 - Prestação de Serviços Médicos Urgência Geral (Jan a Jun/2013),Ajuste Direto Regime Geral,Aquisição de serviços,"85121200-5, Serviços de medicina especializada","Hospital de Faro, E. P. E. (508718872)","Marco Dornelles Unipessoal, Lda. (510362656)","28.800,00 €",12-11-2013,30-06-2013,181 dias,"Portugal, Faro, Faro","Artigo 20.º, n.º 1, alínea a) do Código dos Contratos Públicos","","","","",,Não aplicável.,Não aplicável.,
