freguesia,acronym,validVotesPercentage,votes,dicofre
União das freguesias de Conceição e Estoi,PS,40.82,1252,080507
União das freguesias de Conceição e Estoi,PPD/PSD,23.25,713,080507
União das freguesias de Conceição e Estoi,B.E.,11.84,363,080507
União das freguesias de Conceição e Estoi,PCP-PEV,7.43,228,080507
União das freguesias de Conceição e Estoi,CDS-PP,4.24,130,080507
União das freguesias de Conceição e Estoi,PAN,4.04,124,080507
União das freguesias de Conceição e Estoi,CH,1.89,58,080507
União das freguesias de Conceição e Estoi,IL,1.11,34,080507
União das freguesias de Conceição e Estoi,L,1.01,31,080507
União das freguesias de Conceição e Estoi,PCTP/MRPP,1.01,31,080507
União das freguesias de Conceição e Estoi,R.I.R.,0.75,23,080507
União das freguesias de Conceição e Estoi,MPT,0.52,16,080507
União das freguesias de Conceição e Estoi,A,0.42,13,080507
União das freguesias de Conceição e Estoi,PNR,0.39,12,080507
União das freguesias de Conceição e Estoi,PDR,0.36,11,080507
União das freguesias de Conceição e Estoi,PTP,0.29,9,080507
União das freguesias de Conceição e Estoi,PURP,0.29,9,080507
União das freguesias de Conceição e Estoi,NC,0.16,5,080507
União das freguesias de Conceição e Estoi,PPM,0.16,5,080507
