Objeto do Contrato,Tipo de Procedimento,Tipo(s) de Contrato,CPVs,Entidade(s) Adjudicante(s),Entidade(s) Adjudicatária(s),Preço Contratual,Data de Publicação,Data de Celebração do Contrato,Prazo de Execução,Local de Execução,Fundamentação,Data de Fecho do Contrato,Preço Total Efetivo,Causas das Alterações ao Prazo,Causas das Alterações ao Preço,Estado,N.º registo do Acordo Quadro,Descrição do Acordo Quadro,Procedimento Centralizado
19 equipamentos para distribuição de compressão/aceleração de tráfego; 62 equipamentos de distribuição switchs; 62 passa cabos; 2 equipamentos de core de compressão/aceleração de tráfego; 2 equipamentos de core switchs; 2 equipamentos de agregação de fibra; 40 módulos de fibra.,Concurso público,Aquisição de bens móveis<br/>Aquisição de serviços,"30000000-9, Máquinas, equipamento e material de escritório e de informática, excepto mobiliário e pacotes de programas (software)","Administração Regional de Saúde do Alentejo, IP (503148768)","ATM INFORMÁTICA 2 - Soluções e Sistemas, SA (504062859)","109.976,66 €",23-02-2012,04-11-2011,29 dias,"Portugal, Évora","Artigo 20.º, n.º 1, alínea b) do Código dos Contratos Públicos",30-12-2011,"109.976,66 €","","",,Não aplicável.,Não aplicável.,
Prestação de serviços médicos para a consulta complementar na UCSP de Alandroal,Ajuste Direto Regime Geral,Aquisição de serviços,"85121000-3, Serviços de prática médica","Administração Regional de Saúde do Alentejo, IP (503148768)","Medipeople - Soluções de Saúde e Educação, Lda. (508543436)","13.224,00 €",22-02-2012,02-12-2011,90 dias,"Portugal, Évora, Alandroal","Artigo 20.º, n.º 1, alínea a) do Código dos Contratos Públicos",30-04-2012,"19.087,50 €","Prorrogação do contrato da prestação de serviços até novo contrato, resultante da conclusão do novo procedimento concursal","Prorrogação do contrato da prestação de serviços até novo contrato, resultante da conclusão do novo procedimento concursal",,Não aplicável.,Não aplicável.,
"Serviços de transporte e distribuição de consumíveis do armazém central para as Unidades de Saúde da ARSA, IP",Ajuste Direto Regime Geral,Aquisição de serviços,"60180000-3, Aluguer de veículos para transporte de mercadorias com condutor","Administração Regional de Saúde do Alentejo, IP (503148768)","Evocargo - Transporte e Distribuição de Mercadorias, Lda. (505394189)","17.280,00 €",21-02-2012,19-01-2012,365 dias,"Portugal, Évora","Artigo 20.º, n.º 1, alínea a) do Código dos Contratos Públicos",28-02-2013,"19.970,00 €","Prorrogação do contrato da prestação de serviços até novo contrato, resultante da conclusão do novo procedimento concursal","Prorrogação do contrato da prestação de serviços até novo contrato, resultante da conclusão do novo procedimento concursal",,Não aplicável.,Não aplicável.,
Aquisição de serviços médicos para a consulta programada na UCSP de Alandroal,Ajuste Direto Regime Geral,Aquisição de serviços,"85121100-4, Serviços de médicos de clínica geral","Administração Regional de Saúde do Alentejo, IP (503148768)","Nobre Acordar - Serviços Médicos, Lda. (507894910)","8.650,00 €",21-02-2012,16-11-2011,60 dias,"Portugal, Évora, Alandroal","Artigo 20.º, n.º 1, alínea a) do Código dos Contratos Públicos",30-04-2012,"16.863,50 €",Prorrogação do contrato até celebração de outro contrato resultante de novo procedimento concursal.,Prorrogação do contrato até celebração de outro contrato resultante de novo procedimento concursal.,,Não aplicável.,Não aplicável.,
