freguesia,acronym,validVotesPercentage,votes,dicofre
Benlhevai,PS,34.72,25,041002
Benlhevai,PPD/PSD,26.39,19,041002
Benlhevai,B.E.,13.89,10,041002
Benlhevai,CDS-PP,6.94,5,041002
Benlhevai,PAN,4.17,3,041002
Benlhevai,PCP-PEV,4.17,3,041002
Benlhevai,PCTP/MRPP,4.17,3,041002
Benlhevai,PPM.PPV/CDC,2.78,2,041002
Benlhevai,PTP,1.39,1,041002
Benlhevai,PURP,1.39,1,041002
Benlhevai,A,0,0,041002
Benlhevai,IL,0,0,041002
Benlhevai,L,0,0,041002
Benlhevai,MAS,0,0,041002
Benlhevai,NC,0,0,041002
Benlhevai,PDR,0,0,041002
Benlhevai,PNR,0,0,041002
