freguesia,acronym,validVotesPercentage,votes,dicofre
Serro Ventoso,PPD/PSD.CDS-PP,57.24,166,101613
Serro Ventoso,PS,23.1,67,101613
Serro Ventoso,MPT,8.28,24,101613
Serro Ventoso,L,2.07,6,101613
Serro Ventoso,B.E.,1.72,5,101613
Serro Ventoso,PCP-PEV,1.72,5,101613
Serro Ventoso,PCTP/MRPP,1.72,5,101613
Serro Ventoso,PAN,1.03,3,101613
Serro Ventoso,PND,1.03,3,101613
Serro Ventoso,PPM,0.69,2,101613
Serro Ventoso,PTP,0.69,2,101613
Serro Ventoso,MAS,0.34,1,101613
Serro Ventoso,POUS,0.34,1,101613
Serro Ventoso,PDA,0,0,101613
Serro Ventoso,PNR,0,0,101613
Serro Ventoso,PPV,0,0,101613
