freguesia,acronym,validVotesPercentage,votes,dicofre
Montes da Senhora,PPD/PSD,44.44,100,050802
Montes da Senhora,PS,31.56,71,050802
Montes da Senhora,B.E.,7.56,17,050802
Montes da Senhora,CDS-PP,4.44,10,050802
Montes da Senhora,PPM.PPV/CDC,3.11,7,050802
Montes da Senhora,PCP-PEV,2.67,6,050802
Montes da Senhora,A,2.22,5,050802
Montes da Senhora,L,1.33,3,050802
Montes da Senhora,PAN,0.89,2,050802
Montes da Senhora,PCTP/MRPP,0.89,2,050802
Montes da Senhora,MAS,0.44,1,050802
Montes da Senhora,NC,0.44,1,050802
Montes da Senhora,IL,0,0,050802
Montes da Senhora,PDR,0,0,050802
Montes da Senhora,PNR,0,0,050802
Montes da Senhora,PTP,0,0,050802
Montes da Senhora,PURP,0,0,050802
