freguesia,acronym,validVotesPercentage,votes,dicofre
"União das freguesias de Santa Maria da Feira, Travanca, Sanfins e Espargo",PS,33.95,1686,010935
"União das freguesias de Santa Maria da Feira, Travanca, Sanfins e Espargo",PPD/PSD.CDS-PP,33.91,1684,010935
"União das freguesias de Santa Maria da Feira, Travanca, Sanfins e Espargo",MPT,11.12,552,010935
"União das freguesias de Santa Maria da Feira, Travanca, Sanfins e Espargo",PCP-PEV,6.08,302,010935
"União das freguesias de Santa Maria da Feira, Travanca, Sanfins e Espargo",B.E.,5.66,281,010935
"União das freguesias de Santa Maria da Feira, Travanca, Sanfins e Espargo",L,2.5,124,010935
"União das freguesias de Santa Maria da Feira, Travanca, Sanfins e Espargo",PAN,1.65,82,010935
"União das freguesias de Santa Maria da Feira, Travanca, Sanfins e Espargo",PCTP/MRPP,1.65,82,010935
"União das freguesias de Santa Maria da Feira, Travanca, Sanfins e Espargo",PND,0.91,45,010935
"União das freguesias de Santa Maria da Feira, Travanca, Sanfins e Espargo",PTP,0.7,35,010935
"União das freguesias de Santa Maria da Feira, Travanca, Sanfins e Espargo",PPM,0.54,27,010935
"União das freguesias de Santa Maria da Feira, Travanca, Sanfins e Espargo",PNR,0.42,21,010935
"União das freguesias de Santa Maria da Feira, Travanca, Sanfins e Espargo",MAS,0.34,17,010935
"União das freguesias de Santa Maria da Feira, Travanca, Sanfins e Espargo",PPV,0.28,14,010935
"União das freguesias de Santa Maria da Feira, Travanca, Sanfins e Espargo",PDA,0.16,8,010935
"União das freguesias de Santa Maria da Feira, Travanca, Sanfins e Espargo",POUS,0.12,6,010935
