Objeto do Contrato,Tipo de Procedimento,Tipo(s) de Contrato,CPVs,Entidade(s) Adjudicante(s),Entidade(s) Adjudicatária(s),Preço Contratual,Data de Publicação,Data de Celebração do Contrato,Prazo de Execução,Local de Execução,Fundamentação,Data de Fecho do Contrato,Preço Total Efetivo,Causas das Alterações ao Prazo,Causas das Alterações ao Preço,Estado,N.º registo do Acordo Quadro,Descrição do Acordo Quadro,Procedimento Centralizado
242G18 - SERVICOS MEDICOS NEUROCIRURGIA,Ajuste Direto Regime Geral,Aquisição de serviços,"85100000-0, Serviços de saúde","Instituto Português de Oncologia de Coimbra Francisco Gentil, E. P. E. (506361438)",ARMANDO ROCHA LDA (504642294),"19.968,00 €",23-05-2018,16-01-2018,365 dias,"Portugal, Coimbra, Coimbra","Artigo 20.º, n.º 1, alínea a) do Código dos Contratos Públicos","","",,"",,Não aplicável.,Não aplicável.,FALSE
SERVIÇO MED. NEUROCIRURGIA,Ajuste Direto Regime Geral,Aquisição de serviços,"85121000-3, Serviços de prática médica","Instituto Português de Oncologia de Coimbra Francisco Gentil, E. P. E. (506361438)","ARMANDO ROCHA, LDA (504642294)","15.000,00 €",24-05-2016,28-03-2016,290 dias,"Portugal, Coimbra, Coimbra","Artigo 20.º, n.º 1, alínea a) do Código dos Contratos Públicos","","",,"",,Não aplicável.,Não aplicável.,FALSE
SERVICOS MEDICOS NEUROCIRURGIA,Ajuste Direto Regime Geral,Aquisição de serviços,"85121200-5, Serviços de medicina especializada","Instituto Português de Oncologia de Coimbra Francisco Gentil, E. P. E. (506361438)","ARMANDO ROCHA, LDA (504642294)","15.000,00 €",16-05-2016,04-02-2015,365 dias,"Portugal, Coimbra, Coimbra","Artigo 20.º, n.º 1, alínea a) do Código dos Contratos Públicos",31-12-2015,"13.575,00 €",,DIMINUIÇÃO DAS NECESSIDADES CONSUMIDAS EM VIRTUDE DO NÚMERO DE DOENTES,,Não aplicável.,Não aplicável.,FALSE
