freguesia,acronym,validVotesPercentage,votes,dicofre
Monforte,PS,36.34,161,121102
Monforte,PPD/PSD.CDS-PP,27.31,121,121102
Monforte,PCP-PEV,23.25,103,121102
Monforte,MPT,3.61,16,121102
Monforte,PCTP/MRPP,2.93,13,121102
Monforte,B.E.,2.48,11,121102
Monforte,PAN,1.13,5,121102
Monforte,L,0.68,3,121102
Monforte,PPM,0.45,2,121102
Monforte,PPV,0.45,2,121102
Monforte,PTP,0.45,2,121102
Monforte,MAS,0.23,1,121102
Monforte,PND,0.23,1,121102
Monforte,PNR,0.23,1,121102
Monforte,POUS,0.23,1,121102
Monforte,PDA,0,0,121102
