Objeto do Contrato,Tipo de Procedimento,Tipo(s) de Contrato,CPVs,Entidade(s) Adjudicante(s),Entidade(s) Adjudicatária(s),Preço Contratual,Data de Publicação,Data de Celebração do Contrato,Prazo de Execução,Local de Execução,Fundamentação,Data de Fecho do Contrato,Preço Total Efetivo,Causas das Alterações ao Prazo,Causas das Alterações ao Preço,Estado,N.º registo do Acordo Quadro,Descrição do Acordo Quadro,Procedimento Centralizado
AD 15/2016 - Prestação de serviços de lavagem e tratamento de roupa da UDA e LRSP,Ajuste Direto Regime Geral,Aquisição de serviços,"98311000-6, Serviços de recolha de roupa por lavandarias","Administração Regional de Saúde do Algarve, I. P. (503148709)",Serviço de Utilização Comum dos Hospitais (500900469),"5.888,80 €",19-02-2016,19-02-2016,304 dias,"Portugal, Faro, Faro","Artigo 20.º, n.º 1, alínea a) do Código dos Contratos Públicos",31-12-2016,"5.888,80 €",,,,Não aplicável.,Não aplicável.,FALSE
AD 22/2016 - Prestação de Serviços de Seguro Automóvel para Viaturas da ARS Algarve e Aces,Ajuste Direto Regime Geral,Aquisição de serviços,"66514110-0, Serviços de seguro automóvel","Administração Regional de Saúde do Algarve, I. P. (503148709)","Corbroker, SA - Corretores de Seguros (503239470)","8.539,38 €",17-02-2016,17-02-2016,365 dias,"Portugal, Faro, Faro","Artigo 20.º, n.º 1, alínea a) do Código dos Contratos Públicos",17-02-2017,"8.539,38 €",,,,Não aplicável.,Não aplicável.,FALSE
