Objeto do Contrato,Tipo de Procedimento,Tipo(s) de Contrato,CPVs,Entidade(s) Adjudicante(s),Entidade(s) Adjudicatária(s),Preço Contratual,Data de Publicação,Data de Celebração do Contrato,Prazo de Execução,Local de Execução,Fundamentação,Data de Fecho do Contrato,Preço Total Efetivo,Causas das Alterações ao Prazo,Causas das Alterações ao Preço,Estado,N.º registo do Acordo Quadro,Descrição do Acordo Quadro,Procedimento Centralizado
AD415-2018 MEDICAMENTO,Ajuste Direto Regime Geral,Aquisição de bens móveis,"33600000-6, Produtos farmacêuticos","Instituto Português de Oncologia de Lisboa Francisco Gentil, E. P. E. (506361616)",ALOGA PORTUGAL ARMAZENAGEM E DISTRIBUIÇÃO FARMACÊUTICA (504507230),"59.294,00 €",11-05-2018,19-04-2018,258 dias,"Portugal, Lisboa, Lisboa","Artigo 24.º, n.º 1, alínea e) do Código dos Contratos Públicos",,,,,,Não aplicável.,Não aplicável.,FALSE
AD12229-2018 MEDICAMENTOS,Ajuste Direto Regime Geral,Aquisição de bens móveis,"33600000-6, Produtos farmacêuticos","Instituto Português de Oncologia de Lisboa Francisco Gentil, E. P. E. (506361616)",ISOTOPOS E DERIVADOS ISODER S.A. (502241594),"95.750,00 €",11-05-2018,03-05-2018,252 dias,"Portugal, Lisboa, Lisboa","Artigo 24.º, n.º 1, alínea e) do Código dos Contratos Públicos",,,,,,Não aplicável.,Não aplicável.,FALSE
AD736-2018MEDICAMENTOS EXCLUSIVOS,Ajuste Direto Regime Geral,Aquisição de bens móveis,"33600000-6, Produtos farmacêuticos","Instituto Português de Oncologia de Lisboa Francisco Gentil, E. P. E. (506361616)","NOVARTIS FARMA-PRODUTOS FARMACEUTICOS, SA (500063524)","18.805,14 €",10-05-2018,12-04-2018,30 dias,"Portugal, Lisboa, Lisboa","Artigo 24.º, n.º 1, alínea e) do Código dos Contratos Públicos",,,,,,Não aplicável.,Não aplicável.,FALSE
AD330-2018DUNUTUXIMAB BETA,Ajuste Direto Regime Geral,Aquisição de bens móveis,"33600000-6, Produtos farmacêuticos","Instituto Português de Oncologia de Lisboa Francisco Gentil, E. P. E. (506361616)",IDIS LIMITED (504030298787),"172.060,00 €",10-05-2018,05-02-2018,30 dias,"Portugal, Lisboa, Lisboa","Artigo 24.º, n.º 1, alínea c) do Código dos Contratos Públicos",,,,,,Não aplicável.,Não aplicável.,FALSE
AD1439-2018 MEDICAMENTOS,Ajuste Direto Regime Geral,Aquisição de bens móveis,"33600000-6, Produtos farmacêuticos","Instituto Português de Oncologia de Lisboa Francisco Gentil, E. P. E. (506361616)",PFIZER BIOFARMACEUTICA SOCIEDADE UNIPESSOAL LDA (513300376),"42.413,19 €",10-05-2018,26-04-2018,259 dias,"Portugal, Lisboa, Lisboa","Artigo 24.º, n.º 1, alínea e) do Código dos Contratos Públicos",,,,,,Não aplicável.,Não aplicável.,FALSE
AD1192-2018 MEDICAMENTOS,Ajuste Direto Regime Geral,Aquisição de bens móveis,"33600000-6, Produtos farmacêuticos","Instituto Português de Oncologia de Lisboa Francisco Gentil, E. P. E. (506361616)",UNILFARMA-UNIÃO INTERNACIONAL DE LABORATÓRIOS  FARMACEUTICOS LDA (500293023),"10.435,79 €",09-05-2018,20-04-2018,30 dias,"Portugal, Lisboa, Lisboa","Artigo 24.º, n.º 1, alínea e) do Código dos Contratos Públicos",,,,,,Não aplicável.,Não aplicável.,FALSE
AD970-2018REAGENTES PARA ANÁLISES LAB. PATOLOGIA CLÍNICA,Ajuste Direto Regime Geral,Aquisição de bens móveis,"33696500-0, Reagentes de laboratório","Instituto Português de Oncologia de Lisboa Francisco Gentil, E. P. E. (506361616)",ABBOTT LABORATÓRIOS LDA (500006148),"327.342,20 €",08-05-2018,19-04-2018,269 dias,"Portugal, Lisboa, Lisboa","Artigo 24.º, n.º 1, alínea c) do Código dos Contratos Públicos",,,,,,Não aplicável.,Não aplicável.,FALSE
AD664-2018REAGENTES COM EQUIPAMENTO PARA BIOLOGIA MOLECULAR,Ajuste Direto Regime Geral,Aquisição de bens móveis,"33696500-0, Reagentes de laboratório","Instituto Português de Oncologia de Lisboa Francisco Gentil, E. P. E. (506361616)","IMMUCOR PORTUGAL DIAGNOSTICOS MÉDICOS, LDA (503007358)","21.600,00 €",08-05-2018,20-04-2018,239 dias,"Portugal, Lisboa, Lisboa","Artigo 24.º, n.º 1, alínea e) do Código dos Contratos Públicos",,,,,,Não aplicável.,Não aplicável.,FALSE
AD150-2018-SERVIÇOS DE UTILIZAÇÃO DAS LICENÇAS DE SOFTWARE ENSEMBLE/DEEPSEE,Ajuste Direto Regime Geral,Aquisição de bens móveis,"22456000-1, Licenças","Instituto Português de Oncologia de Lisboa Francisco Gentil, E. P. E. (506361616)","INTERYSTEMS IBÉRIA, SL (B 85286755)","12.059,66 €",08-05-2018,26-03-2018,281 dias,"Portugal, Lisboa, Lisboa","Artigo 20.º, n.º 1, alínea a) do Código dos Contratos Públicos",,,,,,Não aplicável.,Não aplicável.,FALSE
AD428-2017 PROJECTO DE EXWECUÇÃO DAS INSTALAÇÕES MECÊCANICAS RESPEITANTE AO SISTEMA DE PRODUÇÃO CENTRALIZADA DE ÁGUA QUENTE E ÁGUA GELADA  AO IPOLFG EPE.,Ajuste Direto Regime Geral,Aquisição de serviços,"71242000-6, Preparação de projecto e concepção, estimativa de custos","Instituto Português de Oncologia de Lisboa Francisco Gentil, E. P. E. (506361616)",LUXARCLIMA-INSTALAÇÕES ELÉTRICAS AR CONDICIONADO (506339416),"23.750,00 €",08-05-2018,22-03-2018,60 dias,"Portugal, Lisboa, Lisboa","Artigo 20.º, n.º 1, alínea a) do Código dos Contratos Públicos",,,,,,Não aplicável.,Não aplicável.,FALSE
AD971-2018 FORNECIMENTO DE MEDICAMENTO,Ajuste Direto Regime Geral,Aquisição de bens móveis,"33600000-6, Produtos farmacêuticos","Instituto Português de Oncologia de Lisboa Francisco Gentil, E. P. E. (506361616)",BIOJAM S.A. (513642749),"11.250,00 €",08-05-2018,17-04-2018,30 dias,"Portugal, Lisboa, Lisboa","Artigo 24.º, n.º 1, alínea e) do Código dos Contratos Públicos",,,,,,Não aplicável.,Não aplicável.,FALSE
AD17692-2018 GASES MEDICINAIS,Ajuste Direto Regime Geral,Aquisição de bens móveis,"33600000-6, Produtos farmacêuticos","Instituto Português de Oncologia de Lisboa FG, E.P.E. (506361616)","LINDE PORTUGAL, LDA. (500266344)","12.038,96 €",07-05-2018,27-04-2018,30 dias,"Portugal, Lisboa, Lisboa","Artigo 24.º, n.º 1, alínea c) do Código dos Contratos Públicos",,,,,,Não aplicável.,Não aplicável.,FALSE
"AD281-2018TRAMETINIB 0,5 MG CP",Ajuste Direto Regime Geral,Aquisição de bens móveis,"33600000-6, Produtos farmacêuticos","Instituto Português de Oncologia de Lisboa Francisco Gentil, E. P. E. (506361616)","NOVARTIS FARMA PRODUTOS FARMACEUTICOS, SA (500063524)","55.764,96 €",02-05-2018,12-04-2018,30 dias,"Portugal, Lisboa, Lisboa","Artigo 24.º, n.º 1, alínea e) do Código dos Contratos Públicos",,,,,,Não aplicável.,Não aplicável.,FALSE
AD437-2018REAGENTES WE TECNOLOGIA PARA ANÁLISES CITOMETRIA DE FLUXO,Ajuste Direto Regime Geral,Aquisição de bens móveis,"33696500-0, Reagentes de laboratório","Instituto Português de Oncologia de Lisboa Francisco Gentil, E. P. E. (506361616)","ENZIFARMA DIAGNÓSTICA E FARMACEUTICA, S.A. (503636975)","199.258,80 €",02-05-2018,26-03-2018,279 dias,"Portugal, Lisboa, Lisboa","Artigo 24.º, n.º 1, alínea e) do Código dos Contratos Públicos",,,,,,Não aplicável.,Não aplicável.,FALSE
AD201-2018 REAGENTES,Ajuste Direto Regime Geral,Aquisição de bens móveis,"33696500-0, Reagentes de laboratório","Instituto Português de Oncologia de Lisboa Francisco Gentil, E. P. E. (506361616)",COMERCIAL RAFER S.L. (980180651),"12.107,76 €",02-05-2018,10-04-2018,30 dias,"Portugal, Lisboa, Lisboa","Artigo 24.º, n.º 1, alínea e) do Código dos Contratos Públicos",,,,,,Não aplicável.,Não aplicável.,FALSE
