Objeto do Contrato,Tipo de Procedimento,Tipo(s) de Contrato,CPVs,Entidade(s) Adjudicante(s),Entidade(s) Adjudicatária(s),Preço Contratual,Data de Publicação,Data de Celebração do Contrato,Prazo de Execução,Local de Execução,Fundamentação,Data de Fecho do Contrato,Preço Total Efetivo,Causas das Alterações ao Prazo,Causas das Alterações ao Preço,Estado,N.º registo do Acordo Quadro,Descrição do Acordo Quadro,Procedimento Centralizado
Aquisição de serviços médicos sem especialidade para unidades do Dicad para o CRI Porto Central/ ET Santa Maria Feira para o ano de 2018. Processo nº18000138 - CA nº522018 - João Manuel Borges Ferreira,Ajuste Direto Regime Geral,Aquisição de serviços,"85121000-3, Serviços de prática médica","Administração Regional de Saúde do Norte, I. P. (503135593)",João Manuel Borges Ferreira (238657027),"9.724,00 €",15-06-2018,29-01-2018,366 dias,"Portugal, Porto, Vila Nova de Gaia","Artigo 20.º, n.º 1, alínea a) do Código dos Contratos Públicos",31-12-2018,"8.140,00 €",,Numero de horas realizadas inferiores ao numero de horas contratadas,,Não aplicável.,Não aplicável.,FALSE
Aquisição de serviços médicos sem especialidade  (5.5 horas semanais 22.00€) para CRI Porto Central - ET S.M. Feira adstrito ao DICAD - Dr. João Borges.,Ajuste Direto Regime Geral,Aquisição de serviços,"85121000-3, Serviços de prática médica","Administração Regional de Saúde do Norte, I. P. (503135593)",João Manuel Borges Ferreira (238657027),"1.694,00 €",24-11-2017,27-10-2017,92 dias,"Portugal, Porto, Vila Nova de Gaia","Artigo 20.º, n.º 1, alínea a) do Código dos Contratos Públicos",31-12-2017,"1.452,00 €",,Numero de horas realizadas inferiores ao numero de horas contratadas.,,Não aplicável.,Não aplicável.,FALSE
Aquisição de serviços médicos sem especialidade para o CRI Porto Central /ET Santa Maria da Feira adstrito à DICAD - Dr. João Manuel Borges Ferreira,Ajuste Direto Regime Geral,Aquisição de serviços,"85121000-3, Serviços de prática médica","Administração Regional de Saúde do Norte, I. P. (503135593)",João Manuel Borges Ferreira (238657027),"3.900,00 €",16-03-2017,27-01-2017,365 dias,"Portugal, Aveiro, Santa Maria da Feira","Artigo 20.º, n.º 1, alínea a) do Código dos Contratos Públicos",31-12-2017,"3.600,00 €",,Numero de horas realizadas inferiores ao numero de horas contratadas.,,Não aplicável.,Não aplicável.,FALSE
