freguesia,acronym,validVotesPercentage,votes,dicofre
"União das freguesias de Crasto, Ruivos e Grovelas",PPD/PSD.CDS-PP,45.65,126,160626
"União das freguesias de Crasto, Ruivos e Grovelas",PS,40.58,112,160626
"União das freguesias de Crasto, Ruivos e Grovelas",MPT,4.35,12,160626
"União das freguesias de Crasto, Ruivos e Grovelas",PAN,2.17,6,160626
"União das freguesias de Crasto, Ruivos e Grovelas",PND,1.81,5,160626
"União das freguesias de Crasto, Ruivos e Grovelas",PCP-PEV,1.45,4,160626
"União das freguesias de Crasto, Ruivos e Grovelas",PPM,1.09,3,160626
"União das freguesias de Crasto, Ruivos e Grovelas",B.E.,0.72,2,160626
"União das freguesias de Crasto, Ruivos e Grovelas",PCTP/MRPP,0.72,2,160626
"União das freguesias de Crasto, Ruivos e Grovelas",PTP,0.72,2,160626
"União das freguesias de Crasto, Ruivos e Grovelas",PNR,0.36,1,160626
"União das freguesias de Crasto, Ruivos e Grovelas",PPV,0.36,1,160626
"União das freguesias de Crasto, Ruivos e Grovelas",L,0,0,160626
"União das freguesias de Crasto, Ruivos e Grovelas",MAS,0,0,160626
"União das freguesias de Crasto, Ruivos e Grovelas",PDA,0,0,160626
"União das freguesias de Crasto, Ruivos e Grovelas",POUS,0,0,160626
