freguesia,acronym,validVotesPercentage,votes,dicofre
Geme,PPD/PSD.CDS-PP,52.06,101,031317
Geme,PS,25.77,50,031317
Geme,MPT,7.73,15,031317
Geme,PCP-PEV,3.61,7,031317
Geme,L,3.09,6,031317
Geme,PPM,2.06,4,031317
Geme,B.E.,1.55,3,031317
Geme,PND,1.55,3,031317
Geme,MAS,1.03,2,031317
Geme,PCTP/MRPP,1.03,2,031317
Geme,PAN,0.52,1,031317
Geme,PDA,0,0,031317
Geme,PNR,0,0,031317
Geme,POUS,0,0,031317
Geme,PPV,0,0,031317
Geme,PTP,0,0,031317
