freguesia,acronym,validVotesPercentage,votes,dicofre
Vinhós,PS,46.08,94,030736
Vinhós,PPD/PSD.CDS-PP,25.49,52,030736
Vinhós,PCP-PEV,13.24,27,030736
Vinhós,MPT,5.88,12,030736
Vinhós,B.E.,1.96,4,030736
Vinhós,PCTP/MRPP,1.96,4,030736
Vinhós,L,1.47,3,030736
Vinhós,PND,0.98,2,030736
Vinhós,PTP,0.98,2,030736
Vinhós,MAS,0.49,1,030736
Vinhós,PDA,0.49,1,030736
Vinhós,POUS,0.49,1,030736
Vinhós,PPM,0.49,1,030736
Vinhós,PAN,0,0,030736
Vinhós,PNR,0,0,030736
Vinhós,PPV,0,0,030736
