Objeto do Contrato,Tipo de Procedimento,Tipo(s) de Contrato,CPVs,Entidade(s) Adjudicante(s),Entidade(s) Adjudicatária(s),Preço Contratual,Data de Publicação,Data de Celebração do Contrato,Prazo de Execução,Local de Execução,Fundamentação,Data de Fecho do Contrato,Preço Total Efetivo,Causas das Alterações ao Prazo,Causas das Alterações ao Preço,Estado,N.º registo do Acordo Quadro,Descrição do Acordo Quadro,Procedimento Centralizado
Artigos de Papelaria,Ajuste Direto Regime Geral,Aquisição de bens móveis<br/>Sociedade,"30199000-0, Artigos de papelaria e outros artigos de papel",Centro Hospitalar do Oeste (510412009),"Papelaria União, Lda (504368362)","20,10 €",02-03-2016,11-12-2015,1 dias,"Portugal, Leiria, Caldas da Rainha","Artigo 20.º, n.º 1, alínea a) do Código dos Contratos Públicos",14-12-2015,"20,10 €",,,,Não aplicável.,Não aplicável.,FALSE
Artigos de Papelaria,Ajuste Direto Regime Geral,Aquisição de bens móveis<br/>Sociedade,"30199000-0, Artigos de papelaria e outros artigos de papel",Centro Hospitalar do Oeste (510412009),"Olmar-Fernando G.O.& Cª, Lda (508831989)","1,85 €",02-03-2016,11-12-2015,1 dias,"Portugal, Leiria, Caldas da Rainha","Artigo 20.º, n.º 1, alínea a) do Código dos Contratos Públicos",14-12-2015,"1,85 €",,,,Não aplicável.,Não aplicável.,FALSE
Artigos de Papelaria,Ajuste Direto Regime Geral,Sociedade<br/>Aquisição de bens móveis,"30199000-0, Artigos de papelaria e outros artigos de papel",Centro Hospitalar do Oeste (510412009),"America - Papelaria, SA (509959008)","10,30 €",02-03-2016,11-12-2015,1 dias,"Portugal, Leiria, Caldas da Rainha","Artigo 20.º, n.º 1, alínea a) do Código dos Contratos Públicos",14-12-2015,"10,30 €",,,,Não aplicável.,Não aplicável.,FALSE
Aquisição  de sacos,Ajuste Direto Regime Geral,Aquisição de bens móveis,"19640000-4, Sacos de polietileno para recolha de lixo e resíduos",Centro Hospitalar do Oeste (510412009),Microhigiene (505374030),"2.880,00 €",02-03-2016,28-07-2015,1 dias,"Portugal, Leiria, Caldas da Rainha","Artigo 20.º, n.º 1, alínea a) do Código dos Contratos Públicos",29-07-2015,"2.880,00 €",,,,Não aplicável.,Não aplicável.,FALSE
Aquisição  de sacos,Ajuste Direto Regime Geral,Aquisição de bens móveis,"19640000-4, Sacos de polietileno para recolha de lixo e resíduos",Centro Hospitalar do Oeste (510412009),"Joao Antunes Amaro,Lda (500149003)","1.796,00 €",02-03-2016,28-07-2015,1 dias,"Portugal, Leiria, Caldas da Rainha","Artigo 20.º, n.º 1, alínea a) do Código dos Contratos Públicos",29-07-2015,"1.796,00 €",,,,Não aplicável.,Não aplicável.,FALSE
Aquisição de reagentes Imunologia - AjD 80002616,Ajuste Direto Regime Geral,Aquisição de bens móveis,"33696500-0, Reagentes de laboratório",Centro Hospitalar do Oeste (510412009),Abbott Laboratorios (500006148),"6.583,54 €",01-03-2016,08-01-2016,1 dias,"Portugal, Leiria, Caldas da Rainha","Artigo 20.º, n.º 1, alínea a) do Código dos Contratos Públicos",08-01-2016,"6.583,54 €",,,,Não aplicável.,Não aplicável.,FALSE
Aquisição de reagentes imunologia - AjD 80006216,Ajuste Direto Regime Geral,Aquisição de bens móveis,"33696500-0, Reagentes de laboratório",Centro Hospitalar do Oeste (510412009),Siemens Helathcare (507925173),"5.341,04 €",01-03-2016,20-01-2016,1 dias,"Portugal, Leiria, Caldas da Rainha","Artigo 20.º, n.º 1, alínea a) do Código dos Contratos Públicos",20-01-2016,"5.341,04 €",,,,Não aplicável.,Não aplicável.,FALSE
Aquisição de reagentes de imunologia - AjD 80008116,Ajuste Direto Regime Geral,Aquisição de bens móveis,"33696500-0, Reagentes de laboratório",Centro Hospitalar do Oeste (510412009),Abbott Laboratorios (500006148),"6.147,56 €",01-03-2016,02-02-2016,1 dias,"Portugal, Leiria, Caldas da Rainha","Artigo 20.º, n.º 1, alínea a) do Código dos Contratos Públicos",02-02-2016,"6.147,56 €",,,,Não aplicável.,Não aplicável.,FALSE
Toner - Fotocondutor,Ajuste Direto Regime Geral,Aquisição de bens móveis,"30125100-2, Cartuchos de tinta (toner)",Centro Hospitalar do Oeste (510412009),Recivedras (505514788),"165,60 €",29-02-2016,28-10-2015,1 dias,"Portugal, Leiria, Caldas da Rainha","Artigo 20.º, n.º 1, alínea a) do Código dos Contratos Públicos",29-10-2015,"165,60 €",,,,Não aplicável.,Não aplicável.,FALSE
Toner - Fotocondutor,Ajuste Direto Regime Geral,Aquisição de bens móveis,"30125100-2, Cartuchos de tinta (toner)",Centro Hospitalar do Oeste (510412009),"Rebelo Santos Ibform.e Cont.,Lda (509707203)","123,00 €",29-02-2016,28-10-2015,1 dias,"Portugal, Leiria, Caldas da Rainha","Artigo 24.º, n.º 1, alínea f) do Código dos Contratos Públicos",29-10-2015,"123,00 €",,,,Não aplicável.,Não aplicável.,FALSE
Toner - Fotocondutor,Ajuste Direto Regime Geral,Aquisição de bens móveis,"30125100-2, Cartuchos de tinta (toner)",Centro Hospitalar do Oeste (510412009),"Hardtop II Consumiveis informáticos, Lda (508490561)","109,83 €",29-02-2016,28-10-2015,1 dias,"Portugal, Leiria, Caldas da Rainha","Artigo 20.º, n.º 1, alínea a) do Código dos Contratos Públicos",29-10-2015,"109,83 €",,,,Não aplicável.,Não aplicável.,FALSE
Dossier p/proc.Clinicos e Etiquetas Impressão p/Frigorifico,Ajuste Direto Regime Geral,Aquisição de bens móveis,"30190000-7, Equipamento e material de escritório diverso",Centro Hospitalar do Oeste (510412009),"Papelaria União,Lda (504368362)","36,00 €",29-02-2016,28-10-2015,1 dias,"Portugal, Leiria, Caldas da Rainha","Artigo 20.º, n.º 1, alínea a) do Código dos Contratos Públicos",29-10-2015,"36,00 €",,,,Não aplicável.,Não aplicável.,FALSE
Dossier p/proc.Clinicos e Etiquetas Impressão p/Frigorifico,Ajuste Direto Regime Geral,Aquisição de bens móveis,"30190000-7, Equipamento e material de escritório diverso",Centro Hospitalar do Oeste (510412009),"Enveloprinter, Lda (508469830)","30,00 €",29-02-2016,28-10-2015,1 dias,"Portugal, Leiria, Caldas da Rainha","Artigo 20.º, n.º 1, alínea a) do Código dos Contratos Públicos",29-10-2015,"30,00 €",,,,Não aplicável.,Não aplicável.,FALSE
Tambor-Tinteiros-Toners reciclados,Ajuste Direto Regime Geral,Aquisição de bens móveis,"30125100-2, Cartuchos de tinta (toner)",Centro Hospitalar do Oeste (510412009),Recivedras (505514788),"47,70 €",29-02-2016,15-10-2015,1 dias,"Portugal, Leiria, Caldas da Rainha","Artigo 20.º, n.º 1, alínea a) do Código dos Contratos Públicos",16-10-2015,"47,70 €",,,,Não aplicável.,Não aplicável.,FALSE
Tambor-Tinteiros-Toners reciclados,Ajuste Direto Regime Geral,Aquisição de bens móveis,"30125100-2, Cartuchos de tinta (toner)",Centro Hospitalar do Oeste (510412009),"Rebelo Santos Inform.e Cont.,Lda (509707203)","95,80 €",29-02-2016,15-10-2015,1 dias,"Portugal, Leiria, Caldas da Rainha","Artigo 20.º, n.º 1, alínea a) do Código dos Contratos Públicos",16-10-2015,"95,80 €",,,,Não aplicável.,Não aplicável.,FALSE
Tambor-Tinteiros-Toners reciclados,Ajuste Direto Regime Geral,Aquisição de bens móveis,"30125100-2, Cartuchos de tinta (toner)",Centro Hospitalar do Oeste (510412009),"Novabit-Inform.Unip.,Lda (509707203)","12,66 €",29-02-2016,15-10-2015,1 dias,"Portugal, Leiria, Caldas da Rainha","Artigo 20.º, n.º 1, alínea a) do Código dos Contratos Públicos",16-10-2015,"12,66 €",,,,Não aplicável.,Não aplicável.,FALSE
Tambor-Tinteiros-Toners reciclados,Ajuste Direto Regime Geral,Aquisição de bens móveis,"30125100-2, Cartuchos de tinta (toner)",Centro Hospitalar do Oeste (510412009),Fluir-Consumiveis e Equip.Inform.Unip (506212424),"24,00 €",29-02-2016,15-10-2015,1 dias,"Portugal, Leiria, Caldas da Rainha","Artigo 20.º, n.º 1, alínea a) do Código dos Contratos Públicos",16-10-2015,"24,00 €",,,,Não aplicável.,Não aplicável.,FALSE
41005316	Aquisição de Med. Exclusivos aos Lab.Atral,Ajuste Direto Regime Geral,Aquisição de bens móveis,"33690000-3, Medicamentos vários",Centro Hospitalar do Oeste (510412009),LABORATORIOS ATRAL S.A.                            (500162085),"153,98 €",26-02-2016,12-01-2016,1 dias,"Portugal, Leiria, Caldas da Rainha","Artigo 24.º, n.º 1, alínea e) do Código dos Contratos Públicos",12-01-2016,"153,98 €",,,,Não aplicável.,Não aplicável.,FALSE
41005316	Aquisição de Med. Exclusivos aos Lab.Atral,Ajuste Direto Regime Geral,Aquisição de bens móveis,"33690000-3, Medicamentos vários",Centro Hospitalar do Oeste (510412009),LABORATORIOS ATRAL S.A.                            (500162085),"160,50 €",26-02-2016,12-01-2016,1 dias,"Portugal, Leiria, Caldas da Rainha","Artigo 24.º, n.º 1, alínea e) do Código dos Contratos Públicos",12-01-2016,"160,50 €",,,,Não aplicável.,Não aplicável.,FALSE
41004816	Aquisição de Gases medicinais á Air Liquide,Ajuste Direto Regime Geral,Aquisição de bens móveis,"33690000-3, Medicamentos vários",Centro Hospitalar do Oeste (510412009),"AIR LIQUIDE MEDICINAL, SA.                         (501576436)","54,00 €",26-02-2016,05-01-2016,7 dias,"Portugal, Leiria, Caldas da Rainha","Artigo 24.º, n.º 1, alínea c) do Código dos Contratos Públicos",12-01-2016,"54,00 €",,,,Não aplicável.,Não aplicável.,FALSE
41004816	Aquisição de Gases medicinais á Air Liquide,Ajuste Direto Regime Geral,Aquisição de bens móveis,"33690000-3, Medicamentos vários",Centro Hospitalar do Oeste (510412009),"AIR LIQUIDE MEDICINAL, SA.                         (501576436)","75,00 €",26-02-2016,05-01-2016,7 dias,"Portugal, Leiria, Caldas da Rainha","Artigo 24.º, n.º 1, alínea c) do Código dos Contratos Públicos",12-01-2016,"75,00 €",,,,Não aplicável.,Não aplicável.,FALSE
41004816	Aquisição de Gases medicinais á Air Liquide,Ajuste Direto Regime Geral,Aquisição de bens móveis,"33690000-3, Medicamentos vários",Centro Hospitalar do Oeste (510412009),"AIR LIQUIDE MEDICINAL, SA.                         (501576436)","37,50 €",26-02-2016,05-01-2016,7 dias,"Portugal, Leiria, Caldas da Rainha","Artigo 24.º, n.º 1, alínea c) do Código dos Contratos Públicos",12-01-2016,"37,50 €",,,,Não aplicável.,Não aplicável.,FALSE
41004116	Aquisição de Gases Medicinais á Air Liquide,Ajuste Direto Regime Geral,Aquisição de bens móveis,"33690000-3, Medicamentos vários",Centro Hospitalar do Oeste (510412009),"AIR LIQUIDE MEDICINAL, SA.                         (501576436)","18,00 €",26-02-2016,08-01-2016,1 dias,"Portugal, Leiria, Caldas da Rainha","Artigo 24.º, n.º 1, alínea c) do Código dos Contratos Públicos",08-01-2016,"18,00 €",,,,Não aplicável.,Não aplicável.,FALSE
41004116	Aquisição de Gases Medicinais á Air Liquide,Ajuste Direto Regime Geral,Aquisição de bens móveis,"33690000-3, Medicamentos vários",Centro Hospitalar do Oeste (510412009),"AIR LIQUIDE MEDICINAL, SA.                         (501576436)","12,50 €",26-02-2016,08-01-2016,1 dias,"Portugal, Leiria, Caldas da Rainha","Artigo 24.º, n.º 1, alínea c) do Código dos Contratos Públicos",08-01-2016,"12,50 €",,,,Não aplicável.,Não aplicável.,FALSE
41004116	Aquisição de Gases Medicinais á Air Liquide,Ajuste Direto Regime Geral,Aquisição de bens móveis,"33690000-3, Medicamentos vários",Centro Hospitalar do Oeste (510412009),"AIR LIQUIDE MEDICINAL, SA.                         (501576436)","62,50 €",26-02-2016,08-01-2016,1 dias,"Portugal, Leiria, Caldas da Rainha","Artigo 24.º, n.º 1, alínea c) do Código dos Contratos Públicos",08-01-2016,"62,50 €",,,,Não aplicável.,Não aplicável.,FALSE
41002316	Aquisição de reagentes á ABBOTT Laboratorios,Ajuste Direto Regime Geral,Aquisição de bens móveis,"33600000-6, Produtos farmacêuticos",Centro Hospitalar do Oeste (510412009),"ABBOTT LABORATORIOS, LDA.                          (500006148)","120,00 €",26-02-2016,06-01-2016,1 dias,"Portugal, Leiria, Caldas da Rainha","Artigo 20.º, n.º 1, alínea a) do Código dos Contratos Públicos",06-01-2016,"120,00 €",,,,Não aplicável.,Não aplicável.,FALSE
41002316	Aquisição de reagentes á ABBOTT Laboratorios,Ajuste Direto Regime Geral,Aquisição de bens móveis,"33600000-6, Produtos farmacêuticos",Centro Hospitalar do Oeste (510412009),"ABBOTT LABORATORIOS, LDA.                          (500006148)","1.200,00 €",26-02-2016,06-01-2016,1 dias,"Portugal, Leiria, Caldas da Rainha","Artigo 20.º, n.º 1, alínea a) do Código dos Contratos Públicos",06-01-2016,"1.200,00 €",,,,Não aplicável.,Não aplicável.,FALSE
41001516	Aquisição de Medicamentos Exclusivos á Janssen-Cil,Ajuste Direto Regime Geral,Aquisição de bens móveis,"33690000-3, Medicamentos vários",Centro Hospitalar do Oeste (510412009),"JANSSEN-CILAG FARMACEUTICA,LDA                     (500189412)","154,08 €",26-02-2016,04-01-2016,2 dias,"Portugal, Leiria, Caldas da Rainha","Artigo 24.º, n.º 1, alínea e) do Código dos Contratos Públicos",06-01-2016,"154,08 €",,,,Não aplicável.,Não aplicável.,FALSE
41001516	Aquisição de Medicamentos Exclusivos á Janssen-Cil,Ajuste Direto Regime Geral,Aquisição de bens móveis,"33690000-3, Medicamentos vários",Centro Hospitalar do Oeste (510412009),"JANSSEN-CILAG FARMACEUTICA,LDA                     (500189412)","2.466,03 €",26-02-2016,04-01-2016,2 dias,"Portugal, Leiria, Caldas da Rainha","Artigo 24.º, n.º 1, alínea e) do Código dos Contratos Públicos",06-01-2016,"2.466,03 €",,,,Não aplicável.,Não aplicável.,FALSE
41001716	Aquisição de Detergentes á Air Liquide,Ajuste Direto Regime Geral,Aquisição de bens móveis,"33600000-6, Produtos farmacêuticos",Centro Hospitalar do Oeste (510412009),"AIR LIQUIDE MEDICINAL, SA.                         (501576436)","101,52 €",26-02-2016,05-01-2016,1 dias,"Portugal, Leiria, Caldas da Rainha","Artigo 20.º, n.º 1, alínea a) do Código dos Contratos Públicos",05-01-2016,"101,52 €",,,,Não aplicável.,Não aplicável.,FALSE
41001716	Aquisição de Detergentes á Air Liquide,Ajuste Direto Regime Geral,Aquisição de bens móveis,"33600000-6, Produtos farmacêuticos",Centro Hospitalar do Oeste (510412009),"AIR LIQUIDE MEDICINAL, SA.                         (501576436)","197,76 €",26-02-2016,05-01-2016,1 dias,"Portugal, Leiria, Caldas da Rainha","Artigo 20.º, n.º 1, alínea a) do Código dos Contratos Públicos",05-01-2016,"197,76 €",,,,Não aplicável.,Não aplicável.,FALSE
41001416	Aquisição de Medicamentos Exclusivos á Roche Farma,Ajuste Direto Regime Geral,Aquisição de bens móveis,"33690000-3, Medicamentos vários",Centro Hospitalar do Oeste (510412009),ROCHE FARMACEUTICA QUIMICA L                       (500233810),"1.688,50 €",26-02-2016,04-01-2016,1 dias,"Portugal, Leiria, Caldas da Rainha","Artigo 24.º, n.º 1, alínea e) do Código dos Contratos Públicos",04-01-2016,"1.688,50 €",,,,Não aplicável.,Não aplicável.,FALSE
41001416	Aquisição de Medicamentos Exclusivos á Roche Farma,Ajuste Direto Regime Geral,Aquisição de bens móveis,"33690000-3, Medicamentos vários",Centro Hospitalar do Oeste (510412009),ROCHE FARMACEUTICA QUIMICA L                       (500233810),"2.701,59 €",26-02-2016,04-01-2016,1 dias,"Portugal, Leiria, Caldas da Rainha","Artigo 24.º, n.º 1, alínea e) do Código dos Contratos Públicos",04-01-2016,"2.701,59 €",,,,Não aplicável.,Não aplicável.,FALSE
41001216	Aquisição de Gases Medicinais á Air Liquide,Ajuste Direto Regime Geral,Aquisição de bens móveis,"33690000-3, Medicamentos vários",Centro Hospitalar do Oeste (510412009),"AIR LIQUIDE MEDICINAL, SA.                         (501576436)","25,00 €",26-02-2016,04-01-2016,3 dias,"Portugal, Leiria, Caldas da Rainha","Artigo 24.º, n.º 1, alínea c) do Código dos Contratos Públicos",07-01-2016,"25,00 €",,,,Não aplicável.,Não aplicável.,FALSE
41001216	Aquisição de Gases Medicinais á Air Liquide,Ajuste Direto Regime Geral,Aquisição de bens móveis,"33690000-3, Medicamentos vários",Centro Hospitalar do Oeste (510412009),"AIR LIQUIDE MEDICINAL, SA.                         (501576436)","12,50 €",26-02-2016,04-01-2016,3 dias,"Portugal, Leiria, Caldas da Rainha","Artigo 24.º, n.º 1, alínea c) do Código dos Contratos Públicos",07-01-2016,"12,50 €",,,,Não aplicável.,Não aplicável.,FALSE
41001216	Aquisição de Gases Medicinais á Air Liquide,Ajuste Direto Regime Geral,Aquisição de bens móveis,"33690000-3, Medicamentos vários",Centro Hospitalar do Oeste (510412009),"AIR LIQUIDE MEDICINAL, SA.                         (501576436)","667,80 €",26-02-2016,04-01-2016,3 dias,"Portugal, Leiria, Caldas da Rainha","Artigo 24.º, n.º 1, alínea c) do Código dos Contratos Públicos",07-01-2016,"667,80 €",,,,Não aplicável.,Não aplicável.,FALSE
41001216	Aquisição de Gases Medicinais á Air Liquide,Ajuste Direto Regime Geral,Aquisição de bens móveis,"33690000-3, Medicamentos vários",Centro Hospitalar do Oeste (510412009),"AIR LIQUIDE MEDICINAL, SA.                         (501576436)","25,00 €",26-02-2016,04-01-2016,3 dias,"Portugal, Leiria, Caldas da Rainha","Artigo 24.º, n.º 1, alínea c) do Código dos Contratos Públicos",07-01-2016,"25,00 €",,,,Não aplicável.,Não aplicável.,FALSE
41001216	Aquisição de Gases Medicinais á Air Liquide,Ajuste Direto Regime Geral,Aquisição de bens móveis,"33690000-3, Medicamentos vários",Centro Hospitalar do Oeste (510412009),"AIR LIQUIDE MEDICINAL, SA.                         (501576436)","888,76 €",26-02-2016,04-01-2016,3 dias,"Portugal, Leiria, Caldas da Rainha","Artigo 24.º, n.º 1, alínea c) do Código dos Contratos Públicos",07-01-2016,"888,76 €",,,,Não aplicável.,Não aplicável.,FALSE
41001216	Aquisição de Gases Medicinais á Air Liquide,Ajuste Direto Regime Geral,Aquisição de bens móveis,"33690000-3, Medicamentos vários",Centro Hospitalar do Oeste (510412009),"AIR LIQUIDE MEDICINAL, SA.                         (501576436)","36,00 €",26-02-2016,04-01-2016,3 dias,"Portugal, Leiria, Caldas da Rainha","Artigo 24.º, n.º 1, alínea c) do Código dos Contratos Públicos",07-01-2016,"36,00 €",,,,Não aplicável.,Não aplicável.,FALSE
41001216	Aquisição de Gases Medicinais á Air Liquide,Ajuste Direto Regime Geral,Aquisição de bens móveis,"33690000-3, Medicamentos vários",Centro Hospitalar do Oeste (510412009),"AIR LIQUIDE MEDICINAL, SA.                         (501576436)","50,00 €",26-02-2016,04-01-2016,3 dias,"Portugal, Leiria, Caldas da Rainha","Artigo 24.º, n.º 1, alínea c) do Código dos Contratos Públicos",07-01-2016,"50,00 €",,,,Não aplicável.,Não aplicável.,FALSE
41001116	Aquisição de Dietas á Fresenius Kabi,Ajuste Direto Regime Geral,Aquisição de bens móveis,"33600000-6, Produtos farmacêuticos",Centro Hospitalar do Oeste (510412009),"FRESENIUS KABI PHARMA PORTUGAL, L                  (504293753)","100,80 €",26-02-2016,04-01-2016,2 dias,"Portugal, Leiria, Caldas da Rainha","Artigo 20.º, n.º 1, alínea a) do Código dos Contratos Públicos",06-01-2016,"100,80 €",,,,Não aplicável.,Não aplicável.,FALSE
41001116	Aquisição de Dietas á Fresenius Kabi,Ajuste Direto Regime Geral,Aquisição de bens móveis,"33600000-6, Produtos farmacêuticos",Centro Hospitalar do Oeste (510412009),"FRESENIUS KABI PHARMA PORTUGAL, L                  (504293753)","99,84 €",26-02-2016,06-01-2016,2 dias,"Portugal, Leiria, Caldas da Rainha","Artigo 20.º, n.º 1, alínea a) do Código dos Contratos Públicos",06-01-2016,"99,84 €",,,,Não aplicável.,Não aplicável.,FALSE
41001116	Aquisição de Dietas á Fresenius Kabi,Ajuste Direto Regime Geral,Aquisição de bens móveis,"33600000-6, Produtos farmacêuticos",Centro Hospitalar do Oeste (510412009),"FRESENIUS KABI PHARMA PORTUGAL, L                  (504293753)","90,00 €",26-02-2016,04-01-2016,2 dias,"Portugal, Leiria, Caldas da Rainha","Artigo 20.º, n.º 1, alínea a) do Código dos Contratos Públicos",06-01-2016,"90,00 €",,,,Não aplicável.,Não aplicável.,FALSE
41001116	Aquisição de Dietas á Fresenius Kabi,Ajuste Direto Regime Geral,Aquisição de bens móveis,"33600000-6, Produtos farmacêuticos",Centro Hospitalar do Oeste (510412009),"FRESENIUS KABI PHARMA PORTUGAL, L                  (504293753)","175,20 €",26-02-2016,04-01-2016,2 dias,"Portugal, Leiria, Caldas da Rainha","Artigo 20.º, n.º 1, alínea a) do Código dos Contratos Públicos",06-01-2016,"175,20 €",,,,Não aplicável.,Não aplicável.,FALSE
Aquisição de material eléctrico,Ajuste Direto Regime Geral,Aquisição de bens móveis,"31000000-6, Maquinaria, aparelhagem, equipamento e consumíveis eléctricos; iluminação",Centro Hospitalar do Oeste (510412009),Zembe (510416268),"14,25 €",25-02-2016,05-01-2015,1 dias,"Portugal, Leiria, Caldas da Rainha","Artigo 20.º, n.º 1, alínea a) do Código dos Contratos Públicos",05-01-2015,"14,25 €",,,,Não aplicável.,Não aplicável.,FALSE
Aquisição de material eléctrico,Ajuste Direto Regime Geral,Aquisição de bens móveis,"31000000-6, Maquinaria, aparelhagem, equipamento e consumíveis eléctricos; iluminação",Centro Hospitalar do Oeste (510412009),Miracaldas (503889075),"340,78 €",25-02-2016,05-01-2015,1 dias,"Portugal, Leiria, Caldas da Rainha","Artigo 20.º, n.º 1, alínea a) do Código dos Contratos Públicos",05-01-2015,"340,78 €",,,,Não aplicável.,Não aplicável.,FALSE
Aquisição de material eléctrico,Ajuste Direto Regime Geral,Aquisição de bens móveis,"31000000-6, Maquinaria, aparelhagem, equipamento e consumíveis eléctricos; iluminação",Centro Hospitalar do Oeste (510412009),Luxivo (502400315),"161,30 €",25-02-2016,05-01-2015,1 dias,"Portugal, Leiria, Caldas da Rainha","Artigo 20.º, n.º 1, alínea a) do Código dos Contratos Públicos",05-01-2015,"161,30 €",,,,Não aplicável.,Não aplicável.,FALSE
Aquisição de material eléctrico,Ajuste Direto Regime Geral,Aquisição de bens móveis,"31000000-6, Maquinaria, aparelhagem, equipamento e consumíveis eléctricos; iluminação",Centro Hospitalar do Oeste (510412009),"Eugénio & Borga,Lda (502232072)","116,00 €",25-02-2016,05-01-2015,1 dias,"Portugal, Leiria, Caldas da Rainha","Artigo 20.º, n.º 1, alínea a) do Código dos Contratos Públicos",05-01-2015,"116,00 €",,,,Não aplicável.,Não aplicável.,FALSE
Aquisição de artigos de higiene,Ajuste Direto Regime Geral,Aquisição de bens móveis,"33760000-5, Papel higiénico, lenços, toalhas de mão e guardanapos",Centro Hospitalar do Oeste (510412009),"Mundisan,Lda (502729252)","990,10 €",25-02-2016,12-10-2015,1 dias,"Portugal, Leiria, Caldas da Rainha","Artigo 20.º, n.º 1, alínea a) do Código dos Contratos Públicos",13-10-2015,"990,10 €",,,,Não aplicável.,Não aplicável.,FALSE
Aquisição de artigos de higiene,Ajuste Direto Regime Geral,Aquisição de bens móveis,"33760000-5, Papel higiénico, lenços, toalhas de mão e guardanapos",Centro Hospitalar do Oeste (510412009),Exaclean (508758190),"48,53 €",25-02-2016,12-10-2015,1 dias,"Portugal, Leiria, Caldas da Rainha","Artigo 20.º, n.º 1, alínea a) do Código dos Contratos Públicos",13-10-2015,"48,53 €",,,,Não aplicável.,Não aplicável.,FALSE
41000716	Aquisição de Alfentanil 1mg/2ml; 5mg/10ml IV       ,Ajuste Direto Regime Geral,Aquisição de bens móveis,"33690000-3, Medicamentos vários",Centro Hospitalar do Oeste (510412009),"JANSSEN-CILAG FARMACEUTICA,LDA                     (500189412)","279,92 €",25-02-2016,26-01-2016,1 dias,"Portugal, Leiria, Caldas da Rainha","Artigo 24.º, n.º 1, alínea e) do Código dos Contratos Públicos",26-01-2016,"279,92 €",,,,Não aplicável.,Não aplicável.,FALSE
41000716	Aquisição de Alfentanil 1mg/2ml; 5mg/10ml IV       ,Ajuste Direto Regime Geral,Aquisição de bens móveis,"33690000-3, Medicamentos vários",Centro Hospitalar do Oeste (510412009),"JANSSEN-CILAG FARMACEUTICA,LDA                     (500189412)","1.540,80 €",25-02-2016,26-01-2016,1 dias,"Portugal, Leiria, Caldas da Rainha","Artigo 24.º, n.º 1, alínea e) do Código dos Contratos Públicos",26-01-2016,"1.540,80 €",,,,Não aplicável.,Não aplicável.,FALSE
41000116	Aquisição de medicamentos exclusivos (Labesfal),Ajuste Direto Regime Geral,Aquisição de bens móveis,"33690000-3, Medicamentos vários",Centro Hospitalar do Oeste (510412009),"LABESFAL,LABORATORIOS ALMIRO S.A                   (501169580)","209,00 €",25-02-2016,28-01-2016,1 dias,"Portugal, Leiria, Caldas da Rainha","Artigo 24.º, n.º 1, alínea e) do Código dos Contratos Públicos",28-01-2016,"209,00 €",,,,Não aplicável.,Não aplicável.,FALSE
41000116-Aquisição de medicamentos exclusivos (Labesfal),Ajuste Direto Regime Geral,Aquisição de bens móveis,"33690000-3, Medicamentos vários",Centro Hospitalar do Oeste (510412009),"LABESFAL,LABORATORIOS ALMIRO S.A                   (501169580)","992,00 €",25-02-2016,28-01-2016,1 dias,"Portugal, Leiria, Caldas da Rainha","Artigo 24.º, n.º 1, alínea e) do Código dos Contratos Públicos",28-01-2016,"992,00 €",,,,Não aplicável.,Não aplicável.,FALSE
41000116-Aquisição de medicamentos exclusivos (Labesfal),Ajuste Direto Regime Geral,Aquisição de bens móveis,"33690000-3, Medicamentos vários",Centro Hospitalar do Oeste (510412009),"LABESFAL,LABORATORIOS ALMIRO S.A                   (501169580)","1.693,60 €",25-02-2016,28-01-2016,1 dias,"Portugal, Leiria, Caldas da Rainha","Artigo 24.º, n.º 1, alínea e) do Código dos Contratos Públicos",28-01-2016,"1.693,60 €",,,,Não aplicável.,Não aplicável.,FALSE
41000116-Aquisição de medicamentos exclusivos (Labesfal),Ajuste Direto Regime Geral,Aquisição de bens móveis,"33690000-3, Medicamentos vários",Centro Hospitalar do Oeste (510412009),"LABESFAL,LABORATORIOS ALMIRO S.A                   (501169580)","1.065,36 €",25-02-2016,28-01-2016,1 dias,"Portugal, Leiria, Caldas da Rainha","Artigo 24.º, n.º 1, alínea e) do Código dos Contratos Públicos",28-01-2016,"1.065,36 €",,,,Não aplicável.,Não aplicável.,FALSE
Sacos de plástico,Ajuste Direto Regime Geral,Aquisição de bens móveis,"19640000-4, Sacos de polietileno para recolha de lixo e resíduos",Centro Hospitalar do Oeste (510412009),"João Antunes Amaro,Lda (500149003)","561,60 €",24-02-2016,13-01-2016,1 dias,"Portugal, Leiria, Caldas da Rainha","Artigo 20.º, n.º 1, alínea a) do Código dos Contratos Públicos",14-01-2016,"561,60 €",,,,Não aplicável.,Não aplicável.,FALSE
Sacos de plástico,Ajuste Direto Regime Geral,Aquisição de bens móveis,"19640000-4, Sacos de polietileno para recolha de lixo e resíduos",Centro Hospitalar do Oeste (510412009),"Microhigiene,Lda (505374030)","2.320,00 €",24-02-2016,13-01-2016,1 dias,"Portugal, Leiria, Caldas da Rainha","Artigo 20.º, n.º 1, alínea a) do Código dos Contratos Públicos",14-01-2016,"2.320,00 €",,,,Não aplicável.,Não aplicável.,FALSE
Aquisição de material prótese revisão do joelho - AjD 42048016,Ajuste Direto Regime Geral,Aquisição de bens móveis,"33183200-8, Próteses ortopédicas",Centro Hospitalar do Oeste (510412009),Johnson&Johnson (500153370),"7.000,00 €",23-02-2016,22-01-2016,1 dias,"Portugal, Leiria, Caldas da Rainha","Artigo 20.º, n.º 1, alínea a) do Código dos Contratos Públicos",22-01-2016,"7.000,00 €",,,,Não aplicável.,Não aplicável.,FALSE
