freguesia,acronym,validVotesPercentage,votes,dicofre
Alhos Vedros,PS,33.43,1520,150601
Alhos Vedros,PCP-PEV,24.98,1136,150601
Alhos Vedros,B.E.,15.42,701,150601
Alhos Vedros,PAN,7.02,319,150601
Alhos Vedros,PPD/PSD,6.16,280,150601
Alhos Vedros,CDS-PP,2.73,124,150601
Alhos Vedros,PPM.PPV/CDC,1.87,85,150601
Alhos Vedros,PCTP/MRPP,1.8,82,150601
Alhos Vedros,L,1.45,66,150601
Alhos Vedros,A,1.23,56,150601
Alhos Vedros,NC,1.17,53,150601
Alhos Vedros,PNR,0.97,44,150601
Alhos Vedros,PURP,0.51,23,150601
Alhos Vedros,PTP,0.4,18,150601
Alhos Vedros,PDR,0.37,17,150601
Alhos Vedros,IL,0.35,16,150601
Alhos Vedros,MAS,0.15,7,150601
