Objeto do Contrato,Tipo de Procedimento,Tipo(s) de Contrato,CPVs,Entidade(s) Adjudicante(s),Entidade(s) Adjudicatária(s),Preço Contratual,Data de Publicação,Data de Celebração do Contrato,Prazo de Execução,Local de Execução,Fundamentação,Data de Fecho do Contrato,Preço Total Efetivo,Causas das Alterações ao Prazo,Causas das Alterações ao Preço,Estado,N.º registo do Acordo Quadro,Descrição do Acordo Quadro,Procedimento Centralizado
Contrato de higienização das instalações sanitárias.,Ajuste Direto Regime Geral,Aquisição de serviços,"90910000-9, Serviços de limpeza","Instituto Nacional de Saúde Dr. Ricardo Jorge, I.P. (501427511)","Initial Portugal, Lda (508565456)","12.294,59 €",27-10-2011,30-09-2011,365 dias,"Portugal, Setúbal, Setúbal<BR/>Portugal, Lisboa, Lisboa<BR/>Portugal, Porto, Porto","Artigo 20.º, n.º 1, alínea a) do Código dos Contratos Públicos",,,,,,Não aplicável.,Não aplicável.,
Contrato de assistência técnica de analizadores.,Ajuste Direto Regime Geral,Aquisição de serviços,"50530000-9, Serviços de reparação e manutenção de máquinas","Instituto Nacional de Saúde Dr. Ricardo Jorge, I.P. (501427511)","Izasa Portugal, Lda (501086110)","8.534,46 €",27-10-2011,20-10-2011,365 dias,"Portugal, Lisboa, Lisboa","Artigo 24.º, n.º 1, alínea e) do Código dos Contratos Públicos",,,,,,Não aplicável.,Não aplicável.,
Contrato de assistência técnica de equipamentos activos.,Ajuste Direto Regime Geral,Aquisição de serviços,"50530000-9, Serviços de reparação e manutenção de máquinas","Instituto Nacional de Saúde Dr. Ricardo Jorge, I.P. (501427511)","Nextiraone Portugal, SA (505134195)","11.864,81 €",27-10-2011,07-10-2011,365 dias,"Portugal, Lisboa, Lisboa<BR/>Portugal, Setúbal, Setúbal","Artigo 24.º, n.º 1, alínea e) do Código dos Contratos Públicos",,,,,,Não aplicável.,Não aplicável.,
Contrato de assistência técnica de analisadores de aminoácidos.,Ajuste Direto Regime Geral,Aquisição de serviços,"50410000-2, Serviços de reparação e manutenção de aparelhos de medição, ensaio e controlo","Instituto Nacional de Saúde Dr. Ricardo Jorge, I.P. (501427511)","Gomensoro - Instrumentacíon Cientifíca, SA (A28060283)","16.248,00 €",27-10-2011,06-10-2011,365 dias,"Portugal, Porto, Porto","Artigo 20.º, n.º 1, alínea a) do Código dos Contratos Públicos",,,,,,Não aplicável.,Não aplicável.,
