freguesia,acronym,validVotesPercentage,votes,dicofre
Pampilhosa da Serra,PS,37.89,144,061206
Pampilhosa da Serra,PPD/PSD.CDS-PP,37.63,143,061206
Pampilhosa da Serra,MPT,6.58,25,061206
Pampilhosa da Serra,PCP-PEV,6.58,25,061206
Pampilhosa da Serra,B.E.,2.89,11,061206
Pampilhosa da Serra,PND,1.84,7,061206
Pampilhosa da Serra,PTP,1.58,6,061206
Pampilhosa da Serra,PAN,1.32,5,061206
Pampilhosa da Serra,PCTP/MRPP,1.32,5,061206
Pampilhosa da Serra,L,1.05,4,061206
Pampilhosa da Serra,MAS,0.53,2,061206
Pampilhosa da Serra,PNR,0.53,2,061206
Pampilhosa da Serra,PPV,0.26,1,061206
Pampilhosa da Serra,PDA,0,0,061206
Pampilhosa da Serra,POUS,0,0,061206
Pampilhosa da Serra,PPM,0,0,061206
