Objeto do Contrato,Tipo de Procedimento,Tipo(s) de Contrato,CPVs,Entidade(s) Adjudicante(s),Entidade(s) Adjudicatária(s),Preço Contratual,Data de Publicação,Data de Celebração do Contrato,Prazo de Execução,Local de Execução,Fundamentação,Data de Fecho do Contrato,Preço Total Efetivo,Causas das Alterações ao Prazo,Causas das Alterações ao Preço,Estado,N.º registo do Acordo Quadro,Descrição do Acordo Quadro,Procedimento Centralizado
Aquisição de SISTEMA DE IRRIGAÇÃO SOB PRESSÃO P/ ARTROSCOPIA,Ajuste Direto Regime Geral,Aquisição de bens móveis,"33140000-3, Material médico de consumo","Centro Hospitalar Vila Nova de Gaia - Espinho, E. P. E. (508142156)",STRYKER PORTUGAL (504594214),"4.000,00 €",28-08-2014,14-01-2014,90 dias,"Portugal, Porto, Vila Nova de Gaia","Artigo 24.º, n.º 1, alínea c) do Código dos Contratos Públicos",,,,,,Não aplicável.,Não aplicável.,FALSE
Aquisição de Curetas,Ajuste Direto Regime Geral,Aquisição de bens móveis,"33140000-3, Material médico de consumo","Centro Hospitalar Vila Nova de Gaia - Espinho, E. P. E. (508142156)","H.R. PRODUTOS QUIMICOS, LDA (501895558)","470,00 €",28-08-2014,14-01-2014,90 dias,"Portugal, Porto, Vila Nova de Gaia","Artigo 24.º, n.º 1, alínea c) do Código dos Contratos Públicos",,,,,,Não aplicável.,Não aplicável.,FALSE
Aquisição de Clip Hemostático,Ajuste Direto Regime Geral,Aquisição de bens móveis,"33140000-3, Material médico de consumo","Centro Hospitalar Vila Nova de Gaia - Espinho, E. P. E. (508142156)",JMV - Produtos Hospitalares (501887148),"5.130,72 €",28-08-2014,14-01-2014,90 dias,"Portugal, Porto, Vila Nova de Gaia","Artigo 24.º, n.º 1, alínea c) do Código dos Contratos Públicos",,,,,,Não aplicável.,Não aplicável.,FALSE
Aquisição de Aparadeiras Plásticas,Ajuste Direto Regime Geral,Aquisição de bens móveis,"33140000-3, Material médico de consumo","Centro Hospitalar Vila Nova de Gaia - Espinho, E. P. E. (508142156)",FEIRAMÉDICA (503731900),"58,80 €",28-08-2014,14-01-2014,90 dias,"Portugal, Porto, Vila Nova de Gaia","Artigo 24.º, n.º 1, alínea c) do Código dos Contratos Públicos",,,,,,Não aplicável.,Não aplicável.,FALSE
Aquisição de RELOGIO CONTA MINUTOS,Ajuste Direto Regime Geral,Aquisição de bens móveis,"33100000-1, Equipamento médico","Centro Hospitalar Vila Nova de Gaia - Espinho, E. P. E. (508142156)","Sano-Técnica, Lda. (500239819)","18,15 €",28-08-2014,14-01-2014,90 dias,"Portugal, Porto, Vila Nova de Gaia","Artigo 24.º, n.º 1, alínea c) do Código dos Contratos Públicos",,,,,,Não aplicável.,Não aplicável.,FALSE
aquisição Gel p/ electroencefalografo,Ajuste Direto Regime Geral,Aquisição de bens móveis,"33110000-4, Equipamento de imagiologia para uso médico, dentário e veterinário","Centro Hospitalar Vila Nova de Gaia - Espinho, E. P. E. (508142156)","Sano-Técnica, Lda. (500239819)","126,00 €",28-08-2014,14-01-2014,90 dias,"Portugal, Porto, Vila Nova de Gaia","Artigo 24.º, n.º 1, alínea c) do Código dos Contratos Públicos",,,,,,Não aplicável.,Não aplicável.,FALSE
Aquisição de VALVULA DE ASPIRAÇÃO P/ BRONCOFIBROSCOPIA,Ajuste Direto Regime Geral,Aquisição de bens móveis,"33100000-1, Equipamento médico","Centro Hospitalar Vila Nova de Gaia - Espinho, E. P. E. (508142156)","OLYMPUS IBÉRIA, S.A.U. - SUCURSAL EM PORTUGAL (980474710)","953,70 €",28-08-2014,14-01-2014,90 dias,"Portugal, Porto, Vila Nova de Gaia","Artigo 24.º, n.º 1, alínea c) do Código dos Contratos Públicos",,,,,,Não aplicável.,Não aplicável.,FALSE
Aquisição de Agulhas p/ Aspiração transbronquica,Ajuste Direto Regime Geral,Aquisição de bens móveis,"33141000-0, Material médico não químico descartável e produtos hematológicos","Centro Hospitalar Vila Nova de Gaia - Espinho, E. P. E. (508142156)","OLYMPUS IBÉRIA, S.A.U. - SUCURSAL EM PORTUGAL (980474710)","3.315,60 €",28-08-2014,14-01-2014,90 dias,"Portugal, Porto, Vila Nova de Gaia","Artigo 24.º, n.º 1, alínea c) do Código dos Contratos Públicos",,,,,,Não aplicável.,Não aplicável.,FALSE
"1157214  GLAXOSMITHKLINE Produtos Farmacêuticos, Lda",Ajuste Direto Regime Geral,Aquisição de bens móveis,"33600000-6, Produtos farmacêuticos","Centro Hospitalar Vila Nova de Gaia - Espinho, E. P. E. (508142156)","GLAXOSMITHKLINE Produtos Farmacêuticos, Lda (500139962)","8.964,78 €",28-08-2014,14-01-2014,90 dias,"Portugal, Porto, Vila Nova de Gaia","Artigo 24.º, n.º 1, alínea e) do Código dos Contratos Públicos",,,,,,Não aplicável.,Não aplicável.,FALSE
Peças p / Reparação do Aparelho Lase,Ajuste Direto Regime Geral,Aquisição de bens móveis,"31000000-6, Maquinaria, aparelhagem, equipamento e consumíveis eléctricos; iluminação","Centro Hospitalar Vila Nova de Gaia - Espinho, E. P. E. (508142156)","FILSAT, LDA (506708616)","1.317,00 €",28-08-2014,14-01-2014,10 dias,"Portugal, Porto, Vila Nova de Gaia","Artigo 24.º, n.º 1, alínea e) do Código dos Contratos Públicos",,,,,,Não aplicável.,Não aplicável.,FALSE
Aquisição de Consola c/ cabo AM12,Ajuste Direto Regime Geral,Aquisição de bens móveis,"31350000-4, Condutores eléctricos para fins relacionados com controlo e dados","Centro Hospitalar Vila Nova de Gaia - Espinho, E. P. E. (508142156)",CARDIO Solutions -Eq. Médico lda (507158865),"296,00 €",28-08-2014,14-01-2014,10 dias,"Portugal, Porto, Vila Nova de Gaia","Artigo 24.º, n.º 1, alínea e) do Código dos Contratos Públicos",,,,,,Não aplicável.,Não aplicável.,FALSE
Aquisição de Consola c/ cabo AM12,Ajuste Direto Regime Geral,Aquisição de bens móveis,"31350000-4, Condutores eléctricos para fins relacionados com controlo e dados","Centro Hospitalar Vila Nova de Gaia - Espinho, E. P. E. (508142156)",JOHNSON & JOHNSON MEDICAL (500153370),"1.241,24 €",28-08-2014,14-01-2014,10 dias,"Portugal, Porto, Vila Nova de Gaia","Artigo 24.º, n.º 1, alínea e) do Código dos Contratos Públicos",,,,,,Não aplicável.,Não aplicável.,FALSE
Aquisição de Cabo p/ Placa Neutra,Ajuste Direto Regime Geral,Aquisição de bens móveis,"31300000-9, Fios e cabos isolados","Centro Hospitalar Vila Nova de Gaia - Espinho, E. P. E. (508142156)",BACELAR & IRMÃO (500532818),"61,10 €",28-08-2014,14-01-2014,10 dias,"Portugal, Porto, Vila Nova de Gaia","Artigo 24.º, n.º 1, alínea c) do Código dos Contratos Públicos",,,,,,Não aplicável.,Não aplicável.,FALSE
Aquisição de CVP Multipack,Ajuste Direto Regime Geral,Aquisição de bens móveis,"33696000-5, Reagentes e meios de contraste","Centro Hospitalar Vila Nova de Gaia - Espinho, E. P. E. (508142156)",IZASA PORTUGAL (501086110),"7.590,80 €",28-08-2014,14-01-2014,30 dias,"Portugal, Porto, Vila Nova de Gaia","Artigo 24.º, n.º 1, alínea c) do Código dos Contratos Públicos",,,,,,Não aplicável.,Não aplicável.,FALSE
Aquisição de Reagentes para Microbiologia,Ajuste Direto Regime Geral,Aquisição de bens móveis,"33696000-5, Reagentes e meios de contraste","Centro Hospitalar Vila Nova de Gaia - Espinho, E. P. E. (508142156)",BIOMERIEUX PORTUGUESA (501524177),"6.285,75 €",28-08-2014,14-01-2014,90 dias,"Portugal, Porto, Vila Nova de Gaia","Artigo 24.º, n.º 1, alínea c) do Código dos Contratos Públicos",,,,,,Não aplicável.,Não aplicável.,FALSE
Aquisição de Marcadores Radiopacos p/ Exames de Motilidade Digestiva,Ajuste Direto Regime Geral,Aquisição de bens móveis,"33696000-5, Reagentes e meios de contraste","Centro Hospitalar Vila Nova de Gaia - Espinho, E. P. E. (508142156)",EXPOMÉDICA (501886621),"600,00 €",28-08-2014,14-01-2014,30 dias,"Portugal, Porto, Vila Nova de Gaia","Artigo 24.º, n.º 1, alínea e) do Código dos Contratos Públicos",,,,,,Não aplicável.,Não aplicável.,FALSE
Aquisição de Mesa Operatória- uniddae II,Ajuste Direto Regime Geral,Aquisição de bens móveis,"33000000-0, Equipamento médico, medicamentos e produtos para cuidados pessoais","Centro Hospitalar Vila Nova de Gaia - Espinho, E. P. E. (508142156)",Maquet Portugal Lda (506819698),"63.049,00 €",24-08-2014,19-08-2014,15 dias,"Portugal, Porto, Vila Nova de Gaia","Artigo 24.º, n.º 1, alínea c) do Código dos Contratos Públicos",,,,,,Não aplicável.,Não aplicável.,FALSE
Aquisição de Laringoestroboscópio -ORL,Ajuste Direto Regime Geral,Aquisição de bens móveis,"33100000-1, Equipamento médico","Centro Hospitalar Vila Nova de Gaia - Espinho, E. P. E. (508142156)",Olympus Ibéria S.A.U. (980474710),"8.521,39 €",24-08-2014,06-08-2014,15 dias,"Portugal, Porto, Vila Nova de Gaia","Artigo 24.º, n.º 1, alínea c) do Código dos Contratos Públicos",,,,,,Não aplicável.,Não aplicável.,FALSE
Execução de reparações na Sala de Pausa - Unidade II,Ajuste Direto Regime Geral,Empreitadas de obras públicas,"45453100-8, Obras de recuperação","Centro Hospitalar Vila Nova de Gaia - Espinho, E. P. E. (508142156)",Vaslopes Sociedade de Construções Lda (504684078),"14.400,00 €",24-08-2014,04-06-2014,20 dias,"Portugal, Porto, Vila Nova de Gaia","Artigo 19.º, alínea a) do Código dos Contratos Públicos",,,,,,Não aplicável.,Não aplicável.,FALSE
Reparação do Telhado da Capela - Unidade I,Ajuste Direto Regime Geral,Empreitadas de obras públicas,"45261210-9, Cobertura de telhados","Centro Hospitalar Vila Nova de Gaia - Espinho, E. P. E. (508142156)",JJ Construções Lda (509254934),"37.680,00 €",24-08-2014,20-08-2014,45 dias,"Portugal, Porto, Vila Nova de Gaia","Artigo 24.º, n.º 1, alínea c) do Código dos Contratos Públicos",,,,,,Não aplicável.,Não aplicável.,FALSE
Correção de patologias no pavimento de um gabinete do CA,Ajuste Direto Regime Geral,Empreitadas de obras públicas,"45233251-3, Renovação de pavimentos","Centro Hospitalar Vila Nova de Gaia - Espinho, E. P. E. (508142156)",Vaslopes Sociedade de Construções Lda (504684078),"1.900,00 €",24-08-2014,01-08-2014,10 dias,"Portugal, Porto, Vila Nova de Gaia","Artigo 19.º, alínea a) do Código dos Contratos Públicos",,,,,,Não aplicável.,Não aplicável.,FALSE
Desvio da Rede de Alimentação em Média Tensão - Unidade I,Ajuste Direto Regime Geral,Empreitadas de obras públicas,"45315500-3, Instalações de média tensão","Centro Hospitalar Vila Nova de Gaia - Espinho, E. P. E. (508142156)",EDP-Distribuição-Energia S.A. (504394029),"32.694,88 €",24-08-2014,30-07-2014,120 dias,"Portugal, Porto, Vila Nova de Gaia","Artigo 24.º, n.º 1, alínea c) do Código dos Contratos Públicos",,,,,,Não aplicável.,Não aplicável.,FALSE
Construção de Cobertura na zona de receção dos Serviços Farmacêuticos,Ajuste Direto Regime Geral,Empreitadas de obras públicas,"45261213-0, Colocação de coberturas metálicas","Centro Hospitalar Vila Nova de Gaia - Espinho, E. P. E. (508142156)",Rui Firmino Guimarães Ferreira (175991642),"14.850,00 €",24-08-2014,01-08-2014,20 dias,"Portugal, Porto, Vila Nova de Gaia","Artigo 19.º, alínea a) do Código dos Contratos Públicos",,,,,,Não aplicável.,Não aplicável.,FALSE
Prestação de Serviços de Seguros de Acidentes de Trabalho  pelo período de 01 de abril a 31 de dezembro de 2014,Ajuste Direto Regime Geral,Aquisição de serviços,"66512000-2, Serviços de seguros de acidentes e de saúde","Centro Hospitalar Vila Nova de Gaia - Espinho, E. P. E. (508142156)",Lusitânia Companhia de Seguros S.A. (501689168),"297.479,79 €",24-08-2014,01-04-2014,270 dias,"Portugal, Porto, Vila Nova de Gaia","Artigo 20.º, n.º 1, alínea a) do Código dos Contratos Públicos",,,,,,Não aplicável.,Não aplicável.,FALSE
Prestação de Serviços de Coordenação de Segurança em obra ª o 3º e 4º Trimestre de 2014,Ajuste Direto Regime Geral,Aquisição de serviços,"71247000-1, Supervisão de trabalhos de construção","Centro Hospitalar Vila Nova de Gaia - Espinho, E. P. E. (508142156)",SOPSEC S.A. (501993339),"8.400,00 €",24-08-2014,08-08-2014,180 dias,"Portugal, Porto, Vila Nova de Gaia","Artigo 20.º, n.º 1, alínea a) do Código dos Contratos Públicos",,,,,,Não aplicável.,Não aplicável.,FALSE
Empreitada de Criação de Sala de Trabalhos e gabinetes no Piso 4 do Pavilhão Satélite - Unidade I,Ajuste Direto Regime Geral,Empreitadas de obras públicas,"45000000-7, Construção","Centro Hospitalar Vila Nova de Gaia - Espinho, E. P. E. (508142156)","FSA- Construções Uni pessoal, Lda (510490530)","69.500,00 €",24-08-2014,06-08-2013,45 dias,"Portugal, Porto, Vila Nova de Gaia","Artigo 19.º, alínea a) do Código dos Contratos Públicos",,,,,,Não aplicável.,Não aplicável.,FALSE
Manutenção dos Equipamentos das Salas de Servidores,Concurso público,Aquisição de serviços,"50312310-1, Manutenção de equipamento para redes de dados","Centro Hospitalar Vila Nova de Gaia - Espinho, E. P. E. (508142156)",ITEN -SOLUTIONS SA (510728189),"58.793,11 €",24-08-2014,03-07-2014,365 dias,"Portugal, Porto, Vila Nova de Gaia","Artigo 20.º, n.º 1, alínea b) do Código dos Contratos Públicos",,,,,,Não aplicável.,Não aplicável.,FALSE
Upgrade do Software de Video vigilância e Integração das 3 unidades na mesma Unidade de Controlo,Ajuste Direto Regime Geral,Aquisição de bens móveis,"48000000-8, Pacotes de software e sistemas de informação","Centro Hospitalar Vila Nova de Gaia - Espinho, E. P. E. (508142156)",STRONG- SEGURANÇA S.A. (503257567),"7.853,47 €",24-08-2014,14-08-2014,30 dias,"Portugal, Porto, Vila Nova de Gaia","Artigo 20.º, n.º 1, alínea a) do Código dos Contratos Públicos",,,,,,Não aplicável.,Não aplicável.,FALSE
Upgrade da aplicação RADIO,Ajuste Direto Regime Geral,Aquisição de bens móveis,"48000000-8, Pacotes de software e sistemas de informação","Centro Hospitalar Vila Nova de Gaia - Espinho, E. P. E. (508142156)",Glintt Healthcare (502479418),"9.720,00 €",24-08-2014,22-08-2014,30 dias,"Portugal, Porto, Vila Nova de Gaia","Artigo 24.º, n.º 1, alínea e) do Código dos Contratos Públicos",,,,,,Não aplicável.,Não aplicável.,FALSE
Aquisição de 6 Workstations e 6 Monitores,Ajuste Direto Regime Geral,Aquisição de bens móveis,"30000000-9, Máquinas, equipamento e material de escritório e de informática, excepto mobiliário e pacotes de programas (software)","Centro Hospitalar Vila Nova de Gaia - Espinho, E. P. E. (508142156)",Pamafe (504099388),"5.179,44 €",24-08-2014,13-08-2014,12 dias,"Portugal, Porto, Vila Nova de Gaia","Artigo 24.º, n.º 1, alínea c) do Código dos Contratos Públicos",,,,,,Não aplicável.,Não aplicável.,FALSE
Aquisição de 6 Licenças Autocad,Ajuste Direto Regime Geral,Aquisição de bens móveis,"48000000-8, Pacotes de software e sistemas de informação","Centro Hospitalar Vila Nova de Gaia - Espinho, E. P. E. (508142156)",ITEN -CPC.IS-Prológica (510728189),"6.960,00 €",24-08-2014,22-08-2014,5 dias,"Portugal, Porto, Vila Nova de Gaia","Artigo 24.º, n.º 1, alínea c) do Código dos Contratos Públicos",,,,,,Não aplicável.,Não aplicável.,FALSE
