freguesia,acronym,validVotesPercentage,votes,dicofre
Palhais,PS,46.3,25,091313
Palhais,PPD/PSD,40.74,22,091313
Palhais,B.E.,7.41,4,091313
Palhais,CDS-PP,1.85,1,091313
Palhais,NC,1.85,1,091313
Palhais,PCTP/MRPP,1.85,1,091313
Palhais,A,0,0,091313
Palhais,IL,0,0,091313
Palhais,L,0,0,091313
Palhais,MAS,0,0,091313
Palhais,PAN,0,0,091313
Palhais,PCP-PEV,0,0,091313
Palhais,PDR,0,0,091313
Palhais,PNR,0,0,091313
Palhais,PPM.PPV/CDC,0,0,091313
Palhais,PTP,0,0,091313
Palhais,PURP,0,0,091313
