freguesia,acronym,validVotesPercentage,votes,dicofre
Fontes,PS,44.76,94,140118
Fontes,PPD/PSD.CDS-PP,36.67,77,140118
Fontes,B.E.,2.86,6,140118
Fontes,L,2.86,6,140118
Fontes,MPT,2.86,6,140118
Fontes,PAN,1.9,4,140118
Fontes,PCP-PEV,1.9,4,140118
Fontes,PCTP/MRPP,1.9,4,140118
Fontes,PNR,1.43,3,140118
Fontes,PPM,1.43,3,140118
Fontes,MAS,0.95,2,140118
Fontes,PTP,0.48,1,140118
Fontes,PDA,0,0,140118
Fontes,PND,0,0,140118
Fontes,POUS,0,0,140118
Fontes,PPV,0,0,140118
