Objeto do Contrato,Tipo de Procedimento,Tipo(s) de Contrato,CPVs,Entidade(s) Adjudicante(s),Entidade(s) Adjudicatária(s),Preço Contratual,Data de Publicação,Data de Celebração do Contrato,Prazo de Execução,Local de Execução,Fundamentação,Data de Fecho do Contrato,Preço Total Efetivo,Causas das Alterações ao Prazo,Causas das Alterações ao Preço,Estado,N.º registo do Acordo Quadro,Descrição do Acordo Quadro,Procedimento Centralizado
Assistência técnica a central telefónica,Ajuste Direto Regime Geral,Aquisição de serviços,"71356200-0, Serviços de assistência técnica","Instituto Português de Oncologia do Porto Francisco Gentil, E. P. E. (506362299)","Warpcom Services, S.A. (505134195)","6.950,00 €",21-11-2018,04-01-2017,20 dias,"Portugal, Porto, Porto","Artigo 24.º, n.º 1, alínea e) do Código dos Contratos Públicos",,,,,,Não aplicável.,Não aplicável.,FALSE
Serviços de Jardinagem,Ajuste Direto Regime Geral,Aquisição de serviços,"77311000-3, Serviços de manutenção de jardins ornamentais e recreativos","Instituto Português de Oncologia do Porto Francisco Gentil, E. P. E. (506362299)",Vadeca (506589030),"28.458,00 €",21-11-2018,05-01-2017,365 dias,"Portugal, Porto, Porto","Artigo 20.º, n.º 1, alínea a) do Código dos Contratos Públicos",,,,,,Não aplicável.,Não aplicável.,FALSE
Responsabilidade pela instalação elétrica,Ajuste Direto Regime Geral,Aquisição de serviços,"71300000-1, Serviços de engenharia","Instituto Português de Oncologia do Porto Francisco Gentil, E. P. E. (506362299)","ATM - Assistência Total em Manutenção, S.A. (502700823)","6.960,00 €",21-11-2018,04-01-2017,20 dias,"Portugal, Porto, Porto","Artigo 20.º, n.º 1, alínea a) do Código dos Contratos Públicos",,,,,,Não aplicável.,Não aplicável.,FALSE
Serviços de desinfestação 2017,Ajuste Direto Regime Geral,Aquisição de serviços,"90670000-4, Serviços de desinfecção e exterminação em áreas urbanas ou rurais","Instituto Português de Oncologia do Porto Francisco Gentil, E. P. E. (506362299)","Companhia Europeia de Desinfeções, Lda (503231258)","6.575,12 €",21-11-2018,04-01-2017,20 dias,"Portugal, Porto, Porto","Artigo 20.º, n.º 1, alínea a) do Código dos Contratos Públicos",,,,,,Não aplicável.,Não aplicável.,FALSE
Consultoria de segurança,Ajuste Direto Regime Geral,Aquisição de serviços,"79000000-4, Serviços a empresas: direito, comercialização, consultoria, recrutamento, impressão e segurança","Instituto Português de Oncologia do Porto Francisco Gentil, E. P. E. (506362299)","Código Prodígio Unipessoal, Lda (510728855)","6.628,92 €",21-11-2018,04-01-2017,20 dias,"Portugal, Porto, Porto","Artigo 20.º, n.º 1, alínea a) do Código dos Contratos Públicos",,,,,,Não aplicável.,Não aplicável.,FALSE
Aluguer de garrafas e reservatórios de gases,Ajuste Direto Regime Geral,Aquisição de bens móveis,"24100000-5, Gases","IPO Porto FG, EPE (506362299)",Airliquide (501576436),"5.258,44 €",21-11-2018,06-03-2018,20 dias,"Portugal, Porto, Porto","Artigo 24.º, n.º 1, alínea e) do Código dos Contratos Públicos",,,,,,Não aplicável.,Não aplicável.,FALSE
Licenças antivírus,Ajuste Direto Regime Geral,Aquisição de bens móveis,"48000000-8, Pacotes de software e sistemas de informação","Instituto Português de Oncologia do Porto Francisco Gentil, E. P. E. (506362299)","Reload - Consultoria Informática, Lda. (506210855)","9.050,00 €",21-11-2018,21-04-2017,20 dias,"Portugal, Porto, Porto","Artigo 20.º, n.º 1, alínea a) do Código dos Contratos Públicos",,,,,,Não aplicável.,Não aplicável.,FALSE
Contrato Assistência Técnica a Eletrobisturis,Ajuste Direto Regime Geral,Aquisição de serviços,"71356200-0, Serviços de assistência técnica","Instituto Português de Oncologia do Porto Francisco Gentil, E. P. E. (506362299)",CLINIFAR SA (503281115),"5.572,00 €",21-11-2018,13-01-2017,20 dias,"Portugal, Porto, Porto","Artigo 24.º, n.º 1, alínea e) do Código dos Contratos Públicos",,,,,,Não aplicável.,Não aplicável.,FALSE
Manutenção a Sterrad NX,Ajuste Direto Regime Geral,Aquisição de serviços,"71356200-0, Serviços de assistência técnica","Instituto Português de Oncologia do Porto Francisco Gentil, E. P. E. (506362299)",JOHNSON (500153370),"5.184,00 €",21-11-2018,03-02-2017,20 dias,"Portugal, Porto, Porto","Artigo 24.º, n.º 1, alínea e) do Código dos Contratos Públicos",,,,,,Não aplicável.,Não aplicável.,FALSE
Serviços de serralharia - 2017,Ajuste Direto Regime Geral,Aquisição de serviços,"50000000-5, Serviços de reparação e manutenção","Instituto Português de Oncologia do Porto Francisco Gentil, E. P. E. (506362299)","Proestima - Projectos Estudos Instalações e Manutenção, Lda. (504009540)","40.768,00 €",21-11-2018,05-01-2017,365 dias,"Portugal, Porto, Porto","Artigo 20.º, n.º 1, alínea a) do Código dos Contratos Públicos",,,,,,Não aplicável.,Não aplicável.,FALSE
Manutenção à rede de água,Ajuste Direto Regime Geral,Aquisição de serviços,"71356200-0, Serviços de assistência técnica","Instituto Português de Oncologia do Porto Francisco Gentil, E. P. E. (506362299)",Enkrott (500103461),"5.472,00 €",21-11-2018,06-04-2017,20 dias,"Portugal, Porto, Porto","Artigo 20.º, n.º 1, alínea a) do Código dos Contratos Públicos",,,,,,Não aplicável.,Não aplicável.,FALSE
Comunicações Janeiro 17,Ajuste Direto Regime Geral,Aquisição de serviços,"64200000-8, Serviços de telecomunicações","Instituto Português de Oncologia do Porto Francisco Gentil, E. P. E. (506362299)","MEO - Serviços de Comunicações e Multimédia, S.A. (504615947)","5.517,15 €",21-11-2018,27-01-2017,20 dias,"Portugal, Porto, Porto","Artigo 20.º, n.º 1, alínea a) do Código dos Contratos Públicos",,,,,,Não aplicável.,Não aplicável.,FALSE
Aluguer de garrafas e reservatórios de gases,Ajuste Direto Regime Geral,Aquisição de bens móveis,"24100000-5, Gases","Instituto Português de Oncologia do Porto Francisco Gentil, E. P. E. (506362299)",Airliquide (501576436),"5.254,31 €",21-11-2018,06-03-2017,20 dias,"Portugal, Porto, Porto","Artigo 24.º, n.º 1, alínea e) do Código dos Contratos Públicos",,,,,,Não aplicável.,Não aplicável.,FALSE
Serviços de codificação,Ajuste Direto Regime Geral,Aquisição de serviços,"85140000-2, Serviços de saúde diversos","Instituto Português de Oncologia do Porto Francisco Gentil, E. P. E. (506362299)","Fernanda e José Mendes Ribeiro, Neurologia e Codificação Lda.  (514468491)","8.400,00 €",21-11-2018,09-08-2017,20 dias,"Portugal, Porto, Porto","Artigo 20.º, n.º 1, alínea a) do Código dos Contratos Públicos",,,,,,Não aplicável.,Não aplicável.,FALSE
Serviços de consultoria,Ajuste Direto Regime Geral,Aquisição de serviços,"79000000-4, Serviços a empresas: direito, comercialização, consultoria, recrutamento, impressão e segurança","Instituto Português de Oncologia do Porto Francisco Gentil, E. P. E. (506362299)","VALECONSULTORES, UNIPESSOAL, LDA (510070191)","16.375,00 €",21-11-2018,08-08-2017,20 dias,"Portugal, Porto, Porto","Artigo 20.º, n.º 1, alínea a) do Código dos Contratos Públicos",,,,,,Não aplicável.,Não aplicável.,FALSE
Serviços de catering,Ajuste Direto Regime Geral,Aquisição de serviços,"55500000-5, Serviços de cantinas e de fornecimento de refeições (catering)","Instituto Português de Oncologia do Porto Francisco Gentil, E. P. E. (506362299)","Grandes Encontros Unipessoal, Lda (507996364)","8.128,50 €",21-11-2018,25-07-2017,20 dias,"Portugal, Porto, Porto","Artigo 20.º, n.º 1, alínea a) do Código dos Contratos Públicos",,,,,,Não aplicável.,Não aplicável.,FALSE
Licenças antivírus,Ajuste Direto Regime Geral,Aquisição de bens móveis,"48000000-8, Pacotes de software e sistemas de informação","Instituto Português de Oncologia do Porto Francisco Gentil, E. P. E. (506362299)","Reload - Consultoria Informática, Lda. (506210855)","6.050,00 €",21-11-2018,17-01-2017,20 dias,"Portugal, Porto, Porto","Artigo 20.º, n.º 1, alínea a) do Código dos Contratos Públicos",,,,,,Não aplicável.,Não aplicável.,FALSE
Fornecimento de gás natural,Ao abrigo de acordo-quadro (art.º 259.º),Aquisição de bens móveis,"09123000-7, Gás natural","Instituto Português de Oncologia do Porto Francisco Gentil, E. P. E. (506362299)","GALP POWER, S.A. (504723456)","425.284,09 €",20-11-2018,07-03-2017,365 dias,"Portugal, Porto, Porto",Artigo 259.º do Código dos Contratos Públicos,,,,,,1555095,Acordo quadro para o fornecimento de gás natural em regime de mercado livre para Portugal Continental,FALSE
Serviços de técnico de arquivo,Ajuste Direto Regime Geral,Aquisição de serviços,"50000000-5, Serviços de reparação e manutenção","Instituto Português de Oncologia do Porto Francisco Gentil, E. P. E. (506362299)","Proestima - Projectos Estudos Instalações e Manutenção, Lda. (504009540)","13.800,00 €",20-11-2018,05-01-2017,365 dias,"Portugal, Porto, Porto","Artigo 20.º, n.º 1, alínea a) do Código dos Contratos Públicos",,,,,,Não aplicável.,Não aplicável.,FALSE
Contrato Assistência Técnica  a aplicativos Glintt 2º semestre,Ajuste Direto Regime Geral,Aquisição de serviços,"72200000-7, Serviços de consultoria e de programação de software","Instituto Português de Oncologia do Porto Francisco Gentil, E. P. E. (506362299)","Glintt - Healthcare Solutions, S.A. (502479418)","26.621,40 €",20-11-2018,11-08-2017,365 dias,"Portugal, Porto, Porto","Artigo 24.º, n.º 1, alínea e) do Código dos Contratos Públicos",,,,,,Não aplicável.,Não aplicável.,FALSE
Manutenção a monitores,Ajuste Direto Regime Geral,Aquisição de serviços,"71356200-0, Serviços de assistência técnica","Instituto Português de Oncologia do Porto Francisco Gentil, E. P. E. (506362299)","GENERAL ELECTRIC HEALTHCARE PORTUGAL, SOC.UNIP.LDA (500357129)","24.948,84 €",20-11-2018,09-02-2017,365 dias,"Portugal, Porto, Porto","Artigo 24.º, n.º 1, alínea e) do Código dos Contratos Públicos",,,,,,Não aplicável.,Não aplicável.,FALSE
Serviços de oftalmologia em 2017,Ajuste Direto Regime Geral,Aquisição de serviços,"85100000-0, Serviços de saúde","Instituto Português de Oncologia do Porto Francisco Gentil, E. P. E. (506362299)",Clínica Médica e Oftalmológica Lemos e Teves Lda.  (506497364),"216.000,00 €",20-11-2018,08-02-2017,365 dias,"Portugal, Porto, Porto","Artigo 24.º, n.º 1, alínea e) do Código dos Contratos Públicos",,,,,,Não aplicável.,Não aplicável.,FALSE
Serviços de técnico de arquivo,Ajuste Direto Regime Geral,Aquisição de serviços,"50000000-5, Serviços de reparação e manutenção","Instituto Português de Oncologia do Porto Francisco Gentil, E. P. E. (506362299)","Proestima - Projectos Estudos Instalações e Manutenção, Lda. (504009540)","13.800,00 €",20-11-2018,05-01-2017,365 dias,"Portugal, Porto, Porto","Artigo 20.º, n.º 1, alínea a) do Código dos Contratos Públicos",,,,,,Não aplicável.,Não aplicável.,FALSE
Manutenção a equipamento de imagiologia GE,Ajuste Direto Regime Geral,Aquisição de serviços,"71356200-0, Serviços de assistência técnica","Instituto Português de Oncologia do Porto Francisco Gentil, E. P. E. (506362299)","GENERAL ELECTRIC HEALTHCARE PORTUGAL, SOC.UNIP.LDA (500357129)","245.166,72 €",20-11-2018,24-01-2017,365 dias,"Portugal, Porto, Porto","Artigo 24.º, n.º 1, alínea e) do Código dos Contratos Públicos",,,,,,Não aplicável.,Não aplicável.,FALSE
Assinatura de publicações periódicas,Ajuste Direto Regime Geral,Aquisição de serviços,"79980000-7, Serviços de assinatura","Instituto Português de Oncologia do Porto Francisco Gentil, E. P. E. (506362299)","Lusodoc, Documentação Técnico - Cientifíca, Lda (502609982)","64.077,71 €",20-11-2018,11-01-2017,365 dias,"Portugal, Porto, Porto","Artigo 24.º, n.º 1, alínea e) do Código dos Contratos Públicos",,,,,,Não aplicável.,Não aplicável.,FALSE
Assinatura publicações online,Ajuste Direto Regime Geral,Aquisição de serviços,"79980000-7, Serviços de assinatura","Instituto Português de Oncologia do Porto Francisco Gentil, E. P. E. (506362299)",EBSCO Information Services SLU (B85765766),"21.326,80 €",20-11-2018,11-01-2017,365 dias,"Portugal, Porto, Porto","Artigo 24.º, n.º 1, alínea e) do Código dos Contratos Públicos",,,,,,Não aplicável.,Não aplicável.,FALSE
Recolha de resíduos urbanos,Ajuste Direto Regime Geral,Aquisição de serviços,"90500000-2, Serviços relativos a resíduos e lixos","Instituto Português de Oncologia do Porto Francisco Gentil, E. P. E. (506362299)","Recolte, S.A. (503505390)","34.347,15 €",20-11-2018,08-02-2018,365 dias,"Portugal, Porto, Porto","Artigo 20.º, n.º 1, alínea a) do Código dos Contratos Públicos",,,,,,Não aplicável.,Não aplicável.,FALSE
Técnico de manutenção de bloco operatório - 2017,Ajuste Direto Regime Geral,Aquisição de serviços,"50000000-5, Serviços de reparação e manutenção","Instituto Português de Oncologia do Porto Francisco Gentil, E. P. E. (506362299)","Proestima - Projectos Estudos Instalações e Manutenção, Lda. (504009540)","17.035,20 €",20-11-2018,05-01-2017,365 dias,"Portugal, Porto, Porto","Artigo 20.º, n.º 1, alínea a) do Código dos Contratos Públicos",,,,,,Não aplicável.,Não aplicável.,FALSE
Serviços de cafetaria a dadores,Ajuste Direto Regime Geral,Aquisição de serviços,"55500000-5, Serviços de cantinas e de fornecimento de refeições (catering)","Instituto Português de Oncologia do Porto Francisco Gentil, E. P. E. (506362299)","Serdial - Vending, SA (503537314)","20.188,61 €",20-11-2018,16-02-2017,365 dias,"Portugal, Porto, Porto","Artigo 20.º, n.º 1, alínea a) do Código dos Contratos Públicos",,,,,,Não aplicável.,Não aplicável.,FALSE
Serviços de medicina no trabalho,Ajuste Direto Regime Geral,Aquisição de serviços,"85147000-1, Serviços de medicina do trabalho","Instituto Português de Oncologia do Porto Francisco Gentil, E. P. E. (506362299)","Fátima Fernandes Graça, Serviços Médicos Unipessoal, Lda.  (514217839)","18.720,00 €",20-11-2018,14-02-2017,365 dias,"Portugal, Porto, Porto","Artigo 20.º, n.º 1, alínea a) do Código dos Contratos Públicos",,,,,,Não aplicável.,Não aplicável.,FALSE
Ajudante de carpintaria -2017,Ajuste Direto Regime Geral,Aquisição de serviços,"50000000-5, Serviços de reparação e manutenção","Instituto Português de Oncologia do Porto Francisco Gentil, E. P. E. (506362299)","Proestima - Projectos Estudos Instalações e Manutenção, Lda. (504009540)","17.742,40 €",20-11-2018,05-01-2017,20 dias,"Portugal, Porto, Porto","Artigo 20.º, n.º 1, alínea a) do Código dos Contratos Públicos",,,,,,Não aplicável.,Não aplicável.,FALSE
"EXECUÇÃO DE DIVISÓRIAS, NO BACK OFFICE",Ajuste Direto Regime Geral,Aquisição de bens móveis,"44112310-4, Paredes divisórias","Instituto Português de Oncologia do Porto Francisco Gentil, E. P. E. (506362299)","DMFlex, Lda. (509624669)","6.210,66 €",20-11-2018,31-01-2017,20 dias,"Portugal, Porto, Porto","Artigo 20.º, n.º 1, alínea a) do Código dos Contratos Públicos",,,,,,Não aplicável.,Não aplicável.,FALSE
REPARAÇÃO DE ECOGRAFO,Ajuste Direto Regime Geral,Aquisição de serviços,"50000000-5, Serviços de reparação e manutenção","IPO Porto FG, EPE (506362299)","Canon Medical Systems, S.A. (980023700)","5.512,12 €",19-11-2018,18-01-2017,20 dias,"Portugal, Porto, Porto","Artigo 24.º, n.º 1, alínea e) do Código dos Contratos Públicos",,,,,,Não aplicável.,Não aplicável.,FALSE
PORTAS DE VIDRO DE CORRER,Ajuste Direto Regime Geral,Aquisição de bens móveis,"44221230-6, Portas corrediças","IPO Porto FG, EPE (506362299)","Francfil  - Construção Civíl e Obras Públicas, Lda (505279177)","8.581,20 €",19-11-2018,10-01-2017,20 dias,"Portugal, Porto, Porto","Artigo 20.º, n.º 1, alínea a) do Código dos Contratos Públicos",,,,,,Não aplicável.,Não aplicável.,FALSE
REPARAÇÃO DE SISTEMA LASER CO2,Ajuste Direto Regime Geral,Aquisição de serviços,"50000000-5, Serviços de reparação e manutenção","Instituto Português de Oncologia do Porto Francisco Gentil, E. P. E. (506362299)","MEDICINÁLIA CORMÉDICA, LDA. (500684324)","5.556,38 €",19-11-2018,05-01-2017,20 dias,"Portugal, Porto, Porto","Artigo 24.º, n.º 1, alínea e) do Código dos Contratos Públicos",,,,,,Não aplicável.,Não aplicável.,FALSE
SOLUÇÃO DE GESTÃO DE ATENDIMENTO E COMUNICAÇÃO,Ajuste Direto Regime Geral,Aquisição de bens móveis,"48000000-8, Pacotes de software e sistemas de informação","Instituto Português de Oncologia do Porto Francisco Gentil, E. P. E. (506362299)","PAMAFE - Informática, Lda. (504099388)","69.800,00 €",19-11-2018,26-09-2017,20 dias,"Portugal, Porto, Porto","Artigo 20.º, n.º 1, alínea a) do Código dos Contratos Públicos",,,,,,Não aplicável.,Não aplicável.,FALSE
DESENVOLVIMENTO E INTEGRAÇÃO APP PRESCRIÇÃO ANDROID MOV,Ajuste Direto Regime Geral,Aquisição de bens móveis,"48000000-8, Pacotes de software e sistemas de informação","Instituto Português de Oncologia do Porto Francisco Gentil, E. P. E. (506362299)","HLTSYS - HEALTHSYSTEMS, LDA (510552544)","7.602,00 €",19-11-2018,04-12-2017,20 dias,"Portugal, Porto, Porto","Artigo 20.º, n.º 1, alínea a) do Código dos Contratos Públicos",,,,,,Não aplicável.,Não aplicável.,FALSE
DESFIBRILHADOR,Ajuste Direto Regime Geral,Aquisição de bens móveis,"33182100-0, Desfibrilhador","Instituto Português de Oncologia do Porto Francisco Gentil, E. P. E. (506362299)",CLINIFAR SA (503281115),"5.290,00 €",19-11-2018,04-12-2017,20 dias,"Portugal, Porto, Porto","Artigo 20.º, n.º 1, alínea a) do Código dos Contratos Públicos",,,,,,Não aplicável.,Não aplicável.,FALSE
DESENVOLVIMENTO E IMPLEMENTAÇÃO DO 'PORTAL BEM-ME-KER',Ajuste Direto Regime Geral,Aquisição de bens móveis,"48000000-8, Pacotes de software e sistemas de informação","Instituto Português de Oncologia do Porto Francisco Gentil, E. P. E. (506362299)","PAMAFE - Informática, Lda. (504099388)","5.994,00 €",19-11-2018,02-11-2017,20 dias,"Portugal, Porto, Porto","Artigo 20.º, n.º 1, alínea a) do Código dos Contratos Públicos",,,,,,Não aplicável.,Não aplicável.,FALSE
ARCA CONGELADORA -86 526L,Ajuste Direto Regime Geral,Aquisição de bens móveis,"39711120-6, Congeladores","Instituto Português de Oncologia do Porto Francisco Gentil, E. P. E. (506362299)","Frilabo, Lda (507958861)","8.150,00 €",19-11-2018,03-11-2017,20 dias,"Portugal, Porto, Porto","Artigo 20.º, n.º 1, alínea a) do Código dos Contratos Públicos",,,,,,Não aplicável.,Não aplicável.,FALSE
HUMIDIFICADOR AIRVO 2 C/GERADOR DE FLUXO E ACESSÓRIOS,Ajuste Direto Regime Geral,Aquisição de bens móveis,"33157000-5, Aparelhos para assistência respiratória e oxigenoterapia","Instituto Português de Oncologia do Porto Francisco Gentil, E. P. E. (506362299)","TEPREL - EQUIPAMENTO MÉDICOS, S.A. (502262184)","5.393,00 €",16-11-2018,25-10-2017,20 dias,"Portugal, Porto, Porto","Artigo 20.º, n.º 1, alínea a) do Código dos Contratos Públicos",,,,,,Não aplicável.,Não aplicável.,FALSE
MICROSCOPIO BINOCULAR AXIOLAB A1,Ajuste Direto Regime Geral,Aquisição de bens móveis,"38510000-3, Microscópios","Instituto Português de Oncologia do Porto Francisco Gentil, E. P. E. (506362299)",GRUPO TAPER (506886336),"8.640,00 €",16-11-2018,25-10-2017,20 dias,"Portugal, Porto, Porto","Artigo 20.º, n.º 1, alínea a) do Código dos Contratos Públicos",,,,,,Não aplicável.,Não aplicável.,FALSE
LICENÇA SPEECH MAGIC 1:2,Ajuste Direto Regime Geral,Aquisição de bens móveis,"48314000-2, Pacote de software para reconhecimento vocal","Instituto Português de Oncologia do Porto Francisco Gentil, E. P. E. (506362299)",Art Ces (513270396),"8.220,00 €",16-11-2018,11-10-2017,20 dias,"Portugal, Porto, Porto","Artigo 20.º, n.º 1, alínea a) do Código dos Contratos Públicos",,,,,,Não aplicável.,Não aplicável.,FALSE
PROJETOR DE VIDEO LENTE ZOOM,Ajuste Direto Regime Geral,Aquisição de bens móveis,"38652120-7, Videoprojectores","Instituto Português de Oncologia do Porto Francisco Gentil, E. P. E. (506362299)",ISM-TECH LDA (513973680),"13.700,00 €",16-11-2018,11-10-2017,20 dias,"Portugal, Porto, Porto","Artigo 20.º, n.º 1, alínea a) do Código dos Contratos Públicos",,,,,,Não aplicável.,Não aplicável.,FALSE
CADEIRAS DE VIGA DE 3 E 4 LUGARES,Ajuste Direto Regime Geral,Aquisição de bens móveis,"39156000-0, Mobiliário para salas de espera e de recepções","Instituto Português de Oncologia do Porto Francisco Gentil, E. P. E. (506362299)","VELOSO & TROCA, LDA. (500802726)","11.550,00 €",16-11-2018,15-09-2017,20 dias,"Portugal, Porto, Porto","Artigo 20.º, n.º 1, alínea a) do Código dos Contratos Públicos",,,,,,Não aplicável.,Não aplicável.,FALSE
SSD 128GB E 240GB SATA 3 C/BAINHA,Ajuste Direto Regime Geral,Aquisição de bens móveis,"30233132-5, Unidades de disco rígido","Instituto Português de Oncologia do Porto Francisco Gentil, E. P. E. (506362299)","PAMAFE - Informática, Lda. (504099388)","7.518,50 €",16-11-2018,08-06-2017,20 dias,"Portugal, Porto, Porto","Artigo 20.º, n.º 1, alínea a) do Código dos Contratos Públicos",,,,,,Não aplicável.,Não aplicável.,FALSE
ARCA CONGELADORA VERTICAL -86ºC,Ajuste Direto Regime Geral,Aquisição de bens móveis,"39711120-6, Congeladores","Instituto Português de Oncologia do Porto Francisco Gentil, E. P. E. (506362299)","Supplylab, Lda (508453534)","8.637,42 €",16-11-2018,18-08-2017,20 dias,"Portugal, Porto, Porto","Artigo 20.º, n.º 1, alínea a) do Código dos Contratos Públicos",,,,,,Não aplicável.,Não aplicável.,FALSE
CABINE DE SEGURANÇA BIOLÓGICA,Ajuste Direto Regime Geral,Aquisição de bens móveis,"38500000-0, Aparelhos de controlo e ensaio","Instituto Português de Oncologia do Porto Francisco Gentil, E. P. E. (506362299)",EUROCASMEDICA PRODUTOS HOSPITALARES S.A. (503322105),"13.250,00 €",16-11-2018,21-07-2017,20 dias,"Portugal, Porto, Porto","Artigo 20.º, n.º 1, alínea a) do Código dos Contratos Públicos",,,,,,Não aplicável.,Não aplicável.,FALSE
VENTILOCONVECTORES,Ajuste Direto Regime Geral,Aquisição de bens móveis,"31000000-6, Maquinaria, aparelhagem, equipamento e consumíveis eléctricos; iluminação","Instituto Português de Oncologia do Porto Francisco Gentil, E. P. E. (506362299)","Proestima - Projectos Estudos Instalações e Manutenção, Lda. (504009540)","6.889,56 €",16-11-2018,28-06-2017,20 dias,"Portugal, Porto, Porto","Artigo 20.º, n.º 1, alínea a) do Código dos Contratos Públicos",,,,,,Não aplicável.,Não aplicável.,FALSE
CANDEEIRO CIRURGICO COM DUAS CUPULAS,Ajuste Direto Regime Geral,Aquisição de bens móveis,"33167000-8, Luzes para blocos operatórios","Instituto Português de Oncologia do Porto Francisco Gentil, E. P. E. (506362299)","GETINGE GROUP PORTUGAL, UNIP LDA (MAQUET PORT) (506819698)","20.850,00 €",16-11-2018,08-05-2017,20 dias,"Portugal, Porto, Porto","Artigo 20.º, n.º 1, alínea a) do Código dos Contratos Públicos",,,,,,Não aplicável.,Não aplicável.,FALSE
"BANHO, BOMBA E RESPECTIVOS ACESSÓRIOS ",Ajuste Direto Regime Geral,Aquisição de bens móveis,"38000000-5, Equipamento laboratorial, óptico e de precisão (exc. óculos)","Instituto Português de Oncologia do Porto Francisco Gentil, E. P. E. (506362299)",Paralab (502814926),"11.593,00 €",16-11-2018,13-06-2017,20 dias,"Portugal, Porto, Porto","Artigo 24.º, n.º 1, alínea e) do Código dos Contratos Públicos",,,,,,Não aplicável.,Não aplicável.,FALSE
IMPRESSORA LASER HP LASER,Ajuste Direto Regime Geral,Aquisição de bens móveis,"30232110-8, Impressoras laser","Instituto Português de Oncologia do Porto Francisco Gentil, E. P. E. (506362299)","PAMAFE - Informática, Lda. (504099388)","5.859,90 €",16-11-2018,01-06-2017,20 dias,"Portugal, Porto, Porto","Artigo 20.º, n.º 1, alínea a) do Código dos Contratos Públicos",,,,,,Não aplicável.,Não aplicável.,FALSE
NASOLARINGOFIBROSCOPIO,Ajuste Direto Regime Geral,Aquisição de bens móveis,"33168100-6, Endoscópios","Instituto Português de Oncologia do Porto Francisco Gentil, E. P. E. (506362299)",Simmedica - Sistemas Integrales de La Medicina SA - Sucursal em Portugal (980488842),"10.070,00 €",15-11-2018,19-05-2017,20 dias,"Portugal, Porto, Porto","Artigo 20.º, n.º 1, alínea a) do Código dos Contratos Públicos",,,,,,Não aplicável.,Não aplicável.,FALSE
CRONÓMETROS PARA BLOCO OPERATÓRIO,Ajuste Direto Regime Geral,Aquisição de bens móveis,"18523000-1, Cronómetros","Instituto Português de Oncologia do Porto Francisco Gentil, E. P. E. (506362299)","GIELUX - MONTAGENS ELÉCTRICAS, LDA (504234722)","7.000,00 €",14-11-2018,19-05-2017,20 dias,"Portugal, Porto, Porto","Artigo 20.º, n.º 1, alínea a) do Código dos Contratos Públicos",,,,,,Não aplicável.,Não aplicável.,FALSE
MICROSCÓPIO DE FLUORESCENCIA,Ajuste Direto Regime Geral,Aquisição de bens móveis,"38510000-3, Microscópios","Instituto Português de Oncologia do Porto Francisco Gentil, E. P. E. (506362299)","LEICA MICROSISTEMAS - INSTRUMENTOS DE PRECISÃO, S. UNIP. LDA. (500301921)","38.582,77 €",14-11-2018,02-05-2018,20 dias,"Portugal, Porto, Porto","Artigo 24.º, n.º 1, alínea e) do Código dos Contratos Públicos",,,,,,Não aplicável.,Não aplicável.,FALSE
ARCA CRIOGENICA E RESPETIVOS RACKS,Ajuste Direto Regime Geral,Aquisição de bens móveis,"39711120-6, Congeladores","Instituto Português de Oncologia do Porto Francisco Gentil, E. P. E. (506362299)","Frilabo II, Lda. (507958861)","21.560,00 €",14-11-2018,08-05-2017,20 dias,"Portugal, Porto, Porto","Artigo 20.º, n.º 1, alínea a) do Código dos Contratos Públicos",,,,,,Não aplicável.,Não aplicável.,FALSE
AMPOLA DE RAIO X MRM 0410 ROT-GS 2502,Ajuste Direto Regime Geral,Aquisição de bens móveis,"33000000-0, Equipamento médico, medicamentos e produtos para cuidados pessoais","Instituto Português de Oncologia do Porto Francisco Gentil, E. P. E. (506362299)","PHILIPS PORTUGUESA, S.A. (500216843)","34.918,00 €",14-11-2018,13-04-2017,20 dias,"Portugal, Porto, Porto","Artigo 24.º, n.º 1, alínea e) do Código dos Contratos Públicos",,,,,,Não aplicável.,Não aplicável.,FALSE
"ADAUDIT PLUS PROFESSIONAL, PDQ DEPLOY ENTERPRISE E INVENTORY PRO",Ajuste Direto Regime Geral,Aquisição de bens móveis,"48000000-8, Pacotes de software e sistemas de informação","Instituto Português de Oncologia do Porto Francisco Gentil, E. P. E. (506362299)","PAMAFE - Informática, Lda. (504099388)","5.490,38 €",14-11-2018,13-04-2017,20 dias,"Portugal, Porto, Porto","Artigo 20.º, n.º 1, alínea a) do Código dos Contratos Públicos",,,,,,Não aplicável.,Não aplicável.,FALSE
VENTILADOR PEDIATRICO/ADULTO,Ajuste Direto Regime Geral,Aquisição de bens móveis,"33172000-6, Aparelhos para anestesia e reanimação","Instituto Português de Oncologia do Porto Francisco Gentil, E. P. E. (506362299)",Getinge Group Portugal Unipessoal (506819698),"10.000,00 €",14-11-2018,13-04-2017,20 dias,"Portugal, Porto, Porto","Artigo 20.º, n.º 1, alínea a) do Código dos Contratos Públicos",,,,,,Não aplicável.,Não aplicável.,FALSE
AQUISIÇÃO E INSTALAÇÃO DE MONITIRES TOUCH,Ajuste Direto Regime Geral,Aquisição de bens móveis,"30231320-6, Monitores de ecrã táctil","Instituto Português de Oncologia do Porto Francisco Gentil, E. P. E. (506362299)","PAMAFE - Informática, Lda. (504099388)","6.535,49 €",14-11-2018,27-03-2017,20 dias,"Portugal, Porto, Porto","Artigo 20.º, n.º 1, alínea a) do Código dos Contratos Públicos",,,,,,Não aplicável.,Não aplicável.,FALSE
Aquisição de medicamentos - anfotericina B LIPOSSÓMICA,Ajuste Direto Regime Geral,Aquisição de bens móveis,"33600000-6, Produtos farmacêuticos","Instituto Português de Oncologia do Porto Francisco Gentil, E. P. E. (506362299)","GILEAD SCIENCES,LDA (503604704)","143.067,10 €",14-11-2018,25-10-2018,20 dias,"Portugal, Porto, Porto","Artigo 24.º, n.º 1, alínea e), subalínea ii) do Código dos Contratos Públicos",,,,,,Não aplicável.,Não aplicável.,FALSE
PERNEIRAS PARA GINECOLOGIA E UROLOGIA,Ajuste Direto Regime Geral,Aquisição de bens móveis,"33192000-2, Mobiliário para fins médicos","Instituto Português de Oncologia do Porto Francisco Gentil, E. P. E. (506362299)",Getinge Group Portugal Unipessoal (506819698),"6.140,00 €",14-11-2018,22-03-2017,20 dias,"Portugal, Porto, Porto","Artigo 24.º, n.º 1, alínea e) do Código dos Contratos Públicos",,,,,,Não aplicável.,Não aplicável.,FALSE
"ARCA CONGELADORA VERTICAL, CAMARA DE FLUXO DE AR LAMINADO E INCUBADORA COM AGITADOR ",Ajuste Direto Regime Geral,Aquisição de bens móveis,"39711120-6, Congeladores","Instituto Português de Oncologia do Porto Francisco Gentil, E. P. E. (506362299)","Frilabo II, Lda. (507958861)","14.500,00 €",14-11-2018,24-03-2017,20 dias,"Portugal, Porto, Porto","Artigo 20.º, n.º 1, alínea a) do Código dos Contratos Públicos",,,,,,Não aplicável.,Não aplicável.,FALSE
SSD 128GB SATA 3 COM BAINHA,Ajuste Direto Regime Geral,Aquisição de bens móveis,"30233132-5, Unidades de disco rígido","Instituto Português de Oncologia do Porto Francisco Gentil, E. P. E. (506362299)","PAMAFE - Informática, Lda. (504099388)","7.596,80 €",14-11-2018,24-03-2017,20 dias,"Portugal, Porto, Porto","Artigo 20.º, n.º 1, alínea a) do Código dos Contratos Públicos",,,,,,Não aplicável.,Não aplicável.,FALSE
Assistência técnica a central telefónica,Ajuste Direto Regime Geral,Aquisição de serviços,"71356200-0, Serviços de assistência técnica","Instituto Português de Oncologia do Porto Francisco Gentil, E. P. E. (506362299)","Warpcom Services, S. A. (505134195)","6.950,00 €",14-11-2018,04-01-2017,20 dias,"Portugal, Porto, Porto","Artigo 24.º, n.º 1, alínea e) do Código dos Contratos Públicos",,,,,,Não aplicável.,Não aplicável.,FALSE
Aquisição de medicamentos - Dabrafenib; Imatinib; TRAMETinib; CERItinib; Everolimus,Ajuste Direto Regime Geral,Aquisição de bens móveis,"33600000-6, Produtos farmacêuticos","IPO Porto FG, EPE (506362299)","Novartis Farma Produtos Farmacêuticos, SA (500063524)","181.844,26 €",13-11-2018,11-10-2018,20 dias,"Portugal, Porto, Porto","Artigo 24.º, n.º 1, alínea e), subalínea ii) do Código dos Contratos Públicos",,,,,,Não aplicável.,Não aplicável.,FALSE
AGULHA HUBER P/PUNÇÃO; KIT COMPLETO CATETER ADMIN. CITOST. PORTE PEQUENO ,Ajuste Direto Regime Geral,Aquisição de bens móveis,"33600000-6, Produtos farmacêuticos","Instituto Português de Oncologia do Porto Francisco Gentil, E. P. E. (506362299)",VYGON PORTUGAL PROD MEDICOS FARMACEUTICOS LDA (503232785),"15.151,01 €",13-11-2018,04-10-2018,20 dias,"Portugal, Porto, Porto","Artigo 20.º, n.º 1, alínea d) do Código dos Contratos Públicos",,,,,,Não aplicável.,Não aplicável.,FALSE
"TUBO IMPLANTE FLEXÍVEL, KIT AGULHAS",Ajuste Direto Regime Geral,Aquisição de bens móveis,"33000000-0, Equipamento médico, medicamentos e produtos para cuidados pessoais","Instituto Português de Oncologia do Porto Francisco Gentil, E. P. E. (506362299)",RRTS UNIPESSOAL LDA (514185155),"12.701,70 €",13-11-2018,23-10-2018,20 dias,"Portugal, Porto, Porto","Artigo 20.º, n.º 1, alínea d) do Código dos Contratos Públicos",,,,,,Não aplicável.,Não aplicável.,FALSE
BANHEIRA DE HIDROMASSAGEM E RESPECTIVOS ACESSÓRIOS,Ajuste Direto Regime Geral,Aquisição de bens móveis,"33155000-1, Aparelhos para fisioterapia","Instituto Português de Oncologia do Porto Francisco Gentil, E. P. E. (506362299)",Getinge Group Portugal Unipessoal (506819698),"12.142,00 €",13-11-2018,10-03-2017,20 dias,"Portugal, Porto, Porto","Artigo 20.º, n.º 1, alínea a) do Código dos Contratos Públicos",,,,,,Não aplicável.,Não aplicável.,FALSE
"TV'S LED 32"""" E RESPECTIVOS SUPORTES ",Ajuste Direto Regime Geral,Aquisição de bens móveis,"32324100-1, Receptores de televisão a cores","Instituto Português de Oncologia do Porto Francisco Gentil, E. P. E. (506362299)",Informatica El corte ingles (980079659),"10.302,60 €",13-11-2018,06-03-2017,20 dias,"Portugal, Porto, Porto","Artigo 20.º, n.º 1, alínea a) do Código dos Contratos Públicos",,,,,,Não aplicável.,Não aplicável.,FALSE
Aquisição de medicamentos - Meropenem; PACLItaxel e VALGANciclovir,Ajuste Direto Regime Geral,Aquisição de bens móveis,"33600000-6, Produtos farmacêuticos","Instituto Português de Oncologia do Porto Francisco Gentil, E. P. E. (506362299)","GENERIS FARMACÊUTICA, S.A. (508107997)","7.747,80 €",13-11-2018,10-10-2018,20 dias,"Portugal, Porto, Porto","Artigo 20.º, n.º 1, alínea d) do Código dos Contratos Públicos",,,,,,Não aplicável.,Não aplicável.,FALSE
Aquisição de medicamentos - Bussulfano,Ajuste Direto Regime Geral,Aquisição de bens móveis,"33600000-6, Produtos farmacêuticos","Instituto Português de Oncologia do Porto Francisco Gentil, E. P. E. (506362299)","FRESENIUS KABI PHARMA PORTUGAL,LDA (504293753)","8.280,63 €",13-11-2018,24-10-2018,20 dias,"Portugal, Porto, Porto","Artigo 20.º, n.º 1, alínea d) do Código dos Contratos Públicos",,,,,,Não aplicável.,Não aplicável.,FALSE
ARMÁRIO DE REPOSIÇÃO E PORTA-ETIQUETAS,Ajuste Direto Regime Geral,Aquisição de bens móveis,"39132100-7, Armários para classificação","Instituto Português de Oncologia do Porto Francisco Gentil, E. P. E. (506362299)",IFHI (502264543),"5.800,00 €",13-11-2018,06-03-2017,20 dias,"Portugal, Porto, Porto","Artigo 24.º, n.º 1, alínea e) do Código dos Contratos Públicos",,,,,,Não aplicável.,Não aplicável.,FALSE
Aquisição de medicamentos - Lenvatinib,Ajuste Direto Regime Geral,Aquisição de bens móveis,"33600000-6, Produtos farmacêuticos","Instituto Português de Oncologia do Porto Francisco Gentil, E. P. E. (506362299)",EF - Eisai (507847660),"9.340,20 €",13-11-2018,28-09-2018,20 dias,"Portugal, Porto, Porto","Artigo 24.º, n.º 1, alínea e), subalínea ii) do Código dos Contratos Públicos",,,,,,Não aplicável.,Não aplicável.,FALSE
Aquisição de medicamentos - Foscarneto sódico,Ajuste Direto Regime Geral,Aquisição de bens móveis,"33600000-6, Produtos farmacêuticos","Instituto Português de Oncologia do Porto Francisco Gentil, E. P. E. (506362299)",CLINIGEN HEALTHCARE (GB100125104),"18.700,00 €",13-11-2018,24-10-2018,20 dias,"Portugal, Porto, Porto","Artigo 24.º, n.º 1, alínea e), subalínea ii) do Código dos Contratos Públicos",,,,,,Não aplicável.,Não aplicável.,FALSE
OLYMPUS IBERIA S.A.U. - SUC. E,Ajuste Direto Regime Geral,Aquisição de bens móveis,"33168000-5, Aparelhos para endoscopia e endocirurgia","Instituto Português de Oncologia do Porto Francisco Gentil, E. P. E. (506362299)",OLYMPUS IBERIA SAU (980474710),"56.377,60 €",13-11-2018,01-03-2017,20 dias,"Portugal, Porto, Porto","Artigo 24.º, n.º 1, alínea e) do Código dos Contratos Públicos",,,,,,Não aplicável.,Não aplicável.,FALSE
SISTEMA DE VIDEOLARINGOSCÓPIO,Ajuste Direto Regime Geral,Aquisição de bens móveis,"33168000-5, Aparelhos para endoscopia e endocirurgia","Instituto Português de Oncologia do Porto Francisco Gentil, E. P. E. (506362299)","TEPREL - EQUIPAMENTO MÉDICOS, S.A. (502262184)","9.411,75 €",13-11-2018,13-02-2017,20 dias,"Portugal, Porto, Porto","Artigo 20.º, n.º 1, alínea a) do Código dos Contratos Públicos",,,,,,Não aplicável.,Não aplicável.,FALSE
DIGITAL HD 3CCD CAMERA E CAMERA LENS COUPLER C/OBJ HD ZOOM,Ajuste Direto Regime Geral,Aquisição de bens móveis,"38519300-9, Dispositivos fotográficos ou videográficos para microscópios","Instituto Português de Oncologia do Porto Francisco Gentil, E. P. E. (506362299)","FILSAT Equipamentos Médico-Científicos, Lda.  (506708616)","13.295,00 €",13-11-2018,09-02-2017,20 dias,"Portugal, Porto, Porto","Artigo 20.º, n.º 1, alínea a) do Código dos Contratos Públicos",,,,,,Não aplicável.,Não aplicável.,FALSE
UNIDADE DE INSUFLAÇÃO CO2,Ajuste Direto Regime Geral,Aquisição de bens móveis,"33100000-1, Equipamento médico","Instituto Português de Oncologia do Porto Francisco Gentil, E. P. E. (506362299)",OLYMPUS IBERIA SAU (980474710),"19.720,00 €",13-11-2018,08-02-2017,20 dias,"Portugal, Porto, Porto","Artigo 20.º, n.º 1, alínea a) do Código dos Contratos Públicos",,,,,,Não aplicável.,Não aplicável.,FALSE
"PLACA DE AQUECIMENTO, BLOCO DE PLACA DE AQUECIMENTO, MINI-CENTRIFUGA E PCR CABINET ",Ajuste Direto Regime Geral,Aquisição de bens móveis,"38000000-5, Equipamento laboratorial, óptico e de precisão (exc. óculos)","Instituto Português de Oncologia do Porto Francisco Gentil, E. P. E. (506362299)","Frilabo II, Lda. (507958861)","5.688,64 €",13-11-2018,01-02-2017,20 dias,"Portugal, Porto, Porto","Artigo 20.º, n.º 1, alínea a) do Código dos Contratos Públicos",,,,,,Não aplicável.,Não aplicável.,FALSE
SISTEMA DE DETECÇÃO DE GANGLIO SENTINELA,Ajuste Direto Regime Geral,Aquisição de bens móveis,"33696500-0, Reagentes de laboratório","Instituto Português de Oncologia do Porto Francisco Gentil, E. P. E. (506362299)",Getinge Group Portugal Unipessoal (506819698),"36.358,43 €",13-11-2018,01-02-2017,20 dias,"Portugal, Porto, Porto","Artigo 20.º, n.º 1, alínea a) do Código dos Contratos Públicos",,,,,,Não aplicável.,Não aplicável.,FALSE
Aquisição de medicamentos - Nivolumab e DASAtinib,Ajuste Direto Regime Geral,Aquisição de bens móveis,"33600000-6, Produtos farmacêuticos","Instituto Português de Oncologia do Porto Francisco Gentil, E. P. E. (506362299)","BRISTOL MYERS SQUIBB FARMACEUTICA PORTUGUESA,S A (500048193)","120.763,74 €",13-11-2018,29-10-2018,20 dias,"Portugal, Porto, Porto","Artigo 24.º, n.º 1, alínea e), subalínea ii) do Código dos Contratos Públicos",,,,,,Não aplicável.,Não aplicável.,FALSE
UPGRADE CANDEEIRO CIRURGICO,Ajuste Direto Regime Geral,Aquisição de bens móveis,"33167000-8, Luzes para blocos operatórios","Instituto Português de Oncologia do Porto Francisco Gentil, E. P. E. (506362299)",Getinge Group Portugal Unipessoal (506819698),"18.395,00 €",13-11-2018,27-01-2017,20 dias,"Portugal, Porto, Porto","Artigo 24.º, n.º 1, alínea e) do Código dos Contratos Públicos",,,,,,Não aplicável.,Não aplicável.,FALSE
MARQUESA DE OBSERVAÇÃO GINECOLOGIA,Ajuste Direto Regime Geral,Aquisição de bens móveis,"33192000-2, Mobiliário para fins médicos","Instituto Português de Oncologia do Porto Francisco Gentil, E. P. E. (506362299)",RMV - Produtos Hospitalares Lda (514782196),"6.107,00 €",13-11-2018,27-01-2017,20 dias,"Portugal, Porto, Porto","Artigo 20.º, n.º 1, alínea a) do Código dos Contratos Públicos",,,,,,Não aplicável.,Não aplicável.,FALSE
"Aquisição de medicamentos - PACLItaxel, Lenalidomida, azaCITIDina e Lenalidomida",Ajuste Direto Regime Geral,Aquisição de bens móveis,"33600000-6, Produtos farmacêuticos","Instituto Português de Oncologia do Porto Francisco Gentil, E. P. E. (506362299)",CELGENE SOCIEDADE UNIPESSOAL LDA (507791690),"54.934,68 €",12-11-2018,24-10-2018,20 dias,"Portugal, Porto, Porto","Artigo 24.º, n.º 1, alínea e), subalínea ii) do Código dos Contratos Públicos",,,,,,Não aplicável.,Não aplicável.,FALSE
CANDEEIRO CIRURGICO c/TRÊS CUPULAS H-LED,Ajuste Direto Regime Geral,Aquisição de bens móveis,"33167000-8, Luzes para blocos operatórios","Instituto Português de Oncologia do Porto Francisco Gentil, E. P. E. (506362299)",Getinge Group Portugal Unipessoal (506819698),"19.250,00 €",12-11-2018,20-01-2017,20 dias,"Portugal, Porto, Porto","Artigo 20.º, n.º 1, alínea a) do Código dos Contratos Públicos",,,,,,Não aplicável.,Não aplicável.,FALSE
Aquisição de medicamentos - Nivolumab; Ipilimumab; Nistatina,Ajuste Direto Regime Geral,Aquisição de bens móveis,"33600000-6, Produtos farmacêuticos","Instituto Português de Oncologia do Porto Francisco Gentil, E. P. E. (506362299)","BRISTOL-MYERS SQUIBB FARMACÊUTICA PORTUGUESA, S.A. (500048193)","111.836,26 €",12-11-2018,12-10-2018,20 dias,"Portugal, Porto, Porto","Artigo 24.º, n.º 1, alínea e), subalínea ii) do Código dos Contratos Públicos",,,,,,Não aplicável.,Não aplicável.,FALSE
Aquisição de medicamentos - Melfalano,Ajuste Direto Regime Geral,Aquisição de bens móveis,"33600000-6, Produtos farmacêuticos","Instituto Português de Oncologia do Porto Francisco Gentil, E. P. E. (506362299)","Biojam, SA (513642749)","9.400,00 €",12-11-2018,22-10-2018,20 dias,"Portugal, Porto, Porto","Artigo 24.º, n.º 1, alínea e), subalínea ii) do Código dos Contratos Públicos",,,,,,Não aplicável.,Não aplicável.,FALSE
"CENTRIFUGAS, RECT ADAPTER E ROTOR",Ajuste Direto Regime Geral,Aquisição de bens móveis,"42931100-2, Centrifugadoras de laboratório e acessórios","Instituto Português de Oncologia do Porto Francisco Gentil, E. P. E. (506362299)","FISHER SCIENTIFIC UNIPESSOAL, LDA: (506429210)","10.468,00 €",12-11-2018,19-01-2017,20 dias,"Portugal, Porto, Porto","Artigo 20.º, n.º 1, alínea a) do Código dos Contratos Públicos",,,,,,Não aplicável.,Não aplicável.,FALSE
Aquisição de medicamentos - DEXAmetasona,Ajuste Direto Regime Geral,Aquisição de bens móveis,"33600000-6, Produtos farmacêuticos","Instituto Português de Oncologia do Porto Francisco Gentil, E. P. E. (506362299)","BDRPHARMA, LDA (513077332)","5.445,00 €",12-11-2018,02-10-2018,20 dias,"Portugal, Porto, Porto","Artigo 24.º, n.º 1, alínea e), subalínea ii) do Código dos Contratos Públicos",,,,,,Não aplicável.,Não aplicável.,FALSE
Equipamento diverso para laboratório,Ajuste Direto Regime Geral,Aquisição de bens móveis,"38000000-5, Equipamento laboratorial, óptico e de precisão (exc. óculos)","Instituto Português de Oncologia do Porto Francisco Gentil, E. P. E. (506362299)","Alfagene - Novas Tecnologias das Ciências da Vida, Lda (503387398)","5.463,15 €",12-11-2018,18-01-2017,20 dias,"Portugal, Porto, Porto","Artigo 20.º, n.º 1, alínea a) do Código dos Contratos Públicos",,,,,,Não aplicável.,Não aplicável.,FALSE
Mesna; cicloFOSFAMIDA; Ifosfamida; Desfluorano; BOLSA NP PERIFÉRICA; BOLSA NP CENTRAL; Cloreto de sódio 9 mg/ml; Polielectrol + Glucose,Ajuste Direto Regime Geral,Aquisição de bens móveis,"33600000-6, Produtos farmacêuticos","Instituto Português de Oncologia do Porto Francisco Gentil, E. P. E. (506362299)","BAXTER MEDICO-FARMACEUTICA, LDA (503347345)","58.158,91 €",12-11-2018,23-10-2018,20 dias,"Portugal, Porto, Porto","Artigo 24.º, n.º 1, alínea e), subalínea ii) do Código dos Contratos Públicos",,,,,,Não aplicável.,Não aplicável.,FALSE
SISTEMA RETRACTOR ABDOMINAL,Ajuste Direto Regime Geral,Aquisição de bens móveis,"33162200-5, Instrumentos para blocos operatórios","Instituto Português de Oncologia do Porto Francisco Gentil, E. P. E. (506362299)","NOSBET EQUIPAMENTOS, LDA (513514872)","17.905,00 €",12-11-2018,17-01-2017,20 dias,"Portugal, Porto, Porto","Artigo 20.º, n.º 1, alínea a) do Código dos Contratos Públicos",,,,,,Não aplicável.,Não aplicável.,FALSE
CADEIRÃO RODADO RELAX RECLINAVEL,Ajuste Direto Regime Geral,Aquisição de bens móveis,"33192000-2, Mobiliário para fins médicos","Instituto Português de Oncologia do Porto Francisco Gentil, E. P. E. (506362299)","BACELAR E IRMÃO, LDA (500532818)","10.118,25 €",12-11-2018,12-01-2017,20 dias,"Portugal, Porto, Porto","Artigo 20.º, n.º 1, alínea a) do Código dos Contratos Públicos",,,,,,Não aplicável.,Não aplicável.,FALSE
Aquisição de diverso software,Consulta Prévia,Aquisição de bens móveis,"48600000-4, Pacote de software para bases de dados e de software operativo","Instituto Português de Oncologia do Porto Francisco Gentil, E. P. E. (506362299)","Informática El Corte Inglés, S.A. (980079659)","6.168,75 €",12-11-2018,15-10-2018,5 dias,Portugal,"Artigo 20.º, n.º 1, alínea c) do Código dos Contratos Públicos",,,,,,Não aplicável.,Não aplicável.,FALSE
Contrato Assistência Técnica a Data Center 2017,Ajuste Direto Regime Geral,Aquisição de serviços,"71356200-0, Serviços de assistência técnica","Instituto Português de Oncologia do Porto Francisco Gentil, E. P. E. (506362299)","PAMAFE - Informática, Lda. (504099388)","7.003,40 €",12-11-2018,04-01-2017,20 dias,"Portugal, Porto, Porto","Artigo 20.º, n.º 1, alínea a) do Código dos Contratos Públicos",,,,,,Não aplicável.,Não aplicável.,FALSE
Contrato Assistência Técnica a RX telecomandado 2017,Ajuste Direto Regime Geral,Aquisição de serviços,"71356200-0, Serviços de assistência técnica","Instituto Português de Oncologia do Porto Francisco Gentil, E. P. E. (506362299)","MICROMIL-SISTEMAS MÉDICOS E INDUSTRIAIS,S.A. (501605770)","7.200,00 €",12-11-2018,04-01-2017,20 dias,"Portugal, Porto, Porto","Artigo 20.º, n.º 1, alínea a) do Código dos Contratos Públicos",,,,,,Não aplicável.,Não aplicável.,FALSE
ADCM 2023/18 - Sistema droplet digital PCR,Ajuste Direto Regime Geral,Aquisição de bens móveis,"38900000-4, Instrumentos diversos de avaliação ou ensaio","Instituto Português de Oncologia do Porto Francisco Gentil, E. P. E. (506362299)"," BIO-RAD LABORATORIES, LDA (501301321)","72.200,00 €",12-11-2018,01-10-2018,30 dias,"Portugal, Porto, Porto","Artigo 24.º, n.º 1, alínea e), subalínea ii) do Código dos Contratos Públicos",,,,,,Não aplicável.,Não aplicável.,FALSE
Contrato Assistência Técnica a equipamento de deteção de incêndio 2017,Ajuste Direto Regime Geral,Aquisição de serviços,"71356200-0, Serviços de assistência técnica","Instituto Português de Oncologia do Porto Francisco Gentil, E. P. E. (506362299)","Siemens, S.A (500247480)","6.500,00 €",12-11-2018,04-01-2017,20 dias,"Portugal, Porto, Porto","Artigo 24.º, n.º 1, alínea e) do Código dos Contratos Públicos",,,,,,Não aplicável.,Não aplicável.,FALSE
Contrato Assistência Técnica a Ascensores - 2017,Ajuste Direto Regime Geral,Aquisição de serviços,"71356200-0, Serviços de assistência técnica","Instituto Português de Oncologia do Porto Francisco Gentil, E. P. E. (506362299)",Pinto & Cruz (500217904),"46.188,00 €",12-11-2018,04-01-2017,20 dias,"Portugal, Porto, Porto","Artigo 20.º, n.º 1, alínea a) do Código dos Contratos Públicos",,,,,,Não aplicável.,Não aplicável.,FALSE
Máquina de coloração de lâminas,Consulta Prévia,Aquisição de bens móveis,"38500000-0, Aparelhos de controlo e ensaio","IPO Porto FG, EPE (506362299)","Bioportugal - Químico Farmacêutica, Lda (502380543)","10.000,00 €",12-11-2018,16-10-2018,2 dias,Portugal,"Artigo 20.º, n.º 1, alínea c) do Código dos Contratos Públicos",,,,,,Não aplicável.,Não aplicável.,FALSE
"Aquisição de medicamentos - Noradrenalina; BOLSA NP CENTRAL, Morfina e Cloreto de sódio",Ajuste Direto Regime Geral,Aquisição de bens móveis,"33600000-6, Produtos farmacêuticos","Instituto Português de Oncologia do Porto Francisco Gentil, E. P. E. (506362299)","B. Braun Medical, Lda. (501506543)","54.326,78 €",12-11-2018,19-10-2018,20 dias,"Portugal, Porto, Porto","Artigo 24.º, n.º 1, alínea e), subalínea ii) do Código dos Contratos Públicos",,,,,,Não aplicável.,Não aplicável.,FALSE
Manutenção a câmaras de fluxo laminar,Ajuste Direto Regime Geral,Aquisição de serviços,"71356200-0, Serviços de assistência técnica","Instituto Português de Oncologia do Porto Francisco Gentil, E. P. E. (506362299)","Tradelabor - Importação e Exportação, Lda (503069442)","7.427,40 €",12-11-2018,04-01-2017,20 dias,"Portugal, Porto, Porto","Artigo 20.º, n.º 1, alínea a) do Código dos Contratos Públicos",,,,,,Não aplicável.,Não aplicável.,FALSE
CPR 2024/18: Aquisição de Arca -80ºC Ultracongelador Vertical,Consulta Prévia,Aquisição de bens móveis,"33100000-1, Equipamento médico","Instituto Português de Oncologia do Porto Francisco Gentil, E. P. E. (506362299)","IZASA SCIENTIFIC, LDA (513252088)","10.500,00 €",12-11-2018,23-10-2018,15 dias,"Portugal, Porto, Porto","Artigo 20.º, n.º 1, alínea c) do Código dos Contratos Públicos",,,,,,Não aplicável.,Não aplicável.,FALSE
Aluguer e Manutenção a SHSTGest,Ajuste Direto Regime Geral,Aquisição de serviços,"72200000-7, Serviços de consultoria e de programação de software","Instituto Português de Oncologia do Porto Francisco Gentil, E. P. E. (506362299)","Utilsoft-Utilitários e Software, Lda (503041688)","5.715,12 €",12-11-2018,04-01-2017,20 dias,"Portugal, Porto, Porto","Artigo 24.º, n.º 1, alínea e) do Código dos Contratos Públicos",,,,,,Não aplicável.,Não aplicável.,FALSE
