Objeto do Contrato,Tipo de Procedimento,Tipo(s) de Contrato,CPVs,Entidade(s) Adjudicante(s),Entidade(s) Adjudicatária(s),Preço Contratual,Data de Publicação,Data de Celebração do Contrato,Prazo de Execução,Local de Execução,Fundamentação,Data de Fecho do Contrato,Preço Total Efetivo,Causas das Alterações ao Prazo,Causas das Alterações ao Preço,Estado,N.º registo do Acordo Quadro,Descrição do Acordo Quadro,Procedimento Centralizado
"Aquisição de medicamentos desencadeados pela SPMS, EPE, no âmbito do Despacho 1571/B de 2016 - P259-AC-2016-229",Ajuste Direto Regime Geral,Aquisição de bens móveis,"33600000-6, Produtos farmacêuticos","Centro Hospitalar Cova da Beira, E. P. E. (506361659)","Novartis Farma - Produtos Farmacêuticos, S.A. (500063524)","0,00 €",16-05-2017,03-04-2017,365 dias,"Portugal, Castelo Branco, Covilhã",Artigo 258.º do Código dos Contratos Públicos,,,,,,2749393,"Aquisição de medicamentos desencadeados pela SPMS, EPE, no âmbito do Despacho 1571/B de 2016 - P259-AC-2016-229 ",FALSE
"Aquisição de medicamentos Usados nas afeções oculares e otorrinolaringológico, abrigo do Acordo Quadro CP 2015/49. ",Ao abrigo de acordo-quadro (art.º 259.º),Aquisição de bens móveis,"33690000-3, Medicamentos vários","Centro Hospitalar Cova da Beira, E. P. E. (506361659)",Laboratórios Edol (507072642),"2.689,90 €",15-05-2017,06-04-2017,365 dias,"Portugal, Castelo Branco, Covilhã",Artigo 259.º do Código dos Contratos Públicos,,,,,,2722021,Aquisição de mobiliário para o novo edifício de Algés do ACES Lisboa Ocidental e Oeiras,FALSE
"Aquisição de medicamentos Usados nas afeções oculares e otorrinolaringológico, abrigo do Acordo Quadro CP 2015/49. ",Ao abrigo de acordo-quadro (art.º 259.º),Aquisição de bens móveis,"33690000-3, Medicamentos vários","Centro Hospitalar Cova da Beira, E. P. E. (506361659)","Glaxo Smith Kline - Produtos Farmacêuticos, Lda. (500139962)","1.280,50 €",15-05-2017,05-04-2017,365 dias,"Portugal, Castelo Branco, Covilhã",Artigo 259.º do Código dos Contratos Públicos,,,,,,2743067,AQ- LS- 2015 - Aquisição de software e segurança - Anti-Vírus,FALSE
"Aquisição de medicamentos Usados nas afeções oculares e otorrinolaringológico, abrigo do Acordo Quadro CP 2015/49. ",Ao abrigo de acordo-quadro (art.º 259.º),Aquisição de bens móveis,"33690000-3, Medicamentos vários","Centro Hospitalar Cova da Beira, E. P. E. (506361659)","DAVI II FARMACÊUTICA, S.A. (508309450)","408,00 €",15-05-2017,05-04-2017,365 dias,"Portugal, Castelo Branco, Covilhã",Artigo 259.º do Código dos Contratos Públicos,,,,,,2743973,AQ_HL_2015- Aquisição Consumíveis de casa banho - lote I,FALSE
"Aquisição de medicamentos Usados nas afeções oculares e otorrinolaringológico, abrigo do Acordo Quadro CP 2015/49. ",Ajuste Direto Regime Geral,Aquisição de bens móveis,"33690000-3, Medicamentos vários","Centro Hospitalar Cova da Beira, E. P. E. (506361659)","BAUSCH  & LOMB, S.A. (980218764)","9.642,50 €",15-05-2017,04-04-2017,365 dias,"Portugal, Castelo Branco, Covilhã",Artigo 258.º do Código dos Contratos Públicos,,,,,,Não aplicável.,Não aplicável.,FALSE
"Prestação de serviços de assistência técnica ao equipamento FDS 330, instalado no Serviço Farmacêutico",Ajuste Direto Regime Geral,Aquisição de serviços,"50421000-2, Serviços de reparação e manutenção de equipamento médico","Centro Hospitalar Cova da Beira, EPE (506361659)","Baxter Médico Farmacêutica, Lda. (503347345)","18.741,36 €",15-05-2017,24-03-2017,365 dias,"Portugal, Castelo Branco, Covilhã","Artigo 20.º, n.º 1, alínea a) do Código dos Contratos Públicos",,,,,,Não aplicável.,Não aplicável.,FALSE
