Objeto do Contrato,Tipo de Procedimento,Tipo(s) de Contrato,CPVs,Entidade(s) Adjudicante(s),Entidade(s) Adjudicatária(s),Preço Contratual,Data de Publicação,Data de Celebração do Contrato,Prazo de Execução,Local de Execução,Fundamentação,Data de Fecho do Contrato,Preço Total Efetivo,Causas das Alterações ao Prazo,Causas das Alterações ao Preço,Estado,N.º registo do Acordo Quadro,Descrição do Acordo Quadro,Procedimento Centralizado
20140559 - Ação de formação,Ajuste Direto Regime Geral,Aquisição de serviços,"80500000-9, Serviços de formação","Instituto Nacional de Saúde Dr. Ricardo Jorge, I. P. (501427511)","SERGA - Serviços e Organização Informatica, LDA (502213531)","4.455,10 €",07-11-2014,16-10-2014,15 dias,"Portugal, Lisboa, Lisboa","Artigo 20.º, n.º 1, alínea a) do Código dos Contratos Públicos",,,,,,Não aplicável.,Não aplicável.,FALSE
20140560- Ação de formação,Ajuste Direto Regime Geral,Aquisição de serviços,"80500000-9, Serviços de formação","Instituto Nacional de Saúde Dr. Ricardo Jorge, I. P. (501427511)",Relacre - Associação Laboratorios Acreditados Portugal (502578874),"1.240,00 €",07-11-2014,22-09-2014,15 dias,"Portugal, Lisboa, Lisboa","Artigo 20.º, n.º 1, alínea a) do Código dos Contratos Públicos",,,,,,Não aplicável.,Não aplicável.,FALSE
20140561- Ação de formação,Ajuste Direto Regime Geral,Aquisição de serviços,"80500000-9, Serviços de formação","Instituto Nacional de Saúde Dr. Ricardo Jorge, I. P. (501427511)","Best Training, Unipessoal, Lda (510531318)","890,00 €",07-11-2014,22-09-2014,20 dias,"Portugal, Lisboa, Lisboa","Artigo 20.º, n.º 1, alínea a) do Código dos Contratos Públicos",,,,,,Não aplicável.,Não aplicável.,FALSE
20140558 - Ação de formação em Normas,Ajuste Direto Regime Geral,Aquisição de serviços,"80530000-8, Serviços de formação profissional","Instituto Nacional de Saúde Dr. Ricardo Jorge, I. P. (501427511)",APQ -Associação Portuguesa para a Qualidade (500960410),"4.280,00 €",06-11-2014,22-09-2014,2 dias,"Portugal, Lisboa, Lisboa","Artigo 20.º, n.º 1, alínea a) do Código dos Contratos Públicos",,,,,,Não aplicável.,Não aplicável.,FALSE
20140030 - aquisição de reagentes,Ajuste Direto Regime Geral,Aquisição de bens móveis,"33696500-0, Reagentes de laboratório","Instituto Nacional de Saúde Dr. Ricardo Jorge, I. P. (501427511)","STAGO PORTUGAL, UNIPESSOAL LDA (509952976)","5.720,84 €",06-11-2014,06-03-2014,2 dias,"Portugal, Lisboa, Lisboa","Artigo 24.º, n.º 1, alínea e) do Código dos Contratos Públicos",,,,,,Não aplicável.,Não aplicável.,FALSE
20140238- Aquisição de Reagentes,Ajuste Direto Regime Geral,Aquisição de bens móveis,"33696500-0, Reagentes de laboratório","Instituto Nacional de Saúde Dr. Ricardo Jorge, I. P. (501427511)","Beckman Coulter Portugal Unipessoal, Ldª (509035167)","14.381,01 €",06-11-2014,28-03-2014,10 dias,"Portugal, Lisboa, Lisboa","Artigo 24.º, n.º 1, alínea e) do Código dos Contratos Públicos",,,,,,Não aplicável.,Não aplicável.,FALSE
20140492-Aquisição de reagentes,Ajuste Direto Regime Geral,Aquisição de bens móveis,"33696500-0, Reagentes de laboratório","Instituto Nacional de Saúde Dr. Ricardo Jorge, I. P. (501427511)","IZASA  PORTUGAL - Distribuições Técnicas, Lda (501086110)","380,00 €",06-11-2014,24-09-2014,5 dias,"Portugal, Lisboa, Lisboa","Artigo 20.º, n.º 1, alínea a) do Código dos Contratos Públicos",,,,,,Não aplicável.,Não aplicável.,FALSE
Aquisição de acessório para detetor electroquimico,Ajuste Direto Regime Geral,Aquisição de bens móveis,"38430000-8, Aparelhos de detecção e análise","Instituto Nacional de Saúde Dr. Ricardo Jorge, I. P. (501427511)","UNICAM - Sistemas Analiticos, Lda (502614625)","1.704,30 €",06-11-2014,23-05-2014,90 dias,"Portugal, Porto, Porto","Artigo 20.º, n.º 1, alínea a) do Código dos Contratos Públicos",,,,,,Não aplicável.,Não aplicável.,FALSE
20140029-Aquisição de reagentes,Ajuste Direto Regime Geral,Aquisição de bens móveis,"33696500-0, Reagentes de laboratório","Instituto Nacional de Saúde Dr. Ricardo Jorge, I. P. (501427511)",Emilio de Azevedo Campos (500094853),"7.595,00 €",06-11-2014,05-03-2014,15 dias,"Portugal, Lisboa, Lisboa","Artigo 24.º, n.º 1, alínea e) do Código dos Contratos Públicos",,,,,,Não aplicável.,Não aplicável.,FALSE
Aquisição de peças para reparação de centrifuga,Ajuste Direto Regime Geral,Aquisição de bens móveis,"31670000-3, Peças eléctricas para máquinas ou aparelhos","Instituto Nacional de Saúde Dr. Ricardo Jorge, I. P. (501427511)","LABOSISTEMA- Comércio de Equipamentos e projetos para Laboratório e Indústria, Lda (505322137)","2.561,00 €",06-11-2014,17-06-2014,90 dias,"Portugal, Porto, Porto","Artigo 20.º, n.º 1, alínea a) do Código dos Contratos Públicos",,,,,,Não aplicável.,Não aplicável.,FALSE
Aquisição de peças para reparação do Autoanalisador,Ajuste Direto Regime Geral,Aquisição de bens móveis,"33100000-1, Equipamento médico","Instituto Nacional de Saúde Dr. Ricardo Jorge, I. P. (501427511)",TECAN Iberica Instrumentacion SL (B63091888),"9.833,00 €",06-11-2014,24-04-2014,90 dias,"Portugal, Lisboa, Lisboa","Artigo 24.º, n.º 1, alínea e) do Código dos Contratos Públicos",,,,,,Não aplicável.,Não aplicável.,FALSE
Aquisição de peças para diversas reparações eletricas do INSA,Ajuste Direto Regime Geral,Aquisição de bens móveis,"33100000-1, Equipamento médico","Instituto Nacional de Saúde Dr. Ricardo Jorge, I. P. (501427511)","LUZFRANCO - Instalaçoes Eléctricas, Unipessoal, Lda (502995777)","4.975,00 €",06-11-2014,04-11-2014,90 dias,"Portugal, Lisboa, Lisboa<BR/>Portugal, Porto, Porto","Artigo 20.º, n.º 1, alínea a) do Código dos Contratos Públicos",,,,,,Não aplicável.,Não aplicável.,FALSE
Aquisição de peças para reparação do Detetor TQ,Ajuste Direto Regime Geral,Aquisição de bens móveis,"42122000-0, Bombas (equipamento)","Instituto Nacional de Saúde Dr. Ricardo Jorge, I. P. (501427511)","Waters Technologies LC-MS Portugal Unipessoal, Lda (510433669)","12.106,00 €",05-11-2014,23-06-2014,90 dias,"Portugal, Lisboa, Lisboa","Artigo 24.º, n.º 1, alínea e) do Código dos Contratos Públicos",,,,,,Não aplicável.,Não aplicável.,FALSE
Aquisição de kit de baterias para UPS,Ajuste Direto Regime Geral,Aquisição de bens móveis,"33100000-1, Equipamento médico","Instituto Nacional de Saúde Dr. Ricardo Jorge, I. P. (501427511)","BaseDois - Informática e Telecomunicações, Lda (501333401)","8.520,00 €",05-11-2014,01-08-2014,90 dias,"Portugal, Lisboa, Lisboa","Artigo 20.º, n.º 1, alínea a) do Código dos Contratos Públicos",,,,,,Não aplicável.,Não aplicável.,FALSE
"Aquisição de peças para reparação de arcas, congeladores e frigorificos",Ajuste Direto Regime Geral,Aquisição de bens móveis,"33100000-1, Equipamento médico","Instituto Nacional de Saúde Dr. Ricardo Jorge, I. P. (501427511)","Alberto Rafael Ferreira Unipessoal, Lda (509842852)","30.000,00 €",05-11-2014,18-07-2014,90 dias,"Portugal, Lisboa, Lisboa<BR/>Portugal, Porto, Porto<BR/>Portugal, Setúbal, Setúbal","Artigo 20.º, n.º 1, alínea a) do Código dos Contratos Públicos",,,,,,Não aplicável.,Não aplicável.,FALSE
"Aquisição de reagentes para o diagnóstico molecular, nomeadamente polimerases e sondas e reagentes para FISH",Concurso público,Aquisição de bens móveis,"33696500-0, Reagentes de laboratório","Instituto Nacional de Saúde Dr. Ricardo Jorge, I. P. (501427511)","Izasa Portugal- Distribuição Técnicas, Lda (501086110)","17.409,62 €",05-11-2014,13-10-2014,90 dias,"Portugal, Setúbal, Setúbal<BR/>Portugal, Porto, Porto<BR/>Portugal, Lisboa, Lisboa","Artigo 20.º, n.º 1, alínea b) do Código dos Contratos Públicos",,,,,,Não aplicável.,Não aplicável.,FALSE
"Aquisição de reagentes para o diagnóstico molecular, nomeadamente polimerases e sondas e reagentes para FISH",Concurso público,Aquisição de bens móveis,"33696500-0, Reagentes de laboratório","Instituto Nacional de Saúde Dr. Ricardo Jorge, I. P. (501427511)","Alfagene - Novas Tecnologias das Ciências da Vida, Lda (503387398)","22.602,06 €",05-11-2014,13-10-2014,90 dias,"Portugal, Porto, Porto<BR/>Portugal, Setúbal, Setúbal<BR/>Portugal, Lisboa, Lisboa","Artigo 20.º, n.º 1, alínea b) do Código dos Contratos Públicos",,,,,,Não aplicável.,Não aplicável.,FALSE
Aquisição de material de consumo administrativo,Ajuste Direto Regime Geral,Aquisição de bens móveis,"30100000-0, Máquinas, equipamento e material de escritório, excepto computadores, impressoras e mobiliário","Instituto Nacional de Saúde Dr. Ricardo Jorge, I. P. (501427511)","OHMTécnica, Lda (504059521)","544,70 €",05-11-2014,16-09-2014,90 dias,"Portugal, Lisboa, Lisboa<BR/>Portugal, Porto, Porto","Artigo 20.º, n.º 1, alínea a) do Código dos Contratos Públicos",,,,,,Não aplicável.,Não aplicável.,FALSE
Aquisição de material de consumo administrativo,Ajuste Direto Regime Geral,Aquisição de bens móveis,"30100000-0, Máquinas, equipamento e material de escritório, excepto computadores, impressoras e mobiliário","Instituto Nacional de Saúde Dr. Ricardo Jorge, I. P. (501427511)","Olmar - Artigos de Papelaria, Lda (508831989)","39,84 €",05-11-2014,16-09-2014,90 dias,"Portugal, Porto, Porto<BR/>Portugal, Lisboa, Lisboa","Artigo 20.º, n.º 1, alínea a) do Código dos Contratos Públicos",,,,,,Não aplicável.,Não aplicável.,FALSE
Aquisição de material de consumo administrativo,Ajuste Direto Regime Geral,Aquisição de bens móveis,"30100000-0, Máquinas, equipamento e material de escritório, excepto computadores, impressoras e mobiliário","Instituto Nacional de Saúde Dr. Ricardo Jorge, I. P. (501427511)","EDNI - Empresa Distribuidora de Material Informático, Lda (503258121)","1.553,51 €",05-11-2014,16-09-2014,90 dias,"Portugal, Lisboa, Lisboa<BR/>Portugal, Porto, Porto","Artigo 20.º, n.º 1, alínea a) do Código dos Contratos Públicos",,,,,,Não aplicável.,Não aplicável.,FALSE
Reparação da Impressora RISO,Ajuste Direto Regime Geral,Aquisição de serviços,"50000000-5, Serviços de reparação e manutenção","Instituto Nacional de Saúde Dr. Ricardo Jorge, I. P. (501427511)","Riso Iberica, SA (980087783)","1.066,17 €",05-11-2014,16-07-2014,90 dias,"Portugal, Lisboa, Lisboa","Artigo 24.º, n.º 1, alínea e) do Código dos Contratos Públicos",,,,,,Não aplicável.,Não aplicável.,FALSE
20140449- Aquisição de reagentes,Ajuste Direto Regime Geral,Aquisição de bens móveis,"33696500-0, Reagentes de laboratório","Instituto Nacional de Saúde Dr. Ricardo Jorge, I. P. (501427511)","Beckman Coulter Portugal Unipessoal, Lda (509035167)","929,95 €",04-11-2014,21-07-2014,2 dias,"Portugal, Lisboa, Lisboa","Artigo 24.º, n.º 1, alínea e) do Código dos Contratos Públicos",,,,,,Não aplicável.,Não aplicável.,FALSE
Aquisição de um sistema de aspiração de liquidos e acessórios,Ajuste Direto Regime Geral,Aquisição de bens móveis,"33926000-7, Tubos ou aspiradores de vácuo para recolha de fluidos em autópsias",Instituto Nacional de Saúde Dr.Ricardo Jorge(INSA) (501427511),"VWR Internacional, Lda (503842770)","1.340,00 €",04-11-2014,24-04-2014,90 dias,"Portugal, Lisboa, Lisboa","Artigo 20.º, n.º 1, alínea a) do Código dos Contratos Públicos",,,,,,Não aplicável.,Não aplicável.,FALSE
Aquisição de Combinado - frigorifico/congelador,Ajuste Direto Regime Geral,Aquisição de bens móveis,"42513000-5, Equipamento de refrigeração e congelação",Instituto Nacional de Saúde Dr.Ricardo Jorge(INSA) (501427511),"VWR Internacional, Lda (503842770)","1.400,00 €",04-11-2014,14-04-2014,90 dias,"Portugal, Lisboa, Lisboa","Artigo 20.º, n.º 1, alínea a) do Código dos Contratos Públicos",,,,,,Não aplicável.,Não aplicável.,FALSE
Aquisição de Armário frigorifico,Ajuste Direto Regime Geral,Aquisição de bens móveis,"42513200-7, Equipamento de refrigeração",Instituto Nacional de Saúde Dr.Ricardo Jorge(INSA) (501427511),"Frilabo II, Lda (507958861)","3.338,00 €",04-11-2014,10-04-2014,90 dias,"Portugal, Lisboa, Lisboa","Artigo 20.º, n.º 1, alínea a) do Código dos Contratos Públicos",,,,,,Não aplicável.,Não aplicável.,FALSE
Aquisição de peças para reparação de três equipamentos de laboratório do INSA,Ajuste Direto Regime Geral,Aquisição de bens móveis,"33100000-1, Equipamento médico","Instituto Nacional de Saúde Dr. Ricardo Jorge, I. P. (501427511)",Alberto Costa Rafael Ferreira (509842852),"4.360,00 €",04-11-2014,17-07-2014,90 dias,"Portugal, Porto, Porto<BR/>Portugal, Lisboa, Lisboa<BR/>Portugal, Setúbal, Setúbal","Artigo 20.º, n.º 1, alínea a) do Código dos Contratos Públicos",,,,,,Não aplicável.,Não aplicável.,FALSE
20140385- Aquisição de reagentes,Ajuste Direto Regime Geral,Aquisição de bens móveis,"33696500-0, Reagentes de laboratório","Instituto Nacional de Saúde Dr. Ricardo Jorge, I. P. (501427511)","Irlandox Laboratorios Quimica Analítica, Lª (502515619)","2.046,40 €",04-11-2014,28-05-2014,2 dias,"Portugal, Lisboa, Lisboa","Artigo 24.º, n.º 1, alínea e) do Código dos Contratos Públicos",,,,,,Não aplicável.,Não aplicável.,FALSE
Aquisição de Ar condicionados,Ajuste Direto Regime Geral,Aquisição de bens móveis,"42510000-4, Permutadores de calor, equipamento de ar condicionado e de refrigeração, aparelhos de filtragem",Instituto Nacional de Saúde Dr.Ricardo Jorge(INSA) (501427511),"Top Frio- Ar Condicionado e equipamento Hoteleiro, Lda (502745495)","2.600,00 €",04-11-2014,21-05-2014,90 dias,"Portugal, Lisboa, Lisboa<BR/>Portugal, Porto, Porto<BR/>Portugal, Setúbal, Setúbal","Artigo 20.º, n.º 1, alínea a) do Código dos Contratos Públicos",,,,,,Não aplicável.,Não aplicável.,FALSE
Aquisição de um UP Grade Storage para o INSA,Ajuste Direto Regime Geral,Aquisição de bens móveis,"33100000-1, Equipamento médico","Instituto Nacional de Saúde Dr. Ricardo Jorge, I. P. (501427511)","ATM -Sistemas de Informação e Serviços, SA (509784267)","5.971,85 €",04-11-2014,10-04-2014,90 dias,"Portugal, Lisboa, Lisboa","Artigo 20.º, n.º 1, alínea a) do Código dos Contratos Públicos",,,,,,Não aplicável.,Não aplicável.,FALSE
aquisição de peças para reparação de um liofilizador,Ajuste Direto Regime Geral,Aquisição de bens móveis,"33100000-1, Equipamento médico","Instituto Nacional de Saúde Dr. Ricardo Jorge, I. P. (501427511)","VWR Internacional, Lda (503842770)","3.796,60 €",04-11-2014,22-10-2014,90 dias,"Portugal, Lisboa, Lisboa","Artigo 20.º, n.º 1, alínea a) do Código dos Contratos Públicos",,,,,,Não aplicável.,Não aplicável.,FALSE
Aquisição de estufa de incubação,Ajuste Direto Regime Geral,Aquisição de bens móveis,"44211500-7, Estufas",Instituto Nacional de Saúde Dr.Ricardo Jorge(INSA) (501427511),"Frilabo II, Lda (507958861)","3.354,00 €",04-11-2014,16-04-2014,90 dias,"Portugal, Lisboa, Lisboa","Artigo 20.º, n.º 1, alínea a) do Código dos Contratos Públicos",,,,,,Não aplicável.,Não aplicável.,FALSE
Aquisição de 2 arcas congeladoras,Ajuste Direto Regime Geral,Aquisição de bens móveis,"42513100-6, Equipamento de congelação",Instituto Nacional de Saúde Dr.Ricardo Jorge(INSA) (501427511),"Frilabo II, Lda (507958861)","6.044,00 €",04-11-2014,10-04-2014,90 dias,"Portugal<BR/>Portugal, Lisboa, Lisboa","Artigo 20.º, n.º 1, alínea a) do Código dos Contratos Públicos",,,,,,Não aplicável.,Não aplicável.,FALSE
Peças para reparação do sequenciador - Genetic Analyser,Ajuste Direto Regime Geral,Aquisição de bens móveis,"38434000-6, Analisadores",Instituto Nacional de Saúde Dr.Ricardo Jorge(INSA) (501427511),"Alfagene - Novas Tecnologias das Ciências da vida, Lda (503387398)","12.000,00 €",04-11-2014,30-05-2014,90 dias,"Portugal, Lisboa, Lisboa","Artigo 20.º, n.º 1, alínea a) do Código dos Contratos Públicos",,,,,,Não aplicável.,Não aplicável.,FALSE
Aquisição e placa de controle para reparação do auto sampler,Ajuste Direto Regime Geral,Aquisição de bens móveis,"33100000-1, Equipamento médico","Instituto Nacional de Saúde Dr. Ricardo Jorge, I. P. (501427511)","UNICAM - Sistemas Analíticos, Lda (502614625)","3.344,85 €",04-11-2014,26-06-2014,90 dias,"Portugal, Porto, Porto","Artigo 24.º, n.º 1, alínea e) do Código dos Contratos Públicos",,,,,,Não aplicável.,Não aplicável.,FALSE
20140555 - reagentes para area doenças infeciosas,Ajuste Direto Regime Geral,Aquisição de bens móveis,"33696500-0, Reagentes de laboratório","Instituto Nacional de Saúde Dr. Ricardo Jorge, I. P. (501427511)","IZASA PORTUGAL - Distribuições Técnicas, Lda (501086110)","6.450,00 €",04-11-2014,28-08-2014,15 dias,"Portugal, Lisboa, Lisboa","Artigo 24.º, n.º 1, alínea c) do Código dos Contratos Públicos",,,,,,Não aplicável.,Não aplicável.,FALSE
Aquisição de peças para reparação do ICP-OES,Ajuste Direto Regime Geral,Aquisição de bens móveis,"33100000-1, Equipamento médico","Instituto Nacional de Saúde Dr. Ricardo Jorge, I. P. (501427511)","UNICAM sistemas Analitico, Lda (502614625)","3.730,00 €",04-11-2014,26-03-2014,90 dias,"Portugal, Lisboa, Lisboa","Artigo 24.º, n.º 1, alínea e) do Código dos Contratos Públicos",,,,,,Não aplicável.,Não aplicável.,FALSE
Reparação de um HPLC para o INSA,Ajuste Direto Regime Geral,Aquisição de serviços,"50000000-5, Serviços de reparação e manutenção","Instituto Nacional de Saúde Dr. Ricardo Jorge, I. P. (501427511)","VWr Internacional, Lda (503842770)","820,00 €",04-11-2014,12-05-2014,90 dias,"Portugal, Lisboa, Lisboa","Artigo 24.º, n.º 1, alínea e) do Código dos Contratos Públicos",,,,,,Não aplicável.,Não aplicável.,FALSE
20140489-Aquisição de ratos laboratorio,Ajuste Direto Regime Geral,Aquisição de bens móveis,"03322000-2, Animais vivos","Instituto Nacional de Saúde Dr. Ricardo Jorge, I. P. (501427511)",Charles River Laboratories France (29086650041),"707,50 €",04-11-2014,17-07-2014,15 dias,"Portugal, Lisboa, Lisboa","Artigo 20.º, n.º 1, alínea a) do Código dos Contratos Públicos",,,,,,Não aplicável.,Não aplicável.,FALSE
Reparação de uma bomba de vácuo no INSA,Ajuste Direto Regime Geral,Aquisição de serviços,"50000000-5, Serviços de reparação e manutenção","Instituto Nacional de Saúde Dr. Ricardo Jorge, I. P. (501427511)","JTC - PROJECTOS E INSTALAÇÕES TÉCNICAS, LDA (501864369)","240,00 €",04-11-2014,22-05-2014,90 dias,"Portugal, Lisboa, Lisboa","Artigo 20.º, n.º 1, alínea a) do Código dos Contratos Públicos",,,,,,Não aplicável.,Não aplicável.,FALSE
20140506 - Manutenção de extintores e hidrantes,Ajuste Direto Regime Geral,Aquisição de serviços,"50610000-4, Serviços de reparação e manutenção de equipamento de segurança","Instituto Nacional de Saúde Dr. Ricardo Jorge, I. P. (501427511)","Segur-Fogo - Comércio de Equipamentos Contra o Fogo, Lda (501508732)","3.810,32 €",04-11-2014,15-09-2014,10 dias,"Portugal, Lisboa, Lisboa","Artigo 20.º, n.º 1, alínea a) do Código dos Contratos Públicos",,,,,,Não aplicável.,Não aplicável.,FALSE
Aquisição de acessórios para autoclave,Ajuste Direto Regime Geral,Aquisição de bens móveis,"33100000-1, Equipamento médico",INSTITUTO NAC. DE SAUDE DR. RICARDO JORGE-LX (501427511),Such Serviço de Utilixação Comum dios Hospitais (500900469),"1.150,22 €",04-11-2014,17-09-2014,90 dias,"Portugal, Lisboa, Lisboa","Artigo 20.º, n.º 1, alínea a) do Código dos Contratos Públicos",,,,,,Não aplicável.,Não aplicável.,FALSE
Aquisição de mangas e luvas para a glove box do INSA,Ajuste Direto Regime Geral,Aquisição de bens móveis,"33100000-1, Equipamento médico","Instituto Nacional de Saúde Dr. Ricardo Jorge, I. P. (501427511)","ORM Tecnologia e Ciência na Industrial, Lda (501866000)","504,00 €",04-11-2014,16-09-2014,90 dias,"Portugal, Lisboa, Lisboa","Artigo 20.º, n.º 1, alínea a) do Código dos Contratos Públicos",,,,,,Não aplicável.,Não aplicável.,FALSE
Aquisição de peças para contador de células no INSA,Ajuste Direto Regime Geral,Aquisição de bens móveis,"33140000-3, Material médico de consumo","Instituto Nacional de Saúde Dr. Ricardo Jorge, I. P. (501427511)","BECKMAN COULTER PORTUGAL UNIPESSOAL, LDA (509035167)","1.728,60 €",04-11-2014,28-10-2014,90 dias,"Portugal, Lisboa, Lisboa","Artigo 24.º, n.º 1, alínea e) do Código dos Contratos Públicos",,,,,,Não aplicável.,Não aplicável.,FALSE
Licenciamento de software RIDA SOFT win.net,Ajuste Direto Regime Geral,Aquisição de bens móveis,"48900000-7, Pacote de software e sistemas informáticos diversos",Instituto Nacional de Saúde Dr.Ricardo Jorge(INSA) (501427511),"Ambifood - Representações de Produtos Laboratoriais, Lda (505400057)","231,00 €",04-11-2014,28-10-2014,90 dias,"Portugal, Lisboa, Lisboa","Artigo 24.º, n.º 1, alínea e) do Código dos Contratos Públicos",,,,,,Não aplicável.,Não aplicável.,FALSE
"Aquisição de reagentes para cultura de tecidos, padrões e químicos",Concurso público,Aquisição de bens móveis,"33696500-0, Reagentes de laboratório","Instituto Nacional de Saúde Dr. Ricardo Jorge, I. P. (501427511)","ILC - INSTRUMENTOS LABORATÓRIO E CIENTÍFICOS, LDA (500948208)","920,00 €",31-10-2014,20-03-2014,90 dias,"Portugal, Lisboa, Lisboa<BR/>Portugal, Setúbal, Setúbal<BR/>Portugal, Porto, Porto","Artigo 20.º, n.º 1, alínea b) do Código dos Contratos Públicos",,,,,,Não aplicável.,Não aplicável.,FALSE
"Aquisição de reagentes para cultura de tecidos, padrões e químicos",Concurso público,Aquisição de bens móveis,"33696500-0, Reagentes de laboratório","Instituto Nacional de Saúde Dr. Ricardo Jorge, I. P. (501427511)","ZMWAY, LDA (508085349)","290,30 €",31-10-2014,20-03-2014,90 dias,"Portugal, Setúbal, Setúbal<BR/>Portugal, Porto, Porto<BR/>Portugal, Lisboa, Lisboa","Artigo 20.º, n.º 1, alínea b) do Código dos Contratos Públicos",,,,,,Não aplicável.,Não aplicável.,FALSE
"Aquisição de reagentes para cultura de tecidos, padrões e químicos",Concurso público,Aquisição de bens móveis,"33696500-0, Reagentes de laboratório","Instituto Nacional de Saúde Dr. Ricardo Jorge, I. P. (501427511)","WATERS, LDA (510433669)","1.050,00 €",31-10-2014,20-03-2014,90 dias,"Portugal, Lisboa, Lisboa<BR/>Portugal, Setúbal, Setúbal<BR/>Portugal, Porto, Porto","Artigo 20.º, n.º 1, alínea b) do Código dos Contratos Públicos",,,,,,Não aplicável.,Não aplicável.,FALSE
"Aquisição de reagentes para cultura de tecidos, padrões e químicos",Concurso público,Aquisição de bens móveis,"33696500-0, Reagentes de laboratório","Instituto Nacional de Saúde Dr. Ricardo Jorge, I. P. (501427511)","UNICAM, LDA (FACTORING) (502614625)","720,00 €",31-10-2014,20-03-2014,90 dias,"Portugal, Setúbal, Setúbal<BR/>Portugal, Lisboa, Lisboa<BR/>Portugal, Porto, Porto","Artigo 20.º, n.º 1, alínea b) do Código dos Contratos Públicos",,,,,,Não aplicável.,Não aplicável.,FALSE
"Aquisição de reagentes para cultura de tecidos, padrões e químicos",Concurso público,Aquisição de bens móveis,"33696500-0, Reagentes de laboratório","Instituto Nacional de Saúde Dr. Ricardo Jorge, I. P. (501427511)","SOQUÍMICA - SOC. REPRESENTAÇÕES DE QUIMICA, LDA (500274231)","474,64 €",31-10-2014,20-03-2014,90 dias,"Portugal, Porto, Porto<BR/>Portugal, Setúbal, Setúbal<BR/>Portugal, Lisboa, Lisboa","Artigo 20.º, n.º 1, alínea b) do Código dos Contratos Públicos",,,,,,Não aplicável.,Não aplicável.,FALSE
"Aquisição de reagentes para cultura de tecidos, padrões e químicos",Concurso público,Aquisição de bens móveis,"33696500-0, Reagentes de laboratório","Instituto Nacional de Saúde Dr. Ricardo Jorge, I. P. (501427511)","SPECANALÍTICA - EQUIPAMENTOS CIENTÍFICOS, LDA (507350871)","972,65 €",31-10-2014,20-03-2014,90 dias,"Portugal, Lisboa, Lisboa<BR/>Portugal, Porto, Porto<BR/>Portugal, Setúbal, Setúbal","Artigo 20.º, n.º 1, alínea b) do Código dos Contratos Públicos",,,,,,Não aplicável.,Não aplicável.,FALSE
"Aquisição de reagentes para cultura de tecidos, padrões e químicos",Concurso público,Aquisição de bens móveis,"33696500-0, Reagentes de laboratório","Instituto Nacional de Saúde Dr. Ricardo Jorge, I. P. (501427511)","ROCHE SISTEMAS DIAGNÓSTICO, LDA (504282921)","2.076,00 €",31-10-2014,20-03-2014,90 dias,"Portugal, Lisboa, Lisboa<BR/>Portugal, Porto, Porto<BR/>Portugal, Setúbal, Setúbal","Artigo 20.º, n.º 1, alínea b) do Código dos Contratos Públicos",,,,,,Não aplicável.,Não aplicável.,FALSE
"Aquisição de reagentes para cultura de tecidos, padrões e químicos",Concurso público,Aquisição de bens móveis,"33696500-0, Reagentes de laboratório","Instituto Nacional de Saúde Dr. Ricardo Jorge, I. P. (501427511)","QUILABAN - QUÍMICA LABORATORIAL ANALÍTICA, LDA (500399670)","153,96 €",31-10-2014,20-03-2014,90 dias,"Portugal, Setúbal, Setúbal<BR/>Portugal, Porto, Porto<BR/>Portugal, Lisboa, Lisboa","Artigo 20.º, n.º 1, alínea b) do Código dos Contratos Públicos",,,,,,Não aplicável.,Não aplicável.,FALSE
"Aquisição de reagentes para cultura de tecidos, padrões e químicos",Concurso público,Aquisição de bens móveis,"33696500-0, Reagentes de laboratório","Instituto Nacional de Saúde Dr. Ricardo Jorge, I. P. (501427511)","JOHNSON & JOHNSON, LDA (500153370)","198,00 €",31-10-2014,20-03-2014,90 dias,"Portugal, Setúbal, Setúbal<BR/>Portugal, Porto, Porto<BR/>Portugal, Lisboa, Lisboa","Artigo 20.º, n.º 1, alínea b) do Código dos Contratos Públicos",,,,,,Não aplicável.,Não aplicável.,FALSE
"Aquisição de reagentes para cultura de tecidos, padrões e químicos",Concurso público,Aquisição de bens móveis,"33696500-0, Reagentes de laboratório","Instituto Nacional de Saúde Dr. Ricardo Jorge, I. P. (501427511)","IBERLAB & IMUNOREAGE - SOL. PARA LABORATÓRIO, LDA (503406694)","2.699,00 €",31-10-2014,20-03-2014,90 dias,"Portugal, Porto, Porto<BR/>Portugal, Lisboa, Lisboa<BR/>Portugal, Setúbal, Setúbal","Artigo 20.º, n.º 1, alínea b) do Código dos Contratos Públicos",,,,,,Não aplicável.,Não aplicável.,FALSE
"Aquisição de reagentes para cultura de tecidos, padrões e químicos",Concurso público,Aquisição de bens móveis,"33696500-0, Reagentes de laboratório","Instituto Nacional de Saúde Dr. Ricardo Jorge, I. P. (501427511)",FISHER SCIENTIFIC LDA. (506429210),"72,03 €",31-10-2014,20-03-2014,90 dias,"Portugal, Setúbal, Setúbal<BR/>Portugal, Porto, Porto<BR/>Portugal, Lisboa, Lisboa","Artigo 20.º, n.º 1, alínea b) do Código dos Contratos Públicos",,,,,,Não aplicável.,Não aplicável.,FALSE
Aquisição de bens móveis,Concurso público,Aquisição de bens móveis,"33696500-0, Reagentes de laboratório","Instituto Nacional de Saúde Dr. Ricardo Jorge, I. P. (501427511)","BIO-RAD LABORATORIES - APARELHOS, REAG. LAB., LDA (501301321)","4.258,00 €",31-10-2014,26-03-2014,90 dias,"Portugal, Lisboa, Lisboa<BR/>Portugal, Porto, Porto<BR/>Portugal, Setúbal, Setúbal","Artigo 20.º, n.º 1, alínea b) do Código dos Contratos Públicos",,,,,,Não aplicável.,Não aplicável.,FALSE
"Aquisição de reagentes para cultura de tecidos, padrões e químicos",Concurso público,Aquisição de bens móveis,"33696500-0, Reagentes de laboratório","Instituto Nacional de Saúde Dr. Ricardo Jorge, I. P. (501427511)","ENZIFARMA - DAGNÓSTICA E FARMACÊUTICA, LDA (503636975)","7.195,00 €",31-10-2014,20-03-2014,90 dias,"Portugal, Lisboa, Lisboa<BR/>Portugal, Setúbal, Setúbal<BR/>Portugal, Porto, Porto","Artigo 20.º, n.º 1, alínea b) do Código dos Contratos Públicos",,,,,,Não aplicável.,Não aplicável.,FALSE
"Aquisição de reagentes para cultura de tecidos, padrões e químicos",Concurso público,Aquisição de bens móveis,"33696500-0, Reagentes de laboratório","Instituto Nacional de Saúde Dr. Ricardo Jorge, I. P. (501427511)","BIOPORTUGAL - QUÍMICO E FARMACÊUTICA, LDA (502380543)","600,00 €",31-10-2014,20-03-2014,90 dias,"Portugal, Setúbal, Setúbal<BR/>Portugal, Lisboa, Lisboa<BR/>Portugal, Porto, Porto","Artigo 20.º, n.º 1, alínea b) do Código dos Contratos Públicos",,,,,,Não aplicável.,Não aplicável.,FALSE
"Aquisição de reagentes para cultura de tecidos, padrões e químicos",Concurso público,Aquisição de bens móveis,"33696500-0, Reagentes de laboratório","Instituto Nacional de Saúde Dr. Ricardo Jorge, I. P. (501427511)","Sigma Aldrich Quimica, S.L. (B-79184115)","36.723,40 €",31-10-2014,14-04-2014,90 dias,"Portugal, Porto, Porto<BR/>Portugal, Setúbal, Setúbal<BR/>Portugal, Lisboa, Lisboa","Artigo 20.º, n.º 1, alínea b) do Código dos Contratos Públicos",,,,,,Não aplicável.,Não aplicável.,FALSE
"Aquisição de reagentes para cultura de tecidos, padrões e quimicos ",Concurso público,Aquisição de bens móveis,"33696500-0, Reagentes de laboratório","Instituto Nacional de Saúde Dr. Ricardo Jorge, I. P. (501427511)","Bio-Rad Laboratorios, Lda (501301321)","15.304,00 €",31-10-2014,14-04-2014,90 dias,"Portugal, Setúbal, Setúbal<BR/>Portugal, Porto, Porto<BR/>Portugal, Lisboa, Lisboa","Artigo 20.º, n.º 1, alínea b) do Código dos Contratos Públicos",,,,,,Não aplicável.,Não aplicável.,FALSE
"Aquisição de reagentes para cultura de tecidos, padrões e quimicos",Concurso público,Aquisição de bens móveis,"33696500-0, Reagentes de laboratório","Instituto Nacional de Saúde Dr. Ricardo Jorge, I. P. (501427511)","VWR Internacional, Lda (503842770)","49.511,17 €",31-10-2014,14-04-2014,90 dias,"Portugal, Lisboa, Lisboa<BR/>Portugal, Porto, Porto<BR/>Portugal, Setúbal, Setúbal","Artigo 20.º, n.º 1, alínea b) do Código dos Contratos Públicos",,,,,,Não aplicável.,Não aplicável.,FALSE
