freguesia,acronym,validVotesPercentage,votes,dicofre
Quinta Grande,PPD/PSD.CDS-PP,47.11,359,310204
Quinta Grande,MPT,16.14,123,310204
Quinta Grande,PS,15.49,118,310204
Quinta Grande,PTP,5.12,39,310204
Quinta Grande,PAN,3.02,23,310204
Quinta Grande,PCP-PEV,2.89,22,310204
Quinta Grande,PND,2.49,19,310204
Quinta Grande,L,2.1,16,310204
Quinta Grande,B.E.,1.97,15,310204
Quinta Grande,PPM,1.05,8,310204
Quinta Grande,PCTP/MRPP,0.66,5,310204
Quinta Grande,PPV,0.66,5,310204
Quinta Grande,PNR,0.52,4,310204
Quinta Grande,MAS,0.39,3,310204
Quinta Grande,PDA,0.39,3,310204
Quinta Grande,POUS,0,0,310204
