freguesia,acronym,validVotesPercentage,votes,dicofre
Benquerenças,PS,58.15,189,050203
Benquerenças,PPD/PSD,22.15,72,050203
Benquerenças,B.E.,8.62,28,050203
Benquerenças,PCP-PEV,2.46,8,050203
Benquerenças,PAN,1.85,6,050203
Benquerenças,CH,1.23,4,050203
Benquerenças,CDS-PP,0.92,3,050203
Benquerenças,A,0.62,2,050203
Benquerenças,IL,0.62,2,050203
Benquerenças,MPT,0.62,2,050203
Benquerenças,PNR,0.62,2,050203
Benquerenças,PPM,0.62,2,050203
Benquerenças,R.I.R.,0.62,2,050203
Benquerenças,PCTP/MRPP,0.31,1,050203
Benquerenças,PDR,0.31,1,050203
Benquerenças,PURP,0.31,1,050203
Benquerenças,L,0,0,050203
Benquerenças,PTP,0,0,050203
