freguesia,acronym,validVotesPercentage,votes,dicofre
União das freguesias de Ermelo e Pardelhas,PPD/PSD.CDS-PP,56.77,130,170510
União das freguesias de Ermelo e Pardelhas,PS,32.31,74,170510
União das freguesias de Ermelo e Pardelhas,PCP-PEV,2.62,6,170510
União das freguesias de Ermelo e Pardelhas,PTP,2.18,5,170510
União das freguesias de Ermelo e Pardelhas,MPT,1.31,3,170510
União das freguesias de Ermelo e Pardelhas,PCTP/MRPP,1.31,3,170510
União das freguesias de Ermelo e Pardelhas,L,0.87,2,170510
União das freguesias de Ermelo e Pardelhas,PND,0.87,2,170510
União das freguesias de Ermelo e Pardelhas,B.E.,0.44,1,170510
União das freguesias de Ermelo e Pardelhas,PNR,0.44,1,170510
União das freguesias de Ermelo e Pardelhas,POUS,0.44,1,170510
União das freguesias de Ermelo e Pardelhas,PPM,0.44,1,170510
União das freguesias de Ermelo e Pardelhas,MAS,0,0,170510
União das freguesias de Ermelo e Pardelhas,PAN,0,0,170510
União das freguesias de Ermelo e Pardelhas,PDA,0,0,170510
União das freguesias de Ermelo e Pardelhas,PPV,0,0,170510
