freguesia,acronym,validVotesPercentage,votes,dicofre
Oliveira,PPD/PSD.CDS-PP,48.74,58,170403
Oliveira,PS,35.29,42,170403
Oliveira,B.E.,4.2,5,170403
Oliveira,MPT,3.36,4,170403
Oliveira,PCP-PEV,3.36,4,170403
Oliveira,PPM,1.68,2,170403
Oliveira,MAS,0.84,1,170403
Oliveira,PCTP/MRPP,0.84,1,170403
Oliveira,PDA,0.84,1,170403
Oliveira,PTP,0.84,1,170403
Oliveira,L,0,0,170403
Oliveira,PAN,0,0,170403
Oliveira,PND,0,0,170403
Oliveira,PNR,0,0,170403
Oliveira,POUS,0,0,170403
Oliveira,PPV,0,0,170403
