freguesia,acronym,validVotesPercentage,votes,dicofre
Cedães,PS,35.54,43,040712
Cedães,PPD/PSD,34.71,42,040712
Cedães,CDS-PP,8.26,10,040712
Cedães,B.E.,7.44,9,040712
Cedães,PAN,4.13,5,040712
Cedães,PCTP/MRPP,2.48,3,040712
Cedães,PDR,2.48,3,040712
Cedães,PCP-PEV,1.65,2,040712
Cedães,A,0.83,1,040712
Cedães,PNR,0.83,1,040712
Cedães,PPM.PPV/CDC,0.83,1,040712
Cedães,PURP,0.83,1,040712
Cedães,IL,0,0,040712
Cedães,L,0,0,040712
Cedães,MAS,0,0,040712
Cedães,NC,0,0,040712
Cedães,PTP,0,0,040712
