Objeto do Contrato,Tipo de Procedimento,Tipo(s) de Contrato,CPVs,Entidade(s) Adjudicante(s),Entidade(s) Adjudicatária(s),Preço Contratual,Data de Publicação,Data de Celebração do Contrato,Prazo de Execução,Local de Execução,Fundamentação,Data de Fecho do Contrato,Preço Total Efetivo,Causas das Alterações ao Prazo,Causas das Alterações ao Preço,Estado,N.º registo do Acordo Quadro,Descrição do Acordo Quadro,Procedimento Centralizado
"Aquisição de produtos específicos de laboratório, para utilização em Ensaios de Detecção de Hemaglutininas Anti-A e Anti-B EA_20140000355.",Ajuste Direto Regime Geral,Locação de bens móveis,"33696500-0, Reagentes de laboratório","INFARMED - Autoridade Nacional do Medicamento e Produtos de Saúde, I. P. - SNCP (600037002)","GRIFOLS PORTUGAL, LDA. (502041285)","8.520,00 €",18-07-2014,18-07-2014,30 dias,Portugal,"Artigo 24.º, n.º 1, alínea e) do Código dos Contratos Públicos",,,,,,Não aplicável.,Não aplicável.,FALSE
Serviços de viagem no âmbito de uma deslocação com a comitiva do Vice Primeiro Ministro à Arabia Saudida,Ao abrigo de acordo-quadro (art.º 258.º),Aquisição de serviços,"63510000-7, Serviços de agências de viagens e serviços similares","INFARMED - Autoridade Nacional do Medicamento e Produtos de Saúde, I. P. (600037002)","Escalatur, Viagens e Turismo,Lda (501343237)","4.026,48 €",11-07-2014,11-07-2014,4 dias,Arábia Saudita,"Artigo 27.º, n.º 1, alínea h) do Código dos Contratos Públicos",,,,,,273814,"Acordo Quadro de viagens, transportes aéreos e alojamentos",FALSE
"Serviços de alojamento e viagem para participação na reunião pharmaceutical commitee, em Bruxelas,1 participante/2 dias",Ao abrigo de acordo-quadro (art.º 258.º),Aquisição de serviços,"63510000-7, Serviços de agências de viagens e serviços similares","INFARMED - Autoridade Nacional do Medicamento e Produtos de Saúde, I. P. (600037002)","Pamtours - Viagens e Turismo,Lda (502844779)","957,58 €",11-07-2014,11-07-2014,2 dias,Espanha,"Artigo 27.º, n.º 1, alínea h) do Código dos Contratos Públicos",,,,,,273814,"Acordo Quadro de viagens, transportes aéreos e alojamentos",FALSE
"Serviço de viagem para participação na reunião The Heads of Medecines Agencies, em Toledo, 1 participante/3 dias",Ao abrigo de acordo-quadro (art.º 258.º),Aquisição de serviços,"63510000-7, Serviços de agências de viagens e serviços similares","INFARMED - Autoridade Nacional do Medicamento e Produtos de Saúde, I. P. (600037002)","Escalatur, Viagens e Turismo Unipessoal,Lda (501343237)","498,99 €",11-07-2014,11-07-2014,3 dias,Espanha,"Artigo 27.º, n.º 1, alínea h) do Código dos Contratos Públicos",,,,,,273814,"Acordo Quadro de viagens, transportes aéreos e alojamentos",FALSE
"Serviços de alojamento para participação na reunião The Heads of medines Agencies, em Toledo, 1 participante/3 dias",Ao abrigo de acordo-quadro (art.º 258.º),Aquisição de serviços,"63510000-7, Serviços de agências de viagens e serviços similares","INFARMED - Autoridade Nacional do Medicamento e Produtos de Saúde, I. P. (600037002)","TQ-Travel Quality - Viagens e Turismo,Lda (501313915)","292,00 €",11-07-2014,11-07-2014,3 dias,Espanha,"Artigo 27.º, n.º 1, alínea h) do Código dos Contratos Públicos",,,,,,273814,"Acordo Quadro de viagens, transportes aéreos e alojamentos",FALSE
"serviços de alojamento e viagem para participação na reunião Standing Committee on Medical Products for human Use, em Bruxelas,2 participantes/2 dias",Ao abrigo de acordo-quadro (art.º 258.º),Aquisição de serviços,"63510000-7, Serviços de agências de viagens e serviços similares","INFARMED - Autoridade Nacional do Medicamento e Produtos de Saúde, I. P. (600037002)","TQ- Travel Quality,Lda (501313915)","1.035,90 €",11-07-2014,03-06-2014,2 dias,Bélgica,"Artigo 27.º, n.º 1, alínea h) do Código dos Contratos Públicos",,,,,,273814,"Acordo Quadro de viagens, transportes aéreos e alojamentos",FALSE
"Serviços de viagem e alojamento para participação numa inspeção conjunta (pharmaceutical inspection covention and pharmaceutical inspection co-operation scheme),na Indonesia- 1 participante/7 dias",Ao abrigo de acordo-quadro (art.º 258.º),Aquisição de serviços,"63510000-7, Serviços de agências de viagens e serviços similares","INFARMED - Autoridade Nacional do Medicamento e Produtos de Saúde, I. P. (600037002)","Pamtours - Viagens e Turismo,Lda (502844779)","1.362,50 €",11-07-2014,04-07-2014,7 dias,Indonésia,"Artigo 27.º, n.º 1, alínea h) do Código dos Contratos Públicos",,,,,,273814,"Acordo Quadro de viagens, transportes aéreos e alojamentos",FALSE
"Serviços de alojamento e viagem para participação na reunião Pharmakeia, nos Açores,1 participante/3 dias",Ao abrigo de acordo-quadro (art.º 258.º),Aquisição de serviços,"63510000-7, Serviços de agências de viagens e serviços similares","INFARMED - Autoridade Nacional do Medicamento e Produtos de Saúde, I. P. (600037002)","Topatlântico - Viagens e Turismo,SA (501061126)","435,38 €",11-07-2014,16-06-2014,3 dias,Portugal,"Artigo 27.º, n.º 1, alínea h) do Código dos Contratos Públicos",,,,,,273814,"Acordo Quadro de viagens, transportes aéreos e alojamentos",FALSE
