freguesia,acronym,validVotesPercentage,votes,dicofre
São João de Loure e Frossos,PPD/PSD,36.74,511,010210
São João de Loure e Frossos,PS,30.41,423,010210
São João de Loure e Frossos,CDS-PP,12.58,175,010210
São João de Loure e Frossos,B.E.,10.28,143,010210
São João de Loure e Frossos,PAN,2.3,32,010210
São João de Loure e Frossos,PCP-PEV,1.87,26,010210
São João de Loure e Frossos,R.I.R.,1.29,18,010210
São João de Loure e Frossos,CH,0.93,13,010210
São João de Loure e Frossos,IL,0.93,13,010210
São João de Loure e Frossos,L,0.5,7,010210
São João de Loure e Frossos,PCTP/MRPP,0.43,6,010210
São João de Loure e Frossos,PDR,0.36,5,010210
São João de Loure e Frossos,PTP,0.29,4,010210
São João de Loure e Frossos,A,0.22,3,010210
São João de Loure e Frossos,NC,0.22,3,010210
São João de Loure e Frossos,PNR,0.22,3,010210
São João de Loure e Frossos,PURP,0.22,3,010210
São João de Loure e Frossos,MPT,0.14,2,010210
São João de Loure e Frossos,JPP,0.07,1,010210
São João de Loure e Frossos,PPM,0,0,010210
