Objeto do Contrato,Tipo de Procedimento,Tipo(s) de Contrato,CPVs,Entidade(s) Adjudicante(s),Entidade(s) Adjudicatária(s),Preço Contratual,Data de Publicação,Data de Celebração do Contrato,Prazo de Execução,Local de Execução,Fundamentação,Data de Fecho do Contrato,Preço Total Efetivo,Causas das Alterações ao Prazo,Causas das Alterações ao Preço,Estado,N.º registo do Acordo Quadro,Descrição do Acordo Quadro,Procedimento Centralizado
Aquisição de serviços para gestão logística do armazém de Sete Rios 2017,Ajuste Direto Regime Geral,Aquisição de serviços,"79900000-3, Serviços empresariais diversos e afins",Direcção-Geral da Saúde (DGS) (600037100),"Globalfarma, Produtos Farmacêuticos, Ld.ª (504289390)","16.200,00 €",08-05-2017,20-02-2017,365 dias,"Portugal, Lisboa","Artigo 20.º, n.º 1, alínea a) do Código dos Contratos Públicos",,,,,,Não aplicável.,Não aplicável.,FALSE
Aquisição de serviços de carregamento e arrumação de diversos móveis e equipamentos dentro da DGS,Ajuste Direto Regime Geral,Aquisição de serviços,"79900000-3, Serviços empresariais diversos e afins",Direção-Geral da Saúde (600037100),"Benamudis - Mudanças, Distribuição e Serviços, Lda. (506010899)","9.990,00 €",08-05-2017,05-05-2017,270 dias,"Portugal, Lisboa","Artigo 20.º, n.º 1, alínea a) do Código dos Contratos Públicos",,,,,,Não aplicável.,Não aplicável.,FALSE
"Aquisição de serviços de manutenção aplicacional e apoio aos utilizadores dos sistemas HELICS UCI, HELICS CIR, UCI-RN e INCS, para o ano de 2017",Ajuste Direto Regime Geral,Aquisição de serviços,"72610000-9, Serviços de assistência informática",Direção-Geral da Saúde (600037100),"BYVALUE – Sistemas de Informação, Lda. (508124948)","7.740,00 €",08-05-2017,05-05-2017,365 dias,"Portugal, Lisboa","Artigo 20.º, n.º 1, alínea a) do Código dos Contratos Públicos",,,,,,Não aplicável.,Não aplicável.,FALSE
