freguesia,acronym,validVotesPercentage,votes,dicofre
Boivães,PPD/PSD,51.66,78,160602
Boivães,PS,30.46,46,160602
Boivães,CDS-PP,10.6,16,160602
Boivães,B.E.,5.3,8,160602
Boivães,IL,0.66,1,160602
Boivães,MPT,0.66,1,160602
Boivães,PCP-PEV,0.66,1,160602
Boivães,A,0,0,160602
Boivães,CH,0,0,160602
Boivães,JPP,0,0,160602
Boivães,L,0,0,160602
Boivães,NC,0,0,160602
Boivães,PAN,0,0,160602
Boivães,PCTP/MRPP,0,0,160602
Boivães,PDR,0,0,160602
Boivães,PNR,0,0,160602
Boivães,PPM,0,0,160602
Boivães,PTP,0,0,160602
Boivães,PURP,0,0,160602
Boivães,R.I.R.,0,0,160602
