freguesia,acronym,validVotesPercentage,votes,dicofre
Loriga,PS,54.96,277,091207
Loriga,PPD/PSD,18.25,92,091207
Loriga,B.E.,9.92,50,091207
Loriga,PCP-PEV,7.54,38,091207
Loriga,CDS-PP,2.58,13,091207
Loriga,CH,1.79,9,091207
Loriga,PCTP/MRPP,1.19,6,091207
Loriga,A,0.79,4,091207
Loriga,PAN,0.79,4,091207
Loriga,IL,0.6,3,091207
Loriga,L,0.6,3,091207
Loriga,R.I.R.,0.4,2,091207
Loriga,NC,0.2,1,091207
Loriga,PTP,0.2,1,091207
Loriga,PURP,0.2,1,091207
Loriga,MPT,0,0,091207
Loriga,PDR,0,0,091207
Loriga,PNR,0,0,091207
Loriga,PPM,0,0,091207
