Objeto do Contrato,Tipo de Procedimento,Tipo(s) de Contrato,CPVs,Entidade(s) Adjudicante(s),Entidade(s) Adjudicatária(s),Preço Contratual,Data de Publicação,Data de Celebração do Contrato,Prazo de Execução,Local de Execução,Fundamentação,Data de Fecho do Contrato,Preço Total Efetivo,Causas das Alterações ao Prazo,Causas das Alterações ao Preço,Estado,N.º registo do Acordo Quadro,Descrição do Acordo Quadro,Procedimento Centralizado
"CONTRATO DE PRESTAÇÃO DE SERVIÇOS DE ASSESSORIA ECONÓMICO-FINANCEIRA DE APOIO AO ACOMPANHAMENTO DA EXECUÇÃO DO CONTRAO DE GESTÃO DO HOSPITAL DE CASCAIS, EM REGIME DE PARCERIA PÚBLICO - PRIVADA",Ajuste Direto Regime Geral,Aquisição de serviços,"66171000-9, Serviços de consultoria financeira","Serviço Partilhados do Ministério da Saúde, E. P. E. (509540716)","PricewaterhouseCoopers  - Assessoria de Gestão, Lda (504193279)","74.940,00 €",08-06-2012,15-05-2012,229 dias,"Portugal, Lisboa, Lisboa","Artigo 20.º, n.º 1, alínea a) do Código dos Contratos Públicos",,,,,,Não aplicável.,Não aplicável.,
Aquisição de Equipamentos Informáticos - Computadores Portateis,Ajuste Direto Regime Geral,Aquisição de bens móveis,"30213100-6, Computadores portáteis","Serviço Partilhados do Ministério da Saúde, E. P. E. (509540716)","Exitus, Soluções Tecnológicas, Lda (509117660)","6.622,00 €",06-06-2012,30-05-2012,15 dias,"Portugal, Lisboa, Lisboa","Artigo 20.º, n.º 1, alínea a) do Código dos Contratos Públicos",,,,,,Não aplicável.,Não aplicável.,
PRESTAÇÃO DE SERVIÇOS DE CONSULTORIA FUNCIONAL E TÉCNICA PARA O PROJETO - SISTEMAS DE INFORMAÇÃO DE TAXAS MODERADORAS,Ajuste Direto Regime Geral,Aquisição de serviços,"72600000-6, Serviços de consultoria e assistência informáticas","Serviço Partilhados do Ministério da Saúde, E. P. E. (509540716)",GFI PORTUGAL - TECNOLOGIAS DE INFORMAÇÃO S.A. (502726890),"31.733,76 €",06-06-2012,08-05-2012,90 dias,Portugal,"Artigo 20.º, n.º 1, alínea a) do Código dos Contratos Públicos",,,,,,Não aplicável.,Não aplicável.,
"AQUISIÇÃO DE SERVIÇOS DE SUPORTE 24 X 7 AOS SISTEMAS DE INFORMAÇÃO DA SPMS,EPE",Ajuste Direto Regime Geral,Aquisição de serviços,"72500000-0, Serviços relacionados com a informática","Serviço Partilhados do Ministério da Saúde, E. P. E. (509540716)","ORAMIX - SISTEMAS INFORMAÇÃO, S.A. (504448382)","50.400,00 €",06-06-2012,31-05-2012,213 dias,Portugal,"Artigo 20.º, n.º 1, alínea a) do Código dos Contratos Públicos",,,,,,Não aplicável.,Não aplicável.,
AQUISIÇÃO E IMPLEMENTAÇÃO DO SOFTWARE DE COMPRAS INTEGRADO COM O ERP DA CONTABILIDADE,Ajuste Direto Regime Geral,Aquisição de bens móveis,"48000000-8, Pacotes de software e sistemas de informação","Serviço Partilhados do Ministério da Saúde, E. P. E. (509540716)",Art Vision - Business Solutions Lda (509222889),"16.204,00 €",05-06-2012,30-05-2012,122 dias,Portugal,"Artigo 20.º, n.º 1, alínea a) do Código dos Contratos Públicos",,,,,,Não aplicável.,Não aplicável.,
"AQUISIÇÃO DE SERVIÇOS DE CONSULTORIA FINANCEIRA DE APOIO AO ACOMPANHAMENTO DA EXECUÇÃO DOS CONTRATOS DE GESTÃO DOS HOSPITAIS DE BRAGA, LOURES E VILA FRANCA DE XIRA, EM REGIME DE PARCERIA PÚBLICO-PRIVADAS",Ajuste Direto Regime Geral,Aquisição de serviços,"66171000-9, Serviços de consultoria financeira","Serviço Partilhados do Ministério da Saúde, E. P. E. (509540716)","BANCO BPI, S.A. (501214534)","199.990,00 €",04-06-2012,31-05-2012,213 dias,Portugal,"Artigo 20.º, n.º 1, alínea a) do Código dos Contratos Públicos",,,,,,Não aplicável.,Não aplicável.,
"AQUISIÇÃO DE SERVIÇOS DE CONSULTORIA JURÍDICA DE APOIO AO ACOMPANHAMENTO DA EXECUÇÃO DOS CONTRATOS DE GESTÃO DOS HOSPITAIS DE BRAGA, CASCAIS, LOURES E VILA FRANCA DE XIRA, EM REGIME DE PARCERIAS  PÚBLICO-PRIVADAS",Ajuste Direto Regime Geral,Aquisição de serviços,"79100000-5, Serviços jurídicos","Serviço Partilhados do Ministério da Saúde, E. P. E. (509540716)","BAS - Sociedade de Advogados, RL (509100007)","199.990,00 €",04-06-2012,31-05-2012,213 dias,Portugal,"Artigo 20.º, n.º 1, alínea a) do Código dos Contratos Públicos",,,,,,Não aplicável.,Não aplicável.,
