freguesia,acronym,validVotesPercentage,votes,dicofre
Lourosa,PS,44.74,119,061109
Lourosa,PPD/PSD,30.83,82,061109
Lourosa,B.E.,12.03,32,061109
Lourosa,CDS-PP,4.51,12,061109
Lourosa,PCP-PEV,1.5,4,061109
Lourosa,CH,0.75,2,061109
Lourosa,L,0.75,2,061109
Lourosa,PCTP/MRPP,0.75,2,061109
Lourosa,PDR,0.75,2,061109
Lourosa,PNR,0.75,2,061109
Lourosa,PURP,0.75,2,061109
Lourosa,R.I.R.,0.75,2,061109
Lourosa,A,0.38,1,061109
Lourosa,IL,0.38,1,061109
Lourosa,JPP,0.38,1,061109
Lourosa,MAS,0,0,061109
Lourosa,MPT,0,0,061109
Lourosa,NC,0,0,061109
Lourosa,PAN,0,0,061109
Lourosa,PPM,0,0,061109
