freguesia,acronym,validVotesPercentage,votes,dicofre
"União das freguesias de Chorente, Góios, Courel, Pedra Furada e Gueral",PPD/PSD,53.45,465,030296
"União das freguesias de Chorente, Góios, Courel, Pedra Furada e Gueral",PS,22.76,198,030296
"União das freguesias de Chorente, Góios, Courel, Pedra Furada e Gueral",CDS-PP,9.89,86,030296
"União das freguesias de Chorente, Góios, Courel, Pedra Furada e Gueral",B.E.,4.6,40,030296
"União das freguesias de Chorente, Góios, Courel, Pedra Furada e Gueral",PAN,2.53,22,030296
"União das freguesias de Chorente, Góios, Courel, Pedra Furada e Gueral",A,1.38,12,030296
"União das freguesias de Chorente, Góios, Courel, Pedra Furada e Gueral",L,0.92,8,030296
"União das freguesias de Chorente, Góios, Courel, Pedra Furada e Gueral",PURP,0.8,7,030296
"União das freguesias de Chorente, Góios, Courel, Pedra Furada e Gueral",PCP-PEV,0.69,6,030296
"União das freguesias de Chorente, Góios, Courel, Pedra Furada e Gueral",PPM.PPV/CDC,0.69,6,030296
"União das freguesias de Chorente, Góios, Courel, Pedra Furada e Gueral",IL,0.57,5,030296
"União das freguesias de Chorente, Góios, Courel, Pedra Furada e Gueral",MAS,0.46,4,030296
"União das freguesias de Chorente, Góios, Courel, Pedra Furada e Gueral",PDR,0.46,4,030296
"União das freguesias de Chorente, Góios, Courel, Pedra Furada e Gueral",PNR,0.34,3,030296
"União das freguesias de Chorente, Góios, Courel, Pedra Furada e Gueral",PCTP/MRPP,0.23,2,030296
"União das freguesias de Chorente, Góios, Courel, Pedra Furada e Gueral",PTP,0.23,2,030296
"União das freguesias de Chorente, Góios, Courel, Pedra Furada e Gueral",NC,0,0,030296
