Objeto do Contrato,Tipo de Procedimento,Tipo(s) de Contrato,CPVs,Entidade(s) Adjudicante(s),Entidade(s) Adjudicatária(s),Preço Contratual,Data de Publicação,Data de Celebração do Contrato,Prazo de Execução,Local de Execução,Fundamentação,Data de Fecho do Contrato,Preço Total Efetivo,Causas das Alterações ao Prazo,Causas das Alterações ao Preço,Estado,N.º registo do Acordo Quadro,Descrição do Acordo Quadro,Procedimento Centralizado
"S10018/2018 Fornecimento de Serviços de Transporte de Doentes ao CHBM, EPE",Concurso público,Aquisição de serviços,"85143000-3, Serviços de ambulâncias","Centro Hospitalar Barreiro Montijo, E. P. E. (509186998)","Palvidas - Transporte de doentes, Lda. (503253227)","47.075,00 €",21-11-2018,03-07-2018,183 dias,"Portugal, Setúbal, Barreiro","Artigo 20.º, n.º 1, alínea b) do Código dos Contratos Públicos","","",,"",,Não aplicável.,Não aplicável.,FALSE
4SUI0012/2018 TRANSPORTE DE DOENTES - AGOSTO,Ajuste Direto Regime Geral,Aquisição de serviços,"85143000-3, Serviços de ambulâncias","Centro Hospitalar Barreiro Montijo, E. P. E. (509186998)","HELPED EMERGENCY, LDA ASSICIAÇÃO HUMANITÁRIA DE BOMBEIROS VOLUNTÁRIOS DO SUL E SUESTE E ASSOCIAÇÃO HUMANITÁRIA DOS BOMBEIROS VOLUNTÁRIOS O DAFUNDO (509388906)","42.636,52 €",21-11-2018,17-09-2018,31 dias,"Portugal, Setúbal, Barreiro","Artigo 24.º, n.º 1, alínea c) do Código dos Contratos Públicos","","",,"",,Não aplicável.,Não aplicável.,FALSE
4SUI0011/2018 TRANSPORTE DOENTES - JULHO,Ajuste Direto Regime Geral,Aquisição de serviços,"85143000-3, Serviços de ambulâncias","Centro Hospitalar Barreiro Montijo, E. P. E. (509186998)","HELPED EMERGENCY, LDA ASSICIAÇÃO HUMANITÁRIA DE BOMBEIROS VOLUNTÁRIOS DO SUL E SUESTE E ASSOCIAÇÃO HUMANITÁRIA DOS BOMBEIROS VOLUNTÁRIOS O DAFUNDO (509388906)","42.636,52 €",21-11-2018,04-07-2018,31 dias,"Portugal, Setúbal, Barreiro","Artigo 24.º, n.º 1, alínea c) do Código dos Contratos Públicos","","",,"",,Não aplicável.,Não aplicável.,FALSE
"S10023/2018 Fornecimento de Serviços de Transporte de Doentes ao CHBM, EPE",Concurso público,Aquisição de serviços,"85143000-3, Serviços de ambulâncias","CHBM - Centro Hospital Barreiro Montijo, EPE (509186998)","HELPED EMERGENCY, LDA ASSICIAÇÃO HUMANITÁRIA DE BOMBEIROS VOLUNTÁRIOS DO SUL E SUESTE E ASSOCIAÇÃO HUMANITÁRIA DOS BOMBEIROS VOLUNTÁRIOS O DAFUNDO (509388906)","136.739,20 €",21-11-2018,20-09-2018,122 dias,"Portugal, Setúbal, Barreiro","Artigo 20.º, n.º 1, alínea b) do Código dos Contratos Públicos","","",,"",,Não aplicável.,Não aplicável.,FALSE
4SEX0061/2018 - REP BILIRRUBINOMETRO - OBSTETRICIA,Ajuste Direto Regime Geral,Aquisição de serviços,"50000000-5, Serviços de reparação e manutenção","CHBM - Centro Hospital Barreiro Montijo, EPE (509186998)",DRAGER PORTUGAL LDA (508771323),"509,60 €",19-11-2018,29-06-2018,90 dias,"Portugal, Setúbal, Barreiro","Artigo 24.º, n.º 1, alínea e), subalínea ii) do Código dos Contratos Públicos",27-07-2018,"509,60 €",,"",,Não aplicável.,Não aplicável.,FALSE
4SEX0042/2018 - SUBST BALÃO DE TESTES DA MESA DE ANESTESIA DA SALA 1 DO B. PARTOS,Ajuste Direto Regime Geral,Aquisição de serviços,"50000000-5, Serviços de reparação e manutenção","Centro Hospitalar Barreiro Montijo, E. P. E. (509186998)","GETINGE GROUP PORTUGAL, UNIP LDA (MAQUET PORT) (506819698)","101,26 €",19-11-2018,26-06-2018,90 dias,"Portugal, Setúbal, Barreiro","Artigo 24.º, n.º 1, alínea e), subalínea ii) do Código dos Contratos Públicos",30-08-2018,"101,26 €",,"",,Não aplicável.,Não aplicável.,FALSE
4SEX0044/2018 - REP SERINGA INFUSORA - UCI,Ajuste Direto Regime Geral,Aquisição de serviços,"50000000-5, Serviços de reparação e manutenção","Centro Hospitalar Barreiro Montijo, E. P. E. (509186998)","Fresenius Kabi Pharma Portugal, Lda. (504293753)","255,89 €",19-11-2018,21-05-2018,90 dias,"Portugal, Setúbal, Barreiro","Artigo 24.º, n.º 1, alínea e), subalínea ii) do Código dos Contratos Públicos",21-06-2018,"255,89 €",,"",,Não aplicável.,Não aplicável.,FALSE
4SEX0038/2018 - CALIBRAÇÃO DE BILIRRUBINÓMETRO - OBSTETRICIA,Ajuste Direto Regime Geral,Aquisição de serviços,"50000000-5, Serviços de reparação e manutenção","Centro Hospitalar Barreiro Montijo, E. P. E. (509186998)",DRAGER PORTUGAL LDA (508771323),"509,60 €",16-11-2018,22-05-2018,90 dias,"Portugal, Setúbal, Barreiro","Artigo 24.º, n.º 1, alínea e), subalínea ii) do Código dos Contratos Públicos",31-05-2018,"509,60 €",,"",,Não aplicável.,Não aplicável.,FALSE
4SEX0043/2018 - REGULARIZAÇÃO DE FACTURAÇÃO EM FALTA REFERENTE AO 2.º SEM 2017 DO CAT DE MANUT MICROSCOPIO-CARL ZEIS,Ajuste Direto Regime Geral,Aquisição de serviços,"50000000-5, Serviços de reparação e manutenção","Centro Hospitalar Barreiro Montijo, E. P. E. (509186998)",CARL ZEISS MEDITEC IBERIA SA - SUCURSAL EM PORTUGAL (980503043),"1.325,00 €",16-11-2018,21-05-2018,90 dias,"Portugal, Setúbal, Barreiro","Artigo 24.º, n.º 1, alínea e), subalínea ii) do Código dos Contratos Públicos",26-06-2018,"1.325,00 €",,"",,Não aplicável.,Não aplicável.,FALSE
4SUI0004/2018 TRANSPORTE DOENTES - TRANSP PROGRAMADO DE RADIOTERAPIA - MAIO E JUNHO,Ajuste Direto Regime Geral,Aquisição de serviços,"85143000-3, Serviços de ambulâncias","CHBM - Centro Hospital Barreiro Montijo, EPE (509186998)","ASC, Ambulancias Santa Cecilia, Unip. Lda (510905099)","9.183,50 €",14-11-2018,12-06-2018,61 dias,"Portugal, Setúbal, Barreiro","Artigo 24.º, n.º 1, alínea c) do Código dos Contratos Públicos",30-06-2018,"12.514,67 €",,Consumo efetivo superior às estimativas iniciais,,Não aplicável.,Não aplicável.,FALSE
8S0007/2018 MCDT - BIOPSIAS DE FUSÃO,Consulta Prévia,Aquisição de serviços,"85000000-9, Serviços de saúde e acção social","Centro Hospitalar Barreiro Montijo, E. P. E. (509186998)",Hospital da Luz Setúbal (501245570),"25.500,00 €",14-11-2018,13-09-2018,122 dias,"Portugal, Setúbal, Barreiro","Artigo 20.º, n.º 1, alínea c) do Código dos Contratos Públicos","","",,"",,Não aplicável.,Não aplicável.,FALSE
4S0042/2018 TRATAMENTOS COMPLEXOS POR IMRT DE RADIOTERAPIA - ANO 2018,Ajuste Direto Regime Geral,Aquisição de serviços,"85150000-5, Serviços de imagiologia médica","Centro Hospitalar Barreiro Montijo, E. P. E. (509186998)","Quadrantes - Clinica Médica e de Diagnóstico, Sociedade Unipessoal, Lda. (504148850)","100.000,00 €",14-11-2018,09-03-2018,306 dias,"Portugal, Setúbal, Barreiro","Artigo 24.º, n.º 1, alínea a) do Código dos Contratos Públicos","","",,"",,Não aplicável.,Não aplicável.,FALSE
"S10017/2018 - Tratamentos Conformacionais 3D de Radioterapia aos Doentes do CHBM, EPE",Concurso público,Aquisição de serviços,"85150000-5, Serviços de imagiologia médica","CHBM - Centro Hospital Barreiro Montijo, EPE (509186998)",SAMS (500825556),"101.250,00 €",13-11-2018,04-04-2018,304 dias,"Portugal, Setúbal, Barreiro","Artigo 20.º, n.º 1, alínea b) do Código dos Contratos Públicos","","",,"",,Não aplicável.,Não aplicável.,FALSE
