freguesia,acronym,validVotesPercentage,votes,dicofre
Resende,PS,47.91,355,181311
Resende,PPD/PSD,28.74,213,181311
Resende,CDS-PP,6.48,48,181311
Resende,B.E.,5.94,44,181311
Resende,PAN,3.64,27,181311
Resende,PCP-PEV,2.02,15,181311
Resende,PCTP/MRPP,0.94,7,181311
Resende,PDR,0.94,7,181311
Resende,IL,0.67,5,181311
Resende,L,0.67,5,181311
Resende,PPM.PPV/CDC,0.67,5,181311
Resende,A,0.54,4,181311
Resende,NC,0.4,3,181311
Resende,PNR,0.13,1,181311
Resende,PTP,0.13,1,181311
Resende,PURP,0.13,1,181311
Resende,MAS,0,0,181311
