Objeto do Contrato,Tipo de Procedimento,Tipo(s) de Contrato,CPVs,Entidade(s) Adjudicante(s),Entidade(s) Adjudicatária(s),Preço Contratual,Data de Publicação,Data de Celebração do Contrato,Prazo de Execução,Local de Execução,Fundamentação,Data de Fecho do Contrato,Preço Total Efetivo,Causas das Alterações ao Prazo,Causas das Alterações ao Preço,Estado,N.º registo do Acordo Quadro,Descrição do Acordo Quadro,Procedimento Centralizado
Medicamentos Vários Rubrica 316111,Ajuste Direto Regime Geral,Aquisição de bens móveis,"33690000-3, Medicamentos vários","Centro Hospitalar do Baixo Vouga, E.P.E. (510123210)",PIERRE FABRE MEDIC.PORTUGAL (500230366),"7.182,00 €",08-01-2016,07-12-2015,365 dias,"Portugal, Aveiro","Artigo 20.º, n.º 1, alínea a) do Código dos Contratos Públicos",,,,,,Não aplicável.,Não aplicável.,FALSE
Medicamentos Vários Rubrica 316111,Ajuste Direto Regime Geral,Aquisição de bens móveis,"33690000-3, Medicamentos vários","Centro Hospitalar do Baixo Vouga, E.P.E. (510123210)","LABESFAL-LAB.ALMIRO,SA (501169580)","3.160,00 €",08-01-2016,07-12-2015,365 dias,"Portugal, Aveiro","Artigo 20.º, n.º 1, alínea a) do Código dos Contratos Públicos",,,,,,Não aplicável.,Não aplicável.,FALSE
Medicamentos Vários Rubrica 316111,Ajuste Direto Regime Geral,Aquisição de bens móveis,"33690000-3, Medicamentos vários","Centro Hospitalar do Baixo Vouga, E.P.E. (510123210)","KORANGI-PRODUTOS FARMACEUT,LDA (505322307)","515,00 €",08-01-2016,07-12-2015,365 dias,"Portugal, Aveiro","Artigo 20.º, n.º 1, alínea a) do Código dos Contratos Públicos",,,,,,Não aplicável.,Não aplicável.,FALSE
Medicamentos Exclusivos Takeda,Ajuste Direto Regime Geral,Aquisição de bens móveis,"33690000-3, Medicamentos vários","Centro Hospitalar do Baixo Vouga, E.P.E. (510123210)",TAKEDA - FARMACÊUTICOS PORTUGAL LDA (502801204),"59.670,00 €",08-01-2016,12-11-2015,1095 dias,"Portugal, Aveiro","Artigo 24.º, n.º 1, alínea e) do Código dos Contratos Públicos",,,,,,Não aplicável.,Não aplicável.,FALSE
MEDICAMENTOS EXCLUSIVOS CELGENE,Ajuste Direto Regime Geral,Aquisição de bens móveis,"33652300-8, Imunossupressores","Centro Hospitalar do Baixo Vouga, E. P. E (CHBV, E. P. E.) (510123210)","CELGENE, SOCIEDADE UNIPESSOAL, LDA (507791690)","347.173,90 €",08-01-2016,29-12-2015,365 dias,"Portugal, Aveiro","Artigo 24.º, n.º 1, alínea e) do Código dos Contratos Públicos",,,,,,Não aplicável.,Não aplicável.,FALSE
