Objeto do Contrato,Tipo de Procedimento,Tipo(s) de Contrato,CPVs,Entidade(s) Adjudicante(s),Entidade(s) Adjudicatária(s),Preço Contratual,Data de Publicação,Data de Celebração do Contrato,Prazo de Execução,Local de Execução,Fundamentação,Data de Fecho do Contrato,Preço Total Efetivo,Causas das Alterações ao Prazo,Causas das Alterações ao Preço,Estado,N.º registo do Acordo Quadro,Descrição do Acordo Quadro,Procedimento Centralizado
AQUISIÇAO DE SISTEMA DE MONITORIZAÇAO DE DADOS BIOMETRICOS PARA REABILITAÇAO CARDIACA,Ajuste Direto Regime Geral,Aquisição de bens móveis,"32440000-9, Equipamento de telemetria e terminal","Centro Hospitalar de Lisboa Ocidental, EPE (CHLO) (507618319)",CARDIO SOLUTIONS (507158865),"16.250,00 €",27-01-2016,22-01-2016,8 dias,"Portugal, Lisboa, Lisboa","Artigo 20.º, n.º 1, alínea a) do Código dos Contratos Públicos",,,,,,Não aplicável.,Não aplicável.,FALSE
REPARAÇÃO DO ELEVADOR Nº.1 DO HSC,Ajuste Direto Regime Geral,Aquisição de serviços,"50000000-5, Serviços de reparação e manutenção","Centro Hospitalar de Lisboa Ocidental, E. P. E. (507618319)","GRUPNOR GRUPO PORTUGUES ELEVADORES NORTE, LDA (500959579)","7.955,00 €",25-01-2016,21-01-2016,15 dias,"Portugal, Lisboa, Lisboa","Artigo 24.º, n.º 1, alínea e) do Código dos Contratos Públicos",,,,,,Não aplicável.,Não aplicável.,FALSE
"Serviços de manutenção e assistência técnica às portas automáticas do CHLO, EPE",Ajuste Direto Regime Geral,Aquisição de serviços,"50700000-2, Serviços de reparação e manutenção de equipamento em edifícios","Centro Hospitalar de Lisboa Ocidental, EPE (CHLO) (507618319)","Entredoor, Lda (509282547)","9.119,75 €",22-01-2016,04-01-2016,366 dias,"Portugal, Lisboa, Lisboa<BR/>Portugal, Lisboa, Oeiras","Artigo 20.º, n.º 1, alínea a) do Código dos Contratos Públicos",,,,,,Não aplicável.,Não aplicável.,FALSE
Fornecimento e montagem de sistema de exaustão no BO do HEM,Ajuste Direto Regime Geral,Aquisição de bens móveis<br/>Aquisição de serviços,"51000000-9, Serviços de instalação (excepto software)","Centro Hospitalar de Lisboa Ocidental, EPE (CHLO) (507618319)","Constarte, SA (500072221)","8.070,00 €",22-01-2016,07-01-2016,15 dias,"Portugal, Lisboa, Lisboa","Artigo 20.º, n.º 1, alínea a) do Código dos Contratos Públicos",,,,,,Não aplicável.,Não aplicável.,FALSE
Fornecimento com instalação de UPS para o BOC Oftalmologia do CHLO,Ajuste Direto Regime Geral,Aquisição de bens móveis,"31000000-6, Maquinaria, aparelhagem, equipamento e consumíveis eléctricos; iluminação","Centro Hospitalar de Lisboa Ocidental, E. P. E. (507618319)","Custódio António Cardoso Unipessoal, Lda (513252452)","9.800,00 €",22-01-2016,22-12-2015,10 dias,"Portugal, Lisboa, Lisboa","Artigo 20.º, n.º 1, alínea a) do Código dos Contratos Públicos",,,,,,Não aplicável.,Não aplicável.,FALSE
"SERVIÇOS DE SUPORTE E MANUTENÇÃO DA INFRA-ESTRUTRA DE SISTEMAS E TECNOLOGIAS DO CHLO, EPE EM JANEIRO 2016",Ajuste Direto Regime Geral,Aquisição de serviços,"72267000-4, Serviços de manutenção e reparação de software","Centro Hospitalar de Lisboa Ocidental, EPE (CHLO) (507618319)","ITEN, SA (510728189)","8.740,50 €",21-01-2016,19-01-2016,31 dias,"Portugal, Lisboa, Lisboa","Artigo 20.º, n.º 1, alínea a) do Código dos Contratos Públicos",,,,,,Não aplicável.,Não aplicável.,FALSE
"Serviços de Manutenção e Suporte Técnico ao Sistema cardiobase do CHLO, EPE",Ajuste Direto Regime Geral,Aquisição de serviços,"72000000-5, Serviços de TI: consultoria, desenvolvimento de software, Internet e apoio","Centro Hospitalar de Lisboa Ocidental, EPE (CHLO) (507618319)","Infortucano, Lda (503586293)","8.400,00 €",21-01-2016,04-01-2016,366 dias,"Portugal, Lisboa, Lisboa","Artigo 24.º, n.º 1, alínea a) do Código dos Contratos Públicos",,,,,,Não aplicável.,Não aplicável.,FALSE
AD700156 - Aquisição licenças de software HP dataprotector para o ano de 2016,Ajuste Direto Regime Geral,Aquisição de serviços,"72000000-5, Serviços de TI: consultoria, desenvolvimento de software, Internet e apoio","Centro Hospitalar de Lisboa Ocidental, E. P. E. (507618319)","ITEN, SA (510728189)","5.450,00 €",21-01-2016,05-01-2016,366 dias,"Portugal, Lisboa, Lisboa","Artigo 20.º, n.º 1, alínea a) do Código dos Contratos Públicos",,,,,,Não aplicável.,Não aplicável.,FALSE
Colocação sistema de chamada de enfermeira na Cirurgia Geral do HSFX,Ajuste Direto Regime Geral,Aquisição de serviços,"51000000-9, Serviços de instalação (excepto software)","Centro Hospitalar de Lisboa Ocidental, E. P. E. (507618319)","Custódio Antonio cardoso -Unipessoal, Lda (513252452)","28.839,45 €",21-01-2016,30-10-2015,15 dias,"Portugal, Lisboa, Lisboa","Artigo 20.º, n.º 1, alínea a) do Código dos Contratos Públicos",,,,,,Não aplicável.,Não aplicável.,FALSE
AD802385 - Aquisição de macas TAC+RM para o Hospital Santa Cruz,Ajuste Direto Regime Geral,Aquisição de bens móveis,"33100000-1, Equipamento médico","Centro Hospitalar de Lisboa Ocidental, EPE (CHLO) (507618319)","Filsat, Lda (506708616)","12.366,00 €",21-01-2016,10-11-2015,20 dias,"Portugal, Lisboa, Oeiras<BR/>Portugal, Lisboa, Lisboa","Artigo 20.º, n.º 1, alínea a) do Código dos Contratos Públicos",,,,,,Não aplicável.,Não aplicável.,FALSE
AQUISIÇAO DE SISTEMA DE GESTÃO DE ATENDIMENTO NO HEM (VISITAS HOSPITALARES),Ajuste Direto Regime Geral,Aquisição de bens móveis,"32441200-8, Equipamento de controlo e telemetria","Centro Hospitalar de Lisboa Ocidental, EPE (CHLO) (507618319)","Attendsys - Soluçoes Globais de Atendimento, lda (510306802)","74.423,42 €",21-01-2016,08-01-2016,90 dias,"Portugal, Lisboa, Lisboa","Artigo 20.º, n.º 1, alínea a) do Código dos Contratos Públicos",,,,,,Não aplicável.,Não aplicável.,FALSE
Aquisição de serviços de jardinagem no CHLO durante o ano de 2016,Ajuste Direto Regime Geral,Aquisição de serviços,"77310000-6, Serviços de plantação e manutenção de áreas verdes","Centro Hospitalar de Lisboa Ocidental, EPE (CHLO) (507618319)","Floratorres, Lda (503485713)","7.500,00 €",21-01-2016,04-01-2016,366 dias,"Portugal, Lisboa, Oeiras<BR/>Portugal, Lisboa, Lisboa","Artigo 20.º, n.º 1, alínea a) do Código dos Contratos Públicos",,,,,,Não aplicável.,Não aplicável.,FALSE
"MANUTENÇÃO E ASSISTÊNCIA TÉCNICA À REDE DE INCÊNDIOS ARMADA, AGENTES EXTINTORES E SISTEMAS AUTOMÁTICOS NO CHLO ",Ajuste Direto Regime Geral,Aquisição de serviços,"50413200-5, Serviços de reparação e manutenção de equipamento de combate a incêndios","Centro Hospitalar de Lisboa Ocidental, EPE (CHLO) (507618319)","Segur Fogo, Lda (501508732)","11.400,00 €",21-01-2016,04-01-2016,366 dias,"Portugal, Lisboa, Oeiras<BR/>Portugal, Lisboa, Lisboa","Artigo 20.º, n.º 1, alínea a) do Código dos Contratos Públicos",,,,,,Não aplicável.,Não aplicável.,FALSE
"SERVIÇOS DE MANUTENÇÃO E ASSISTÊNCIA TÉCNICA AOS EQUIPAMENTOS E TERMINAIS DE GASES MEDICINAIS NO CHLO, EPE",Concurso público,Aquisição de serviços,"50000000-5, Serviços de reparação e manutenção","Centro Hospitalar de Lisboa Ocidental, E. P. E. (507618319)","Vedolis, Lda (501260170)","79.596,00 €",21-01-2016,04-01-2016,366 dias,"Portugal, Lisboa, Lisboa<BR/>Portugal, Lisboa, Oeiras","Artigo 20.º, n.º 1, alínea b) do Código dos Contratos Públicos",,,,,,Não aplicável.,Não aplicável.,FALSE
