Objeto do Contrato,Tipo de Procedimento,Tipo(s) de Contrato,CPVs,Entidade(s) Adjudicante(s),Entidade(s) Adjudicatária(s),Preço Contratual,Data de Publicação,Data de Celebração do Contrato,Prazo de Execução,Local de Execução,Fundamentação,Data de Fecho do Contrato,Preço Total Efetivo,Causas das Alterações ao Prazo,Causas das Alterações ao Preço,Estado,N.º registo do Acordo Quadro,Descrição do Acordo Quadro,Procedimento Centralizado
40029/2015 - IMPRESSOS - ENVELOPES SA70,Ajuste Direto Regime Geral,Aquisição de bens móveis,"22000000-0, Material impresso e afins","Centro Hospitalar Barreiro Montijo, E. P. E. (509186998)",TIPOGRAFIA RIBATEJO (503700479),"2.172,00 €",18-02-2015,06-02-2015,360 dias,"Portugal, Setúbal, Barreiro","Artigo 20.º, n.º 1, alínea a) do Código dos Contratos Públicos",10-09-2015,"1.810,00 €",,Alteração de quantidades,,Não aplicável.,Não aplicável.,FALSE
40029/2015 - IMPRESSOS,Ajuste Direto Regime Geral,Aquisição de bens móveis,"22000000-0, Material impresso e afins","Centro Hospitalar Barreiro Montijo, E. P. E. (509186998)",CUNHA & DUARTE (500081336),"4.736,96 €",18-02-2015,06-02-2015,360 dias,"Portugal, Setúbal, Barreiro","Artigo 20.º, n.º 1, alínea a) do Código dos Contratos Públicos",03-09-2015,"292.851,00 €",,Alteração  de quantidades,,Não aplicável.,Não aplicável.,FALSE
40016/2015 - Etiquetas 2015,Ajuste Direto Regime Geral,Aquisição de bens móveis,"30192800-9, Etiquetas autocolantes","CHBM - Centro Hospital Barreiro Montijo, EPE (509186998)",Datalabel (506448967),"8.380,40 €",18-02-2015,02-01-2015,360 dias,"Portugal, Setúbal, Barreiro","Artigo 20.º, n.º 1, alínea a) do Código dos Contratos Públicos",23-09-2015,"8.318,88 €",,ALTERAÇÃO NAS QUANTIDADES,,Não aplicável.,Não aplicável.,FALSE
Fornecimento de Seguro de Acidentes de Trabalho aos Colaboradores em CIT no CHBM EPE,Ajuste Direto Regime Geral,Aquisição de serviços,"66510000-8, Serviços de seguros","CHBM - Centro Hospital Barreiro Montijo, EPE (509186998)",João Mata Lda. - Corretores e Consultores de Seguros (500150141),"49.906,80 €",12-02-2015,04-02-2014,300 dias,"Portugal, Setúbal, Barreiro","Artigo 20.º, n.º 1, alínea a) do Código dos Contratos Públicos",31-12-2014,"49.906,80 €",,"",,Não aplicável.,Não aplicável.,FALSE
Prestação de Serviços de jardinagem,Ajuste Direto Regime Geral,Aquisição de serviços,"77311000-3, Serviços de manutenção de jardins ornamentais e recreativos","CHBM - Centro Hospital Barreiro Montijo, EPE (509186998)",Decoverdi - Plantas e Jardins SA (502438878),"10.488,00 €",11-02-2015,16-01-2014,365 dias,"Portugal, Setúbal, Barreiro","Artigo 20.º, n.º 1, alínea a) do Código dos Contratos Públicos",31-12-2014,"10.488,00 €",,"",,Não aplicável.,Não aplicável.,FALSE
