freguesia,acronym,validVotesPercentage,votes,dicofre
União das freguesias de Carvalhais e Candal,PS,42.97,165,181620
União das freguesias de Carvalhais e Candal,PPD/PSD,34.11,131,181620
União das freguesias de Carvalhais e Candal,B.E.,5.21,20,181620
União das freguesias de Carvalhais e Candal,CDS-PP,5.21,20,181620
União das freguesias de Carvalhais e Candal,PAN,4.69,18,181620
União das freguesias de Carvalhais e Candal,A,2.08,8,181620
União das freguesias de Carvalhais e Candal,PCP-PEV,1.56,6,181620
União das freguesias de Carvalhais e Candal,L,1.04,4,181620
União das freguesias de Carvalhais e Candal,PCTP/MRPP,1.04,4,181620
União das freguesias de Carvalhais e Candal,PTP,0.78,3,181620
União das freguesias de Carvalhais e Candal,PURP,0.78,3,181620
União das freguesias de Carvalhais e Candal,IL,0.52,2,181620
União das freguesias de Carvalhais e Candal,MAS,0,0,181620
União das freguesias de Carvalhais e Candal,NC,0,0,181620
União das freguesias de Carvalhais e Candal,PDR,0,0,181620
União das freguesias de Carvalhais e Candal,PNR,0,0,181620
União das freguesias de Carvalhais e Candal,PPM.PPV/CDC,0,0,181620
