freguesia,acronym,validVotesPercentage,votes,dicofre
Ericeira,PS,33.26,1081,110906
Ericeira,PPD/PSD,20.15,655,110906
Ericeira,B.E.,11.6,377,110906
Ericeira,PAN,9.08,295,110906
Ericeira,CDS-PP,6.89,224,110906
Ericeira,PCP-PEV,5.72,186,110906
Ericeira,A,3.6,117,110906
Ericeira,L,2.68,87,110906
Ericeira,PPM.PPV/CDC,2.4,78,110906
Ericeira,IL,1.2,39,110906
Ericeira,NC,1.08,35,110906
Ericeira,PNR,0.71,23,110906
Ericeira,PCTP/MRPP,0.65,21,110906
Ericeira,MAS,0.31,10,110906
Ericeira,PDR,0.28,9,110906
Ericeira,PURP,0.25,8,110906
Ericeira,PTP,0.15,5,110906
