freguesia,acronym,validVotesPercentage,votes,dicofre
Balugães,PPD/PSD,53.32,257,030212
Balugães,PS,25.52,123,030212
Balugães,B.E.,6.85,33,030212
Balugães,CDS-PP,6.85,33,030212
Balugães,PCP-PEV,2.28,11,030212
Balugães,PAN,1.66,8,030212
Balugães,PCTP/MRPP,1.04,5,030212
Balugães,L,0.62,3,030212
Balugães,MPT,0.62,3,030212
Balugães,R.I.R.,0.41,2,030212
Balugães,A,0.21,1,030212
Balugães,CH,0.21,1,030212
Balugães,IL,0.21,1,030212
Balugães,PTP,0.21,1,030212
Balugães,JPP,0,0,030212
Balugães,MAS,0,0,030212
Balugães,NC,0,0,030212
Balugães,PDR,0,0,030212
Balugães,PNR,0,0,030212
Balugães,PPM,0,0,030212
Balugães,PURP,0,0,030212
