freguesia,acronym,validVotesPercentage,votes,dicofre
União das freguesias de Montijo e Afonsoeiro,PS,31.06,2656,150710
União das freguesias de Montijo e Afonsoeiro,PCP-PEV,23.95,2048,150710
União das freguesias de Montijo e Afonsoeiro,PPD/PSD.CDS-PP,19.73,1687,150710
União das freguesias de Montijo e Afonsoeiro,MPT,7.08,605,150710
União das freguesias de Montijo e Afonsoeiro,B.E.,7.04,602,150710
União das freguesias de Montijo e Afonsoeiro,L,2.88,246,150710
União das freguesias de Montijo e Afonsoeiro,PAN,2.57,220,150710
União das freguesias de Montijo e Afonsoeiro,PCTP/MRPP,2.55,218,150710
União das freguesias de Montijo e Afonsoeiro,PNR,0.74,63,150710
União das freguesias de Montijo e Afonsoeiro,PPM,0.5,43,150710
União das freguesias de Montijo e Afonsoeiro,PND,0.46,39,150710
União das freguesias de Montijo e Afonsoeiro,PTP,0.43,37,150710
União das freguesias de Montijo e Afonsoeiro,PPV,0.42,36,150710
União das freguesias de Montijo e Afonsoeiro,MAS,0.4,34,150710
União das freguesias de Montijo e Afonsoeiro,POUS,0.12,10,150710
União das freguesias de Montijo e Afonsoeiro,PDA,0.07,6,150710
