freguesia,acronym,validVotesPercentage,votes,dicofre
Correlhã,PPD/PSD,36.04,306,160716
Correlhã,CDS-PP,23.44,199,160716
Correlhã,PS,21.32,181,160716
Correlhã,B.E.,4.95,42,160716
Correlhã,PAN,3.18,27,160716
Correlhã,NC,2.24,19,160716
Correlhã,PCP-PEV,2.24,19,160716
Correlhã,L,1.18,10,160716
Correlhã,PPM.PPV/CDC,1.18,10,160716
Correlhã,PCTP/MRPP,0.82,7,160716
Correlhã,A,0.71,6,160716
Correlhã,PNR,0.71,6,160716
Correlhã,IL,0.59,5,160716
Correlhã,PTP,0.59,5,160716
Correlhã,PURP,0.35,3,160716
Correlhã,MAS,0.24,2,160716
Correlhã,PDR,0.24,2,160716
