freguesia,acronym,validVotesPercentage,votes,dicofre
União das freguesias de Moimenta e Montouto,PS,68.6,59,041237
União das freguesias de Moimenta e Montouto,PPD/PSD.CDS-PP,27.91,24,041237
União das freguesias de Moimenta e Montouto,MPT,1.16,1,041237
União das freguesias de Moimenta e Montouto,PCP-PEV,1.16,1,041237
União das freguesias de Moimenta e Montouto,PCTP/MRPP,1.16,1,041237
União das freguesias de Moimenta e Montouto,B.E.,0,0,041237
União das freguesias de Moimenta e Montouto,L,0,0,041237
União das freguesias de Moimenta e Montouto,MAS,0,0,041237
União das freguesias de Moimenta e Montouto,PAN,0,0,041237
União das freguesias de Moimenta e Montouto,PDA,0,0,041237
União das freguesias de Moimenta e Montouto,PND,0,0,041237
União das freguesias de Moimenta e Montouto,PNR,0,0,041237
União das freguesias de Moimenta e Montouto,POUS,0,0,041237
União das freguesias de Moimenta e Montouto,PPM,0,0,041237
União das freguesias de Moimenta e Montouto,PPV,0,0,041237
União das freguesias de Moimenta e Montouto,PTP,0,0,041237
