freguesia,acronym,validVotesPercentage,votes,dicofre
União das freguesias de Travassô e Óis da Ribeira,PPD/PSD.CDS-PP,43.64,278,010125
União das freguesias de Travassô e Óis da Ribeira,PS,33.75,215,010125
União das freguesias de Travassô e Óis da Ribeira,MPT,8.16,52,010125
União das freguesias de Travassô e Óis da Ribeira,PCP-PEV,5.65,36,010125
União das freguesias de Travassô e Óis da Ribeira,B.E.,4.08,26,010125
União das freguesias de Travassô e Óis da Ribeira,PCTP/MRPP,1.26,8,010125
União das freguesias de Travassô e Óis da Ribeira,PAN,1.1,7,010125
União das freguesias de Travassô e Óis da Ribeira,L,0.63,4,010125
União das freguesias de Travassô e Óis da Ribeira,PND,0.47,3,010125
União das freguesias de Travassô e Óis da Ribeira,POUS,0.31,2,010125
União das freguesias de Travassô e Óis da Ribeira,PPM,0.31,2,010125
União das freguesias de Travassô e Óis da Ribeira,MAS,0.16,1,010125
União das freguesias de Travassô e Óis da Ribeira,PDA,0.16,1,010125
União das freguesias de Travassô e Óis da Ribeira,PPV,0.16,1,010125
União das freguesias de Travassô e Óis da Ribeira,PTP,0.16,1,010125
União das freguesias de Travassô e Óis da Ribeira,PNR,0,0,010125
