Objeto do Contrato,Tipo de Procedimento,Tipo(s) de Contrato,CPVs,Entidade(s) Adjudicante(s),Entidade(s) Adjudicatária(s),Preço Contratual,Data de Publicação,Data de Celebração do Contrato,Prazo de Execução,Local de Execução,Fundamentação,Data de Fecho do Contrato,Preço Total Efetivo,Causas das Alterações ao Prazo,Causas das Alterações ao Preço,Estado,N.º registo do Acordo Quadro,Descrição do Acordo Quadro,Procedimento Centralizado
"Prestação de Serviços Médicos na Especialidade de Otorrinolaringologia, na ULSNA, EPE (Período máx jan a dez 2018)",Ajuste Direto Regime Geral,Aquisição de serviços,"85100000-0, Serviços de saúde","Unidade Local de Saúde do Norte Alentejano, E. P. E. (508094461)","Génese Dinâmica - Serviços Médicos, Lda. (510315186)","129.755,40 €",12-02-2018,26-01-2018,365 dias,"Portugal, Portalegre, Portalegre","Artigo 24.º, n.º 1, alínea c) do Código dos Contratos Públicos","","",,,,Não aplicável.,Não aplicável.,FALSE
Prestação de Serviços de Médicos na Especialidade de Otorrinolaringologia - Abr a Dez 17,Ajuste Direto Regime Geral,Aquisição de serviços,"85100000-0, Serviços de saúde","Unidade Local de Saúde do Norte Alentejano, E. P. E. (508094461)","Génese Dinâmica - Serviços Médicos, Lda. (510315186)","79.242,07 €",11-08-2017,18-07-2017,275 dias,"Portugal, Portalegre, Portalegre","Artigo 27.º, n.º 1, alínea a) do Código dos Contratos Públicos","","",,,,Não aplicável.,Não aplicável.,FALSE
"Prestação de Serviços Médicos na Especialidade de Otorrinolaringologia na ULSNA, EPE",Ajuste Direto Regime Geral,Aquisição de serviços,"85100000-0, Serviços de saúde","Unidade Local de Saúde do Norte Alentejano, E. P. E. (508094461)","Génese Dinâmica - Serviços Médicos, Lda. (510315186)","97.549,43 €",17-03-2016,25-02-2016,365 dias,"Portugal, Portalegre, Portalegre","Artigo 27.º, n.º 1, alínea a) do Código dos Contratos Públicos",17-03-2016,"97.549,43 €",,,,Não aplicável.,Não aplicável.,FALSE
5001/15/0000923 Serviço Médico Especializado CED JRP,Ajuste Direto Regime Geral,Aquisição de serviços,"85000000-9, Serviços de saúde e acção social","Casa Pia de Lisboa, I. P. (501390642)",Génese Dinamica - Serviços Médicos (510315186),"3.456,00 €",11-08-2015,27-04-2015,210 dias,"Portugal, Lisboa, Lisboa","Artigo 20.º, n.º 1, alínea a) do Código dos Contratos Públicos",30-12-2015,"3.456,00 €",,,,Não aplicável.,Não aplicável.,FALSE
"Prestação de Serviços Médicos na Especialidade de Otorrinolaringologia na ULSNA, EPE (Abril de 2015 a 31 de Março de 2016)",Concurso público,Aquisição de serviços,"85100000-0, Serviços de saúde","Unidade Local de Saúde do Norte Alentejano, E. P. E. (508094461)","Génese Dinâmica - Serviços Médicos, Lda. (510315186)","96.739,43 €",04-05-2015,09-03-2015,365 dias,"Portugal, Portalegre, Portalegre","Artigo 20.º, n.º 1, alínea b) do Código dos Contratos Públicos",04-05-2015,"96.739,43 €",,,,Não aplicável.,Não aplicável.,FALSE
"Prestação de Serviços Médicos na Especialidade de Otorrinolaringologia na ULSNA, EPE (Janeiro a Março de 2015)",Ajuste Direto Regime Geral,Aquisição de serviços,"85100000-0, Serviços de saúde","Unidade Local de Saúde do Norte Alentejano, E. P. E. (508094461)","Génese Dinâmica - Serviços Médicos, Lda (510315186)","26.603,36 €",19-02-2015,21-01-2015,90 dias,"Portugal, Portalegre, Portalegre","Artigo 24.º, n.º 1, alínea c) do Código dos Contratos Públicos",19-02-2015,"26.603,36 €",,,,Não aplicável.,Não aplicável.,FALSE
"PRESTAÇÃO DE SERVIÇOS DE CODIFICAÇÃO CLÍNICA PARA A ULSNA, EPE",Ajuste Direto Regime Geral,Aquisição de serviços,"85100000-0, Serviços de saúde","Unidade Local de Saúde do Norte Alentejano, E. P. E. (508094461)","Génese Dinâmica - Serviços Médicos, Lda. (510315186)","12.100,00 €",12-08-2014,02-04-2014,365 dias,"Portugal, Portalegre, Portalegre","Artigo 20.º, n.º 1, alínea a) do Código dos Contratos Públicos",02-04-2014,"12.100,00 €",,,,Não aplicável.,Não aplicável.,FALSE
SERVIÇO MÉDICO ESPECIALIZADO EM ORL,Ajuste Direto Regime Geral,Aquisição de serviços,"85000000-9, Serviços de saúde e acção social","Casa Pia de Lisboa, I. P. (501390642)",GÉNESE DINÂMICA (510315186),"3.456,00 €",22-05-2014,21-02-2014,365 dias,"Portugal, Lisboa, Lisboa","Artigo 20.º, n.º 1, alínea a) do Código dos Contratos Públicos",31-12-2014,"3.456,00 €",,,,Não aplicável.,Não aplicável.,FALSE
Serviços clinicos especializados,Ajuste Direto Regime Geral,Aquisição de serviços,"85000000-9, Serviços de saúde e acção social","Casa Pia de Lisboa, I. P. (501390642)",Génese Dinâmica (510315186),"3.456,00 €",26-03-2014,07-03-2013,365 dias,"Portugal, Lisboa, Lisboa","Artigo 34.º do Decreto-Lei n.º 36/2013, de 11.03",31-12-2013,"3.456,00 €",,,,Não aplicável.,Não aplicável.,FALSE
"Prestação de Serviços Médicos na Especialidade de Otorrinolaringologia na ULSNA, EPE",Ajuste Direto Regime Geral,Aquisição de serviços,"85100000-0, Serviços de saúde","Unidade Local de Saúde do Norte Alentejano, E. P. E. (508094461)","Génese Dinâmica, Lda. (510315186)","56.837,70 €",12-02-2014,04-02-2014,181 dias,"Portugal, Portalegre, Portalegre","Artigo 24.º, n.º 1, alínea c) do Código dos Contratos Públicos",30-06-2014,"56.837,70 €",,,,Não aplicável.,Não aplicável.,FALSE
"Prestação de Serviços Médicos na Especialidade de Otorrinolaringologia, na ULSNA, EPE (Ano 2013)",Ajuste Direto Regime Geral,Aquisição de serviços,"85100000-0, Serviços de saúde","Unidade Local de Saúde do Norte Alentejano, E.P.E. (508094461)","Génese Dinâmica - Serviços Médicos, Lda. (510315186)","75.000,00 €",30-01-2013,30-01-2013,365 dias,"Portugal, Portalegre, Portalegre","Artigo 20.º, n.º 1, alínea a) do Código dos Contratos Públicos",31-12-2013,"75.000,00 €",,,,Não aplicável.,Não aplicável.,
