freguesia,acronym,validVotesPercentage,votes,dicofre
Azinhoso,PPD/PSD,51.3,59,040801
Azinhoso,PS,28.7,33,040801
Azinhoso,B.E.,7.83,9,040801
Azinhoso,CDS-PP,6.09,7,040801
Azinhoso,NC,2.61,3,040801
Azinhoso,PAN,2.61,3,040801
Azinhoso,L,0.87,1,040801
Azinhoso,A,0,0,040801
Azinhoso,IL,0,0,040801
Azinhoso,MAS,0,0,040801
Azinhoso,PCP-PEV,0,0,040801
Azinhoso,PCTP/MRPP,0,0,040801
Azinhoso,PDR,0,0,040801
Azinhoso,PNR,0,0,040801
Azinhoso,PPM.PPV/CDC,0,0,040801
Azinhoso,PTP,0,0,040801
Azinhoso,PURP,0,0,040801
