freguesia,acronym,validVotesPercentage,votes,dicofre
Valongo,PS,39.18,4669,131505
Valongo,PPD/PSD,26.43,3150,131505
Valongo,B.E.,12.18,1452,131505
Valongo,PCP-PEV,6.33,755,131505
Valongo,PAN,4.72,563,131505
Valongo,R.I.R.,2.78,331,131505
Valongo,CDS-PP,2.37,282,131505
Valongo,IL,1.54,183,131505
Valongo,L,1.04,124,131505
Valongo,CH,0.85,101,131505
Valongo,PCTP/MRPP,0.6,71,131505
Valongo,A,0.47,56,131505
Valongo,PNR,0.3,36,131505
Valongo,MPT,0.28,33,131505
Valongo,PDR,0.26,31,131505
Valongo,JPP,0.13,16,131505
Valongo,MAS,0.13,16,131505
Valongo,NC,0.12,14,131505
Valongo,PURP,0.12,14,131505
Valongo,PPM,0.1,12,131505
Valongo,PTP,0.08,9,131505
