freguesia,acronym,validVotesPercentage,votes,dicofre
Cabração e Moreira do Lima,PPD/PSD,33.78,100,160757
Cabração e Moreira do Lima,PS,29.05,86,160757
Cabração e Moreira do Lima,CDS-PP,18.58,55,160757
Cabração e Moreira do Lima,B.E.,5.74,17,160757
Cabração e Moreira do Lima,PAN,2.7,8,160757
Cabração e Moreira do Lima,A,1.35,4,160757
Cabração e Moreira do Lima,PCP-PEV,1.35,4,160757
Cabração e Moreira do Lima,PPM.PPV/CDC,1.35,4,160757
Cabração e Moreira do Lima,L,1.01,3,160757
Cabração e Moreira do Lima,NC,1.01,3,160757
Cabração e Moreira do Lima,PCTP/MRPP,1.01,3,160757
Cabração e Moreira do Lima,PNR,1.01,3,160757
Cabração e Moreira do Lima,IL,0.68,2,160757
Cabração e Moreira do Lima,PURP,0.68,2,160757
Cabração e Moreira do Lima,MAS,0.34,1,160757
Cabração e Moreira do Lima,PDR,0.34,1,160757
Cabração e Moreira do Lima,PTP,0,0,160757
