freguesia,acronym,validVotesPercentage,votes,dicofre
União das freguesias de Vale de Frades e Avelanoso,PPD/PSD.CDS-PP,49.15,58,041117
União das freguesias de Vale de Frades e Avelanoso,PS,36.44,43,041117
União das freguesias de Vale de Frades e Avelanoso,MPT,4.24,5,041117
União das freguesias de Vale de Frades e Avelanoso,PCTP/MRPP,2.54,3,041117
União das freguesias de Vale de Frades e Avelanoso,B.E.,1.69,2,041117
União das freguesias de Vale de Frades e Avelanoso,L,1.69,2,041117
União das freguesias de Vale de Frades e Avelanoso,MAS,1.69,2,041117
União das freguesias de Vale de Frades e Avelanoso,PCP-PEV,1.69,2,041117
União das freguesias de Vale de Frades e Avelanoso,PAN,0.85,1,041117
União das freguesias de Vale de Frades e Avelanoso,PDA,0,0,041117
União das freguesias de Vale de Frades e Avelanoso,PND,0,0,041117
União das freguesias de Vale de Frades e Avelanoso,PNR,0,0,041117
União das freguesias de Vale de Frades e Avelanoso,POUS,0,0,041117
União das freguesias de Vale de Frades e Avelanoso,PPM,0,0,041117
União das freguesias de Vale de Frades e Avelanoso,PPV,0,0,041117
União das freguesias de Vale de Frades e Avelanoso,PTP,0,0,041117
