Objeto do Contrato,Tipo de Procedimento,Tipo(s) de Contrato,CPVs,Entidade(s) Adjudicante(s),Entidade(s) Adjudicatária(s),Preço Contratual,Data de Publicação,Data de Celebração do Contrato,Prazo de Execução,Local de Execução,Fundamentação,Data de Fecho do Contrato,Preço Total Efetivo,Causas das Alterações ao Prazo,Causas das Alterações ao Preço,Estado,N.º registo do Acordo Quadro,Descrição do Acordo Quadro,Procedimento Centralizado
"Aquisição de Medicamentos desencadeada pela SPMS, no âmbito de Despacho 1571/B de 2016, ao abrigo do Acordo Quadro 2016/40, Ref.ª P259-AC-2017-120 - BAYER",Ao abrigo de acordo-quadro (art.º 259.º),Aquisição de bens móveis,"33600000-6, Produtos farmacêuticos","Unidade Local de Saúde do Nordeste, E. P. E. (509932584)","BAYER PORTUGAL, LDA (500043256)","426,08 €",09-08-2017,14-07-2017,170 dias,"Portugal, Braganca, Bragança",Artigo 259.º do Código dos Contratos Públicos,31-12-2017,"426,08 €",,,,2489595,CP 2016/18 - Acordo quadro para fornecimento de Medicamentos do Grupo 4: Sangue às Instituições e Serviços do Serviço Nacional de Saúde,FALSE
"Aquisição de Medicamentos desencadeada pela SPMS, no âmbito de Despacho 1571/B de 2016, ao abrigo do Acordo Quadro 2016/40, Ref.ª P259-AC-2017-120 - JANSSEN",Ao abrigo de acordo-quadro (art.º 259.º),Aquisição de bens móveis,"33600000-6, Produtos farmacêuticos","Unidade Local de Saúde do Nordeste, E. P. E. (509932584)","JANSSEN CILAG FARMACÊUTICA, LDA. (500189412)","2.115,72 €",09-08-2017,14-07-2017,170 dias,"Portugal, Braganca, Bragança",Artigo 259.º do Código dos Contratos Públicos,31-12-2017,"2.115,72 €",,,,2183729,Medicamentos antirretrovíricos para o tratamento da infeção por VIH,FALSE
"Aquisição de Medicamentos desencadeada pela SPMS, no âmbito de Despacho 1571/B de 2016, ao abrigo do Acordo Quadro 2015/6, Ref.ª P259-AC-2017-117",Ao abrigo de acordo-quadro (art.º 259.º),Aquisição de bens móveis,"33600000-6, Produtos farmacêuticos","Unidade Local de Saúde do Nordeste, E. P. E. (509932584)","Teva Pharma - Produtos Farmacêuticos, Lda (507045491)","1.008,00 €",09-08-2017,27-07-2017,157 dias,"Portugal, Braganca, Bragança",Artigo 259.º do Código dos Contratos Públicos,31-12-2017,"1.008,00 €",,,,1771819,CP 2015/6 - Acordo quadro para o fornecimento de Medicamentos do Foro Oncológico,FALSE
"Aquisição de Material de Penso de Efeito Terapêutico  desencadeada pala SPMS, no âmbito do despacho 1571/B, ao Abrigo do Acordo Quadro 2014/10, Ref.ª P259/2017-02 ",Ao abrigo de acordo-quadro (art.º 259.º),Aquisição de bens móveis,"33600000-6, Produtos farmacêuticos","Unidade Local de Saúde do Nordeste, E. P. E. (509932584)","Clinifar, SA (503281115)","5.354,00 €",31-07-2017,12-07-2017,172 dias,"Portugal, Braganca, Bragança",Artigo 259.º do Código dos Contratos Públicos,31-12-2017,"5.354,00 €",,,,2371297,CP 2016/10 - Acordo Quadro para fornecimento de Material de Penso de Efeito Terapêutico às Instituições e Serviços do Serviço Nacional de Saúde,FALSE
