Objeto do Contrato,Tipo de Procedimento,Tipo(s) de Contrato,CPVs,Entidade(s) Adjudicante(s),Entidade(s) Adjudicatária(s),Preço Contratual,Data de Publicação,Data de Celebração do Contrato,Prazo de Execução,Local de Execução,Fundamentação,Data de Fecho do Contrato,Preço Total Efetivo,Causas das Alterações ao Prazo,Causas das Alterações ao Preço,Estado,N.º registo do Acordo Quadro,Descrição do Acordo Quadro,Procedimento Centralizado
"Transfer fixo para o Bloco Operatório do HSB, CHS, E.P.E.",Ajuste Direto Regime Geral,Aquisição de bens móveis,"33000000-0, Equipamento médico, medicamentos e produtos para cuidados pessoais","Centro Hospitalar de Setúbal, E. P. E. (507606787)","Getinge Group Portugal, Unipessoal, Lda (506819698)","42.000,00 €",11-10-2017,21-09-2017,45 dias,"Portugal, Setúbal, Setúbal","Artigo 24.º, n.º 1, alínea e) do Código dos Contratos Públicos",,,,,,Não aplicável.,Não aplicável.,FALSE
Ecógrafo para o Serviço de Nefrologia,Concurso público,Aquisição de bens móveis,"33100000-1, Equipamento médico","Centro Hospitalar de Setúbal, E. P. E. (507606787)","Speculum - Artigos Médicos, S.A. (502996323)","19.458,85 €",11-10-2017,29-09-2017,15 dias,"Portugal, Setúbal, Setúbal","Artigo 20.º, n.º 1, alínea b) do Código dos Contratos Públicos",,,,,,Não aplicável.,Não aplicável.,FALSE
Serviços Médicos Ginecologia/Obstetricia,Ajuste Direto Regime Geral,Aquisição de serviços,"85000000-9, Serviços de saúde e acção social","Centro Hospitalar de Setúbal, E. P. E. (507606787)","Margarida Enes-Serviços Médicos Unipessoal, Lda (514071117)","3.840,00 €",10-10-2017,19-09-2017,122 dias,"Portugal, Setúbal, Setúbal","Artigo 20.º, n.º 1, alínea a) do Código dos Contratos Públicos",,,,,,Não aplicável.,Não aplicável.,FALSE
Microtomos de minot,Ajuste Direto Regime Geral,Aquisição de bens móveis,"33000000-0, Equipamento médico, medicamentos e produtos para cuidados pessoais","Centro Hospitalar de Setúbal, E. P. E. (507606787)","Grupo Taper - Equipamentos de Precisão Cientifica, Lda (506886336)","25.500,00 €",09-10-2017,13-09-2017,30 dias,"Portugal, Setúbal, Setúbal","Artigo 20.º, n.º 1, alínea a) do Código dos Contratos Públicos",,,,,,Não aplicável.,Não aplicável.,FALSE
Serviços Médicos Pediatria - Setembro a dezembro 2017,Ajuste Direto Regime Geral,Aquisição de serviços,"85000000-9, Serviços de saúde e acção social","Centro Hospitalar de Setúbal, E. P. E. (507606787)",Planeta das Meninices Lda (513715754),"3.840,00 €",09-10-2017,14-09-2017,365 dias,"Portugal, Setúbal, Setúbal","Artigo 20.º, n.º 1, alínea a) do Código dos Contratos Públicos",,,,,,Não aplicável.,Não aplicável.,FALSE
Lâmpadas de fenda com tonómetro e mesa elevatória,Ajuste Direto Regime Geral,Aquisição de bens móveis,"38000000-5, Equipamento laboratorial, óptico e de precisão (exc. óculos)","Centro Hospitalar de Setúbal, E. P. E. (507606787)","Jose Cotta - Equip. Med. e Serviços, Lda (500155739)","18.960,00 €",04-10-2017,19-09-2017,30 dias,"Portugal, Setúbal, Setúbal","Artigo 20.º, n.º 1, alínea a) do Código dos Contratos Públicos",,,,,,Não aplicável.,Não aplicável.,FALSE
novo espaço para exames especiais do Serviço de Ginecologia/Obstetricia,Ajuste Direto Regime Geral,Concessão de obras públicas,"45000000-7, Construção","Centro Hospitalar de Setúbal, E. P. E. (507606787)",Const. V. Repolho Cruz (506286380),"18.498,92 €",02-10-2017,19-09-2017,30 dias,"Portugal, Setúbal, Setúbal","Artigo 19.º, alínea a) do Código dos Contratos Públicos",,,,,,Não aplicável.,Não aplicável.,FALSE
BENEFICIAÇÃO DAS INSTALAÇÕES SANITÁRIAS DO SERVIÇO DE CARDIOLOGIA,Ajuste Direto Regime Geral,Concessão de obras públicas,"45000000-7, Construção","Centro Hospitalar de Setúbal, E. P. E. (507606787)","Construções V. repolho Cruz, Lda (506286380)","13.489,43 €",02-10-2017,19-09-2017,30 dias,"Portugal, Setúbal, Setúbal","Artigo 19.º, alínea a) do Código dos Contratos Públicos",,,,,,Não aplicável.,Não aplicável.,FALSE
Serviços Médicos Pediatria - Setembro a Dezembro 2017,Ajuste Direto Regime Geral,Aquisição de serviços,"85000000-9, Serviços de saúde e acção social","Centro Hospitalar de Setúbal, E. P. E. (507606787)",Claudio D`Elia - Pediatria Lda (508617499),"8.160,00 €",02-10-2017,30-08-2017,122 dias,"Portugal, Setúbal, Setúbal","Artigo 20.º, n.º 1, alínea a) do Código dos Contratos Públicos",,,,,,Não aplicável.,Não aplicável.,FALSE
IBRUTINIB 140 MG,Ajuste Direto Regime Geral,Aquisição de bens móveis,"33600000-6, Produtos farmacêuticos","Centro Hospitalar de Setúbal, E. P. E. (507606787)","JANSSEN-CILAG Farmacêutica, Lda. (500189412)","32.979,42 €",02-10-2017,08-08-2017,365 dias,"Portugal, Setúbal, Setúbal","Artigo 24.º, n.º 1, alínea e) do Código dos Contratos Públicos",,,,,,Não aplicável.,Não aplicável.,FALSE
DARUNAVIR [600MG; CAP/COMP],Ao abrigo de acordo-quadro (art.º 259.º),Aquisição de bens móveis,"33600000-6, Produtos farmacêuticos","Centro Hospitalar de Setúbal, E. P. E. (507606787)","JANSSEN-CILAG Farmacêutica, Lda. (500189412)","55.537,65 €",02-10-2017,17-08-2017,365 dias,"Portugal, Setúbal, Setúbal",Artigo 259.º do Código dos Contratos Públicos,,,,,,2183729,Medicamentos antirretrovíricos para o tratamento da infeção por VIH,FALSE
Serviços Médicos Dermatologia,Ajuste Direto Regime Geral,Aquisição de serviços,"85000000-9, Serviços de saúde e acção social","Centro Hospitalar de Setúbal, E. P. E. (507606787)",Allderma - Centro Médico Lda (514161639),"2.400,00 €",02-10-2017,27-09-2017,122 dias,"Portugal, Setúbal, Setúbal","Artigo 20.º, n.º 1, alínea a) do Código dos Contratos Públicos",,,,,,Não aplicável.,Não aplicável.,FALSE
