Objeto do Contrato,Tipo de Procedimento,Tipo(s) de Contrato,CPVs,Entidade(s) Adjudicante(s),Entidade(s) Adjudicatária(s),Preço Contratual,Data de Publicação,Data de Celebração do Contrato,Prazo de Execução,Local de Execução,Fundamentação,Data de Fecho do Contrato,Preço Total Efetivo,Causas das Alterações ao Prazo,Causas das Alterações ao Preço,Estado,N.º registo do Acordo Quadro,Descrição do Acordo Quadro,Procedimento Centralizado
Aquisição de Serviços de Assessoria Jurídica,Ajuste Direto Regime Geral,Aquisição de serviços,"79111000-5, Serviços de assessoria jurídica","Hospital Professor Doutor Fernando Fonseca, E. P. E. (503035416)",Saragoça da Matta & Silveiro de Barros Sociedade de Advogados (505324539),"67.584,00 €",11-10-2016,07-03-2016,731 dias,"Portugal, Lisboa, Amadora","Artigo 20.º, n.º 1, alínea a) do Código dos Contratos Públicos",,,,,,Não aplicável.,Não aplicável.,FALSE
Aquisição de Sacos de Sangue,Concurso público,Aquisição de bens móveis,"33141613-0, Sacos para sangue",Hospital Prof. Doutor Fernando Fonseca E.P.E. (503035416),"Hemovision, Lda (509717853)","18.128,10 €",11-10-2016,29-09-2016,93 dias,"Portugal, Lisboa, Amadora","Artigo 20.º, n.º 1, alínea b) do Código dos Contratos Públicos",,,,,,Não aplicável.,Não aplicável.,FALSE
"Medicamentos do Sistema Nervoso Cerebrospinal, exceto anestésicos, relaxantes musculares, antidepressores e antipsicóticos ",Ao abrigo de acordo-quadro (art.º 259.º),Aquisição de bens móveis,"33600000-6, Produtos farmacêuticos","HOSPITAL PROFESSOR DOUTOR FERNANDO FONSECA, EPE (503035416)",GENERIS FARMACÊUTICA S.A. (508107997),"215,10 €",07-10-2016,15-09-2016,107 dias,"Portugal, Lisboa, Amadora",Artigo 259.º do Código dos Contratos Públicos,,,,,,1179911,"CONCURSO PÚBLICO PARA A CELEBRAÇÃO DE CONTRATOS PÚBLICOS DE APROVISIONAMENTO PARA A ÁREA DA SAÚDE, MEDICAMENTOS DO SISTEMA NERVOSO CEREBROSPINAL, EXCETO: ANESTÉSICOS, RELAXANTES MUSCULARES, ANALGÉSICOS, ANTIPIRÉTICOS, ANTIDEPRESSORES E ANTIPSICÓTICOS, ÀS INSTITUIÇÕES E SERVIÇOS DO SERVIÇO NACIONAL DE SAÚDE",FALSE
"Medicamentos do Sistema Nervoso Cerebrospinal, exceto anestésicos, relaxantes musculares, antidepressores e antipsicóticos",Ao abrigo de acordo-quadro (art.º 259.º),Aquisição de bens móveis,"33600000-6, Produtos farmacêuticos","HOSPITAL PROFESSOR DOUTOR FERNANDO FONSECA, EPE (503035416)","UCB Pharma (produtos Farmacêuticos), Lda (500291322)","2.148,48 €",07-10-2016,15-09-2016,107 dias,"Portugal, Lisboa, Amadora",Artigo 259.º do Código dos Contratos Públicos,,,,,,1179911,"CONCURSO PÚBLICO PARA A CELEBRAÇÃO DE CONTRATOS PÚBLICOS DE APROVISIONAMENTO PARA A ÁREA DA SAÚDE, MEDICAMENTOS DO SISTEMA NERVOSO CEREBROSPINAL, EXCETO: ANESTÉSICOS, RELAXANTES MUSCULARES, ANALGÉSICOS, ANTIPIRÉTICOS, ANTIDEPRESSORES E ANTIPSICÓTICOS, ÀS INSTITUIÇÕES E SERVIÇOS DO SERVIÇO NACIONAL DE SAÚDE",FALSE
"Medicamentos do Sistema Nervoso Cerebrospinal, exceto anestésicos, relaxantes musculares, antidepressores e antipsicóticos ",Ao abrigo de acordo-quadro (art.º 259.º),Aquisição de bens móveis,"33600000-6, Produtos farmacêuticos","HOSPITAL PROFESSOR DOUTOR FERNANDO FONSECA, EPE (503035416)",Bluefish Pharmaceuticals AB (509426590),"142,12 €",07-10-2016,15-09-2016,107 dias,"Portugal, Lisboa, Amadora",Artigo 259.º do Código dos Contratos Públicos,,,,,,1179911,"CONCURSO PÚBLICO PARA A CELEBRAÇÃO DE CONTRATOS PÚBLICOS DE APROVISIONAMENTO PARA A ÁREA DA SAÚDE, MEDICAMENTOS DO SISTEMA NERVOSO CEREBROSPINAL, EXCETO: ANESTÉSICOS, RELAXANTES MUSCULARES, ANALGÉSICOS, ANTIPIRÉTICOS, ANTIDEPRESSORES E ANTIPSICÓTICOS, ÀS INSTITUIÇÕES E SERVIÇOS DO SERVIÇO NACIONAL DE SAÚDE",FALSE
"Medicamentos do Sistema Nervoso Cerebrospinal, exceto anestésicos, relaxantes musculares, antidepressores e antipsicóticos",Ao abrigo de acordo-quadro (art.º 259.º),Aquisição de bens móveis,"33600000-6, Produtos farmacêuticos","HOSPITAL PROFESSOR DOUTOR FERNANDO FONSECA, EPE (503035416)","Teva Pharma - Produtos Farmacêuticos, Lda (507045491)","15,68 €",07-10-2016,15-09-2016,107 dias,"Portugal, Lisboa, Amadora",Artigo 259.º do Código dos Contratos Públicos,,,,,,1179911,"CONCURSO PÚBLICO PARA A CELEBRAÇÃO DE CONTRATOS PÚBLICOS DE APROVISIONAMENTO PARA A ÁREA DA SAÚDE, MEDICAMENTOS DO SISTEMA NERVOSO CEREBROSPINAL, EXCETO: ANESTÉSICOS, RELAXANTES MUSCULARES, ANALGÉSICOS, ANTIPIRÉTICOS, ANTIDEPRESSORES E ANTIPSICÓTICOS, ÀS INSTITUIÇÕES E SERVIÇOS DO SERVIÇO NACIONAL DE SAÚDE",FALSE
"Medicamentos do Sistema Nervoso Cerebrospinal, exceto anestésicos, relaxantes musculares, antidepressores e antipsicóticos",Ao abrigo de acordo-quadro (art.º 259.º),Aquisição de bens móveis,"33600000-6, Produtos farmacêuticos","HOSPITAL PROFESSOR DOUTOR FERNANDO FONSECA, EPE (503035416)","Laboratórios PFizer, Lda. (500162166)","1.009,27 €",07-10-2016,15-09-2016,107 dias,"Portugal, Lisboa, Amadora",Artigo 259.º do Código dos Contratos Públicos,,,,,,1179911,"CONCURSO PÚBLICO PARA A CELEBRAÇÃO DE CONTRATOS PÚBLICOS DE APROVISIONAMENTO PARA A ÁREA DA SAÚDE, MEDICAMENTOS DO SISTEMA NERVOSO CEREBROSPINAL, EXCETO: ANESTÉSICOS, RELAXANTES MUSCULARES, ANALGÉSICOS, ANTIPIRÉTICOS, ANTIDEPRESSORES E ANTIPSICÓTICOS, ÀS INSTITUIÇÕES E SERVIÇOS DO SERVIÇO NACIONAL DE SAÚDE",FALSE
"Medicamentos do Sistema Nervoso Cerebrospinal, exceto anestésicos, relaxantes musculares, antidepressores e antipsicóticos ",Ao abrigo de acordo-quadro (art.º 259.º),Aquisição de bens móveis,"33600000-6, Produtos farmacêuticos","HOSPITAL PROFESSOR DOUTOR FERNANDO FONSECA, EPE (503035416)",MEDA PHARMA PRODUTOS FARMACÊUTICOS S.A. (500082090),"380,99 €",07-10-2016,15-09-2016,107 dias,"Portugal, Lisboa, Amadora",Artigo 259.º do Código dos Contratos Públicos,,,,,,1179911,"CONCURSO PÚBLICO PARA A CELEBRAÇÃO DE CONTRATOS PÚBLICOS DE APROVISIONAMENTO PARA A ÁREA DA SAÚDE, MEDICAMENTOS DO SISTEMA NERVOSO CEREBROSPINAL, EXCETO: ANESTÉSICOS, RELAXANTES MUSCULARES, ANALGÉSICOS, ANTIPIRÉTICOS, ANTIDEPRESSORES E ANTIPSICÓTICOS, ÀS INSTITUIÇÕES E SERVIÇOS DO SERVIÇO NACIONAL DE SAÚDE",FALSE
"Medicamentos do Sistema Nervoso Cerebrospinal, exceto anestésicos, relaxantes musculares, antidepressores e antipsicóticos",Ao abrigo de acordo-quadro (art.º 259.º),Aquisição de bens móveis,"33600000-6, Produtos farmacêuticos","HOSPITAL PROFESSOR DOUTOR FERNANDO FONSECA, EPE (503035416)","Farmoz - Sociedade Técnico Medicinal, S.A. (501505334)","535,00 €",07-10-2016,15-09-2016,107 dias,"Portugal, Lisboa, Amadora",Artigo 259.º do Código dos Contratos Públicos,,,,,,1179911,"CONCURSO PÚBLICO PARA A CELEBRAÇÃO DE CONTRATOS PÚBLICOS DE APROVISIONAMENTO PARA A ÁREA DA SAÚDE, MEDICAMENTOS DO SISTEMA NERVOSO CEREBROSPINAL, EXCETO: ANESTÉSICOS, RELAXANTES MUSCULARES, ANALGÉSICOS, ANTIPIRÉTICOS, ANTIDEPRESSORES E ANTIPSICÓTICOS, ÀS INSTITUIÇÕES E SERVIÇOS DO SERVIÇO NACIONAL DE SAÚDE",FALSE
"Medicamentos do Sistema Nervoso Cerebrospinal, exceto anestésicos, relaxantes musculares, antidepressores e antipsicóticos",Ao abrigo de acordo-quadro (art.º 259.º),Aquisição de bens móveis,"33600000-6, Produtos farmacêuticos","HOSPITAL PROFESSOR DOUTOR FERNANDO FONSECA, EPE (503035416)","HIKMA FARMACÊUTICA (PORTUGAL), S.A. (502266791)","6.848,50 €",07-10-2016,15-09-2016,107 dias,"Portugal, Lisboa, Amadora",Artigo 259.º do Código dos Contratos Públicos,,,,,,1179911,"CONCURSO PÚBLICO PARA A CELEBRAÇÃO DE CONTRATOS PÚBLICOS DE APROVISIONAMENTO PARA A ÁREA DA SAÚDE, MEDICAMENTOS DO SISTEMA NERVOSO CEREBROSPINAL, EXCETO: ANESTÉSICOS, RELAXANTES MUSCULARES, ANALGÉSICOS, ANTIPIRÉTICOS, ANTIDEPRESSORES E ANTIPSICÓTICOS, ÀS INSTITUIÇÕES E SERVIÇOS DO SERVIÇO NACIONAL DE SAÚDE",FALSE
"Medicamentos do Sistema Nervoso Cerebrospinal, exceto anestésicos, relaxantes musculares, antidepressores e antipsicóticos",Ao abrigo de acordo-quadro (art.º 259.º),Aquisição de bens móveis,"33600000-6, Produtos farmacêuticos","HOSPITAL PROFESSOR DOUTOR FERNANDO FONSECA, EPE (503035416)","Laboratórios Normon, S.A. (505654156)","5.550,00 €",07-10-2016,15-09-2016,107 dias,"Portugal, Lisboa, Amadora",Artigo 259.º do Código dos Contratos Públicos,,,,,,1179911,"CONCURSO PÚBLICO PARA A CELEBRAÇÃO DE CONTRATOS PÚBLICOS DE APROVISIONAMENTO PARA A ÁREA DA SAÚDE, MEDICAMENTOS DO SISTEMA NERVOSO CEREBROSPINAL, EXCETO: ANESTÉSICOS, RELAXANTES MUSCULARES, ANALGÉSICOS, ANTIPIRÉTICOS, ANTIDEPRESSORES E ANTIPSICÓTICOS, ÀS INSTITUIÇÕES E SERVIÇOS DO SERVIÇO NACIONAL DE SAÚDE",FALSE
"Sistema Nervoso Cerebrospinal, exceto anestésicos, relaxantes musculares, antidepressores e antipsicóticos",Ao abrigo de acordo-quadro (art.º 259.º),Aquisição de bens móveis,"33600000-6, Produtos farmacêuticos","HOSPITAL PROFESSOR DOUTOR FERNANDO FONSECA, EPE (503035416)","PROSPA - LABORATÓRIOS FARMACÊUTICOS, S.A. (500130248)","648,00 €",07-10-2016,15-09-2016,107 dias,"Portugal, Lisboa, Amadora",Artigo 259.º do Código dos Contratos Públicos,,,,,,1179911,"CONCURSO PÚBLICO PARA A CELEBRAÇÃO DE CONTRATOS PÚBLICOS DE APROVISIONAMENTO PARA A ÁREA DA SAÚDE, MEDICAMENTOS DO SISTEMA NERVOSO CEREBROSPINAL, EXCETO: ANESTÉSICOS, RELAXANTES MUSCULARES, ANALGÉSICOS, ANTIPIRÉTICOS, ANTIDEPRESSORES E ANTIPSICÓTICOS, ÀS INSTITUIÇÕES E SERVIÇOS DO SERVIÇO NACIONAL DE SAÚDE",FALSE
"Daclastavir, Oral, 60 MG, Comprimido",Ajuste Direto Regime Geral,Aquisição de bens móveis,"33600000-6, Produtos farmacêuticos","Hospital Professor Doutor Fernando Fonseca, E. P. E. (503035416)",Bristol-Myers Squibb Farmacêutica Portuguesa. S.A. (500048193),"221.883,77 €",07-10-2016,28-09-2016,94 dias,"Portugal, Lisboa, Amadora","Artigo 20.º, n.º 1, alínea a) do Código dos Contratos Públicos",,,,,,Não aplicável.,Não aplicável.,FALSE
"Medicamentos do Sistema Nervoso Cerebrospinal, exceto anestésicos, relaxantes musculares, antidepressores e antipsicóticos",Ao abrigo de acordo-quadro (art.º 259.º),Aquisição de bens móveis,"33600000-6, Produtos farmacêuticos","HOSPITAL PROFESSOR DOUTOR FERNANDO FONSECA, EPE (503035416)","Biogen Portugal, Lda. (506415740)","18.172,70 €",04-10-2016,15-09-2016,107 dias,"Portugal, Lisboa, Amadora",Artigo 259.º do Código dos Contratos Públicos,,,,,,1179911,"CONCURSO PÚBLICO PARA A CELEBRAÇÃO DE CONTRATOS PÚBLICOS DE APROVISIONAMENTO PARA A ÁREA DA SAÚDE, MEDICAMENTOS DO SISTEMA NERVOSO CEREBROSPINAL, EXCETO: ANESTÉSICOS, RELAXANTES MUSCULARES, ANALGÉSICOS, ANTIPIRÉTICOS, ANTIDEPRESSORES E ANTIPSICÓTICOS, ÀS INSTITUIÇÕES E SERVIÇOS DO SERVIÇO NACIONAL DE SAÚDE",FALSE
"Medicamentos do Sistema Nervoso Cerebrospinal, exceto anestésicos, relaxantes musculares, antidepressores e antipsicóticos",Ao abrigo de acordo-quadro (art.º 259.º),Aquisição de bens móveis,"33600000-6, Produtos farmacêuticos","HOSPITAL PROFESSOR DOUTOR FERNANDO FONSECA, EPE (503035416)","ACCORD HEALTHCARE, Unipessoal Lda (508622263)","207,60 €",04-10-2016,15-09-2016,107 dias,"Portugal, Lisboa, Amadora",Artigo 259.º do Código dos Contratos Públicos,,,,,,1179911,"CONCURSO PÚBLICO PARA A CELEBRAÇÃO DE CONTRATOS PÚBLICOS DE APROVISIONAMENTO PARA A ÁREA DA SAÚDE, MEDICAMENTOS DO SISTEMA NERVOSO CEREBROSPINAL, EXCETO: ANESTÉSICOS, RELAXANTES MUSCULARES, ANALGÉSICOS, ANTIPIRÉTICOS, ANTIDEPRESSORES E ANTIPSICÓTICOS, ÀS INSTITUIÇÕES E SERVIÇOS DO SERVIÇO NACIONAL DE SAÚDE",FALSE
"Medicamentos do Sistema Nervoso Cerebrospinal, exceto anestésicos, relaxantes musculares, antidepressores e antipsicóticos",Ao abrigo de acordo-quadro (art.º 259.º),Aquisição de bens móveis,"33600000-6, Produtos farmacêuticos","HOSPITAL PROFESSOR DOUTOR FERNANDO FONSECA, EPE (503035416)","Lusomedicamenta Sociedade Técnica Farmacêutica, S. (507150473)","123,50 €",04-10-2016,28-09-2016,107 dias,"Portugal, Lisboa, Amadora",Artigo 259.º do Código dos Contratos Públicos,,,,,,1179911,"CONCURSO PÚBLICO PARA A CELEBRAÇÃO DE CONTRATOS PÚBLICOS DE APROVISIONAMENTO PARA A ÁREA DA SAÚDE, MEDICAMENTOS DO SISTEMA NERVOSO CEREBROSPINAL, EXCETO: ANESTÉSICOS, RELAXANTES MUSCULARES, ANALGÉSICOS, ANTIPIRÉTICOS, ANTIDEPRESSORES E ANTIPSICÓTICOS, ÀS INSTITUIÇÕES E SERVIÇOS DO SERVIÇO NACIONAL DE SAÚDE",FALSE
"Medicamentos do Sistema Nervoso Cerebrospinal, exceto anestésicos, relaxantes musculares, antidepressores e antipsicóticos",Ao abrigo de acordo-quadro (art.º 259.º),Aquisição de bens móveis,"33600000-6, Produtos farmacêuticos","HOSPITAL PROFESSOR DOUTOR FERNANDO FONSECA, EPE (503035416)","Aurovitas, Unipessoal Lda (513053239)","1.899,40 €",04-10-2016,15-09-2016,107 dias,"Portugal, Lisboa, Amadora",Artigo 259.º do Código dos Contratos Públicos,,,,,,1179911,"CONCURSO PÚBLICO PARA A CELEBRAÇÃO DE CONTRATOS PÚBLICOS DE APROVISIONAMENTO PARA A ÁREA DA SAÚDE, MEDICAMENTOS DO SISTEMA NERVOSO CEREBROSPINAL, EXCETO: ANESTÉSICOS, RELAXANTES MUSCULARES, ANALGÉSICOS, ANTIPIRÉTICOS, ANTIDEPRESSORES E ANTIPSICÓTICOS, ÀS INSTITUIÇÕES E SERVIÇOS DO SERVIÇO NACIONAL DE SAÚDE",FALSE
"Medicamentos do Sistema Nervoso Cerebrospinal, exceto anestésicos, relaxantes musculares, antidepressores e antipsicóticos ",Ao abrigo de acordo-quadro (art.º 259.º),Aquisição de bens móveis,"33600000-6, Produtos farmacêuticos","HOSPITAL PROFESSOR DOUTOR FERNANDO FONSECA, EPE (503035416)","LABESFAL - LABORATÓRIOS ALMIRO, S.A. (501169580)","10.494,85 €",04-10-2016,15-09-2016,107 dias,"Portugal, Lisboa, Amadora",Artigo 259.º do Código dos Contratos Públicos,,,,,,1179911,"CONCURSO PÚBLICO PARA A CELEBRAÇÃO DE CONTRATOS PÚBLICOS DE APROVISIONAMENTO PARA A ÁREA DA SAÚDE, MEDICAMENTOS DO SISTEMA NERVOSO CEREBROSPINAL, EXCETO: ANESTÉSICOS, RELAXANTES MUSCULARES, ANALGÉSICOS, ANTIPIRÉTICOS, ANTIDEPRESSORES E ANTIPSICÓTICOS, ÀS INSTITUIÇÕES E SERVIÇOS DO SERVIÇO NACIONAL DE SAÚDE",FALSE
"Medicamentos do Sistema Nervoso Cerebrospinal, exceto anestésicos, relaxantes musculares, antidepressores e antipsicóticos",Ao abrigo de acordo-quadro (art.º 259.º),Aquisição de bens móveis,"33600000-6, Produtos farmacêuticos","HOSPITAL PROFESSOR DOUTOR FERNANDO FONSECA, EPE (503035416)","PHARMAKERN PORTUGAL - PRODUTOS FARMACÊUTICOS, LDA (507002571)","140,96 €",04-10-2016,15-09-2016,107 dias,"Portugal, Lisboa, Amadora",Artigo 259.º do Código dos Contratos Públicos,,,,,,1179911,"CONCURSO PÚBLICO PARA A CELEBRAÇÃO DE CONTRATOS PÚBLICOS DE APROVISIONAMENTO PARA A ÁREA DA SAÚDE, MEDICAMENTOS DO SISTEMA NERVOSO CEREBROSPINAL, EXCETO: ANESTÉSICOS, RELAXANTES MUSCULARES, ANALGÉSICOS, ANTIPIRÉTICOS, ANTIDEPRESSORES E ANTIPSICÓTICOS, ÀS INSTITUIÇÕES E SERVIÇOS DO SERVIÇO NACIONAL DE SAÚDE",FALSE
"Medicamentos do Sistema Nervoso Cerebrospinal, exceto anestésicos, relaxantes musculares, antidepressores e antipsicóticos",Ao abrigo de acordo-quadro (art.º 259.º),Aquisição de bens móveis,"33600000-6, Produtos farmacêuticos","HOSPITAL PROFESSOR DOUTOR FERNANDO FONSECA, EPE (503035416)","Novartis Farma, S.A. (500063524)","202,40 €",04-10-2016,15-09-2016,107 dias,"Portugal, Lisboa, Amadora",Artigo 259.º do Código dos Contratos Públicos,,,,,,1179911,"CONCURSO PÚBLICO PARA A CELEBRAÇÃO DE CONTRATOS PÚBLICOS DE APROVISIONAMENTO PARA A ÁREA DA SAÚDE, MEDICAMENTOS DO SISTEMA NERVOSO CEREBROSPINAL, EXCETO: ANESTÉSICOS, RELAXANTES MUSCULARES, ANALGÉSICOS, ANTIPIRÉTICOS, ANTIDEPRESSORES E ANTIPSICÓTICOS, ÀS INSTITUIÇÕES E SERVIÇOS DO SERVIÇO NACIONAL DE SAÚDE",FALSE
"Medicamentos do Sistema Nervoso Cerebrospinal, exceto anestésicos, relaxantes musculares, antidepressores e antipsicóticos",Ao abrigo de acordo-quadro (art.º 259.º),Aquisição de bens móveis,"33600000-6, Produtos farmacêuticos","HOSPITAL PROFESSOR DOUTOR FERNANDO FONSECA, EPE (503035416)","JANSSEN-CILAG FARMACEUTICA, LDA. (500189412)","1,08 €",04-10-2016,15-09-2016,107 dias,"Portugal, Lisboa, Amadora",Artigo 259.º do Código dos Contratos Públicos,,,,,,1179911,"CONCURSO PÚBLICO PARA A CELEBRAÇÃO DE CONTRATOS PÚBLICOS DE APROVISIONAMENTO PARA A ÁREA DA SAÚDE, MEDICAMENTOS DO SISTEMA NERVOSO CEREBROSPINAL, EXCETO: ANESTÉSICOS, RELAXANTES MUSCULARES, ANALGÉSICOS, ANTIPIRÉTICOS, ANTIDEPRESSORES E ANTIPSICÓTICOS, ÀS INSTITUIÇÕES E SERVIÇOS DO SERVIÇO NACIONAL DE SAÚDE",FALSE
"Medicamentos do Sistema Nervoso Cerebrospinal, exceto anestésicos, relaxantes musculares, antidepressores e antipsicóticos",Ao abrigo de acordo-quadro (art.º 259.º),Aquisição de bens móveis,"33600000-6, Produtos farmacêuticos","HOSPITAL PROFESSOR DOUTOR FERNANDO FONSECA, EPE (503035416)","DLA FARMACEUTICA, S.A. (503894427)","46,87 €",04-10-2016,15-09-2016,107 dias,"Portugal, Lisboa, Amadora",Artigo 259.º do Código dos Contratos Públicos,,,,,,1179911,"CONCURSO PÚBLICO PARA A CELEBRAÇÃO DE CONTRATOS PÚBLICOS DE APROVISIONAMENTO PARA A ÁREA DA SAÚDE, MEDICAMENTOS DO SISTEMA NERVOSO CEREBROSPINAL, EXCETO: ANESTÉSICOS, RELAXANTES MUSCULARES, ANALGÉSICOS, ANTIPIRÉTICOS, ANTIDEPRESSORES E ANTIPSICÓTICOS, ÀS INSTITUIÇÕES E SERVIÇOS DO SERVIÇO NACIONAL DE SAÚDE",FALSE
"Medicamentos do Sistema Nervoso Cerebrospinal, exceto anestésicos, relaxantes musculares, antidepressores e antipsicóticos",Ao abrigo de acordo-quadro (art.º 259.º),Aquisição de bens móveis,"33600000-6, Produtos farmacêuticos","HOSPITAL PROFESSOR DOUTOR FERNANDO FONSECA, EPE (503035416)",Merck Sharp and Dhome (500191360),"7.463,95 €",04-10-2016,15-09-2016,107 dias,"Portugal, Lisboa, Amadora",Artigo 259.º do Código dos Contratos Públicos,,,,,,1179911,"CONCURSO PÚBLICO PARA A CELEBRAÇÃO DE CONTRATOS PÚBLICOS DE APROVISIONAMENTO PARA A ÁREA DA SAÚDE, MEDICAMENTOS DO SISTEMA NERVOSO CEREBROSPINAL, EXCETO: ANESTÉSICOS, RELAXANTES MUSCULARES, ANALGÉSICOS, ANTIPIRÉTICOS, ANTIDEPRESSORES E ANTIPSICÓTICOS, ÀS INSTITUIÇÕES E SERVIÇOS DO SERVIÇO NACIONAL DE SAÚDE",FALSE
"Medicamentos do Sistema Nervoso Cerebrospinal, exceto anestésicos, relaxantes musculares, antidepressores e antipsicóticos",Ao abrigo de acordo-quadro (art.º 259.º),Aquisição de bens móveis,"33600000-6, Produtos farmacêuticos","HOSPITAL PROFESSOR DOUTOR FERNANDO FONSECA, EPE (503035416)","Sanofi - Produtos Farmacêuticos, Lda (500134960)","676,18 €",04-10-2016,15-09-2016,107 dias,"Portugal, Lisboa, Amadora",Artigo 259.º do Código dos Contratos Públicos,,,,,,1179911,"CONCURSO PÚBLICO PARA A CELEBRAÇÃO DE CONTRATOS PÚBLICOS DE APROVISIONAMENTO PARA A ÁREA DA SAÚDE, MEDICAMENTOS DO SISTEMA NERVOSO CEREBROSPINAL, EXCETO: ANESTÉSICOS, RELAXANTES MUSCULARES, ANALGÉSICOS, ANTIPIRÉTICOS, ANTIDEPRESSORES E ANTIPSICÓTICOS, ÀS INSTITUIÇÕES E SERVIÇOS DO SERVIÇO NACIONAL DE SAÚDE",FALSE
"Sistema Nervoso Cerebrospinal, exceto anestésicos, relaxantes musculares, antidepressores e antipsicóticos ",Ao abrigo de acordo-quadro (art.º 259.º),Aquisição de bens móveis,"33600000-6, Produtos farmacêuticos","HOSPITAL PROFESSOR DOUTOR FERNANDO FONSECA, EPE (503035416)",TECNIFAR-INDUSTRIA TÉCNICA FARMACÊUTICA S.A. (500280436),"1.794,45 €",04-10-2016,15-09-2016,107 dias,"Portugal, Lisboa, Amadora",Artigo 259.º do Código dos Contratos Públicos,,,,,,1179911,"CONCURSO PÚBLICO PARA A CELEBRAÇÃO DE CONTRATOS PÚBLICOS DE APROVISIONAMENTO PARA A ÁREA DA SAÚDE, MEDICAMENTOS DO SISTEMA NERVOSO CEREBROSPINAL, EXCETO: ANESTÉSICOS, RELAXANTES MUSCULARES, ANALGÉSICOS, ANTIPIRÉTICOS, ANTIDEPRESSORES E ANTIPSICÓTICOS, ÀS INSTITUIÇÕES E SERVIÇOS DO SERVIÇO NACIONAL DE SAÚDE",FALSE
"NORADRENALINA, IV, 1MGML; 10 ML SOL INJ ",Ajuste Direto Regime Geral,Locação de bens móveis,"33600000-6, Produtos farmacêuticos",Hospital Prof. Doutor Fernando Fonseca E.P.E. (503035416),Labesfal S.A. -  Laboratórios Almiro S.A. (501169580),"53.088,00 €",04-10-2016,28-09-2016,94 dias,"Portugal, Lisboa, Amadora","Artigo 20.º, n.º 1, alínea a) do Código dos Contratos Públicos",,,,,,Não aplicável.,Não aplicável.,FALSE
Contrato de Prestação de Serviços de Enfermagem,Ajuste Direto Regime Geral,Aquisição de serviços,"85141000-9, Serviços prestados pelo pessoal médico","Hospital Professor Doutor Fernando Fonseca, E. P. E. (503035416)",Sandra Marina Santos Nunes (222180625),"5.712,00 €",04-10-2016,02-05-2016,91 dias,"Portugal, Lisboa, Amadora","Artigo 20.º, n.º 1, alínea a) do Código dos Contratos Públicos",,,,,,Não aplicável.,Não aplicável.,FALSE
Aquisição de Serviços de para Avaliação de Satisfação de Utentes,Ajuste Direto Regime Geral,Aquisição de serviços,"72225000-8, Serviços de análise e avaliação em matéria de garantias da qualidade dos sistemas",Hospital Prof. Doutor Fernando Fonseca E.P.E. (503035416)," CONSULMARK 2, ESTUDOS DE MERCADO E TRABALHO DE CAMPO, LDA. (506842045)","15.950,00 €",04-10-2016,27-09-2016,91 dias,"Portugal, Lisboa, Amadora","Artigo 20.º, n.º 1, alínea a) do Código dos Contratos Públicos",,,,,,Não aplicável.,Não aplicável.,FALSE
Aquisição de Prestação de Serviços de Administração e Suporte Aplicacional para SAP,Ajuste Direto Regime Geral,Aquisição de serviços,"72267000-4, Serviços de manutenção e reparação de software","Hospital Professor Doutor Fernando Fonseca, E. P. E. (503035416)","VAR3F - CONSULTORIA INFORMÁTICA E SISTEMAS, SA (507058917)","43.125,00 €",03-10-2016,02-09-2016,214 dias,"Portugal, Lisboa, Amadora","Artigo 24.º, n.º 1, alínea b) do Código dos Contratos Públicos",,,,,,Não aplicável.,Não aplicável.,FALSE
