freguesia,acronym,validVotesPercentage,votes,dicofre
"União das freguesias de São Miguel, Santa Eufémia e Rabaçal",PS,38.54,296,061407
"União das freguesias de São Miguel, Santa Eufémia e Rabaçal",PPD/PSD,31.25,240,061407
"União das freguesias de São Miguel, Santa Eufémia e Rabaçal",B.E.,11.2,86,061407
"União das freguesias de São Miguel, Santa Eufémia e Rabaçal",PAN,4.82,37,061407
"União das freguesias de São Miguel, Santa Eufémia e Rabaçal",CDS-PP,2.99,23,061407
"União das freguesias de São Miguel, Santa Eufémia e Rabaçal",PCP-PEV,2.99,23,061407
"União das freguesias de São Miguel, Santa Eufémia e Rabaçal",A,2.08,16,061407
"União das freguesias de São Miguel, Santa Eufémia e Rabaçal",L,1.69,13,061407
"União das freguesias de São Miguel, Santa Eufémia e Rabaçal",PPM.PPV/CDC,1.3,10,061407
"União das freguesias de São Miguel, Santa Eufémia e Rabaçal",PCTP/MRPP,0.91,7,061407
"União das freguesias de São Miguel, Santa Eufémia e Rabaçal",PTP,0.65,5,061407
"União das freguesias de São Miguel, Santa Eufémia e Rabaçal",IL,0.52,4,061407
"União das freguesias de São Miguel, Santa Eufémia e Rabaçal",PDR,0.39,3,061407
"União das freguesias de São Miguel, Santa Eufémia e Rabaçal",PURP,0.39,3,061407
"União das freguesias de São Miguel, Santa Eufémia e Rabaçal",PNR,0.26,2,061407
"União das freguesias de São Miguel, Santa Eufémia e Rabaçal",MAS,0,0,061407
"União das freguesias de São Miguel, Santa Eufémia e Rabaçal",NC,0,0,061407
