Objeto do Contrato,Tipo de Procedimento,Tipo(s) de Contrato,CPVs,Entidade(s) Adjudicante(s),Entidade(s) Adjudicatária(s),Preço Contratual,Data de Publicação,Data de Celebração do Contrato,Prazo de Execução,Local de Execução,Fundamentação,Data de Fecho do Contrato,Preço Total Efetivo,Causas das Alterações ao Prazo,Causas das Alterações ao Preço,Estado,N.º registo do Acordo Quadro,Descrição do Acordo Quadro,Procedimento Centralizado
Reagentes para Hematologia [com cedencia de equipamento(s)],Concurso público,Locação de bens móveis,"33696500-0, Reagentes de laboratório","Unidade Local de Saúde de Castelo Branco, E. P. E. (509309844)","SIEMENS HEALTHCARE DIAGNOSTICS, UNIPESSOAL, LDA (507925173)","120.225,00 €",17-04-2015,12-02-2015,1095 dias,"Portugal, Castelo Branco, Castelo Branco","Artigo 20.º, n.º 1, alínea b) do Código dos Contratos Públicos","","","",,,Não aplicável.,Não aplicável.,FALSE
1 Sistema de Cardioversor Desfibrilhador Implantável (CDI),Ao abrigo de acordo-quadro (art.º 259.º),Aquisição de bens móveis,"33182100-0, Desfibrilhador","Unidade Local de Saúde de Castelo Branco, E. P. E. (509309844)",ST.JUDE MEDICAL PORTUGAL (504180746),"11.500,00 €",17-04-2015,17-04-2015,1 dias,"Portugal, Castelo Branco, Castelo Branco",Artigo 259.º do Código dos Contratos Públicos,17-04-2015,"11.500,00 €","",,,600027,"CONCURSO PÚBLICO PARA A CELEBRAÇÃO DE CONTRATOS PÚBLICOS DE APROVISIONAMENTO PARA A ÁREA DA SAÚDE, COM VISTA AO FORNECIMENTO DE SISTEMAS DE CARDIOVERSORES DESFIBRILHADORES IMPLANTÁVEIS ÀS INSTITUIÇÕES E SERVIÇOS DO SERVIÇO NACIONAL DE SAÚDE",FALSE
Aquisição de sistema de alimentação ininterrupta com redundância_Sala de servidores,Ajuste Direto Regime Geral,Aquisição de bens móveis,"31154000-0, Fontes de alimentação ininterruptas","Unidade Local de Saúde de Castelo Branco, E. P. E. (509309844)","ECV-ELECTRO CENTRAL VULCANIZADORA, LDA (500092354)","31.310,00 €",16-04-2015,28-11-2014,45 dias,"Portugal, Castelo Branco, Castelo Branco","Artigo 20.º, n.º 1, alínea a) do Código dos Contratos Públicos",13-03-2015,"31.310,00 €","",,,Não aplicável.,Não aplicável.,FALSE
"Substituição do pavimento do 7º piso_Medicina I, II e Hall",Ajuste Direto Regime Geral,Empreitadas de obras públicas,"45432110-8, Obras de pavimentação","Unidade Local de Saúde de Castelo Branco, E. P. E. (509309844)",ISIDRO MARTINHO PRATA (801532698),"19.317,80 €",16-04-2015,11-12-2014,30 dias,"Portugal, Castelo Branco, Castelo Branco","Artigo 19.º, alínea a) do Código dos Contratos Públicos","","19.317,80 €",.,,,Não aplicável.,Não aplicável.,FALSE
Sistema de atendimento automático de utentes,Concurso público,Aquisição de bens móveis,"30230000-0, Equipamento informático","Unidade Local de Saúde de Castelo Branco, E. P. E. (509309844)","GISCON - GAB. DE SIST., INFORM. E CONSULT., LDA (501937102)","137.581,50 €",16-04-2015,20-02-2015,365 dias,"Portugal, Castelo Branco, Castelo Branco","Artigo 20.º, n.º 1, alínea b) do Código dos Contratos Públicos",17-08-2015,"137.581,50 €","",,,Não aplicável.,Não aplicável.,FALSE
Central telefónica Centro de Saúde de Proença-a-Nova,Ajuste Direto Regime Geral,Aquisição de bens móveis,"32551200-2, Centrais telefónicas","Unidade Local de Saúde de Castelo Branco, EPE (509309844)","GONKSYS, S.A. (510874169)","9.279,47 €",16-04-2015,02-03-2015,30 dias,"Portugal, Castelo Branco, Castelo Branco","Artigo 20.º, n.º 1, alínea a) do Código dos Contratos Públicos",18-05-2015,"9.279,47 €","",,,Não aplicável.,Não aplicável.,FALSE
Aquisição/instalação de Software B-Simple de Gestão Clínica para UCIP,Ajuste Direto Regime Geral,Aquisição de bens móveis,"48517000-5, Pacote de software para TI","Unidade Local de Saúde de Castelo Branco, E.P.E. (509309844)","B-SIMPLE SISTEMAS INFORMACAO, LDA (506188841)","50.000,00 €",16-04-2015,05-02-2015,112 dias,"Portugal, Castelo Branco, Castelo Branco","Artigo 20.º, n.º 1, alínea a) do Código dos Contratos Públicos",16-04-2015,"50.000,00 €","",,,Não aplicável.,Não aplicável.,FALSE
Prestação de serviços de manutenção preventiva e correctiva de equipamentos de oftalmologia_1abr-31dez2015,Ajuste Direto Regime Geral,Aquisição de serviços,"71356200-0, Serviços de assistência técnica","Unidade Local de Saúde de Castelo Branco, E. P. E. (509309844)","PM - EQUIPAMENTOS E SERVIÇOS, LDA (508299900)","7.200,00 €",16-04-2015,16-04-2015,274 dias,"Portugal, Castelo Branco, Castelo Branco","Artigo 20.º, n.º 1, alínea a) do Código dos Contratos Públicos",03-10-2015,"7.200,00 €","",,,Não aplicável.,Não aplicável.,FALSE
