freguesia,acronym,validVotesPercentage,votes,dicofre
Santa Catarina,PPD/PSD.CDS-PP,61.2,552,100611
Santa Catarina,PS,15.08,136,100611
Santa Catarina,MPT,6.76,61,100611
Santa Catarina,PCP-PEV,6.1,55,100611
Santa Catarina,B.E.,2,18,100611
Santa Catarina,PAN,1.88,17,100611
Santa Catarina,L,1.77,16,100611
Santa Catarina,PNR,1.11,10,100611
Santa Catarina,PCTP/MRPP,0.78,7,100611
Santa Catarina,PND,0.78,7,100611
Santa Catarina,MAS,0.67,6,100611
Santa Catarina,PPM,0.67,6,100611
Santa Catarina,PTP,0.67,6,100611
Santa Catarina,PPV,0.33,3,100611
Santa Catarina,PDA,0.11,1,100611
Santa Catarina,POUS,0.11,1,100611
