freguesia,acronym,validVotesPercentage,votes,dicofre
União das freguesias de Assares e Lodões,PS,51.9,41,041020
União das freguesias de Assares e Lodões,PPD/PSD,20.25,16,041020
União das freguesias de Assares e Lodões,B.E.,10.13,8,041020
União das freguesias de Assares e Lodões,PCP-PEV,5.06,4,041020
União das freguesias de Assares e Lodões,CDS-PP,3.8,3,041020
União das freguesias de Assares e Lodões,PAN,2.53,2,041020
União das freguesias de Assares e Lodões,PCTP/MRPP,1.27,1,041020
União das freguesias de Assares e Lodões,PDR,1.27,1,041020
União das freguesias de Assares e Lodões,PNR,1.27,1,041020
União das freguesias de Assares e Lodões,PPM.PPV/CDC,1.27,1,041020
União das freguesias de Assares e Lodões,PURP,1.27,1,041020
União das freguesias de Assares e Lodões,A,0,0,041020
União das freguesias de Assares e Lodões,IL,0,0,041020
União das freguesias de Assares e Lodões,L,0,0,041020
União das freguesias de Assares e Lodões,MAS,0,0,041020
União das freguesias de Assares e Lodões,NC,0,0,041020
União das freguesias de Assares e Lodões,PTP,0,0,041020
