freguesia,acronym,validVotesPercentage,votes,dicofre
União das freguesias de Dois Portos e Runa,PS,41.49,324,111324
União das freguesias de Dois Portos e Runa,PPD/PSD,14.47,113,111324
União das freguesias de Dois Portos e Runa,PCP-PEV,13.7,107,111324
União das freguesias de Dois Portos e Runa,B.E.,8.71,68,111324
União das freguesias de Dois Portos e Runa,CDS-PP,6.4,50,111324
União das freguesias de Dois Portos e Runa,PAN,4.35,34,111324
União das freguesias de Dois Portos e Runa,PPM.PPV/CDC,2.82,22,111324
União das freguesias de Dois Portos e Runa,A,2.05,16,111324
União das freguesias de Dois Portos e Runa,PCTP/MRPP,1.41,11,111324
União das freguesias de Dois Portos e Runa,L,1.02,8,111324
União das freguesias de Dois Portos e Runa,IL,0.77,6,111324
União das freguesias de Dois Portos e Runa,NC,0.77,6,111324
União das freguesias de Dois Portos e Runa,PDR,0.64,5,111324
União das freguesias de Dois Portos e Runa,PNR,0.51,4,111324
União das freguesias de Dois Portos e Runa,PTP,0.38,3,111324
União das freguesias de Dois Portos e Runa,PURP,0.38,3,111324
União das freguesias de Dois Portos e Runa,MAS,0.13,1,111324
