freguesia,acronym,validVotesPercentage,votes,dicofre
Quintanilha,PS,47.83,33,040232
Quintanilha,B.E.,20.29,14,040232
Quintanilha,PPD/PSD,11.59,8,040232
Quintanilha,CDS-PP,4.35,3,040232
Quintanilha,PCP-PEV,4.35,3,040232
Quintanilha,PCTP/MRPP,2.9,2,040232
Quintanilha,A,1.45,1,040232
Quintanilha,PAN,1.45,1,040232
Quintanilha,PDR,1.45,1,040232
Quintanilha,PNR,1.45,1,040232
Quintanilha,PPM.PPV/CDC,1.45,1,040232
Quintanilha,PTP,1.45,1,040232
Quintanilha,IL,0,0,040232
Quintanilha,L,0,0,040232
Quintanilha,MAS,0,0,040232
Quintanilha,NC,0,0,040232
Quintanilha,PURP,0,0,040232
