freguesia,acronym,validVotesPercentage,votes,dicofre
Nossa Senhora do Pranto,PPD/PSD.CDS-PP,41.15,158,141110
Nossa Senhora do Pranto,PS,35.16,135,141110
Nossa Senhora do Pranto,MPT,9.38,36,141110
Nossa Senhora do Pranto,B.E.,3.91,15,141110
Nossa Senhora do Pranto,PCP-PEV,2.34,9,141110
Nossa Senhora do Pranto,PND,1.82,7,141110
Nossa Senhora do Pranto,L,1.56,6,141110
Nossa Senhora do Pranto,PCTP/MRPP,1.56,6,141110
Nossa Senhora do Pranto,PTP,0.78,3,141110
Nossa Senhora do Pranto,MAS,0.52,2,141110
Nossa Senhora do Pranto,PNR,0.52,2,141110
Nossa Senhora do Pranto,PPM,0.52,2,141110
Nossa Senhora do Pranto,PAN,0.26,1,141110
Nossa Senhora do Pranto,PDA,0.26,1,141110
Nossa Senhora do Pranto,PPV,0.26,1,141110
Nossa Senhora do Pranto,POUS,0,0,141110
