freguesia,acronym,validVotesPercentage,votes,dicofre
Penafiel,PS,39.79,3194,131139
Penafiel,PPD/PSD,32.64,2620,131139
Penafiel,B.E.,9.19,738,131139
Penafiel,R.I.R.,4.12,331,131139
Penafiel,PCP-PEV,3.29,264,131139
Penafiel,CDS-PP,3.21,258,131139
Penafiel,PAN,3.03,243,131139
Penafiel,L,0.93,75,131139
Penafiel,IL,0.92,74,131139
Penafiel,CH,0.75,60,131139
Penafiel,PCTP/MRPP,0.54,43,131139
Penafiel,A,0.46,37,131139
Penafiel,PURP,0.22,18,131139
Penafiel,PNR,0.21,17,131139
Penafiel,PTP,0.16,13,131139
Penafiel,MPT,0.15,12,131139
Penafiel,NC,0.1,8,131139
Penafiel,PDR,0.09,7,131139
Penafiel,JPP,0.07,6,131139
Penafiel,MAS,0.06,5,131139
Penafiel,PPM,0.06,5,131139
