freguesia,acronym,validVotesPercentage,votes,dicofre
União das freguesias de Touguinha e Touguinhó,PPD/PSD.CDS-PP,39.44,340,131636
União das freguesias de Touguinha e Touguinhó,PS,31.9,275,131636
União das freguesias de Touguinha e Touguinhó,MPT,8.24,71,131636
União das freguesias de Touguinha e Touguinhó,PCP-PEV,6.03,52,131636
União das freguesias de Touguinha e Touguinhó,B.E.,4.18,36,131636
União das freguesias de Touguinha e Touguinhó,L,2.32,20,131636
União das freguesias de Touguinha e Touguinhó,PAN,1.62,14,131636
União das freguesias de Touguinha e Touguinhó,PCTP/MRPP,1.51,13,131636
União das freguesias de Touguinha e Touguinhó,PPM,1.28,11,131636
União das freguesias de Touguinha e Touguinhó,PTP,1.16,10,131636
União das freguesias de Touguinha e Touguinhó,MAS,0.7,6,131636
União das freguesias de Touguinha e Touguinhó,PNR,0.46,4,131636
União das freguesias de Touguinha e Touguinhó,PDA,0.35,3,131636
União das freguesias de Touguinha e Touguinhó,PND,0.35,3,131636
União das freguesias de Touguinha e Touguinhó,POUS,0.23,2,131636
União das freguesias de Touguinha e Touguinhó,PPV,0.23,2,131636
