freguesia,acronym,validVotesPercentage,votes,dicofre
Vale de Figueira,PPD/PSD,37.65,32,181511
Vale de Figueira,PS,32.94,28,181511
Vale de Figueira,B.E.,7.06,6,181511
Vale de Figueira,CDS-PP,4.71,4,181511
Vale de Figueira,PCP-PEV,3.53,3,181511
Vale de Figueira,PPM.PPV/CDC,3.53,3,181511
Vale de Figueira,PAN,2.35,2,181511
Vale de Figueira,PCTP/MRPP,2.35,2,181511
Vale de Figueira,A,1.18,1,181511
Vale de Figueira,L,1.18,1,181511
Vale de Figueira,NC,1.18,1,181511
Vale de Figueira,PDR,1.18,1,181511
Vale de Figueira,PNR,1.18,1,181511
Vale de Figueira,IL,0,0,181511
Vale de Figueira,MAS,0,0,181511
Vale de Figueira,PTP,0,0,181511
Vale de Figueira,PURP,0,0,181511
