freguesia,acronym,validVotesPercentage,votes,dicofre
"União das freguesias de Canedo, Vale e Vila Maior",PPD/PSD,38.91,847,010933
"União das freguesias de Canedo, Vale e Vila Maior",PS,30.91,673,010933
"União das freguesias de Canedo, Vale e Vila Maior",B.E.,9.74,212,010933
"União das freguesias de Canedo, Vale e Vila Maior",CDS-PP,7.12,155,010933
"União das freguesias de Canedo, Vale e Vila Maior",PAN,4.32,94,010933
"União das freguesias de Canedo, Vale e Vila Maior",PCP-PEV,1.52,33,010933
"União das freguesias de Canedo, Vale e Vila Maior",A,1.1,24,010933
"União das freguesias de Canedo, Vale e Vila Maior",PPM.PPV/CDC,1.1,24,010933
"União das freguesias de Canedo, Vale e Vila Maior",PCTP/MRPP,1.06,23,010933
"União das freguesias de Canedo, Vale e Vila Maior",L,0.96,21,010933
"União das freguesias de Canedo, Vale e Vila Maior",NC,0.73,16,010933
"União das freguesias de Canedo, Vale e Vila Maior",PTP,0.73,16,010933
"União das freguesias de Canedo, Vale e Vila Maior",IL,0.6,13,010933
"União das freguesias de Canedo, Vale e Vila Maior",PDR,0.51,11,010933
"União das freguesias de Canedo, Vale e Vila Maior",PNR,0.37,8,010933
"União das freguesias de Canedo, Vale e Vila Maior",PURP,0.18,4,010933
"União das freguesias de Canedo, Vale e Vila Maior",MAS,0.14,3,010933
