Objeto do Contrato,Tipo de Procedimento,Tipo(s) de Contrato,CPVs,Entidade(s) Adjudicante(s),Entidade(s) Adjudicatária(s),Preço Contratual,Data de Publicação,Data de Celebração do Contrato,Prazo de Execução,Local de Execução,Fundamentação,Data de Fecho do Contrato,Preço Total Efetivo,Causas das Alterações ao Prazo,Causas das Alterações ao Preço,Estado,N.º registo do Acordo Quadro,Descrição do Acordo Quadro,Procedimento Centralizado
Aquisição de viagens e alojamento no âmbito das conferências e seminários com participação de oradores internacionais,Ajuste Direto Regime Geral,Aquisição de serviços,"63000000-9, Serviços anexos e auxiliares dos transportes; serviços de agências de viagens","SPMS- Serviços Partilhados do M. da Saúde, E.P.E. (509540716)","TOP ATLÂNTICO - VIAGENS E TURISMO, S.A. (501061126)","30.000,00 €",01-03-2018,20-12-2017,365 dias,Portugal,"Artigo 20.º, n.º 1, alínea a) do Código dos Contratos Públicos",,,,,,Não aplicável.,Não aplicável.,FALSE
Aquisição de serviços de software e licenciamento de backup para Exadata,Ao abrigo de acordo-quadro (art.º 259.º),Aquisição de bens móveis<br/>Aquisição de serviços,"48000000-8, Pacotes de software e sistemas de informação","SPMS - Serviços Partilhados do Ministério da Saúde, E. P. E. (509540716)",normatica (501782230),"259.870,00 €",01-03-2018,19-12-2017,365 dias,Portugal,Artigo 259.º do Código dos Contratos Públicos,,,,,,610968,Acordo quadro de licenciamento de software e serviços conexos,FALSE
Serviços de monotorização de média (clipping,Ajuste Direto Regime Geral,Aquisição de serviços,"79416200-5, Serviços de consultoria em matéria de relações públicas","SPMS- Serviços Partilhados do M. da Saúde, E.P.E. (509540716)","CISION PORTUGAL - DIST. DE INFORMAÇÃO GERAL, S.A. (501355383)","17.280,00 €",27-02-2018,24-11-2017,1095 dias,Portugal,"Artigo 21.º, n.º 1, alínea a) do Código dos Contratos Públicos",,,,,,Não aplicável.,Não aplicável.,FALSE
Aquisição de aplicações para apoio à gestão de recursos humanos,Ajuste Direto Regime Geral,Aquisição de bens móveis,"48100000-9, Pacote de software para sectores específicos","SPMS- Serviços Partilhados do M. da Saúde, E.P.E. (509540716)","Escrita Digital - Publicações Electrónicas, S.A. (504600141)","56.440,00 €",27-02-2018,27-11-2017,764 dias,Portugal,"Artigo 20.º, n.º 1, alínea a) do Código dos Contratos Públicos",,,,,,Não aplicável.,Não aplicável.,FALSE
AQUISIÇÃO DE SERVIÇOS PARA APOIO À AREA DA COMUNICAÇÃO E RELAÇÕES PÚBLICAS E DE APOIO GERAL,Concurso público,Aquisição de serviços,"79342200-5, Serviços de promoção","SPMS - Serviços Partilhados do Ministério da Saúde, E. P. E. (509540716)",SEARCHWIND (509042635),"149.050,00 €",27-02-2018,09-11-2017,365 dias,Portugal,"Artigo 21.º, n.º 1, alínea b) do Código dos Contratos Públicos",,,,,,Não aplicável.,Não aplicável.,FALSE
AQUISIÇÃO DE SERVIÇOS DE HIGIENE E LIMPEZA COM FORNECIMENTO DE CONSUMÍVEIS DE CASA DE BANHO AO ABRIGO DO ACORDO QUADRO AQ-HL/2015 “HIGIENE E LIMPEZA” CELEBRADO PELA ESPAP,Ao abrigo de acordo-quadro (art.º 259.º),Aquisição de bens móveis<br/>Aquisição de serviços,"90910000-9, Serviços de limpeza","SPMS- Serviços Partilhados do M. da Saúde, E.P.E. (509540716)",Clece SA (513789995),"349.993,71 €",27-02-2018,31-10-2017,1095 dias,Portugal,Artigo 259.º do Código dos Contratos Públicos,,,,,,614429,Acordo quadro para higiene e limpeza,FALSE
Aquisição de economato com branding SPMS,Concurso público,Aquisição de bens móveis,"30192700-8, Artigos de papelaria","SPMS- Serviços Partilhados do M. da Saúde, E.P.E. (509540716)","Publipin - Publicidade, Lda. (502783354)","71.945,98 €",26-02-2018,15-01-2018,365 dias,Portugal,Artigo 28.º do Código dos Contratos Públicos,,,,,,Não aplicável.,Não aplicável.,FALSE
AQUISIÇÃO DE ECONOMATO AO ABRIGO DO LOTE 1 E 2 DO “ACORDO QUADRO PARA FORNECIMENTO DE PAPEL E ECONOMATO” DA ESPAP PARA AS ENTIDADES DO SERVIÇO NACIONAL DE SAÚDE,Ao abrigo de acordo-quadro (art.º 259.º),Aquisição de bens móveis,"30190000-7, Equipamento e material de escritório diverso","SPMS - Serviços Partilhados do Ministério da Saúde, E. P. E. (509540716)","OHM TECNICA - REPRESENTAÇÕES DE MARCAS, LDA (504059521)","15.710,12 €",26-02-2018,22-12-2017,1095 dias,Portugal,Artigo 259.º do Código dos Contratos Públicos,,,,,,1351201,Acordo quadro de fornecimento de papel e economato,FALSE
