Objeto do Contrato,Tipo de Procedimento,Tipo(s) de Contrato,CPVs,Entidade(s) Adjudicante(s),Entidade(s) Adjudicatária(s),Preço Contratual,Data de Publicação,Data de Celebração do Contrato,Prazo de Execução,Local de Execução,Fundamentação,Data de Fecho do Contrato,Preço Total Efetivo,Causas das Alterações ao Prazo,Causas das Alterações ao Preço,Estado,N.º registo do Acordo Quadro,Descrição do Acordo Quadro,Procedimento Centralizado
Aquisição De Consumíveis para Unidade Centralizada de Reprocessamento de Dispositivos Médicos - SECH,Ajuste Direto Regime Geral,Aquisição de bens móveis,"33700000-7, Produtos para cuidados pessoais",Serviço de Utilização Comum dos Hospitais (500900469),"PERGUT PORTUGAL,LDA. (501799729)","34.966,26 €",04-12-2017,04-12-2017,15 dias,"Portugal, Lisboa","Artigo 20.º, n.º 1, alínea a) do Código dos Contratos Públicos",,,,,,Não aplicável.,Não aplicável.,FALSE
Prestação de Serviços de Transporte Logístico de Sangue e Derivados do IPST,Ajuste Direto Regime Geral,Aquisição de serviços,"60100000-9, Serviços de transporte rodoviário",Serviço de Utilização Comum dos Hospitais (500900469),"TORRES SERVICIO MOVIL - LOGISTICA HOSPITALAR, S.A. (514082127)","67.942,67 €",04-12-2017,04-12-2017,26 dias,"Portugal, Portugal Continental","Artigo 20.º, n.º 1, alínea a) do Código dos Contratos Públicos",,,,,,Não aplicável.,Não aplicável.,FALSE
