freguesia,acronym,validVotesPercentage,votes,dicofre
Mentrestido,PS,40.15,53,161009
Mentrestido,PPD/PSD,35.61,47,161009
Mentrestido,B.E.,5.3,7,161009
Mentrestido,CDS-PP,4.55,6,161009
Mentrestido,R.I.R.,3.79,5,161009
Mentrestido,PAN,3.03,4,161009
Mentrestido,PCP-PEV,2.27,3,161009
Mentrestido,A,1.52,2,161009
Mentrestido,CH,0.76,1,161009
Mentrestido,IL,0.76,1,161009
Mentrestido,JPP,0.76,1,161009
Mentrestido,L,0.76,1,161009
Mentrestido,PDR,0.76,1,161009
Mentrestido,MPT,0,0,161009
Mentrestido,NC,0,0,161009
Mentrestido,PCTP/MRPP,0,0,161009
Mentrestido,PNR,0,0,161009
Mentrestido,PPM,0,0,161009
Mentrestido,PTP,0,0,161009
Mentrestido,PURP,0,0,161009
