Objeto do Contrato,Tipo de Procedimento,Tipo(s) de Contrato,CPVs,Entidade(s) Adjudicante(s),Entidade(s) Adjudicatária(s),Preço Contratual,Data de Publicação,Data de Celebração do Contrato,Prazo de Execução,Local de Execução,Fundamentação,Data de Fecho do Contrato,Preço Total Efetivo,Causas das Alterações ao Prazo,Causas das Alterações ao Preço,Estado,N.º registo do Acordo Quadro,Descrição do Acordo Quadro,Procedimento Centralizado
Estudo sobre a Diabetes Mellitus,Ajuste Direto Regime Geral,Aquisição de serviços,"98390000-3, Outros serviços",Entidade Reguladora da Saúde (507021266),"Rui Cernadas Consultoria, Unipessoal, Lda. (509778798)","8.500,00 €",03-06-2011,06-10-2009,180 dias,"Portugal, Porto, Porto","Artigo 20.º, n.º 1, alínea a) do Código dos Contratos Públicos","","",,,,Não aplicável.,Não aplicável.,
"Aquisição das seguintes licenças de antivírus, para o período de 2 anos file server 100 conexões para 5 blades; File server 80 conexões para 11 máquinas virtuais; email server 80 mail box para 3 novos servidores de email; 20 licenças para postos de trabalho (utilizadores).",Ajuste Direto Regime Geral,Aquisição de bens móveis,"48760000-3, Pacote de software para protecção antivírus",Entidade Reguladora da Saúde (507021266),Frederico Jorge Lima Pinto Gomes Rodrigues (229597548),"20.150,00 €",03-06-2011,26-05-2011,10 dias,"Portugal, Porto, Porto","Artigo 26.º, n.º 1, alínea a) do Código dos Contratos Públicos",03-06-2011,"20.150,00 €",,,,Não aplicável.,Não aplicável.,
