Objeto do Contrato,Tipo de Procedimento,Tipo(s) de Contrato,CPVs,Entidade(s) Adjudicante(s),Entidade(s) Adjudicatária(s),Preço Contratual,Data de Publicação,Data de Celebração do Contrato,Prazo de Execução,Local de Execução,Fundamentação,Data de Fecho do Contrato,Preço Total Efetivo,Causas das Alterações ao Prazo,Causas das Alterações ao Preço,Estado,N.º registo do Acordo Quadro,Descrição do Acordo Quadro,Procedimento Centralizado
SPMS 00103_2017 AGRAGAÇÃO Papel Economato,Ajuste Direto Regime Geral,Aquisição de bens móveis,"22000000-0, Material impresso e afins",Instituto de Oftalmologia do Dr. Gama Pinto (600000052),"OHM Técnica-Representação de Marcas, Lda. (504059521)","824,23 €",12-03-2018,16-01-2018,349 dias,"Portugal, Lisboa, Lisboa","Artigo 20.º, n.º 1, alínea a) do Código dos Contratos Públicos",08-01-2019,"824,23 €",,"",,Não aplicável.,Não aplicável.,FALSE
"Lidocaína 25 mg/g (2,5%)+ Prilocaína 25 mg/g (2,5%) Pens impreg",Ao abrigo de acordo-quadro (art.º 258.º),Aquisição de bens móveis,"33600000-6, Produtos farmacêuticos",Instituto de Oftalmologia do Dr. Gama Pinto (600000052),"ASTRAZENECA PRODUTOS FARMACEUTICOS, LDA (502942240)","59,60 €",08-03-2018,08-03-2018,60 dias,"Portugal, Lisboa, Lisboa",Artigo 258.º do Código dos Contratos Públicos,29-03-2018,"59,60 €",,"",,2850371,"CP 2017/51 - Acordo Quadro para fornecimento de Medicamentos usados nas afeções cutâneas, às Instituições e Serviços do Serviço Nacional de Saúde",FALSE
Glicopirrolato 0.2 mg/ml Sol inj,Ajuste Direto Regime Geral,Aquisição de bens móveis,"33600000-6, Produtos farmacêuticos",Instituto de Oftalmologia do Dr. Gama Pinto (600000052),"IDIS  WORLD  MEDICINES, LDA (700513982)","23,00 €",08-03-2018,08-03-2018,300 dias,"Portugal, Lisboa, Lisboa","Artigo 24.º, n.º 1, alínea e) do Código dos Contratos Públicos",27-12-2018,"",,"Artigo não foi fornecido atempadamente. Primeiro esteve em rutura no fornecedor e posteriormente porque o fornecedor exigia um valor mínimo de € 50,00 o que significa que o preço unitário passava de € 4,60 para € 10,00 por ampola.",,Não aplicável.,Não aplicável.,FALSE
Aminofilina 240 mg/10 ml Sol inj  IV,Ajuste Direto Regime Geral,Aquisição de bens móveis,"33600000-6, Produtos farmacêuticos",Instituto de Oftalmologia do Dr. Gama Pinto (600000052),"B BRAUN MEDICAL, LDA (501506543)","7,20 €",08-03-2018,08-03-2018,30 dias,"Portugal, Lisboa, Lisboa","Artigo 21.º, n.º 1, alínea c) do Código dos Contratos Públicos",12-03-2018,"7,20 €",,"",,Não aplicável.,Não aplicável.,FALSE
HEXAFLUORETO DE ENXOFRE (SF6) MONODOSES,Ajuste Direto Regime Geral,Aquisição de bens móveis,"33600000-6, Produtos farmacêuticos",Instituto de Oftalmologia do Dr. Gama Pinto (600000052),Oftaldata (504887459),"130,00 €",08-03-2018,08-03-2018,60 dias,"Portugal, Lisboa, Lisboa","Artigo 21.º, n.º 1, alínea c) do Código dos Contratos Públicos",22-03-2018,"130,00 €",,"",,Não aplicável.,Não aplicável.,FALSE
"Droperidol 2,5 mg/ 1 ml Sol inj  IM, IV",Ao abrigo de acordo-quadro (art.º 258.º),Aquisição de bens móveis,"33600000-6, Produtos farmacêuticos",Instituto de Oftalmologia do Dr. Gama Pinto (600000052),"OVERPHARMA,LDA. (505792362)","40,00 €",08-03-2018,08-03-2018,60 dias,"Portugal, Lisboa, Lisboa",Artigo 258.º do Código dos Contratos Públicos,12-03-2018,"40,00 €",,"",,2356543,CP 2016/19 - Medicamentos Antipsicóticos,FALSE
"Hidroxipropimetilcelulose 2%, seringa 1 a 2 ml",Ajuste Direto Regime Geral,Aquisição de bens móveis,"33600000-6, Produtos farmacêuticos",Instituto de Oftalmologia do Dr. Gama Pinto (600000052),BAUSCH LOMB S A (980218764),"240,00 €",08-03-2018,08-03-2018,300 dias,"Portugal, Lisboa, Lisboa","Artigo 21.º, n.º 1, alínea c) do Código dos Contratos Públicos",20-12-2018,"240,00 €",,"",,Não aplicável.,Não aplicável.,FALSE
Óculos de Proteção c/ filtro,Ajuste Direto Regime Geral,Aquisição de bens móveis,"33140000-3, Material médico de consumo",Instituto de Oftalmologia Doutor Gama Pinto (IOGP) (600000052),NOVARTIS FARMACEUTICA (500063524),"522,40 €",07-03-2018,25-01-2018,340 dias,"Portugal, Lisboa, Lisboa","Artigo 24.º, n.º 1, alínea e) do Código dos Contratos Públicos",24-08-2018,"522,40 €",,"",,Não aplicável.,Não aplicável.,FALSE
