freguesia,acronym,validVotesPercentage,votes,dicofre
Paus,PS,69.77,60,181310
Paus,PPD/PSD,22.09,19,181310
Paus,PAN,3.49,3,181310
Paus,CDS-PP,2.33,2,181310
Paus,B.E.,1.16,1,181310
Paus,PTP,1.16,1,181310
Paus,A,0,0,181310
Paus,IL,0,0,181310
Paus,L,0,0,181310
Paus,MAS,0,0,181310
Paus,NC,0,0,181310
Paus,PCP-PEV,0,0,181310
Paus,PCTP/MRPP,0,0,181310
Paus,PDR,0,0,181310
Paus,PNR,0,0,181310
Paus,PPM.PPV/CDC,0,0,181310
Paus,PURP,0,0,181310
