Objeto do Contrato,Tipo de Procedimento,Tipo(s) de Contrato,CPVs,Entidade(s) Adjudicante(s),Entidade(s) Adjudicatária(s),Preço Contratual,Data de Publicação,Data de Celebração do Contrato,Prazo de Execução,Local de Execução,Fundamentação,Data de Fecho do Contrato,Preço Total Efetivo,Causas das Alterações ao Prazo,Causas das Alterações ao Preço,Estado,N.º registo do Acordo Quadro,Descrição do Acordo Quadro,Procedimento Centralizado
Requalificação / Remodelação do Centro de Saúde da Sertã,Concurso público,Empreitadas de obras públicas,"45453100-8, Obras de recuperação","Unidade Local de Saúde de Castelo Branco, E. P. E. (509309844)","CADIMARTE - CONSTRUÇÕES, LDA (502341165)","509.465,55 €",07-06-2017,07-06-2017,270 dias,"Portugal, Castelo Branco, Sertã","Artigo 19.º, alínea b) do Código dos Contratos Públicos",,,,,,Não aplicável.,Não aplicável.,FALSE
CONTRATO PARA AQUISIÇÃO DE EQUIPAMENTO INFORMÁTICO 2017 AO ABRIGO DO ACORDO QUADRO “AQUISIÇÃO E ALUGUER OPERACIONAL DE EQUIPAMENTO INFORMÁTICO” EM VIGOR NA ESPAP,Ao abrigo de acordo-quadro (art.º 259.º),Aquisição de bens móveis,"30200000-1, Equipamento e material informático","Unidade Local de Saúde de Castelo Branco, E. P. E. (509309844)",Basedois Informática e Telecomunicações Lda. (501333401),"25.110,00 €",02-06-2017,24-05-2017,365 dias,"Portugal, Castelo Branco, Castelo Branco",Artigo 259.º do Código dos Contratos Públicos,,,,,,1196657,Acordo Quadro para aquisição e aluguer operacional de equipamento informático,FALSE
"AQUISIÇÃO DE MEDICAMENTOS DESENCADEADA PELA SPMS, EPE NO ÂMBITO DO DESPACHO 1571/B DE 2016 AO ABRIGO DO ACORDO QUADRO 2015/6",Ao abrigo de acordo-quadro (art.º 259.º),Aquisição de bens móveis,"33600000-6, Produtos farmacêuticos","Unidade Local de Saúde de Castelo Branco, E. P. E. (509309844)","Pharmakern Portugal Sociedade Unipessoal, Lda. (507002571)","13.954,96 €",01-06-2017,22-05-2017,365 dias,"Portugal, Castelo Branco, Castelo Branco",Artigo 259.º do Código dos Contratos Públicos,,,,,,1771819,CP 2015/6 - Acordo quadro para o fornecimento de Medicamentos do Foro Oncológico,FALSE
