freguesia,acronym,validVotesPercentage,votes,dicofre
Arnóia,PS,38.39,172,030502
Arnóia,PPD/PSD,31.47,141,030502
Arnóia,B.E.,9.6,43,030502
Arnóia,PAN,5.8,26,030502
Arnóia,CDS-PP,4.46,20,030502
Arnóia,PCP-PEV,2.46,11,030502
Arnóia,PPM.PPV/CDC,1.79,8,030502
Arnóia,PDR,1.12,5,030502
Arnóia,PTP,1.12,5,030502
Arnóia,A,0.89,4,030502
Arnóia,NC,0.89,4,030502
Arnóia,PCTP/MRPP,0.67,3,030502
Arnóia,IL,0.45,2,030502
Arnóia,PNR,0.45,2,030502
Arnóia,L,0.22,1,030502
Arnóia,MAS,0.22,1,030502
Arnóia,PURP,0,0,030502
