Objeto do Contrato,Tipo de Procedimento,Tipo(s) de Contrato,CPVs,Entidade(s) Adjudicante(s),Entidade(s) Adjudicatária(s),Preço Contratual,Data de Publicação,Data de Celebração do Contrato,Prazo de Execução,Local de Execução,Fundamentação,Data de Fecho do Contrato,Preço Total Efetivo,Causas das Alterações ao Prazo,Causas das Alterações ao Preço,Estado,N.º registo do Acordo Quadro,Descrição do Acordo Quadro,Procedimento Centralizado
Aquisição de video para apresentação de mensagens eductivas para USF Serra Lousã,Ajuste Direto Regime Geral,Aquisição de bens móveis,"32350000-1, Partes de equipamento de som e imagem","Administração Regional de Saúde do Centro, I.P. (503122165)",Joaquim Miguel Nunes dos Santos (214360792),"200,00 €",28-07-2011,28-07-2011,7 dias,"Portugal, Coimbra, Lousã","Artigo 20.º, n.º 1, alínea a) do Código dos Contratos Públicos",,,,,,Não aplicável.,Não aplicável.,
Aquisição de 2 cadeiras de podologia para o ACES PIN I e BV III,Ajuste Direto Regime Geral,Aquisição de bens móveis,"33100000-1, Equipamento médico","Administração Regional de Saúde do Centro, I.P. (503122165)","VITALCARE - Dentária, Podologia e Estética, Lda (505381206)","2.846,28 €",28-07-2011,26-07-2011,15 dias,"Portugal, Aveiro, Ovar<BR/>Portugal, Coimbra, Vila Nova de Poiares","Artigo 20.º, n.º 1, alínea a) do Código dos Contratos Públicos",,,,,,Não aplicável.,Não aplicável.,
6 - almofada de abdução; 4 - banco Crawler de altura regulável; 3 - espelho quadriculado com quadrícula de 10 cm em estativo rodado; 1 - mesa eléctrica universal para terapia ocupacional; 1 - tabuleiro para superfície de trabalho em cadeira de rodas.,Ajuste Direto Regime Geral,Aquisição de bens móveis,"33193222-1, Estruturas para cadeiras de rodas<BR/>39516110-6, Almofadas<BR/>33155000-1, Aparelhos para fisioterapia<BR/>33100000-1, Equipamento médico<BR/>39299300-7, Espelhos de vidro","Administração Regional de Saúde do Centro, I.P. (503122165)","SORISA - Estética e Fisioterapia, SA (500990441)","4.325,40 €",26-07-2011,25-05-2011,30 dias,"Portugal, Coimbra, Coimbra","Artigo 20.º, n.º 1, alínea a) do Código dos Contratos Públicos",,,,,,Não aplicável.,Não aplicável.,
Conjunto de quatro módulos metálicos para arquivo de lâminas histológicas de 14 gavetas (cada módulo para 6500 lâminas) num total de 26000 lâminas,Ajuste Direto Regime Geral,Aquisição de bens móveis,"39180000-7, Mobiliário de laboratório","Administração Regional de Saúde do Centro, I.P. (503122165)","LABOMETER - Sociedade Técnica de Equipamento de Laboratório, Lda (500609160)","785,00 €",26-07-2011,17-06-2011,30 dias,"Portugal, Coimbra, Coimbra","Artigo 20.º, n.º 1, alínea a) do Código dos Contratos Públicos",,,,,,Não aplicável.,Não aplicável.,
Agitador de plaquetas tipo vai-vem com capacidade até 40 unidadesrandom ou 18 unidades aferesi com 6 gavetas amovíveis; sistema de alarme visual e acústico e possibilidade de ligação remota a alarme central,Ajuste Direto Regime Geral,Aquisição de bens móveis,"38436000-0, Agitadores e acessórios","Administração Regional de Saúde do Centro, I.P. (503122165)","Norconcessus - Equipamentos de Laboratório e Científicos, Lda (504907808)","3.017,50 €",26-07-2011,17-06-2011,30 dias,"Portugal, Coimbra, Coimbra","Artigo 20.º, n.º 1, alínea a) do Código dos Contratos Públicos",,,,,,Não aplicável.,Não aplicável.,
"Incubador de plaquetas com capacidade de 150 litros; tomada eléctrica com ficha Schuco para ligação do agitador; porta transparente em plexiglas com chave; controlador digital de temperatura PID; alarme independente visual/sonoro, para temperatura máxima e mínima, com bateria e interface para ligação a PC e ligação a controlo remoto de temperaturas.",Ajuste Direto Regime Geral,Aquisição de bens móveis,"33152000-0, Incubadoras","Administração Regional de Saúde do Centro, I.P. (503122165)","Narconcessus - Equipamentos de Laboratório e Científicos, Lda (504907808)","6.054,55 €",26-07-2011,17-06-2011,30 dias,"Portugal, Coimbra, Coimbra","Artigo 20.º, n.º 1, alínea a) do Código dos Contratos Públicos",,,,,,Não aplicável.,Não aplicável.,
"Microscópio para microscopia óptica, com dupla observação (principal+1 observador), com tubo binocular super ergonómico (com inclinação ajustável, extensível e ajustável em altura); par de oculares de campo 22mm (ambos com ajuste dióptrico; platina rebaixada e com revestimento cerâmico; objectivas planas acromáticas (4x, 10x, 20x e 40x); sistema de dupla observação frontal com ponteiro luminoso e cabo de alimentação.",Ajuste Direto Regime Geral,Aquisição de bens móveis,"38510000-3, Microscópios","Administração Regional de Saúde do Centro, I.P. (503122165)","OLYMPUS PORTUGAL - Opto-Digital Tecnologias, SA (503581429)","8.050,00 €",26-07-2011,17-06-2011,30 dias,"Portugal, Coimbra, Coimbra","Artigo 20.º, n.º 1, alínea a) do Código dos Contratos Públicos",,,,,,Não aplicável.,Não aplicável.,
"Congelador vertical, temperaturas entre -70ºC e -85ºC, capacidade de 628 litros com caixas e gavetas de compartimentação, registador de temperaturas, alarmes audíveis e visuais e ligação em rede para monitorização de temperaturas. - 3 unidades",Ajuste Direto Regime Geral,Aquisição de bens móveis,"39711123-7, Congeladores verticais","Administração Regional de Saúde do Centro, I.P. (503122165)","ELNOR - Equipamentos Técnicos e de Laboratório, SA (500094403)","28.236,00 €",26-07-2011,16-06-2011,30 dias,"Portugal, Coimbra, Coimbra","Artigo 20.º, n.º 1, alínea a) do Código dos Contratos Públicos",,,,,,Não aplicável.,Não aplicável.,
