Objeto do Contrato,Tipo de Procedimento,Tipo(s) de Contrato,CPVs,Entidade(s) Adjudicante(s),Entidade(s) Adjudicatária(s),Preço Contratual,Data de Publicação,Data de Celebração do Contrato,Prazo de Execução,Local de Execução,Fundamentação,Data de Fecho do Contrato,Preço Total Efetivo,Causas das Alterações ao Prazo,Causas das Alterações ao Preço,Estado,N.º registo do Acordo Quadro,Descrição do Acordo Quadro,Procedimento Centralizado
CP-902017-FORNECIMWENTO E DISTRIBUIÇÃO DE BENS E SERVIÇOS ALIMENTAÇÃO DE DOENTES ACOMPANHANTES E COLABORADORES DO IPO,Concurso público,Aquisição de serviços,"55322000-3, Serviços de confecção de refeições","Instituto Português de Oncologia de Lisboa Francisco Gentil, E. P. E. (506361616)","GERTAL-COMPANHIA GERAL DE RESTAURANTES E ALIMENTAÇÃO, S.A. (500126623)","1.380.792,96 €",03-03-2017,11-01-2017,365 dias,"Portugal, Lisboa, Lisboa","Artigo 20.º, n.º 1, alínea b) do Código dos Contratos Públicos",,,,,,Não aplicável.,Não aplicável.,FALSE
AD629-2017SERVIÇOS DE MANUTENÇÃO CORRECTIVA E EVOLUTIVA DOS SISTEMAS CLINIDATA,Ajuste Direto Regime Geral,Aquisição de serviços,"72000000-5, Serviços de TI: consultoria, desenvolvimento de software, Internet e apoio","Instituto Português de Oncologia de Lisboa Francisco Gentil, E. P. E. (506361616)",MAXDATA SOFTWARE  SOFTWARE S.A. (502250259),"35.788,68 €",03-03-2017,17-02-2017,365 dias,"Portugal, Lisboa, Lisboa","Artigo 24.º, n.º 1, alínea e) do Código dos Contratos Públicos",,,,,,Não aplicável.,Não aplicável.,FALSE
AD895-2017LENALIDOMIDA 15 MG CP,Ajuste Direto Regime Geral,Aquisição de bens móveis,"33600000-6, Produtos farmacêuticos","Instituto Português de Oncologia de Lisboa Francisco Gentil, E. P. E. (506361616)","CELGENE SOCIEDADE UNIPESSOAL, LDA (507791690)","49.246,70 €",03-03-2017,24-02-2017,365 dias,"Portugal, Lisboa, Lisboa","Artigo 24.º, n.º 1, alínea c) do Código dos Contratos Públicos",,,,,,Não aplicável.,Não aplicável.,FALSE
AD478-2017VITAMINA A+D+OXIDO ZINCO POM,Ao abrigo de acordo-quadro (art.º 259.º),Aquisição de bens móveis,"33600000-6, Produtos farmacêuticos","Instituto Português de Oncologia de Lisboa Francisco Gentil, E. P. E. (506361616)","LAB MEDINFAR-PRODUTOS FARMACEUTICOS, S.A. (500384045)","110,24 €",03-03-2017,20-02-2017,365 dias,"Portugal, Lisboa, Lisboa",Artigo 259.º do Código dos Contratos Públicos,,,,,,1513257,Acordo quadro para fornecimento de Medicamentos diversos II   às Instituições e Serviços do Serviço Nacional de Saúde,FALSE
AD93-2017-MEDICAMENTOS EXCLUSIVOS,Ajuste Direto Regime Geral,Aquisição de bens móveis,"33600000-6, Produtos farmacêuticos","Instituto Português de Oncologia de Lisboa Francisco Gentil, E. P. E. (506361616)","GILEAD SCIENCES, LDA (503604704)","220.356,36 €",02-03-2017,31-01-2017,365 dias,"Portugal, Lisboa, Lisboa","Artigo 24.º, n.º 1, alínea e) do Código dos Contratos Públicos",,,,,,Não aplicável.,Não aplicável.,FALSE
AD56-PRESTAÇÃO DE SERVIÇOS DE MANUTENÇÃO E ASSISTENCIA TÉCNICA A ARQUIVADORES ROTATIVOS,Ajuste Direto Regime Geral,Aquisição de serviços,"50800000-3, Serviços de reparação e manutenção diversos","Instituto Português de Oncologia de Lisboa Francisco Gentil, E. P. E. (506361616)","SLIDELOG-SISTEMA LOGISTICOS, LDA (506385876)","21.300,00 €",02-03-2017,27-01-2017,365 dias,"Portugal, Lisboa, Lisboa","Artigo 24.º, n.º 1, alínea e) do Código dos Contratos Públicos",,,,,,Não aplicável.,Não aplicável.,FALSE
AD739-2017-LICENÇAS MOBILWAVE,Ajuste Direto Regime Geral,Aquisição de serviços<br/>Aquisição de bens móveis,"22456000-1, Licenças","Instituto Português de Oncologia de Lisboa Francisco Gentil, E. P. E. (506361616)","MOBILWAVE-TECNOLOGIAS DE INFORMAÇÃO, S.A. (506929183)","5.103,00 €",02-03-2017,15-02-2017,365 dias,"Portugal, Lisboa, Lisboa","Artigo 24.º, n.º 1, alínea e) do Código dos Contratos Públicos",,,,,,Não aplicável.,Não aplicável.,FALSE
AD91-2017-CARFILZOMIB 60 MG INJ,Ajuste Direto Regime Geral,Aquisição de bens móveis,"33600000-6, Produtos farmacêuticos","Instituto Português de Oncologia de Lisboa Francisco Gentil, E. P. E. (506361616)","AMGEN BIO-FARMACEUTICA,LDA (502942959)","151.804,80 €",01-03-2017,23-01-2017,365 dias,"Portugal, Lisboa, Lisboa","Artigo 24.º, n.º 1, alínea e) do Código dos Contratos Públicos",,,,,,Não aplicável.,Não aplicável.,FALSE
AD96-2017 CONTRATO DE ASSISTENCIA TÉCNICA,Ajuste Direto Regime Geral,Aquisição de serviços,"50400000-9, Serviços de reparação e manutenção de equipamento médico e de precisão","Instituto Português de Oncologia de Lisboa FG, E.P.E. (506361616)","TERUMO BCT PORTUGAL UNIPESSOAL, LDA (510627048)","13.997,52 €",27-02-2017,25-01-2017,365 dias,"Portugal, Lisboa, Lisboa","Artigo 24.º, n.º 1, alínea e) do Código dos Contratos Públicos",,,,,,Não aplicável.,Não aplicável.,FALSE
AD734-2017-ASSISTENCIA TÉCNICA DO SOFTWARE B-ICU-CARE E B-ANESTESIC,Ajuste Direto Regime Geral,Aquisição de serviços,"71356200-0, Serviços de assistência técnica","Instituto Português de Oncologia de Lisboa Francisco Gentil, E. P. E. (506361616)",B-SIMPLE-SISTEMAS DE INFORMAÇÃO LDA (506188841),"6.000,00 €",24-02-2017,15-02-2017,365 dias,"Portugal, Lisboa, Lisboa","Artigo 24.º, n.º 1, alínea e) do Código dos Contratos Públicos",,,,,,Não aplicável.,Não aplicável.,FALSE
AD162-2017-IMPLEMENYAÇÃO DO SISTEMA DE SEGURANÇA TRANSFUNCIONAL,Ajuste Direto Regime Geral,Aquisição de bens móveis,"48100000-9, Pacote de software para sectores específicos","Instituto Português de Oncologia de Lisboa FG, E.P.E. (506361616)",BIQ-HEALTH SOLUTIONS LDA (504105337),"70.605,00 €",24-02-2017,15-02-2017,365 dias,"Portugal, Lisboa, Lisboa","Artigo 20.º, n.º 1, alínea a) do Código dos Contratos Públicos",,,,,,Não aplicável.,Não aplicável.,FALSE
AD477-2017-IODOPOVIDONA 40 MG/ML ESPUMA,Ao abrigo de acordo-quadro (art.º 259.º),Aquisição de bens móveis,"33600000-6, Produtos farmacêuticos","Instituto Português de Oncologia de Lisboa Francisco Gentil, E. P. E. (506361616)","PROCLÍNICA-EQUIPAMENTOS E PRODUTOS CLÍNICOS, LDA. (500222665)","690,00 €",24-02-2017,22-02-2017,2 dias,"Portugal, Lisboa, Lisboa",Artigo 259.º do Código dos Contratos Públicos,,,,,,1406003,CP 2015/8,FALSE
AD643-2017SERVIÇOS DE MANUTENÇÃO DO SOFTWARE GHAF E PREL INSTALADOS NAS ENTIDADES M. SAÚDE PARA O ANO 2017,Ajuste Direto Regime Geral,Aquisição de serviços,"50000000-5, Serviços de reparação e manutenção","Instituto Português de Oncologia de Lisboa Francisco Gentil, E. P. E. (506361616)","ST+I-SERVIÇOS TÉCNICOS DE INFORMÁTICA, UNIPESSOAL (502246995)","60.400,00 €",23-02-2017,07-02-2017,365 dias,"Portugal, Lisboa, Lisboa","Artigo 24.º, n.º 1, alínea e) do Código dos Contratos Públicos",,,,,,Não aplicável.,Não aplicável.,FALSE
AD128-2017LAMINA PARAMAQ. TRICOTOMIA ESTER,Ajuste Direto Regime Geral,Aquisição de bens móveis,"33600000-6, Produtos farmacêuticos","Instituto Português de Oncologia de Lisboa Francisco Gentil, E. P. E. (506361616)",3M PORTUGAL LDA (500193940),"414,00 €",23-02-2017,22-02-2017,365 dias,"Portugal, Lisboa, Lisboa","Artigo 20.º, n.º 1, alínea a) do Código dos Contratos Públicos",,,,,,Não aplicável.,Não aplicável.,FALSE
"CO110-2017-PRESTAÇÃO DE SERVIÇOS DE RECOLHA, TRANSPORTE DEPOSIÇÃO TRATAMENTO E E NCAMINHAMENTO PARA DESTINO FINAL DOS RESIDUOSHOSPITALARES PRODUZIDOS NO IPO",Concurso público,Aquisição de serviços,"90524400-0, Recolha, transporte e eliminação de resíduos hospitalares","Instituto Português de Oncologia de Lisboa Francisco Gentil, E. P. E. (506361616)","AMBIMED-GESTÃO AMBIENTAL, LDA (503593427)","207.547,30 €",23-02-2017,01-02-2017,365 dias,"Portugal, Lisboa, Lisboa","Artigo 20.º, n.º 1, alínea b) do Código dos Contratos Públicos",,,,,,Não aplicável.,Não aplicável.,FALSE
AD100-PRESTAÇÃO DE SERVIÇOS DE FISCALIZAÇÃO DE OBRAS DE REMODELAÇÃO E AMPLIAÇÃO,Ajuste Direto Regime Geral,Aquisição de serviços,"71500000-3, Serviços relacionados com a construção","Instituto Português de Oncologia de Lisboa Francisco Gentil, E. P. E. (506361616)","JVALENTE-SERVIÇOS DE ENGENHARIA, LDA (508618142)","66.500,00 €",22-02-2017,31-01-2017,365 dias,"Portugal, Lisboa, Lisboa","Artigo 20.º, n.º 1, alínea a) do Código dos Contratos Públicos",,,,,,Não aplicável.,Não aplicável.,FALSE
AD303-2017-TRABECTEDIN 1 MG INJ,Ajuste Direto Regime Geral,Aquisição de bens móveis,"33600000-6, Produtos farmacêuticos","Instituto Português de Oncologia de Lisboa Francisco Gentil, E. P. E. (506361616)","LOGIFARMA, LOGISTICAFARMACEUTICA S.A. (503934640)","10.028,28 €",22-02-2017,10-02-2017,2 dias,"Portugal, Lisboa, Lisboa","Artigo 24.º, n.º 1, alínea e) do Código dos Contratos Públicos",,,,,,Não aplicável.,Não aplicável.,FALSE
"AD290-2017ENTECAVIR 0,5 MG CP",Ao abrigo de acordo-quadro (art.º 259.º),Aquisição de bens móveis,"33600000-6, Produtos farmacêuticos","Instituto Português de Oncologia de Lisboa Francisco Gentil, E. P. E. (506361616)",BRISTOL- MYERS SQUIBB FARMACEUTICA PORTUGUESA S.A. (500048193),"11.542,70 €",22-02-2017,15-02-2017,2 dias,"Portugal, Lisboa, Lisboa",Artigo 259.º do Código dos Contratos Públicos,,,,,,1422736,CP 2015/41 - ACORDO QUADRO PARA FORNECIMENTO DE MEDICAMENTOS ANTI-INFECIOSOS: ANTIVÍRICOS E ANTIFÚNGICOS ÀS INSTITUIÇÕES E SERVIÇOS DO SERVIÇO NACIONAL DE SAÚDE,FALSE
AD37-2017ETIQUETA ADES. P/IMPRESSORA C/22X22 mm,Ajuste Direto Regime Geral,Aquisição de bens móveis,"30199760-5, Etiquetas","Instituto Português de Oncologia de Lisboa Francisco Gentil, E. P. E. (506361616)","ZMWAY, LDA (508085349)","1.356,00 €",22-02-2017,19-01-2017,3 dias,"Portugal, Lisboa, Lisboa","Artigo 20.º, n.º 1, alínea a) do Código dos Contratos Públicos",,,,,,Não aplicável.,Não aplicável.,FALSE
AD778-2017HÉLIO PARA RESSONANCIA MAGNÉTICA,Ajuste Direto Regime Geral,Aquisição de bens móveis,"24111300-8, Hélio","Instituto Português de Oncologia de Lisboa Francisco Gentil, E. P. E. (506361616)",PHILIPS PORTUGUESA S.A. (500216843),"10.875,00 €",21-02-2017,17-02-2017,15 dias,"Portugal, Lisboa, Lisboa","Artigo 24.º, n.º 1, alínea c) do Código dos Contratos Públicos",,,,,,Não aplicável.,Não aplicável.,FALSE
"AD289-2017ENOXAPAQRINA 10 MG 1 ML INJ 0,2+ENOXAPARINA 10 MG INJ 0,4 ML+ENOXAPARINA 10 MG 1 MLINJ O.6 ML",Ao abrigo de acordo-quadro (art.º 259.º),Aquisição de bens móveis,"33600000-6, Produtos farmacêuticos","Instituto Português de Oncologia de Lisboa Francisco Gentil, E. P. E. (506361616)",SANOFI PRODUTOS FARMACEUTICOS (500134960),"7.624,44 €",21-02-2017,13-02-2017,30 dias,"Portugal, Lisboa, Lisboa",Artigo 259.º do Código dos Contratos Públicos,,,,,,1210107,"CONCURSO PÚBLICO PARA A CELEBRAÇÃO DE CONTRATOS PÚBLICOS DE APROVISIONAMENTO PARA A ÁREA DA SAÚDE, COM VISTA AO FORNECIMENTO DE MEDICAMENTOS DO GRUPO 4: SANGUE, ÀS INSTITUIÇÕES E SERVIÇOS DO SERVIÇO NACIONAL DE SAÚDE",FALSE
