Objeto do Contrato,Tipo de Procedimento,Tipo(s) de Contrato,CPVs,Entidade(s) Adjudicante(s),Entidade(s) Adjudicatária(s),Preço Contratual,Data de Publicação,Data de Celebração do Contrato,Prazo de Execução,Local de Execução,Fundamentação,Data de Fecho do Contrato,Preço Total Efetivo,Causas das Alterações ao Prazo,Causas das Alterações ao Preço,Estado,N.º registo do Acordo Quadro,Descrição do Acordo Quadro,Procedimento Centralizado
CONTRATO DE PRESTAÇÃO DE SERVIÇOS MUSEOLÓGICOS E SERVIÇOS DE COMUNICAÇÃO E RELAÇÕES PÚBLICAS,Concurso público,Aquisição de serviços,"79416000-3, Serviços de relações públicas",CHO - Centro Hospitalar do Oeste (510412009),"TONUS GLOBAL, UNIPESSOAL, LDA. (509622976)","25.313,88 €",11-03-2014,20-01-2014,364 dias,"Portugal, Leiria, Caldas da Rainha","Artigo 20.º, n.º 1, alínea b) do Código dos Contratos Públicos",31-12-2014,"25.313,88 €",,,,Não aplicável.,Não aplicável.,FALSE
CONTRATO PRESTAÇÃO DE SERVIÇOS MUSEOLÓGICOS E SERVIÇOS DE COMUNICAÇÃO E RELAÇÕES PÚBLICAS,Concurso público,Aquisição de serviços,"92500000-6, Serviços de bibliotecas, arquivos e museus e outros serviços culturais",CHO - Centro Hospitalar do Oeste (510412009),"TONUS GLOBAL, UNIPESSOAL, LDA. (509622976)","22.609,02 €",11-03-2014,20-01-2014,180 dias,"Portugal, Leiria, Caldas da Rainha","Artigo 20.º, n.º 1, alínea b) do Código dos Contratos Públicos",31-12-2014,"22.609,02 €",,,,Não aplicável.,Não aplicável.,FALSE
"CONTRATO DE PRESTAÇÃO DE SERVIÇOS DE TRANSPORTE URGENTE DE DOENTES EM AMBULÂNCIA, COM ORIGEM NUM DOS HOSPITAIS DE ALCOBAÇA, PENICHE, CALDAS DA RAINHA E TORRE VEDRAS/BARRO",Concurso público,Aquisição de serviços,"60000000-8, Serviços de transporte (excl. transporte de resíduos)",Centro Hospitalar do Oeste (510412009),"LUSO AMBULÂNCIAS, SERVIÇOS MÉDICOS, LDA. (503034657)","250.000,00 €",11-03-2014,11-06-2013,88 dias,"Portugal, Leiria, Caldas da Rainha","Artigo 20.º, n.º 1, alínea b) do Código dos Contratos Públicos",31-12-2013,"250.000,00 €",,,,Não aplicável.,Não aplicável.,FALSE
