freguesia,acronym,validVotesPercentage,votes,dicofre
Santo Varão,PS,43.88,269,061009
Santo Varão,PCP-PEV,20.39,125,061009
Santo Varão,PPD/PSD.CDS-PP,14.36,88,061009
Santo Varão,MPT,9.14,56,061009
Santo Varão,B.E.,6.2,38,061009
Santo Varão,PCTP/MRPP,2.12,13,061009
Santo Varão,L,1.14,7,061009
Santo Varão,PAN,0.65,4,061009
Santo Varão,PNR,0.49,3,061009
Santo Varão,PPM,0.49,3,061009
Santo Varão,PPV,0.33,2,061009
Santo Varão,PTP,0.33,2,061009
Santo Varão,MAS,0.16,1,061009
Santo Varão,PDA,0.16,1,061009
Santo Varão,PND,0.16,1,061009
Santo Varão,POUS,0,0,061009
