freguesia,acronym,validVotesPercentage,votes,dicofre
Torno,PS,40.86,266,130525
Torno,PPD/PSD.CDS-PP,32.1,209,130525
Torno,MPT,9.52,62,130525
Torno,PCP-PEV,6.76,44,130525
Torno,B.E.,2.61,17,130525
Torno,PCTP/MRPP,2,13,130525
Torno,PTP,1.54,10,130525
Torno,L,1.23,8,130525
Torno,PND,0.77,5,130525
Torno,MAS,0.61,4,130525
Torno,PPV,0.61,4,130525
Torno,PAN,0.46,3,130525
Torno,PNR,0.46,3,130525
Torno,POUS,0.31,2,130525
Torno,PPM,0.15,1,130525
Torno,PDA,0,0,130525
