freguesia,acronym,validVotesPercentage,votes,dicofre
União das freguesias de Pinheiro de Coja e Meda de Mouros,PS,49.42,85,061619
União das freguesias de Pinheiro de Coja e Meda de Mouros,PPD/PSD,29.65,51,061619
União das freguesias de Pinheiro de Coja e Meda de Mouros,B.E.,5.23,9,061619
União das freguesias de Pinheiro de Coja e Meda de Mouros,CDS-PP,4.07,7,061619
União das freguesias de Pinheiro de Coja e Meda de Mouros,PCP-PEV,4.07,7,061619
União das freguesias de Pinheiro de Coja e Meda de Mouros,A,1.74,3,061619
União das freguesias de Pinheiro de Coja e Meda de Mouros,PAN,1.74,3,061619
União das freguesias de Pinheiro de Coja e Meda de Mouros,L,1.16,2,061619
União das freguesias de Pinheiro de Coja e Meda de Mouros,IL,0.58,1,061619
União das freguesias de Pinheiro de Coja e Meda de Mouros,NC,0.58,1,061619
União das freguesias de Pinheiro de Coja e Meda de Mouros,PDR,0.58,1,061619
União das freguesias de Pinheiro de Coja e Meda de Mouros,PNR,0.58,1,061619
União das freguesias de Pinheiro de Coja e Meda de Mouros,PTP,0.58,1,061619
União das freguesias de Pinheiro de Coja e Meda de Mouros,MAS,0,0,061619
União das freguesias de Pinheiro de Coja e Meda de Mouros,PCTP/MRPP,0,0,061619
União das freguesias de Pinheiro de Coja e Meda de Mouros,PPM.PPV/CDC,0,0,061619
União das freguesias de Pinheiro de Coja e Meda de Mouros,PURP,0,0,061619
