Objeto do Contrato,Tipo de Procedimento,Tipo(s) de Contrato,CPVs,Entidade(s) Adjudicante(s),Entidade(s) Adjudicatária(s),Preço Contratual,Data de Publicação,Data de Celebração do Contrato,Prazo de Execução,Local de Execução,Fundamentação,Data de Fecho do Contrato,Preço Total Efetivo,Causas das Alterações ao Prazo,Causas das Alterações ao Preço,Estado,N.º registo do Acordo Quadro,Descrição do Acordo Quadro,Procedimento Centralizado
FACTOR IX RECOMBINANTE 1000 UI INJ ( BENEFIX RT 1000UI),Ajuste Direto Regime Geral,Aquisição de bens móveis,"33690000-3, Medicamentos vários","Centro Hospitalar Lisboa Norte, E. P. E. (508481287)",PFIZER BIOFARMACEUTICA SOCIEDADE UNIPESSOAL LDA (513300376),"94.255,50 €",11-05-2018,12-02-2018,2 dias,"Portugal, Lisboa, Lisboa","Artigo 24.º, n.º 1, alínea e), subalínea iii) do Código dos Contratos Públicos",,,,,,Não aplicável.,Não aplicável.,FALSE
MIFEPRISTONA COMP 200 MG,Ajuste Direto Regime Geral,Aquisição de bens móveis,"33690000-3, Medicamentos vários","Centro Hospitalar Lisboa Norte, E. P. E. (508481287)","DISTRIFARMA - COMPT. DISTRIB. FARM., S.A. (502948663)","6.000,00 €",11-05-2018,15-02-2018,2 dias,"Portugal, Lisboa, Lisboa","Artigo 24.º, n.º 1, alínea e), subalínea iii) do Código dos Contratos Públicos",,,,,,Não aplicável.,Não aplicável.,FALSE
Aquisição de Rapid Point 500 Cassete,Ajuste Direto Regime Geral,Aquisição de bens móveis,"33696000-5, Reagentes e meios de contraste","Centro Hospitalar Lisboa Norte, E. P. E. (508481287)",Siemens (507925173),"7.127,52 €",11-05-2018,11-05-2018,1 dias,"Portugal, Lisboa, Lisboa","Artigo 24.º, n.º 1, alínea e), subalínea ii) do Código dos Contratos Públicos",,,,,,Não aplicável.,Não aplicável.,FALSE
ANTIG CLOSTRIDIUM DIFFICILE/TOXINAS A E,Ajuste Direto Regime Geral,Aquisição de bens móveis,"33690000-3, Medicamentos vários","Centro Hospitalar Lisboa Norte, E. P. E. (508481287)","ALERE,LDA (502518863)","5.500,00 €",11-05-2018,15-02-2018,2 dias,"Portugal, Lisboa, Lisboa","Artigo 24.º, n.º 1, alínea e), subalínea iii) do Código dos Contratos Públicos",,,,,,Não aplicável.,Não aplicável.,FALSE
PERFLUORODECALIN SOL ESTÉRIL FRS/AMP 5 M,Ajuste Direto Regime Geral,Aquisição de bens móveis,"33690000-3, Medicamentos vários","Centro Hospitalar Lisboa Norte, E. P. E. (508481287)",Oftaldata (504887459),"5.800,00 €",11-05-2018,22-02-2018,2 dias,"Portugal, Lisboa, Lisboa","Artigo 20.º, n.º 1, alínea d) do Código dos Contratos Públicos",,,,,,Não aplicável.,Não aplicável.,FALSE
189C000011 - Empreitada para execução da obra de fornecimento e montagem de mastros e arranjos exteriores na entrada principal do HSM - CHLN,Consulta Prévia,Empreitadas de obras públicas,"45453000-7, Obras de revisão e recuperação","Centro Hospitalar Lisboa Norte, E. P. E. (508481287)",C.E Gonçalves.Lda (508657520),"22.057,51 €",11-05-2018,03-04-2018,30 dias,"Portugal, Lisboa, Lisboa","Artigo 19.º, alínea c) do Código dos Contratos Públicos",,,,,,Não aplicável.,Não aplicável.,FALSE
COLISTIMETATO DE SODIO SOL P/ NEBULIZAÇÃO,Ajuste Direto Regime Geral,Aquisição de bens móveis,"33690000-3, Medicamentos vários","Centro Hospitalar Lisboa Norte, E. P. E. (508481287)",Zambon Produtos Farmacêuticos Lda. (502155930),"9.614,85 €",11-05-2018,08-02-2018,1 dias,"Portugal, Lisboa, Lisboa","Artigo 24.º, n.º 1, alínea e), subalínea ii) do Código dos Contratos Públicos",,,,,,Não aplicável.,Não aplicável.,FALSE
"Aquisição de consumiveis para alimentação entérica, com colocação de equipamento",Consulta Prévia,Aquisição de bens móveis,"33140000-3, Material médico de consumo","Centro Hospitalar Lisboa Norte, E. P. E. (508481287)","MEDTRONIC PORTUGAL, LDA (504223933)","61.439,96 €",11-05-2018,17-04-2018,255 dias,"Portugal, Lisboa, Lisboa","Artigo 20.º, n.º 1, alínea c) do Código dos Contratos Públicos",,,,,,Não aplicável.,Não aplicável.,FALSE
prestação de serviços de transporte de amostras biológicas relativas a rastreios realizados ACES.,Ajuste Direto Regime Geral,Aquisição de serviços,"60000000-8, Serviços de transporte (excl. transporte de resíduos)","Centro Hospitalar Lisboa Norte, E. P. E. (508481287)","TGVE, LDA. (508495164)","14.968,80 €",11-05-2018,26-04-2018,249 dias,"Portugal, Lisboa, Lisboa","Artigo 20.º, n.º 1, alínea d) do Código dos Contratos Públicos",,,,,,Não aplicável.,Não aplicável.,FALSE
PROPOFOL SOL INJ 20 MG/ML SERINGA 50 ML,Ajuste Direto Regime Geral,Aquisição de bens móveis,"33690000-3, Medicamentos vários","Centro Hospitalar Lisboa Norte, E. P. E. (508481287)","ASTRAZENECA-PRODUTOS FARMACEUTICOS,LDA (502942240)","16.632,00 €",11-05-2018,14-02-2018,320 dias,"Portugal, Lisboa, Lisboa","Artigo 24.º, n.º 1, alínea e), subalínea ii) do Código dos Contratos Públicos",,,,,,Não aplicável.,Não aplicável.,FALSE
Compra Centralizada de miglustate comp. 100 mg - AD-2018-7,Ajuste Direto Regime Geral,Aquisição de bens móveis,"33690000-3, Medicamentos vários","Centro Hospitalar Lisboa Norte, E. P. E. (508481287)","ACTELION PHARMACEUTICALS PORTUGAL, LDA. (507336488)","33.069,12 €",11-05-2018,07-05-2018,238 dias,"Portugal, Lisboa, Lisboa","Artigo 24.º, n.º 1, alínea e), subalínea ii) do Código dos Contratos Públicos",,,,,,Não aplicável.,Não aplicável.,FALSE
HIV TESTE DETERMINACAO POR PCR 48 T,Ajuste Direto Regime Geral,Aquisição de bens móveis,"33696000-5, Reagentes e meios de contraste","Centro Hospitalar Lisboa Norte, E. P. E. (508481287)","Roche Sistemas Diagnósticos, Lda (504282921)","42.240,00 €",11-05-2018,12-02-2018,322 dias,"Portugal, Lisboa, Lisboa","Artigo 24.º, n.º 1, alínea e), subalínea iii) do Código dos Contratos Públicos",,,,,,Não aplicável.,Não aplicável.,FALSE
RESISTENCIA HIV1 AOS INIBIDORES INTEGRAS,Ajuste Direto Regime Geral,Aquisição de bens móveis,"33696000-5, Reagentes e meios de contraste","Centro Hospitalar Lisboa Norte, E. P. E. (508481287)",Abbott laboratorios (500006148),"7.200,00 €",11-05-2018,09-02-2018,3 dias,"Portugal, Lisboa, Lisboa","Artigo 24.º, n.º 1, alínea e), subalínea iii) do Código dos Contratos Públicos",,,,,,Não aplicável.,Não aplicável.,FALSE
DESINFECTANTE HIDROALCOOLICO DE MÃOS 500,Ajuste Direto Regime Geral,Aquisição de bens móveis,"33696000-5, Reagentes e meios de contraste","Centro Hospitalar Lisboa Norte, E. P. E. (508481287)","AIR LIQUIDE MEDICINAL,S A (501576436)","12.348,00 €",11-05-2018,09-02-2018,2 dias,"Portugal, Lisboa, Lisboa","Artigo 24.º, n.º 1, alínea e), subalínea ii) do Código dos Contratos Públicos",,,,,,Não aplicável.,Não aplicável.,FALSE
ESTREPTOCCUS PNEUMONIAE/URINA TESTE DET,Ajuste Direto Regime Geral,Aquisição de bens móveis,"33696000-5, Reagentes e meios de contraste","Centro Hospitalar Lisboa Norte, E. P. E. (508481287)","ALERE,LDA (502518863)","8.360,00 €",11-05-2018,15-02-2018,2 dias,"Portugal, Lisboa, Lisboa","Artigo 24.º, n.º 1, alínea e), subalínea iii) do Código dos Contratos Públicos",,,,,,Não aplicável.,Não aplicável.,FALSE
INFLIXIMAB CONJ DET,Ajuste Direto Regime Geral,Aquisição de bens móveis,"33690000-3, Medicamentos vários","Centro Hospitalar Lisboa Norte, E. P. E. (508481287)",ARIUM (502501880),"8.100,00 €",11-05-2018,15-02-2018,2 dias,"Portugal, Lisboa, Lisboa","Artigo 20.º, n.º 1, alínea d) do Código dos Contratos Públicos",,,,,,Não aplicável.,Não aplicável.,FALSE
REAGENTES DIVERSOS,Ajuste Direto Regime Geral,Aquisição de bens móveis,"33696000-5, Reagentes e meios de contraste","Centro Hospitalar Lisboa Norte, E. P. E. (508481287)","Roche Sistemas Diagnósticos, Lda (504282921)","63.660,00 €",11-05-2018,12-02-2018,322 dias,"Portugal, Lisboa, Lisboa","Artigo 24.º, n.º 1, alínea e), subalínea iii) do Código dos Contratos Públicos",,,,,,Não aplicável.,Não aplicável.,FALSE
VÁRIOS MEDICAMENTOS,Ajuste Direto Regime Geral,Aquisição de bens móveis,"33690000-3, Medicamentos vários","Centro Hospitalar Lisboa Norte, E. P. E. (508481287)",SANDOZ FARMACEUTICA LDA (506985261),"33.210,00 €",11-05-2018,22-02-2018,312 dias,"Portugal, Lisboa, Lisboa","Artigo 24.º, n.º 1, alínea e), subalínea ii) do Código dos Contratos Públicos",,,,,,Não aplicável.,Não aplicável.,FALSE
OXIGENIO MEDICINAL,Ajuste Direto Regime Geral,Aquisição de bens móveis,"33690000-3, Medicamentos vários","Centro Hospitalar Lisboa Norte, E. P. E. (508481287)","LINDE PORTUGAL, LDA. (500266344)","108.972,00 €",11-05-2018,12-02-2018,1 dias,"Portugal, Lisboa, Lisboa","Artigo 24.º, n.º 1, alínea e), subalínea ii) do Código dos Contratos Públicos",,,,,,Não aplicável.,Não aplicável.,FALSE
Aquisição de efavirenze 600 mg + emtricitabina 200 mg + tenofovir 245 mg - comprimidos,Concurso público,Aquisição de bens móveis,"33651400-2, Antivíricos de uso sistémico","Centro Hospitalar Lisboa Norte, E. P. E. (508481287)","Sanofi - Produtos Farmacêuticos, Lda  (500134960)","105.000,00 €",11-05-2018,04-05-2018,30 dias,"Portugal, Lisboa, Lisboa",Artigo 155.º do Código dos Contratos Públicos,,,,,,Não aplicável.,Não aplicável.,FALSE
CONCENTRADO FIBRINOGÉNIO HUMANO 1 GR ( HAEMOCOMPLETTAN),Ajuste Direto Regime Geral,Aquisição de bens móveis,"33690000-3, Medicamentos vários","Centro Hospitalar Lisboa Norte, E. P. E. (508481287)","CSL BEHRING, LDA. (503047201)","40.000,00 €",11-05-2018,15-02-2018,319 dias,"Portugal, Lisboa, Lisboa","Artigo 24.º, n.º 1, alínea e), subalínea iii) do Código dos Contratos Públicos",,,,,,Não aplicável.,Não aplicável.,FALSE
DEXMEDETOMIDINA INJ 100 MCG/ML AMP 2 ML,Ajuste Direto Regime Geral,Aquisição de bens móveis,"33690000-3, Medicamentos vários","Centro Hospitalar Lisboa Norte, E. P. E. (508481287)","ORIONFIN Unipessoal, Lda (508907365)","16.200,00 €",11-05-2018,12-02-2018,2 dias,"Portugal, Lisboa, Lisboa","Artigo 24.º, n.º 1, alínea e), subalínea iii) do Código dos Contratos Públicos",,,,,,Não aplicável.,Não aplicável.,FALSE
NEVIRAPINA 400 MG COMP AP,Consulta Prévia,Aquisição de bens móveis,"33690000-3, Medicamentos vários","Centro Hospitalar Lisboa Norte, E. P. E. (508481287)","MYLAN, LDA (502248793)","5.100,00 €",11-05-2018,21-02-2018,1 dias,"Portugal, Lisboa, Lisboa",Artigo 27.º-A do Código dos Contratos Públicos,,,,,,Não aplicável.,Não aplicável.,FALSE
AGUA DESTILADA SOL P/ INJ FRS 50 ML.,Consulta Prévia,Aquisição de bens móveis,"33692500-2, Soluções injectáveis","Centro Hospitalar Lisboa Norte, E. P. E. (508481287)","B BRAUN MEDICAL, LDA.                              (501506543)","33.120,00 €",11-05-2018,27-02-2018,307 dias,"Portugal, Lisboa, Lisboa",Artigo 27.º-A do Código dos Contratos Públicos,,,,,,Não aplicável.,Não aplicável.,FALSE
MANITOL SALT AGAR MEIO CULTURA 500 GR,Consulta Prévia,Aquisição de bens móveis,"33696000-5, Reagentes e meios de contraste","Centro Hospitalar Lisboa Norte, E. P. E. (508481287)",FISHER SCIENTIFIC (506429210),"175,20 €",11-05-2018,27-02-2018,2 dias,"Portugal, Lisboa, Lisboa",Artigo 27.º-A do Código dos Contratos Públicos,,,,,,Não aplicável.,Não aplicável.,FALSE
COLISTIMETATO DE SODIO SOL P/ NEBULIZAÇÃO,Ajuste Direto Regime Geral,Aquisição de bens móveis,"33696000-5, Reagentes e meios de contraste","Centro Hospitalar Lisboa Norte, E. P. E. (508481287)","Zambon, Lda. (502155930)","7.691,88 €",10-05-2018,02-02-2018,1 dias,"Portugal, Lisboa, Lisboa","Artigo 24.º, n.º 1, alínea e), subalínea ii) do Código dos Contratos Públicos",,,,,,Não aplicável.,Não aplicável.,FALSE
PROPOFOL SOL INJ 20 MG/ML SERINGA 50 ML,Ajuste Direto Regime Geral,Aquisição de bens móveis,"33690000-3, Medicamentos vários","Centro Hospitalar Lisboa Norte, E. P. E. (508481287)","ASTRAZENECA-PRODUTOS FARMACEUTICOS,LDA (502942240)","35.343,00 €",10-05-2018,05-02-2018,3 dias,"Portugal, Lisboa, Lisboa","Artigo 24.º, n.º 1, alínea e), subalínea ii) do Código dos Contratos Públicos",,,,,,Não aplicável.,Não aplicável.,FALSE
IMATINIB COMP,Consulta Prévia,Aquisição de bens móveis,"33690000-3, Medicamentos vários","Centro Hospitalar Lisboa Norte, E. P. E. (508481287)","ACCORD HEALTHCARE, UNIPESSOAL LDA (508622263)","1.926,00 €",10-05-2018,08-02-2018,1 dias,"Portugal, Lisboa, Lisboa",Artigo 27.º-A do Código dos Contratos Públicos,,,,,,Não aplicável.,Não aplicável.,FALSE
Reagentes,Ajuste Direto Regime Geral,Aquisição de bens móveis,"33696000-5, Reagentes e meios de contraste","Centro Hospitalar Lisboa Norte, E. P. E. (508481287)",Abbott laboratorios (500006148),"13.543,62 €",10-05-2018,14-02-2018,320 dias,"Portugal, Lisboa, Lisboa","Artigo 24.º, n.º 1, alínea e), subalínea iii) do Código dos Contratos Públicos",,,,,,Não aplicável.,Não aplicável.,FALSE
Reagentes,Ajuste Direto Regime Geral,Aquisição de bens móveis,"33690000-3, Medicamentos vários","Centro Hospitalar Lisboa Norte, E. P. E. (508481287)","IMMUCOR PORTUGAL DIAGNOSTICOS MÉDICOS, LDA (503007358)","11.680,00 €",10-05-2018,08-02-2018,326 dias,"Portugal, Lisboa, Lisboa","Artigo 24.º, n.º 1, alínea e), subalínea iii) do Código dos Contratos Públicos",,,,,,Não aplicável.,Não aplicável.,FALSE
Reagentes,Ajuste Direto Regime Geral,Aquisição de bens móveis,"33696000-5, Reagentes e meios de contraste","Centro Hospitalar Lisboa Norte, E. P. E. (508481287)",OCD (513032665),"37.189,20 €",10-05-2018,07-02-2018,2 dias,"Portugal, Lisboa, Lisboa","Artigo 24.º, n.º 1, alínea e), subalínea iii) do Código dos Contratos Públicos",,,,,,Não aplicável.,Não aplicável.,FALSE
LENALIDOMIDA CAPS 15 MG,Ajuste Direto Regime Geral,Aquisição de bens móveis,"33690000-3, Medicamentos vários","Centro Hospitalar Lisboa Norte, E. P. E. (508481287)","CELGENE SOCIEDADE UNIPESSOAL, LDA (507791690)","54.171,37 €",10-05-2018,06-02-2018,4 dias,"Portugal, Lisboa, Lisboa","Artigo 24.º, n.º 1, alínea e), subalínea iii) do Código dos Contratos Públicos",,,,,,Não aplicável.,Não aplicável.,FALSE
HEMOCULTURAS AEROBIOS P/A SISTEMA AUTOMATICO,Ajuste Direto Regime Geral,Locação de bens móveis<br/>Aquisição de bens móveis,"33696000-5, Reagentes e meios de contraste","Centro Hospitalar Lisboa Norte, E. P. E. (508481287)","QUILABAN - Quimica Lab. Analítica, Lda. (500399670)","11.400,00 €",10-05-2018,02-02-2018,2 dias,"Portugal, Lisboa, Lisboa","Artigo 24.º, n.º 1, alínea e), subalínea iii) do Código dos Contratos Públicos",,,,,,Não aplicável.,Não aplicável.,FALSE
"IDARUCIZUMAB 2,5 G/50 ML SOL INJ",Ajuste Direto Regime Geral,Aquisição de bens móveis,"33690000-3, Medicamentos vários","Centro Hospitalar Lisboa Norte, E. P. E. (508481287)","Unilfarma - União Internacional de Laboratórios Farmacêuticos, Lda (500293023)","6.024,00 €",10-05-2018,02-02-2018,2 dias,"Portugal, Lisboa, Lisboa","Artigo 24.º, n.º 1, alínea e), subalínea iii) do Código dos Contratos Públicos",,,,,,Não aplicável.,Não aplicável.,FALSE
Reagentes,Ajuste Direto Regime Geral,Aquisição de bens móveis,"33696000-5, Reagentes e meios de contraste","Centro Hospitalar Lisboa Norte, E. P. E. (508481287)","Thermo Fisher Diagnostics, Sociedade Unipessoal, Lda (506916243)","16.000,00 €",10-05-2018,01-02-2018,2 dias,"Portugal, Lisboa, Lisboa","Artigo 24.º, n.º 1, alínea e), subalínea iii) do Código dos Contratos Públicos",,,,,,Não aplicável.,Não aplicável.,FALSE
Aquisição de cobimetinib 20 mg,Ajuste Direto Regime Geral,Aquisição de bens móveis,"33690000-3, Medicamentos vários","Centro Hospitalar Lisboa Norte, E. P. E. (508481287)","ROCHE FARMACEUTICA QUIMICA, LDA (500233810)","10.139,85 €",10-05-2018,11-04-2018,1 dias,"Portugal, Lisboa, Lisboa","Artigo 24.º, n.º 1, alínea e), subalínea iii) do Código dos Contratos Públicos",,,,,,Não aplicável.,Não aplicável.,FALSE
CH 50 Conj det,Ajuste Direto Regime Geral,Aquisição de bens móveis,"33696000-5, Reagentes e meios de contraste","Centro Hospitalar Lisboa Norte, E. P. E. (508481287)",THE BINDING SITE GROUP LTD (980525136),"5.745,00 €",10-05-2018,01-02-2018,5 dias,"Portugal, Lisboa, Lisboa","Artigo 24.º, n.º 1, alínea e), subalínea iii) do Código dos Contratos Públicos",,,,,,Não aplicável.,Não aplicável.,FALSE
Hemoculturas Aeróbios P/A Sistema,Ajuste Direto Regime Geral,Aquisição de bens móveis,"33696000-5, Reagentes e meios de contraste","Centro Hospitalar Lisboa Norte, E. P. E. (508481287)",Biomerieux Portugal (501524177),"17.250,00 €",10-05-2018,02-02-2018,2 dias,"Portugal, Lisboa, Lisboa","Artigo 24.º, n.º 1, alínea e), subalínea iii) do Código dos Contratos Públicos",,,,,,Não aplicável.,Não aplicável.,FALSE
Aquisição de rituximab sol. inj. 10 mg/ml amp. 10 ml,Ajuste Direto Regime Geral,Aquisição de bens móveis,"33690000-3, Medicamentos vários","Centro Hospitalar Lisboa Norte, E. P. E. (508481287)","ROCHE FARMACEUTICA QUIMICA, LDA (500233810)","25.138,80 €",10-05-2018,13-04-2018,1 dias,"Portugal, Lisboa, Lisboa","Artigo 24.º, n.º 1, alínea e), subalínea ii) do Código dos Contratos Públicos",,,,,,Não aplicável.,Não aplicável.,FALSE
Mycobacterias Meio Líquido 7 ml,Ajuste Direto Regime Geral,Aquisição de bens móveis,"33696000-5, Reagentes e meios de contraste","Centro Hospitalar Lisboa Norte, E. P. E. (508481287)","QUILABAN - Quimica Lab. Analítica, Lda. (500399670)","18.277,40 €",10-05-2018,06-02-2018,2 dias,"Portugal, Lisboa, Lisboa","Artigo 24.º, n.º 1, alínea e), subalínea iii) do Código dos Contratos Públicos",,,,,,Não aplicável.,Não aplicável.,FALSE
ACIDOS NUCLEICOS REAGENTE EXTRACÇÃO 48 T,Ajuste Direto Regime Geral,Aquisição de bens móveis,"33696000-5, Reagentes e meios de contraste","Centro Hospitalar Lisboa Norte, E. P. E. (508481287)",WERFEN PORTUGAL LDA (501086110),"7.200,00 €",10-05-2018,31-01-2018,2 dias,"Portugal, Lisboa, Lisboa","Artigo 24.º, n.º 1, alínea e), subalínea iii) do Código dos Contratos Públicos",,,,,,Não aplicável.,Não aplicável.,FALSE
Resina Permutadora de Catiões Fase Cálcica,Ajuste Direto Regime Geral,Aquisição de bens móveis,"33690000-3, Medicamentos vários","Centro Hospitalar Lisboa Norte, E. P. E. (508481287)","FRESENIUS MEDICAL CARE PORTUGAL, SA (503070220)","5.310,00 €",10-05-2018,06-02-2018,3 dias,"Portugal, Lisboa, Lisboa","Artigo 24.º, n.º 1, alínea e), subalínea iii) do Código dos Contratos Públicos",,,,,,Não aplicável.,Não aplicável.,FALSE
VEDOLIZUMAB 300 MG INJ,Ajuste Direto Regime Geral,Aquisição de bens móveis,"33690000-3, Medicamentos vários","Centro Hospitalar Lisboa Norte, E. P. E. (508481287)",TAKEDA - FARMACÊUTICOS PORTUGAL LDA (502801204),"76.756,00 €",10-05-2018,30-01-2018,2 dias,"Portugal, Lisboa, Lisboa","Artigo 24.º, n.º 1, alínea e), subalínea iii) do Código dos Contratos Públicos",,,,,,Não aplicável.,Não aplicável.,FALSE
Aquisição de Kits de Higiene durante o ano 2018,Consulta Prévia,Aquisição de bens móveis,"33711790-1, Conjuntos de higiene oral","Centro Hospitalar Lisboa Norte, E. P. E. (508481287)","AVIQUIMICA- IMPORTAÇÃO E MANUFACTURAS, LDA (500039720)","20.055,00 €",10-05-2018,16-04-2018,256 dias,"Portugal, Lisboa, Lisboa","Artigo 20.º, n.º 1, alínea c) do Código dos Contratos Públicos",,,,,,Não aplicável.,Não aplicável.,FALSE
HEMOGLOBINA HUMANA NAS FEZES TESTE PESQ,Ajuste Direto Regime Geral,Aquisição de bens móveis,"33696500-0, Reagentes de laboratório","Centro Hospitalar Lisboa Norte, E. P. E. (508481287)",SYSMEX EUROPE GMBH (N0047144-A),"32.000,00 €",10-05-2018,07-02-2018,1 dias,"Portugal, Lisboa, Lisboa","Artigo 24.º, n.º 1, alínea e), subalínea iii) do Código dos Contratos Públicos",,,,,,Não aplicável.,Não aplicável.,FALSE
HELICOBACTER PYLORI TESTE RESPIRATORIO 5,Ajuste Direto Regime Geral,Aquisição de bens móveis,"33696000-5, Reagentes e meios de contraste","Centro Hospitalar Lisboa Norte, E. P. E. (508481287)",QUEENLABS-ESPEC FARMACÊUTICAS LDA (503984485),"9.666,00 €",10-05-2018,07-02-2018,1 dias,"Portugal, Lisboa, Lisboa","Artigo 24.º, n.º 1, alínea e), subalínea iii) do Código dos Contratos Públicos",,,,,,Não aplicável.,Não aplicável.,FALSE
AFATINIB 20 MG COMP,Ajuste Direto Regime Geral,Aquisição de bens móveis,"33690000-3, Medicamentos vários","Centro Hospitalar Lisboa Norte, E. P. E. (508481287)",UNILFARMA-UNIÃO INTERNACIONAL DE LABORATÓRIOS  FARMACEUTICOS LDA (500293023),"5.217,90 €",10-05-2018,06-02-2018,2 dias,"Portugal, Lisboa, Lisboa","Artigo 24.º, n.º 1, alínea e), subalínea iii) do Código dos Contratos Públicos",,,,,,Não aplicável.,Não aplicável.,FALSE
CMV CAP/CTM TESTE DET 72 T,Ajuste Direto Regime Geral,Aquisição de bens móveis,"33696000-5, Reagentes e meios de contraste","Centro Hospitalar Lisboa Norte, E. P. E. (508481287)","Roche Sistemas de Diagnóstico, Lda. (504282921)","23.918,40 €",10-05-2018,15-02-2018,319 dias,"Portugal, Lisboa, Lisboa","Artigo 24.º, n.º 1, alínea e), subalínea iii) do Código dos Contratos Públicos",,,,,,Não aplicável.,Não aplicável.,FALSE
CP n.º 182A000003 - Aquisição de trouxas cirúrgicas universais e campos cirúrgicos durante o ano de 2018,Concurso público,Aquisição de bens móveis,"33140000-3, Material médico de consumo","Centro Hospitalar Lisboa Norte, E. P. E. (508481287)","MEDLINE INTERNATIONAL UNIPESSOAL, LDA (510533515)","115.513,08 €",09-05-2018,04-05-2018,241 dias,"Portugal, Lisboa, Lisboa","Artigo 20.º, n.º 1, alínea b) do Código dos Contratos Públicos",,,,,,Não aplicável.,Não aplicável.,FALSE
SOMATROPINA SOL INJ 10 MG/2 ML,Ajuste Direto Regime Geral,Aquisição de bens móveis,"33690000-3, Medicamentos vários","Centro Hospitalar Lisboa Norte, E. P. E. (508481287)",IPSEN PORTUGAL (502609800),"1.022,58 €",09-05-2018,07-02-2018,2 dias,"Portugal, Lisboa, Lisboa","Artigo 24.º, n.º 1, alínea e), subalínea ii) do Código dos Contratos Públicos",,,,,,Não aplicável.,Não aplicável.,FALSE
Aquisição de serviços de manutenção e assistência técnica à solução PICIS - Ref.ª 00084_2018,Ajuste Direto Regime Geral,Aquisição de serviços,"50000000-5, Serviços de reparação e manutenção","Centro Hospitalar Lisboa Norte, E. P. E. (508481287)","Cerner Portugal, Unipessoal, Lda (513269843)","231.063,37 €",09-05-2018,26-03-2018,365 dias,"Portugal, Lisboa, Lisboa","Artigo 24.º, n.º 1, alínea e), subalínea iii) do Código dos Contratos Públicos",,,,,,Não aplicável.,Não aplicável.,FALSE
MICOFENOLATO DE MOFETIL CAPS 500 MG,Ajuste Direto Regime Geral,Aquisição de bens móveis,"33690000-3, Medicamentos vários","Centro Hospitalar Lisboa Norte, E. P. E. (508481287)","Accord Healthcare, Unipessoal Lda. (508622263)","16.680,00 €",09-05-2018,29-01-2018,1 dias,"Portugal, Lisboa, Lisboa","Artigo 24.º, n.º 1, alínea e), subalínea ii) do Código dos Contratos Públicos",,,,,,Não aplicável.,Não aplicável.,FALSE
Epoetina Alfa Sol Inj 40.000 UI Frs/Amp,Ajuste Direto Regime Geral,Aquisição de bens móveis,"33690000-3, Medicamentos vários","Centro Hospitalar Lisboa Norte, E. P. E. (508481287)","JANSSEN CILAG FARMACEUTICA, LDA (500189412)","5.088,00 €",09-05-2018,02-02-2018,2 dias,"Portugal, Lisboa, Lisboa","Artigo 24.º, n.º 1, alínea e), subalínea ii) do Código dos Contratos Públicos",,,,,,Não aplicável.,Não aplicável.,FALSE
189G000436 - Aquisição de serviço de manutenção ao equipamento de radioterapia representada pela Elektra para o ano de 2018,Ajuste Direto Regime Geral,Aquisição de serviços,"50421000-2, Serviços de reparação e manutenção de equipamento médico","CENTRO HOSPITALAR LISBOA NORTE, EPE (508481287)",RRTS (514185155),"140.009,84 €",09-05-2018,07-05-2018,238 dias,"Portugal, Lisboa, Lisboa","Artigo 24.º, n.º 1, alínea e), subalínea iii) do Código dos Contratos Públicos",,,,,,Não aplicável.,Não aplicável.,FALSE
Osimertinib 80 mg,Ajuste Direto Regime Geral,Aquisição de bens móveis,"33652000-5, Antineoplásicos e imunomoduladores","Centro Hospitalar Lisboa Norte, E. P. E. (508481287)","Astrazeneca - Produtos Farmacêuticos, Lda (502942240)","116.262,93 €",09-05-2018,14-02-2018,320 dias,"Portugal, Lisboa, Lisboa","Artigo 24.º, n.º 1, alínea e), subalínea iii) do Código dos Contratos Públicos",,,,,,Não aplicável.,Não aplicável.,FALSE
TEMOZOLAMIDA CAPS,Ajuste Direto Regime Geral,Aquisição de bens móveis,"33690000-3, Medicamentos vários","Centro Hospitalar Lisboa Norte, E. P. E. (508481287)","Accord Healthcare, Unipessoal Lda. (508622263)","2.392,50 €",09-05-2018,29-01-2018,1 dias,"Portugal, Lisboa, Lisboa","Artigo 24.º, n.º 1, alínea e), subalínea ii) do Código dos Contratos Públicos",,,,,,Não aplicável.,Não aplicável.,FALSE
IMPREGNADO COM VASELINA 10X10 CM,Consulta Prévia,Aquisição de bens móveis,"33690000-3, Medicamentos vários","Centro Hospitalar Lisboa Norte, E. P. E. (508481287)",SMITH+NEPHEW (503552461),"48,00 €",09-05-2018,08-02-2018,2 dias,"Portugal, Lisboa, Lisboa",Artigo 27.º-A do Código dos Contratos Públicos,,,,,,Não aplicável.,Não aplicável.,FALSE
BUDESONIDO 3 MG CAPS LM,Consulta Prévia,Aquisição de bens móveis,"33690000-3, Medicamentos vários","Centro Hospitalar Lisboa Norte, E. P. E. (508481287)","LABORATORIOS VITORIA, SA (500162220)","203,70 €",09-05-2018,14-02-2018,5 dias,"Portugal, Lisboa, Lisboa",Artigo 27.º-A do Código dos Contratos Públicos,,,,,,Não aplicável.,Não aplicável.,FALSE
Compra centralizada de entricitabina 200 mg + tenofovir 245 mg caps. AD - 2018- 6,Ajuste Direto Regime Geral,Aquisição de bens móveis,"33690000-3, Medicamentos vários","Centro Hospitalar Lisboa Norte, E. P. E. (508481287)","GILEAD SCIENCES, LDA. (503604704)","767.118,00 €",09-05-2018,13-04-2018,236 dias,"Portugal, Lisboa, Lisboa","Artigo 24.º, n.º 1, alínea e), subalínea ii) do Código dos Contratos Públicos",,,,,,Não aplicável.,Não aplicável.,FALSE
IMUNOGLOBULINA 100 MG/ML INJ FR 100 ML (10 G) ( PRIVIGEN ),Ajuste Direto Regime Geral,Aquisição de bens móveis,"33690000-3, Medicamentos vários","Centro Hospitalar Lisboa Norte, E. P. E. (508481287)","CSL BEHRING, LDA. (503047201)","151.242,40 €",09-05-2018,02-02-2018,1 dias,"Portugal, Lisboa, Lisboa","Artigo 24.º, n.º 1, alínea e), subalínea ii) do Código dos Contratos Públicos",,,,,,Não aplicável.,Não aplicável.,FALSE
OLAPARIB 50 MG CAPS,Ajuste Direto Regime Geral,Aquisição de bens móveis,"33690000-3, Medicamentos vários","Centro Hospitalar Lisboa Norte, E. P. E. (508481287)","Astrazeneca - Produtos Farmacêuticos, Lda (502942240)","14.704,98 €",09-05-2018,14-02-2018,3 dias,"Portugal, Lisboa, Lisboa","Artigo 24.º, n.º 1, alínea e), subalínea iii) do Código dos Contratos Públicos",,,,,,Não aplicável.,Não aplicável.,FALSE
Aquisição de serviços de manutenção ao equipamento de infusão da marca B. Braun,Ajuste Direto Regime Geral,Aquisição de serviços,"50511000-0, Serviços de reparação e manutenção de bombas","Centro Hospitalar Lisboa Norte, E. P. E. (508481287)","B. BRAUN MEDICAL, Lda. (501506543)","116.507,84 €",09-05-2018,20-04-2018,306 dias,"Portugal, Lisboa, Lisboa","Artigo 24.º, n.º 1, alínea e), subalínea iii) do Código dos Contratos Públicos",,,,,,Não aplicável.,Não aplicável.,FALSE
IMUNOGLOBULINA 100 MG/ML INJ FR 200 ML (20 G)  ( PRIVIGEN ),Ajuste Direto Regime Geral,Aquisição de bens móveis,"33690000-3, Medicamentos vários","Centro Hospitalar Lisboa Norte, E. P. E. (508481287)","CSL BEHRING, LDA. (503047201)","169.952,80 €",09-05-2018,02-02-2018,1 dias,"Portugal, Lisboa, Lisboa","Artigo 24.º, n.º 1, alínea e), subalínea ii) do Código dos Contratos Públicos",,,,,,Não aplicável.,Não aplicável.,FALSE
Aquisição de material de Ortopedia,Ajuste Direto Regime Geral,Aquisição de bens móveis,"33190000-8, Dispositivos e produtos médicos variados","Centro Hospitalar Lisboa Norte, E. P. E. (508481287)",JOHNSON JOHNSON MEDICAL (500153370),"5.317,71 €",09-05-2018,09-05-2018,1 dias,"Portugal, Lisboa, Lisboa","Artigo 24.º, n.º 1, alínea e), subalínea ii) do Código dos Contratos Públicos",,,,,,Não aplicável.,Não aplicável.,FALSE
Aciclovir 800 mg Comp,Consulta Prévia,Aquisição de bens móveis,"33690000-3, Medicamentos vários","Centro Hospitalar Lisboa Norte, E. P. E. (508481287)","GENERIS-FARMACEUTICA, SA (508107997)","1.050,00 €",08-05-2018,12-02-2018,1 dias,"Portugal, Lisboa, Lisboa",Artigo 27.º-A do Código dos Contratos Públicos,,,,,,Não aplicável.,Não aplicável.,FALSE
ETANERCEPT SOL INJ 50 MG/1 ML CANETAS,Ajuste Direto Regime Geral,Aquisição de bens móveis,"33690000-3, Medicamentos vários","Centro Hospitalar Lisboa Norte, E. P. E. (508481287)","PFIZER - Biofarmacêutica, Soc. Unipessoal, Lda. (513300376)","177.660,00 €",08-05-2018,09-02-2018,2 dias,"Portugal, Lisboa, Lisboa","Artigo 24.º, n.º 1, alínea e), subalínea ii) do Código dos Contratos Públicos",,,,,,Não aplicável.,Não aplicável.,FALSE
Aquisição de imunoglobulina 50 mg/ml sol. inj. fr. 100 m,Ajuste Direto Regime Geral,Aquisição de bens móveis,"33690000-3, Medicamentos vários","Centro Hospitalar Lisboa Norte, E. P. E. (508481287)","Kedrion Portugal, Lda. (508472830)","5.400,00 €",08-05-2018,08-05-2018,1 dias,"Portugal, Lisboa, Lisboa","Artigo 24.º, n.º 1, alínea e), subalínea ii) do Código dos Contratos Públicos",,,,,,Não aplicável.,Não aplicável.,FALSE
IMUNOGLOBULINA SOL INJ 165 MG/ML AMP 10,Ajuste Direto Regime Geral,Aquisição de bens móveis,"33690000-3, Medicamentos vários","Centro Hospitalar Lisboa Norte, E. P. E. (508481287)","Octapharma - Produtos Farmaceutico, Lda. (502820780)","28.215,00 €",08-05-2018,27-02-2018,307 dias,"Portugal, Lisboa, Lisboa","Artigo 24.º, n.º 1, alínea e), subalínea ii) do Código dos Contratos Públicos",,,,,,Não aplicável.,Não aplicável.,FALSE
Aquisição de bota anti-rotativa,Consulta Prévia,Aquisição de bens móveis,"33183000-6, Material de assistência ortopédica","Centro Hospitalar Lisboa Norte, E. P. E. (508481287)",Ortopedia Moderna (500481300),"1.099,00 €",08-05-2018,08-05-2018,1 dias,"Portugal, Lisboa, Lisboa","Artigo 20.º, n.º 1, alínea c) do Código dos Contratos Públicos",,,,,,Não aplicável.,Não aplicável.,FALSE
Aquisição de impregnado com vaselina 10x10 cm,Consulta Prévia,Aquisição de bens móveis,"33690000-3, Medicamentos vários","Centro Hospitalar Lisboa Norte, E. P. E. (508481287)",SMITH+NEPHEW (503552461),"48,00 €",08-05-2018,08-05-2018,1 dias,"Portugal, Lisboa, Lisboa",Artigo 27.º-A do Código dos Contratos Públicos,,,,,,Não aplicável.,Não aplicável.,FALSE
Aquisição de material de Cardiologia,Ajuste Direto Regime Geral,Aquisição de bens móveis,"33190000-8, Dispositivos e produtos médicos variados","Centro Hospitalar Lisboa Norte, E. P. E. (508481287)","VOLCANO EUROPE, SPRL/BVBA (BE859842345)","32.625,00 €",08-05-2018,08-05-2018,1 dias,"Portugal, Lisboa, Lisboa","Artigo 24.º, n.º 1, alínea e), subalínea ii) do Código dos Contratos Públicos",,,,,,Não aplicável.,Não aplicável.,FALSE
Aquisição de alcool 70% frs. 1 l,Ajuste Direto Regime Geral,Aquisição de bens móveis,"33680000-0, Artigos de farmácia","Centro Hospitalar Lisboa Norte, E. P. E. (508481287)","PROCLINICA, LDA (500222665)","5.040,00 €",08-05-2018,08-05-2018,1 dias,"Portugal, Lisboa, Lisboa","Artigo 24.º, n.º 1, alínea e), subalínea ii) do Código dos Contratos Públicos",,,,,,Não aplicável.,Não aplicável.,FALSE
Oxigénio Gasoso Medicinal Garrafa 10.6 m3,Ajuste Direto Regime Geral,Aquisição de bens móveis,"33690000-3, Medicamentos vários","Centro Hospitalar Lisboa Norte, E. P. E. (508481287)","LINDE PORTUGAL, LDA. (500266344)","6.648,00 €",08-05-2018,26-01-2018,1 dias,"Portugal, Lisboa, Lisboa","Artigo 24.º, n.º 1, alínea e), subalínea ii) do Código dos Contratos Públicos",,,,,,Não aplicável.,Não aplicável.,FALSE
AZACITIDINA SUSP INJ 100 MG,Ajuste Direto Regime Geral,Aquisição de bens móveis,"33690000-3, Medicamentos vários","Centro Hospitalar Lisboa Norte, E. P. E. (508481287)","CELGENE SOCIEDADE UNIPESSOAL, LDA (507791690)","127.440,00 €",08-05-2018,02-02-2018,4 dias,"Portugal, Lisboa, Lisboa","Artigo 24.º, n.º 1, alínea e), subalínea iii) do Código dos Contratos Públicos",,,,,,Não aplicável.,Não aplicável.,FALSE
TRAMETINIB 2 MG COMP,Ajuste Direto Regime Geral,Aquisição de bens móveis,"33690000-3, Medicamentos vários","Centro Hospitalar Lisboa Norte, E. P. E. (508481287)","NOVARTIS FARMA-PRODUT.FARMACEUTICOS, SA (500063524)","41.823,73 €",08-05-2018,02-02-2018,1 dias,"Portugal, Lisboa, Lisboa","Artigo 24.º, n.º 1, alínea e), subalínea iii) do Código dos Contratos Públicos",,,,,,Não aplicável.,Não aplicável.,FALSE
"Trabectedina 0,25 mg Inj",Ajuste Direto Regime Geral,Aquisição de bens móveis,"33690000-3, Medicamentos vários","Centro Hospitalar Lisboa Norte, E. P. E. (508481287)",LOGIFARMA-LOGÍSTICA FARMACÊUTICA S.A. (503934640),"7.521,12 €",08-05-2018,02-02-2018,1 dias,"Portugal, Lisboa, Lisboa","Artigo 24.º, n.º 1, alínea e), subalínea iii) do Código dos Contratos Públicos",,,,,,Não aplicável.,Não aplicável.,FALSE
Aquisição de fator VIII c/ dupla inativação viral 10,Ajuste Direto Regime Geral,Aquisição de bens móveis,"33690000-3, Medicamentos vários","Centro Hospitalar Lisboa Norte, E. P. E. (508481287)","Kedrion Portugal, Lda. (508472830)","9.100,00 €",08-05-2018,04-05-2018,1 dias,"Portugal, Lisboa, Lisboa","Artigo 24.º, n.º 1, alínea e), subalínea ii) do Código dos Contratos Públicos",,,,,,Não aplicável.,Não aplicável.,FALSE
Colistemetato de Sódio 1662500 UI Pó,Ajuste Direto Regime Geral,Aquisição de bens móveis,"33690000-3, Medicamentos vários","Centro Hospitalar Lisboa Norte, E. P. E. (508481287)","TEVA PHARMA-PRODUTOS FARMACEUTICOS, LDA (507045491)","22.318,46 €",08-05-2018,02-02-2018,332 dias,"Portugal, Lisboa, Lisboa","Artigo 24.º, n.º 1, alínea e), subalínea iii) do Código dos Contratos Públicos",,,,,,Não aplicável.,Não aplicável.,FALSE
Rituximab Sol Inj 10 mg/ml amp 10 ml e 50 ml,Ajuste Direto Regime Geral,Aquisição de bens móveis,"33690000-3, Medicamentos vários","Centro Hospitalar Lisboa Norte, E. P. E. (508481287)",ROCHE FARMACEUTICA QUIMICA LDA (500233810),"143.814,60 €",08-05-2018,09-02-2018,1 dias,"Portugal, Lisboa, Lisboa","Artigo 24.º, n.º 1, alínea e), subalínea ii) do Código dos Contratos Públicos",,,,,,Não aplicável.,Não aplicável.,FALSE
"Aquisição de serviços de seguros de acidentes de trabalho para funcionários do Centro Hospitalar Lisboa Norte, E.P.E.",Ajuste Direto Regime Geral,Aquisição de serviços,"66512100-3, Serviços de seguros de acidentes","CENTRO HOSPITALAR LISBOA NORTE, EPE (508481287)","Lusitânia - Companhia de Seguros, S.A. (501689168)","294.245,24 €",08-05-2018,08-05-2018,61 dias,"Portugal, Lisboa, Lisboa","Artigo 24.º, n.º 1, alínea c) do Código dos Contratos Públicos",,,,,,Não aplicável.,Não aplicável.,FALSE
TENOFOVIR 245 MG COMP,Consulta Prévia,Aquisição de bens móveis,"33690000-3, Medicamentos vários","Centro Hospitalar Lisboa Norte, E. P. E. (508481287)","Mylan , Lda (502248793)","11.160,00 €",08-05-2018,06-02-2018,1 dias,"Portugal, Lisboa, Lisboa",Artigo 27.º-A do Código dos Contratos Públicos,,,,,,Não aplicável.,Não aplicável.,FALSE
Aquisição e implementação de software BHealth Flow Imag,Ajuste Direto Regime Geral,Aquisição de bens móveis,"48211000-0, Pacote de software para interconectividade de plataformas","CENTRO HOSPITALAR LISBOA NORTE, EPE (508481287)","Byme - Information technology, Lda (507790960)","9.800,00 €",08-05-2018,08-05-2018,30 dias,"Portugal, Lisboa, Lisboa","Artigo 20.º, n.º 1, alínea d) do Código dos Contratos Públicos",,,,,,Não aplicável.,Não aplicável.,FALSE
Aquisição de Paclitaxel 5 mg/ml inj (NAB-Paclitaxel),Ajuste Direto Regime Geral,Locação de bens móveis<br/>Aquisição de bens móveis,"33690000-3, Medicamentos vários","CENTRO HOSPITALAR LISBOA NORTE, EPE (508481287)","CELGENE SOCIEDADE UNIPESSOAL, LDA (507791690)","24.750,00 €",08-05-2018,02-02-2018,332 dias,"Portugal, Lisboa, Lisboa","Artigo 24.º, n.º 1, alínea e), subalínea iii) do Código dos Contratos Públicos",,,,,,Não aplicável.,Não aplicável.,FALSE
"Compra centralizada de medicamento trabectedina inj. 1 mg e 0,25 mg - Ad-2018-15",Ajuste Direto Regime Geral,Aquisição de bens móveis,"33690000-3, Medicamentos vários","Centro Hospitalar Lisboa Norte, E. P. E. (508481287)","LOGIFARMA - LOGISTICA FARMACEUTICA, S.A. (503934640)","219.368,25 €",07-05-2018,28-03-2018,256 dias,"Portugal, Lisboa, Lisboa","Artigo 24.º, n.º 1, alínea e), subalínea ii) do Código dos Contratos Públicos",,,,,,Não aplicável.,Não aplicável.,FALSE
CP n.º 182A000003 - Aquisição de trouxas cirúrgicas universais e campos cirúrgicos durante o ano de 2018,Concurso público,Aquisição de bens móveis,"33140000-3, Material médico de consumo","Centro Hospitalar Lisboa Norte, E. P. E. (508481287)","3M España, S..L.  (980560241)","25.492,00 €",07-05-2018,04-05-2018,238 dias,"Portugal, Lisboa, Lisboa","Artigo 20.º, n.º 1, alínea b) do Código dos Contratos Públicos",,,,,,Não aplicável.,Não aplicável.,FALSE
CP n.º 182A000003 - Aquisição de trouxas cirúrgicas universais e campos cirúrgicos durante o ano de 2018,Concurso público,Aquisição de bens móveis,"33140000-3, Material médico de consumo","Centro Hospitalar Lisboa Norte, E. P. E. (508481287)","DocWorld, Lda (508592909)","3.024,00 €",07-05-2018,07-05-2018,238 dias,"Portugal, Lisboa, Lisboa","Artigo 20.º, n.º 1, alínea b) do Código dos Contratos Públicos",,,,,,Não aplicável.,Não aplicável.,FALSE
CP n.º 182A000003 - Aquisição de trouxas cirúrgicas universais e campos cirúrgicos durante o ano de 2018,Concurso público,Aquisição de bens móveis,"33140000-3, Material médico de consumo","Centro Hospitalar Lisboa Norte, E. P. E. (508481287)","ANASTACIO SALDANHA UNIPESSOAL, LDA. (505804441)","2.457,00 €",07-05-2018,07-05-2018,238 dias,"Portugal, Lisboa, Lisboa","Artigo 20.º, n.º 1, alínea b) do Código dos Contratos Públicos",,,,,,Não aplicável.,Não aplicável.,FALSE
Aquisição de  material consignado do Serviço de Cirurgia Vascular,Ajuste Direto Regime Geral,Aquisição de bens móveis,"33190000-8, Dispositivos e produtos médicos variados","Centro Hospitalar Lisboa Norte, E. P. E. (508481287)",BIOSONDA (501463313),"18.010,00 €",07-05-2018,07-05-2018,1 dias,"Portugal, Lisboa, Lisboa","Artigo 20.º, n.º 1, alínea d) do Código dos Contratos Públicos",,,,,,Não aplicável.,Não aplicável.,FALSE
Reparação de Um Candeeiro Cirúrgico.,Ajuste Direto Regime Geral,Aquisição de serviços,"50420000-5, Serviços de reparação e manutenção de equipamento médico e cirúrgico","CENTRO HOSPITALAR LISBOA NORTE, EPE (508481287)","GETINGE GROUP PORTUGAL, UNIPESSOAL LDA.(EX-MAQUET) (506819698)","12.300,00 €",07-05-2018,28-06-2016,30 dias,"Portugal, Lisboa, Lisboa","Artigo 20.º, n.º 1, alínea a) do Código dos Contratos Públicos",,,,,,Não aplicável.,Não aplicável.,FALSE
Serviço de Reparação de um Candeeiro Cirúrgico,Ajuste Direto Regime Geral,Aquisição de serviços,"50420000-5, Serviços de reparação e manutenção de equipamento médico e cirúrgico","CENTRO HOSPITALAR LISBOA NORTE, EPE (508481287)","GETINGE GROUP PORTUGAL, UNIPESSOAL LDA.(EX-MAQUET) (506819698)","12.300,00 €",07-05-2018,27-05-2016,30 dias,"Portugal, Lisboa, Lisboa","Artigo 20.º, n.º 1, alínea a) do Código dos Contratos Públicos",,,,,,Não aplicável.,Não aplicável.,FALSE
Colistina 2.000.000 UI Inj,Ajuste Direto Regime Geral,Aquisição de bens móveis,"33690000-3, Medicamentos vários","CENTRO HOSPITALAR LISBOA NORTE, EPE (508481287)","PHARMIS BIOFARMACEUTICA, LDA. (502595442)","6.180,00 €",07-05-2018,26-01-2018,1 dias,"Portugal, Lisboa, Lisboa","Artigo 20.º, n.º 1, alínea d) do Código dos Contratos Públicos",,,,,,Não aplicável.,Não aplicável.,FALSE
Pemetrexedo 100 mg Inj,Ajuste Direto Regime Geral,Aquisição de bens móveis,"33690000-3, Medicamentos vários","Centro Hospitalar Lisboa Norte, E. P. E. (508481287)","Lilly Portugal - Produtos Farmacêuticos, Lda (500165602)","15.831,90 €",07-05-2018,26-01-2018,1 dias,"Portugal, Lisboa, Lisboa","Artigo 24.º, n.º 1, alínea e), subalínea ii) do Código dos Contratos Públicos",,,,,,Não aplicável.,Não aplicável.,FALSE
Reparação de zonas de estacionamento do HPV,Ajuste Direto Regime Geral,Empreitadas de obras públicas,"45233142-6, Reparação de estradas","CENTRO HOSPITALAR LISBOA NORTE, EPE (508481287)","Escalas & Espaços, Lda (505039990)","11.023,78 €",07-05-2018,03-06-2016,5 dias,"Portugal, Lisboa, Lisboa","Artigo 19.º, alínea a) do Código dos Contratos Públicos",,,,,,Não aplicável.,Não aplicável.,FALSE
Aquisição de iloprost sol. p/ inalação por neb. 20 mcg/ml ampolas 1 ml,Ajuste Direto Regime Geral,Aquisição de bens móveis,"33690000-3, Medicamentos vários","Centro Hospitalar Lisboa Norte, E. P. E. (508481287)","BAYER PORTUGAL, LDA (500043256)","14.021,28 €",07-05-2018,18-04-2018,1 dias,"Portugal, Lisboa, Lisboa","Artigo 24.º, n.º 1, alínea e), subalínea iii) do Código dos Contratos Públicos",,,,,,Não aplicável.,Não aplicável.,FALSE
VIRUS HEPATITE C TESTE AMPLIF ARN POR PC,Ajuste Direto Regime Geral,Aquisição de bens móveis,"33696000-5, Reagentes e meios de contraste","Centro Hospitalar Lisboa Norte, E. P. E. (508481287)","Roche Sistemas Diagnóstico, Lda. (504282921)","28.512,00 €",07-05-2018,07-02-2018,2 dias,"Portugal, Lisboa, Lisboa","Artigo 24.º, n.º 1, alínea e), subalínea iii) do Código dos Contratos Públicos",,,,,,Não aplicável.,Não aplicável.,FALSE
VINORELBINA SOL INJ 50 MG AMP,Ajuste Direto Regime Geral,Aquisição de bens móveis,"33690000-3, Medicamentos vários","Centro Hospitalar Lisboa Norte, E. P. E. (508481287)","GENERIS-FARMACEUTICA, S.A. (508107997)","800,00 €",07-05-2018,29-01-2018,1 dias,"Portugal, Lisboa, Lisboa","Artigo 24.º, n.º 1, alínea e), subalínea ii) do Código dos Contratos Públicos",,,,,,Não aplicável.,Não aplicável.,FALSE
FACTOR VII RECOMBINANTE SOL INJ 1 MG ( Novoseven),Ajuste Direto Regime Geral,Aquisição de bens móveis,"33690000-3, Medicamentos vários","Centro Hospitalar Lisboa Norte, E. P. E. (508481287)","Novo Nordisk Comercio Produtos Farmaceuticos, Lda.  (501485210)","33.172,98 €",07-05-2018,31-01-2018,1 dias,"Portugal, Lisboa, Lisboa","Artigo 24.º, n.º 1, alínea e), subalínea iii) do Código dos Contratos Públicos",,,,,,Não aplicável.,Não aplicável.,FALSE
Factor VIII Recombinante S/Albumina 500 UI,Ajuste Direto Regime Geral,Aquisição de bens móveis,"33690000-3, Medicamentos vários","Centro Hospitalar Lisboa Norte, E. P. E. (508481287)","Pfizer Biofarmaceutica, Sociedade Unipessoal Lda. (513300376)","13.095,87 €",07-05-2018,26-01-2018,2 dias,"Portugal, Lisboa, Lisboa","Artigo 24.º, n.º 1, alínea e), subalínea ii) do Código dos Contratos Públicos",,,,,,Não aplicável.,Não aplicável.,FALSE
Antig Legionella Pneumophila Urin Teste,Consulta Prévia,Aquisição de bens móveis,"33696000-5, Reagentes e meios de contraste","Centro Hospitalar Lisboa Norte, E. P. E. (508481287)","BAPTISTA MARQUES, DIAGNÓSTICA REAGENTES, LDA (501439110)","1.400,00 €",07-05-2018,26-01-2018,2 dias,"Portugal, Lisboa, Lisboa",Artigo 27.º-A do Código dos Contratos Públicos,,,,,,Não aplicável.,Não aplicável.,FALSE
Aquisição de hidropolimero fino p/ transferencia de exsudado 20x50 cm penso,Ajuste Direto Regime Geral,Aquisição de bens móveis,"33690000-3, Medicamentos vários","Centro Hospitalar Lisboa Norte, E. P. E. (508481287)","MOLNLYCKE HEALTH CARE COM PROD HOSPITALARES, LDA (511101066)","6.976,80 €",07-05-2018,07-05-2018,1 dias,"Portugal, Lisboa, Lisboa","Artigo 24.º, n.º 1, alínea e), subalínea ii) do Código dos Contratos Públicos",,,,,,Não aplicável.,Não aplicável.,FALSE
Ajuste Direto n.º 181G001683,Ajuste Direto Regime Geral,Aquisição de bens móveis,"33690000-3, Medicamentos vários","Centro Hospitalar Lisboa Norte, E. P. E. (508481287)","ACTELION PHARMACEUTICALS PORTUGAL, LDA (507336488)","6.400,00 €",07-05-2018,07-05-2018,1 dias,"Portugal, Lisboa, Lisboa","Artigo 24.º, n.º 1, alínea e), subalínea iii) do Código dos Contratos Públicos",,,,,,Não aplicável.,Não aplicável.,FALSE
Aquisição de acidos nucleicos reagente extração 48 T,Ajuste Direto Regime Geral,Aquisição de bens móveis,"33696000-5, Reagentes e meios de contraste","Centro Hospitalar Lisboa Norte, E. P. E. (508481287)","WERFEN PORTUGAL, LDA (EX IZASA) (501086110)","7.200,00 €",07-05-2018,19-04-2018,1 dias,"Portugal, Lisboa, Lisboa","Artigo 24.º, n.º 1, alínea e), subalínea iii) do Código dos Contratos Públicos",,,,,,Não aplicável.,Não aplicável.,FALSE
Aquisição de hidropolimero fino p/ transferência de exsudado 20x50 cm penso,Ajuste Direto Regime Geral,Aquisição de bens móveis,"33690000-3, Medicamentos vários","Centro Hospitalar Lisboa Norte, E. P. E. (508481287)","MOLNLYCKE HEALTH CARE COM PROD HOSPITALARES, LDA (511101066)","6.976,80 €",07-05-2018,07-05-2018,1 dias,"Portugal, Lisboa, Lisboa","Artigo 24.º, n.º 1, alínea e), subalínea ii) do Código dos Contratos Públicos",,,,,,Não aplicável.,Não aplicável.,FALSE
Aquisição de selexipag 1600 mcg comp.,Ajuste Direto Regime Geral,Aquisição de bens móveis,"33690000-3, Medicamentos vários","Centro Hospitalar Lisboa Norte, E. P. E. (508481287)","ACTELION PHARMACEUTICALS PORTUGAL, LDA (507336488)","6.400,00 €",07-05-2018,07-05-2018,1 dias,"Portugal, Lisboa, Lisboa","Artigo 24.º, n.º 1, alínea e), subalínea iii) do Código dos Contratos Públicos",,,,,,Não aplicável.,Não aplicável.,FALSE
Aquisição de materiais de manutenção de equipamentos de endoscopia Olympus,Ajuste Direto Regime Geral,Aquisição de bens móveis,"33168000-5, Aparelhos para endoscopia e endocirurgia","CENTRO HOSPITALAR LISBOA NORTE, EPE (508481287)",OLYMPUS IBERIA (980474710),"7.718,00 €",04-05-2018,04-05-2018,3 dias,"Portugal, Lisboa, Lisboa","Artigo 24.º, n.º 1, alínea e), subalínea iii) do Código dos Contratos Públicos",,,,,,Não aplicável.,Não aplicável.,FALSE
Aquisição de serviços de reparação de um ecocardiógrafo do Serviço de Pneumologia - Internamento - Unidade de Cuidados Intensivos Respiratórios (UCIR) - CHLN - HSM,Ajuste Direto Regime Geral,Aquisição de serviços,"50421200-4, Serviços de reparação e manutenção de equipamentos de raios X","CENTRO HOSPITALAR LISBOA NORTE, EPE (508481287)",GENERAL ELECTRIC (500357129),"7.006,71 €",04-05-2018,04-05-2018,3 dias,"Portugal, Lisboa, Lisboa","Artigo 24.º, n.º 1, alínea e), subalínea iii) do Código dos Contratos Públicos",,,,,,Não aplicável.,Não aplicável.,FALSE
Prestação de serviços para alteração de Workflows EDI - Determinação Automàtica de Unidade de Medida,Ajuste Direto Regime Geral,Aquisição de serviços,"75211110-2, Serviços consulares","Centro Hospitalar Lisboa Norte, E. P. E. (508481287)","Softinsa - Engenharia de software Avançado, Lda  (508207908)","5.840,00 €",04-05-2018,04-04-2018,241 dias,"Portugal, Lisboa, Lisboa","Artigo 20.º, n.º 1, alínea d) do Código dos Contratos Públicos",,,,,,Não aplicável.,Não aplicável.,FALSE
EXTRACÇÃO ACIDOS NUCLEICOS P/ MAGNA PURE COMPACT TESTE 32T,Ajuste Direto Regime Geral,Aquisição de bens móveis,"33696000-5, Reagentes e meios de contraste","Centro Hospitalar Lisboa Norte, E. P. E. (508481287)","Roche Sistemas Diagnóstico, Lda. (504282921)","5.290,00 €",04-05-2018,26-01-2018,5 dias,"Portugal, Lisboa, Lisboa","Artigo 24.º, n.º 1, alínea e), subalínea iii) do Código dos Contratos Públicos",,,,,,Não aplicável.,Não aplicável.,FALSE
Aquisição de material para cirurgia vascular,Ajuste Direto Regime Geral,Aquisição de bens móveis,"33190000-8, Dispositivos e produtos médicos variados","Centro Hospitalar Lisboa Norte, E. P. E. (508481287)",J.M.FARMACEUTICA (503550558),"5.980,00 €",04-05-2018,19-04-2018,1 dias,"Portugal, Lisboa, Lisboa","Artigo 20.º, n.º 1, alínea d) do Código dos Contratos Públicos",,,,,,Não aplicável.,Não aplicável.,FALSE
GLUCOSE 5% SOL INJ FRS 100 ML (PLÁSTICO),Consulta Prévia,Aquisição de bens móveis,"33690000-3, Medicamentos vários","Centro Hospitalar Lisboa Norte, E. P. E. (508481287)","GRIFOLS PORTUGAL,PROD.FARMACÊUTICOS HOSPITAL LDA (502041285)","65,00 €",04-05-2018,06-02-2018,1 dias,"Portugal, Lisboa, Lisboa",Artigo 27.º-A do Código dos Contratos Públicos,,,,,,Não aplicável.,Não aplicável.,FALSE
BICARBONATO DE SODIO 720 G + CLORETO DE SODIO 1200 G PO CART,Ajuste Direto Regime Geral,Aquisição de bens móveis,"33690000-3, Medicamentos vários","Centro Hospitalar Lisboa Norte, E. P. E. (508481287)","BAXTER MEDICO - FARMACEUTICA, LDA (503347345)","8.460,00 €",04-05-2018,22-01-2018,1 dias,"Portugal, Lisboa, Lisboa","Artigo 24.º, n.º 1, alínea e), subalínea iii) do Código dos Contratos Públicos",,,,,,Não aplicável.,Não aplicável.,FALSE
TEMOZOLAMIDA CAPS,Ajuste Direto Regime Geral,Aquisição de bens móveis,"33690000-3, Medicamentos vários","Centro Hospitalar Lisboa Norte, E. P. E. (508481287)","ACCORD HEALTHCARE, UNIPESSOAL, LDA (508622263)","2.196,00 €",04-05-2018,30-01-2018,1 dias,"Portugal, Lisboa, Lisboa","Artigo 24.º, n.º 1, alínea e), subalínea ii) do Código dos Contratos Públicos",,,,,,Não aplicável.,Não aplicável.,FALSE
VIRUS HEPATITE B TESTE AMPLIF ADN POR PC,Ajuste Direto Regime Geral,Aquisição de bens móveis,"33696000-5, Reagentes e meios de contraste","Centro Hospitalar Lisboa Norte, E. P. E. (508481287)","Roche Sistemas Diagnóstico, Lda. (504282921)","25.200,00 €",04-05-2018,31-01-2018,5 dias,"Portugal, Lisboa, Lisboa","Artigo 24.º, n.º 1, alínea e), subalínea iii) do Código dos Contratos Públicos",,,,,,Não aplicável.,Não aplicável.,FALSE
FACTOR VII RECOMBINANTE SOL INJ 2 MG,Ajuste Direto Regime Geral,Aquisição de bens móveis,"33690000-3, Medicamentos vários","Centro Hospitalar Lisboa Norte, E. P. E. (508481287)","Novo Nordisk Comercio Produtos Farmaceuticos, Lda.  (501485210)","100.989,00 €",04-05-2018,29-01-2018,1 dias,"Portugal, Lisboa, Lisboa","Artigo 24.º, n.º 1, alínea e), subalínea iii) do Código dos Contratos Públicos",,,,,,Não aplicável.,Não aplicável.,FALSE
Aquisição de serviços de manutenção aos elevadores instalados no Hospital Pulido Valente para o ano de 2018,Ajuste Direto Regime Geral,Aquisição de serviços,"50750000-7, Serviços de manutenção de elevadores","Centro Hospitalar Lisboa Norte, E. P. E. (508481287)","Schindler ascensores e escadas rolantes, SA (502353740)","5.202,00 €",03-05-2018,03-05-2018,270 dias,"Portugal, Lisboa, Lisboa","Artigo 20.º, n.º 1, alínea d) do Código dos Contratos Públicos",,,,,,Não aplicável.,Não aplicável.,FALSE
Factor VIII Recombinante 2000 UI (Octog Alfa),Ajuste Direto Regime Geral,Aquisição de bens móveis,"33690000-3, Medicamentos vários","Centro Hospitalar Lisboa Norte, E. P. E. (508481287)","Shire Pharmaceuticals Portugal, Lda (509264662)","199.408,00 €",03-05-2018,02-02-2018,1 dias,"Portugal, Lisboa, Lisboa","Artigo 24.º, n.º 1, alínea e), subalínea ii) do Código dos Contratos Públicos",,,,,,Não aplicável.,Não aplicável.,FALSE
Compra Centralizada de etanercept  caneta e seringa - AD-AC-2017-151,Ajuste Direto Regime Geral,Aquisição de bens móveis,"33690000-3, Medicamentos vários","Centro Hospitalar Lisboa Norte, E. P. E. (508481287)","Pfizer Biofarmaceutica, Sociedade Unipessoal Lda. (513300376)","1.788.443,09 €",03-05-2018,26-04-2018,239 dias,"Portugal, Lisboa, Lisboa","Artigo 24.º, n.º 1, alínea e) do Código dos Contratos Públicos",,,,,,Não aplicável.,Não aplicável.,FALSE
Polielectrolíticos Soluções P/Hemofiltração,Ajuste Direto Regime Geral,Aquisição de bens móveis,"33690000-3, Medicamentos vários","Centro Hospitalar Lisboa Norte, E. P. E. (508481287)","BAXTER MEDICO - FARMACEUTICA, LDA (503347345)","35.400,00 €",03-05-2018,22-01-2018,1 dias,"Portugal, Lisboa, Lisboa","Artigo 24.º, n.º 1, alínea e), subalínea iii) do Código dos Contratos Públicos",,,,,,Não aplicável.,Não aplicável.,FALSE
Aquisição de material para neurocirurgia,Ajuste Direto Regime Geral,Aquisição de bens móveis,"33190000-8, Dispositivos e produtos médicos variados","Centro Hospitalar Lisboa Norte, E. P. E. (508481287)","Surgyline-Dispositivos Médicos,Lda (509811663)","5.700,00 €",03-05-2018,03-05-2018,1 dias,"Portugal, Lisboa, Lisboa","Artigo 24.º, n.º 1, alínea e), subalínea ii) do Código dos Contratos Públicos",,,,,,Não aplicável.,Não aplicável.,FALSE
Oxigénio Líquido e Gasoso Medicinal,Ajuste Direto Regime Geral,Aquisição de bens móveis,"33690000-3, Medicamentos vários","Centro Hospitalar Lisboa Norte, E. P. E. (508481287)","LINDE PORTUGAL, LDA. (500266344)","99.000,00 €",03-05-2018,26-01-2018,1 dias,"Portugal, Lisboa, Lisboa","Artigo 24.º, n.º 1, alínea e), subalínea iii) do Código dos Contratos Públicos",,,,,,Não aplicável.,Não aplicável.,FALSE
Aquisição de imatinib 100 mg comp. (GIST),Ajuste Direto Regime Geral,Aquisição de bens móveis,"33690000-3, Medicamentos vários","Centro Hospitalar Lisboa Norte, E. P. E. (508481287)","Novartis Farma - Produtos Farmacêuticos, S.A. (500063524)","6.313,50 €",03-05-2018,03-05-2018,1 dias,"Portugal, Lisboa, Lisboa","Artigo 24.º, n.º 1, alínea e), subalínea iii) do Código dos Contratos Públicos",,,,,,Não aplicável.,Não aplicável.,FALSE
Aquisição de nitroglicerina sistema transdermico 10 mg/24 H,Consulta Prévia,Aquisição de bens móveis,"33690000-3, Medicamentos vários","Centro Hospitalar Lisboa Norte, E. P. E. (508481287)","SPCARE ESPECIALIDADES FARMACEUTICAS, LDA (508284872)","261,04 €",03-05-2018,03-05-2018,1 dias,"Portugal, Lisboa, Lisboa",Artigo 27.º-A do Código dos Contratos Públicos,,,,,,Não aplicável.,Não aplicável.,FALSE
"Aquisição de hidropolimero espesso c/ rebordo 15,4x",Ajuste Direto Regime Geral,Aquisição de bens móveis,"33690000-3, Medicamentos vários","Centro Hospitalar Lisboa Norte, E. P. E. (508481287)",SMITH+NEPHEW (503552461),"5.055,00 €",03-05-2018,26-04-2018,1 dias,"Portugal, Lisboa, Lisboa","Artigo 24.º, n.º 1, alínea e), subalínea ii) do Código dos Contratos Públicos",,,,,,Não aplicável.,Não aplicável.,FALSE
Sevoflurano Solução Inalação Frs 250 Ml,Ajuste Direto Regime Geral,Aquisição de bens móveis,"33690000-3, Medicamentos vários","Centro Hospitalar Lisboa Norte, E. P. E. (508481287)","ABBVIE, LDA (510229050)","45.630,00 €",03-05-2018,22-01-2018,2 dias,"Portugal, Lisboa, Lisboa","Artigo 24.º, n.º 1, alínea e), subalínea iii) do Código dos Contratos Públicos",,,,,,Não aplicável.,Não aplicável.,FALSE
Aquisição de sistemas CDI BIV,Ajuste Direto Regime Geral,Aquisição de bens móveis,"33190000-8, Dispositivos e produtos médicos variados","Centro Hospitalar Lisboa Norte, E. P. E. (508481287)",ABBOTT MEDICAL PORTUGAL (504180746),"31.036,00 €",03-05-2018,02-04-2018,1 dias,"Portugal, Lisboa, Lisboa","Artigo 24.º, n.º 1, alínea e), subalínea ii) do Código dos Contratos Públicos",,,,,,Não aplicável.,Não aplicável.,FALSE
Imatinib 100 mg e 400 mg Comp (Gist),Ajuste Direto Regime Geral,Aquisição de bens móveis,"33690000-3, Medicamentos vários","Centro Hospitalar Lisboa Norte, E. P. E. (508481287)","Novartis Farma - Produtos Farmacêuticos, S.A. (500063524)","31.567,85 €",03-05-2018,26-01-2018,339 dias,"Portugal, Lisboa, Lisboa","Artigo 24.º, n.º 1, alínea e), subalínea iii) do Código dos Contratos Públicos",,,,,,Não aplicável.,Não aplicável.,FALSE
SISTEMA ID ABO/D CARDS 4X12,Ajuste Direto Regime Geral,Aquisição de bens móveis,"33696000-5, Reagentes e meios de contraste","Centro Hospitalar Lisboa Norte, E. P. E. (508481287)","BIO-RAD LABORATORIES, LDA (501301321)","5.516,80 €",03-05-2018,09-02-2018,2 dias,"Portugal, Lisboa, Lisboa","Artigo 24.º, n.º 1, alínea e), subalínea iii) do Código dos Contratos Públicos",,,,,,Não aplicável.,Não aplicável.,FALSE
TRASTUZUMAB EMTANSINA 160 MG INJ,Ajuste Direto Regime Geral,Aquisição de bens móveis,"33690000-3, Medicamentos vários","Centro Hospitalar Lisboa Norte, E. P. E. (508481287)",ROCHE FARMACEUTICA QUIMICA LDA (500233810),"48.628,62 €",03-05-2018,12-02-2018,1 dias,"Portugal, Lisboa, Lisboa","Artigo 24.º, n.º 1, alínea e), subalínea iii) do Código dos Contratos Públicos",,,,,,Não aplicável.,Não aplicável.,FALSE
CELULAS LISS/COOMBS 48 T,Ajuste Direto Regime Geral,Aquisição de bens móveis,"33690000-3, Medicamentos vários","Centro Hospitalar Lisboa Norte, E. P. E. (508481287)","Bio Rad Laboratories, Lda (501301321)","8.000,00 €",03-05-2018,09-02-2018,2 dias,"Portugal, Lisboa, Lisboa","Artigo 24.º, n.º 1, alínea e), subalínea iii) do Código dos Contratos Públicos",,,,,,Não aplicável.,Não aplicável.,FALSE
Aquisição de omeprazol sol. inj. ext. 40 mg frs/amp.,Consulta Prévia,Aquisição de bens móveis,"33610000-9, Medicamentos para o tracto digestivo e o metabolismo","Centro Hospitalar Lisboa Norte, E. P. E. (508481287)","Overpharma, Produtos Médicos e Farmacêuticos, Lda. (505792362)","45.000,00 €",03-05-2018,09-04-2018,251 dias,"Portugal, Lisboa, Lisboa","Artigo 20.º, n.º 1, alínea c) do Código dos Contratos Públicos",,,,,,Não aplicável.,Não aplicável.,FALSE
Aquisição de material de Ortopedia,Ajuste Direto Regime Geral,Aquisição de bens móveis,"33190000-8, Dispositivos e produtos médicos variados","Centro Hospitalar Lisboa Norte, E. P. E. (508481287)","MEDTRONIC PORTUGAL, LDA (504223933)","5.941,50 €",02-05-2018,27-04-2018,1 dias,"Portugal, Lisboa, Lisboa","Artigo 24.º, n.º 1, alínea e), subalínea ii) do Código dos Contratos Públicos",,,,,,Não aplicável.,Não aplicável.,FALSE
Aquisição de serviços de manutenção às camas elétricas Mundinter para o ano de 2018,Ajuste Direto Regime Geral,Aquisição de serviços,"50421000-2, Serviços de reparação e manutenção de equipamento médico","Centro Hospitalar Lisboa Norte, E. P. E. (508481287)","Mundinter, S.A. (500199906)","47.695,20 €",02-05-2018,02-05-2018,30 dias,"Portugal, Lisboa, Lisboa","Artigo 24.º, n.º 1, alínea e), subalínea iii) do Código dos Contratos Públicos",,,,,,Não aplicável.,Não aplicável.,FALSE
Aquisição de lâmina de bisturi n.º 15 est.,Ajuste Direto Regime Geral,Aquisição de bens móveis,"33190000-8, Dispositivos e produtos médicos variados","Centro Hospitalar Lisboa Norte, E. P. E. (508481287)","ANASTACIO SALDANHA UNIPESSOAL, LDA. (505804441)","156,40 €",02-05-2018,24-04-2018,1 dias,"Portugal, Lisboa, Lisboa","Artigo 24.º, n.º 1, alínea c) do Código dos Contratos Públicos",,,,,,Não aplicável.,Não aplicável.,FALSE
Aquisição de frigorificos de medicação para o Serviço de Gestão Técnico Farmacêutica - Unidade de Gestão Técnico Farmacêutica - Unidade de Gestão de Medicamentos e Outres Produtos Farmacêuticos - CHLN - HSM,Ajuste Direto Regime Geral,Aquisição de bens móveis,"39711130-9, Frigoríficos","Centro Hospitalar Lisboa Norte, E. P. E. (508481287)","Concessus - Sociedade de Apetrechamento Técnico e Científico, SA (500070040)","15.535,05 €",02-05-2018,20-02-2018,30 dias,"Portugal, Lisboa, Lisboa","Artigo 20.º, n.º 1, alínea d) do Código dos Contratos Públicos",,,,,,Não aplicável.,Não aplicável.,FALSE
FACTOR VIII C/DUPLA INACTIVACAO VIRAL 10,Ajuste Direto Regime Geral,Aquisição de bens móveis,"33690000-3, Medicamentos vários","Centro Hospitalar Lisboa Norte, E. P. E. (508481287)","Kedrion Portugal, Lda. (508472830)","9.100,00 €",02-05-2018,09-02-2018,2 dias,"Portugal, Lisboa, Lisboa","Artigo 24.º, n.º 1, alínea e), subalínea i) do Código dos Contratos Públicos",,,,,,Não aplicável.,Não aplicável.,FALSE
Aquisição de serviços de manutenção ao sistema de chamadas e filas de espera para o ano de 2018,Ajuste Direto Regime Geral,Aquisição de serviços,"50312000-5, Manutenção e reparação de equipamento informático","CENTRO HOSPITALAR LISBOA NORTE, EPE (508481287)","GPTECH - TECNOLOGY CENTRE, S.A. (504983474)","24.164,16 €",02-05-2018,02-05-2018,365 dias,"Portugal, Lisboa, Lisboa","Artigo 24.º, n.º 1, alínea e), subalínea iii) do Código dos Contratos Públicos",,,,,,Não aplicável.,Não aplicável.,FALSE
Aquisição de materiais para manutenção,Ajuste Direto Regime Geral,Aquisição de bens móveis,"35125100-7, Sensores","Centro Hospitalar Lisboa Norte, E. P. E. (508481287)",GENERAL ELECTRIC (500357129),"17.240,80 €",02-05-2018,26-04-2018,30 dias,"Portugal, Lisboa, Lisboa","Artigo 24.º, n.º 1, alínea e), subalínea iii) do Código dos Contratos Públicos",,,,,,Não aplicável.,Não aplicável.,FALSE
FACTOR VIII RECOMBINANTE 1000 UI ( OCTOG,Ajuste Direto Regime Geral,Aquisição de bens móveis,"33690000-3, Medicamentos vários","Centro Hospitalar Lisboa Norte, E. P. E. (508481287)","Shire Pharmaceuticals Portugal, Lda (509264662)","137.093,00 €",02-05-2018,26-02-2018,1 dias,"Portugal, Lisboa, Lisboa","Artigo 24.º, n.º 1, alínea e), subalínea ii) do Código dos Contratos Públicos",,,,,,Não aplicável.,Não aplicável.,FALSE
Aq de OMEPRAZOL SOL INJ EXT 40 MG FRS/AMP,Consulta Prévia,Aquisição de bens móveis,"33690000-3, Medicamentos vários","Centro Hospitalar Lisboa Norte, E. P. E. (508481287)","DLA Farmacêutica, SA (503894427)","4.422,00 €",02-05-2018,23-02-2016,1 dias,"Portugal, Lisboa, Lisboa","Artigo 20.º, n.º 1, alínea c) do Código dos Contratos Públicos",,,,,,Não aplicável.,Não aplicável.,FALSE
Aquisição de próteses para o Serviço de Cirurgia Vascular,Ajuste Direto Regime Geral,Aquisição de bens móveis,"33184000-3, Próteses","Centro Hospitalar Lisboa Norte, E. P. E. (508481287)",BIOSONDA (501463313),"50.500,00 €",02-05-2018,02-05-2018,1 dias,"Portugal, Lisboa, Lisboa","Artigo 24.º, n.º 1, alínea e), subalínea ii) do Código dos Contratos Públicos",,,,,,Não aplicável.,Não aplicável.,FALSE
Aquisição de esomeprazol 40 mg comp. gr.,Consulta Prévia,Aquisição de bens móveis,"33690000-3, Medicamentos vários","Centro Hospitalar Lisboa Norte, E. P. E. (508481287)","Vitalion - Produtos Farmacêuticos, Sociedade unipessoal, Lda (505238683)","970,20 €",02-05-2018,27-02-2018,5 dias,"Portugal, Lisboa, Lisboa","Artigo 20.º, n.º 1, alínea c) do Código dos Contratos Públicos",,,,,,Não aplicável.,Não aplicável.,FALSE
