Objeto do Contrato,Tipo de Procedimento,Tipo(s) de Contrato,CPVs,Entidade(s) Adjudicante(s),Entidade(s) Adjudicatária(s),Preço Contratual,Data de Publicação,Data de Celebração do Contrato,Prazo de Execução,Local de Execução,Fundamentação,Data de Fecho do Contrato,Preço Total Efetivo,Causas das Alterações ao Prazo,Causas das Alterações ao Preço,Estado,N.º registo do Acordo Quadro,Descrição do Acordo Quadro,Procedimento Centralizado
Empreitada de construção de Serviço de Urgência Básica de Moimenta da Beira,Concurso público,Empreitadas de obras públicas,"45215100-8, Obras de construção de edifícios relacionados com serviços de saúde","Administração Regional de Saúde do Norte, I.P. (503135593)","Construções Ezequiel Pinho Moreira, Lda (503320455)","955.346,62 €",14-03-2012,30-06-2011,180 dias,"Portugal, Viseu, Moimenta da Beira","Artigo 19.º, alínea b) do Código dos Contratos Públicos","","",,,,Não aplicável.,Não aplicável.,
Protecções parletais Centro de Reabilitação do Norte,Ajuste Direto Regime Geral,Empreitadas de obras públicas,"45421140-7, Instalação de artigos de carpintaria metálica excepto portas e janelas","Administração Regional de Saúde do Norte, I.P. (503135593)","I.F.H.I. - Instalações de Fluidos Hospitalares e Industriais, Lda (502264543)","59.619,00 €",14-03-2012,21-12-2011,10 dias,"Portugal, Porto, Vila Nova de Gaia","Artigo 19.º, alínea a) do Código dos Contratos Públicos",30-01-2012,"59.619,00 €",,,,Não aplicável.,Não aplicável.,
Adaptação Sala de tratamentos CDP Porto,Ajuste Direto Regime Geral,Empreitadas de obras públicas,"45454000-4, Obras de reestruturação","Administração Regional de Saúde do Norte, I.P. (503135593)","Ideias & Enigmas, Lda (509895786)","13.730,77 €",13-03-2012,20-12-2011,10 dias,"Portugal, Porto, Porto","Artigo 19.º, alínea a) do Código dos Contratos Públicos",30-12-2011,"13.730,77 €",,,,Não aplicável.,Não aplicável.,
Recuperação CS Bonfim,Ajuste Direto Regime Geral,Empreitadas de obras públicas,"45453100-8, Obras de recuperação","Administração Regional de Saúde do Norte, I.P. (503135593)","CREC - Engenharia e Construções, Lda (503854263)","14.967,68 €",13-03-2012,24-11-2011,30 dias,"Portugal, Porto, Porto","Artigo 19.º, alínea a) do Código dos Contratos Públicos",30-12-2011,"14.967,68 €",,,,Não aplicável.,Não aplicável.,
Recuperação painéis século XVI CS Batalha,Ajuste Direto Regime Geral,Aquisição de serviços,"50000000-5, Serviços de reparação e manutenção","Administração Regional de Saúde do Norte, I.P. (503135593)","RicardoTeixeira & Vitor Fonseca - Arqueologia, Lda (505693569)","12.800,00 €",13-03-2012,12-12-2011,15 dias,"Portugal, Porto, Porto","Artigo 20.º, n.º 1, alínea a) do Código dos Contratos Públicos",30-12-2011,"12.800,00 €",,,,Não aplicável.,Não aplicável.,
Remodelação CS Lousada,Ajuste Direto Regime Geral,Empreitadas de obras públicas,"45453000-7, Obras de revisão e recuperação","Administração Regional de Saúde do Norte, I.P. (503135593)","Construções Alvarez, Lda (503999377)","14.818,05 €",13-03-2012,13-12-2011,15 dias,"Portugal, Porto, Lousada","Artigo 19.º, alínea a) do Código dos Contratos Públicos",30-12-2011,"14.818,05 €",,,,Não aplicável.,Não aplicável.,
Adaptações CS Ermesinde,Ajuste Direto Regime Geral,Empreitadas de obras públicas,"45453000-7, Obras de revisão e recuperação","Administração Regional de Saúde do Norte, I.P. (503135593)","Macefe Norte, Lda (504176773)","7.126,34 €",13-03-2012,21-06-2011,30 dias,"Portugal, Porto, Valongo","Artigo 19.º, alínea a) do Código dos Contratos Públicos",15-09-2011,"7.126,34 €",,,,Não aplicável.,Não aplicável.,
Conservação US Sobrado/USF S.João do Sobrado,Ajuste Direto Regime Geral,Empreitadas de obras públicas,"45453000-7, Obras de revisão e recuperação","Administração Regional de Saúde do Norte, I.P. (503135593)","Empriber - Empreiteiros Ibéricos, Lda (501753010)","11.115,54 €",13-03-2012,28-11-2011,15 dias,"Portugal, Porto, Valongo","Artigo 19.º, alínea a) do Código dos Contratos Públicos",30-12-2011,"11.115,54 €",,,,Não aplicável.,Não aplicável.,
Remodelação instalação elétrica USF Casa dos Pescadores,Ajuste Direto Regime Geral,Aquisição de serviços,"51110000-6, Serviços de instalação de equipamento eléctrico","Administração Regional de Saúde do Norte, I.P. (503135593)","Pontal, SA (503868892)","8.833,19 €",13-03-2012,07-07-2011,30 dias,"Portugal, Porto, Póvoa de Varzim","Artigo 20.º, n.º 1, alínea a) do Código dos Contratos Públicos",30-12-2011,"8.833,19 €",,,,Não aplicável.,Não aplicável.,
Manutenção da ventilação/AVAC CS S.João da Pesqueira,Ajuste Direto Regime Geral,Empreitadas de obras públicas,"50710000-5, Serviços de reparação e manutenção de equipamento eléctrico e mecânico em edifícios","Administração Regional de Saúde do Norte, I.P. (503135593)","Tempo de Retorno - Unipessoal, Lda (509691269)","13.860,00 €",13-03-2012,18-11-2011,15 dias,"Portugal, Viseu, São João da Pesqueira","Artigo 19.º, alínea a) do Código dos Contratos Públicos",30-12-2011,"13.860,00 €",,,,Não aplicável.,Não aplicável.,
Conservação Ex-US Meinedo,Ajuste Direto Regime Geral,Empreitadas de obras públicas,"45453000-7, Obras de revisão e recuperação","Administração Regional de Saúde do Norte, I.P. (503135593)","Binómio Elevado, Lda (509361218)","11.181,25 €",13-03-2012,18-11-2011,30 dias,"Portugal, Porto, Lousada","Artigo 19.º, alínea a) do Código dos Contratos Públicos",30-12-2011,"11.181,25 €",,,,Não aplicável.,Não aplicável.,
