freguesia,acronym,validVotesPercentage,votes,dicofre
São Pedro,PS,48.48,48,410104
São Pedro,B.E.,16.16,16,410104
São Pedro,PPD/PSD,11.11,11,410104
São Pedro,CDS-PP,8.08,8,410104
São Pedro,A,4.04,4,410104
São Pedro,PAN,3.03,3,410104
São Pedro,PCP-PEV,3.03,3,410104
São Pedro,PDR,2.02,2,410104
São Pedro,PNR,2.02,2,410104
São Pedro,L,1.01,1,410104
São Pedro,PCTP/MRPP,1.01,1,410104
São Pedro,IL,0,0,410104
São Pedro,MAS,0,0,410104
São Pedro,NC,0,0,410104
São Pedro,PPM.PPV/CDC,0,0,410104
São Pedro,PTP,0,0,410104
São Pedro,PURP,0,0,410104
