%YAML 1.1
%TAG !u! tag:unity3d.com,2011:
--- !u!1 &7658426939551107637
GameObject:
  m_ObjectHideFlags: 0
  m_CorrespondingSourceObject: {fileID: 0}
  m_PrefabInstance: {fileID: 0}
  m_PrefabAsset: {fileID: 0}
  serializedVersion: 6
  m_Component:
  - component: {fileID: 3841367644552360493}
  m_Layer: 0
  m_Name: Level_01
  m_TagString: Untagged
  m_Icon: {fileID: 0}
  m_NavMeshLayer: 0
  m_StaticEditorFlags: 0
  m_IsActive: 1
--- !u!4 &3841367644552360493
Transform:
  m_ObjectHideFlags: 0
  m_CorrespondingSourceObject: {fileID: 0}
  m_PrefabInstance: {fileID: 0}
  m_PrefabAsset: {fileID: 0}
  m_GameObject: {fileID: 7658426939551107637}
  m_LocalRotation: {x: 0, y: 0, z: 0, w: 1}
  m_LocalPosition: {x: 0, y: 0, z: 0}
  m_LocalScale: {x: 1, y: 1, z: 1}
  m_Children:
  - {fileID: 261558516340093211}
  - {fileID: 2934683471104741568}
  - {fileID: 2806325951408011937}
  m_Father: {fileID: 0}
  m_RootOrder: 0
  m_LocalEulerAnglesHint: {x: 0, y: 0, z: 0}
--- !u!1001 &1652720483348559571
PrefabInstance:
  m_ObjectHideFlags: 0
  serializedVersion: 2
  m_Modification:
    m_TransformParent: {fileID: 3841367644552360493}
    m_Modifications:
    - target: {fileID: 4491693654098322963, guid: f64f14078dfaf3b4382c2e9ea69f4aa0,
        type: 3}
      propertyPath: m_LocalPosition.x
      value: 0.01
      objectReference: {fileID: 0}
    - target: {fileID: 4491693654098322963, guid: f64f14078dfaf3b4382c2e9ea69f4aa0,
        type: 3}
      propertyPath: m_LocalPosition.y
      value: -4
      objectReference: {fileID: 0}
    - target: {fileID: 4491693654098322963, guid: f64f14078dfaf3b4382c2e9ea69f4aa0,
        type: 3}
      propertyPath: m_LocalPosition.z
      value: 0
      objectReference: {fileID: 0}
    - target: {fileID: 4491693654098322963, guid: f64f14078dfaf3b4382c2e9ea69f4aa0,
        type: 3}
      propertyPath: m_LocalRotation.x
      value: 0.7071068
      objectReference: {fileID: 0}
    - target: {fileID: 4491693654098322963, guid: f64f14078dfaf3b4382c2e9ea69f4aa0,
        type: 3}
      propertyPath: m_LocalRotation.y
      value: 0
      objectReference: {fileID: 0}
    - target: {fileID: 4491693654098322963, guid: f64f14078dfaf3b4382c2e9ea69f4aa0,
        type: 3}
      propertyPath: m_LocalRotation.z
      value: 0
      objectReference: {fileID: 0}
    - target: {fileID: 4491693654098322963, guid: f64f14078dfaf3b4382c2e9ea69f4aa0,
        type: 3}
      propertyPath: m_LocalRotation.w
      value: 0.7071068
      objectReference: {fileID: 0}
    - target: {fileID: 4491693654098322963, guid: f64f14078dfaf3b4382c2e9ea69f4aa0,
        type: 3}
      propertyPath: m_RootOrder
      value: 1
      objectReference: {fileID: 0}
    - target: {fileID: 4491693654098322963, guid: f64f14078dfaf3b4382c2e9ea69f4aa0,
        type: 3}
      propertyPath: m_LocalEulerAnglesHint.x
      value: 90
      objectReference: {fileID: 0}
    - target: {fileID: 4491693654098322963, guid: f64f14078dfaf3b4382c2e9ea69f4aa0,
        type: 3}
      propertyPath: m_LocalEulerAnglesHint.y
      value: 0
      objectReference: {fileID: 0}
    - target: {fileID: 4491693654098322963, guid: f64f14078dfaf3b4382c2e9ea69f4aa0,
        type: 3}
      propertyPath: m_LocalEulerAnglesHint.z
      value: 0
      objectReference: {fileID: 0}
    - target: {fileID: 8511287009616507962, guid: f64f14078dfaf3b4382c2e9ea69f4aa0,
        type: 3}
      propertyPath: m_Name
      value: Cannon
      objectReference: {fileID: 0}
    m_RemovedComponents: []
  m_SourcePrefab: {fileID: 100100000, guid: f64f14078dfaf3b4382c2e9ea69f4aa0, type: 3}
--- !u!4 &2934683471104741568 stripped
Transform:
  m_CorrespondingSourceObject: {fileID: 4491693654098322963, guid: f64f14078dfaf3b4382c2e9ea69f4aa0,
    type: 3}
  m_PrefabInstance: {fileID: 1652720483348559571}
  m_PrefabAsset: {fileID: 0}
--- !u!1001 &3299412763641200366
PrefabInstance:
  m_ObjectHideFlags: 0
  serializedVersion: 2
  m_Modification:
    m_TransformParent: {fileID: 3841367644552360493}
    m_Modifications:
    - target: {fileID: 809465927352140879, guid: 61dfd91a06023c748959d1e61790931d,
        type: 3}
      propertyPath: m_LocalPosition.x
      value: 0
      objectReference: {fileID: 0}
    - target: {fileID: 809465927352140879, guid: 61dfd91a06023c748959d1e61790931d,
        type: 3}
      propertyPath: m_LocalPosition.y
      value: 4.35
      objectReference: {fileID: 0}
    - target: {fileID: 809465927352140879, guid: 61dfd91a06023c748959d1e61790931d,
        type: 3}
      propertyPath: m_LocalPosition.z
      value: 0
      objectReference: {fileID: 0}
    - target: {fileID: 809465927352140879, guid: 61dfd91a06023c748959d1e61790931d,
        type: 3}
      propertyPath: m_LocalRotation.x
      value: 0.7071068
      objectReference: {fileID: 0}
    - target: {fileID: 809465927352140879, guid: 61dfd91a06023c748959d1e61790931d,
        type: 3}
      propertyPath: m_LocalRotation.y
      value: 0
      objectReference: {fileID: 0}
    - target: {fileID: 809465927352140879, guid: 61dfd91a06023c748959d1e61790931d,
        type: 3}
      propertyPath: m_LocalRotation.z
      value: 0
      objectReference: {fileID: 0}
    - target: {fileID: 809465927352140879, guid: 61dfd91a06023c748959d1e61790931d,
        type: 3}
      propertyPath: m_LocalRotation.w
      value: 0.7071068
      objectReference: {fileID: 0}
    - target: {fileID: 809465927352140879, guid: 61dfd91a06023c748959d1e61790931d,
        type: 3}
      propertyPath: m_RootOrder
      value: 2
      objectReference: {fileID: 0}
    - target: {fileID: 809465927352140879, guid: 61dfd91a06023c748959d1e61790931d,
        type: 3}
      propertyPath: m_LocalEulerAnglesHint.x
      value: 90
      objectReference: {fileID: 0}
    - target: {fileID: 809465927352140879, guid: 61dfd91a06023c748959d1e61790931d,
        type: 3}
      propertyPath: m_LocalEulerAnglesHint.y
      value: 0
      objectReference: {fileID: 0}
    - target: {fileID: 809465927352140879, guid: 61dfd91a06023c748959d1e61790931d,
        type: 3}
      propertyPath: m_LocalEulerAnglesHint.z
      value: 0
      objectReference: {fileID: 0}
    - target: {fileID: 4422698798985098844, guid: 61dfd91a06023c748959d1e61790931d,
        type: 3}
      propertyPath: m_Name
      value: FinishPref
      objectReference: {fileID: 0}
    m_RemovedComponents: []
  m_SourcePrefab: {fileID: 100100000, guid: 61dfd91a06023c748959d1e61790931d, type: 3}
--- !u!4 &2806325951408011937 stripped
Transform:
  m_CorrespondingSourceObject: {fileID: 809465927352140879, guid: 61dfd91a06023c748959d1e61790931d,
    type: 3}
  m_PrefabInstance: {fileID: 3299412763641200366}
  m_PrefabAsset: {fileID: 0}
--- !u!1001 &5105827276695820801
PrefabInstance:
  m_ObjectHideFlags: 0
  serializedVersion: 2
  m_Modification:
    m_TransformParent: {fileID: 3841367644552360493}
    m_Modifications:
    - target: {fileID: -4216859302048453862, guid: e14b3d784091ec746b89a3e10ccc1ec3,
        type: 3}
      propertyPath: m_LocalPosition.x
      value: 8.31
      objectReference: {fileID: 0}
    - target: {fileID: -4216859302048453862, guid: e14b3d784091ec746b89a3e10ccc1ec3,
        type: 3}
      propertyPath: m_LocalPosition.y
      value: -9.77
      objectReference: {fileID: 0}
    - target: {fileID: -4216859302048453862, guid: e14b3d784091ec746b89a3e10ccc1ec3,
        type: 3}
      propertyPath: m_LocalPosition.z
      value: 0
      objectReference: {fileID: 0}
    - target: {fileID: -4216859302048453862, guid: e14b3d784091ec746b89a3e10ccc1ec3,
        type: 3}
      propertyPath: m_LocalRotation.x
      value: 0.7071068
      objectReference: {fileID: 0}
    - target: {fileID: -4216859302048453862, guid: e14b3d784091ec746b89a3e10ccc1ec3,
        type: 3}
      propertyPath: m_LocalRotation.y
      value: -0
      objectReference: {fileID: 0}
    - target: {fileID: -4216859302048453862, guid: e14b3d784091ec746b89a3e10ccc1ec3,
        type: 3}
      propertyPath: m_LocalRotation.z
      value: -0
      objectReference: {fileID: 0}
    - target: {fileID: -4216859302048453862, guid: e14b3d784091ec746b89a3e10ccc1ec3,
        type: 3}
      propertyPath: m_LocalRotation.w
      value: 0.7071068
      objectReference: {fileID: 0}
    - target: {fileID: -4216859302048453862, guid: e14b3d784091ec746b89a3e10ccc1ec3,
        type: 3}
      propertyPath: m_RootOrder
      value: 0
      objectReference: {fileID: 0}
    - target: {fileID: -4216859302048453862, guid: e14b3d784091ec746b89a3e10ccc1ec3,
        type: 3}
      propertyPath: m_LocalEulerAnglesHint.x
      value: 90
      objectReference: {fileID: 0}
    - target: {fileID: -4216859302048453862, guid: e14b3d784091ec746b89a3e10ccc1ec3,
        type: 3}
      propertyPath: m_LocalEulerAnglesHint.y
      value: 0
      objectReference: {fileID: 0}
    - target: {fileID: -4216859302048453862, guid: e14b3d784091ec746b89a3e10ccc1ec3,
        type: 3}
      propertyPath: m_LocalEulerAnglesHint.z
      value: 0
      objectReference: {fileID: 0}
    - target: {fileID: -927199367670048503, guid: e14b3d784091ec746b89a3e10ccc1ec3,
        type: 3}
      propertyPath: m_Name
      value: cylinder (1)
      objectReference: {fileID: 0}
    - target: {fileID: -684568028452062451, guid: e14b3d784091ec746b89a3e10ccc1ec3,
        type: 3}
      propertyPath: m_LocalPosition.x
      value: -8.33
      objectReference: {fileID: 0}
    - target: {fileID: -684568028452062451, guid: e14b3d784091ec746b89a3e10ccc1ec3,
        type: 3}
      propertyPath: m_LocalPosition.y
      value: 0.1
      objectReference: {fileID: 0}
    - target: {fileID: -684568028452062451, guid: e14b3d784091ec746b89a3e10ccc1ec3,
        type: 3}
      propertyPath: m_LocalPosition.z
      value: -2.4
      objectReference: {fileID: 0}
    m_RemovedComponents: []
  m_SourcePrefab: {fileID: 100100000, guid: e14b3d784091ec746b89a3e10ccc1ec3, type: 3}
--- !u!4 &261558516340093211 stripped
Transform:
  m_CorrespondingSourceObject: {fileID: -4216859302048453862, guid: e14b3d784091ec746b89a3e10ccc1ec3,
    type: 3}
  m_PrefabInstance: {fileID: 5105827276695820801}
  m_PrefabAsset: {fileID: 0}
