module musictagger

go 1.14

require (
	github.com/djimenez/iconv-go v0.0.0-20160305225143-8960e66bd3da // indirect
	github.com/gdamore/tcell/v2 v2.0.1-0.20201017141208-acf90d56d591
	github.com/jmoiron/sqlx v1.2.0
	github.com/mattn/go-sqlite3 v1.14.5
	github.com/mikkyang/id3-go v0.0.0-20191012064224-2c6ab3bb1fbd
	github.com/rivo/tview v0.0.0-20201118063654-f007e9ad3893
	google.golang.org/appengine v1.6.7 // indirect
)
