[gd_resource type="TileSet" load_steps=17 format=2]

[ext_resource path="res://Assets/GFX/Environment/ground_cake.png" type="Texture" id=1]
[ext_resource path="res://Assets/GFX/Environment/ground_sand.png" type="Texture" id=2]
[ext_resource path="res://Assets/GFX/Environment/ground_grass.png" type="Texture" id=3]
[ext_resource path="res://Assets/GFX/Environment/ground_snow.png" type="Texture" id=4]
[ext_resource path="res://Assets/GFX/Environment/ground_cake_small.png" type="Texture" id=5]
[ext_resource path="res://Assets/GFX/Environment/ground_sand_small.png" type="Texture" id=6]
[ext_resource path="res://Assets/GFX/Environment/ground_grass_small.png" type="Texture" id=7]
[ext_resource path="res://Assets/GFX/Environment/ground_snow_small.png" type="Texture" id=8]

[sub_resource type="ConvexPolygonShape2D" id=1]
points = PoolVector2Array( -190, -10, -189.473, -38.1566, -178.91, -47.8393, 176.562, -48.1668, 188.595, -38.5967, 190, -10, 158.667, 37.105, -161.305, 48.1081 )

[sub_resource type="ConvexPolygonShape2D" id=2]
points = PoolVector2Array( -190, -10, -189.473, -38.1566, -178.91, -47.8393, 176.562, -48.1668, 188.595, -38.5967, 190, -10, 158.667, 37.105, -161.305, 48.1081 )

[sub_resource type="ConvexPolygonShape2D" id=3]
points = PoolVector2Array( -190, -10, -189.473, -38.1566, -178.91, -47.8393, 176.562, -48.1668, 188.595, -38.5967, 190, -10, 158.667, 37.105, -161.305, 48.1081 )

[sub_resource type="ConvexPolygonShape2D" id=4]
points = PoolVector2Array( -190, -10, -189.473, -38.1566, -178.91, -47.8393, 176.562, -48.1668, 188.595, -38.5967, 190, -10, 158.667, 37.105, -161.305, 48.1081 )

[sub_resource type="ConvexPolygonShape2D" id=5]
points = PoolVector2Array( -91.3809, 4.79537, -99.0573, -18.0282, -99.7927, -38.558, -89.4373, -50.3224, 88.5638, -49.3471, 99.2464, -42.1359, 102.172, -10.9248, 72.9582, 48.1878, -78.2208, 39.8973 )

[sub_resource type="ConvexPolygonShape2D" id=6]
points = PoolVector2Array( -91.3809, 4.79537, -99.0573, -18.0282, -99.7927, -38.558, -89.4373, -50.3224, 88.5638, -49.3471, 99.2464, -42.1359, 102.172, -10.9248, 72.9582, 48.1878, -78.2208, 39.8973 )

[sub_resource type="ConvexPolygonShape2D" id=7]
points = PoolVector2Array( -91.3809, 4.79537, -99.0573, -18.0282, -99.7927, -38.558, -89.4373, -50.3224, 88.5638, -49.3471, 99.2464, -42.1359, 102.172, -10.9248, 72.9582, 48.1878, -78.2208, 39.8973 )

[sub_resource type="ConvexPolygonShape2D" id=8]
points = PoolVector2Array( -91.3809, 4.79537, -99.0573, -18.0282, -99.7927, -38.558, -89.4373, -50.3224, 88.5638, -49.3471, 99.2464, -42.1359, 102.172, -10.9248, 72.9582, 48.1878, -78.2208, 39.8973 )

[resource]
0/name = "GroundCake"
0/texture = ExtResource( 1 )
0/tex_offset = Vector2( 0, 0 )
0/modulate = Color( 1, 1, 1, 1 )
0/region = Rect2( 0, 0, 380, 94 )
0/tile_mode = 0
0/occluder_offset = Vector2( 190, 47 )
0/navigation_offset = Vector2( 190, 47 )
0/shapes = [ {
"autotile_coord": Vector2( 0, 0 ),
"one_way": false,
"one_way_margin": 1.0,
"shape": SubResource( 1 ),
"shape_transform": Transform2D( 1, 0, 0, 1, 190, 47 )
} ]
0/z_index = 0
1/name = "GroundSand"
1/texture = ExtResource( 2 )
1/tex_offset = Vector2( 0, 0 )
1/modulate = Color( 1, 1, 1, 1 )
1/region = Rect2( 0, 0, 380, 94 )
1/tile_mode = 0
1/occluder_offset = Vector2( 190, 47 )
1/navigation_offset = Vector2( 190, 47 )
1/shapes = [ {
"autotile_coord": Vector2( 0, 0 ),
"one_way": false,
"one_way_margin": 1.0,
"shape": SubResource( 2 ),
"shape_transform": Transform2D( 1, 0, 0, 1, 190, 47 )
} ]
1/z_index = 0
2/name = "GroundGrass"
2/texture = ExtResource( 3 )
2/tex_offset = Vector2( 0, 0 )
2/modulate = Color( 1, 1, 1, 1 )
2/region = Rect2( 0, 0, 380, 94 )
2/tile_mode = 0
2/occluder_offset = Vector2( 190, 47 )
2/navigation_offset = Vector2( 190, 47 )
2/shapes = [ {
"autotile_coord": Vector2( 0, 0 ),
"one_way": false,
"one_way_margin": 1.0,
"shape": SubResource( 3 ),
"shape_transform": Transform2D( 1, 0, 0, 1, 190, 47 )
} ]
2/z_index = 0
3/name = "GroundSnow"
3/texture = ExtResource( 4 )
3/tex_offset = Vector2( 0, 0 )
3/modulate = Color( 1, 1, 1, 1 )
3/region = Rect2( 0, 0, 380, 94 )
3/tile_mode = 0
3/occluder_offset = Vector2( 190, 47 )
3/navigation_offset = Vector2( 190, 47 )
3/shapes = [ {
"autotile_coord": Vector2( 0, 0 ),
"one_way": false,
"one_way_margin": 1.0,
"shape": SubResource( 4 ),
"shape_transform": Transform2D( 1, 0, 0, 1, 190, 47 )
} ]
3/z_index = 0
4/name = "GroundCakeSmall"
4/texture = ExtResource( 5 )
4/tex_offset = Vector2( 0, 0 )
4/modulate = Color( 1, 1, 1, 1 )
4/region = Rect2( 0, 0, 201, 100 )
4/tile_mode = 0
4/occluder_offset = Vector2( 100.5, 50 )
4/navigation_offset = Vector2( 100.5, 50 )
4/shapes = [ {
"autotile_coord": Vector2( 0, 0 ),
"one_way": false,
"one_way_margin": 1.0,
"shape": SubResource( 5 ),
"shape_transform": Transform2D( 1, 0, 0, 1, 100.5, 50 )
} ]
4/z_index = 0
5/name = "GroundSandSmall"
5/texture = ExtResource( 6 )
5/tex_offset = Vector2( 0, 0 )
5/modulate = Color( 1, 1, 1, 1 )
5/region = Rect2( 0, 0, 201, 100 )
5/tile_mode = 0
5/occluder_offset = Vector2( 100.5, 50 )
5/navigation_offset = Vector2( 100.5, 50 )
5/shapes = [ {
"autotile_coord": Vector2( 0, 0 ),
"one_way": false,
"one_way_margin": 1.0,
"shape": SubResource( 6 ),
"shape_transform": Transform2D( 1, 0, 0, 1, 100.5, 50 )
} ]
5/z_index = 0
6/name = "GroundGrassSmall"
6/texture = ExtResource( 7 )
6/tex_offset = Vector2( 0, 0 )
6/modulate = Color( 1, 1, 1, 1 )
6/region = Rect2( 0, 0, 201, 100 )
6/tile_mode = 0
6/occluder_offset = Vector2( 100.5, 50 )
6/navigation_offset = Vector2( 100.5, 50 )
6/shapes = [ {
"autotile_coord": Vector2( 0, 0 ),
"one_way": false,
"one_way_margin": 1.0,
"shape": SubResource( 7 ),
"shape_transform": Transform2D( 1, 0, 0, 1, 100.5, 50 )
} ]
6/z_index = 0
7/name = "GroundSnowSmall"
7/texture = ExtResource( 8 )
7/tex_offset = Vector2( 0, 0 )
7/modulate = Color( 1, 1, 1, 1 )
7/region = Rect2( 0, 0, 201, 100 )
7/tile_mode = 0
7/occluder_offset = Vector2( 100.5, 50 )
7/navigation_offset = Vector2( 100.5, 50 )
7/shapes = [ {
"autotile_coord": Vector2( 0, 0 ),
"one_way": false,
"one_way_margin": 1.0,
"shape": SubResource( 8 ),
"shape_transform": Transform2D( 1, 0, 0, 1, 100.5, 50 )
} ]
7/z_index = 0

