[gd_scene load_steps=3 format=1]

[ext_resource path="res://Assets/Sprites/paddle.png" type="Texture" id=1]
[ext_resource path="res://Assets/Sprites/ball.png" type="Texture" id=2]

[node name="Game" type="Node2D"]

[node name="KinematicBody2D" type="KinematicBody2D" parent="."]

transform/pos = Vector2( 320, 320 )
input/pickable = false
collision/layers = 1
collision/mask = 1
collision/margin = 0.08

[node name="Sprite" type="Sprite" parent="KinematicBody2D"]

transform/scale = Vector2( 2, 2 )
texture = ExtResource( 1 )
__meta__ = {
"_edit_lock_": true
}

[node name="Ball" type="RigidBody2D" parent="."]

transform/pos = Vector2( 320, 288 )
input/pickable = false
collision/layers = 1
collision/mask = 1
mode = 0
mass = 1.0
friction = 1.0
bounce = 0.0
gravity_scale = 0.0
custom_integrator = false
continuous_cd = 0
contacts_reported = 0
contact_monitor = false
sleeping = false
can_sleep = true
velocity/linear = Vector2( 0, 0 )
velocity/angular = 0.0
damp_override/linear = 0.0
damp_override/angular = 0.0

[node name="Sprite" type="Sprite" parent="Ball"]

transform/scale = Vector2( 2, 2 )
texture = ExtResource( 2 )
__meta__ = {
"_edit_lock_": true
}


