[gd_scene load_steps=5 format=2]

[ext_resource path="res://Scripts/PlayerBullet.gd" type="Script" id=1]
[ext_resource path="res://Assets/sheet.png" type="Texture" id=2]

[sub_resource type="AtlasTexture" id=1]

atlas = ExtResource( 2 )
region = Rect2( 856, 421, 9, 54 )
margin = Rect2( 0, 0, 0, 0 )

[sub_resource type="CapsuleShape2D" id=2]

custom_solver_bias = 0.0
radius = 4.71233
height = 45.4824

[node name="Bullet" type="Area2D"]

input_pickable = true
gravity_vec = Vector2( 0, 1 )
gravity = 98.0
linear_damp = 0.1
angular_damp = 1.0
audio_bus_override = false
audio_bus_name = "Master"
script = ExtResource( 1 )
__meta__ = {
"_edit_group_": true
}

[node name="Bullet" type="Sprite" parent="."]

texture = SubResource( 1 )

[node name="Collision" type="CollisionShape2D" parent="."]

shape = SubResource( 2 )


