[gd_scene load_steps=5 format=2]

[ext_resource path="res://Scripts/Player.gd" type="Script" id=1]
[ext_resource path="res://Assets/sheet.png" type="Texture" id=2]

[sub_resource type="AtlasTexture" id=1]

atlas = ExtResource( 2 )
region = Rect2( 112, 716, 112, 75 )
margin = Rect2( 0, 0, 0, 0 )

[sub_resource type="CircleShape2D" id=2]

custom_solver_bias = 0.0
radius = 25.369

[node name="Player" type="Area2D"]

position = Vector2( 521.54, 269.814 )
input_pickable = true
gravity_vec = Vector2( 0, 1 )
gravity = 98.0
linear_damp = 0.1
angular_damp = 1.0
audio_bus_override = false
audio_bus_name = "Master"
script = ExtResource( 1 )
__meta__ = {
"_edit_group_": true
}
rotation_speed = 2.6
thrust = 500
max_vel = 400
friction = 0.65

[node name="Ship" type="Sprite" parent="."]

scale = Vector2( 0.6, 0.6 )
texture = SubResource( 1 )
_sections_unfolded = [ "Transform" ]

[node name="Collision" type="CollisionShape2D" parent="."]

position = Vector2( 0.291992, 2.04392 )
shape = SubResource( 2 )
_sections_unfolded = [ "Transform" ]


