{
    "telemetry.enableTelemetry": false,
    "window.title": "${activeEditorShort}${separator}${rootName}",
    "window.titleBarStyle": "custom",
    "workbench.iconTheme": "vscode-simpler-icons",
    "workbench.colorTheme": "Tokyo Night Storm",
    "workbench.startupEditor": "newUntitledFile",
    "explorer.autoReveal": false,
    "editor.renderWhitespace": "trailing",
    "editor.dragAndDrop": true,
    "editor.wordWrap": "on",
    "editor.minimap.enabled": true,
    "editor.minimap.showSlider": "always",
    "editor.minimap.maxColumn": 120,
    "editor.mouseWheelZoom": false,
    "editor.fontSize": 14,
    "editor.fontFamily": "'Droid Sans Mono', 'monospace', monospace, 'Droid Sans Fallback', 'Hack Nerd Font'",
    "editor.insertSpaces": true,
    "editor.tabSize": 2,
    "editor.multiCursorModifier": "ctrlCmd",
    "editor.snippetSuggestions": "top",
    "editor.defaultFormatter": "vscode.html-language-features",
    "editor.formatOnSave": true,
    "gitlens.advanced.messages": {
        "suppressShowKeyBindingsNotice": true
    },
    "git.autofetch": true,
    "html.format.endWithNewline": true,
    "explorer.confirmDelete": false
}
