<?xml version="1.0" encoding="UTF-8"?>
<svg width="64px" height="80px" viewBox="0 0 64 80" version="1.1" xmlns="http://www.w3.org/2000/svg" xmlns:xlink="http://www.w3.org/1999/xlink">
    <!-- Generator: Sketch 54.1 (76490) - https://sketchapp.com -->
    <title>Group 4 Copy</title>
    <desc>Created with Sketch.</desc>
    <defs>
        <rect id="path-1" x="0" y="0" width="57.4358974" height="42.0512821"></rect>
        <path d="M56.7765568,68.5714286 C56.7765568,71.2579592 54.579304,73.4693878 51.9099948,73.4693878 L11.3553114,73.4693878 C8.68600209,73.4693878 6.48874935,71.2579592 6.48874935,68.5714286 L6.48874935,35.1020408 L15.1147305,35.1020408 C15.2436944,35.117551 15.370225,35.1412245 15.5032444,35.1404082 L47.8585819,35.1020408 L56.7765568,35.1020408 L56.7765568,68.5714286 Z M18.6551544,11.4220408 C18.6583987,8.73877551 20.8548404,6.53061224 23.5217164,6.53061224 L39.7435897,6.53061224 C42.412899,6.53061224 44.6101518,8.74204082 44.6101518,11.4285714 L44.6101518,28.5714286 L18.729775,28.5714286 L18.6551544,11.4220408 Z M60.0209314,28.5714286 C61.8126374,28.5714286 63.2653061,30.0334694 63.2653061,31.8367347 L63.2653061,68.5714286 C63.2653061,74.8644898 58.1627159,80 51.9099948,80 L11.3553114,80 C5.10259027,80 0,74.8644898 0,68.5714286 L0,31.8367347 C0,30.0334694 1.45266876,28.5714286 3.24437467,28.5714286 L12.2402145,28.5714286 L12.166405,11.4432653 C12.166405,5.1355102 17.2689953,0 23.5217164,0 L39.7435897,0 C45.9963108,0 51.0989011,5.1355102 51.0989011,11.4285714 L51.0989011,28.5714286 L60.0209314,28.5714286 Z" id="path-2"></path>
    </defs>
    <g id="Summary-page-and-modals" stroke="none" stroke-width="1" fill="none" fill-rule="evenodd">
        <g id="FC-Desktop---Lock-your-price---Summary-page" transform="translate(-213.000000, -1169.000000)">
            <g id="Group-4-Copy" transform="translate(213.000000, 1169.000000)">
                <g id="Group-3" transform="translate(3.076923, 32.820513)">
                    <g id="Rectangle">
                        <use fill="#ADB9C8" xlink:href="#path-1"></use>
                        <use fill="#DEE3E9" xlink:href="#path-1"></use>
                    </g>
                    <path d="M27.7103014,-19.1677913 L27.7103014,26.1763383" id="Line-2-Copy-2" stroke-opacity="0.1" stroke="#FFFFFF" stroke-width="4" stroke-linecap="round" transform="translate(27.710301, 3.504274) rotate(90.000000) translate(-27.710301, -3.504274) "></path>
                    <rect id="Rectangle" fill-opacity="0.1" fill="#000000" x="28.2141251" y="2.002442" width="27.2064777" height="40.04884"></rect>
                    <path d="M5.54206028,38.5470085 L50.3823662,38.5470085 L5.54206028,38.5470085 L5.54206028,3.5042735 L5.54206028,38.5470085 Z M5.54206028,38.5470085 L5.54206028,39.047619 L5.54206028,38.5470085 L5.03823662,38.5470085 L5.54206028,38.5470085 Z" id="Combined-Shape" stroke-opacity="0.4" stroke="#FFFFFF" stroke-width="4" stroke-linecap="round"></path>
                    <path d="M52.9014845,3.5042735 L52.9014845,39.047619" id="Line-2" stroke-opacity="0.1" stroke="#000000" stroke-width="6" stroke-linecap="round"></path>
                </g>
                <g id="01-Atoms/Icons-New/Lock/Close">
                    <mask id="mask-3" fill="white">
                        <use xlink:href="#path-2"></use>
                    </mask>
                    <use id="Mask" fill="#082A5E" xlink:href="#path-2"></use>
                    <g id="01-Atoms/Fills/First-Choice-Colours/Grey-Blue" mask="url(#mask-3)" fill="#5C7491">
                        <g transform="translate(-7.948718, 0.000000)" id="Fill">
                            <rect x="0" y="0" width="79" height="80"></rect>
                        </g>
                    </g>
                </g>
                <path d="M22.0167725,64.2111998 C22.531443,61.7812498 23.0208014,59.3712426 23.4690109,57.0509512 L23.4073687,57.0509512 C21.905721,57.0509512 20.6857698,55.8471048 20.6857698,54.3588 C20.6857698,52.8704952 21.9057209,51.6666488 23.4073687,51.6666488 L24.4899988,51.6666488 C25.2874595,47.7476634 26.0413663,45.5529789 27.3361804,43.4589157 C29.5926949,39.8095241 33.1068462,37.9487179 37.8648724,37.9487179 C40.0347196,37.9487179 41.5451509,38.2226511 43.2555693,38.9102291 C43.4515745,38.9890221 43.6535057,39.0738772 43.9090817,39.184603 C44.0268296,39.2358195 44.0268296,39.2358195 44.20504,39.3136873 L44.5284044,39.4550669 C45.9048356,40.0546464 46.5297493,41.6459999 45.9203444,43.0082942 C45.3124874,44.3671282 43.7076449,44.9808099 42.3346419,44.3827237 L42.0182613,44.2444042 C41.8380158,44.165636 41.8380158,44.165636 41.7253056,44.1165981 C41.5143534,44.0252051 41.3537869,43.9576724 41.2062275,43.8983544 C40.1557569,43.4760714 39.3390217,43.3330204 37.8648724,43.3330204 C33.3588912,43.3330204 31.5545843,45.2091934 30.0668196,51.6666488 L38.976988,51.6666488 C40.4786358,51.6666488 41.6985869,52.8704952 41.6985869,54.3588 C41.6985869,55.8471048 40.4786358,57.0509512 38.976988,57.0509512 L29.0091761,57.0509512 C28.9837294,57.1847882 28.9580959,57.3191645 28.9322769,57.4540753 C28.4464706,59.9925324 27.9105356,62.6419059 27.3442976,65.3153252 C27.3394024,65.3384377 27.334511,65.3615226 27.3296236,65.3845796 L40.6451616,65.3845796 C42.1468093,65.3845796 43.3667604,66.588426 43.3667604,68.0767308 C43.3667604,69.5650357 42.1468093,70.7688821 40.6451616,70.7688821 L24.0214455,70.7687782 C23.965635,70.7695397 23.965635,70.7695397 23.9197735,70.7688821 L21.1831374,70.7688821 C19.6814896,70.7688821 18.4615385,69.5650357 18.4615385,68.0767308 C18.4615385,66.588426 19.6814896,65.3845796 21.1831374,65.3845796 L21.7665151,65.3845796 C21.8483526,65.0036038 21.9319208,64.6118161 22.0167725,64.2111998 Z" id="Mask-Copy" fill="#5C7491" fill-rule="nonzero"></path>
            </g>
        </g>
    </g>
</svg>