<?xml version="1.0" encoding="UTF-8"?>
<svg width="120px" height="16px" viewBox="0 0 120 16" version="1.1" xmlns="http://www.w3.org/2000/svg" xmlns:xlink="http://www.w3.org/1999/xlink">
    <!-- Generator: Sketch 59.1 (86144) - https://sketch.com -->
    <title>Paypal credit button 2</title>
    <desc>Created with Sketch.</desc>
    <g id="Buu-now-pay-later" stroke="none" stroke-width="1" fill="none" fill-rule="evenodd">
        <g id="Artboard" transform="translate(-48.000000, -48.000000)" fill-rule="nonzero">
            <g id="Paypal-credit-button-2" transform="translate(48.000000, 48.000000)">
                <g id="Paypal-credit-button">
                    <g id="Group-2">
                        <g id="Paypal-credit" transform="translate(70.000000, 3.000000)" fill="#FFFFFF">
                            <path d="M27.9502839,0.871360867 C28.0012387,0.672760099 28.1530631,0.523809524 28.3558423,0.523809524 L32.0547422,0.523809524 C35.1458246,0.523809524 37.273966,2.85736854 36.767538,5.78672986 C36.3115449,8.71609118 33.3722869,11 30.3321592,11 L26.5318697,11 C26.3795253,11 26.2781358,10.9006996 26.3290905,10.751749 L27.9502839,0.871360867 Z M29.5210426,8.71609118 L30.1798149,8.71609118 C31.8519631,8.71609118 33.4736764,7.82238772 33.82828,5.78672986 C34.1324488,3.90002257 33.0176833,2.85736854 31.1937107,2.85736854 L30.6867628,2.85736854 C30.5853732,2.85736854 30.4839836,2.90701873 30.4839836,3.00631912 L29.5210426,8.71609118 Z" id="Shape"></path>
                            <path d="M23.0916786,3.15526969 L22.8391096,4.59512525 L25.770881,4.59512525 C25.9223187,4.59512525 26.02345,4.69442564 26.02345,4.84337621 L25.720056,6.58113293 C25.6697497,6.77973369 25.5177934,6.87903408 25.3155307,6.87903408 L22.7888032,6.87903408 C22.5865406,6.87903408 22.4345843,7.02798465 22.3842779,7.22658542 L22.1317089,8.71609118 L25.2652244,8.71609118 C25.416662,8.71609118 25.5177934,8.81539156 25.467487,8.96434213 L25.214918,10.7020988 C25.164093,10.8510494 25.0126553,11 24.8103927,11 L19.1999374,11 C19.0484998,11 18.9473684,10.8510494 18.9473684,10.751749 L20.5649511,0.871360867 C20.6152575,0.672760099 20.8175202,0.523809524 20.9689578,0.523809524 L26.6297194,0.523809524 C26.7308508,0.523809524 26.8828071,0.672760099 26.8319821,0.772060483 L26.5794131,2.5098172 C26.5285881,2.70841796 26.3771504,2.80771835 26.1748877,2.80771835 L23.4458976,2.80771835 C23.2436349,2.85736854 23.0916786,2.95666892 23.0916786,3.15526969 Z" id="Path"></path>
                            <path d="M39.4444982,11 L37.1074665,11 C36.9483587,11 36.8421053,10.9006996 36.8421053,10.751749 L38.5944703,0.871360867 C38.5944703,0.672760099 38.8069773,0.523809524 38.9660851,0.523809524 L41.355971,0.523809524 C41.4622245,0.523809524 41.6213323,0.672760099 41.568478,0.821710675 L39.8689672,10.7020988 C39.8161129,10.8510494 39.6564602,11 39.4444982,11 Z" id="Path"></path>
                            <path d="M18.2780452,11 L15.2965103,11 C15.1419473,11 15.0390812,10.9503498 14.9879119,10.8510494 L13.0345106,6.97833446 L12.9828138,6.97833446 L12.3661446,10.751749 C12.3144478,10.9006996 12.2115817,11 12.0575463,11 L9.69268054,11 C9.53864512,11 9.435779,10.9006996 9.4869483,10.751749 L11.1322787,0.821710675 C11.183448,0.672760099 11.2863141,0.523809524 11.4403495,0.523809524 L15.501715,0.523809524 C17.7125453,0.523809524 19.2550096,1.51681336 18.8952419,3.75107199 C18.6378128,5.19092756 17.5585099,6.48183254 15.9131795,6.7300835 L18.4837774,10.7020988 C18.5866435,10.8013992 18.4326081,11 18.2780452,11 Z M13.2914122,5.24057775 L13.5483137,5.24057775 C14.5252781,5.24057775 15.6045811,5.04197698 15.8103133,3.90002257 C16.0160456,2.80771835 15.3993764,2.60911758 14.3707152,2.60911758 L13.9597782,2.60911758 C13.8052153,2.60911758 13.7028767,2.70841796 13.7028767,2.80771835 L13.2914122,5.24057775 Z" id="Shape"></path>
                            <path d="M45.571773,11 L43.3373931,11 C43.1847175,11 43.0831074,10.9006996 43.134173,10.751749 L44.4035175,2.85736854 L42.3218133,2.85736854 C42.1691376,2.85736854 42.0675275,2.70841796 42.1185931,2.55946739 L42.3723578,0.871360867 C42.4234234,0.672760099 42.575578,0.523809524 42.7787982,0.523809524 L49.786768,0.523809524 C49.8883781,0.523809524 50.0405327,0.672760099 49.9899881,0.821710675 L49.6851579,2.5098172 C49.6851579,2.70841796 49.5324822,2.85736854 49.3297831,2.85736854 L47.2981024,2.85736854 L45.9776923,10.7020988 C45.9776923,10.8510494 45.8255377,11 45.571773,11 Z" id="Path"></path>
                            <path d="M9.10656915,3.23018834 C9.10656915,3.42814532 8.85354172,3.52712381 8.70130961,3.37865607 C8.19525475,2.88376361 7.48605057,2.63631738 6.72696828,2.63631738 C4.95473716,2.63631738 3.587246,3.92303778 3.28382092,5.50669366 C3.03027392,7.13983879 4.0429032,8.3275807 5.81513433,8.3275807 C6.52433851,8.3275807 7.33433802,8.08013447 7.94222733,7.63473125 C8.14433753,7.53575276 8.39788452,7.6842205 8.3469673,7.88217748 L7.94222733,10.2576613 C7.8913101,10.406129 7.78999522,10.5051075 7.63828267,10.5545968 C6.77736594,10.802043 6.11907898,11 5.30907947,11 C0.549358174,11 -0.210243675,7.13983879 0.0427837537,5.50669366 C0.701070718,0.904193761 4.6507925,-0.135080411 7.03039337,0.0133873277 C7.78999522,0.0133873277 8.49919941,0.11236582 9.15696681,0.359812052 C9.4105138,0.458790544 9.51182868,0.656747529 9.46091146,0.904193761 L9.10656915,3.23018834 Z" id="Path"></path>
                        </g>
                        <g id="download" transform="translate(13.000000, 2.000000)" fill="#FFFFFF">
                            <path d="M6.88235294,0.4585 L2.75294118,0.4585 C2.48823529,0.4585 2.22352941,0.6585 2.17058824,0.9085 L0.529411765,10.9085 C0.476470588,11.1085 0.635294118,11.2585 0.847058824,11.2585 L2.80588235,11.2585 C3.07058824,11.2585 3.33529412,11.0585 3.38823529,10.8085 L3.81176471,8.1085 C3.86470588,7.8585 4.07647059,7.6585 4.39411765,7.6585 L5.71764706,7.6585 C8.41764706,7.6585 10.0058824,6.4085 10.4294118,3.9585 C10.5882353,2.9085 10.4294118,2.0585 9.9,1.4585 C9.31764706,0.8085 8.25882353,0.4585 6.88235294,0.4585 Z M7.35882353,4.1085 C7.14705882,5.5085 5.98235294,5.5085 4.92352941,5.5085 L4.28823529,5.5085 L4.71176471,2.9085 C4.71176471,2.7585 4.87058824,2.6585 5.02941176,2.6585 L5.29411765,2.6585 C6.03529412,2.6585 6.72352941,2.6585 7.09411765,3.0585 C7.35882353,3.2585 7.46470588,3.6085 7.35882353,4.1085 Z" id="Shape"></path>
                            <path d="M19.1647059,4.0585 L17.2058824,4.0585 C17.0470588,4.0585 16.8882353,4.1585 16.8882353,4.3085 L16.7823529,4.8085 L16.6235294,4.6085 C16.2,4.0085 15.2470588,3.8085 14.2941176,3.8085 C12.1235294,3.8085 10.2705882,5.3585 9.9,7.5585 C9.68823529,8.6585 9.95294118,9.7085 10.6411765,10.4085 C11.2235294,11.0585 12.1235294,11.3585 13.1294118,11.3585 C14.8764706,11.3585 15.8823529,10.3085 15.8823529,10.3085 L15.7764706,10.8085 C15.7235294,11.0085 15.8823529,11.2085 16.0941176,11.2085 L17.8941176,11.2085 C18.1588235,11.2085 18.4235294,11.0085 18.4764706,10.7585 L19.5352941,4.3585 C19.5882353,4.2585 19.3764706,4.0585 19.1647059,4.0585 Z M16.4647059,7.6585 C16.2529412,8.7085 15.4058824,9.4585 14.2411765,9.4585 C13.6588235,9.4585 13.2352941,9.3085 12.9176471,8.9585 C12.6,8.6085 12.4941176,8.1585 12.6,7.6585 C12.7588235,6.6085 13.7117647,5.8585 14.8235294,5.8585 C15.4058824,5.8585 15.8294118,6.0585 16.1470588,6.3585 C16.4117647,6.7085 16.5176471,7.1585 16.4647059,7.6585 Z" id="Shape"></path>
                            <path d="M29.7,4.0585 L27.7411765,4.0585 C27.5294118,4.0585 27.3705882,4.1585 27.2647059,4.3085 L24.5117647,8.1085 L23.3470588,4.4585 C23.2941176,4.2085 23.0294118,4.0585 22.8176471,4.0585 L20.8588235,4.0585 C20.6470588,4.0585 20.4352941,4.2585 20.5411765,4.5085 L22.7117647,10.5585 L20.6470588,13.2585 C20.4882353,13.4585 20.6470588,13.7585 20.9117647,13.7585 L22.8705882,13.7585 C23.0823529,13.7585 23.2411765,13.6585 23.3470588,13.5085 L29.9647059,4.5085 C30.1235294,4.3585 29.9647059,4.0585 29.7,4.0585 Z" id="Path"></path>
                            <path d="M36.2647059,0.4585 L32.1352941,0.4585 C31.8705882,0.4585 31.6058824,0.6585 31.5529412,0.9085 L29.9117647,10.8585 C29.8588235,11.0585 30.0176471,11.2085 30.2294118,11.2085 L32.3470588,11.2085 C32.5588235,11.2085 32.7176471,11.0585 32.7176471,10.9085 L33.1941176,8.0585 C33.2470588,7.8085 33.4588235,7.6085 33.7764706,7.6085 L35.1,7.6085 C37.8,7.6085 39.3882353,6.3585 39.8117647,3.9085 C39.9705882,2.8585 39.8117647,2.0085 39.2823529,1.4085 C38.6470588,0.8085 37.6411765,0.4585 36.2647059,0.4585 Z M36.7411765,4.1085 C36.5294118,5.5085 35.3647059,5.5085 34.3058824,5.5085 L33.6705882,5.5085 L34.0941176,2.9085 C34.0941176,2.7585 34.2529412,2.6585 34.4117647,2.6585 L34.6764706,2.6585 C35.4176471,2.6585 36.1058824,2.6585 36.4764706,3.0585 C36.7411765,3.2585 36.7941176,3.6085 36.7411765,4.1085 Z" id="Shape"></path>
                            <path d="M48.5470588,4.0585 L46.5882353,4.0585 C46.4294118,4.0585 46.2705882,4.1585 46.2705882,4.3085 L46.1647059,4.8085 L46.0058824,4.6085 C45.5823529,4.0085 44.6294118,3.8085 43.6764706,3.8085 C41.5058824,3.8085 39.6529412,5.3585 39.2823529,7.5585 C39.0705882,8.6585 39.3352941,9.7085 40.0235294,10.4085 C40.6058824,11.0585 41.5058824,11.3585 42.5117647,11.3585 C44.2588235,11.3585 45.2647059,10.3085 45.2647059,10.3085 L45.1588235,10.8085 C45.1058824,11.0085 45.2647059,11.2085 45.4764706,11.2085 L47.2764706,11.2085 C47.5411765,11.2085 47.8058824,11.0085 47.8588235,10.7585 L48.9176471,4.3585 C48.9176471,4.2585 48.7588235,4.0585 48.5470588,4.0585 Z M45.7941176,7.6585 C45.5823529,8.7085 44.7352941,9.4585 43.5705882,9.4585 C42.9882353,9.4585 42.5647059,9.3085 42.2470588,8.9585 C41.9294118,8.6085 41.8235294,8.1585 41.9294118,7.6585 C42.0882353,6.6085 43.0411765,5.8585 44.1529412,5.8585 C44.7352941,5.8585 45.1588235,6.0585 45.4764706,6.3585 C45.7941176,6.7085 45.9,7.1585 45.7941176,7.6585 Z" id="Shape"></path>
                            <path d="M50.8764706,0.7085 L49.1823529,10.8585 C49.1294118,11.0585 49.2882353,11.2085 49.5,11.2085 L51.1941176,11.2085 C51.4588235,11.2085 51.7235294,11.0085 51.7764706,10.7585 L53.4705882,0.8085 C53.5235294,0.6085 53.3647059,0.4585 53.1529412,0.4585 L51.2470588,0.4585 C51.0352941,0.4585 50.9294118,0.5585 50.8764706,0.7085 Z" id="Path"></path>
                        </g>
                        <g id="download-(1)">
                            <path d="M11.2870793,5.03786667 C11.4474885,3.9184 11.2870793,3.17173333 10.6431509,2.4256 C9.94594373,1.67893333 8.71251151,1.35893333 7.15711509,1.35893333 L2.59862916,1.35893333 C2.27666496,1.35893333 2.00855243,1.57226667 1.95470077,1.89226667 L0.0779130435,13.728 C0.0240613811,13.9941333 0.185043478,14.2074667 0.45315601,14.2074667 L3.29583632,14.2074667 L3.08100256,15.4336 C3.02772379,15.5936 3.24198465,15.8069333 3.40296675,15.8069333 L5.81655243,15.8069333 C6.08466496,15.8069333 6.29892583,15.5936 6.35277749,15.3274667 L6.40605627,15.2208 L6.8351509,12.4485333 L6.88900256,12.2885333 C6.94285422,11.9685333 7.15711509,11.8085333 7.42522762,11.8085333 L7.80047059,11.8085333 C10.1069258,11.8085333 11.8765831,10.8490667 12.4133811,8.23626667 C12.6276419,7.1168 12.5205115,6.15733333 11.9304348,5.51733333 C11.7161739,5.35786667 11.5013402,5.14453333 11.2870793,5.03786667 L11.2870793,5.03786667" id="Path" fill="#FFFFFF" opacity="0.7"></path>
                            <path d="M11.2870793,5.03786667 C11.4474885,3.9184 11.2870793,3.17173333 10.6431509,2.4256 C9.94594373,1.67893333 8.71251151,1.35893333 7.15711509,1.35893333 L2.59862916,1.35893333 C2.27666496,1.35893333 2.00855243,1.57226667 1.95470077,1.89226667 L0.0779130435,13.728 C0.0240613811,13.9941333 0.185043478,14.2074667 0.45315601,14.2074667 L3.29583632,14.2074667 L3.99304348,9.7824 L3.93919182,9.9424 C4.04632225,9.62293333 4.26115601,9.4096 4.63639898,9.4096 L5.97696164,9.4096 C8.60538107,9.4096 10.6431509,8.34293333 11.2332276,5.30453333 C11.2332276,5.19786667 11.2332276,5.0912 11.2870793,5.03786667" id="Path" fill="#FFFFFF" opacity="0.7"></path>
                            <path d="M4.74352941,5.03786667 C4.74352941,4.87786667 4.85123274,4.71786667 5.06549361,4.6112 C5.11934527,4.6112 5.2264757,4.55786667 5.27975448,4.55786667 L8.87349361,4.55786667 C9.30258824,4.55786667 9.6778312,4.6112 10.0530742,4.66453333 C10.1607775,4.66453333 10.2140563,4.66453333 10.3750384,4.71786667 C10.42889,4.7712 10.5360205,4.7712 10.6431509,4.82453333 C10.6970026,4.82453333 10.6970026,4.82453333 10.804133,4.87786667 C10.9651151,4.9312 11.1260972,4.98453333 11.2870793,5.03786667 C11.4474885,3.9184 11.2870793,3.17173333 10.6431509,2.47893333 C9.94594373,1.73226667 8.71251151,1.35893333 7.15711509,1.35893333 L2.59862916,1.35893333 C2.27666496,1.35893333 2.00855243,1.6256 1.95470077,1.89226667 L0.0779130435,13.728 C0.0240613811,13.9941333 0.185043478,14.2074667 0.45315601,14.2074667 L3.29583632,14.2074667 L3.99304348,9.7824 L4.74352941,5.03786667 Z" id="Path" fill="#FFFFFF"></path>
                            <g id="Group" opacity="0.2" transform="translate(0.058114, 0.340615)" fill="#231F20">
                                <path d="M11.2063385,4.68597547 C11.4629722,4.82627413 11.6910911,4.99463253 11.8621802,5.19105067 C12.1473288,5.49970773 12.3184179,5.892544 12.4039625,6.34149973 C12.489507,5.44358827 12.3469328,4.7140352 11.8621802,4.15284053 C11.6910911,3.9564224 11.4914871,3.81612373 11.2633682,3.67582507 C11.2633682,3.98448213 11.2633682,4.32119893 11.2063385,4.68597547 Z" id="Path"></path>
                                <path d="M0.114059425,12.6829995 L1.91049537,1.57134507 C1.93901023,1.262688 2.22415879,1.03821013 2.53782221,1.03821013 L7.10019921,1.03821013 C8.6685163,1.03821013 9.89465512,1.37492693 10.5790117,2.13253973 C10.9211899,2.525376 11.1207939,2.97433173 11.2063385,3.47940693 C11.3203979,2.46925653 11.1493088,1.7677632 10.5790117,1.12238933 C9.89465512,0.3367168 8.6685163,0 7.10019921,0 L2.53782221,0 C2.22415879,0 1.93901023,0.224477867 1.88198051,0.533134933 L0,12.3743424 C0,12.4865813 0.0285148563,12.5988203 0.114059425,12.6829995 Z" id="Path"></path>
                                <path d="M3.05108962,13.8615083 L3.02257476,14.0298667 C2.99405991,14.1421056 3.05108962,14.2543445 3.13663419,14.3385237 L3.22217876,13.8615083 L3.05108962,13.8615083 Z" id="Path"></path>
                            </g>
                        </g>
                    </g>
                </g>
            </g>
        </g>
    </g>
</svg>