<?xml version="1.0" standalone="no"?>
<!DOCTYPE svg PUBLIC "-//W3C//DTD SVG 1.1//EN" "http://www.w3.org/Graphics/SVG/1.1/DTD/svg11.dtd">
<svg xmlns="http://www.w3.org/2000/svg">
<defs >
<font id="Raleway" horiz-adv-x="441" ><font-face
    font-family="Raleway Light"
    units-per-em="1000"
    panose-1="2 11 4 3 3 1 1 6 0 3"
    ascent="940"
    descent="-234"
    alphabetic="0" />
<glyph unicode=" " glyph-name="space" horiz-adv-x="251" />
<glyph unicode="!" glyph-name="exclam" horiz-adv-x="239" d="M77 218L182 717H233L127 218H77ZM30 0L52 102H105L81 0H30Z" />
<glyph unicode="&quot;" glyph-name="quotedbl" horiz-adv-x="259" d="M118 540L155 714H200L162 540H118ZM194 540L231 714H276L239 540H194Z" />
<glyph unicode="#" glyph-name="numbersign" horiz-adv-x="641" d="M638 466H519L426 253H553L545 212H407L314 0H270L365 212H169L76 0H32L126 212H19L28 253H146L238 466H113L122 505H257L347 710H391L299 505H495L585 710H629L537 505H647L638 466ZM383 253L476
466H281L188 253H383Z" />
<glyph unicode="$" glyph-name="dollar" horiz-adv-x="592" d="M552 592Q504 668 389 669L328 378Q374 367 412 355T476 324T516 280T531 217Q531 163 510 122T452 52T362 9T249 -6L229 -99H199L219 -5Q80 2 -1 100L35 141Q64 98 113 71T231 39L293 334Q249 344
215 356T156 384T120 424T107 481Q107 533 127 575T182 647T266 694T372 714L394 815H424L402 715Q465 713 509 693T586 632L552 592ZM475 202Q475 254 435 281T317 328L256 39Q357 39 416 81T475 202ZM162 496Q162 448 197 425T304 384L364 668Q310 666 272 652T210
615T174 562T162 496Z" />
<glyph unicode="%" glyph-name="percent" horiz-adv-x="672" d="M211 437Q160 437 130 470T99 553Q99 587 113 617T152 670T207 706T271 720Q322 720 352 687T383 603Q383 570 369 540T330 487T275 451T211 437ZM218 469Q242 469 264 480T304 509T332 550T343
599Q343 637 321 662T264 688Q240 688 218 677T178 648T150 607T139 558Q139 520 161 495T218 469ZM424 -10Q374 -10 343 23T312 107Q312 140 327 170T366 223T421 259T484 273Q534 273 564 240T595 157Q595 123 581 93T542 40T488 4T424 -10ZM430 22Q454 22 476
33T516 62T545 103T556 151Q556 189 534 215T477 241Q453 241 431 230T391 201T362 160T351 111Q351 73 373 48T430 22ZM-1 21L672 713L695 690L22 -3L-1 21Z" />
<glyph unicode="&amp;" glyph-name="ampersand" horiz-adv-x="670" d="M414 110Q364 53 306 22T186 -10Q149 -10 119 2T66 36T32 88T19 155Q19 232 70 290T213 404Q182 452 169 484T156 545Q156 580 172 611T217 667T281 705T359 719Q413 719 454 692T518 614L483
583Q466 627 431 653T351 679Q322 679 295 669T248 641T215 600T203 552Q203 528 216 496T265 415L423 189Q453 237 475 294T510 416H655L646 374H548Q532 310 507 255T448 152L555 0H490L414 110ZM196 33Q248 33 298 62T391 144L238 367L235 370Q154 321 112 272T69
161Q69 102 104 68T196 33Z" />
<glyph unicode="&apos;" glyph-name="quotesingle" horiz-adv-x="182" d="M118 539L155 714H200L162 539H118Z" />
<glyph unicode="(" glyph-name="parenleft" horiz-adv-x="250" d="M46 258Q46 325 63 385T111 504T183 618T270 734L304 714Q272 676 236 624T168 513T115 390T94 266Q94 235 97 200T108 128T125 57T149 -11L108 -33Q79 35 63 112T46 258Z" />
<glyph unicode=")" glyph-name="parenright" horiz-adv-x="250" d="M224 433Q224 372 208 314T163 198T92 83T1 -33L-32 -11Q14 43 52 97T117 206T160 315T175 424Q175 462 171 503T159 583T141 656T121 714L164 734Q190 664 207 586T224 433Z" />
<glyph unicode="*" glyph-name="asterisk" horiz-adv-x="306" d="M138 553L191 613L132 635L147 664L207 640L220 712H254L237 640L308 664L309 635L241 613L269 553L239 535L213 596L159 535L138 553Z" />
<glyph unicode="+" glyph-name="plus" horiz-adv-x="413" d="M369 376V334H239V193H193V334H62V376H193V517H239V376H369Z" />
<glyph unicode="," glyph-name="comma" horiz-adv-x="235" d="M15 -81L46 -2H28L46 85H97L78 -2L42 -81H15Z" />
<glyph unicode="-" glyph-name="hyphen" horiz-adv-x="405" d="M54 249L64 295H338L328 249H54Z" />
<glyph unicode="." glyph-name="period" horiz-adv-x="177" d="M4 0L23 85H66L48 0H4Z" />
<glyph unicode="/" glyph-name="slash" horiz-adv-x="574" d="M626 710L31 0H-26L569 710H626Z" />
<glyph unicode="0" glyph-name="zero" horiz-adv-x="590" d="M229 -10Q187 -10 154 7T96 55T60 128T47 221Q47 299 72 367T141 487T240 567T358 597Q400 597 433 580T491 532T527 459T540 366Q540 288 515 220T446 100T347 20T229 -10ZM239 37Q289 37 334 62T414
131T469 234T489 361Q489 403 480 438T452 497T407 536T348 550Q297 550 252 525T173 455T118 352T98 225Q98 141 135 89T239 37Z" />
<glyph unicode="1" glyph-name="one" horiz-adv-x="389" d="M12 46H147L245 508Q234 496 213 482T167 456T117 435T72 426L82 476Q106 476 135 489T191 520T237 552T258 571H309L198 46H319L309 0H2L12 46Z" />
<glyph unicode="2" glyph-name="two" horiz-adv-x="493" d="M-13 0Q-7 28 5 62T41 132T103 202T201 262Q250 284 289 302T355 341T396 384T411 440Q411 458 405 475T384 505T349 527T298 535Q266 535 238 525T188 501T149 473T125 451L99 486Q103 490 121 505T168
537T234 567T315 581Q352 581 380 571T428 542T456 501T466 452Q466 411 450 381T406 326T337 282T250 241Q210 224 177 199T119 147T78 93T55 46H392L382 0H-13V0Z" />
<glyph unicode="3" glyph-name="three" horiz-adv-x="503" d="M149 -147Q77 -147 30 -115T-31 -27L11 3Q20 -45 58 -73T159 -101Q203 -101 239 -88T302 -50T343 10T358 88Q358 145 322 179T215 213H192L201 257H226Q270 257 305 269T365 302T403 353T416 418Q416
470 383 500T293 530Q237 530 189 503T110 428L82 456Q99 483 123 505T177 543T240 567T307 576Q344 576 374 565T426 535T458 488T470 428Q470 392 457 360T422 302T369 259T302 236Q353 228 381 189T410 92Q410 40 390 -4T334 -79T252 -129T149 -147Z" />
<glyph unicode="4" glyph-name="four" horiz-adv-x="517" d="M299 59H-27L-18 103L424 571H458L359 105H443L433 59H349L310 -127H260L299 59ZM313 105L395 490L38 105H313Z" />
<glyph unicode="5" glyph-name="five" horiz-adv-x="525" d="M158 -149Q86 -149 37 -111T-28 -9L13 12Q28 -40 69 -71T167 -103Q210 -103 250 -86T322 -39T372 31T391 119Q391 184 353 224T252 264Q204 264 157 242T74 177H26Q30 187 43 220T74 297T111 389T147
477T174 544T185 571H508L498 524H212L101 243Q136 275 178 292T266 310Q305 310 338 297T394 259T430 202T443 128Q443 68 419 17T354 -71T263 -128T158 -149Z" />
<glyph unicode="6" glyph-name="six" horiz-adv-x="585" d="M237 -10Q150 -10 99 48T48 208Q48 307 73 398T145 560T255 673T397 715Q464 715 509 678T566 577L526 550Q518 604 481 637T386 670Q338 670 295 646T216 578T153 471T111 331Q129 364 154 391T211
436T276 465T346 475Q388 475 422 460T481 418T518 355T532 277Q532 219 507 167T441 76T347 13T237 -10ZM248 35Q292 35 334 54T409 105T462 179T482 268Q482 302 471 332T440 384T393 419T332 432Q288 432 246 413T171 362T118 287T97 199Q97 165 108 135T139
83T187 48T248 35Z" />
<glyph unicode="7" glyph-name="seven" horiz-adv-x="513" d="M461 536H84L94 583H552L58 -127H1L461 536Z" />
<glyph unicode="8" glyph-name="eight" horiz-adv-x="565" d="M214 -7Q170 -7 135 6T76 43T38 97T25 164Q25 206 42 241T85 304T145 351T210 381Q172 397 147 430T121 508Q121 556 144 593T203 657T284 696T370 710Q403 710 434 700T490 672T529 626T544 563Q544
529 531 501T496 449T446 409T388 381Q435 363 465 323T496 226Q496 174 472 131T408 58T318 10T214 -7ZM227 37Q263 37 302 50T372 88T424 147T445 224Q445 256 432 281T398 323T349 350T293 359Q257 359 219 345T149 307T97 248T76 171Q76 139 89 115T123 73T172
46T227 37ZM303 400Q333 400 366 410T427 440T473 488T492 554Q492 580 482 600T453 635T410 656T359 664Q325 664 292 653T231 622T188 574T171 511Q171 484 182 464T213 429T255 408T303 400Z" />
<glyph unicode="9" glyph-name="nine" horiz-adv-x="569" d="M173 -155Q105 -155 60 -119T3 -17L43 10Q51 -44 88 -77T183 -110Q231 -110 274 -86T353 -18T416 89T458 229Q423 162 359 124T223 85Q181 85 147 100T89 142T52 205T38 283Q38 341 62 393T128 484T222
547T332 570Q419 570 470 512T521 352Q521 253 496 162T425 0T315 -113T173 -155ZM238 128Q282 128 324 147T399 198T452 273T472 361Q472 395 461 425T430 477T382 512T321 525Q277 525 235 506T160 455T107 381T87 292Q87 258 98 228T129 176T177 141T238 128Z"
/>
<glyph unicode=":" glyph-name="colon" horiz-adv-x="174" d="M92 432L111 517H154L136 432H92ZM1 0L19 85H62L44 0H1Z" />
<glyph unicode=";" glyph-name="semicolon" horiz-adv-x="179" d="M94 432L112 517H156L137 432H94ZM-12 -81L19 -2H1L20 85H70L51 -2L15 -81H-12Z" />
<glyph unicode="&lt;" glyph-name="less" horiz-adv-x="544" d="M31 273L449 524V470L103 259L449 48V-7L31 243V273Z" />
<glyph unicode="=" glyph-name="equal" horiz-adv-x="464" d="M77 208V246H375V208H77ZM77 306V344H375V306H77Z" />
<glyph unicode="&gt;" glyph-name="greater" horiz-adv-x="543" d="M495 243L76 -7V48L422 259L76 470V524L495 273V243Z" />
<glyph unicode="?" glyph-name="question" horiz-adv-x="455" d="M131 193Q147 270 176 308T249 370Q275 384 305 398T362 432T405 484T422 564Q422 620 389 648T310 676Q257 676 208 646T126 568L94 590Q114 621 140 645T196 685T258 710T320 719Q350 719 377
710T424 682T457 635T469 570Q469 518 454 483T413 423T355 381T289 349Q271 341 254 330T222 302T195 259T175 193H131ZM91 0L112 98H155L135 0H91Z" />
<glyph unicode="@" glyph-name="at" horiz-adv-x="799" d="M553 15Q585 15 613 42T661 111T694 203T706 301Q706 358 688 408T637 494T556 552T449 574Q375 574 304 541T178 451T89 319T55 161Q55 101 73 51T124 -37T204 -96T308 -117Q347 -117 384 -108T459 -79L465
-106Q423 -126 380 -136T298 -146Q238 -146 188 -123T102 -60T46 36T25 158Q25 219 42 276T90 382T161 472T250 542T350 587T455 603Q518 603 570 580T659 518T716 424T736 308Q736 259 723 202T685 97T624 16T541 -16Q513 -16 498 -2T483 47Q483 54 483 62T486
79Q452 47 408 27T321 6Q287 6 260 19T213 57T183 113T172 184Q172 237 191 285T244 371T320 431T411 453Q461 453 494 429T544 362L562 450H598L523 99Q519 82 518 72T517 55Q517 15 553 15ZM335 40Q359 40 384 48T432 72T472 107T499 150L532 319Q518 369 485
394T409 419Q371 419 336 401T272 351T226 279T209 192Q209 159 218 131T244 83T284 51T335 40Z" />
<glyph unicode="A" glyph-name="A" horiz-adv-x="649" d="M394 710H438L571 0H517L473 234H154L12 0H-43L394 710ZM469 276L403 648L175 276H469Z" />
<glyph unicode="B" glyph-name="B" horiz-adv-x="636" d="M178 710H494Q524 710 546 698T584 665T606 619T614 565Q614 533 604 502T576 445T532 398T477 364Q522 349 545 310T569 219Q569 173 550 133T499 64T427 17T344 0H27L178 710ZM353 46Q384 46 413 61T466
100T504 155T518 219Q518 243 512 264T493 301T462 327T422 337H150L88 46H353ZM404 380Q435 380 463 394T514 433T549 488T562 552Q562 599 538 631T470 664H219L159 380H404Z" />
<glyph unicode="C" glyph-name="C" horiz-adv-x="659" d="M295 -6Q236 -6 191 19T114 86T66 182T49 293Q49 366 79 440T164 576T292 675T453 714Q498 714 534 703T597 671T642 622T668 559L621 535Q612 572 593 597T550 637T497 660T439 667Q390 667 346 652T264
609T196 546T144 468T112 383T100 296Q100 244 114 198T156 117T221 62T308 41Q338 41 372 49T439 74T502 117T558 180L598 159Q572 119 537 88T460 36T377 5T295 -6Z" />
<glyph unicode="D" glyph-name="D" horiz-adv-x="688" d="M178 710H403Q469 710 517 689T597 632T644 546T660 439Q660 344 630 264T545 125T415 33T252 0H27L178 710ZM262 46Q342 46 406 77T514 162T583 284T607 430Q607 481 594 524T553 598T486 646T393 664H219L88
46H262Z" />
<glyph unicode="E" glyph-name="E" horiz-adv-x="584" d="M178 710H619L610 664H219L160 385H501L491 341H151L88 46H487L477 0H27L178 710Z" />
<glyph unicode="F" glyph-name="F" horiz-adv-x="578" d="M178 710H618L608 664H219L160 382H489L480 338H150L78 0H27L178 710Z" />
<glyph unicode="G" glyph-name="G" horiz-adv-x="687" d="M546 110Q425 -5 298 -5Q239 -5 193 20T115 86T66 181T49 292Q49 371 81 447T169 582T295 678T444 715Q495 715 533 704T598 672T642 623T669 560L623 535Q603 605 554 636T433 668Q364 668 304 635T198
548T127 428T100 295Q100 244 115 198T157 118T223 63T310 42Q371 42 432 71T558 166L588 304H436L445 345H641L568 0H523L546 110Z" />
<glyph unicode="H" glyph-name="H" horiz-adv-x="706" d="M178 710H229L160 386H582L651 710H702L551 0H500L572 340H151L78 0H27L178 710Z" />
<glyph unicode="I" glyph-name="I" horiz-adv-x="233" d="M178 709H229L78 0H27L178 709Z" />
<glyph unicode="J" glyph-name="J" horiz-adv-x="464" d="M102 -11Q17 -11 -35 33L-10 74Q9 57 40 47T112 36Q166 36 203 57T265 118T308 216T341 349L418 709H469L392 349Q375 268 354 202T301 88T221 15T102 -11Z" />
<glyph unicode="K" glyph-name="K" horiz-adv-x="606" d="M178 709H229L137 279L619 710H678L332 399L541 0H483L293 368L125 219L78 0H27L178 709Z" />
<glyph unicode="L" glyph-name="L" horiz-adv-x="555" d="M178 710H229L88 46H489L479 0H27L178 710Z" />
<glyph unicode="M" glyph-name="M" horiz-adv-x="842" d="M178 710H229L400 202L788 710H838L687 0H636L767 614L402 135H370L209 614L78 0H27L178 710Z" />
<glyph unicode="N" glyph-name="N" horiz-adv-x="741" d="M178 710H218L554 85L686 709H737L586 0H541L209 614L78 0H27L178 710Z" />
<glyph unicode="O" glyph-name="O" horiz-adv-x="724" d="M297 -5Q237 -5 191 19T113 83T65 177T48 287Q48 369 82 446T172 583T301 679T451 715Q511 715 557 690T634 624T682 530T698 421Q698 340 664 263T574 127T446 31T297 -5ZM307 42Q376 42 438 75T546 162T619
283T646 416Q646 467 632 512T592 592T527 647T440 668Q371 668 309 635T201 548T127 427T100 293Q100 242 114 197T154 117T219 62T307 42Z" />
<glyph unicode="P" glyph-name="P" horiz-adv-x="598" d="M178 710H456Q493 710 521 695T570 654T600 596T611 528Q611 481 592 435T539 351T462 291T368 268H135L78 0H27L178 710ZM376 315Q414 315 447 333T505 382T544 449T559 523Q559 552 551 577T527 622T491
653T443 664H219L145 315H376Z" />
<glyph unicode="Q" glyph-name="Q" horiz-adv-x="723" d="M502 64Q455 32 403 14T297 -5Q237 -5 191 19T113 83T65 177T48 287Q48 369 82 446T172 583T301 679T451 715Q511 715 557 690T634 624T682 530T698 421Q698 374 687 329T654 241T604 161T538 92L593 0H540L502
64ZM307 42Q355 42 398 58T480 102L420 206H472L516 131Q545 159 569 192T610 263T636 339T646 416Q646 467 632 512T592 592T527 647T440 668Q371 668 309 635T201 548T127 427T100 293Q100 242 114 197T154 117T219 62T307 42Z" />
<glyph unicode="R" glyph-name="R" horiz-adv-x="624" d="M27 0L178 710H460Q496 710 525 695T574 654T604 596T615 528Q615 484 599 442T554 365T488 306T407 276L515 0H457L351 268H135L78 0H27ZM380 315Q417 315 450 333T508 381T547 448T562 522Q562 550 554
576T530 621T494 652T447 664H219L145 315H380Z" />
<glyph unicode="S" glyph-name="S" horiz-adv-x="583" d="M240 -6Q82 -6 -6 100L30 141Q62 94 117 67T251 39Q352 39 411 81T470 202Q470 257 424 285T289 334Q244 344 210 356T151 384T115 424T102 481Q102 536 124 579T184 653T274 699T388 715Q454 715 501
695T581 632L546 592Q498 669 378 669Q319 669 278 656T209 619T170 565T157 496Q157 470 167 452T199 421T251 398T325 378Q370 367 407 355T471 324T511 280T526 217Q526 163 505 121T445 51T354 9T240 -6Z" />
<glyph unicode="T" glyph-name="T" horiz-adv-x="579" d="M339 664H93L102 710H646L636 664H390L248 0H198L339 664Z" />
<glyph unicode="U" glyph-name="U" horiz-adv-x="724" d="M298 -5Q236 -5 194 13T127 63T90 137T78 229Q78 288 92 353L168 710H219L143 353Q137 323 133 294T129 237Q129 196 138 161T168 99T223 57T307 42Q375 42 425 69T511 140T569 240T604 353L679 710H730L655
353Q640 281 612 217T539 103T436 24T298 -5Z" />
<glyph unicode="V" glyph-name="V" horiz-adv-x="647" d="M98 710H152L270 64L661 710H715L279 0H232L98 710Z" />
<glyph unicode="W" glyph-name="W" horiz-adv-x="993" d="M97 710H153L271 60L484 406L428 705H478L523 447L678 705H728L546 406L612 60L1006 710H1062L623 0H577L507 365L280 0H234L97 710Z" />
<glyph unicode="X" glyph-name="X" horiz-adv-x="598" d="M281 350L94 710H152L318 387L620 710H678L338 350L519 0H461L302 313L9 0H-49L281 350Z" />
<glyph unicode="Y" glyph-name="Y" horiz-adv-x="602" d="M264 270L93 710H150L300 317L618 710H674L315 268L257 0H207L264 270Z" />
<glyph unicode="Z" glyph-name="Z" horiz-adv-x="593" d="M-28 42L580 664H110L120 710H651L641 668L36 46H507L498 0H-37L-28 42Z" />
<glyph unicode="[" glyph-name="bracketleft" horiz-adv-x="238" d="M17 -40L183 740H281L272 697H221L73 3H125L116 -40H17Z" />
<glyph unicode="\" glyph-name="backslash" horiz-adv-x="514" d="M164 710L426 0H369L106 710H164Z" />
<glyph unicode="]" glyph-name="bracketright" horiz-adv-x="237" d="M-23 -40L-14 3H37L185 697H134L143 740H241L76 -40H-23Z" />
<glyph unicode="^" glyph-name="asciicircum" horiz-adv-x="528" d="M53 303L251 710H294L491 303H445L273 659L97 303H53Z" />
<glyph unicode="_" glyph-name="underscore" horiz-adv-x="500" d="M-9 -46L1 0H367L357 -46H-9Z" />
<glyph unicode="`" glyph-name="grave" horiz-adv-x="204" d="M63 730H118L159 645L122 629L63 730Z" />
<glyph unicode="a" glyph-name="a" horiz-adv-x="591" d="M212 -10Q169 -10 135 8T76 56T40 125T27 209Q27 270 51 327T115 430T208 502T317 529Q350 529 376 519T424 493T460 454T484 407L508 520H559L463 72Q461 64 461 60Q461 45 478 45L468 0Q463 -1 460 -1T453
-2Q433 -2 423 8T412 34Q412 37 412 41T414 53T418 73T424 104Q383 52 326 21T212 -10ZM230 35Q257 35 289 46T350 77T403 121T435 175L471 346Q467 374 454 399T420 443T373 473T317 484Q269 484 226 460T151 398T99 311T79 215Q79 179 90 146T121 89T169 50T230
35Z" />
<glyph unicode="b" glyph-name="b" horiz-adv-x="586" d="M245 -10Q181 -10 139 23T79 104L57 0H12L167 730H217L148 407Q195 461 249 495T365 529Q410 529 443 511T498 462T532 394T543 315Q543 251 518 192T450 88T355 17T245 -10ZM245 35Q292 35 336 58T415
119T469 207T490 308Q490 342 481 374T452 430T406 469T343 484Q313 484 285 473T230 444T181 402T136 351L96 159Q99 132 112 109T145 70T190 44T245 35Z" />
<glyph unicode="c" glyph-name="c" horiz-adv-x="522" d="M222 -10Q177 -10 141 7T80 54T41 124T27 210Q27 274 52 331T119 433T217 503T335 529Q403 529 447 497T506 408L453 392Q441 435 406 459T323 484Q276 484 232 463T154 405T99 320T78 217Q78 179 89 146T119
88T167 49T228 35Q254 35 281 43T332 64T374 94T403 131L449 117Q434 90 410 67T355 26T291 0T222 -10Z" />
<glyph unicode="d" glyph-name="d" horiz-adv-x="591" d="M214 -10Q170 -10 135 8T76 56T40 125T27 209Q27 270 51 327T115 430T208 502T318 529Q350 529 376 519T424 493T460 454T484 407L552 730H603L463 72Q461 62 461 60Q461 45 478 45L468 0Q461 -1 456 -1T446
-1Q412 4 412 35Q412 38 412 41T414 52T417 72T424 104Q383 52 326 21T214 -10ZM233 35Q258 35 289 46T350 76T402 121T435 175L471 346Q467 374 453 399T419 443T373 473T320 484Q271 484 227 460T150 398T98 312T79 217Q79 180 90 147T121 89T169 50T233 35Z"
/>
<glyph unicode="e" glyph-name="e" horiz-adv-x="529" d="M224 -10Q177 -10 141 7T79 55T40 125T27 210Q27 271 50 328T116 430T214 502T337 529Q368 529 397 520T448 494T484 450T498 390Q498 240 226 240Q194 240 159 241T80 245Q79 237 79 228T78 211Q78 174
87 141T116 84T165 45T234 30Q259 30 285 37T336 58T380 91T415 135L457 122Q439 92 414 68T358 27T293 0T224 -10ZM331 488Q284 488 245 471T174 425T121 359T88 283Q130 280 163 279T229 278Q291 278 333 286T402 310T439 345T451 391Q451 416 441 434T414 465T375
482T331 488Z" />
<glyph unicode="f" glyph-name="f" horiz-adv-x="311" d="M133 479H64L73 520H143L146 537Q165 633 214 686T330 740Q358 740 382 731T422 707L396 671Q386 682 368 689T329 696Q281 696 245 656T196 538L193 520H332L323 479H183L37 -213H-13L133 479Z" />
<glyph unicode="g" glyph-name="g" horiz-adv-x="586" d="M165 -223Q79 -223 35 -191T-29 -103L9 -80Q27 -133 72 -157T174 -182Q211 -182 247 -171T312 -139T363 -85T394 -10L418 104Q398 79 373 59T321 23T265 0T209 -8Q166 -8 132 10T75 58T39 127T26 209Q26
269 50 326T114 429T208 501T320 529Q384 529 424 494T488 407L512 520H557L444 -10Q433 -63 406 -103T340 -169T257 -209T165 -223ZM231 35Q262 35 294 47T355 80T404 125T434 175L470 346Q465 376 452 401T418 445T372 473T318 484Q267 484 224 459T148 396T97
310T78 217Q78 180 89 147T120 89T168 50T231 35Z" />
<glyph unicode="h" glyph-name="h" horiz-adv-x="552" d="M167 730H217L146 396Q189 457 250 493T373 529Q436 529 464 494T492 394Q492 373 490 349T481 299L418 0H368L429 290Q439 337 439 373Q439 483 348 483Q318 483 287 471T226 437T171 386T130 322L62
0H12L167 730Z" />
<glyph unicode="i" glyph-name="i" horiz-adv-x="201" d="M122 520H172L62 0H12L122 520ZM167 730H217L198 638H148L167 730Z" />
<glyph unicode="j" glyph-name="j" horiz-adv-x="209" d="M-109 -177Q-139 -177 -163 -169T-205 -140L-171 -107Q-159 -121 -141 -126T-104 -131Q-86 -131 -68 -124T-33 -103T-5 -71T12 -30L129 520H179L63 -28Q56 -61 38 -88T-4 -135T-55 -166T-109 -177ZM174
730H224L204 638H154L174 730Z" />
<glyph unicode="k" glyph-name="k" horiz-adv-x="530" d="M167 730H217L139 361Q196 439 260 485T396 531Q453 531 482 503T512 426Q512 360 460 309T311 232L429 0H374L250 255Q355 277 409 321T464 419Q464 454 443 471T384 489Q318 489 250 435T122 282L62
0H12L167 730Z" />
<glyph unicode="l" glyph-name="l" horiz-adv-x="249" d="M103 -6Q69 -6 50 12T31 63Q31 74 34 88L170 730H220L87 103Q86 98 86 94T85 85Q85 64 97 52T134 40Q145 40 160 42T188 50V10Q171 3 146 -1T103 -6Z" />
<glyph unicode="m" glyph-name="m" horiz-adv-x="874" d="M122 520H169L142 396Q186 459 243 494T359 529Q420 529 448 492T477 385Q519 456 578 492T701 529Q761 529 788 496T815 400Q815 356 803 299L739 0H689L751 290Q761 339 761 379Q761 483 675 483Q645
483 616 471T559 438T509 387T468 321L401 0H351L412 290Q418 317 420 339T423 381Q423 483 338 483Q308 483 278 472T221 439T171 388T130 322L62 0H12L122 520Z" />
<glyph unicode="n" glyph-name="n" horiz-adv-x="552" d="M122 520H169L142 396Q163 426 191 450T250 492T315 519T382 529Q442 529 468 497T494 404Q494 381 491 355T481 299L418 0H368L429 290Q435 318 437 341T440 383Q440 483 357 483Q326 483 293 471T230
437T173 386T130 322L62 0H12L122 520Z" />
<glyph unicode="o" glyph-name="o" horiz-adv-x="569" d="M218 -10Q173 -10 138 7T78 53T40 122T26 207Q26 270 51 328T120 431T218 502T333 529Q377 529 412 512T472 465T510 395T524 310Q524 248 499 190T431 88T333 17T218 -10ZM227 35Q272 35 316 57T395 116T451
201T473 303Q473 341 462 374T432 431T384 470T323 484Q278 484 235 462T156 403T100 316T78 213Q78 175 89 143T119 86T166 49T227 35Z" />
<glyph unicode="p" glyph-name="p" horiz-adv-x="587" d="M123 520H168L146 416Q187 466 243 497T357 529Q401 529 435 511T493 463T529 392T542 309Q542 249 519 192T457 89T364 17T252 -10Q189 -10 147 25T86 112L17 -213H-33L123 520ZM250 35Q299 35 342 59T419
121T471 206T490 302Q490 339 479 372T448 430T400 469T337 484Q311 484 280 473T220 442T168 397T135 344L98 173Q104 144 117 119T150 75T195 46T250 35Z" />
<glyph unicode="q" glyph-name="q" horiz-adv-x="586" d="M202 -10Q159 -10 127 7T72 54T38 122T26 204Q26 268 52 326T120 430T216 502T327 529Q385 529 428 497T489 415L511 520H557L417 -141Q415 -149 415 -151Q415 -166 431 -167L422 -211Q420 -211 418 -211T414
-212Q392 -212 377 -203T361 -171Q361 -167 363 -159L420 112Q318 -10 202 -10ZM224 35Q255 35 284 46T340 75T390 117T432 169L470 345Q467 373 456 398T426 443T382 473T326 484Q277 484 233 460T154 398T99 311T78 212Q78 176 88 144T117 88T163 49T224 35Z"
/>
<glyph unicode="r" glyph-name="r" horiz-adv-x="333" d="M122 520H170L142 392Q184 452 238 486T344 521Q354 521 358 520L348 475Q281 473 224 434T131 325L62 0H12L122 520Z" />
<glyph unicode="s" glyph-name="s" horiz-adv-x="461" d="M167 -10Q110 -10 62 10T-17 70L14 104Q47 66 85 48T175 30Q211 30 241 39T294 64T329 103T342 155Q342 193 307 211T207 246Q172 255 146 264T103 284T76 312T67 351Q67 394 85 427T133 483T202 517T285
529Q343 529 383 509T441 456L408 429Q391 459 355 474T273 489Q242 489 214 482T165 459T130 420T117 364Q117 347 124 336T144 316T179 301T228 287Q267 277 297 267T349 244T382 212T393 167Q393 128 376 96T329 40T258 3T167 -10Z" />
<glyph unicode="t" glyph-name="t" horiz-adv-x="306" d="M129 -6Q94 -6 71 12T48 65Q48 70 48 75T50 87L134 479H64L73 520H143L180 698H230L193 520H308L299 479H184L109 127Q102 95 102 87Q102 64 116 53T152 41Q167 41 180 44T205 51T223 59T234 65L240 25Q236
22 226 17T200 7T167 -2T129 -6Z" />
<glyph unicode="u" glyph-name="u" horiz-adv-x="562" d="M162 -10Q41 -10 41 126Q41 146 43 169T52 220L117 520H166L104 227Q93 177 93 142Q93 35 186 35Q217 35 249 46T310 78T366 128T410 192L479 520H529L437 85Q435 77 434 70T432 61Q432 45 449 45L439
0Q432 -1 427 -1T417 -1Q401 -1 393 9T384 34Q384 37 384 41T386 54T391 79T401 123Q355 60 292 25T162 -10Z" />
<glyph unicode="v" glyph-name="v" horiz-adv-x="476" d="M60 520H112L182 50Q273 162 336 285T432 520H480Q442 389 372 258T195 0H143L60 520Z" />
<glyph unicode="w" glyph-name="w" horiz-adv-x="743" d="M56 520H108L193 50Q240 103 279 161T350 278L298 520H350L385 344Q408 390 425 434T455 520H503Q467 401 400 277L446 50Q540 162 604 285T701 520H750Q710 389 639 258T459 0H407L364 217Q332 162 293
108T207 0H155L56 520Z" />
<glyph unicode="x" glyph-name="x" horiz-adv-x="472" d="M198 259L62 520H117L229 305L233 291L243 303L448 520H503L256 259L392 0H336L225 214L220 227L210 215L8 0H-48L198 259Z" />
<glyph unicode="y" glyph-name="y" horiz-adv-x="478" d="M-36 -183Q-5 -178 16 -170T56 -147T90 -112T127 -59L163 -5L52 520H104L198 49L246 125Q291 197 321 250T374 349T411 434T438 520H488Q474 472 459 431T422 343T366 239T282 103L200 -26Q165 -82 138
-118T84 -177T31 -210T-30 -224L-36 -183Z" />
<glyph unicode="z" glyph-name="z" horiz-adv-x="463" d="M-28 36L412 481H73L82 520H478L470 484L32 39H375L366 0H-36L-28 36Z" />
<glyph unicode="{" glyph-name="braceleft" horiz-adv-x="238" d="M222 697L163 420Q161 410 153 392T126 360Q134 352 136 341T139 319Q139 314 139 309T138 300L76 12H129L119 -31H42Q36 -31 31 -27T26 -12Q26 -5 27 -1L89 289Q90 293 90 297T90 305Q90 319
85 329T66 341L74 381Q84 381 92 387T105 401T114 417T119 431L178 710Q182 730 191 735T206 740H283L274 697H222Z" />
<glyph unicode="|" glyph-name="bar" horiz-adv-x="275" d="M120 -130V775H165V-130H120Z" />
<glyph unicode="}" glyph-name="braceright" horiz-adv-x="238" d="M133 697L142 740H218Q222 740 228 737T235 719Q235 713 234 710L174 431Q173 429 173 425T173 416Q173 404 178 393T198 381L189 341Q171 339 160 323T144 289L83 -1Q79 -18 71 -24T54 -31H-22L-13
12H39L100 300Q102 309 110 327T136 360Q129 369 127 379T124 400Q124 412 126 420L185 697H133Z" />
<glyph unicode="~" glyph-name="asciitilde" horiz-adv-x="473" d="M53 245Q54 248 61 263T81 296T114 326T160 340Q182 340 200 331T236 310T270 290T308 280Q326 280 340 287T363 304T376 322T381 333H415Q415 331 408 318T388 288T353 258T302 245Q278 245
259 254T222 274T188 295T155 304Q138 304 126 295T105 275T92 255T87 245H53V245Z" />
<glyph unicode="&#xa0;" glyph-name="uni00A0" horiz-adv-x="251" />
<glyph unicode="&#xa1;" glyph-name="exclamdown" horiz-adv-x="239" d="M186 498L80 -1H30L136 498H186ZM232 716L211 614H158L182 716H232Z" />
<glyph unicode="&#xa2;" glyph-name="cent" horiz-adv-x="533" d="M175 -120L199 -9Q159 -6 128 14T75 64T42 132T30 210Q30 266 52 321T112 420T202 494T313 528L338 645H368L343 528Q415 526 454 494T508 408L456 392Q442 437 411 459T334 483L239 36Q259 36
283 43T332 62T376 92T406 131L452 117Q435 85 408 62T350 22T287 -2T229 -10L205 -120H175ZM81 216Q81 183 90 153T115 98T155 58T209 38L303 481Q255 477 215 452T145 388T98 305T81 216Z" />
<glyph unicode="&#xa3;" glyph-name="sterling" horiz-adv-x="466" d="M66 370H160Q149 408 138 443T126 516Q126 556 144 592T191 656T257 699T333 715Q384 715 422 687T477 610L440 579Q426 622 394 647T322 672Q294 672 268 660T220 627T187 578T174 519Q174
483 186 447T208 370H377L368 329H216Q217 321 217 312T218 295Q218 265 213 239T192 185T146 122T65 41Q102 49 135 49Q156 49 172 46T204 40T235 33T268 30Q303 30 360 49L364 9Q308 -15 256 -15Q235 -15 217 -12T182 -4T147 3T106 7Q85 7 57 3T5 -7L-2 30Q53
79 87 114T140 177T165 232T172 290Q172 309 169 329H58L66 370Z" />
<glyph unicode="&#xa4;" glyph-name="currency" horiz-adv-x="558" d="M169 475Q192 495 221 506T284 518Q318 518 347 506T400 474L471 545L497 519L426 448Q443 425 453 397T463 336Q463 273 424 223L497 152L473 128L400 198Q377 178 348 167T284 156Q250 156
221 166T169 197L98 128L74 152L145 222Q106 272 106 336Q106 368 116 397T143 449L74 519L101 545L169 475ZM149 335Q149 305 159 280T188 235T231 204T284 193Q312 193 336 204T379 235T409 281T420 337Q420 367 409 393T380 438T337 469T284 480Q257 480 233
469T190 438T160 392T149 335Z" />
<glyph unicode="&#xa5;" glyph-name="yen" horiz-adv-x="642" d="M404 357H487L479 319H375L333 268L328 242H463L456 205H320L276 0H225L269 205H134L142 242H277L283 270L264 319H159L167 357H251L112 710H169L318 317L636 710H693L404 357Z" />
<glyph unicode="&#xa6;" glyph-name="brokenbar" horiz-adv-x="269" d="M162 280V-130H117V280H162ZM162 775V365H117V775H162Z" />
<glyph unicode="&#xa7;" glyph-name="section" horiz-adv-x="481" d="M366 190Q395 169 395 117Q395 66 373 28T316 -36T242 -75T166 -88Q134 -88 108 -81T62 -61T27 -32T0 0L40 31Q68 -5 100 -22T175 -40Q203 -40 232 -30T286 -2T325 43T341 104Q341 128 331
143T305 166T269 178T229 183Q162 186 119 217T76 311Q76 349 92 380T126 430Q112 441 104 464T96 517Q96 562 117 599T170 661T241 701T318 715Q352 715 377 708T419 689T449 661T469 627L425 609Q420 627 408 638T380 656T346 666T310 669Q282 669 253 659T201
630T162 585T147 524Q147 476 179 457T262 436Q292 435 320 429T371 407T407 369T421 312Q421 275 405 242T366 190ZM124 311Q124 270 147 252T201 227T266 218T322 205Q343 221 357 248T372 304Q372 329 361 346T333 373T296 388T255 393Q203 393 169 410Q152
395 138 369T124 311Z" />
<glyph unicode="&#xa8;" glyph-name="dieresis" horiz-adv-x="284" d="M55 640L73 728H117L98 640H55ZM186 640L205 728H248L230 640H186Z" />
<glyph unicode="&#xa9;" glyph-name="copyright" horiz-adv-x="842" d="M431 -7Q353 -7 286 20T171 96T95 211T67 355Q67 432 94 498T170 612T286 687T431 715Q510 715 577 688T693 612T770 498T798 355Q798 277 770 211T693 97T577 21T431 -7ZM432 21Q503 21
564 45T671 113T742 217T768 352Q768 424 743 485T672 592T566 662T432 687Q360 687 299 662T192 593T122 487T96 354Q96 283 121 222T191 117T297 47T432 21ZM439 124Q396 124 355 140T282 186T231 259T211 355Q211 396 224 437T264 512T333 567T432 588Q494 588
544 561T616 481L568 465Q557 489 540 504T505 528T467 540T432 543Q388 543 356 526T303 482T272 422T262 355Q262 310 278 276T319 218T375 182T435 169Q455 169 476 174T516 190T551 216T576 251L624 237Q618 220 603 201T563 164T508 136T439 124Z" />
<glyph unicode="&#xaa;" glyph-name="ordfeminine" horiz-adv-x="410" d="M168 348Q126 348 101 374T76 438Q76 465 89 488T125 527T178 553T243 563Q270 563 295 559T340 545L346 576Q349 589 349 602Q349 635 329 654T272 674Q222 674 154 633L144 664Q220 710
283 710Q337 710 367 684T397 610Q397 589 393 570L360 417Q359 415 359 410Q359 399 372 397L363 354Q334 354 326 364T317 395Q317 399 317 403T318 413Q288 381 249 365T168 348ZM188 386Q209 386 231 392T272 407T304 430T321 459L333 514Q313 524 291 527T244
531Q192 531 158 508T123 447Q123 421 141 404T188 386Z" />
<glyph unicode="&#xab;" glyph-name="guillemotleft" horiz-adv-x="532" d="M36 273L305 448L296 403L75 259L235 116L225 71L29 243L36 273ZM230 273L500 448L490 403L269 259L429 116L420 71L224 243L230 273Z" />
<glyph unicode="&#xac;" glyph-name="logicalnot" horiz-adv-x="554" d="M495 354L447 131H403L441 308H79L89 354H495Z" />
<glyph unicode="&#xad;" glyph-name="uni00AD" horiz-adv-x="537" d="M54 249L64 295H470L461 249H54Z" />
<glyph unicode="&#xae;" glyph-name="registered" horiz-adv-x="842" d="M432 -7Q353 -7 286 20T171 96T95 211T67 355Q67 432 94 498T170 612T286 687T432 715Q510 715 577 688T693 612T770 498T798 355Q798 277 770 211T693 97T577 21T432 -7ZM432 21Q503 21
564 45T670 113T741 218T767 355Q767 426 742 486T672 591T566 661T432 687Q360 687 299 662T192 592T122 487T97 355Q97 283 122 222T191 117T297 47T432 21ZM282 581H472Q501 581 525 569T567 536T595 491T605 439Q605 414 597 391T575 350T541 319T496 303L610
125H564L454 298H323V125H282V581ZM473 334Q518 334 541 365T565 439Q565 484 538 513T469 543H323V334H473Z" />
<glyph unicode="&#xaf;" glyph-name="overscore" horiz-adv-x="372" d="M62 671L70 708H342L334 671H62Z" />
<glyph unicode="&#xb0;" glyph-name="degree" horiz-adv-x="254" d="M181 568Q154 568 138 585T121 629Q121 647 128 664T148 694T178 716T214 724Q241 724 257 706T274 661Q274 642 267 625T246 596T216 576T181 568ZM188 600Q206 600 224 616T242 655Q242 672
233 681T207 690Q187 690 171 675T154 638Q154 621 163 611T188 600Z" />
<glyph unicode="&#xb1;" glyph-name="plusminus" horiz-adv-x="484" d="M71 70V113H385V70H71ZM385 382V339H252V195H205V339H71V382H205V526H252V382H385Z" />
<glyph unicode="&#xb2;" glyph-name="twosuperior" horiz-adv-x="367" d="M62 413Q70 451 84 479T117 529T162 565T219 592Q245 602 272 611T322 632T359 663T374 710Q374 737 354 757T289 777Q265 777 244 771T207 757T177 738T156 720L137 744Q140 748 153 759T187
781T237 802T301 811Q359 811 386 784T414 718Q414 684 400 661T363 622T311 595T250 573Q214 561 191 545T153 512T132 478T122 447H355L348 413H62Z" />
<glyph unicode="&#xb3;" glyph-name="threesuperior" horiz-adv-x="370" d="M205 407Q146 407 114 432T77 499L105 520Q105 488 131 466T211 443Q237 443 260 449T302 467T331 494T342 529Q342 561 309 579T216 598H195L201 630H223Q291 630 329 651T368 711Q368
742 343 760T277 778Q238 778 206 763T154 721L135 747Q158 776 198 793T284 811Q340 811 373 785T406 717Q406 679 379 653T300 615Q336 608 356 586T377 531Q377 503 362 480T323 441T268 416T205 407Z" />
<glyph unicode="&#xb4;" glyph-name="acute" horiz-adv-x="203" d="M66 629L35 645L111 730H168L66 629Z" />
<glyph unicode="&#xb5;" glyph-name="mu" horiz-adv-x="591" d="M131 520H181L119 227Q108 177 108 142Q108 35 202 35Q232 35 264 46T325 78T380 128T424 192L494 520H545L449 70Q448 67 448 60Q448 45 465 45L454 0Q419 0 411 11T402 40Q402 42 403 52T407 76T411
102T416 123Q396 94 370 70T314 28T253 0T190 -10Q142 -10 117 14T85 82L25 -212H-25L131 520Z" />
<glyph unicode="&#xb6;" glyph-name="paragraph" horiz-adv-x="565" d="M64 424Q64 488 87 541T152 631T255 689T389 710H605L596 669H530L370 -80H326L394 237H318L250 -80H206L273 237Q173 239 119 288T64 424ZM109 434Q109 395 122 367T159 320T214 291T282
279L365 669Q304 669 257 651T176 602T126 528T109 434ZM485 669H410L327 279H402L485 669Z" />
<glyph unicode="&#xb7;" glyph-name="middot" horiz-adv-x="174" d="M53 248L75 349H118L97 248H53Z" />
<glyph unicode="&#xb8;" glyph-name="cedilla" horiz-adv-x="258" d="M8 -125Q21 -132 42 -138T87 -144Q152 -144 152 -99Q152 -83 141 -77T111 -71Q91 -71 68 -76T32 -85L106 15L130 3L86 -53Q95 -49 105 -48T124 -47Q182 -47 182 -93Q182 -131 155 -151T77 -171Q51
-171 29 -166T-11 -152L8 -125Z" />
<glyph unicode="&#xb9;" glyph-name="onesuperior" horiz-adv-x="253" d="M264 447L257 412H72L79 447H157L225 769Q219 763 207 755T180 739T151 726T124 721L131 756Q146 756 164 764T197 782T222 801T234 811H270L192 447H264Z" />
<glyph unicode="&#xba;" glyph-name="ordmasculine" horiz-adv-x="431" d="M223 348Q191 348 166 359T124 391T97 438T88 495Q88 537 105 576T152 644T219 692T300 710Q331 710 356 699T400 667T427 620T437 562Q437 521 420 483T373 414T305 366T223 348ZM231
385Q261 385 290 399T342 436T379 491T393 556Q393 605 365 638T292 671Q262 671 234 658T182 621T145 566T131 500Q131 451 158 418T231 385Z" />
<glyph unicode="&#xbb;" glyph-name="guillemotright" horiz-adv-x="532" d="M477 243L209 71L218 116L439 259L279 403L288 448L484 273L477 243ZM283 243L14 71L24 116L245 259L85 403L94 448L289 273L283 243Z" />
<glyph unicode="&#xbc;" glyph-name="onequarter" horiz-adv-x="758" d="M591 106H373L380 138L663 393H687L633 140H687L680 106H626L603 0H569L591 106ZM599 140L642 342L420 140H599ZM53 21L726 713L749 690L76 -3L53 21ZM254 367L247 332H62L69 367H147L215
689Q209 683 197 675T170 659T141 646T114 641L121 676Q136 676 154 684T187 702T212 721T224 731H260L182 367H254Z" />
<glyph unicode="&#xbd;" glyph-name="onehalf" horiz-adv-x="795" d="M407 0Q423 76 461 116T563 180Q588 189 615 198T664 219T700 250T714 297Q714 325 695 344T632 364Q608 364 588 358T551 344T522 325T500 306L481 331Q485 335 497 346T531 368T580 389T643
398Q700 398 727 371T754 305Q754 272 741 249T705 210T653 183T592 160Q557 148 534 132T497 99T476 65T466 34H700L692 0H407ZM25 21L698 713L721 690L48 -3L25 21ZM258 367L251 332H66L73 367H151L219 689Q213 683 201 675T174 659T145 646T118 641L125 676Q140
676 158 684T191 702T216 721T228 731H264L186 367H258Z" />
<glyph unicode="&#xbe;" glyph-name="threequarters" horiz-adv-x="771" d="M189 327Q165 327 143 333T103 350T74 379T63 419L91 440Q91 411 118 387T196 363Q222 363 246 369T288 387T317 414T328 449Q328 481 294 499T202 518H181L187 550H209Q277 550 315
570T354 632Q354 662 328 680T263 698Q224 698 192 683T140 641L121 667Q144 696 184 713T270 731Q326 731 359 705T392 638Q392 557 286 535Q322 528 342 505T363 451Q363 423 349 400T310 361T254 336T189 327ZM600 106H382L389 138L672 393H696L642 140H696L689
106H635L612 0H578L600 106ZM608 140L651 342L429 140H608ZM86 21L759 713L782 690L109 -3L86 21Z" />
<glyph unicode="&#xbf;" glyph-name="questiondown" horiz-adv-x="450" d="M301 313Q293 274 282 246T256 198T223 163T183 136Q157 122 127 108T70 74T27 22T10 -58Q10 -114 43 -142T122 -170Q175 -170 224 -140T306 -62L338 -84Q318 -115 292 -139T236 -179T174
-204T112 -213Q82 -213 55 -204T8 -176T-25 -129T-37 -64Q-37 -12 -22 23T19 83T77 125T143 157Q161 165 178 176T210 204T237 247T257 313H301ZM341 506L320 408H277L297 506H341Z" />
<glyph unicode="&#xc0;" glyph-name="Agrave" horiz-adv-x="649" d="M394 710H438L571 0H517L473 234H154L12 0H-43L394 710ZM469 276L403 648L175 276H469ZM366 918H421L462 833L425 817L366 918Z" />
<glyph unicode="&#xc1;" glyph-name="Aacute" horiz-adv-x="649" d="M394 710H438L571 0H517L473 234H154L12 0H-43L394 710ZM469 276L403 648L175 276H469ZM430 816L399 832L475 917H532L430 816Z" />
<glyph unicode="&#xc2;" glyph-name="Acircumflex" horiz-adv-x="649" d="M394 710H438L571 0H517L473 234H154L12 0H-43L394 710ZM469 276L403 648L175 276H469ZM331 836L440 917H477L552 836L519 819L451 882L357 819L331 836Z" />
<glyph unicode="&#xc3;" glyph-name="Atilde" horiz-adv-x="649" d="M394 710H438L571 0H517L473 234H154L12 0H-43L394 710ZM469 276L403 648L175 276H469ZM496 834Q475 834 460 840T433 853T410 867T384 874Q368 874 357 867T340 852T330 836T326 826H292Q293
830 299 843T317 871T347 897T391 909Q410 909 423 903T449 889T473 875T503 869Q522 869 534 876T553 891T564 907T568 917H601Q600 912 594 899T576 871T544 846T496 834Z" />
<glyph unicode="&#xc4;" glyph-name="Adieresis" horiz-adv-x="649" d="M394 710H438L571 0H517L473 234H154L12 0H-43L394 710ZM469 276L403 648L175 276H469ZM346 828L364 916H408L389 828H346ZM477 828L496 916H539L521 828H477Z" />
<glyph unicode="&#xc5;" glyph-name="Aring" horiz-adv-x="649" d="M394 710H438L571 0H517L473 234H154L12 0H-43L394 710ZM469 276L403 648L175 276H469ZM378 843Q378 875 402 896T458 917Q482 917 496 903T510 867Q510 835 487 814T431 792Q406 792 392 806T378
843ZM452 894Q434 894 420 881T405 847Q405 833 413 824T436 815Q452 815 468 828T484 862Q484 877 475 885T452 894Z" />
<glyph unicode="&#xc6;" glyph-name="AE" horiz-adv-x="922" d="M506 710H958L947 664H560L502 386H837L827 339H491L429 46H824L815 0H369L419 234H166L-25 0H-82L506 710ZM426 280L503 646L200 280H426Z" />
<glyph unicode="&#xc7;" glyph-name="Ccedilla" horiz-adv-x="655" d="M189 -125Q202 -132 223 -138T268 -144Q333 -144 333 -99Q333 -83 322 -77T292 -71Q272 -71 249 -76T213 -85L272 -5Q218 -1 176 25T105 93T61 186T46 293Q46 366 76 440T161 576T289 675T450
714Q495 714 531 703T594 671T639 622T665 559L618 535Q609 572 590 597T547 637T494 660T436 667Q387 667 343 652T261 609T193 546T141 468T109 383T97 296Q97 244 111 198T153 117T218 62T305 41Q335 41 369 49T436 74T499 117T555 180L595 159Q570 120 536
91T463 40T383 8T304 -5L267 -53Q276 -49 286 -48T305 -47Q363 -47 363 -93Q363 -131 336 -151T258 -171Q232 -171 210 -166T170 -152L189 -125Z" />
<glyph unicode="&#xc8;" glyph-name="Egrave" horiz-adv-x="584" d="M178 710H619L610 664H219L160 385H501L491 341H151L88 46H487L477 0H27L178 710ZM361 918H416L457 833L420 817L361 918Z" />
<glyph unicode="&#xc9;" glyph-name="Eacute" horiz-adv-x="584" d="M413 816L382 832L458 917H515L413 816ZM178 710H619L610 664H219L160 385H501L491 341H151L88 46H487L477 0H27L178 710Z" />
<glyph unicode="&#xca;" glyph-name="Ecircumflex" horiz-adv-x="584" d="M323 836L432 917H469L544 836L511 819L443 882L349 819L323 836ZM178 710H619L610 664H219L160 385H501L491 341H151L88 46H487L477 0H27L178 710Z" />
<glyph unicode="&#xcb;" glyph-name="Edieresis" horiz-adv-x="584" d="M336 828L354 916H398L379 828H336ZM467 828L486 916H529L511 828H467ZM178 710H619L610 664H219L160 385H501L491 341H151L88 46H487L477 0H27L178 710Z" />
<glyph unicode="&#xcc;" glyph-name="Igrave" horiz-adv-x="233" d="M178 709H229L78 0H27L178 709ZM162 918H217L258 833L221 817L162 918Z" />
<glyph unicode="&#xcd;" glyph-name="Iacute" horiz-adv-x="233" d="M178 709H229L78 0H27L178 709ZM218 816L187 832L263 917H320L218 816Z" />
<glyph unicode="&#xce;" glyph-name="Icircumflex" horiz-adv-x="233" d="M178 709H229L78 0H27L178 709ZM119 836L228 917H265L340 836L307 819L239 882L145 819L119 836Z" />
<glyph unicode="&#xcf;" glyph-name="Idieresis" horiz-adv-x="233" d="M178 709H229L78 0H27L178 709ZM140 828L158 916H202L183 828H140ZM271 828L290 916H333L315 828H271Z" />
<glyph unicode="&#xd0;" glyph-name="Eth" horiz-adv-x="695" d="M54 378H114L185 710H410Q476 710 524 689T604 632T651 546T667 439Q667 344 637 264T552 125T422 33T259 0H34L105 336H45L54 378ZM269 46Q349 46 413 77T521 162T590 284T614 430Q614 481 601
524T560 598T493 646T400 664H226L165 378H334L325 336H156L95 46H269Z" />
<glyph unicode="&#xd1;" glyph-name="Ntilde" horiz-adv-x="741" d="M178 710H218L554 85L686 709H737L586 0H541L209 614L78 0H27L178 710ZM547 834Q526 834 511 840T484 853T461 867T435 874Q419 874 408 867T391 852T381 836T377 826H343Q344 830 350 843T368
871T398 897T442 909Q461 909 474 903T500 889T524 875T554 869Q573 869 585 876T604 891T615 907T619 917H652Q651 912 645 899T627 871T595 846T547 834Z" />
<glyph unicode="&#xd2;" glyph-name="Ograve" horiz-adv-x="724" d="M297 -5Q237 -5 191 19T113 83T65 177T48 287Q48 369 82 446T172 583T301 679T451 715Q511 715 557 690T634 624T682 530T698 421Q698 340 664 263T574 127T446 31T297 -5ZM307 42Q376 42 438
75T546 162T619 283T646 416Q646 467 632 512T592 592T527 647T440 668Q371 668 309 635T201 548T127 427T100 293Q100 242 114 197T154 117T219 62T307 42ZM424 918H479L520 833L483 817L424 918Z" />
<glyph unicode="&#xd3;" glyph-name="Oacute" horiz-adv-x="724" d="M469 816L438 832L514 917H571L469 816ZM297 -5Q237 -5 191 19T113 83T65 177T48 287Q48 369 82 446T172 583T301 679T451 715Q511 715 557 690T634 624T682 530T698 421Q698 340 664 263T574
127T446 31T297 -5ZM307 42Q376 42 438 75T546 162T619 283T646 416Q646 467 632 512T592 592T527 647T440 668Q371 668 309 635T201 548T127 427T100 293Q100 242 114 197T154 117T219 62T307 42Z" />
<glyph unicode="&#xd4;" glyph-name="Ocircumflex" horiz-adv-x="724" d="M371 836L480 917H517L592 836L559 819L491 882L397 819L371 836ZM297 -5Q237 -5 191 19T113 83T65 177T48 287Q48 369 82 446T172 583T301 679T451 715Q511 715 557 690T634 624T682 530T698
421Q698 340 664 263T574 127T446 31T297 -5ZM307 42Q376 42 438 75T546 162T619 283T646 416Q646 467 632 512T592 592T527 647T440 668Q371 668 309 635T201 548T127 427T100 293Q100 242 114 197T154 117T219 62T307 42Z" />
<glyph unicode="&#xd5;" glyph-name="Otilde" horiz-adv-x="724" d="M297 -5Q237 -5 191 19T113 83T65 177T48 287Q48 369 82 446T172 583T301 679T451 715Q511 715 557 690T634 624T682 530T698 421Q698 340 664 263T574 127T446 31T297 -5ZM307 42Q376 42 438
75T546 162T619 283T646 416Q646 467 632 512T592 592T527 647T440 668Q371 668 309 635T201 548T127 427T100 293Q100 242 114 197T154 117T219 62T307 42ZM534 834Q513 834 498 840T471 853T448 867T422 874Q406 874 395 867T378 852T368 836T364 826H330Q331
830 337 843T355 871T385 897T429 909Q448 909 461 903T487 889T511 875T541 869Q560 869 572 876T591 891T602 907T606 917H639Q638 912 632 899T614 871T582 846T534 834Z" />
<glyph unicode="&#xd6;" glyph-name="Odieresis" horiz-adv-x="724" d="M388 828L406 916H450L431 828H388ZM519 828L538 916H581L563 828H519ZM297 -5Q237 -5 191 19T113 83T65 177T48 287Q48 369 82 446T172 583T301 679T451 715Q511 715 557 690T634 624T682
530T698 421Q698 340 664 263T574 127T446 31T297 -5ZM307 42Q376 42 438 75T546 162T619 283T646 416Q646 467 632 512T592 592T527 647T440 668Q371 668 309 635T201 548T127 427T100 293Q100 242 114 197T154 117T219 62T307 42Z" />
<glyph unicode="&#xd7;" glyph-name="multiply" horiz-adv-x="465" d="M384 145L351 113L225 239L98 113L66 146L192 271L66 398L99 430L225 304L351 431L383 398L257 271L384 145Z" />
<glyph unicode="&#xd8;" glyph-name="Oslash" horiz-adv-x="724" d="M701 710L631 627Q664 585 681 532T698 421Q698 340 664 263T574 127T446 31T297 -5Q251 -5 214 9T146 48L106 0H49L116 80Q82 121 65 174T48 287Q48 369 82 446T172 583T301 679T451 715Q497
715 534 700T601 659L644 710H701ZM100 293Q100 192 151 121L567 618Q542 641 510 654T440 668Q371 668 309 635T201 548T127 427T100 293ZM307 42Q376 42 438 75T546 162T619 283T646 416Q646 464 633 507T596 585L180 89Q205 66 237 54T307 42Z" />
<glyph unicode="&#xd9;" glyph-name="Ugrave" horiz-adv-x="724" d="M298 -5Q236 -5 194 13T127 63T90 137T78 229Q78 288 92 353L168 710H219L143 353Q137 323 133 294T129 237Q129 196 138 161T168 99T223 57T307 42Q375 42 425 69T511 140T569 240T604 353L679
710H730L655 353Q640 281 612 217T539 103T436 24T298 -5ZM416 918H471L512 833L475 817L416 918Z" />
<glyph unicode="&#xda;" glyph-name="Uacute" horiz-adv-x="724" d="M453 816L422 832L498 917H555L453 816ZM298 -5Q236 -5 194 13T127 63T90 137T78 229Q78 288 92 353L168 710H219L143 353Q137 323 133 294T129 237Q129 196 138 161T168 99T223 57T307 42Q375
42 425 69T511 140T569 240T604 353L679 710H730L655 353Q640 281 612 217T539 103T436 24T298 -5Z" />
<glyph unicode="&#xdb;" glyph-name="Ucircumflex" horiz-adv-x="724" d="M364 836L473 917H510L585 836L552 819L484 882L390 819L364 836ZM298 -5Q236 -5 194 13T127 63T90 137T78 229Q78 288 92 353L168 710H219L143 353Q137 323 133 294T129 237Q129 196 138
161T168 99T223 57T307 42Q375 42 425 69T511 140T569 240T604 353L679 710H730L655 353Q640 281 612 217T539 103T436 24T298 -5Z" />
<glyph unicode="&#xdc;" glyph-name="Udieresis" horiz-adv-x="724" d="M383 828L401 916H445L426 828H383ZM514 828L533 916H576L558 828H514ZM298 -5Q236 -5 194 13T127 63T90 137T78 229Q78 288 92 353L168 710H219L143 353Q137 323 133 294T129 237Q129 196
138 161T168 99T223 57T307 42Q375 42 425 69T511 140T569 240T604 353L679 710H730L655 353Q640 281 612 217T539 103T436 24T298 -5Z" />
<glyph unicode="&#xdd;" glyph-name="Yacute" horiz-adv-x="602" d="M264 270L93 710H150L300 317L618 710H674L315 268L257 0H207L264 270ZM387 816L356 832L432 917H489L387 816Z" />
<glyph unicode="&#xde;" glyph-name="Thorn" horiz-adv-x="577" d="M178 710H229L198 566H407Q444 566 472 551T521 510T551 452T562 384Q562 337 543 291T490 207T413 147T319 124H104L78 0H27L178 710ZM327 171Q366 171 399 189T457 238T496 305T511 378Q511
406 503 432T479 477T443 507T395 519H189L115 171H327Z" />
<glyph unicode="&#xdf;" glyph-name="germandbls" horiz-adv-x="527" d="M170 40Q227 41 272 55T350 94T400 157T418 242Q418 304 382 340T280 377H262L272 424H289Q320 424 348 435T397 466T430 512T443 569Q443 615 414 642T337 669Q305 669 277 657T228 623T191
571T168 506L60 0H12L121 513Q130 558 151 595T203 658T271 699T349 714Q415 714 454 677T494 582Q494 551 482 522T450 468T405 426T353 403Q411 389 440 348T470 247Q470 188 448 143T386 65T288 15T160 -6L170 40Z" />
<glyph unicode="&#xe0;" glyph-name="agrave" horiz-adv-x="591" d="M212 -10Q169 -10 135 8T76 56T40 125T27 209Q27 270 51 327T115 430T208 502T317 529Q350 529 376 519T424 493T460 454T484 407L508 520H559L463 72Q461 64 461 60Q461 45 478 45L468 0Q463
-1 460 -1T453 -2Q433 -2 423 8T412 34Q412 37 412 41T414 53T418 73T424 104Q383 52 326 21T212 -10ZM230 35Q257 35 289 46T350 77T403 121T435 175L471 346Q467 374 454 399T420 443T373 473T317 484Q269 484 226 460T151 398T99 311T79 215Q79 179 90 146T121
89T169 50T230 35ZM299 730H354L395 645L358 629L299 730Z" />
<glyph unicode="&#xe1;" glyph-name="aacute" horiz-adv-x="591" d="M212 -10Q169 -10 135 8T76 56T40 125T27 209Q27 270 51 327T115 430T208 502T317 529Q350 529 376 519T424 493T460 454T484 407L508 520H559L463 72Q461 64 461 60Q461 45 478 45L468 0Q463
-1 460 -1T453 -2Q433 -2 423 8T412 34Q412 37 412 41T414 53T418 73T424 104Q383 52 326 21T212 -10ZM230 35Q257 35 289 46T350 77T403 121T435 175L471 346Q467 374 454 399T420 443T373 473T317 484Q269 484 226 460T151 398T99 311T79 215Q79 179 90 146T121
89T169 50T230 35ZM346 629L315 645L391 730H448L346 629Z" />
<glyph unicode="&#xe2;" glyph-name="acircumflex" horiz-adv-x="591" d="M212 -10Q169 -10 135 8T76 56T40 125T27 209Q27 270 51 327T115 430T208 502T317 529Q350 529 376 519T424 493T460 454T484 407L508 520H559L463 72Q461 64 461 60Q461 45 478 45L468
0Q463 -1 460 -1T453 -2Q433 -2 423 8T412 34Q412 37 412 41T414 53T418 73T424 104Q383 52 326 21T212 -10ZM230 35Q257 35 289 46T350 77T403 121T435 175L471 346Q467 374 454 399T420 443T373 473T317 484Q269 484 226 460T151 398T99 311T79 215Q79 179 90
146T121 89T169 50T230 35ZM249 649L358 730H395L470 649L437 632L369 695L275 632L249 649Z" />
<glyph unicode="&#xe3;" glyph-name="atilde" horiz-adv-x="591" d="M212 -10Q169 -10 135 8T76 56T40 125T27 209Q27 270 51 327T115 430T208 502T317 529Q350 529 376 519T424 493T460 454T484 407L508 520H559L463 72Q461 64 461 60Q461 45 478 45L468 0Q463
-1 460 -1T453 -2Q433 -2 423 8T412 34Q412 37 412 41T414 53T418 73T424 104Q383 52 326 21T212 -10ZM230 35Q257 35 289 46T350 77T403 121T435 175L471 346Q467 374 454 399T420 443T373 473T317 484Q269 484 226 460T151 398T99 311T79 215Q79 179 90 146T121
89T169 50T230 35ZM410 647Q389 647 374 653T347 666T324 680T298 687Q282 687 271 680T254 665T244 649T240 639H206Q207 643 213 656T231 684T261 710T305 722Q324 722 337 716T363 702T387 688T417 682Q436 682 448 689T467 704T478 720T482 730H515Q514 725
508 712T490 684T458 659T410 647Z" />
<glyph unicode="&#xe4;" glyph-name="adieresis" horiz-adv-x="591" d="M212 -10Q169 -10 135 8T76 56T40 125T27 209Q27 270 51 327T115 430T208 502T317 529Q350 529 376 519T424 493T460 454T484 407L508 520H559L463 72Q461 64 461 60Q461 45 478 45L468 0Q463
-1 460 -1T453 -2Q433 -2 423 8T412 34Q412 37 412 41T414 53T418 73T424 104Q383 52 326 21T212 -10ZM230 35Q257 35 289 46T350 77T403 121T435 175L471 346Q467 374 454 399T420 443T373 473T317 484Q269 484 226 460T151 398T99 311T79 215Q79 179 90 146T121
89T169 50T230 35ZM268 640L286 728H330L311 640H268ZM399 640L418 728H461L443 640H399Z" />
<glyph unicode="&#xe5;" glyph-name="aring" horiz-adv-x="591" d="M212 -10Q169 -10 135 8T76 56T40 125T27 209Q27 270 51 327T115 430T208 502T317 529Q350 529 376 519T424 493T460 454T484 407L508 520H559L463 72Q461 64 461 60Q461 45 478 45L468 0Q463
-1 460 -1T453 -2Q433 -2 423 8T412 34Q412 37 412 41T414 53T418 73T424 104Q383 52 326 21T212 -10ZM230 35Q257 35 289 46T350 77T403 121T435 175L471 346Q467 374 454 399T420 443T373 473T317 484Q269 484 226 460T151 398T99 311T79 215Q79 179 90 146T121
89T169 50T230 35ZM293 656Q293 688 317 709T373 730Q397 730 411 716T425 680Q425 648 402 627T346 605Q321 605 307 619T293 656ZM367 707Q349 707 335 694T320 660Q320 646 328 637T351 628Q367 628 383 641T399 675Q399 690 390 698T367 707Z" />
<glyph unicode="&#xe6;" glyph-name="ae" horiz-adv-x="885" d="M135 -10Q102 -10 76 0T33 29T7 71T-2 122Q-2 162 17 196T68 254T145 291T241 305Q274 305 306 300T366 285Q374 311 384 333T402 378Q402 428 372 458T286 489Q248 489 205 473T113 427L101 461Q157
495 205 512T299 529Q358 529 396 501T443 418Q485 468 541 498T660 529Q704 529 740 513T801 469T841 403T855 320Q855 294 851 273T841 240H405Q404 231 404 222T403 204Q403 166 414 134T446 79T495 43T559 30Q585 30 611 37T661 58T705 89T739 130L781 118Q764
90 739 67T683 26T618 0T549 -10Q484 -10 439 22T371 107Q349 75 319 53T256 17T192 -3T135 -10ZM154 30Q182 30 214 39T276 63T328 100T359 145Q353 167 353 194Q353 223 359 250Q332 260 301 265T241 270Q199 270 164 260T102 232T62 189T47 132Q47 112 53 94T73
61T106 39T154 30ZM801 277Q803 288 804 300T805 323Q805 357 795 387T766 439T717 475T651 488Q611 488 574 472T504 428T448 362T412 277H801Z" />
<glyph unicode="&#xe7;" glyph-name="ccedilla" horiz-adv-x="522" d="M120 -125Q133 -132 154 -138T199 -144Q264 -144 264 -99Q264 -83 253 -77T223 -71Q203 -71 180 -76T144 -85L200 -9Q160 -5 128 13T74 61T39 129T27 210Q27 274 52 331T119 433T217 503T335
529Q403 529 447 497T506 408L453 392Q441 435 406 459T323 484Q276 484 232 463T154 405T99 320T78 217Q78 179 89 146T119 88T167 49T228 35Q254 35 281 43T332 64T374 94T403 131L449 117Q434 90 411 68T359 29T298 2T232 -10L198 -53Q207 -49 217 -48T236 -47Q294
-47 294 -93Q294 -131 267 -151T189 -171Q163 -171 141 -166T101 -152L120 -125Z" />
<glyph unicode="&#xe8;" glyph-name="egrave" horiz-adv-x="529" d="M224 -10Q177 -10 141 7T79 55T40 125T27 210Q27 271 50 328T116 430T214 502T337 529Q368 529 397 520T448 494T484 450T498 390Q498 240 226 240Q194 240 159 241T80 245Q79 237 79 228T78
211Q78 174 87 141T116 84T165 45T234 30Q259 30 285 37T336 58T380 91T415 135L457 122Q439 92 414 68T358 27T293 0T224 -10ZM331 488Q284 488 245 471T174 425T121 359T88 283Q130 280 163 279T229 278Q291 278 333 286T402 310T439 345T451 391Q451 416 441
434T414 465T375 482T331 488ZM309 730H364L405 645L368 629L309 730Z" />
<glyph unicode="&#xe9;" glyph-name="eacute" horiz-adv-x="529" d="M336 629L305 645L381 730H438L336 629ZM224 -10Q177 -10 141 7T79 55T40 125T27 210Q27 271 50 328T116 430T214 502T337 529Q368 529 397 520T448 494T484 450T498 390Q498 240 226 240Q194
240 159 241T80 245Q79 237 79 228T78 211Q78 174 87 141T116 84T165 45T234 30Q259 30 285 37T336 58T380 91T415 135L457 122Q439 92 414 68T358 27T293 0T224 -10ZM331 488Q284 488 245 471T174 425T121 359T88 283Q130 280 163 279T229 278Q291 278 333 286T402
310T439 345T451 391Q451 416 441 434T414 465T375 482T331 488Z" />
<glyph unicode="&#xea;" glyph-name="ecircumflex" horiz-adv-x="529" d="M257 649L366 730H403L478 649L445 632L377 695L283 632L257 649ZM224 -10Q177 -10 141 7T79 55T40 125T27 210Q27 271 50 328T116 430T214 502T337 529Q368 529 397 520T448 494T484 450T498
390Q498 240 226 240Q194 240 159 241T80 245Q79 237 79 228T78 211Q78 174 87 141T116 84T165 45T234 30Q259 30 285 37T336 58T380 91T415 135L457 122Q439 92 414 68T358 27T293 0T224 -10ZM331 488Q284 488 245 471T174 425T121 359T88 283Q130 280 163 279T229
278Q291 278 333 286T402 310T439 345T451 391Q451 416 441 434T414 465T375 482T331 488Z" />
<glyph unicode="&#xeb;" glyph-name="edieresis" horiz-adv-x="529" d="M269 640L287 728H331L312 640H269ZM400 640L419 728H462L444 640H400ZM224 -10Q177 -10 141 7T79 55T40 125T27 210Q27 271 50 328T116 430T214 502T337 529Q368 529 397 520T448 494T484
450T498 390Q498 240 226 240Q194 240 159 241T80 245Q79 237 79 228T78 211Q78 174 87 141T116 84T165 45T234 30Q259 30 285 37T336 58T380 91T415 135L457 122Q439 92 414 68T358 27T293 0T224 -10ZM331 488Q284 488 245 471T174 425T121 359T88 283Q130 280
163 279T229 278Q291 278 333 286T402 310T439 345T451 391Q451 416 441 434T414 465T375 482T331 488Z" />
<glyph unicode="&#xec;" glyph-name="igrave" horiz-adv-x="201" d="M122 520H172L62 0H12L122 520ZM95 730H150L191 645L154 629L95 730Z" />
<glyph unicode="&#xed;" glyph-name="iacute" horiz-adv-x="201" d="M170 629L139 645L215 730H272L170 629ZM122 520H172L62 0H12L122 520Z" />
<glyph unicode="&#xee;" glyph-name="icircumflex" horiz-adv-x="201" d="M64 649L173 730H210L285 649L252 632L184 695L90 632L64 649ZM122 520H172L62 0H12L122 520Z" />
<glyph unicode="&#xef;" glyph-name="idieresis" horiz-adv-x="201" d="M84 640L102 728H146L127 640H84ZM215 640L234 728H277L259 640H215ZM122 520H172L62 0H12L122 520Z" />
<glyph unicode="&#xf0;" glyph-name="eth" horiz-adv-x="575" d="M547 689L451 633Q498 570 516 502T535 370Q535 282 507 212T434 93T332 17T217 -10Q174 -10 138 5T77 48T37 111T23 190Q23 247 48 298T114 389T207 451T313 474Q380 474 426 439T486 347Q486
355 486 362T487 378Q487 437 472 495T410 613L286 540L274 565L393 634Q371 658 344 682T282 730H352Q376 712 396 693T434 654L535 713L547 689ZM74 196Q74 162 85 133T116 82T165 48T227 35Q272 35 315 55T393 108T447 185T468 275Q468 308 457 336T425 386T377
419T314 431Q269 431 226 412T149 361T95 286T74 196Z" />
<glyph unicode="&#xf1;" glyph-name="ntilde" horiz-adv-x="552" d="M122 520H169L142 396Q163 426 191 450T250 492T315 519T382 529Q442 529 468 497T494 404Q494 381 491 355T481 299L418 0H368L429 290Q435 318 437 341T440 383Q440 483 357 483Q326 483 293
471T230 437T173 386T130 322L62 0H12L122 520ZM401 647Q380 647 365 653T338 666T315 680T289 687Q273 687 262 680T245 665T235 649T231 639H197Q198 643 204 656T222 684T252 710T296 722Q315 722 328 716T354 702T378 688T408 682Q427 682 439 689T458 704T469
720T473 730H506Q505 725 499 712T481 684T449 659T401 647Z" />
<glyph unicode="&#xf2;" glyph-name="ograve" horiz-adv-x="569" d="M218 -10Q173 -10 138 7T78 53T40 122T26 207Q26 270 51 328T120 431T218 502T333 529Q377 529 412 512T472 465T510 395T524 310Q524 248 499 190T431 88T333 17T218 -10ZM227 35Q272 35 316
57T395 116T451 201T473 303Q473 341 462 374T432 431T384 470T323 484Q278 484 235 462T156 403T100 316T78 213Q78 175 89 143T119 86T166 49T227 35ZM304 730H359L400 645L363 629L304 730Z" />
<glyph unicode="&#xf3;" glyph-name="oacute" horiz-adv-x="569" d="M350 629L319 645L395 730H452L350 629ZM218 -10Q173 -10 138 7T78 53T40 122T26 207Q26 270 51 328T120 431T218 502T333 529Q377 529 412 512T472 465T510 395T524 310Q524 248 499 190T431
88T333 17T218 -10ZM227 35Q272 35 316 57T395 116T451 201T473 303Q473 341 462 374T432 431T384 470T323 484Q278 484 235 462T156 403T100 316T78 213Q78 175 89 143T119 86T166 49T227 35Z" />
<glyph unicode="&#xf4;" glyph-name="ocircumflex" horiz-adv-x="569" d="M249 649L358 730H395L470 649L437 632L369 695L275 632L249 649ZM218 -10Q173 -10 138 7T78 53T40 122T26 207Q26 270 51 328T120 431T218 502T333 529Q377 529 412 512T472 465T510 395T524
310Q524 248 499 190T431 88T333 17T218 -10ZM227 35Q272 35 316 57T395 116T451 201T473 303Q473 341 462 374T432 431T384 470T323 484Q278 484 235 462T156 403T100 316T78 213Q78 175 89 143T119 86T166 49T227 35Z" />
<glyph unicode="&#xf5;" glyph-name="otilde" horiz-adv-x="569" d="M218 -10Q173 -10 138 7T78 53T40 122T26 207Q26 270 51 328T120 431T218 502T333 529Q377 529 412 512T472 465T510 395T524 310Q524 248 499 190T431 88T333 17T218 -10ZM227 35Q272 35 316
57T395 116T451 201T473 303Q473 341 462 374T432 431T384 470T323 484Q278 484 235 462T156 403T100 316T78 213Q78 175 89 143T119 86T166 49T227 35ZM411 647Q390 647 375 653T348 666T325 680T299 687Q283 687 272 680T255 665T245 649T241 639H207Q208 643
214 656T232 684T262 710T306 722Q325 722 338 716T364 702T388 688T418 682Q437 682 449 689T468 704T479 720T483 730H516Q515 725 509 712T491 684T459 659T411 647Z" />
<glyph unicode="&#xf6;" glyph-name="odieresis" horiz-adv-x="569" d="M267 640L285 728H329L310 640H267ZM398 640L417 728H460L442 640H398ZM218 -10Q173 -10 138 7T78 53T40 122T26 207Q26 270 51 328T120 431T218 502T333 529Q377 529 412 512T472 465T510
395T524 310Q524 248 499 190T431 88T333 17T218 -10ZM227 35Q272 35 316 57T395 116T451 201T473 303Q473 341 462 374T432 431T384 470T323 484Q278 484 235 462T156 403T100 316T78 213Q78 175 89 143T119 86T166 49T227 35Z" />
<glyph unicode="&#xf7;" glyph-name="divide" horiz-adv-x="541" d="M243 394V475H287V394H243ZM243 81V161H287V81H243ZM64 257V300H467V257H64Z" />
<glyph unicode="&#xf8;" glyph-name="oslash" horiz-adv-x="569" d="M81 49Q54 78 40 119T26 207Q26 270 52 328T120 431T218 502T333 529Q401 529 448 488L478 521H516L468 469Q495 439 509 398T524 310Q524 248 499 190T431 88T334 17T219 -10Q150 -10 102 29L74
-1H36L81 49ZM227 35Q272 35 316 57T395 116T451 201T473 303Q473 340 463 372T433 429L135 69Q154 53 177 44T227 35ZM78 213Q78 137 118 88L414 449Q396 466 373 475T323 484Q278 484 234 462T156 403T100 316T78 213Z" />
<glyph unicode="&#xf9;" glyph-name="ugrave" horiz-adv-x="562" d="M162 -10Q41 -10 41 126Q41 146 43 169T52 220L117 520H166L104 227Q93 177 93 142Q93 35 186 35Q217 35 249 46T310 78T366 128T410 192L479 520H529L437 85Q435 77 434 70T432 61Q432 45 449
45L439 0Q432 -1 427 -1T417 -1Q401 -1 393 9T384 34Q384 37 384 41T386 54T391 79T401 123Q355 60 292 25T162 -10ZM272 730H327L368 645L331 629L272 730Z" />
<glyph unicode="&#xfa;" glyph-name="uacute" horiz-adv-x="562" d="M322 629L291 645L367 730H424L322 629ZM162 -10Q41 -10 41 126Q41 146 43 169T52 220L117 520H166L104 227Q93 177 93 142Q93 35 186 35Q217 35 249 46T310 78T366 128T410 192L479 520H529L437
85Q435 77 434 70T432 61Q432 45 449 45L439 0Q432 -1 427 -1T417 -1Q401 -1 393 9T384 34Q384 37 384 41T386 54T391 79T401 123Q355 60 292 25T162 -10Z" />
<glyph unicode="&#xfb;" glyph-name="ucircumflex" horiz-adv-x="562" d="M239 649L348 730H385L460 649L427 632L359 695L265 632L239 649ZM162 -10Q41 -10 41 126Q41 146 43 169T52 220L117 520H166L104 227Q93 177 93 142Q93 35 186 35Q217 35 249 46T310 78T366
128T410 192L479 520H529L437 85Q435 77 434 70T432 61Q432 45 449 45L439 0Q432 -1 427 -1T417 -1Q401 -1 393 9T384 34Q384 37 384 41T386 54T391 79T401 123Q355 60 292 25T162 -10Z" />
<glyph unicode="&#xfc;" glyph-name="udieresis" horiz-adv-x="562" d="M255 640L273 728H317L298 640H255ZM386 640L405 728H448L430 640H386ZM162 -10Q41 -10 41 126Q41 146 43 169T52 220L117 520H166L104 227Q93 177 93 142Q93 35 186 35Q217 35 249 46T310
78T366 128T410 192L479 520H529L437 85Q435 77 434 70T432 61Q432 45 449 45L439 0Q432 -1 427 -1T417 -1Q401 -1 393 9T384 34Q384 37 384 41T386 54T391 79T401 123Q355 60 292 25T162 -10Z" />
<glyph unicode="&#xfd;" glyph-name="yacute" horiz-adv-x="478" d="M-36 -183Q-5 -178 16 -170T56 -147T90 -112T127 -59L163 -5L52 520H104L198 49L246 125Q291 197 321 250T374 349T411 434T438 520H488Q474 472 459 431T422 343T366 239T282 103L200 -26Q165
-82 138 -118T84 -177T31 -210T-30 -224L-36 -183ZM285 629L254 645L330 730H387L285 629Z" />
<glyph unicode="&#xfe;" glyph-name="thorn" horiz-adv-x="577" d="M163 710H214L152 421Q194 468 243 499T353 530Q398 530 432 513T488 466T522 399T534 321Q534 264 512 205T451 97T357 17T237 -14Q172 -14 135 15T81 87L18 -213H-33L163 710ZM248 33Q293 33
335 55T410 116T462 204T482 309Q482 346 473 378T445 433T401 470T340 484Q310 484 282 474T227 445T179 402T137 351L99 171Q97 166 97 163T97 156Q97 131 109 109T142 70T190 43T248 33Z" />
<glyph unicode="&#xff;" glyph-name="ydieresis" horiz-adv-x="478" d="M-36 -183Q-5 -178 16 -170T56 -147T90 -112T127 -59L163 -5L52 520H104L198 49L246 125Q291 197 321 250T374 349T411 434T438 520H488Q474 472 459 431T422 343T366 239T282 103L200 -26Q165
-82 138 -118T84 -177T31 -210T-30 -224L-36 -183ZM206 640L224 728H268L249 640H206ZM337 640L356 728H399L381 640H337Z" />
<glyph unicode="&#x2013;" glyph-name="endash" horiz-adv-x="537" d="M54 249L64 295H470L461 249H54Z" />
<glyph unicode="&#x2014;" glyph-name="emdash" horiz-adv-x="853" d="M54 249L64 295H786L777 249H54Z" />
<glyph unicode="&#x2018;" glyph-name="quoteleft" horiz-adv-x="181" d="M202 730L167 631H185L166 540H114L134 631L175 730H202Z" />
<glyph unicode="&#x2019;" glyph-name="quoteright" horiz-adv-x="177" d="M118 540L153 639H135L154 730H206L186 639L145 540H118Z" />
<glyph unicode="&#x201a;" glyph-name="quotesinglbase" horiz-adv-x="237" d="M13 -93L47 0H28L48 92H99L79 0L40 -93H13Z" />
<glyph unicode="&#x201c;" glyph-name="quotedblleft" horiz-adv-x="282" d="M202 730L167 631H185L166 540H114L134 631L175 730H202ZM302 730L267 631H285L266 540H214L234 631L275 730H302Z" />
<glyph unicode="&#x201d;" glyph-name="quotedblright" horiz-adv-x="277" d="M118 540L153 638H135L154 730H206L186 638L145 540H118ZM219 540L253 638H235L254 730H306L286 638L245 540H219Z" />
<glyph unicode="&#x201e;" glyph-name="quotedblbase" horiz-adv-x="335" d="M13 -93L47 0H28L48 92H99L79 0L40 -93H13ZM110 -93L144 0H126L145 92H197L177 0L137 -93H110Z" />
<glyph unicode="&#x2022;" glyph-name="bullet" horiz-adv-x="337" d="M260 360Q260 340 252 322T229 289T196 267T158 259Q129 259 111 279T93 330Q93 350 102 368T125 400T158 422T195 430Q225 430 242 410T260 360Z" />
<glyph unicode="&#x2039;" glyph-name="guilsinglleft" horiz-adv-x="337" d="M36 273L305 448L296 403L75 259L235 116L225 71L29 243L36 273Z" />
<glyph unicode="&#x203a;" glyph-name="guilsinglright" horiz-adv-x="337" d="M283 243L14 71L24 116L245 259L85 403L94 448L289 273L283 243Z" />
</font>
</defs>
</svg>
