<?xml version="1.0" encoding="UTF-8"?>
<svg width="64px" height="80px" viewBox="0 0 64 80" version="1.1" xmlns="http://www.w3.org/2000/svg" xmlns:xlink="http://www.w3.org/1999/xlink">
    <!-- Generator: Sketch 54.1 (76490) - https://sketchapp.com -->
    <title>Group 4</title>
    <desc>Created with Sketch.</desc>
    <defs>
        <path d="M57.1428571,68.5714286 C57.1428571,71.2579592 54.9314286,73.4693878 52.244898,73.4693878 L11.4285714,73.4693878 C8.74204082,73.4693878 6.53061224,71.2579592 6.53061224,68.5714286 L6.53061224,35.1020408 L15.2122449,35.1020408 C15.3420408,35.117551 15.4693878,35.1412245 15.6032653,35.1404082 L48.1673469,35.1020408 L57.1428571,35.1020408 L57.1428571,68.5714286 Z M18.7755102,11.4220408 C18.7787755,8.73877551 20.9893878,6.53061224 23.6734694,6.53061224 L40,6.53061224 C42.6865306,6.53061224 44.8979592,8.74204082 44.8979592,11.4285714 L44.8979592,28.5714286 L18.8506122,28.5714286 L18.7755102,11.4220408 Z M60.4081633,28.5714286 C62.2114286,28.5714286 63.6734694,30.0334694 63.6734694,31.8367347 L63.6734694,68.5714286 C63.6734694,74.8644898 58.5379592,80 52.244898,80 L11.4285714,80 C5.1355102,80 0,74.8644898 0,68.5714286 L0,31.8367347 C0,30.0334694 1.46204082,28.5714286 3.26530612,28.5714286 L12.3191837,28.5714286 L12.244898,11.4432653 C12.244898,5.1355102 17.3804082,0 23.6734694,0 L40,0 C46.2930612,0 51.4285714,5.1355102 51.4285714,11.4285714 L51.4285714,28.5714286 L60.4081633,28.5714286 Z" id="path-1"></path>
    </defs>
    <g id="Summary-page-and-modals" stroke="none" stroke-width="1" fill="none" fill-rule="evenodd">
        <g id="Desktop---Summary-page" transform="translate(-213.000000, -1169.000000)">
            <g id="Group-5" transform="translate(190.000000, 1152.000000)">
                <g id="Group-4" transform="translate(23.000000, 17.000000)">
                    <g id="Group-3" transform="translate(3.000000, 33.000000)">
                        <rect id="Rectangle" fill="#C2E6FA" x="0" y="0" width="57" height="42"></rect>
                        <path d="M27.5,-19 L27.5,26" id="Line-2-Copy-2" stroke-opacity="0.1" stroke="#FFFFFF" stroke-width="4" stroke-linecap="round" transform="translate(27.500000, 3.500000) rotate(90.000000) translate(-27.500000, -3.500000) "></path>
                        <rect id="Rectangle" fill-opacity="0.1" fill="#000000" x="28" y="2" width="27" height="40"></rect>
                        <path d="M5.5,38.5 L5.5,3.5 L5.5,38.5 L50,38.5 L5.5,38.5 Z M5.5,38.5 L5.5,39 L5.5,38.5 L5,38.5 L5.5,38.5 Z" id="Combined-Shape" stroke-opacity="0.4" stroke="#FFFFFF" stroke-width="4" stroke-linecap="round"></path>
                        <path d="M52.5,3.5 L52.5,39" id="Line-2" stroke-opacity="0.1" stroke="#000000" stroke-width="6" stroke-linecap="round"></path>
                    </g>
                    <g id="01-Atoms/Icons-New/Lock/Close">
                        <mask id="mask-2" fill="white">
                            <use xlink:href="#path-1"></use>
                        </mask>
                        <use id="Mask" fill="#082A5E" xlink:href="#path-1"></use>
                        <g id="01-Atoms/Fills/Brand-Colours/TUI-Dark-Blue" mask="url(#mask-2)" fill="#092A5E">
                            <g transform="translate(-8.000000, 0.000000)" id="Fill">
                                <rect x="0" y="0" width="80" height="80"></rect>
                            </g>
                        </g>
                    </g>
                    <path d="M21.574051,64.4060094 C22.0914456,61.9627794 22.5833941,59.5396013 23.0339758,57.2066292 L22.9720073,57.2066292 C21.4624117,57.2066292 20.2360037,55.9962036 20.2360037,54.4997651 C20.2360037,53.0033265 21.4624117,51.7929009 22.9720073,51.7929009 L24.0603675,51.7929009 C24.8620491,47.8524978 25.6199461,45.6458191 26.9216133,43.5403117 C29.1900711,39.8709756 32.722822,38 37.5060312,38 C39.6873629,38 41.2057886,38.2754302 42.9252598,38.966766 C43.1223025,39.0459895 43.3253024,39.1313084 43.5822312,39.2426393 C43.7006022,39.2941358 43.7006022,39.2941358 43.8797558,39.3724291 L44.2048317,39.5145813 C45.5885481,40.1174376 46.2167693,41.717488 45.604139,43.0872274 C44.9930648,44.4534877 43.3797281,45.0705231 41.9994582,44.4691684 L41.6814031,44.3300929 C41.5002036,44.2508942 41.5002036,44.2508942 41.3868968,44.2015883 C41.1748281,44.1096959 41.0134117,44.0417941 40.8650713,43.9821519 C39.8090409,43.5575611 38.9879829,43.4137283 37.5060312,43.4137283 C32.9762009,43.4137283 31.1623442,45.3001548 29.6667052,51.7929009 L38.6240331,51.7929009 C40.1336287,51.7929009 41.3600367,53.0033265 41.3600367,54.4997651 C41.3600367,55.9962036 40.1336287,57.2066292 38.6240331,57.2066292 L28.6034638,57.2066292 C28.5778824,57.3411976 28.5521133,57.4763083 28.5261576,57.6119564 C28.0377801,60.1642865 27.4990085,62.8281391 26.9297736,65.516169 C26.9248524,65.5394077 26.9199351,65.5626188 26.9150218,65.5858018 L40.3010358,65.5858018 C41.8106314,65.5858018 43.0370395,66.7962274 43.0370395,68.292666 C43.0370395,69.7891046 41.8106314,70.9995301 40.3010358,70.9995301 L23.5893344,70.9994257 C23.5332285,71.0001914 23.5332285,71.0001914 23.4871242,70.9995301 L20.7360037,70.9995301 C19.2264081,70.9995301 18,69.7891046 18,68.292666 C18,66.7962274 19.2264081,65.5858018 20.7360037,65.5858018 L21.3224691,65.5858018 C21.4047397,65.2027439 21.4887502,64.8088151 21.574051,64.4060094 Z" id="Mask-Copy" fill="#092A5E" fill-rule="nonzero"></path>
                </g>
            </g>
        </g>
    </g>
</svg>