{
    "orgName": "SfBotPkg",
    "edition": "Developer",
    "features": [],
    "settings": {
        "orgPreferenceSettings": {
            "s1DesktopEnabled": true,
            "s1EncryptedStoragePref2": false
        }
    }
}