One Star
’ 0.032135507361089125
service 0.025961690675953775
would 0.020104479974671522
company 0.01973510632684291
time 0.016252440504458867
never 0.014827713577119941
one 0.014247269273389268
get 0.013614057305683077
said 0.013033613001952403
job 0.012400401034246214
Two Star
’ 0.009680055314601798
would 0.0072286127349299135
job 0.0066628952165440946
service 0.005342887673643849
work 0.004902885159343767
time 0.004840027657300899
back 0.0036457351184863915
one 0.003520020114400654
done 0.003457162612357785
2 0.003457162612357785
Three Star
job 0.005360177801019741
’ 0.005164073735128775
would 0.005098705713165119
time 0.004967969669237808
work 0.004314289449601255
good 0.0032030330762191136
service 0.003072297032291803
said 0.002614720878546215
one 0.0025493528565825596
like 0.0025493528565825596
Four Star
job 0.012761166020267735
great 0.009821093456774678
time 0.008820217690479169
work 0.0087576629550857
good 0.008069560865757539
would 0.00706868509946203
’ 0.006943575628675091
service 0.005755035656199174
done 0.0042537220067559115
professional 0.004191167271362442
Five Star
job 0.07862109204064764
great 0.06481256381582146
work 0.060485243350999175
time 0.04366217727427432
professional 0.04283561044391501
would 0.03836242524432343
recommend 0.03379199688821899
definitely 0.027422570136626634
’ 0.024991491223805125
service 0.024845626489035835
4 5
4 5
1 5
4 1
3 5
4 5
4 5
3 5
1 5
1 1
4 5
4 5
3 5
2 1
1 1
1 5
1 1
2 1
1 1
1 5
1 1
1 1
4 5
4 5
3 5
4 5
2 5
3 5
1 1
1 1
1 1
3 5
1 1
4 5
1 5
4 5
3 1
1 5
1 1
1 1
4 5
3 1
4 5
4 5
4 1
4 5
4 5
4 5
4 5
4 5
2 1
4 1
3 5
4 5
1 1
4 1
4 1
2 1
4 5
1 1
1 5
1 1
1 5
4 1
1 1
4 5
4 1
2 5
4 5
1 1
4 5
1 1
1 1
1 1
1 1
1 1
1 1
1 1
1 1
1 1
1 1
1 1
1 1
1 1
1 1
1 1
3 1
1 1
1 5
2 1
1 1
4 5
4 5
1 1
2 1
4 5
1 1
1 1
4 5
4 1
4 5
4 5
3 1
1 1
1 1
4 1
3 5
1 1
2 1
1 1
1 1
1 5
1 1
1 1
3 5
1 5
2 5
4 1
2 5
1 1
3 5
4 1
1 1
3 5
3 1
4 1
1 1
1 1
4 5
1 1
1 1
1 1
1 1
4 5
3 1
1 1
2 1
1 1
1 5
1 1
1 5
1 1
2 1
1 1
2 1
1 5
1 5
1 1
2 1
1 1
4 5
1 1
1 1
1 1
1 1
1 1
1 1
1 5
1 1
3 5
1 5
1 1
1 1
1 1
1 1
1 1
1 1
1 1
1 1
1 1
1 1
1 1
4 5
1 1
3 5
1 5
1 1
1 1
1 1
1 1
1 1
1 1
3 1
1 1
1 1
3 1
1 1
1 1
1 1
1 1
1 5
1 1
1 1
1 1
1 1
1 1
1 1
1 1
1 1
1 1
1 1
4 1
1 1
1 5
1 1
1 1
1 1
4 1
1 1
1 1
1 5
1 1
1 1
4 5
1 1
1 1
4 5
1 1
1 1
4 1
4 5
1 5
1 1
1 5
1 1
4 5
1 1
4 5
4 5
1 1
1 1
4 5
2 5
4 5
3 1
4 5
3 5
1 1
4 5
1 1
1 1
1 1
1 1
1 5
1 1
1 5
1 1
1 1
1 1
1 1
1 5
1 1
1 1
1 1
1 1
1 1
1 5
1 1
1 1
4 5
1 1
1 1
1 1
1 1
4 5
4 5
4 5
3 1
4 5
3 5
2 1
4 5
1 1
1 1
4 5
1 5
4 1
4 5
1 1
1 1
1 1
4 5
4 5
4 5
4 5
4 1
4 5
3 5
3 5
3 5
4 5
2 1
4 5
1 1
1 1
1 5
4 5
3 5
1 1
4 5
4 5
4 5
1 1
4 5
2 5
3 5
1 1
1 1
1 5
4 5
3 5
4 5
3 5
3 5
3 1
1 5
1 5
1 5
3 5
4 5
4 5
3 5
1 5
4 5
4 1
4 5
3 5
2 5
1 5
2 5
1 5
3 1
4 5
1 1
1 1
2 1
1 1
2 1
3 5
2 5
1 5
4 5
1 1
1 1
1 1
1 5
1 1
2 1
1 1
1 5
1 1
1 1
1 5
4 5
1 1
1 5
1 5
1 1
1 1
1 5
1 1
1 5
2 1
4 5
1 5
1 1
4 5
3 5
3 5
3 5
3 5
2 1
1 5
1 1
1 1
1 1
1 1
4 5
2 1
2 1
1 5
1 5
1 1
1 1
1 5
3 5
2 1
3 1
1 1
1 1
1 5
4 5
1 1
2 1
4 5
4 5
1 1
4 5
4 1
2 5
1 1
1 1
2 5
1 1
1 1
2 1
4 5
1 5
1 1
1 5
3 1
4 5
1 1
4 5
1 1
1 5
4 5
4 5
4 5
3 5
3 1
3 5
4 5
4 5
4 1
4 5
4 5
1 1
4 5
2 1
1 1
1 1
1 5
2 1
4 5
4 5
3 5
4 5
4 5
4 5
4 5
1 1
3 5
3 1
2 1
2 1
1 1
3 5
2 5
4 5
4 5
4 5
4 5
2 5
1 1
2 5
1 1
2 1
2 1
2 1
2 1
2 5
1 1
3 5
1 1
3 5
1 1
1 1
1 5
1 5
1 1
1 5
4 5
2 5
2 5
1 1
1 1
1 1
1 1
2 1
3 5
1 1
1 1
1 5
4 5
4 5
2 5
1 1
4 1
1 5
4 5
4 5
4 1
2 1
2 5
1 5
1 1
1 1
1 1
3 5
1 1
1 1
4 5
4 5
4 5
4 5
3 5
2 5
1 5
3 5
3 5
1 1
2 5
2 1
1 1
1 1
3 5
1 1
1 1
1 1
4 5
4 5
1 1
1 1
2 5
4 5
3 5
4 5
2 1
2 5
3 1
4 1
1 5
1 1
2 5
4 5
4 5
4 5
3 5
3 5
1 1
4 5
3 1
4 5
4 5
4 5
4 5
4 5
3 5
1 1
4 5
3 5
2 5
4 5
4 1
2 5
3 5
1 1
3 5
2 5
1 1
1 5
4 5
3 5
3 5
1 5
2 5
1 5
1 5
2 5
2 1
1 5
2 5
2 1
1 1
2 1
1 5
4 5
4 5
1 5
1 5
1 1
1 5
1 1
1 5
1 1
1 1
1 1
1 5
1 5
1 5
1 5
4 5
4 5
3 1
2 5
4 5
4 1
2 5
3 1
2 1
1 1
1 1
1 1
1 1
4 5
4 5
1 5
1 1
1 1
4 5
3 5
2 1
3 5
1 5
1 1
1 1
4 5
4 5
4 5
1 5
1 5
4 5
1 1
1 1
4 5
1 1
1 1
1 1
1 1
1 5
1 1
4 5
3 5
1 1
4 5
3 1
3 1
1 1
1 1
4 5
4 1
4 5
1 1
2 5
2 5
1 5
1 5
3 1
4 5
3 1
3 5
4 5
2 1
2 5
2 1
1 5
1 1
1 1
4 5
4 1
4 5
4 5
4 1
3 1
4 5
3 1
4 5
4 5
4 5
3 1
2 1
2 1
2 1
3 5
4 5
1 1
1 1
1 1
1 1
1 1
1 1
1 5
1 1
1 1
1 5
1 5
1 1
3 5
2 1
1 1
4 5
2 5
1 1
1 1
2 1
1 1
2 1
4 5
2 1
3 5
1 1
4 5
4 5
1 1
1 1
1 5
2 1
1 1
1 1
3 5
3 5
1 5
1 5
3 1
3 1
4 5
4 5
2 1
2 1
4 5
1 1
3 5
1 1
3 5
2 5
1 1
1 1
1 1
1 5
1 1
1 1
3 5
4 5
3 5
4 5
4 1
4 1
4 5
4 5
4 5
4 5
4 5
4 5
3 1
3 5
3 1
4 1
3 5
2 5
4 5
2 5
1 5
1 1
1 5
3 5
2 1
3 1
1 5
1 1
1 1
1 1
1 1
1 5
4 5
2 1
1 5
3 5
3 5
3 5
1 5
2 1
2 5
1 1
1 1
3 5
3 5
1 1
1 1
2 5
4 5
1 1
2 5
1 1
1 1
1 1
1 5
1 5
1 5
1 5
2 5
4 5
2 1
1 1
2 5
4 5
4 1
4 5
4 5
4 5
1 1
4 5
4 5
3 1
4 5
4 5
1 1
1 1
1 5
1 5
1 1
1 5
1 1
1 1
1 1
1 1
1 1
1 1
2 1
2 1
1 1
1 5
1 1
1 1
1 5
1 1
2 1
4 5
1 5
1 1
1 1
2 1
2 1
1 1
4 1
4 5
4 1
4 5
3 5
1 5
3 5
4 5
1 1
1 1
3 5
1 1
1 1
2 1
4 5
1 1
1 5
1 5
1 1
3 1
1 1
1 5
1 5
4 5
1 5
4 1
3 5
1 1
4 5
1 1
1 5
2 1
1 1
4 5
4 5
1 1
1 1
1 5
1 1
2 5
1 1
1 5
1 1
1 1
1 1
1 1
1 1
1 1
1 1
2 1
1 1
2 1
4 5
1 1
1 1
1 1
1 1
1 1
4 5
1 1
1 1
1 1
1 5
1 1
1 1
1 5
1 1
2 5
1 1
1 1
1 1
4 5
1 1
1 1
1 1
1 1
1 1
1 5
1 1
1 1
1 5
1 1
1 1
1 1
1 1
1 1
1 1
4 5
1 1
1 1
1 1
1 1
1 1
1 1
4 5
4 1
4 5
4 5
3 5
1 1
4 5
1 1
4 5
2 1
4 5
4 5
1 1
1 5
4 5
4 5
3 5
3 5
2 1
3 5
1 1
1 5
1 5
1 5
1 1
1 1
1 1
1 1
1 1
1 5
1 5
4 5
3 5
1 5
1 1
1 1
1 1
4 5
4 5
4 5
4 5
4 5
2 1
4 5
3 5
4 5
2 1
3 5
4 5
4 5
4 5
2 1
1 5
4 5
1 1
1 5
1 1
1 1
4 5
3 5
3 1
1 5
1 5
1 1
1 5
1 1
3 5
2 1
1 5
2 5
1 1
4 5
4 5
1 1
4 5
2 1
2 1
1 1
1 1
2 1
4 5
4 5
4 5
4 5
4 5
1 1
3 1
1 1
3 5
1 1
1 1
2 1
3 5
4 5
1 1
4 5
1 1
1 1
2 5
4 5
2 1
4 5
1 1
4 5
4 5
4 5
4 5
2 1
4 5
4 5
4 5
4 5
4 5
4 5
3 5
3 5
1 5
4 5
4 5
4 5
1 1
1 5
2 1
4 5
1 5
1 1
2 1
3 1
2 1
1 1
2 1
4 5
4 5
4 5
4 5
4 5
1 1
2 1
2 5
2 5
1 1
1 5
2 1
1 5
4 5
1 5
1 1
1 1
1 1
1 1
1 5
1 5
4 5
1 1
1 1
4 5
4 5
4 5
4 5
4 5
4 5
4 5
4 5
4 5
4 5
3 1
2 1
1 5
1 1
1 1
1 1
4 5
1 1
4 5
4 5
4 5
4 5
3 5
3 5
4 5
2 5
3 5
4 5
2 5
4 5
3 1
3 5
1 1
1 5
4 5
1 1
1 1
1 1
1 5
2 5
4 5
4 5
1 1
4 5
4 5
2 1
1 5
2 1
1 5
1 5
1 5
1 1
3 5
2 5
2 5
4 5
1 1
1 1
4 5
1 1
3 5
4 5
1 1
1 1
1 1
3 5
4 1
1 1
4 1
4 5
4 5
4 5
3 1
1 1
3 5
3 1
4 5
4 5
1 1
2 5
1 5
1 5
1 1
1 1
1 1
4 5
4 1
2 1
1 5
4 5
4 5
1 1
4 5
4 5
4 5
3 5
2 5
4 5
2 5
1 1
1 1
2 5
4 5
1 5
1 1
1 5
1 5
4 5
1 1
1 5
4 5
1 5
1 5
1 1
3 5
4 5
3 5
1 5
1 5
4 5
4 5
2 1
4 5
2 1
3 5
3 5
2 5
4 5
2 5
3 5
1 1
1 1
1 5
2 5
4 5
3 5
4 5
4 5
1 1
4 5
4 5
2 5
1 1
1 1
1 1
3 5
1 1
4 5
4 5
4 5
4 5
4 5
4 5
3 5
2 5
1 5
1 5
1 5
1 1
1 1
4 5
4 5
3 5
2 1
1 1
1 1
1 1
1 1
1 1
1 1
1 1
1 1
1 5
1 1
1 1
1 5
4 5
1 1
1 1
1 5
1 5
1 1
3 5
2 5
1 1
1 1
1 5
4 1
3 1
4 5
4 1
4 5
4 5
3 1
4 5
3 1
4 5
3 5
4 5
4 5
4 5
2 1
2 5
4 5
3 5
1 1
1 1
1 1
1 1
1 1
1 1
4 1
4 1
1 1
1 1
1 1
1 1
1 5
1 1
3 1
4 5
4 5
2 1
4 1
1 1
1 1
1 1
1 1
1 1
1 1
1 1
1 1
1 1
1 1
3 1
3 1
1 1
1 1
2 1
1 1
1 1
1 1
2 1
1 5
1 1
1 1
2 5
4 5
4 5
2 1
4 5
3 5
3 5
3 1
1 1
3 1
1 1
3 1
1 5
4 5
1 1
1 1
1 1
4 5
1 1
2 1
3 1
1 1
4 1
1 1
1 1
3 1
1 1
1 1
1 1
1 1
3 5
1 1
1 1
1 1
1 1
2 1
4 5
1 1
1 1
4 5
1 1
1 1
1 1
1 1
3 1
1 1
1 1
1 1
4 5
1 1
1 1
1 1
1 1
1 1
1 1
1 5
1 1
1 1
1 5
1 1
1 1
1 1
1 1
3 5
1 1
3 5
1 1
1 1
1 1
3 1
4 5
3 1
3 1
4 5
1 1
1 5
1 5
1 5
1 1
1 5
1 1
3 1
1 5
4 5
4 5
1 1
1 1
1 1
1 1
1 1
1 1
1 5
1 1
1 1
1 1
2 1
2 5
1 1
3 1
1 1
1 1
1 1
1 1
1 1
1 5
2 1
1 1
2 1
1 1
1 1
2 5
1 1
1 5
1 1
2 5
1 5
4 5
1 1
4 5
1 1
3 5
1 1
2 1
4 1
4 5
4 5
1 5
2 5
2 1
4 5
1 1
1 1
1 1
4 5
3 5
1 5
1 1
1 1
1 1
1 1
1 1
1 1
1 5
1 1
1 1
1 1
1 5
1 1
1 1
1 1
1 1
1 5
4 1
1 1
1 1
1 1
1 1
1 1
1 1
1 1
1 5
1 1
1 1
1 1
1 1
1 1
1 1
1 1
1 1
1 1
1 1
1 1
1 1
4 5
1 1
1 1
1 1
1 1
1 1
3 5
3 5
4 5
1 1
1 1
4 5
2 5
4 5
1 1
3 1
1 5
1 1
1 1
1 1
4 5
4 5
3 1
1 1
1 5
1 1
1 1
4 1
2 1
2 5
2 1
4 5
2 1
1 1
1 5
1 5
1 1
1 1
1 1
1 1
1 1
1 1
1 1
1 1
1 1
4 5
1 5
3 5
1 1
1 5
1 1
1 1
1 5
1 1
1 1
1 1
3 5
2 1
4 5
4 5
4 5
3 1
4 5
4 5
4 5
4 5
4 5
4 5
3 5
3 5
3 5
3 5
4 5
4 5
4 5
4 5
4 5
4 5
2 1
2 5
2 5
3 5
3 5
1 1
1 1
1 1
1 5
1 5
1 1
1 1
1 5
1 1
1 5
4 5
4 1
4 5
4 5
2 5
1 1
3 5
2 5
1 5
1 1
1 1
1 1
3 5
4 5
4 1
4 5
2 1
4 5
3 5
1 5
1 1
1 1
3 5
4 5
2 5
2 1
4 5
1 5
1 1
1 5
1 1
1 1
3 5
1 1
1 2
1 1
1 5
2 5
3 5
1 5
1 1
1 1
1 1
2 1
2 1
4 5
1 1
1 1
1 1
1 1
4 5
4 5
3 1
3 1
4 1
4 5
2 1
4 5
4 1
4 5
3 5
4 5
2 1
2 1
2 1
1 1
1 1
1 1
1 1
1 1
4 5
1 1
2 5
1 1
1 1
1 1
1 1
1 1
1 1
1 1
1 5
1 1
4 5
4 5
4 5
3 1
3 5
4 5
4 1
1 1
1 5
1 1
1 1
1 1
1 1
1 1
3 5
4 5
1 1
1 1
4 1
3 1
1 1
1 1
1 1
1 5
1 1
1 1
3 5
1 1
3 5
1 1
1 1
4 5
1 1
4 5
4 5
3 5
4 5
1 1
4 5
2 1
1 1
3 5
2 1
1 1
1 5
1 1
1 1
1 1
1 1
1 1
4 5
1 1
1 1
4 5
1 1
1 1
1 1
1 1
1 1
4 5
1 1
4 1
1 1
1 1
1 5
2 5
4 5
1 1
3 5
3 1
1 1
1 1
4 5
4 5
4 5
4 5
4 5
4 5
4 5
4 5
4 5
4 5
4 5
4 5
4 5
4 5
2 1
4 5
1 1
2 1
3 5
3 1
3 5
3 5
3 5
3 5
3 5
3 1
1 1
1 5
4 1
4 5
4 5
4 1
2 5
1 1
3 5
3 5
3 5
3 5
3 5
2 1
2 5
1 1
1 1
1 1
4 5
4 5
4 1
4 5
4 5
4 5
1 1
2 1
1 1
1 1
1 5
1 1
1 1
1 1
1 1
1 1
1 1
1 5
1 1
1 1
1 1
1 1
1 1
1 1
1 1
1 1
1 5
1 1
1 5
1 1
1 1
1 1
1 1
1 1
1 1
1 5
1 1
1 1
1 1
1 1
1 1
1 1
1 1
4 5
4 5
4 5
4 5
2 1
2 5
1 5
1 1
4 1
2 1
4 5
3 5
2 5
3 5
4 5
1 5
4 5
3 5
3 5
3 5
3 5
3 5
4 5
2 1
2 5
1 1
1 5
1 1
1 1
1 5
4 5
2 1
3 1
4 5
1 1
1 1
1 1
4 5
1 1
4 5
4 5
4 1
2 5
2 5
1 5
1 5
1 1
1 1
1 1
4 5
3 5
4 5
2 1
3 1
2 5
2 1
4 5
2 1
2 1
3 1
4 5
1 1
4 1
1 1
1 5
1 1
1 1
1 1
1 5
1 1
2 1
3 1
3 1
2 1
4 5
1 1
1 1
1 5
3 5
1 1
1 1
1 1
1 5
1 1
1 1
1 1
1 1
1 1
1 1
1 1
2 1
1 1
1 5
2 5
4 5
3 5
3 5
1 1
1 1
1 1
1 1
4 1
1 1
4 5
4 5
1 1
1 1
2 1
1 1
3 5
4 5
4 1
1 1
1 1
1 1
1 1
2 1
1 1
1 1
1 1
1 1
3 5
1 5
1 1
1 1
1 5
1 1
1 1
1 1
2 1
1 1
1 1
1 1
4 5
1 1
1 1
1 5
1 1
1 1
4 5
4 5
1 1
1 1
4 5
1 1
1 1
4 5
2 1
4 5
1 1
1 1
4 5
1 1
1 1
4 5
1 1
3 5
3 5
2 1
1 5
1 5
1 1
1 1
1 5
1 1
1 1
4 5
1 1
4 5
1 1
4 5
4 5
4 5
4 5
4 5
1 1
4 5
1 1
1 5
1 1
5 5
5 5
5 5
5 5
5 5
5 5
5 5
5 5
5 5
5 5
5 5
5 5
5 5
5 5
5 5
5 5
5 5
5 5
5 5
5 5
5 5
5 5
5 5
5 5
5 5
1 5
5 5
5 5
5 5
5 5
5 5
5 5
5 5
5 5
5 5
5 5
5 5
5 5
5 5
5 5
5 5
5 5
5 5
5 5
5 5
5 5
5 5
5 1
5 5
5 5
5 5
5 5
5 5
5 5
5 5
5 5
5 5
5 5
5 5
5 5
5 5
5 5
5 5
5 5
5 5
5 5
5 5
5 5
5 5
5 5
5 5
5 5
5 5
5 5
5 5
5 5
5 5
5 5
5 5
5 5
4 5
5 5
5 5
5 5
5 5
5 5
5 5
5 5
5 5
5 5
5 5
5 5
1 1
1 1
1 1
5 5
5 5
5 5
5 5
5 5
5 5
5 5
5 5
3 5
5 5
5 5
5 5
5 5
5 5
5 5
5 5
1 1
4 5
5 5
1 1
1 1
1 1
4 5
5 5
5 5
5 5
5 5
5 5
5 5
5 5
5 5
5 5
5 5
1 5
5 5
5 5
5 5
5 5
5 5
5 5
5 5
5 5
5 5
5 5
1 5
5 5
5 5
5 5
5 5
5 5
5 5
5 5
5 5
5 5
5 5
5 5
5 5
5 5
5 5
5 5
5 5
5 5
5 5
5 5
5 5
5 5
3 1
5 5
5 5
5 5
5 5
5 5
5 5
5 5
5 5
5 5
5 5
5 5
2 1
5 5
5 5
5 5
5 5
5 5
5 5
5 5
5 5
5 5
5 5
5 5
5 5
5 5
5 5
5 5
5 5
5 5
5 5
5 5
5 5
5 5
5 5
1 1
5 5
5 5
5 5
5 5
5 5
5 5
5 5
5 5
5 5
5 5
5 5
5 5
5 5
5 5
5 5
5 5
5 5
1 1
5 5
5 5
2 1
5 5
5 5
2 1
5 5
5 5
3 5
5 5
5 5
5 5
5 5
5 5
5 5
5 5
5 5
5 5
3 5
5 5
5 5
5 5
5 5
5 5
5 5
2 5
3 5
5 5
5 5
1 5
5 5
5 5
5 5
5 5
1 5
5 5
1 5
1 5
5 5
5 5
5 5
5 5
5 5
5 5
1 5
5 5
5 5
5 5
5 5
5 5
5 5
5 5
5 5
5 5
5 5
5 5
5 5
5 5
5 1
5 5
5 5
5 1
5 5
5 5
5 5
5 5
5 5
5 5
5 5
5 5
5 5
5 5
5 5
5 5
5 5
5 5
5 5
5 5
5 5
5 5
5 5
5 5
5 5
5 5
5 5
5 5
5 5
5 5
5 5
5 5
5 5
5 5
5 5
4 5
4 5
1 1
1 5
5 5
5 5
5 5
5 5
5 5
1 5
5 5
5 5
5 5
5 5
5 5
5 5
5 5
5 5
5 5
5 5
5 5
5 5
5 5
5 5
5 5
5 5
5 5
5 5
5 5
5 5
5 5
5 5
5 5
5 5
5 5
5 1
5 5
5 5
5 5
5 5
5 5
3 5
3 5
5 5
5 5
3 1
5 5
4 5
5 5
5 5
5 5
5 5
5 5
5 5
5 5
5 5
3 5
5 5
5 5
5 5
5 5
5 5
5 5
4 5
5 5
2 5
4 5
5 5
5 5
5 5
2 5
1 5
5 5
5 5
5 5
1 1
1 1
1 1
5 5
1 5
4 5
5 5
5 5
1 1
5 5
5 5
3 5
5 5
5 5
5 5
5 5
5 5
5 1
1 1
2 5
5 5
2 5
4 5
5 5
5 5
1 5
5 5
5 5
1 1
3 5
5 5
5 5
2 5
5 5
1 5
5 5
1 1
1 1
5 5
5 5
5 5
5 5
5 5
1 1
4 5
5 5
1 1
5 5
4 1
4 5
4 5
5 5
5 5
5 5
5 5
5 5
5 5
5 5
5 5
5 5
5 5
5 5
4 5
5 5
5 5
5 5
5 5
5 5
5 5
4 5
5 5
5 5
5 5
5 5
5 5
5 5
4 5
5 5
5 5
5 5
5 5
5 5
4 5
4 5
5 5
5 1
5 5
5 5
4 5
5 5
5 5
5 5
5 5
5 5
4 1
5 5
5 5
3 5
4 5
5 5
3 1
4 5
5 5
4 5
5 5
5 5
5 5
4 5
5 5
5 5
5 5
5 5
5 5
5 5
5 5
5 5
5 5
5 5
5 5
5 5
5 5
5 5
5 5
5 5
4 1
3 5
5 5
5 5
3 5
4 1
4 5
3 1
5 5
3 5
5 5
5 5
4 5
5 5
5 5
4 1
4 5
4 1
3 5
4 1
5 5
5 5
5 5
5 5
5 5
5 5
5 5
4 5
5 5
3 1
2 1
5 5
5 5
5 5
5 5
5 5
5 5
5 5
5 5
5 5
5 5
5 5
5 5
5 5
5 5
5 5
5 5
5 5
5 5
5 5
5 5
5 5
5 5
5 5
5 5
5 5
5 5
5 5
3 1
5 5
2 1
2 1
5 5
1 1
2 5
4 5
1 1
5 5
4 5
5 5
5 5
5 5
5 5
1 1
1 5
1 1
1 1
2 1
4 5
1 1
5 5
1 5
5 5
1 1
1 1
1 5
1 5
5 5
5 5
1 1
5 5
4 5
1 1
5 5
1 5
4 1
4 5
5 5
5 5
5 5
5 5
5 5
5 5
5 5
1 1
5 1
5 5
1 5
5 5
5 5
5 5
5 5
4 5
5 5
5 5
4 5
4 5
5 5
4 5
5 5
5 5
5 5
5 5
5 5
5 5
5 5
5 5
5 5
5 5
5 5
5 1
1 1
1 1
5 5
5 5
5 5
5 5
5 5
5 5
5 5
5 5
5 5
5 5
5 5
5 5
5 5
5 5
5 5
5 5
5 5
5 5
5 5
5 5
5 5
5 5
5 5
5 5
5 5
5 5
5 5
5 5
5 5
5 5
5 5
5 5
5 5
5 5
5 5
5 1
5 5
5 5
4 5
5 5
5 5
4 5
5 5
5 5
5 5
5 5
5 5
5 5
5 5
5 5
5 5
5 5
5 5
5 5
5 5
1 1
5 5
2 1
5 5
5 5
4 5
5 5
5 5
2 5
1 1
5 5
5 5
5 5
2 1
5 5
5 5
5 5
5 5
5 5
5 5
5 5
5 5
5 5
5 5
5 5
5 5
2 1
1 1
5 5
5 5
5 5
5 5
5 5
5 5
5 5
5 5
5 5
5 5
5 5
5 5
2 1
5 5
5 5
4 5
5 5
5 5
5 5
1 5
5 5
5 5
5 5
5 5
5 5
5 5
5 5
5 5
5 5
5 5
5 5
5 5
5 5
5 5
2 1
5 5
5 5
5 5
5 5
5 5
5 5
5 5
5 5
5 5
5 5
5 5
5 5
5 5
5 5
5 5
5 5
5 5
5 5
5 5
5 5
5 5
5 5
5 5
4 5
5 5
5 5
5 5
5 5
5 5
5 5
5 5
5 5
5 5
5 5
5 5
5 5
5 5
5 5
5 5
5 5
5 5
5 5
5 5
5 5
5 5
5 5
5 5
5 5
5 5
5 5
5 5
5 5
5 5
5 5
5 5
5 5
2 5
5 5
5 5
4 5
5 5
5 5
5 5
5 5
4 5
5 5
5 5
5 5
1 1
1 1
1 1
1 1
4 5
5 5
5 5
5 5
5 5
5 5
4 5
1 5
5 5
2 1
5 5
5 5
5 5
5 5
5 5
5 5
5 5
5 5
4 5
5 5
2 5
4 5
5 5
5 5
1 1
5 5
5 5
5 5
4 5
5 5
5 5
5 5
5 5
5 5
5 5
2 1
5 5
5 5
5 5
5 5
5 5
1 1
3 5
5 5
5 5
4 5
5 5
5 5
3 5
5 5
5 5
5 5
5 5
5 5
5 5
5 5
5 5
5 5
5 5
5 5
5 5
5 5
4 5
5 5
5 5
5 5
5 5
3 1
5 5
5 5
5 5
5 5
5 5
5 5
5 5
5 5
5 5
5 5
5 5
3 5
5 5
5 5
5 5
5 5
5 5
5 5
5 5
2 5
5 5
5 1
5 5
5 5
5 5
5 5
5 5
1 1
5 5
5 5
5 5
5 5
5 5
5 5
5 5
5 5
5 5
5 5
5 1
5 5
5 5
5 5
5 5
5 5
4 5
5 5
5 5
5 5
5 5
5 5
4 5
4 5
5 5
5 5
5 5
5 5
5 5
5 5
5 5
5 5
5 5
5 5
5 5
3 5
5 1
5 5
5 5
2 1
1 5
5 5
1 1
5 5
1 1
1 1
1 1
5 5
5 5
5 5
5 5
1 1
5 5
5 5
5 5
5 5
5 5
5 5
5 5
5 5
5 5
5 5
5 5
5 5
5 5
5 5
5 5
5 5
4 5
4 5
5 5
5 5
5 5
5 5
5 5
5 5
3 1
5 5
5 5
5 5
4 5
4 5
5 5
1 1
5 5
5 5
5 5
5 5
5 5
5 5
5 5
5 5
5 5
5 5
1 1
5 5
5 5
5 5
5 5
5 5
5 5
5 5
5 5
5 5
5 5
5 5
5 5
5 5
5 5
5 5
5 5
5 5
5 5
5 5
5 5
5 5
5 5
5 5
5 5
5 5
5 5
5 5
5 5
5 5
5 5
5 5
5 5
5 5
5 5
5 5
5 5
5 5
5 5
5 5
5 5
5 5
5 5
5 5
5 5
5 5
5 5
5 5
5 5
5 5
5 5
5 5
5 5
5 5
5 5
5 5
5 5
5 5
5 5
5 5
5 5
5 5
5 5
5 5
5 5
5 5
5 5
5 5
5 5
5 5
5 5
5 5
5 5
5 5
5 5
5 5
5 5
5 5
5 5
5 5
5 5
5 5
4 5
5 5
5 5
5 5
5 5
5 5
5 5
5 5
5 5
5 5
5 5
5 5
5 5
5 5
5 5
5 5
5 5
5 5
5 5
5 5
5 5
5 5
5 5
5 5
5 5
5 5
5 5
5 5
5 5
5 5
5 5
3 5
5 5
5 5
5 5
5 5
5 5
5 5
5 5
5 5
5 5
5 5
5 5
5 5
5 5
5 5
5 5
5 5
5 5
5 5
5 5
5 5
5 5
5 5
5 5
5 5
5 5
5 5
5 5
5 5
5 5
5 5
5 5
5 5
5 5
5 5
5 5
5 5
5 5
5 5
5 5
5 5
5 5
5 5
5 5
5 5
5 5
5 5
5 5
5 5
5 5
5 5
5 5
5 5
5 5
5 5
5 5
5 5
5 5
5 5
5 5
5 5
5 5
5 5
5 5
5 5
5 5
5 5
5 5
5 5
5 5
5 5
5 5
5 5
5 5
5 5
5 5
5 5
5 5
5 5
5 5
5 5
5 5
5 5
5 5
5 5
5 5
5 5
5 5
5 5
5 5
5 5
5 5
5 5
5 5
5 5
5 5
5 5
5 5
5 5
5 5
5 5
5 5
5 5
5 5
5 5
5 5
5 5
5 5
5 5
5 5
5 5
5 5
5 5
5 5
5 5
5 5
5 5
5 5
5 5
5 5
5 5
5 5
5 5
5 5
5 5
5 5
5 5
5 5
5 5
4 5
5 5
5 5
5 5
4 5
5 5
5 5
5 5
5 5
5 5
5 5
5 5
5 5
5 5
5 5
5 5
5 5
4 5
5 5
5 5
5 5
5 5
5 5
5 5
5 5
5 5
5 5
5 5
5 5
5 5
5 5
5 5
5 5
5 5
5 5
5 5
5 5
5 5
5 5
5 5
5 5
5 5
5 5
5 5
5 5
5 5
5 5
5 5
5 5
5 5
5 5
4 5
5 5
5 5
5 5
5 5
5 5
5 5
5 5
5 5
5 5
4 5
5 5
5 5
5 5
5 5
5 5
5 5
5 5
5 5
5 5
5 5
5 5
5 5
5 5
5 5
5 5
5 5
5 5
5 5
5 5
5 5
4 5
5 5
5 5
5 5
5 5
5 5
5 5
5 5
5 5
5 5
5 5
5 5
5 5
5 5
5 5
5 5
5 5
5 5
5 5
5 5
5 5
5 5
5 5
5 5
5 5
5 5
5 5
5 5
5 5
5 5
5 5
5 5
5 5
5 5
5 5
5 5
5 5
5 5
5 5
5 5
5 5
5 5
5 5
5 5
5 5
4 5
5 5
5 5
5 5
5 5
5 5
5 5
5 5
5 5
5 5
5 5
5 5
5 5
5 5
5 5
5 5
5 5
5 5
5 5
5 5
5 5
5 5
5 5
5 5
5 5
5 5
5 5
5 5
5 5
5 5
5 5
5 5
5 5
5 5
5 5
5 5
5 5
5 5
5 5
5 5
5 5
5 5
5 5
5 5
5 5
5 5
5 5
5 5
4 5
5 5
5 5
5 5
5 5
5 5
5 5
4 5
5 5
5 5
5 5
5 5
5 5
5 5
5 5
5 5
5 5
5 5
1 5
5 5
5 5
5 5
5 5
5 5
5 5
5 5
5 5
5 5
5 5
5 5
5 5
1 5
5 5
5 5
5 5
5 5
5 5
5 5
5 5
5 5
5 5
5 5
5 5
5 5
5 5
5 5
5 5
5 5
5 5
5 5
5 5
5 5
5 5
5 5
5 5
5 5
5 5
5 5
5 5
5 5
5 5
5 5
5 5
5 5
5 5
5 5
5 5
5 5
5 5
5 5
5 5
5 5
5 5
5 5
5 5
5 5
5 5
5 5
5 5
5 5
5 5
5 5
5 5
5 5
5 5
5 5
5 5
5 5
5 5
5 5
5 5
5 5
5 5
5 5
5 5
5 5
5 5
5 5
5 5
5 5
5 5
5 5
5 5
5 5
5 5
2 5
5 5
5 5
5 5
5 5
4 5
5 5
5 5
5 5
5 5
2 5
5 5
5 5
5 5
5 5
5 5
5 5
5 5
5 5
5 5
5 5
5 5
5 5
5 5
5 5
5 5
5 5
5 5
5 5
5 5
5 5
5 5
5 5
5 5
5 5
5 5
5 5
5 5
5 5
5 5
5 5
5 5
5 5
5 5
5 5
5 5
5 5
5 5
5 5
5 5
5 5
5 5
5 5
5 5
5 5
5 5
5 5
5 5
5 5
5 5
4 5
5 5
5 5
5 5
5 5
5 5
5 5
5 5
5 5
5 5
5 5
5 5
5 5
5 5
5 5
5 5
5 5
5 5
5 5
5 5
5 5
5 5
5 5
5 5
5 5
5 5
5 5
5 5
5 5
5 5
5 5
5 5
5 5
5 5
5 5
5 5
5 5
5 5
5 5
5 5
5 5
5 5
5 5
5 5
5 5
5 5
5 5
5 5
5 5
5 5
5 5
5 5
5 5
5 5
5 5
5 5
5 5
5 5
5 5
5 5
5 5
5 5
5 5
5 5
5 5
5 5
5 5
5 5
5 5
5 5
5 5
5 5
5 5
5 5
5 5
5 5
5 5
5 5
5 5
5 5
5 5
5 5
5 5
5 5
5 5
5 5
5 5
5 5
5 5
5 5
5 5
5 5
5 5
5 5
5 5
5 5
5 5
5 5
5 5
5 5
5 5
5 5
5 5
5 5
5 5
5 5
5 5
5 5
5 5
5 5
5 5
5 5
5 5
5 5
5 5
5 5
5 5
5 5
5 5
5 5
5 5
5 5
5 5
5 5
5 5
5 5
5 5
5 5
5 5
5 5
1 5
5 5
5 5
5 5
5 5
5 5
5 5
5 5
5 5
5 5
5 5
5 5
5 5
5 5
5 5
5 5
5 5
5 5
5 5
5 5
5 5
5 5
5 5
5 5
5 5
4 5
5 5
5 5
5 5
5 5
5 5
5 5
5 5
5 5
5 5
5 5
2 5
5 5
5 5
5 5
5 5
5 5
5 5
5 5
5 5
5 5
5 5
5 5
5 5
5 5
5 5
5 5
5 5
5 5
5 5
5 5
5 5
5 5
5 5
5 5
5 5
5 5
5 5
5 5
5 5
5 5
5 5
5 5
5 5
5 5
5 5
5 5
5 5
5 5
5 5
2 1
5 5
5 5
5 5
1 1
4 5
4 5
4 5
4 5
4 5
4 5
1 1
5 5
5 5
4 5
1 5
5 5
5 5
3 5
5 5
3 1
5 5
3 5
5 5
5 5
4 5
5 5
5 5
5 5
5 5
5 5
5 5
5 5
5 5
4 5
4 5
4 5
4 5
4 5
4 5
4 5
4 5
4 5
2 5
2 5
2 1
2 1
2 5
3 1
2 1
1 5
2 5
5 5
5 5
1 1
1 1
1 1
1 5
1 1
1 5
5 5
5 5
5 5
5 5
5 5
5 5
4 5
5 5
5 5
5 5
4 5
5 5
5 5
5 5
5 5
5 5
5 5
5 5
5 5
5 5
5 5
5 5
5 5
5 5
5 5
5 5
5 5
5 5
5 5
5 5
5 5
5 5
5 5
5 5
5 5
5 5
5 5
5 5
5 5
5 5
5 5
5 5
5 5
5 5
5 5
5 5
5 5
5 5
5 5
5 5
5 5
5 5
5 5
5 5
5 5
5 5
5 5
5 5
5 5
5 5
5 5
5 5
5 5
5 5
5 5
5 5
5 5
5 5
5 5
5 5
5 5
5 5
5 5
5 5
5 5
5 5
5 5
5 5
5 5
5 5
5 5
5 5
5 5
5 5
5 5
5 5
5 5
5 5
5 5
5 5
5 5
5 5
5 5
5 5
5 5
5 5
5 5
5 5
5 5
5 5
5 5
5 5
5 5
5 5
5 5
5 5
5 5
5 5
5 5
5 5
5 5
5 5
5 5
5 5
5 5
5 5
5 5
5 5
5 5
5 5
5 5
5 5
5 5
5 5
5 5
5 5
5 5
5 5
5 5
5 5
5 5
5 5
5 5
5 5
5 5
5 5
5 5
5 5
5 5
5 5
5 5
5 5
5 5
5 5
5 5
5 5
5 5
5 5
5 5
5 5
5 5
5 5
5 5
5 5
5 5
5 5
5 5
5 5
5 5
5 5
5 5
5 5
5 5
5 5
5 5
5 5
5 5
5 5
5 5
5 5
5 5
5 5
5 5
5 5
5 5
5 5
5 5
5 5
5 5
5 5
5 5
5 5
5 5
5 5
5 5
5 5
5 5
5 5
5 5
5 5
5 5
5 5
5 5
5 5
5 5
5 5
5 5
5 5
5 5
4 5
5 5
5 5
5 5
5 5
5 5
5 5
4 5
5 5
5 5
5 5
4 5
5 5
4 5
5 5
5 5
5 5
5 5
5 5
5 5
4 5
5 5
5 5
5 5
4 5
5 5
5 5
5 5
5 5
5 5
5 5
4 1
4 5
5 5
4 5
5 5
5 5
5 5
5 5
4 5
5 5
5 5
5 5
5 5
5 5
4 5
5 5
5 5
5 5
5 5
5 5
5 5
5 5
5 5
5 5
5 5
5 5
5 5
5 5
5 5
5 5
5 5
5 5
5 5
5 5
5 5
5 5
5 5
5 5
5 5
4 5
5 5
5 5
5 5
5 5
5 5
5 5
5 5
5 5
5 5
5 5
5 5
5 5
5 5
5 5
5 5
5 5
5 5
5 5
5 5
4 5
5 5
5 5
5 5
5 5
5 5
5 5
5 5
5 5
5 5
5 5
5 5
5 5
5 5
5 5
5 5
5 5
5 5
5 5
5 5
5 5
5 5
5 5
5 5
3 5
5 5
5 5
5 5
5 5
5 5
5 5
5 5
5 5
5 5
5 5
5 5
5 5
5 5
5 5
5 5
5 5
5 5
5 5
5 5
5 5
5 5
5 5
5 5
5 5
5 5
5 5
5 5
5 5
5 5
5 5
5 5
5 5
5 5
5 5
5 5
5 5
5 5
5 5
5 5
5 5
5 5
5 5
5 5
5 5
5 5
5 5
5 5
5 5
5 5
5 5
5 5
5 5
5 5
5 5
5 5
5 5
3 5
5 5
5 5
5 5
5 5
5 5
5 5
5 5
5 5
5 5
5 5
5 5
5 5
5 5
5 5
5 5
5 5
5 5
5 5
5 5
5 5
5 5
5 5
5 5
5 5
5 5
5 5
5 5
5 5
5 5
5 5
5 5
5 5
5 5
5 5
5 5
5 5
5 5
5 5
5 5
5 5
5 5
5 5
5 5
5 5
5 5
5 5
5 5
5 5
5 5
5 5
5 5
5 5
5 5
5 5
5 5
5 5
5 5
5 5
5 5
5 5
5 5
5 5
3 5
5 5
5 5
5 5
5 5
5 5
5 5
5 5
5 5
5 5
5 5
5 5
5 5
5 5
5 5
5 5
5 5
5 5
5 5
5 5
5 5
5 5
5 5
5 5
5 5
5 5
4 5
5 5
5 5
5 5
5 5
5 5
5 5
5 5
5 5
5 5
5 5
5 5
5 5
5 5
5 5
5 5
5 5
5 5
5 5
5 5
5 5
5 5
5 5
4 5
5 5
5 5
5 5
5 5
5 5
5 5
5 5
3 5
5 5
5 5
5 5
5 5
5 5
5 5
5 5
5 5
5 5
5 5
5 5
2 1
5 5
5 5
4 5
5 5
5 5
5 5
5 5
5 5
5 5
5 5
5 5
5 5
5 5
5 5
4 5
5 5
5 5
5 5
5 5
1 5
5 5
5 5
5 5
5 5
5 5
5 5
5 5
5 5
5 5
5 5
5 5
5 5
5 5
3 5
5 5
5 5
5 5
5 5
5 5
5 5
5 5
5 5
5 5
5 5
5 5
5 5
5 5
2 5
5 5
2 5
5 5
5 5
5 5
4 5
5 5
5 5
5 5
5 5
5 5
2 5
5 5
5 5
5 5
5 5
5 5
5 5
2 5
5 5
5 5
5 5
5 5
2 5
5 5
5 5
2 1
5 5
5 5
5 5
5 5
5 5
5 5
5 5
5 5
5 5
5 5
5 5
5 5
5 5
5 5
5 5
5 5
5 5
5 5
5 5
5 5
5 5
3 1
5 5
5 5
5 5
5 5
1 1
1 1
1 1
5 5
5 5
1 1
1 1
5 5
5 5
1 5
4 5
5 5
1 5
1 5
5 5
5 5
2 5
5 5
5 5
1 5
1 1
5 5
5 5
5 5
5 5
5 5
5 5
5 5
5 5
5 5
5 5
5 5
5 5
5 5
5 5
5 5
5 5
5 5
5 5
5 5
5 5
5 5
5 5
3 5
5 5
5 5
5 5
5 5
5 5
5 5
5 5
5 5
5 5
5 5
5 5
5 5
5 5
5 5
5 5
5 5
5 5
5 5
5 5
5 5
5 5
5 5
5 5
5 5
5 5
4 5
5 5
5 5
5 5
5 5
5 5
5 5
5 5
5 5
5 5
3 5
1 5
5 5
5 5
5 5
5 5
5 5
5 5
1 5
5 5
5 5
5 5
5 5
5 5
5 5
5 5
5 5
5 5
5 5
5 5
5 5
5 5
5 5
5 5
5 5
5 5
5 5
5 5
5 5
1 5
5 5
5 5
5 5
5 5
5 5
5 5
5 5
5 5
2 5
5 5
4 5
5 5
5 5
5 5
5 5
5 5
5 5
5 5
5 5
1 5
5 5
5 5
1 1
5 5
5 5
5 5
5 5
2 5
5 5
5 5
5 5
5 5
5 5
5 5
5 5
5 5
5 5
5 5
5 5
5 5
5 5
5 5
5 5
5 5
5 5
1 1
5 5
5 5
5 5
5 5
5 5
5 5
5 5
5 5
5 5
5 5
5 5
5 5
2 5
5 5
5 5
5 5
5 5
5 5
5 5
5 5
5 5
5 5
4 5
5 5
4 5
4 5
5 5
5 5
5 5
5 5
5 5
5 5
5 5
5 5
5 5
5 5
5 5
5 5
5 5
5 5
5 5
5 5
5 5
5 5
5 5
1 1
5 5
5 5
5 5
5 5
1 1
5 5
5 5
5 5
1 1
5 5
5 5
5 5
5 5
1 1
5 5
5 5
5 5
5 5
5 5
5 5
5 5
5 5
5 5
5 5
5 5
5 5
5 5
5 5
5 5
5 5
1 1
5 5
4 5
5 5
5 5
5 5
5 5
5 5
5 5
5 5
5 5
5 5
5 5
5 5
5 5
5 5
4 5
5 5
5 5
5 5
5 5
5 5
5 5
5 5
5 5
5 5
5 5
5 5
5 5
5 5
5 5
5 5
5 5
5 5
4 5
5 5
5 5
5 5
5 5
5 5
5 5
5 5
5 5
5 5
5 5
5 5
5 5
5 5
5 5
5 5
5 5
5 5
2 1
5 5
5 5
5 5
3 5
5 5
5 5
5 5
5 5
5 5
5 5
5 5
5 5
5 5
5 5
5 5
5 5
5 5
5 5
5 5
5 5
5 5
5 5
5 5
5 5
5 5
5 5
5 5
5 5
5 5
5 5
5 5
5 5
5 5
5 5
5 5
5 5
5 5
5 5
5 5
5 5
5 5
5 5
5 5
5 5
5 5
5 5
5 5
5 5
5 5
5 5
5 5
5 5
5 5
5 5
5 5
5 5
5 5
5 5
5 5
5 5
5 5
5 5
5 5
5 5
5 5
5 5
5 5
5 5
5 5
5 5
5 5
5 5
5 5
5 5
5 5
4 5
5 5
5 5
5 5
5 5
5 5
5 5
5 5
5 5
5 5
5 5
5 5
5 5
3 5
5 5
5 5
5 5
5 5
5 5
5 5
4 5
2 5
1 5
5 5
5 5
5 5
1 1
5 5
5 5
5 5
5 5
5 5
5 5
5 5
5 5
5 5
5 5
5 5
5 5
5 5
5 5
5 5
5 5
5 5
5 5
4 5
3 5
5 5
3 5
5 5
5 5
5 5
4 1
5 5
5 5
1 1
5 5
5 5
5 5
5 5
5 5
5 5
5 5
5 5
5 5
1 5
5 5
1 1
5 5
5 5
1 1
5 5
5 5
5 5
5 5
5 5
4 5
5 5
5 5
3 5
5 5
5 5
5 5
5 5
5 5
5 5
5 5
3 5
5 5
5 5
5 5
5 5
5 5
5 5
2 5
5 5
5 5
5 5
5 5
5 5
5 5
5 5
5 5
5 5
5 5
5 5
5 5
5 5
5 5
5 5
5 5
5 5
3 1
5 5
5 5
5 5
1 1
5 5
5 5
5 5
5 5
5 5
5 5
5 5
5 5
5 5
5 5
5 5
5 5
5 5
5 5
2 5
5 5
5 5
5 1
5 5
5 5
5 5
5 5
5 5
5 5
5 5
5 5
5 5
5 5
5 5
5 5
5 5
5 5
5 5
5 5
5 5
5 5
5 5
4 5
5 5
5 5
5 5
5 5
5 5
5 5
5 5
5 5
5 5
5 5
5 5
5 5
5 5
5 5
5 5
5 5
5 5
2 5
5 5
5 5
5 5
2 1
5 5
5 5
5 5
1 1
1 1
4 5
5 5
5 5
5 5
5 5
5 5
5 5
4 5
1 1
5 5
1 1
5 5
5 5
1 1
5 5
5 5
5 5
5 5
5 5
5 5
5 5
5 5
5 5
5 5
5 5
5 5
5 5
5 5
5 5
5 5
5 5
5 5
5 5
5 5
5 5
5 5
5 5
5 5
5 5
5 5
5 5
5 5
5 5
5 5
5 5
5 5
5 5
5 5
5 5
3 5
5 5
5 5
5 5
5 5
5 5
1 1
1 1
1 1
5 5
1 1
5 5
5 5
5 5
5 5
5 5
5 5
5 5
5 5
5 5
5 5
5 5
5 5
5 5
5 5
5 5
5 5
5 5
5 5
5 5
5 5
1 5
1 5
5 5
5 5
5 5
5 5
5 5
5 5
5 5
5 5
5 5
5 5
5 5
5 5
5 5
5 5
5 5
5 5
5 5
5 5
5 5
5 5
5 5
5 5
5 5
5 5
5 5
1 1
5 5
5 5
5 5
5 5
5 5
5 5
5 5
5 5
5 5
5 5
5 5
5 5
5 5
5 5
5 5
5 5
5 5
5 5
5 5
5 5
5 5
5 5
5 5
5 5
5 5
5 5
5 5
5 5
5 5
5 5
5 5
5 5
5 5
5 5
5 5
5 5
5 5
5 5
5 5
5 5
2 5
5 5
5 5
5 5
5 5
5 5
5 5
5 5
5 5
5 5
5 5
5 5
5 5
5 5
5 5
5 5
5 5
5 5
5 5
5 5
5 5
5 5
4 5
4 5
5 5
5 5
5 5
5 5
5 5
5 5
5 5
2 5
5 5
5 5
5 5
1 5
5 5
5 5
5 5
5 5
5 5
5 5
5 5
5 5
5 5
5 5
5 5
5 5
5 5
5 5
1 1
1 1
4 5
5 5
4 5
2 5
1 5
5 5
5 5
5 5
5 5
5 5
5 5
5 5
5 5
5 5
5 5
5 5
5 5
5 5
1 5
4 5
3 5
2 5
5 5
5 5
5 5
5 5
5 5
5 5
5 5
5 5
5 5
5 5
5 5
4 5
5 5
4 5
5 5
5 5
5 5
4 5
5 5
5 5
5 5
5 5
5 5
5 5
5 5
5 5
5 5
5 5
5 5
5 5
5 5
5 5
5 5
5 5
5 1
5 5
5 5
5 5
5 5
5 5
5 5
5 5
5 5
1 1
1 1
4 1
5 5
5 5
5 5
5 5
5 5
5 5
5 5
5 5
5 5
5 5
5 5
5 5
5 5
5 5
5 5
5 5
4 5
4 5
5 5
5 5
5 5
5 5
3 5
2 5
2 1
1 1
1 5
5 5
5 5
5 5
5 5
5 5
5 5
5 5
5 5
5 5
5 5
5 5
5 5
5 5
5 5
5 5
5 5
5 5
5 5
5 5
5 5
5 5
5 5
5 5
5 5
5 5
2 5
5 5
5 5
5 5
5 5
5 5
5 5
5 5
5 5
5 5
5 5
5 5
5 5
5 5
5 5
5 5
5 5
5 5
5 5
5 5
5 5
5 5
5 5
5 5
5 5
5 5
4 5
4 5
4 5
4 5
4 5
5 5
2 5
5 5
5 5
5 5
3 5
5 5
5 5
5 5
2 1
4 5
5 5
5 5
4 5
5 5
5 5
5 5
5 5
5 5
5 5
5 5
5 5
5 5
5 5
5 5
5 5
5 5
5 5
5 5
5 5
5 5
5 5
5 5
5 5
5 5
5 5
5 5
5 5
5 5
5 5
5 5
5 5
5 5
5 5
5 5
5 5
5 5
5 5
5 5
5 5
5 5
5 5
5 5
5 5
5 5
5 5
5 5
5 5
5 5
5 5
5 5
5 5
5 5
5 5
5 5
5 5
5 5
5 5
5 5
5 5
5 5
5 5
5 5
5 5
5 5
5 5
5 5
5 5
5 5
5 5
5 5
5 5
5 5
5 5
5 5
5 5
5 5
5 5
5 5
5 5
5 5
5 5
5 5
5 5
5 5
5 5
5 5
5 5
5 5
5 5
5 5
5 5
5 5
5 5
5 5
5 5
5 5
5 5
5 5
5 5
5 5
5 5
5 5
5 5
5 5
5 5
5 5
5 5
5 5
5 5
5 5
5 5
5 5
5 5
5 5
5 5
5 5
5 5
5 5
5 5
5 5
5 5
5 5
5 5
5 5
5 5
5 5
5 5
5 5
5 5
5 5
4 5
4 5
4 5
5 5
5 5
5 5
5 5
5 5
5 5
5 5
5 5
5 5
5 5
5 5
5 5
5 5
5 5
4 5
5 5
5 5
5 5
5 5
5 5
5 5
5 5
5 5
5 5
5 5
5 5
5 5
5 5
5 5
5 5
5 5
5 5
5 5
5 5
5 5
5 5
5 5
5 5
5 5
5 5
5 5
5 5
5 5
5 5
5 5
3 5
5 5
5 5
5 5
5 5
5 5
5 5
5 5
5 5
5 5
5 5
5 5
5 5
5 5
5 5
5 5
5 5
5 5
5 5
5 5
5 5
5 5
5 5
5 5
5 5
5 5
5 5
5 5
5 5
5 5
5 5
5 5
5 5
5 5
5 5
5 5
5 5
5 5
5 5
5 5
5 5
5 1
5 5
5 5
5 5
5 5
5 5
5 5
3 5
5 5
5 5
5 5
5 5
5 5
5 5
5 5
5 5
5 5
5 5
5 5
5 5
5 5
5 5
4 5
5 5
5 5
5 5
5 5
5 5
5 5
5 5
5 5
4 5
5 5
5 5
5 5
5 5
5 5
5 5
5 5
5 5
2 5
5 5
5 5
5 5
5 5
5 5
5 5
5 5
4 5
5 5
4 5
5 5
2 1
5 5
5 5
5 5
5 5
5 5
5 5
3 5
5 5
5 5
5 5
5 5
5 5
5 5
3 5
5 5
5 5
5 5
5 5
5 5
5 5
5 5
5 5
5 5
5 5
5 5
5 5
5 5
5 5
5 5
5 5
5 5
5 5
5 5
5 5
5 5
5 5
5 5
4 5
5 5
5 5
5 5
4 5
1 5
5 5
1 1
1 5
1 1
5 5
1 1
1 1
5 5
1 1
1 5
5 5
5 5
1 1
5 5
5 5
5 5
4 5
4 5
5 5
5 5
5 5
5 5
5 5
5 5
5 5
5 5
5 5
5 5
5 5
5 5
5 5
5 5
5 5
5 5
5 5
5 5
5 5
5 5
5 5
5 5
5 5
5 5
5 5
5 5
5 5
5 5
5 5
5 5
5 5
5 5
5 5
5 5
5 5
5 5
5 5
5 5
5 5
5 5
5 5
5 5
5 5
5 5
5 5
5 5
5 5
5 5
1 1
5 5
5 5
5 5
5 5
5 5
4 5
5 5
5 5
5 5
5 5
2 1
5 5
5 5
5 5
5 5
5 5
5 5
5 5
5 5
1 5
1 5
1 1
5 5
5 5
5 5
1 1
5 5
5 5
5 5
5 5
5 5
5 1
5 5
5 5
5 5
5 5
5 5
5 5
5 5
5 5
5 5
5 5
5 5
5 5
5 5
4 5
5 5
5 5
5 5
5 5
1 5
5 5
5 5
5 5
5 5
5 5
5 5
5 5
5 5
5 5
5 5
5 5
5 5
5 5
5 5
5 5
5 5
4 5
5 5
4 5
5 5
2 5
5 5
5 5
5 5
5 5
5 5
5 5
5 5
5 5
5 5
5 5
5 5
5 5
5 5
5 5
5 5
5 5
5 5
5 5
5 5
5 5
5 5
5 5
4 5
5 5
5 5
5 5
5 5
5 5
5 5
5 5
5 5
5 5
5 5
5 5
5 5
5 5
5 5
1 1
5 5
5 5
5 5
5 5
1 1
5 5
5 5
5 5
5 5
5 5
5 5
5 5
5 5
5 5
5 5
5 5
5 5
5 5
5 5
5 5
5 5
5 5
5 5
5 5
5 5
5 5
5 5
4 5
5 5
5 5
5 5
5 5
5 5
5 5
5 5
5 5
5 5
5 5
5 5
5 5
5 5
5 5
2 1
4 5
5 5
5 5
5 5
5 5
4 5
5 5
5 5
5 5
5 5
5 5
4 5
5 5
5 5
5 5
5 5
5 5
5 5
5 5
5 5
5 5
5 5
5 5
5 5
5 5
5 5
5 5
5 5
5 5
5 5
5 5
5 5
5 5
5 5
5 5
5 5
5 5
5 5
4 5
5 5
5 5
5 5
5 5
5 5
5 5
5 5
5 5
5 5
5 5
5 5
5 5
5 5
5 5
5 5
5 5
5 5
5 5
5 5
5 5
5 5
5 5
5 5
2 1
5 5
1 1
5 5
5 5
5 5
5 5
5 5
5 5
5 5
5 5
5 5
5 5
5 5
5 5
5 5
5 5
5 5
1 1
5 5
5 5
1 5
5 5
5 5
5 5
5 5
5 5
5 5
5 5
5 5
5 5
5 5
5 5
5 5
5 5
5 5
5 5
5 5
5 5
5 5
5 5
5 5
5 5
5 5
5 5
5 5
5 5
5 5
5 5
5 5
5 5
5 5
5 5
5 5
5 5
5 5
5 5
5 5
5 5
5 5
5 5
5 5
5 5
5 5
5 5
5 5
5 5
5 5
5 5
5 5
5 5
5 5
5 5
5 5
5 5
5 5
5 5
1 1
5 5
5 5
5 5
5 5
5 5
5 5
5 5
5 5
5 5
4 5
5 5
5 5
5 5
5 5
5 5
5 5
5 5
5 5
5 5
5 5
5 5
5 5
5 5
5 5
5 5
5 5
5 5
5 5
5 5
5 5
5 5
5 5
5 5
5 5
5 5
5 1
5 5
5 5
5 5
5 5
5 5
5 5
5 5
5 5
5 5
5 5
5 5
5 5
5 5
5 5
5 5
5 5
5 5
5 5
2 5
5 5
2 5
5 5
2 5
5 5
5 5
5 5
3 1
5 5
5 5
1 5
5 5
5 5
5 5
2 5
5 5
5 5
5 5
5 5
5 5
5 5
1 1
5 5
5 5
5 5
3 5
5 5
5 5
5 5
5 5
5 5
5 5
5 5
5 5
5 5
5 5
5 5
5 5
5 5
5 5
5 5
5 5
4 5
5 5
5 5
5 5
5 5
5 5
2 5
5 5
4 5
5 5
4 5
5 5
5 5
5 5
3 5
1 5
5 5
5 5
5 5
5 5
5 5
5 5
5 5
5 5
5 5
5 5
5 5
5 5
5 5
5 5
5 5
5 5
5 5
5 5
5 5
5 5
5 5
5 5
5 5
5 5
5 5
5 5
5 5
5 5
5 5
5 5
5 5
1 1
5 5
5 5
5 5
5 5
5 5
5 5
5 5
5 5
5 5
5 5
5 5
5 5
5 5
5 5
5 5
5 5
4 5
5 5
5 5
5 5
5 5
5 5
5 5
5 5
5 5
5 5
5 1
4 5
2 5
5 5
5 5
1 5
5 5
5 5
5 5
5 5
5 5
5 5
5 5
5 5
5 5
5 5
5 5
5 5
5 5
5 5
5 5
5 5
5 5
5 5
5 5
5 5
5 5
5 5
5 5
5 5
5 5
5 5
5 5
5 5
5 5
5 5
5 5
5 5
5 5
5 5
5 5
5 5
5 5
5 5
5 5
5 5
5 5
5 5
5 5
5 5
5 5
5 5
5 5
5 5
5 5
5 5
5 5
5 5
5 5
5 5
5 5
5 5
5 5
5 5
5 5
5 5
5 5
5 5
5 5
5 5
5 5
5 5
5 5
5 5
5 5
5 5
5 5
5 5
5 5
5 5
5 5
5 5
5 5
5 5
5 5
5 5
5 5
5 5
5 5
5 5
4 5
5 5
5 5
5 5
1 1
2 1
5 5
1 1
5 5
5 5
1 1
5 5
5 5
5 5
5 5
5 5
5 5
5 5
5 5
1 1
5 5
5 5
5 5
5 5
5 5
3 5
5 5
1 1
5 5
5 5
3 5
5 5
1 5
5 5
4 5
5 5
4 5
5 5
1 5
5 5
2 5
5 5
4 5
5 5
5 5
5 5
5 5
1 1
5 5
5 5
5 5
5 5
5 5
5 5
5 5
5 5
5 5
5 5
5 5
5 5
1 1
5 5
5 5
5 5
5 5
1 5
5 5
5 5
5 5
5 5
5 5
5 5
5 5
5 5
5 5
5 5
5 5
5 5
5 1
5 5
5 5
5 5
3 5
5 5
3 5
4 5
5 5
5 5
5 5
5 5
5 5
5 5
1 1
5 5
5 5
5 5
5 5
5 5
5 5
5 5
5 5
5 5
5 1
5 5
5 5
5 5
5 5
5 5
5 5
5 5
5 5
5 5
5 5
5 5
5 5
5 1
5 5
5 5
5 5
5 5
5 5
5 5
5 1
4 5
5 5
5 5
5 5
5 5
5 5
5 5
5 5
5 5
5 5
5 5
5 5
5 1
5 5
5 5
5 5
5 5
5 5
5 5
4 5
5 5
5 5
5 5
5 5
5 5
5 1
5 5
5 5
4 5
4 1
3 1
5 5
5 5
5 5
5 5
5 5
5 5
5 5
5 5
1 1
1 1
1 5
5 5
5 5
5 5
5 5
5 5
3 5
5 5
5 5
5 5
5 5
5 1
5 5
5 5
5 5
5 1
5 5
4 5
5 5
4 5
4 1
5 5
5 5
5 5
5 5
5 5
3 1
5 5
5 5
5 5
5 5
5 5
5 5
5 5
5 5
5 1
5 5
5 5
2 5
1 1
4 5
5 5
5 5
2 5
2 5
4 1
1 1
5 5
5 5
1 5
1 5
1 1
1 1
5 5
1 1
5 5
5 5
5 5
4 5
5 5
5 5
5 5
5 5
5 5
5 5
1 1
5 5
2 5
5 5
5 5
5 5
5 5
5 5
5 5
5 5
5 5
5 5
5 5
5 5
5 5
5 5
5 5
5 5
5 5
5 5
5 5
4 5
5 5
5 5
5 5
5 5
5 5
5 5
5 5
5 5
5 5
2 5
5 5
5 5
5 5
4 5
5 5
5 5
5 5
5 5
5 5
5 5
5 5
5 5
1 1
5 5
5 5
5 5
5 5
5 5
5 5
5 5
5 5
1 5
1 5
5 5
5 5
5 5
5 5
5 5
5 5
5 5
3 5
5 5
5 5
5 5
5 5
5 5
5 5
5 1
5 5
5 5
5 5
5 1
5 5
5 5
5 5
5 5
4 5
5 5
5 5
5 5
5 5
5 5
5 5
5 5
5 5
5 5
5 5
5 5
5 5
5 5
5 5
5 5
5 5
5 5
5 5
5 5
5 5
5 5
5 5
5 5
5 5
4 5
3 1
5 5
5 5
5 5
5 5
5 5
5 5
5 5
5 5
5 5
3 5
4 5
4 5
4 5
5 5
5 5
5 5
4 5
5 5
5 5
5 5
5 5
5 5
2 5
4 5
5 5
3 5
2 1
5 5
5 5
5 5
5 5
5 5
5 5
5 5
5 5
5 5
5 5
5 5
5 5
5 5
5 5
5 5
5 5
5 5
5 5
5 5
5 5
5 5
5 5
5 5
5 5
5 1
5 5
5 5
5 5
5 5
5 5
5 5
5 5
4 1
5 5
5 5
5 5
5 5
5 5
5 5
5 5
4 5
5 5
4 5
5 5
5 5
5 5
5 5
5 5
5 5
5 5
4 1
5 5
5 5
5 5
5 5
5 5
5 5
5 5
5 5
5 5
5 5
5 5
5 1
5 5
5 5
5 1
5 5
4 5
5 5
5 5
5 5
5 5
5 5
5 5
4 5
5 5
4 5
5 5
5 1
5 5
5 5
5 5
5 5
5 5
5 5
5 5
5 5
5 5
5 5
3 1
5 5
2 1
5 5
4 5
4 5
5 5
5 5
5 5
5 5
5 5
5 5
5 5
5 5
5 5
5 5
5 5
5 5
5 5
2 1
5 5
5 5
5 5
5 5
5 5
5 5
3 5
4 5
5 5
5 5
5 5
5 5
5 5
5 5
5 5
5 1
5 5
5 5
5 5
4 5
5 5
5 5
2 1
1 1
4 5
5 5
5 5
5 5
1 1
5 5
5 5
5 5
5 5
5 5
5 5
5 5
5 5
5 5
5 5
3 5
5 5
5 5
4 5
3 5
5 5
2 5
1 1
1 1
1 5
5 5
1 1
5 5
5 5
5 5
2 1
5 5
5 5
4 5
1 1
2 1
1 1
5 5
5 5
5 5
1 1
4 5
5 5
5 5
5 5
1 1
5 5
5 5
1 5
5 5
5 5
5 5
1 1
5 5
1 1
5 5
5 5
5 5
5 5
5 5
5 5
4 5
5 5
5 5
3 5
5 5
5 5
5 5
1 1
5 5
1 1
1 1
4 5
1 1
5 5
5 5
1 5
1 1
5 5
5 5
5 5
1 1
5 5
1 5
5 5
5 5
5 5
5 5
1 5
5 5
5 5
5 5
5 5
5 5
5 5
5 5
5 5
5 5
5 5
5 5
5 5
5 5
5 5
5 5
4 5
5 5
5 5
5 5
5 5
5 5
5 5
5 5
5 5
5 5
4 5
5 5
2 1
5 5
5 5
5 5
5 5
5 5
5 5
5 5
5 5
5 5
5 5
5 5
5 5
5 5
5 5
5 5
5 5
5 5
5 5
5 5
5 5
4 5
4 5
5 5
5 5
5 5
5 5
5 5
5 5
5 1
5 5
5 5
5 5
5 5
5 5
5 5
5 5
5 5
5 5
5 5
4 5
3 5
3 5
5 5
5 5
5 5
5 5
5 5
5 5
5 5
5 5
5 5
5 5
5 5
5 5
5 5
3 5
4 5
4 1
5 5
5 5
5 5
5 5
3 5
5 5
5 5
5 5
5 5
5 5
5 5
2 5
5 5
4 5
4 5
1 5
1 1
1 5
1 1
1 1
1 1
1 1
1 1
1 1
5 5
5 5
5 5
5 5
5 5
5 5
5 5
5 5
5 5
5 5
5 5
5 5
5 5
5 5
5 5
4 5
4 5
4 5
1 5
1 1
1 1
5 5
5 5
5 5
5 5
5 5
5 5
5 1
5 1
5 5
5 5
5 5
5 5
5 5
5 5
5 5
5 5
5 5
5 5
5 1
5 5
5 5
5 5
5 5
5 5
5 5
5 5
5 5
5 5
5 5
5 5
5 5
5 1
5 5
5 5
4 5
4 5
5 5
5 5
5 5
5 5
5 5
5 5
5 5
5 5
5 5
5 5
5 5
5 5
5 5
4 5
5 5
5 5
5 5
4 5
5 1
5 5
5 5
5 5
5 5
5 5
5 5
5 5
5 5
5 5
5 5
5 5
5 5
5 5
5 5
5 5
5 5
5 5
5 5
5 5
5 5
5 5
5 5
4 5
5 5
5 5
5 5
5 5
5 5
4 5
5 5
5 5
3 5
4 5
5 5
4 5
5 5
5 5
5 5
2 5
5 5
5 5
4 1
5 5
5 5
4 5
5 5
5 5
5 5
4 5
3 5
4 5
5 5
5 5
5 5
5 5
5 5
3 1
5 5
2 5
5 5
5 5
5 5
5 5
5 5
5 5
5 5
5 5
2 1
5 5
5 5
5 5
1 5
5 5
5 5
5 5
1 5
3 1
5 5
5 5
5 5
2 5
3 5
5 5
3 5
4 5
5 5
5 5
5 5
5 5
5 5
4 5
4 5
5 5
5 5
5 5
5 5
5 5
5 5
1 1
5 5
5 5
5 5
5 5
4 5
5 5
5 5
1 1
5 5
5 5
5 5
5 5
5 5
5 5
5 5
5 5
5 5
1 1
5 5
5 5
5 5
5 5
5 5
5 5
4 5
5 5
5 5
4 5
5 5
5 5
5 5
5 5
5 5
5 5
5 5
5 5
5 5
5 5
5 5
5 5
5 5
5 5
5 5
5 5
5 5
5 5
5 5
5 5
5 5
5 5
5 5
5 5
5 5
5 5
5 5
5 5
5 5
5 5
4 5
5 5
4 5
5 5
4 5
5 5
5 5
5 5
5 5
2 5
2 5
5 5
5 5
5 5
3 5
5 1
5 5
5 5
5 5
2 5
1 1
5 5
1 1
5 5
5 5
5 5
5 5
5 5
1 1
1 1
5 5
5 5
1 5
1 5
5 1
5 5
3 5
5 5
5 5
5 5
5 5
4 5
5 5
1 1
1 1
1 1
5 5
2 5
5 5
4 5
3 1
5 5
5 5
4 5
5 5
5 5
5 5
5 5
5 5
3 1
5 5
2 1
1 1
5 5
2 1
1 1
1 5
4 5
2 1
2 5
5 5
5 5
2 1
5 5
1 5
1 1
4 5
3 1
3 5
1 1
1 1
5 5
5 5
1 5
5 5
4 5
5 5
5 5
2 1
5 5
5 5
1 1
1 1
5 5
5 5
5 5
5 5
4 5
5 5
5 5
5 5
5 5
5 5
5 5
4 5
4 5
5 5
5 5
5 5
5 5
5 5
5 5
4 5
4 1
5 5
5 5
5 5
5 5
3 1
4 5
5 5
5 5
5 5
4 5
5 5
5 5
4 5
5 5
4 1
4 5
5 5
4 5
1 1
1 1
1 1
1 1
1 1
1 1
1 1
1 1
1 1
2 1
1 1
1 1
4 5
1 1
1 1
1 1
1 1
1 1
1 1
1 1
4 5
1 1
1 1
4 5
1 1
1 1
4 1
1 1
3 1
4 1
4 5
4 5
4 5
4 5
4 5
4 1
4 1
1 1
1 1
4 1
1 1
2 1
2 5
1 1
4 5
4 5
2 1
4 5
2 1
4 5
2 5
4 5
3 5
1 1
4 5
1 1
4 5
4 5
4 5
4 5
4 5
4 5
2 1
1 1
4 5
4 5
4 1
4 5
4 5
4 5
2 1
2 1
1 1
1 1
4 5
1 1
1 1
1 1
4 1
4 5
3 5
3 1
4 1
4 5
2 1
1 1
3 1
1 1
3 1
4 5
1 1
1 1
1 1
1 1
1 1
4 5
2 5
4 5
1 1
1 1
1 1
1 1
4 5
1 1
1 1
1 1
1 1
5 5
1 1
1 1
5 5
1 1
1 1
5 5
1 1
1 1
1 1
1 1
1 1
1 1
1 1
1 1
1 1
1 1
1 1
1 1
1 1
1 1
5 5
1 1
1 1
1 1
1 1
1 1
1 1
5 5
1 1
5 5
1 1
5 5
5 1
1 1
5 5
1 1
2 1
5 5
1 1
5 5
2 1
2 1
5 5
1 1
1 1
5 5
1 1
5 5
1 1
1 1
1 1
1 1
5 5
5 1
2 1
1 1
1 1
2 5
5 5
1 1
5 5
1 1
1 1
1 1
1 1
1 1
5 5
5 1
1 1
5 5
1 1
1 1
1 1
1 1
1 1
1 1
Accuracy: 0.7528075042938301