Rating,ReviewText
1,"We ordered our cabinets on April and received confirmations email they were going to be shipped on May 26 . It did not happen. We called several times just to find a horrible, poor, rude customer service. They set up another delivery date and boom same story, nothing got here. We also write several emails which many of them were ignored and the one that was answered lacked any greetings, not good morning or evening, just a short, rude message with another lie and excuse. In the meantime, my house looks like a mest because bases on the original shipping day, may 26, our contractor demolished everything. We gave tried to explain this to them, custoner service, but not only they dont care but they dont show any empathy about it. I have to continue waitting for my cabinets and I hope to get them begore xmast and in a good shape. Sorry, but I will nevet ever recommend this conpany to anybody."
1,"Deceptive sales tactics!

Went with Cliqstudios because they quoted delivery times that would allow our project to be completed on time. Since then the cabinets have been delayed twice, a month each time. Have blamed supply chain and labor issues each time, which were both issues at the time we placed our order, which means at best, Cliqstudios' sales team was quoting incredibly optimistic delivery times in order to meet sales goals. This was also the excuse for the first and second delays. What changed between delay 1 and delay 2? Did their labor issues get worse? And why are those issues passed on to the customer? Additionally, it took 5 emails and voicemail to get an update on our delivery date because apparently they're having labor issues in their customer service department as well. We only got the update 12 hours before our delivery date. Nothing was offered to remedy the situation.

I recommend going with any other vendor. If their delivery estimates are further out than Cliqstudios', just know they aren't lying to you."
1,"These cabinets are junk. We bought 3 years ago and already have to replace. They chip, they stain, and they’re not made of real wood. I would have never purchase knowing ahead of time what crap they actually are. If you are looking for a cheap way out and looking to replace in a couple of years then these cabinets are for you."
1,"Half of our cabinets came damaged and poorly packaged. Seems like a lot could have been done if they spent more than the bare minimum on packing supplies. 

Clearly not a company who prides themselves on customer service excellence- we’ve been waiting for replacements for almost two months now. Have left several messages for the manager of customer service who seems to always me too busy to call me back (even when promised she would follow-up). Was told they “don’t know when replacements are sent out” and don’t take initiative to call to find out their status. Absolutely regret wasting my time/money on cliqstudios! Buyer beware!!!"
1,"We spent 20K on cabinets for our new kitchen. First, we paid for the service to have the cabinets brought into our house instead of on the street corner. When the delivery service called us, they said they did not bring items into the house, they would only drop them on the curb (yes! 20K worth of cabinets). We called CliqStudios and they said there was nothing they could do about it! In the end they agreed to reimburse us if we found a local service to do it. What a mess! Then we had them installed and they looked beautiful for about 2 months and then the sides of ALL of the open faced panels started peeling off. I guess do to some sort of adhesive problem. They said they did not have anyone who could fix the problem and if they replaced the cabinets, we would have to pay for demo and installation. They said we could try and fix them ourselves and gave a few suggestions (REALLY!). We asked for some reimbursement so we could have a local company fix the problem. Two companies that came and looked at them would not even take the job due to poor craftsmanship of the product. Finally we found someone who would try to fix it but they would not guarantee the work. After negotiation, Cliq said the best we they could offer is $3500 back and if we didn't take it we were at risk of getting nothing at all. I have been trying to get the money for over a month now. They said they tried to put it back on our card but it was rejected (or bank says nothing has come through). So they said they would mail us a check, but still nothing. I'm starting to think that they are just lying to us. I am so frustrated and sad that we trusted CliqStudios with our new kitchen. Don't make the same mistake!"
1,Cliq Cabinets is terrible.  Don't buy anything from them.  As you see in the pictures the finish is deteriorating and Customer Service is ignoring my request to address their terrible product.  I emailed them serveral times and they decided to ignore me.  I'm furious and will be suing them and reporting them to the Better Business Bureau.  Their product is garbage and they don't stand by it!! I spent over $20K with Cliq and they are treating me like crap.
1,"I have used CliqStudios twice.  The first time in 2019 with incredible results of both quality and customer care.  The second time was in November of 2020.  The results of both quality and customer care were terrible.  I ordered my cabinets on November 17, 2020.  I understood that the lead time (as printed on my invoice) would be 5-7 weeks.  Honestly, I didn't mind if it was 7 or 8 given it was holiday season and every company was dealing with the reality of a pandemic and possible manufacturing shortages.  At 5 weeks I began calling to ask for a timing.  No rush - just some way to plan all the other steps of a remodel.  I waited another two weeks and asked again.  Each time, no one could answer the question with any certainty.  I simply said thank you and waited another 7 - 10 days.  At 11 weeks, the cabinets shipped.  I was disappointed but understood the realities.  No one ever called to update me; the updates never came with an apology or very realistic explanation.  BUT, the cabinets arrived on 2/11/2021 and we were relieved.  The box descriptions matched the packing slip and we thought we were golden.  As we began the installation, we realized we a have a odd sized cabinet.  We came to understand it was an error in the order to building process.  The order clearly had a 21"" x 42"" cabinet.  The packing slip and the physical cabinet was 12"" x 42"".  I called on 2/18 to let them know.  They said (and my order stated) that all replacements typically take 14 days.  So, now we can't finish the kitchen, again.  But, what do you do.  I got a nice apology and promise to move the process through quickly.  After two weeks, I called.  Nope.  Still in manufacturing.  OK.  10 days later, I called again.  Nope.  Still in quality.  At this point, I'm not very happy.  MOSTLY because NO ONE had the customer kindness to CALL ME and let me know.  Just leave the customer hanging on CLIQ STUDIOS mistake.  When the very nice customer service representative  called my on 3/19, she let me know that the production supervisor was pushing to get the cabinet out by the middle of next week (3/24 - 3/25).  When I called on 3/26, that all seemed lost and there was a new date of 3/30 or 3/31.  I was extremely clear as to how very unhappy I was about their mistake and what it cost our timeline and resource planning.  Again, the customer service person was lovely but she has no control.  Why wouldn't someone call an apologize, send an email, a credit for their mistake and their inability to meet a single self-imposed deadline.  

The cabinet shipped on 3/30 and the cabinet was delivered on 4/6.  The projects done.  It looks good.  There are many imperfections in the paint, but none worth waiting on anything from the company.  

What a shame.  The original company was so customer focused.  This time around - new company - no customer focus. 

Sadly, we had a new project to do this spring, and we'll be starting with a new cabinet vendor."
1,"Very Disappointed Customer..  We build a new house and contacted CliqStudios for our cabinets. We received our order and our contractor installed our cabinets. He mentioned that he saw many problems with the way the cabinets were made. We were missing End Panels and Shelves. WE NEVER RECIVED THE END PANEL !!!  We had Cabinet boxes that had Big cracks in the box and or in the doors. We were in touch with customer service and were told we would receive a refund for the cabinets that could not be replaced as the Countertop had been installed. Also the Paint Touch up Pens Do Not Match the cabinet paint. We were emailing CliqStudio Customer Service and had some of the problems resolved. What could not be fixed by them We were told that we would receive a Refund. Total to be Refunded was $2,458.63.   We Never Received The Refund or End Panel Or Cabinet Front Needed.  We have not received any replays from them. I guess we don't have any Warranty on them as well.  Would NEVER USE THEM AGAIN!!!!!!"
1,"I am the daughter of a builder, have run many construction projects, and built my own house. I bought my painted inset cabinets in the fall of 2019. Just a year later, they began chipping and the faces began getting disjointed. The finish started wearing. I contacted the company in November to seek a warranty claim, since Cliq did before the ownership changed - and still does - claim to offer a lifetime warranty. I received this response: 

""I’m reaching out about your request to file a warranty claim. I hope the information below is helpful for understanding the situation.

As you may have heard, CliqStudios.com, under Wayzata Home Products, filed an action in Minnesota State Court known as an Assignment for the Benefit of Creditors (the “ABC Action”) on March 13, 2020. It is similar to a Chapter 7 bankruptcy to liquidate assets. The current operating company, CliqStudios Cabinets, LLC, is a separate company with new ownership unaffiliated with CliqStudios.com or Wayzata Home Products.  Because the company you purchased your cabinets from went out of business, the warranty has expired. 

The assignee for that business, Lighthouse Management Group, created a claims process for creditors who may have or hold claims against CliqStudios.com and Wayzata Home Products. Unfortunately, the deadline to file a claim in the ABC Action was July 29, 2020.  Additional details about the claims process and court case can be found here: https://www.donlinrecano.com/cliq""

These cabinets were NOT cheap, and the company is falsely representing itself by offering the same lifetime warranty as before the ownership change, but yet won't make good on even sending new parts, which is frankly, ridiculous. This way of doing business will likely wind up getting the company into another bankruptcy or change in ownership that won't back the product, so I'd avoid purchasing these if you're hoping for a quality, long life out of them. We're considering taking further action based on the misrepresentation."
2,"Still waiting on pieces for the past several months, and can't get anyone to answer my calls anymore. Very frustrating."
1,"Bought my cabinets in 2019. Design and sales process was great.  Went downhill here from there. Lots of shipping delays, damaged products, and poor quality control.   Had to have many doors replaced initially.

Fast forward to today and the paint on the cabinets is essentially chipping and falling off and the new company doesn't honor the original warranty.   Not fun spending 10's of thousands of dollars for cabinets that look terribly a year later."
1,"Quality is poor. Do not buy.

This is the second kitchen I bought from Cliq. In 2017, the kitchen was complicated with many angles and uppers and lowers. It was a high-quality product and I had no difficulty getting it delivered, getting a door replaced, or installing it.

The second kitchen, ordered July 2020 was after the ownership changed and is a very different story. I was nervous to order it as I read many negative reviews around the change in ownership, but I spoke and emailed with Bill Decker, the new owner, and was assured that all would go well.

This kitchen was a straight-line L shape with no uppers. You couldn’t get an easier configuration. I also ordered two bathroom vanities and five 18-inch shallow, tall pantry cabinets for other places in the house. 

The designer was good and customer service was fine. But the quality of the cabinets received was atrocious. I ordered 14 cabinets and 9 of them were compromised in some way, including chipped doors and sides, poor paint job, nails coming through the cabinets, hairline cracks, rails on drawers not screwed on properly, missing hinges, missing stoppers. They did replace 8 items, but of those 3 arrived damaged. I am still trying to get those.

And worst of all, Bill Decker ignored my emails. I would send it back if I could. 

Update: The response to this comment was the only resolution I got from Cliq Studios. Not much. And, of course, Bill Decker, who assured me that I would be happy, ghosted me as soon as he got his money. He does not care about quality at all."
4,"After seeing an ad for CliqStudios in my Instagram feed, we decided to price them out. They were, indeed, several thousand dollars cheaper than the big box store for similar or possibly better quality. We are not-rich DIYers renovating a very large (3800 square feet) old (1910) money pit, so custom cabinetry was not in the cards for us. Paired with their deign service, it seemed like a no-brained so we went with them. Our first designer was a bit snappy and difficult to work with so we switched to Robyn Belongie, who was excellent. She was patient and accommodating and helped us go through many iterations to find the right design for our old, awkward space. Order process was easy, delivery ahead of schedule and professional. It took us a long time to be ready for install but once we were, we found that the build quality was not that great and a couple of the cabinets nearly came apart in the hanging process. Ultimately we got them all installed with some hiccups along the way but did not need to reorder anything, thank goodness. After using the cabinetry for a year, I can say that we love our kitchen and the cabinets have been very functional. My biggest criticism is that the paint finish is not very durable and the Harbor-colored island has quite a few chips already which is really disappointing. The cabinet doors also seem pretty cheap, particularly on the pantry where their lack of heft is noticeable. Otherwise it’s been a mostly positive experience."
1,"Do not buy from this company.  They will send you subpar product, avoid answering questions via phone or email, back out on warranties. You will end up wasting tens of thousands of dollars. Find someone local that will respond to your needs. Don’t use a company they sends broken, cheap parts and won’t fix it."
1,"Cabinets were delivered with factory damage (nails/ staples protruding from the top rear into the interior of the cabinets). The designer worked up a design based on 8 foot ceilings (ours are 10 feet).  We've used our pantry cabinet for 5 months and two of the shelves have fallen (they are not overloaded) The kitchen drawers slide around in the box. We will likely have to replace our entire kitchen. The ""new"" ownership continues to try to sell us on trying them again but won't help at all with our current situation. It's been a nightmare."
1,I bought cabinets from Cliq Studios for a kitchen remodel. The cabinets arrived late and then showed up busted and broke. Cliq I initially attempted to make it right by stating they would replace the broken cabinets and do a partial refund but they didn't. Even worse I later learned they sent only 12 inch deep cabinets instead of the normal 18 inch cabinets i had paid for. I wrote to them and asked how this wasn't fraud but par for their experience i have got no reply. Poor workmanship and even worse customer satisfaction
1,"Please if you are thinking of buying cabinets from Cliq Studios make sure you do your homework. My cabinets were delivered on June 6,2020. They were of very bad quality and were peeling. I just found out today July 11, 2020 that the design was flawed the dishwasher too close to a cabinet that I will not be able to open the drawer. I sent them pictures of damaged cabinet instead of a refund or replace the cabinets that are damaged they sent me a you tube video on how to repair my own cabinets that I spent approximately $6,000.00."
1,"I ordered 3 samples over a month ago. 2 of the samples arrived and the third did not. When I asked customer service on March 5th about why it didn't arrive yet they told me it was coming shortly in a separate shipment from another warehouse. I've contacted their customer service and the assigned team member to me a total of 5 times in the past month asking for the sample to be shipped or to get a refund with no further response or action. Their ability to deliver the samples, an easy order compared to an actual full kitchen cabinet remodel order, has convinced me to go a different direction."
1,"As another reviewer mentioned, CliqStudio abruptly went out of business on about 3/17/2020.  After working with a CliqStudios designer for several weeks, I placed an order with them in late February 2020, got a confirmation of my order, and then didn't hear anything more. 

After several days of calling and sending emails, I started searching online and came across a local news article in Minnesota stating that CliqStudios had abruptly shut down all operations.  There has been not a single communication from CliqStudios even informing customers that they shut down, and they are leaving people to find out on their own.  Zero transparency, no communication.  

They are owned by a private equity company, Great Hill Partners, so if anyone else is in the same boat being left high and dry with no communications, might be worth letting them know how you feel about that."
1,"Cliq Studios has gone out of business with zero communication to those customers who have orders outstanding and with NO refunds offered as of today, 3/24/2020. I expected my order to ship 3/16/20. I left email and voicemail messages on 3/18/20 and again 3/19/20 to try to find out the status of my order, and on 3/20/20 found out by Googling them that they had closed down the week before. Fortunately, I was able to dispute the charge with American Express and should receive my $$$ back. Horrific customer service to not communicate this to customers and leave us waiting. After 6 weeks waiting, back to the drawing board! If they come back, avoid this company!"
4,"Mary did a great job with our kitchen remodel. She designed it out just like we had in mind, with many great suggestions of things we hadn't thought about. She was very attentive and responsive throughout the project and even afterward when we had additional requests. Thanks, Mary! YOU ROCK!"
1,"I have had my CliqStudios cabinets installed in my house for 6 months now and I can say I’m far from satisfied. 

The design, ordering and delivery were all top notch. 5 stars. However, when the in place product does not meet expectations, none of those matter

I did a two tone cabinet with white uppers and midnight blue lowers. My complaint is on the blue lowers. First, they use paint and not laminated or hydrofoil color. I didn’t think this was a problem until I cleaned them for the first time and the paint rubbed off. There are portions of my cabinets that have a matte finish now from where I had to lightly scrub something off. That’s not acceptable. 

Second, any scratch or ding shows the wood underneath. With a toddler in my house, the bases look terrible after only 6 months. I’m not unrealistic, and I understand that a toddler is going to be rough on any cabinet, but I do expect at least some level of durability. These have none.  

And lastly, the cabinet drawers are put together in pieces and then painted. What results is that if any portion of the drawer shifts, you see the un-painted portion below. I have to take apart the drawer to reset the orientation so it’s lined up again. They should paint, then assemble so this is not an issue. 

My house is a high end house. I will have to redo the base cabinets before I sell. 

A consolation is that the upper cabinets are nice and work well. 

If you use Cliq, maybe just don’t get painted cabinets."
1,"As some of the other 1 ""star"" reviews have noted, the customer service is atrocious.  Also, at least one of these reviews is written by one of the Cliq designers - Nicole Vroman - so not sure how many of these other positive reviews can be trusted.  Our personal designer was a victim of fraud and someone sent her a pro account letter pretending to be from Cliq. After she finally figured it out - 6 weeks into the project where my kitchen had been gutted already and we were waiting on cabinets that weren't coming - she called Cliq who said they'd be on top of it and would try to get things going quickly.  After 3 weeks, there was no sign of the order being expedited as we were led to believe once the fraud was revealed.  I called and emailed with no response.  I took my complaint to the Better Business Bureau and Cliq's response was soulless. 
 First, they didn't care that someone was impersonating  them and stealing $ and secondly, their customer service was terrible.  No one ever called me personally nor was it possible to get anyone on the phone.  Perhaps this company did decent work a few years ago, but in recent times they are clearly overwhelmed and cannot be bothered by customers being fleeced in their name.  Know that some of these reviews here are not legit and were written but Cliq employees and be warned of potential problems.  When I took to the social media universe to express my frustration and alert people, they pulled the rug from under us and cancelled the order completely.  Thanks Cliq."
4,Amy did a great job getting my design and layout together.  I received an estimate and design from her within a week.
1,"We have a two-family house, and are redoing two kitchens and two laundry rooms.  We placed an order for two new kitchens' worth of cabinets, as well as two new laundry rooms' worth of cabinets from Cliq.  Needless to say this was an expensive order.  We placed that order at the beginning of November.  Cabinets shipped in mid December, and were supposed to arrive a week later.  And then....nothing.  No cabinets.  No phone call from Cliq.  Customer service has no idea where the cabinets are.  No one has once apologized, or explained how this could happen, or offered any type of suggestion for how this could be resolved.  They have said they would ""look into it"" and call me back.  And guess what?  No one has called me back.  That's happened three times.  This is catastrophic for us, as now we've wasted months, and are out tens of thousands of dollars, and Cliq couldn't seem to care less.  Disaster.  Avoid at all costs."
1,"Don’t order from this company! We started the process of ordering cabinets with Cliq about 8-9 weeks ago. The design process with designer went great and she did a great job except with proper delivery expectations. Before finalizing with cliq we got several other quotes and were up front with the time crunch we were on and we were told the cabinets would be delivered in 4-6 weeks. This was very important because of scheduling all the other renovations on our home (flooring, countertops, tile etc.). 6 weeks later and cliq sends us HALF of the cabinet order and the other part of order is delayed. I call and email and the person I speak to has no idea why it’s delayed and has no answers or no manager available to help. They then promise that this order would be shipped this past Friday. Today I get a call that the other cabinets did not ship and they don’t know why or when they will find out. This has cost me thousands of extra dollars because of this cabinet delay and no one at cliq has answers. It’s been almost 10 weeks and still nothing. Do yourself a favor and don’t buy from Cliq. Unless somehow they can rectify this situation. It’s sad because I loved the design and build process and price but the fulfillment  of what was promised is it happening which cost me a lot of money and time I DONT have."
4,We decided to go with a local company that would do the install because we did not want to do it ourselves. Very satisfied with cliqstudios however. They were very helpful.
1,"All of your instincts about buying kitchen cabinets on the internet are correct - I do not recommend Cliqstudios at all. The poor communication I've experienced has created issue upon issue and endless frustration both for me and my builders. 

I provided Cliq with the correct dimensions for my kitchen, however my designer misinterpreted them and designed my kitchen as being four inches longer than it is. I didn't catch it on the design plan because that longer number is in fact the correct measurement of the exterior of my kitchen including a pony wall, so it didn't strike me as wrong. Because I didn't catch her mistake in the plan they consider it to be my fault. At that point they worked with me negotiate the replacement cabinets, we split the difference.

But this is when things really started going downhill. My designer told me the replacement ones would be expedited and arrive 3-4 weeks from date of order. I rebooked my builders accordingly. Come three weeks and not having heard anything I started reaching out to her, repeatedly, every day for a week and heard nothing. Total radio silence until I managed to catch her on the phone at the very end of Friday. She had nothing useful to say. I've followed up with a handful of customer service people all of whom keep confirming that my cabinets are scheduled to ship out a full week and a half after they were supposed to arrive, and no one seems particularly concerned about the totally inaccurate shipping window or that my designer simply ignored my attempts to reach her. 

I absolutely regret not having paid just a little bit more to order through a local home center."
3,"Though I decided not to go with Cliq Studios for my cabinets, I appreciated Amy Ammann's help in the design phase."
4,"Cliq Studios was great to work with!  I got an estimate from a big box store and also from Cliq.  Cliq beat the big box price by $10,000 (compared with Kraft Maid cabinets).  My kitchen installer was impressed with the quality of the cabinets.  Vanessa, the Cliq kitchen designer I worked with, made some good suggestions regarding functional design changes, which I am grateful for.  The only down side was delivery - the vendor that delivered my cabinets was careless and 1/3 of my cabinets were damaged.  But, Cliq made it easy to get replacements!  I simply made a claim online and uploaded some pictures and replacement cabinets were shipped right out to me on a priority basis. I would definitely use Cliq again - great combination of quality and price."
4,"I had my first opportunity to work with Cliq on a recent project. The client expressed an interest in the brand. It was my first time sourcing cabinets through an online retailer versus a local source. Robyn work diligently with us to navigate the specification and revision process. While there were differences in communication, solely by virtual methods versus in-person, the outcome of the project is just as good as any cabinet experience I've had! The quality of the cabinets is excellent. The GC installed them with ease. The resulting kitchen is exactly what the client and I envisioned. I will definitely pursue Cliq Cabinets again on future projects!
| Project : Residential Kitchen Renovation in Arlington VA
| Designer : Design Cadence
| Contractor : Montoya Construction"
4,"The Project Advisor I worked with Jessica Tindall. She offered excellent ideas and suggestions I didn't consider. Jessica was very responsive and timely; extremely easy to work with. When we talked about pricing, she worked with me to stay in my price range.  If you are considering CLIQ, ask for Jessica. She won't steer you wrong."
4,I was very pleased with the design work provided by Candice Whitney.  Candice was very knowledgable and professional.  Candice was quick to respond whenever I had a question or needed more info.
4,"Hi worked with Amy for a quote to redo my entire kitchen due water damage.  I provided her the existing layout and she provided me with a quote..and was very quick in her response. Her follow-up with also good. However, there were some limitations with the cabinets (e.g. no four drawer stack, only three drawer) that were dealbreakers and I ended up going with a local supplier."
4,"Kacee was prompt ,polite ,and concise.  the design and estimate provided was excellent with all my needs an choices met"
4,"Modern base cabinets by Cliq  complement our vintage uppers  and combine to give us a great, functioning work space.  Cabinets are 1/2 plywood, full extension glides, soft close and nice color.  As a home owner/installer, there was lots to plan for - so do your homework and don't forget to drill a hole through the base cabinets for the icemaker before you install!  Our designer was very helpful."
4,"I was skeptical about buying cabinets from a on line cabinet company as I would have preferred to see the samples of the finished cabinets first.  But after reading a few reviews and getting estimates from local custom cabinet shops we decided to keep moving forward with Cliq Studios.  The design process was very easy.  Or designer Erin was responsive, helpful, creative and patient though the process. Our decision to buy from was driven by price, great options and the fact that Cliq builds an all wood cabinet where most custom builders do not.  Our cabinets were delivered about 3 weeks after the order was placed - well within my expectations. 
The order was delivered complete and the boxes all appeared in good condition.  As advised by Cliq Studios - I opened each box and inspected the cabinets for damage.  My order had 7 cabinets that were in my opinion were damaged or had build quality issues.  I contacted Cliq Studios and supplied pictures of the damage and build quality concerns.  Cliq Studious reviewed my claim and agreed to replace all of the cabinets.  This process was completed within a few hours.  Unfortunately this pushed my project out another 3 weeks. Good news is we followed the instructions and had not removed our previous kitchen so the inconvenience was minor.   The finished project looks great and every cabinet fit as planned! 

Overall I found Cliq Studios easy to work with.  They were helpful and responsive throughout the process.  We are very happy with our new kitchen and are hopeful that the Cliq Studio cabinets will provide us with a beautiful kitchen for many years."
1,"First the positive(s), the design process was simple and of very good quality. Similarly, customer service is very empathetic and apologetic to the failures of the company. Finally, the company does use better materials to build its cabinets.

With that said, the quality of the build and the finishing lacks in comparison with competitors that provide solid wood cabinets with dovetail and soft-close. 

We purchase all cabinets for our kitchen, laundry and bar/dining areas with CliqStudio in May 2019. The product arrived within the expected timeframe, however, several items came broken, missing parts, not square and/or not finished.

Customer service was prompt to open a case, and mentioned it would be prioritized (still took over 5 weeks to fulfill the initial complaint). During this time, we received several small batches for different items (drawers, front, mechanicals, doors, and full cabinet) some of which arrived broken a second time.

At this moment, 07/30/19, we are over 7 weeks delayed, still don't have the cabinets fully installed and have to spend significantly more on additional visits from different contractors (installer/fixer, plumber, electrician, and granite) due to the lack of quality from their production.

I'm happy for the people that had a different experience than I had, but do not plan to use this company in the future. It costs me way less to pay a bit more to have any project done right the first time."
1,"We recently did a gut renovation of our new home and regret using Cliqstudios for our cabinets. Their complete lack of quality control on cabinet production, our designer's lack of expertise and poor customer service created a time delay in our project, thus creating extra cost, which they did not cover. 
After receiving our first batch of cabinets, every single piece had a problem and had to be replaced. After seeing the poor quality, we did not want to continue with Cliqstudios, but had no choice but to continue because of their return policy requiring us to pay for return shipping for all the cabinets. 
The customer service was very poor, up to the top of the department. Their handling of all the issues related to our order was unacceptable by American standards.
Our second batch of cabinets took longer to arrive than the estimated ""expedited"" window provided and they were of similar quality, but we had to move forward with our project and install them anyways. They are already chipping all over after moving in 6 weeks ago. The paint job is very poor. Our contractor's feedback was that the installation instructions were almost nonexistent and they are some of the worst quality cabinets he's worked with. 
We are still waiting for a fourth cabinet door that came damaged, then warped, then they sent the wrong size and now have to reorder again. This is almost 6 months after our cabinet order was placed.
Our designer, Sarah, ordered a wrong piece and and instead of the customer service dept working directly with her to get the correct piece ordered, we had to track her down over several days and many phone calls and emails and begged her to take care of this for us. Customer service's response was that she wasn't answering their emails and that it was our problem. 
I chose Cliq because of the competitive price and high ratings on Houzz, but the prices don't reflect the true cost and our experience was much different than these 5-star reviews."
4,"While I did not end up going with Cliq Studios, I wanted to say how wonderful the design process has been.  They did many different drawings as my plans evolved and seemed happy to do so!  Miranda was my designer.

I ended up going with something local that had similar pricing and I was able to see/touch/feel the end product and also felt if there’d were issues they could be resolved in a day or two versus waiting weeks.

I gave 4 stars as I would suggest they find a way to allow customers to see installed cabinets of others.  Maybe a special program taking volunteers to show off their cabinets?  I went to the home of someone the local cabinetmaker had done and it was very helpful in my decision!"
1,"Working through Cliqstudios and the designer that was assigned to me (Wendy M) was great. Wendy was of great help and really helped me refine my kitchen remodel project until I was happy with it. I found the pricing to be fair compared to local cabinet companies and their custom color options were the reason why i decided to move forward with Cliq. Everything was smooth and the cabinets actually were a few days early and arrived well packaged. Most of the cabinets came in good condition with a few having a minor nick or scratch that can be touched up via the supplied touch up kit. The main problem i had was that one of the cabinets that I ordered arrived poorly constructed / not constructed correctly. I emailed the designer and she sent it right off to customer service. Now i have to wait for a new cabinet to go into production and then shipped off to me. This has the potential to delay my remodel about 4 weeks or so. I am disappointed that the cabinet would leave the factory this way without any quality control or review from staff.

EDIT - I have found another cabinet that seems to have been poorly assembled. The cabinet face was not nailed to the plywood box correctly and has led to splitting of the face and some other issues. I still do not understand how my cabinets left the factory this week, especially for the premium I paid for them. I am completely disappointed and will not recommend to anyone."
2,"I have mixed feelings using this company. The cost of the cabinets was reasonable. My experienced kitchen contractor said the cabinets were well made with a major exception being the paint job.  The navy paint seems to flake or scratch off rather easily. Under the navy is a while primer that shows when the navy comes off making it even more noticeable.  The actual construction of the cabinets is good so I am not sure why they in my opinion cut corners on the paint job.  Other Pros: shipping was fast and the order was completed sooner than expected. There was no damage from the shipping. 

Some Cons of using Cliqstudios:  The kitchen design is free and you get what you pay for. I would not recommend using the free design unless your kitchen is a perfect square or rectangle. I had some bump outs and indents in the room and the designer used a cabinet 6"" too long. My contractor had to make some modifications to make it work. Looking back at the plan I can now see the mistake. A professional kitchen designer should have seen something was off.  Using other supplied measurements and reviewing the supplied kitchen photos the designer should have easily seen the issue. Instead she left a 6"" void in the measurements on the opposite wall to make the 6"" mistake work correctly in the plans. That should have been a red flag for her instead it was ignored and a mistake happened. 

What is most disappointing is the customer service in fixing the problem. They would not even offer a small discount or free shipping on the new piece.  This was a piece needed to correct their mistake.  They decided to save literally just a few bucks instead of providing good customer service. 

Overall you will probably save money using Cliqstudios but it may come at the cost of some aggravation.  I most likely would never use them again because I fear the paint job on the cabinets is going to get worse.  Spend some extra money and get a real kitchen design with a company that actually values customer service."
2,"The Good. 
- Drawers and doors are rock solid. 
- Excellent hinges and drawer glides.
- Candice was very responsive.

The Bad. 
- We had a number of instances of poor workmanship: nailer that missed the mark, plywood that should not have been used, glass inset area that is ragged, shelf edges unpainted, shelf backs and sides unfinished, cabinet widths not completely accurate (always slightly larger), a shelf that was too wide, and more.
- Far too much toe-kick baseboard was ordered.
- My $1400 custom cabinet was not built and not delivered. There was a different item with its item number. How does this happen at the time of shipping?
- Split rail that was not related to shipping.
- Simply put, more attention to detail is needed.
- Instructions are ball-park but not great in some places. A more detailed installation plan would be helpful.
- Really need more options at 30"" and 33"".
- Need more options for height of base cabinets.
- Instructions for installing glass are awful. Check the need for a quarter-inch bead. That much silicone results in a big mess. After the first door, I cut back on silicone so that there wouldn't be so much trimming of it after curing."
1,Very disappointed with Cliq.  Our kitchen project was delayed by several months because our cabinets kept arriving damaged.  The only thing that was offered (besides new cabinets over and over) was a refund for one cabinet that came damaged 5 times.  We ended up having to keep that cabinet because we just needed to get our kitchen finished.  Cliq cost us so much time and money.  What a horrible decision we made.  We already e-mailed customer service to express our dissatisfaction and got no response.  Horrible.
4,"Townhome Remodel...I removed two walls which confined a generous Kitchen inside a segmented main floor of this Townhome. COMPLETE GUT JOB!!! Cliqstudios Rockford style cabinets with a Habor painted finish were installed accented with Houzz products, Vigo pull-out spray faucet, Cosmas brushed brass cabinet knobs & Winflo stainless steel hood. Jessica from Cliqstudios perfectly rendered my design making it easy for install. Any additional material was quick shipped & all products arrived in a timely manner & without defects. Very pleased with the outcome & service. Thanks Jessica!"
4,We really had a great experience in working with CliqStudios. We had a designer that had quoted cabinets through a different course that came back at over $15k not including tax and shipping. We were pleasantly surprised that Cliq was only $12k all-in for our needs. We did have to compromise a couple little custom things but definitely worth the savings. The cabinet quality is great - our contractor complimented them even though he and our designer were originally skeptical. We worked with Roxanne on the order and she was such a pleasure! Very accommodating and communicative. The only issues we had were that we were a little short on shoe moulding and cabinet skin. Cliq's customer service was great and they got us the additional materials at no cost as quickly as they could but it did ultimately delay the completion of the project.
2,"The designer was forgetful, not timely, ate up an extra couple weeks in my timeline... you better know what you're doing, what you're looking to accomplish, and you better be a GREAT proofreader. Repeat 'final' versions and I finally have almost what I wanted to order. For the wasted $200 in extra fillers, I can't be bothered to email yet again or spend time on the phone explaining the plan. We'll see what arrives...."
4,"I was a bit hesitant to deal with a long distance cabinet maker that I found on the web, but everything was highly professional: the designer Delaney Englert was an angel of patience and efficiency, the cabinets arrived on time and are beautiful, the cost was reasonable. Small glitches on the delivery side: two wrong drawers were replaced promptly, one small missing panel should arrive today (some waiting)."
2,"I ordered cabinets through Cliq Studios while planning a kitchen re-design following water damage to my floor. As others have written, the design team (Bill was my point of contact) was helpful and knowledgeable and the software they use is great.

Unfortunately, there were two errors made before the shipment left the factory: the shelves I ordered were not included, and one of the cabinets was the wrong color. Obviously, these errors were on Cliq's end and not in the shipping process

Because this was a base cabinet, the error basically added another 4-6 weeks without me having a kitchen (can't install counters). While Cliq recommends waiting to inspect all cabinets before removing old cabinetry, this was simply not an option for me as I was replacing my damaged floor as well.

This was a costly delay for me, and I asked Cliq for a very reasonable payment to make me whole. The customer service rep told me that I shouldn't have removed the old cabinets. When I asked at what point Cliq could guarantee delivery or at what point they would make a payment for a delayed/wrong shipment, she wrote ""I can't speculate on ""what if"" scenarios""."
4,"My cliq designer, Minda, was excellent. Her recommendations were helpful and attention to detail ensured the success of our project. The cabinets are well made and the company was responsive to correcting the inevitable small flaws that happen with packaging and shipping. I would definitely work with CliqStudios again."
2,After being in my place for 2 months I felt inclined to provide a review. Caroline was excellent. I purchased a lot from her and she was attentive and quick and turnaround for quotes was excellent. Why 2 Stars?!  Well the quality of the painted cabinets is less than acceptable. The slightest bump and the paint is nicked with visible damage. This is not my first RENO where I’ve ordered a painted cabinet and the other brand was far more superior quality of cabinet and paint.  I’m sorry I went this route and getting a sample in advance wouldn’t have really helped. Minimal traffic and usage- disappointed in the quality %
4,"I contacted CliqStudios for design ideas and cost for a kitchen remodel. In the end, we did not end up going through with the project but working with Jessica Wood was convenient, easy, and low pressure."
3,The cabinets are of reasonable quality but we had several issues getting the order completed successfully. Incorrect parts were sent numerous times. Cliq was extremely responsive in fixing the order and accepting the costs associated but every shipment came with at least one error. While we are happy with the style and options the delays and inconvenience of the mistakes I. The order would likely keep us from using them again.
1,"I would HIGHLY recommend staying away from cliqstudios. I went through the order process with one of their designers, Lisa. She was very nice and professional. We placed our order on September 13. Before I placed the order, I asked her what if a cabinet was the wrong size and we had to return it. She stated there would be a 25% ""restocking fee"". I got my order confirmation and the cabinets were to be delivered the week of October 9th. Fast forward 5 days to Monday, and the deal on our house falls through. We were obviously upset, and I immediately called to cancel the order of cabinets. I verified with them at nothing had shipped yet, but Lisa stated to me they were going to withhold 25% of my payment for a ""restocking fee"" citing company policy. Nothing had even shipped yet!!! How can it be restocked when it hasn't even shipped! Needless to say, I am less than pleased. This company is dishonest, lacking common sense, and borderline criminal. I would stay away at ALL costs."
4,"We have finally completed our kitchen remodel, and are very happy with the outcome. We worked with CliqStudios Designer Angela during the design phase. Angela was very helpful, professional, patient and bent over backwards to work out all the design details and make sure we had all the items required were included for our complete remodel. We orderd the Dayton cabinets, and went with painted Linen uppers, and painted Tea Leaf lowers. The packaging, and shipment went very well, no damage, very organized, and everything showed up as ordered. The construction of the cabinets is oustanding, great quality materials and the soft close hardware is great and easilly adjustable. The only issue we have is with the Painted Tea leaf lowers, where the paint easilly scratches, and has a white primer which shows through and scratch or chip. So we have to be very careful. A more durable topcost with a color coordinated primer would help. Other than having to be careful with the lowers, we are completely satisfied with our cabinets and CliqStudios, and would definately recommend.."
1,"Pros:
 - Free designer assistance with renders.
 - Samples of door styles and colors.
 - Relatively inexpensive.
 - Damaged cabinets were replaced with no argument. I was pleasantly surprised by that. Credit where credit is due.

Cons:
 - The designer let me modify the design in ways that were not optimal. (But seemed like a good idea to me) I wish she had been a little more adamant about why she made the decisions she did.
 - Large number of cabinets arrived damaged. Some from shipping but others clearly left the factory damaged or poorly constructed.
 - The replacement cabinets took a really long time to be shipped. The representatives I spoke with provided various reasons for the delay. (This leads me to believe they didn't really know what was causing the delay or were not being truthful with me) The last reason I was given was that a supplier provided Cliq with the wrong color paint. OK. I never had the feeling they were doing everything they could to fix the problem or make it right.
 - Some of the replacement cabinets arrived with damage. But by then my project was so far behind we just made the best of it.
 - The plywood construction might be ""real"" wood but it is fragile and chips easily.
 - Some of the cabinet frames were not level and/or square which required modification prior to mounting them together or installing countertops.
 - The trash bin base cabinet will not stay closed. (Yes it is level, the countertop guys verified) It constantly creeps open about 1 inch. I hate it. Frustrating considering how expensive it was. Why can't it have the soft close like everything else?

In hindsight I wish I had used a local company with a good reputation. Even one of the big box stores. They sold cabinets that looked nearly identical."
4,"We received an estimate and consultation with Robyn Belongie at cliqstudios.com and were very impressed.  She truly knows her stuff and created a great design for our full house cabinetry needs.  Robyn is very responsive in her communication and was able to easily catch the vision of  the design style we were looking for in our custom built home. If you are looking for a seasoned designer who is professional, knowledgable, works hard, and meets deadlines and budgets... look no further than Robyn Belongie at cliqstudios.com"
4,"I contacted CliqStudios in regard to a kitchen cabinet replacement project for a medium sized full kitchen remodel. Within two days I was connected to Morgan Hemmings via both email and phone. Morgan was very responsive, diligent and a highly skilled design professional. I felt like I got a lot more out of my interaction and design process with her than I had with a much higher priced in home high end cabinet salesperson in previous jobs. Morgan delivered a multiple rendering autocad type plan via email which was great. She was able to work with a difficult design space and made it work perfectly. She was both creative and still task oriented and on time- a rare blend. I can't recommend Morgan Hemmings enough, she was great to work with. If you like the sample you get in the mail I think it would be a great choice for the price. I didn't quite find a match with their finishes but I was highly impressed with the design process and the customer service experience."
4,"CliqStudios was the right choice for us. We got high quality cabinets for a very good price, which is exactly what we needed. That left us dollars in our budget to do the rest of the project how we wanted. Our contractor was also surprised at the quality of the materials. All the people we dealt with at Cliq were very polite and knowledgeable. All of our problems with the cabinets were dealt with quickly and without hassle. The only questions they had were about how they could improve themselves. We are glad we found this company."
4,"There were only really a few issues but I think it was the lack of knowledge on my part and then also a little but of an issue with CliqStudios not using the most of the space when they designed the Kitchen renderings. I absolutely LOVE the quality of the cabinets. This is by far the best part. Soft Close, hard wood, durable, and just like everything described in the brochures. The quality of cabinets was better than my moms $17,000 cabinet order and I paid less than $10,000. I would highly recommend these cabinets, I would also highly recommend double and triple checking the design before placing the order."
4,"Jason Spencer worked with us over the phone and e-mail through several drafts until the design was exactly what we wanted. He kept in touch but didn't pressure us to order until we were ready. Delivery was within expected time and went smoothly. We purchased cabinets from a ""big box"" store for a previous renovation. CliqStudios are better quality at lower price and they don't charge for extras like soft-close drawers and doors. I spent a lot of time on the website deciding how to handle the corner and making sure we weren't buying extra molding etc. we didn't need- we had just enough room to install the 42"" upper cabinets. We  found the open shelves ourselves, which left some room for any measuring error from removing the pantry closet. Our contractor thought the cabinets were good quality and installed them without any problem."
4,"Anne Marie Klobe worked with me to design our kitchen and it came out great! I am not a professional in any way. I was able to share my idea and thoughts with Anne Marie and she was able to bring the kitchen design to life. She was professional, patient, and helpful. We had one snafu with a cabinet but the issue was handled and rectified to our satisfaction and our kitchen looks Great! I would use Cliqstudios again in a minute, and recommend you do too! The cabinets are all wood construction, dovetail drawers, soft close hinges, perfect!"
2,"I'll start with, I love my cabinets and my new kitchen.  I really enjoyed working with my designer John (see my 5 star review on him.) The cabinets are good quality, and my husband was able to install them fairly easily.  That being said, their Customer Service needs some work.  After we received our cabinets and inspected them, there was 5 cabinets that had some ""finishing"" issues and cracks that the other 13 or so did not.  Now a few of the problems my husband could of made work with hiding the cracks in the cabinets at install. But the other he could not and then some issues were poor quality in the sanding before the painting. So I sent in my claim(s) with pictures and descriptions as requested for everything (5).  I received the generated email yes we received your claim and will contact you in 24-48 hrs.  So then, after 10 days and not hearing back from anyone, my husband called to hear from a CS agent that our claim was received but just sitting in the system and she didn't have an answer why but she said she send it on.  Again, another couple days went by.  My designer told me if I had any problems with CS or anything to call him, which I did.  Our claim was bumped up to a CS supervisor, or ""someone that gets the job done."" She did call, but was short and to the point, she seemed rushed and a little impatient, just asking for more pictures and which cabinets had problems. (which I would think she could of seen, if she had my claims?) Yes, we were frustrated that our claim was just floating the system and wasted 2 weeks before even getting them to order replacement cabinets. But we were not angry at customer service just really disappointed.  What we never heard asked was, ""What would you like to see happen here?"" We would of been fine with a few of the cabinets that we could hide the cracks, and maybe receive a discount/refund on the others?  We would of been open to that. To me there was more options than just resend us all new cabinets.  Like lets just push this through so we don't have to deal with you. So now we have extra cabinets in the garage, they don't take them back or have returns - their shippers are only one-way. And any return shipping would be on us, so they'll be donated, given away, sold or trashed. And that is such a waste to me, not only in material but time.  Not sure why our claim was just sitting in the system to begin with, and no one had an answer to that. BUT to me their customer service needs more training, or more people or more likely BOTH!"
1,"Doing my project with this company was a complete nightmare. It all started from the beginning:

1 - The Designer assigned to my project was very nice however, she was either too busy to pay attention or was a horrible listener.  We started working together on January 5th. I emailed her a list of the cabinets I wanted with wall measurements; all I was really looking for was a rendering of what the project would look like on paper since I already had it in my head. She did o.k. the first round but after that it was all downhill.  I emailed her pictures of the room in question with the measurements and the look I was looking for and she got it wrong.  We went back and forth so many times that I just became exhausted.  What really upset me was that I was very specific with what I was looking for and I even sent pictures.  It took 2 weeks of back and forth to get it and it was still wrong.  In the end I ended up sending her a list with an email simply stating, “Please, just send me this” with a list of each individual cabinet.

I will admit that although we checked the boxes for shipping damage, we did not check the cabinets right away due to all the construction and trying to keep them protected from damage. That delayed about 3 weeks.

When we finally start reviewing the layout, I had not realized that although I was specific in that I wanted a 96” tall cabinet, I had actually received a 90” cabinet.  Unfortunately there is no real way to tell unless you know for sure that the toe-kick for the 96” actually comes in separate packaging as opposed to inside the packaging with the cabinet.  I had to call and wait for call backs and it took days to get this resolved.  They advised me that I should review the rest of the delivery to make sure all was in order.  To my disgrace, it got worse.

This could have been avoided had the building team paid attention to their workmanship:
My mixer cabinet comes with a roll-out tray - the rollout tray was missing.
One of my cabinets ordered with an end panel was missing the end panel.
Another cabinet was not glued properly so the right side started separating and what looked like a crack was actually the cabinet falling apart.
One of the doors had a scratch right on the face.

During this whole process, I had already picked out my slab for the countertop.  I picked it out in January 23rd, well ahead of the scheduled delivery. After all the waiting, I started getting phone calls from the fabricator to follow up and see when they can come and measure.  My electrician was following up for my finishing work.  Everything was delayed because the pivotal cabinet that set everything in place was not there.

Finally, on Monday March 27, I get my tall cabinet in the right height.  I have yet to open it and see if it is in good order and condition.  I was expecting to receive the missing and replacement parts along with the factory-defect cabinet and all I received was the tall cabinet.  When I called they told me the rest were not ordered together but they were shipping out that day as they were ready.  On Wednesday, I get a phone call from the delivery company and they shipped my placement cabinet with the missing items to the wrong address!!!  The only way to get that fixed is by the shipper and supposedly they fixed it and Thursday I call only to find out the address was not fixed.  It took them 2 days to finally get it fixed as opposed to the couple of hours they promised.   I am scheduled to get my Countertop measured on Saturday 4/1 yet my cabinet cannot get there until the following week.

Everything else prior to this was shipped to the correct address so I can't imagine how they made such a careless mistake.  We are now at the home stretch and they have to screw it up on the shipping.  Had this not been an issue or at least had it fixed on time, I could have had everything installed in time for my countertop measure, now I'm incomplete.

I have heard of stress with construction and we have had our share of unrelated surprises, but this is beyond!  How can one company make so many mistakes on one order?  When you call it feels like this is the norm for them so there is no sense of urgency.  I was considering ordering 2 vanities from them since I have 2 bathrooms to update.  I will go elsewhere.  I will never, ever refer them to anyone or use them again.

As far as what came in, the cabinets look good and I am excited to install them.  My issue is the disappointment with the workmanship and the competence.  When the project is complete, I will post final pictures."
4,Cliqstudios did an excellent job of designing a kitchen to meet my needs. The design consultant showed a high level of understanding and conducted herself in a professional manner.  Carpentry is good quality. The paint on the cabinets is not top quality. I am needing to do more touchup than I should.
4,"In short ... great product and great company at a great price. Highly recommended. This kitchen was for our lake house project. I am a retired high end custom home builder. My wife and I were very surprised and pleased at the excellent quality and finish. No, it is not custom built cabinetry so you use fillers to fit room dimensions, but, they do not carry the high price tag of a custom cabinet shop. Shipping and delivery went very smooth. We had a few minor issues with a few nicked doors and end panel which were handled by their superb customer service department (who immediately shipped us new replacements with absolutely no hassle). Installation was straight forward. We worked with Donna Jones who was very knowledgeable, cost conscience and spent all of the needed time getting the design just right We would use Donna and Cliq again in a heartbeat !!!"
4,"My husband and I did a very extensive remodel (tore down our entire house minus one wall). We chose Cliqstudios for our cabinetry for the entire house. Jill our sales representative was very helpful and patient. She was a pleasure to work with. The cabinets unfortunately arrived damaged. It took a few months to receive replacement fronts, but Cliqstudios gave us a partial refund and replaced damaged cabinets.  After everything was said and done we are very pleased with our kitchen and bathroom cabinets."
4,We worked with Jill Hanneman and she worked with us on getting our kitchen layout just how we wanted it. We worked through a bunch of revisions and all the cabinets were delivered in perfect condition. The kitchen remodel turned out better than we imagined.
4,Jill Hanneman was a great designer. Responsive and helpful. She helped us redesign our kitchen and re-work the space. We are really enjoying our new kitchen and love the quality of the cabinets. Thanks!
4,"We recently ordered Cliq cabinets for our kitchen renovation and were really happy with the process. We ordered base cabinets, an island, a tall pantry cabinet, and doors for the laundry. We worked with a designer who was able to accommodate all our requests for the cabinets. The cabinets arrived in great condition except for the trash cabinet, which was broken and unusable. They responded quickly to my request for a replacement and we received it in about 2 weeks (because it was a custom color). We love how our kitchen turned out and would definitely recommend Cliq."
2,"It has now been almost 4 months, and I have yet to receive all of my kitchen.  The first set of cabinets were ordered in the wrong colors due to human error on their side.  It took almost 2 months to get the incorrect order in and figure that out.  Now my ""rushed"" replacement cabinets (which took about 6+ weeks) are missing pieces and will likely by ""rushed"" in another couple months.  Now my reno has been pushed back at least 4 months past where it should have been.  One of the most frustrating transactions ever, and I'm strongly considering getting a lawyer involved at this point.  

On the up-side, the design process and the quality of the cabinets are great. However the gross incompetence in this company is horrific."
2,"I initially contacted CliqStudios to request a free design in early September.  I was given a telephone appointment for 9/7 at 6:15pm to speak with a project coordinator.  My husband called me to let me know that the project coordinator had left a message the appointment had been rescheduled for the following morning because he had to leave by 4:30pm.  I decided to take a chance and call the project coordinator and he happened to still be in the office after 5pm in spite of the cancellation.  He informed me that he had submitted my information to a designer who would be contacting me in a few days. I was contacted by Kristen in an e-mail on Thursday 9/8.  In the e-mail she asked several questions about my project, many of which had already been addressed in my initial submission with the measurements, however I answered each one in detail.  She further explained that she would be out of town the next week but that I could be assigned another designer.  In my response I explained that I was anxious to get pricing before the end of the sale on 9/15, however I did not receive a response.  After more than a week's time I still did not get a response so I sent an inquiry through customer service on 9/20 and requested another designer.  I figured Kristen was playing catch-up from being on vacation.  Finally on 9/21, I received my first designs on a snipping tool.  One design had cabinets all the way around the room on 3 walls, covered a window and involved moving appliances.  I had specified I simply wanted to change out the existing cabinets which were in an L-shape.  All of the cabinets were 36"" high and I had specified with my initial submission that I had a 14"" soffit which would not allow 36"" high cabinets.  We continued to e-mail back and forth  with revisions of the design and were finally able to speak on the phone 9/26.  I mentioned that I was working with a designer from another online cabinet company.  Upon hearing this Kristen mentioned that the competitor charges for shipping and the soft close hinges/drawers would cost extra.  Seems the possible threat of losing the sale inspired her to send a final design and pricing on 9/26 and encouraged me to place the order by 9/27 so the order could arrive before Thanksgiving.  I sent a couple more inquiries on the evening of 9/27 and the following day and never heard back.  With the competitor, I submitted my measurements on Friday 9/23, was matched with a designer on Monday 9/26, received the initial design with pricing on 9/27 and placed the order Monday 10/3.  The whole process took just over a week and the price and quality were about the same.  Response to my questions and design changes was immediate.  Shipping was free and the soft close hinges/drawers was  standard.  I felt Kristen was not attentive to my needs and response time was slow.  If I had been assigned another designer, the outcome may have been different."
1,"I purchased white shaker cabinets from CliqStudios.  I received cabinets that were 3 different shades of white.  Unfortunately I did not notice until a number of the cabinets had already been installed.  
I also had a number of problems with the quality of the cabinets.  I have  cabinets that are pull out cabinets, 2 spice racks and one garbage bin.  2 of these cabinets are not working properly.  The garbage bin door does not shut properly and the runners were installed crooked.  The cabinets were just generally of a poor quality and I have had on going problems for the past year."
1,"We decided to use CliqStudios for our kitchen remodel based upon the all wood construction and price point.  The design process was great and the detailed renderings and materials list were very helpful.  We purchased over $20K worth of cabinets.  Delivery took approximately 6 weeks.

Unfortunately, the cabinets had numerous quality issues:

- The majority of the cabinet boxes were out of square which created headaches at installation.  Straightening the box stressed the face frames and led to some hairline cracks.
- Out of square cabinets could not be appropriately shimmed and resulted in gaps between cabinet face frames or off level installation.
- Faceframes were not flush with the cabinet box and others were not of the same height, again resulting in uneven installation.
- End panels were offset producing an unsightly gap between cabinets.  Our installer tried shaving off the protruding panel, but he couldn’t do anything about areas where the panels where short.  This probably wouldn’t show up much on dark cabinets, but it was a big cosmetic defect on white cabinets.
- Drawer face fronts fell off due to stripped screws.
- Face frames had large cracks in them.
- Face frames and cabinet doors were warped.
- The painted finish is very thin and several cabinets had chips in the paint and worn corners on faceframes, doors, and drawers where raw wood was showing.

Our cabinet installer is a professional with 22 years of experience.  We saw his work in other homes and it was impeccable.  The issues were the cabinets were due to poor quality construction and not installation.

We contacted CliqStudios about these issues.  They offered to replace all of the defective cabinets and materials.  We had a separate shipment of cabinets for our mudroom and kitchen island arriving, so we decided to wait and see how these cabinets looked.  Unfortunately they had similar issues, so I was not hopeful that replacement cabinets would address the craftsmanship issues.

Ultimately we made the decision to return all of the cabinets.  CliqStudios is paying for the return shipping on just the defective cabinets; we have to pay the return shipping on the other cabinets and materials.  In addition, we are being charged a 25% restocking fee for the non-defective items.  This still amounts to thousands of dollars in addition to the cost of partial installation, removal, and reboxing, not to mention an additional 8 week or more delay in construction.  CliqStudios is treating each item as a separate purchase, when, in fact, the entire purchase should be considered as an all-or-none prospect.

Purchasing from CliqStudios has been an expensive and painful mistake."
4,"I decided to take a chance on ordering cabinets from Cliq Studios.  I was impressed with their website and sample products sent.  The process was great, my sales rep Mary was very responsive and very helpful.  I am an Interior Designer and my client had a very tight budget.

Overall I love how the cabinets look and the kitchen turned out really beautiful.    I think the quality is very good- but I did have some hiccups along the way.   Several of the drawers arrived with small nicks on them.  When I contacted Mary,  she was very apologetic and issued replacements for me right away.  

Last week when I was waiting for some shelves to arrive, they arrived in the wrong color which was frustrating but it turned out a second set of shelves was sent in the right color as well.

Besides these issues my overall experience working with them was very good, and I would use them again."
1,"We picked the Rockford in white and they delivered on time. Quality was not outstanding, but Cliq was cheaper than our other quotes, so you get what you pay for. However, one of our base cabinets was sent with no drawer, just a face attached to the cabinet. Finally, after a few calls and e-mails (with pictures to prove it), we got the drawer. NO GLIDES. Then, after more calls and e-mails, we got the glides. 3 pairs as a matter of fact. But they did not send any of the plastic parts to actually attach the glides to the box, or to the drawer. I e-mailed them 3 weeks ago, and still no parts. I actually managed to talk to the head of customer service last week, who was supposed to quick ship them, but of course we are still waiting. Our cabinets were delivered April 1, and here is June 29 and I still don't have a silverware drawer. We have another drawer that does not close properly because the glides were installed wrong, so I guess its a good thing they send me extra so I can fix it! Things to know: 1) No one has ever answered the customer service line when I called, or returned my call. E-mail works best, or pretend you are a new customer when you call. 2) It takes about 3 weeks from the time they respond to your e-mail to the time they actually do anything about it."
1,"Buyer/homeowner beware. Our contractor recommended this company for our kitchen renovation. The pictures were beautiful on the website and we trusted our contractor's recommendation.  The problems started when they got our first design wrong and completely omitted the windows on the design. We were told the cabinets would take 5 weeks after ordering. It actually took over 7 weeks just to ship and then when they arrived were missing parts. Also, the cabinets were made to incorrect specifications and did not fit the space requiring a wall to be extended so that they did not protrude. The parts that were missing took an additional 2 weeks to deliver. All in all this set us back over a month on our renovation and caused tons of stress and inconvenience along the road. Finally, the customer service people at Cliq refused to communicate with us regarding times of shipment and manufacturing and would take extended periods of time to get back to our contractor."
1,"I typically do not spend the time writing reviews, but my experience with cliqstudios was so disappointing that I feel compelled to warn others.
Their service is initially very good — they have clearly invested in business development in their design and sales team. And this strategy appears to be working — I was told multiple times after multiple delays that they couldn't fulfill their promised delivery timelines because they were so busy.
Once the order was placed, service is inconsistent at best - phone calls and emails are ignored, and the customer service team is not capable of providing accurate updates on orders.
Cabinet quality is mediocre. Most of the box joints aren't glued correctly, leaving only narrow gauge staples to hold them together. Doors and drawer fronts are solid, however, with tight joinery.
Cabinet delivery finally happened four weeks late. Several cabinets arrived damaged, but due to the delayed timeline I had little choice but to hire a carpenter to repair them and install anyway.
One wall cabinet face frame was cracked beyond repair in a very visible area, so I reached out to cliqstudios to order a replacement. Their literature says most replacements ship within a week, but it took more than a week just to get the customer service team on the phone. When we finally connected, I was told a replacement couldn't ship for weeks. I was offered a rush order that would take about one week (no guarantees) for an additional $2,015 — for one 33 inch wall cabinet! 
The replacement was finally delivered last week. Here's how the final timeline looked:
Order placed: January 29, 2016
Estimated delivery: week of March 14, 2016.
Cabinets delivered: April 1, 2016
Replacement requested: April 12, 2016
Replacement received: May 13, 2016
In short, the mediocre quality of these cabinets is not worth the 3 1/2-month process for a single order, especially when considering the frustration and time wasted dealing with the inadequate customer service."
4,"Our consultant Molly, was very helpful.   The customer service reps seemed to get frustrated at times when I would call about damages."
4,"Worked with Mary at Cliqstudios, very patient and respectful.  She came up with a lot of designed ideas that we had not considered and in the end proved to be the better choice. We went through 3 different design changes before pulling the trigger. I had concerns over the use of Chinese plywood in the construction of the cabinets and Mary was very quick to address those concerns.  We had a couple items (range hood and 18” cabinet that were askew and or paint issues) customer service was very quick to reorder those items and have them shipped. We are still in the process of completing the installation, but happy with the process and cabinets so far."
3,They were professional and extremely helpful! Helped me build the kitchen of my dreams with all the little finishing details that make it wonderful!
3,Cabinets I received a quote for was more than double the price I actually paid for all my cabinets at lowes for the Diamond Kelby style.  I am a contractor and I'm never going to attempt to buy these cabinets.  Nice commercial though.
4,"CliqStudios offers competitive pricing, solid manufacturing and excellent customer service including complete design facilities.  My designer, AJ, was recommended by my brother and his wife, and she was excellent: from coming up with an initial layout, through several rounds of ideas and changes, to getting final graphics and custom specs confirmed for building.  The cabinets are well-made, with several finish-options and colors, and discounts and sales seem to be available.  Pay attention to shipping and delivery paperwork - always best to have detailed, itemized receipt of delivery to check against invoice.  I will go back to Cliq next time i need cabinets."
4,"-Cabinets were of good quality (similiar to custom order cabinets of Home depot/Lowe's. 
-Cliqs price was well under the estimates I received from other places and even beat a similar price offered elsewhere. 
-Cabinets arrived without any damage or issues And were easy to install.
-A missing item was shipped fast.
-My consultant Erin was friendly, patient, and did a great job designing my kitchen."
2,"After a wonderful experience with our designer, Lynn, I decided to invest with CliqStudios on 7/9/2015.  Prior to placing my order, I reviewed the itemized invoice to find that when the order was pushed from design to invoice, the Rockford cabinets that were in my design were changed to Dayton.  I contacted our designer who quickly corrected the problem and sent me a corrected invoice.

Due to their recent upgrade to their website, I was unable to pay online.  I spoke with Courtney, who prior to 8/20/15 was CliqStudios Customer Service Supervisor.  Courtney was extremely helpful in placing my order and quickly emailed me a receipt for the Rockford cabinets.

On 7/10/15 I received an email notice from CliqStudios about my order with an Estimated Week of Delivery: 8/10/2015.

8/20/2015 our cabinets arrived.

When I got home from work I quickly noticed that the cabinets received were Dayton rather than the Rockford ordered.  We also had one set of drawers that do not function due to broken parts that occurred prior to shipping. (The broken pieces were in the top drawer) We also have two warped cabinet doors and one cabinet door that is a different size than the other.  Our touch-up kit that is supposed to be included with the order was not included with the shipment either.

I contacted CliqStudios about our order and have received the most unprofessional responses.  As of today, I have had CliqStudios blame their designer, not returned promised phone calls, and I have received two shipping notifications for replacement parts that have no explanation of what has been shipped.

Although CliqStudios excels in the design process, the product delivered and the level of customer care following an order prevent me from recommending CliqStudios.  When making such a large investment, I strongly recommend avoiding CliqStudios."
1,"They sent the wrong color cabinets! Management treated me very badly (basically calling me a liar)! At their request I sent many pictures of the cabinets in different lighting situations but they would not correct problem without me paying shipping costs to return cabinets and paying a 15% restocking fee. No assurance I would get the correct color the second time.

I had a wonderful experience with the first kitchen I used them for but the second time was a complete disaster! I am forced to live with and look at the wrong color cabinets every day.

Do yourself a favor and buy locally."
3,"The design process was amazing, customer service was great dealing with a few issues after cabinets arrived.   There has been some peeling and cracking, some arrived that way, some occurred months after installation.  The touch-up kit does not help this.  A few more calls to customer service and they requested pictures.  They agreed there was a problem, perhaps in the finishing stage that caused the peeling and cracking.  Their concern is matching the paint, so they have requested I send a drawer front to get the best match.   I believe we are now on our way to making it right.

5/1/16:  I see a recent like on this comment.  I didn't receive replacements for all the doors that were damaged and I had been in contact with customer service, who I thought would track down the missing doors, but nothing happened.  I have let the issue go as it has been far too long.  My advice is to follow up until you are completely satisfied as this is a big investment."
1,"Our cabinets came in damaged and did not fit our space.  The company took no ownership of the situation, charged us a 25% re-stocking fee, and required us to pay for freight.  Three separate cabinet companies came to our home to take a look at the product and all said we were overcharged and that the product was was poor.  I am furious and that is only one of the facts."
3,"Overall ok, might buy from them again based solely on their desire to make any errors right..

Quality of product - 3-4 stars.  a couple of the cabinets has the shelf guides poorly installed.  Don't know how well the painted surface will hold up.  Overall a nice solid cabinet that is as described on their website.
Shipping - 2 stars - one cabinet came damaged and they quickly replaced it.  In another the the shelf slider drawers came loose and were slightly damaged in shipping.  They shipped when they said they would.
Accuracy - 1 star.  The initial shipment came with three errors.  Two cabinets were incorrect and did not match the packing list (had 1 roll out shelf instead of 2, left open door instead of right open) and the other was a minor error by the designer (finish panel on wrong side).  They also forgot to include the touch up paint kit and I had to contact them separately for that.
Customer service - 5 stars. Quickly replaced damaged, incorrect and missing items with zero hassle.  They shipped when they said they would.  It's just too bad that I needed customer service in the first place.
Instructions - 2 stars.  They ship the trim with no instructions.  They have some on the web but they ship with no instructions, not a big deal but would be nice to have more complete instructions for all the trim included.  The designer did email some helpful .pdfs.  I found the YouTube videos to be ok but without enough detail.
Packing - 2 stars.  Most everything arrived safely but given how they ship, cardboard boxes and styrofoam, it's amazing the cabinets survive as well as they do. 
Design - 4 stars.  They put up with numerous changes and I was able to do all of the conversation by email.  Design was simple but nice.  
Hardware - 2 stars.  The hardware I got was simply drop shipped from Hardware Resources.  The hardware is made in China and the screws provided are too short for use with drawers.  And being made in China the 8/32 screws are actually about 7/32 so buying longer 8/32 ones from the hardware store is not an exact fit.  No templates are available or provided.  They know the thickness of the drawers, why not give me a heads up I need longer screws ahead of time?  

What is missing with this company is attention to detail.  Quality is pretty good but could easily be better, shipping the wrong stuff that does not match the packing list is a cardinal sin, lack of detailed instructions (despite the fact I am a skilled DIY'er that has done a kitchen before), better thought out shipping containers, missing hardware templates all add up to an ""OK"" experience.  With a few minor changes these guys could be dynamite and I don't think it would cost much money for them to be significantly better.

I would not dissuade you from using them but can't provide a ringing endorsement either."
4,"I placed my order with CliqStudios a few weeks ago and should be receiving my cabinets early next week (on time).  So far my experience has been smooth and hassle-free.  My designer, Stephanie, has been super helpful and always available to answer my (many) questions.  I absolutely love my design that she came up with--can't wait to see it in my new kitchen! So far my experience has been great and would recommend them!
I will update my review after I've received my order!"
1,"Promised delivery of 4 weeks, 2 weeks to build, 2 weeks to ship.  Great experience with the Designer, but once you pay, never a word.  I ended up calling constantly to finally get a ship date.  Then the delivery company, SAIA, loads and unloads my cabinets six times.  When I finally received my shipment, four out of the ten were destroyed.  My contractor and I ended up repairing on-site.  We had doors sheered at the joints, door split down the middle, drawer cabinets totally out of square and loose, the back of several of the big box cabinets were broken and had to be replace with new wood, the sliding drawers were laying in the cabinet along with the mechanisms, drawer faces chipped and scratched, front trim wood sheered and split.  Do Not use this company!!!!! Go to a local cabinet builder.  If this was for my own kitchen, I would would sent the whole lot back."
1,"Wow, what a mess! My husband and I ordered cabinets from this company due to the great reviews we had read about them. Don't make the same mistake we did! Our first delivery date was pushed back by a week at the last minute and no one bothered to call us to tell us they would be another week delayed beyond that. With contractors at our house and vacation planned around demolition, we find out the cabinets will not be arriving for another week (only after calling ourselves and leaving voicemails) and still no tracking number. The customer service line is very nice but can do nothing for you and the management does not return calls. Very, very frustrated and disappointed in this company and experience. Buyer beware."
1,"CliqStudios gave me a 4-6 week delivery window on a $9,500 cabinet order.  Six weeks was the absolute longest they said I would wait.  I planned my contractors and vacation very carefully so that my kitchen would be installed while our very active family was out of town.  I gave them plenty of lead time to build the cabinets.  

One week before delivery was scheduled they called to inform they were having production problems.  They later gave me a second delivery date that they also missed.  This forced me to reschedule my contractors twice, which caused me to lose money.  It also meant that we will now be living in the house during the remodel, which we desperately wanted to avoid.  

I will say that the employees of CliqStudios have been very nice.  Unfortunately, that amounts to nothing if they don't keep their word or provide their product in a timely manner.  I would recommend that anyone considering an online company for a kitchen remodel look elsewhere.  I hope this review will save you some aggravation.

I am updating this review today (04/08/2014) after experiencing further issues with my order.  I left for vacation with another guarantee from CliqStudios that my cabinets would be shipped by Friday, April 4 and would be delivered in three days or less.  I was contacted today Tuesday, April 8 by my in laws who were set to receive the order while we were out of town.  They told me the delivery company called today to set up a delivery date.  During the call they made it clear they would not bring the items inside my home despite the fact that I paid CliqStudios extra for ""white glove"" service.  ""White glove"" service is an extra $150.00 and ensures the items will be brought inside and set in the first interior room on the street level floor.

I called and spoke with CliqStudios.  They told me they made an error and scheduled the order to deliver through the company they use for non ""white glove"" service.  This company will only leave the cabinets out in your yard or on your driveway.  Now they are scrambling to have the order picked up at the warehouse by the correct delivery company.  They will now miss their third delivery date and will cause me to reschedule all of my contractors again.  I anticipate at least some of my contractors telling me they aren't available now because they have already been rescheduled twice.  Another reason to stay away from CliqStudios and go with someone more dependable."
1,"We contracted with Cliq for all new maple cabinets for our kitchen renovation.  I'm a retired contractor who was finally doing his own kitchen.  The designer was helpful was suggestions for several cabinets that do not appear on their website.  The sample door looked to be of high quality, so we placed the order.  When the cabinets arrived is when the problems started.  Very poorly packaged resulting in damage.  2 cabinets destroyed and multiple gouges in several doors.  The feature display cabinet had glue that oozed out of the side of the side panels and couldn't be removed.  Very poor quality control.  A total of 9 items needed replacing.  After 9 days I was notified the replacements were shipped.  I finished tearing out the kitchen on the arrival date for the replacements.  Only 2 of the 9 items were actually shipped.  They never bothered to tell me it was a partial shipment, so I'm know stuck without a kitchen and the balance of my replacements still hasn't shipped.  STAY AWAYFROM THIS COMPANY!!
It's really a shame because the undamaged cabinets are of nice quality."

1,"While I was initially pleased with the look of the tiles, it wasn't until my tile installer showed up to do my backsplash that he pointed out the crazy amount of size variance from tile to tile, making an even and uniform pattern with straight lines virtually impossible. After I discovered this variance, I looked back through Fireclay's website and tech sheets and while they do mention this size variance, it is not prominently displayed or explained nor was it ever mentioned to me by the Fireclay design consultation who I spoke with during my free consultation. As someone who has never picked out tile before, I just assumed all tiles in the same lot would be the same size. I mean, who wants uneven tiles after all? Fireclay should do a better job of highlighting this size variance."
4,"These guys have beautiful tile and great customer service!  Our designer recommended them and they went above and beyond to get us tile that we love.  
We had several samples sent to us and chose one of those.  However, when we received the tile, it was a fair amount off from the color of the sample (more blue than blue/green).  The fireclay team was very kind and offered to re-run the order for us at no charge, but they couldn't guarantee the color would come out any closer to the sample as the colors of the handmade tile could apparently fluctuate quite a bit.  They also offered to do tile in a completely new color if we wanted.  We decided to chance it and as luck would have it, the color of the new tile was an exact match to the other batch we got (not matching the sample.). Oh well, it was still beautiful tile and we get compliments on it all the time.  I will say though, that the color we ended up with, looks much closer to a different color on their website and if the colors can fluctuate that much, I don't know how they list such close colors on their website.  
All that said though, I would not hesitate to order again from them.  While the color might not have matched the sample perfectly, it really is stunning.  Our tile guy even said so.  Don't hesitate to do business with this company - you can't go wrong."
2,"While the team at Fireclay was helpful in the design/purchase process, their design process overcounted more expensive tile instead of the less expensive tile - that we found they counted a dozen tiles short in their design tool.  Don't expect any help when something goes wrong, and don't trust their ""designers"" (just sales reps) when you are installing more complex designs like herringbone.

Also note: their tile looks very different in each batch.  This is tough for any tile company, but keep in mind this will come into play when they miscount your tile.

In the end the tile is beautiful, just don't trust them in the design as they are not any more experienced than you or your contractor."
4,"Love the designs, love the affordable (and free for the first 5!) samples, and love the customer service even more! Super responsive, patient with me, offered design recommendations and advice given my needs. I had some significant budget constraints and my fireclay design rep even through in some very generous discounts! 

My one concern was how high the prices are. I thought I could afford tile for my tiny bathroom, but it very quickly amounted to something way out of my budget.  My challenge to Fireclay tile is how to make superior quality tile more accessible?"
1,"Tile quality may be good, but you can't trust their estimated timelines for production and delivery. The estimate on the website means nothing - I was told there was an additional 2 week delay immediately after paying. And then was hit with another delay halfway through that wait time. I still haven't received my tiles, and will not be at all surprised if it gets delayed again. If you don't care when they arrive - go for it, but I wouldn't try to plan construction start dates until AFTER you have them in-hand. Others seem to say the quality is good - I wouldn't know as mine still haven't arrived, and I won't be surprised if they get delayed again, but at that point I won't be able to afford to wait any longer, and will have to cancel the order and buy something else. Seemingly poor understanding of their supply chain and no option to expedite an order."

