2.000000000000000000e+00
1.000000000000000000e+00
9.999998211860656738e-01
9.999997615814208984e-01
9.999997019767761230e-01
9.999996423721313477e-01
9.999995231628417969e-01
9.999994039535522461e-01
9.999989271163940430e-01
9.999945163726806641e-01
9.999943971633911133e-01
9.999893903732299805e-01
9.999881982803344727e-01
9.999759793281555176e-01
9.999758005142211914e-01
9.998298883438110352e-01
9.998253583908081055e-01
9.997297525405883789e-01
9.997011423110961914e-01
9.996906518936157227e-01
9.996891021728515625e-01
9.991072416305541992e-01
9.990876913070678711e-01
9.987530112266540527e-01
9.987316131591796875e-01
9.986101388931274414e-01
9.985229969024658203e-01
9.983243942260742188e-01
9.983060956001281738e-01
9.960173368453979492e-01
9.957383871078491211e-01
9.930409193038940430e-01
9.930034875869750977e-01
9.917043447494506836e-01
9.915230274200439453e-01
9.915034174919128418e-01
9.911445379257202148e-01
9.910608530044555664e-01
9.910569190979003906e-01
9.908633232116699219e-01
9.901474714279174805e-01
9.890083074569702148e-01
9.889128208160400391e-01
9.849555492401123047e-01
9.847545027732849121e-01
9.802600145339965820e-01
9.801063537597656250e-01
9.799145460128784180e-01
9.799056649208068848e-01
9.799051880836486816e-01
9.798561334609985352e-01
9.796112775802612305e-01
9.795579910278320312e-01
9.754642248153686523e-01
9.751828908920288086e-01
9.700341224670410156e-01
9.698505997657775879e-01
9.694280624389648438e-01
9.693900346755981445e-01
9.598349332809448242e-01
9.596902132034301758e-01
9.592212438583374023e-01
9.583573341369628906e-01
9.549701213836669922e-01
9.549057483673095703e-01
9.529041051864624023e-01
9.528692960739135742e-01
9.524266123771667480e-01
9.520761966705322266e-01
9.507348537445068359e-01
9.504441618919372559e-01
9.486903548240661621e-01
9.472165107727050781e-01
9.451184272766113281e-01
9.441155195236206055e-01
9.428965449333190918e-01
9.417898654937744141e-01
9.395216703414916992e-01
9.390112161636352539e-01
9.378093481063842773e-01
9.371054768562316895e-01
9.335073232650756836e-01
9.333023428916931152e-01
9.224079847335815430e-01
9.209249615669250488e-01
9.185552597045898438e-01
9.183586835861206055e-01
9.169024229049682617e-01
9.162992238998413086e-01
9.128931164741516113e-01
9.123910665512084961e-01
8.993207216262817383e-01
8.989759683609008789e-01
8.920682668685913086e-01
8.909818530082702637e-01
8.871194124221801758e-01
8.862253427505493164e-01
8.859454989433288574e-01
8.833890557289123535e-01
8.769570589065551758e-01
8.769457340240478516e-01
8.729245662689208984e-01
8.710973262786865234e-01
8.702393770217895508e-01
8.696783781051635742e-01
8.688313961029052734e-01
8.673613071441650391e-01
8.661283850669860840e-01
8.660200834274291992e-01
8.638420104980468750e-01
8.637023568153381348e-01
8.566759824752807617e-01
8.566201925277709961e-01
8.560473918914794922e-01
8.552483916282653809e-01
8.539885282516479492e-01
8.528977632522583008e-01
8.513101339340209961e-01
8.493523597717285156e-01
8.452807664871215820e-01
8.433886170387268066e-01
8.395663499832153320e-01
8.392341136932373047e-01
8.371933698654174805e-01
8.348966836929321289e-01
8.333275318145751953e-01
8.331683874130249023e-01
8.326042890548706055e-01
8.326034545898437500e-01
8.276436924934387207e-01
8.260046839714050293e-01
8.137748837471008301e-01
8.134596347808837891e-01
8.022298812866210938e-01
8.010101318359375000e-01
7.992180585861206055e-01
7.990608215332031250e-01
7.947877049446105957e-01
7.940765619277954102e-01
7.893468141555786133e-01
7.888368368148803711e-01
7.854754924774169922e-01
7.843195796012878418e-01
7.655640840530395508e-01
7.651360034942626953e-01
7.583593130111694336e-01
7.564860582351684570e-01
7.560594081878662109e-01
7.553359270095825195e-01
7.545599937438964844e-01
7.544323801994323730e-01
7.506213188171386719e-01
7.476009726524353027e-01
7.449828386306762695e-01
7.443785667419433594e-01
7.347558736801147461e-01
7.338904142379760742e-01
7.312788367271423340e-01
7.298176288604736328e-01
7.248392701148986816e-01
7.215242981910705566e-01
7.181124091148376465e-01
7.151435613632202148e-01
7.147837877273559570e-01
7.141446471214294434e-01
7.081255316734313965e-01
7.066357135772705078e-01
6.980124711990356445e-01
6.976513266563415527e-01
6.968078017234802246e-01
6.962313652038574219e-01
6.903274059295654297e-01
6.891905069351196289e-01
6.880460381507873535e-01
6.873367428779602051e-01
6.843633651733398438e-01
6.823687553405761719e-01
6.804727911949157715e-01
6.795675754547119141e-01
6.783589720726013184e-01
6.779029369354248047e-01
6.770544052124023438e-01
6.749381422996520996e-01
6.747785806655883789e-01
6.734599471092224121e-01
6.661773920059204102e-01
6.650545597076416016e-01
6.648584604263305664e-01
6.639357209205627441e-01
6.631594300270080566e-01
6.612435579299926758e-01
6.592381596565246582e-01
6.586976051330566406e-01
6.499817967414855957e-01
6.478289961814880371e-01
6.443228721618652344e-01
6.421566605567932129e-01
6.404353380203247070e-01
6.403652429580688477e-01
6.380018591880798340e-01
6.345493197441101074e-01
6.307209730148315430e-01
6.303641796112060547e-01
6.293919086456298828e-01
6.289821267127990723e-01
6.285943388938903809e-01
6.250131130218505859e-01
6.236251592636108398e-01
6.229619979858398438e-01
6.206794977188110352e-01
6.191148161888122559e-01
6.117159128189086914e-01
6.076582670211791992e-01
6.056154370307922363e-01
6.043919324874877930e-01
6.042872667312622070e-01
6.026833057403564453e-01
6.001447439193725586e-01
6.000902652740478516e-01
5.976278781890869141e-01
5.975614190101623535e-01
5.971813201904296875e-01
5.967079401016235352e-01
5.915095806121826172e-01
5.895369052886962891e-01
5.876698493957519531e-01
5.860393047332763672e-01
5.731441974639892578e-01
5.723867416381835938e-01
5.685602426528930664e-01
5.678922533988952637e-01
5.676826238632202148e-01
5.670101046562194824e-01
5.669130086898803711e-01
5.632550716400146484e-01
5.618016123771667480e-01
5.617616176605224609e-01
5.615559816360473633e-01
5.571147203445434570e-01
5.555148720741271973e-01
5.535946488380432129e-01
5.535641908645629883e-01
5.527887344360351562e-01
5.489988327026367188e-01
5.476974248886108398e-01
5.421762466430664062e-01
5.419411063194274902e-01
5.384071469306945801e-01
5.342095494270324707e-01
5.333569645881652832e-01
5.329165458679199219e-01
5.326733589172363281e-01
5.288331508636474609e-01
5.275697708129882812e-01
5.259172320365905762e-01
5.185235142707824707e-01
5.184492468833923340e-01
5.184274315834045410e-01
5.153732299804687500e-01
5.141993761062622070e-01
5.101382732391357422e-01
5.088011622428894043e-01
5.076159834861755371e-01
5.053798556327819824e-01
5.049825906753540039e-01
5.031615495681762695e-01
5.014006495475769043e-01
5.009518265724182129e-01
4.999262988567352295e-01
4.988564550876617432e-01
4.971415698528289795e-01
4.971177577972412109e-01
4.963030219078063965e-01
4.957047700881958008e-01
4.942291975021362305e-01
4.935237467288970947e-01
4.918252825736999512e-01
4.908372759819030762e-01
4.903349578380584717e-01
4.876103401184082031e-01
4.872118234634399414e-01
4.850715100765228271e-01
4.849199354648590088e-01
4.796672463417053223e-01
4.780393838882446289e-01
4.760163128376007080e-01
4.742688238620758057e-01
4.734273850917816162e-01
4.728480577468872070e-01
4.693175256252288818e-01
4.692904055118560791e-01
4.673083424568176270e-01
4.652064442634582520e-01
4.643642008304595947e-01
4.629319310188293457e-01
4.628758430480957031e-01
4.616330862045288086e-01
4.615295231342315674e-01
4.606322944164276123e-01
4.605318903923034668e-01
4.596299231052398682e-01
4.595592021942138672e-01
4.592301547527313232e-01
4.591525197029113770e-01
4.545675218105316162e-01
4.540373682975769043e-01
4.535337984561920166e-01
4.530033171176910400e-01
4.526770114898681641e-01
4.525816142559051514e-01
4.497693777084350586e-01
4.492796063423156738e-01
4.475942850112915039e-01
4.459849894046783447e-01
4.459626376628875732e-01
4.459457397460937500e-01
4.456746876239776611e-01
4.453354775905609131e-01
4.437796771526336670e-01
4.435212910175323486e-01
4.423880279064178467e-01
4.417784214019775391e-01
4.415870606899261475e-01
4.392836391925811768e-01
4.360720217227935791e-01
4.359287619590759277e-01
4.342479407787322998e-01
4.309260845184326172e-01
4.307781457901000977e-01
4.229337573051452637e-01
4.191002249717712402e-01
4.176693260669708252e-01
4.157853126525878906e-01
4.145548641681671143e-01
4.143711030483245850e-01
4.143221974372863770e-01
4.141373634338378906e-01
4.138289093971252441e-01
4.116069972515106201e-01
4.110534787178039551e-01
4.055842161178588867e-01
4.033834636211395264e-01
4.026254415512084961e-01
4.007218480110168457e-01
4.004312455654144287e-01
4.000195562839508057e-01
3.985356092453002930e-01
3.982662856578826904e-01
3.958088755607604980e-01
3.956505060195922852e-01
3.955715298652648926e-01
3.955473899841308594e-01
3.946185410022735596e-01
3.944383263587951660e-01
3.926749825477600098e-01
3.921134471893310547e-01
3.915137350559234619e-01
3.891802728176116943e-01
3.870739042758941650e-01
3.858299553394317627e-01
3.850462436676025391e-01
3.845554888248443604e-01
3.841651082038879395e-01
3.828327059745788574e-01
3.805511593818664551e-01
3.786255717277526855e-01
3.778471648693084717e-01
3.765224516391754150e-01
3.747186660766601562e-01
3.738645315170288086e-01
3.733454942703247070e-01
3.724613785743713379e-01
3.712019324302673340e-01
3.705503940582275391e-01
3.701270818710327148e-01
3.681935966014862061e-01
3.672298491001129150e-01
3.668467998504638672e-01
3.651961088180541992e-01
3.648684322834014893e-01
3.636510968208312988e-01
3.634826540946960449e-01
3.625943064689636230e-01
3.605675697326660156e-01
3.604351282119750977e-01
3.601845204830169678e-01
3.586555123329162598e-01
3.586171865463256836e-01
3.558832406997680664e-01
3.545287251472473145e-01
3.543533086776733398e-01
3.531634807586669922e-01
3.530049622058868408e-01
3.519097566604614258e-01
3.508982956409454346e-01
3.507171869277954102e-01
3.499115705490112305e-01
3.488184809684753418e-01
3.482732772827148438e-01
3.478928804397583008e-01
3.453999757766723633e-01
3.452497720718383789e-01
3.442590832710266113e-01
3.431711792945861816e-01
3.418762087821960449e-01
3.412887454032897949e-01
3.412441015243530273e-01
3.406261801719665527e-01
3.402064442634582520e-01
3.391762971878051758e-01
3.389122188091278076e-01
3.387656509876251221e-01
3.383758664131164551e-01
3.378209769725799561e-01
3.371753394603729248e-01
3.369538784027099609e-01
3.364059031009674072e-01
3.356507420539855957e-01
3.344967067241668701e-01
3.340931832790374756e-01
3.339817821979522705e-01
3.330824673175811768e-01
3.329787254333496094e-01
3.327359855175018311e-01
3.305099606513977051e-01
3.302214741706848145e-01
3.293908238410949707e-01
3.262296617031097412e-01
3.251450061798095703e-01
3.248475492000579834e-01
3.233827352523803711e-01
3.219004869461059570e-01
3.208362162113189697e-01
3.193773031234741211e-01
3.191813230514526367e-01
3.189982175827026367e-01
3.188689649105072021e-01
3.179437518119812012e-01
3.172145485877990723e-01
3.155201673507690430e-01
3.150883615016937256e-01
3.145033121109008789e-01
3.137935996055603027e-01
3.135934472084045410e-01
3.135029077529907227e-01
3.126448392868041992e-01
3.122832775115966797e-01
3.112984299659729004e-01
3.109717667102813721e-01
3.104935288429260254e-01
3.088238835334777832e-01
3.084580898284912109e-01
3.081744909286499023e-01
3.077384233474731445e-01
3.070276677608489990e-01
3.063567876815795898e-01
3.054325580596923828e-01
3.047562241554260254e-01
3.036985099315643311e-01
3.036299645900726318e-01
3.030806183815002441e-01
3.027049303054809570e-01
3.000156581401824951e-01
2.998000085353851318e-01
2.995801568031311035e-01
2.984280288219451904e-01
2.973690032958984375e-01
2.956329584121704102e-01
2.949626445770263672e-01
2.943494915962219238e-01
2.941492795944213867e-01
2.938701510429382324e-01
2.937958538532257080e-01
2.935742139816284180e-01
2.929293513298034668e-01
2.926502525806427002e-01
2.926403880119323730e-01
2.921763062477111816e-01
2.919014692306518555e-01
2.911138534545898438e-01
2.905566096305847168e-01
2.901523709297180176e-01
2.885747849941253662e-01
2.875384092330932617e-01
2.874549627304077148e-01
2.865563333034515381e-01
2.863578796386718750e-01
2.858963608741760254e-01
2.852433323860168457e-01
2.848995923995971680e-01
2.846212983131408691e-01
2.839962542057037354e-01
2.822527587413787842e-01
2.821849584579467773e-01
2.820432782173156738e-01
2.817218899726867676e-01
2.803382873535156250e-01
2.798967957496643066e-01
2.798015177249908447e-01
2.795643210411071777e-01
2.793188691139221191e-01
2.782281637191772461e-01
2.776714563369750977e-01
2.769734859466552734e-01
2.768353223800659180e-01
2.768051624298095703e-01
2.767820954322814941e-01
2.765174508094787598e-01
2.763202786445617676e-01
2.761822342872619629e-01
2.753678560256958008e-01
2.747118473052978516e-01
2.744817137718200684e-01
2.734987139701843262e-01
2.730114459991455078e-01
2.722890973091125488e-01
2.701666653156280518e-01
2.687380909919738770e-01
2.686971724033355713e-01
2.683795690536499023e-01
2.668679654598236084e-01
2.667570114135742188e-01
2.657647430896759033e-01
2.657612562179565430e-01
2.653305232524871826e-01
2.652416229248046875e-01
2.648670077323913574e-01
2.644168734550476074e-01
2.642032802104949951e-01
2.636582255363464355e-01
2.636235654354095459e-01
2.633963525295257568e-01
2.623289525508880615e-01
2.617926001548767090e-01
2.613028883934020996e-01
2.611173689365386963e-01
2.608838677406311035e-01
2.607407271862030029e-01
2.606831789016723633e-01
2.602170109748840332e-01
2.595190107822418213e-01
2.594103217124938965e-01
2.581344842910766602e-01
2.578701376914978027e-01
2.559340596199035645e-01
2.555509209632873535e-01
2.554016709327697754e-01
2.553781270980834961e-01
2.539215087890625000e-01
2.538190484046936035e-01
2.533363699913024902e-01
2.530602514743804932e-01
2.529902458190917969e-01
2.521787881851196289e-01
2.521417737007141113e-01
2.513593733310699463e-01
2.512920796871185303e-01
2.512762546539306641e-01
2.511174082756042480e-01
2.509540319442749023e-01
2.498374581336975098e-01
2.497683763504028320e-01
2.492016255855560303e-01
2.489708662033081055e-01
2.488737106323242188e-01
2.484022378921508789e-01
2.479929924011230469e-01
2.479212880134582520e-01
2.476921379566192627e-01
2.475544512271881104e-01
2.463209629058837891e-01
2.461764514446258545e-01
2.461510896682739258e-01
2.460265159606933594e-01
2.460121512413024902e-01
2.459861338138580322e-01
2.456554472446441650e-01
2.454403638839721680e-01
2.448759377002716064e-01
2.446829974651336670e-01
2.445853948593139648e-01
2.445792853832244873e-01
2.445182800292968750e-01
2.440320551395416260e-01
2.439822554588317871e-01
2.435705959796905518e-01
2.433919608592987061e-01
2.431572973728179932e-01
2.424090504646301270e-01
2.423582971096038818e-01
2.417740523815155029e-01
2.415108680725097656e-01
2.407183945178985596e-01
2.404840886592864990e-01
2.403359115123748779e-01
2.402557730674743652e-01
2.399920821189880371e-01
2.395489513874053955e-01
2.394773364067077637e-01
2.393127083778381348e-01
2.392083406448364258e-01
2.389782965183258057e-01
2.384212613105773926e-01
2.381299436092376709e-01
2.380374968051910400e-01
2.377513647079467773e-01
2.375282645225524902e-01
2.371903359889984131e-01
2.367996573448181152e-01
2.367707788944244385e-01
2.364879250526428223e-01
2.362867295742034912e-01
2.361618876457214355e-01
2.353419363498687744e-01
2.347856163978576660e-01
2.347349524497985840e-01
2.345709800720214844e-01
2.345547676086425781e-01
2.343741059303283691e-01
2.341092228889465332e-01
2.338802218437194824e-01
2.336317896842956543e-01
2.335880994796752930e-01
2.334252595901489258e-01
2.331881225109100342e-01
2.331369519233703613e-01
2.330386638641357422e-01
2.327302098274230957e-01
2.324627935886383057e-01
2.324181497097015381e-01
2.321562469005584717e-01
2.321498990058898926e-01
2.321389913558959961e-01
2.321325242519378662e-01
2.316233813762664795e-01
2.315035164356231689e-01
2.312802076339721680e-01
2.312692105770111084e-01
2.291864454746246338e-01
2.288531363010406494e-01
2.286206781864166260e-01
2.285231947898864746e-01
2.280659675598144531e-01
2.280051708221435547e-01
2.279573678970336914e-01
2.279063463211059570e-01
2.276837825775146484e-01
2.274960279464721680e-01
2.263783812522888184e-01
2.261435091495513916e-01
2.251501977443695068e-01
2.249865531921386719e-01
2.249132096767425537e-01
2.243295609951019287e-01
2.240728735923767090e-01
2.238956689834594727e-01
2.235078513622283936e-01
2.231513559818267822e-01
2.226676940917968750e-01
2.221693098545074463e-01
2.220027148723602295e-01
2.218516170978546143e-01
2.217835187911987305e-01
2.213695347309112549e-01
2.211493551731109619e-01
2.210215926170349121e-01
2.208333909511566162e-01
2.206641137599945068e-01
2.196981906890869141e-01
2.194930613040924072e-01
2.183430194854736328e-01
2.183189690113067627e-01
2.182576656341552734e-01
2.182190120220184326e-01
2.178391218185424805e-01
2.176906764507293701e-01
2.175573408603668213e-01
2.174639403820037842e-01
2.174484431743621826e-01
2.174186408519744873e-01
2.173903584480285645e-01
2.173609435558319092e-01
2.172457277774810791e-01
2.172183096408843994e-01
2.168732583522796631e-01
2.168394327163696289e-01
2.167296409606933594e-01
2.165398299694061279e-01
2.156441211700439453e-01
2.155949771404266357e-01
2.153964340686798096e-01
2.152561843395233154e-01
2.148755490779876709e-01
2.147189080715179443e-01
2.146135270595550537e-01
2.141544222831726074e-01
2.141082584857940674e-01
2.140430510044097900e-01
2.138473391532897949e-01
2.138109207153320312e-01
2.137094438076019287e-01
2.136672437191009521e-01
2.128812074661254883e-01
2.127662599086761475e-01
2.124803960323333740e-01
2.121851444244384766e-01
2.121462225914001465e-01
2.121293246746063232e-01
2.109026908874511719e-01
2.108846008777618408e-01
2.108085453510284424e-01
2.107130885124206543e-01
2.104220390319824219e-01
2.102400064468383789e-01
2.098408639430999756e-01
2.097565829753875732e-01
2.094234228134155273e-01
2.092832326889038086e-01
2.091185152530670166e-01
2.090991437435150146e-01
2.089338600635528564e-01
2.088688910007476807e-01
2.075035274028778076e-01
2.074632048606872559e-01
2.064443826675415039e-01
2.064050436019897461e-01
2.059435844421386719e-01
2.056945860385894775e-01
2.052295804023742676e-01
2.051770389080047607e-01
2.043511569499969482e-01
2.043443620204925537e-01
2.043154239654541016e-01
2.043088674545288086e-01
2.042377591133117676e-01
2.042104005813598633e-01
2.039914429187774658e-01
2.038668692111968994e-01
2.037013769149780273e-01
2.036445438861846924e-01
2.036008834838867188e-01
2.035193145275115967e-01
2.033964991569519043e-01
2.030939161777496338e-01
2.028456628322601318e-01
2.026041448116302490e-01
2.019606232643127441e-01
2.019085884094238281e-01
2.015638649463653564e-01
2.014477849006652832e-01
2.013471126556396484e-01
2.011905014514923096e-01
2.007332146167755127e-01
2.006789445877075195e-01
2.001344859600067139e-01
1.998791396617889404e-01
1.996874511241912842e-01
1.996509432792663574e-01
1.994187235832214355e-01
1.993174552917480469e-01
1.989601552486419678e-01
1.989445984363555908e-01
1.988186538219451904e-01
1.988089382648468018e-01
1.987275779247283936e-01
1.987046897411346436e-01
1.984161138534545898e-01
1.981981098651885986e-01
1.976616680622100830e-01
1.975544095039367676e-01
1.974219679832458496e-01
1.972927153110504150e-01
1.968717277050018311e-01
1.968489587306976318e-01
1.968117654323577881e-01
1.967781782150268555e-01
1.965072154998779297e-01
1.964361071586608887e-01
1.964100301265716553e-01
1.963357329368591309e-01
1.960144042968750000e-01
1.959720253944396973e-01
1.956987977027893066e-01
1.955702304840087891e-01
1.955156922340393066e-01
1.954659819602966309e-01
1.952928304672241211e-01
1.951997578144073486e-01
1.949720084667205811e-01
1.948417723178863525e-01
1.940470933914184570e-01
1.940279006958007812e-01
1.936780214309692383e-01
1.935489773750305176e-01
1.931827068328857422e-01
1.931138634681701660e-01
1.930175423622131348e-01
1.928374469280242920e-01
1.928359568119049072e-01
1.928298473358154297e-01
1.924543976783752441e-01
1.924492120742797852e-01
1.919766366481781006e-01
1.919226646423339844e-01
1.917736828327178955e-01
1.916562318801879883e-01
1.916323900222778320e-01
1.916081309318542480e-01
1.915715634822845459e-01
1.915136873722076416e-01
1.914065778255462646e-01
1.913821101188659668e-01
1.905952990055084229e-01
1.905325353145599365e-01
1.903953254222869873e-01
1.903027892112731934e-01
1.900793313980102539e-01
1.900708377361297607e-01
1.897577047348022461e-01
1.897538602352142334e-01
1.897124946117401123e-01
1.896947920322418213e-01
1.896432638168334961e-01
1.895642280578613281e-01
1.892893314361572266e-01
1.891286373138427734e-01
1.890069246292114258e-01
1.888928115367889404e-01
1.887787580490112305e-01
1.887764334678649902e-01
1.886769235134124756e-01
1.885355412960052490e-01
1.884938478469848633e-01
1.884382069110870361e-01
1.883623003959655762e-01
1.883600354194641113e-01
1.878487467765808105e-01
1.878016591072082520e-01
1.877581477165222168e-01
1.877471208572387695e-01
1.875856220722198486e-01
1.875334382057189941e-01
1.875286996364593506e-01
1.875272989273071289e-01
1.873529553413391113e-01
1.873524487018585205e-01
1.868111789226531982e-01
1.868094503879547119e-01
1.866551637649536133e-01
1.865379810333251953e-01
1.861319839954376221e-01
1.861296892166137695e-01
1.861023902893066406e-01
1.860885918140411377e-01
1.859864294528961182e-01
1.859397888183593750e-01
1.855831742286682129e-01
1.855813860893249512e-01
1.854476928710937500e-01
1.854426562786102295e-01
1.853839159011840820e-01
1.853616535663604736e-01
1.851829886436462402e-01
1.850655674934387207e-01
1.850185394287109375e-01
1.850112080574035645e-01
1.849909126758575439e-01
1.849541068077087402e-01
1.848126053810119629e-01
1.848092377185821533e-01
1.847721040248870850e-01
1.847663223743438721e-01
1.847026646137237549e-01
1.846758425235748291e-01
1.846677958965301514e-01
1.846600174903869629e-01
1.845156848430633545e-01
1.844961643218994141e-01
1.843406856060028076e-01
1.843011677265167236e-01
1.842275857925415039e-01
1.841661036014556885e-01
1.839874684810638428e-01
1.838932037353515625e-01
1.838576197624206543e-01
1.838231980800628662e-01
1.837843656539916992e-01
1.837653815746307373e-01
1.835703253746032715e-01
1.835487186908721924e-01
1.834227740764617920e-01
1.833490133285522461e-01
1.831232309341430664e-01
1.831088364124298096e-01
1.828264594078063965e-01
1.827891170978546143e-01
1.827762722969055176e-01
1.827737987041473389e-01
1.827699542045593262e-01
1.827651262283325195e-01
1.826302409172058105e-01
1.826159060001373291e-01
1.825253665447235107e-01
1.824815869331359863e-01
1.818125545978546143e-01
1.818028986454010010e-01
1.815020740032196045e-01
1.814830601215362549e-01
1.813733279705047607e-01
1.813544034957885742e-01
1.812275052070617676e-01
1.811727881431579590e-01
1.811474263668060303e-01
1.811292469501495361e-01
1.810722649097442627e-01
1.810411214828491211e-01
1.809704601764678955e-01
1.809512078762054443e-01
1.808566749095916748e-01
1.808381080627441406e-01
1.807258427143096924e-01
1.807001233100891113e-01
1.806174516677856445e-01
1.805778145790100098e-01
1.805259883403778076e-01
1.805011034011840820e-01
1.804677248001098633e-01
1.803852319717407227e-01
1.803075969219207764e-01
1.802597343921661377e-01
1.802500486373901367e-01
1.801055967807769775e-01
1.798979341983795166e-01
1.798799037933349609e-01
1.797971725463867188e-01
1.797804832458496094e-01
1.796827614307403564e-01
1.795874834060668945e-01
1.791590452194213867e-01
1.791226863861083984e-01
1.788899302482604980e-01
1.788546442985534668e-01
1.786839962005615234e-01
1.786714196205139160e-01
1.785323321819305420e-01
1.785210371017456055e-01
1.784820854663848877e-01
1.784227490425109863e-01
1.783968806266784668e-01
1.783291399478912354e-01
1.783084273338317871e-01
1.782871186733245850e-01
1.782693862915039062e-01
1.782513856887817383e-01
1.781843602657318115e-01
1.781644225120544434e-01
1.781573295593261719e-01
1.781145036220550537e-01
1.779596209526062012e-01
