0.000000000000000000e+00
6.495101506220524179e-02
6.636009478830662278e-02
6.704663267122848436e-02
6.968097622314844974e-02
7.390548914776079448e-02
7.503185913610169178e-02
8.591673286796587539e-02
8.591673286796587539e-02
9.136988212931300424e-02
9.136988212931300424e-02
9.233177638822498423e-02
9.233177638822498423e-02
9.264353153754111003e-02
9.264353153754111003e-02
9.579381434579700705e-02
9.579381434579700705e-02
9.730775316893586213e-02
9.730775316893586213e-02
9.868606511525221392e-02
9.868606511525221392e-02
9.890300413464606089e-02
9.890300413464606089e-02
1.003224222987449676e-01
1.003224222987449676e-01
1.006967380990398675e-01
1.006967380990398675e-01
1.017387083742818665e-01
1.017387083742818665e-01
1.022149910169043580e-01
1.022149910169043580e-01
1.025162442224966663e-01
1.025162442224966663e-01
1.026620336873541595e-01
1.026620336873541595e-01
1.029440068448384260e-01
1.029440068448384260e-01
1.030802168137998076e-01
1.030802168137998076e-01
1.032132592842644747e-01
1.032132592842644747e-01
1.033431464896082674e-01
1.033431464896082674e-01
1.035935022901014468e-01
1.035935022901014468e-01
1.037139936208902324e-01
1.037139936208902324e-01
1.040568507333102799e-01
1.040568507333102799e-01
1.041649648536550343e-01
1.041649648536550343e-01
1.042700094081848161e-01
1.042700094081848161e-01
1.044709265862778513e-01
1.044709265862778513e-01
1.047495024615709425e-01
1.047495024615709425e-01
1.048363136919282235e-01
1.048363136919282235e-01
1.052253452843271153e-01
1.052253452843271153e-01
1.055399210094178503e-01
1.055399210094178503e-01
1.055939627807423176e-01
1.055939627807423176e-01
1.056450579317292360e-01
1.056450579317292360e-01
1.057384252128178159e-01
1.057384252128178159e-01
1.058200540065013795e-01
1.058200540065013795e-01
1.058899714597895669e-01
1.058899714597895669e-01
1.059205458329479377e-01
1.059205458329479377e-01
1.059482007583668339e-01
1.059482007583668339e-01
1.059729385216422182e-01
1.059729385216422182e-01
1.059947611652543864e-01
1.059947611652543864e-01
1.060136704894131532e-01
1.060136704894131532e-01
1.060296680528021174e-01
1.060296680528021174e-01
1.060427551732221890e-01
1.060427551732221890e-01
1.060529329281348354e-01
1.060529329281348354e-01
1.060602021551061563e-01
1.060602021551061563e-01
1.060660171779821276e-01
1.060660171779821276e-01
1.060602021551061563e-01
1.060602021551061563e-01
1.060296680528021174e-01
1.060296680528021174e-01
1.059947611652543864e-01
1.059947611652543864e-01
1.058564751092320455e-01
1.058564751092320455e-01
1.058200540065013795e-01
1.058200540065013795e-01
1.055939627807423176e-01
1.055939627807423176e-01
1.054229792327738280e-01
1.054229792327738280e-01
1.053600693954792333e-01
1.053600693954792333e-01
1.051535196019856427e-01
1.051535196019856427e-01
1.050009104504184415e-01
1.050009104504184415e-01
1.047495024615709425e-01
1.047495024615709425e-01
1.045668168330096959e-01
1.045668168330096959e-01
1.044709265862778513e-01
1.044709265862778513e-01
1.041649648536550343e-01
1.041649648536550343e-01
1.040568507333102799e-01
1.040568507333102799e-01
1.038313751688277053e-01
1.038313751688277053e-01
1.037139936208902324e-01
1.037139936208902324e-01
1.035935022901014468e-01
1.035935022901014468e-01
1.030802168137998076e-01
1.030802168137998076e-01
1.029440068448384260e-01
1.029440068448384260e-01
1.023672346932392174e-01
1.023672346932392174e-01
1.022149910169043580e-01
1.022149910169043580e-01
1.020594987202169124e-01
1.020594987202169124e-01
1.017387083742818665e-01
1.017387083742818665e-01
1.015733793563858012e-01
1.015733793563858012e-01
1.014047397643539627e-01
1.014047397643539627e-01
1.012327730533320452e-01
1.012327730533320452e-01
1.005112885179653692e-01
1.005112885179653692e-01
9.953239677201500268e-02
9.953239677201500268e-02
9.932614714405682554e-02
9.932614714405682554e-02
9.890300413464606089e-02
9.890300413464606089e-02
9.868606511525221392e-02
9.868606511525221392e-02
9.846551634758624050e-02
9.846551634758624050e-02
9.824133352033015409e-02
9.824133352033015409e-02
9.801349169731535249e-02
9.801349169731535249e-02
9.730775316893586213e-02
9.730775316893586213e-02
9.706501291401284370e-02
9.706501291401284370e-02
9.681847900994625111e-02
9.681847900994625111e-02
9.656812240171350203e-02
9.656812240171350203e-02
9.605582105604598686e-02
9.605582105604598686e-02
9.579381434579700705e-02
9.579381434579700705e-02
9.498398093868598568e-02
9.498398093868598568e-02
9.442390595930347241e-02
9.442390595930347241e-02
9.413770534872428764e-02
9.413770534872428764e-02
9.355278934120518641e-02
9.355278934120518641e-02
9.325399544794175932e-02
9.325399544794175932e-02
9.295092350848679907e-02
9.295092350848679907e-02
9.201561371231503639e-02
9.201561371231503639e-02
9.169499791860932780e-02
9.169499791860932780e-02
9.136988212931300424e-02
9.136988212931300424e-02
9.104021813432966459e-02
9.104021813432966459e-02
9.036704573550501107e-02
9.036704573550501107e-02
9.002343380674618367e-02
9.002343380674618367e-02
8.967506651429570097e-02
8.967506651429570097e-02
8.932188821851055893e-02
8.932188821851055893e-02
8.896384162168262388e-02
8.896384162168262388e-02
8.860086770368870435e-02
8.860086770368870435e-02
8.823290565427541199e-02
8.823290565427541199e-02
8.670989318125733869e-02
8.670989318125733869e-02
8.631601045466441580e-02
8.631601045466441580e-02
8.551198485120126147e-02
8.551198485120126147e-02
8.510168835146414423e-02
8.510168835146414423e-02
8.468576272277636430e-02
8.468576272277636430e-02
8.383668782250797147e-02
8.383668782250797147e-02
8.340336320850785801e-02
8.340336320850785801e-02
8.251867821982193651e-02
8.251867821982193651e-02
8.114507656391302393e-02
8.114507656391302393e-02
8.067436807035360813e-02
8.067436807035360813e-02
8.019705179823923002e-02
8.019705179823923002e-02
7.971300904682393496e-02
7.971300904682393496e-02
7.922211652095387246e-02
7.922211652095387246e-02
7.872424608347255992e-02
7.872424608347255992e-02
7.770703310439300293e-02
7.770703310439300293e-02
7.718740759354314473e-02
7.718740759354314473e-02
7.503185913610170565e-02
7.503185913610170565e-02
7.390548914776078060e-02
7.390548914776078060e-02
7.274472990728426958e-02
7.274472990728426958e-02
7.031318100188291287e-02
7.031318100188291287e-02
6.968097622314847750e-02
6.968097622314847750e-02
6.903851615445834311e-02
6.903851615445834311e-02
6.838551176089001371e-02
6.838551176089001371e-02
6.772165802296364889e-02
6.772165802296364889e-02
6.704663267122849823e-02
6.704663267122849823e-02
6.566168326098888175e-02
6.566168326098888175e-02
6.422768333939957164e-02
6.422768333939957164e-02
6.274126973523816431e-02
6.274126973523816431e-02
6.119862344201550813e-02
6.119862344201550813e-02
6.040487284721282601e-02
6.040487284721282601e-02
5.959537781379756205e-02
5.959537781379756205e-02
5.876948775037603434e-02
5.876948775037603434e-02
5.792650140225037714e-02
5.792650140225037714e-02
5.706566112435063759e-02
5.706566112435063759e-02
5.618614629074078493e-02
5.618614629074078493e-02
5.528706567580535941e-02
5.528706567580535941e-02
5.436744860362771603e-02
5.436744860362771603e-02
5.342623461265429141e-02
5.342623461265429141e-02
5.246226131892954558e-02
5.246226131892954558e-02
5.046078893643229230e-02
5.046078893643229230e-02
4.942031221744169756e-02
4.942031221744169756e-02
4.835107589126284855e-02
4.835107589126284855e-02
4.725112761201465811e-02
4.725112761201465811e-02
4.495001472645293594e-02
4.495001472645293594e-02
4.249554740880216730e-02
4.249554740880216730e-02
4.120230907719791419e-02
4.120230907719791419e-02
3.547530935847714034e-02
3.547530935847714034e-02
3.386993505682903138e-02
3.386993505682903138e-02
3.217500066851543272e-02
3.217500066851543272e-02
2.637621302159158868e-02
2.637621302159158868e-02
1.872505604853359762e-02
1.872505604853359762e-02
1.083940346217973465e-02
1.083940346217973465e-02
0.000000000000000000e+00
0.000000000000000000e+00
