2.000000000000000000e+00
1.000000000000000000e+00
9.999998211860656738e-01
9.999997615814208984e-01
9.999997019767761230e-01
9.999990463256835938e-01
9.999989271163940430e-01
9.999988079071044922e-01
9.999986886978149414e-01
9.999974370002746582e-01
9.999973773956298828e-01
9.999764561653137207e-01
9.999744892120361328e-01
9.996345043182373047e-01
9.995932579040527344e-01
9.994055032730102539e-01
9.993983507156372070e-01
9.988801479339599609e-01
9.988669157028198242e-01
9.984781742095947266e-01
9.984668493270874023e-01
9.973220229148864746e-01
9.968907833099365234e-01
9.967262744903564453e-01
9.966022968292236328e-01
9.870815277099609375e-01
9.862700700759887695e-01
9.860757589340209961e-01
9.841845035552978516e-01
9.834952354431152344e-01
9.829049110412597656e-01
9.819393754005432129e-01
9.810131788253784180e-01
9.790866374969482422e-01
9.789683818817138672e-01
9.683070182800292969e-01
9.672710299491882324e-01
9.609912037849426270e-01
9.606426954269409180e-01
9.474050402641296387e-01
9.461476802825927734e-01
9.455018043518066406e-01
9.448831081390380859e-01
9.404894113540649414e-01
9.399442672729492188e-01
9.204083681106567383e-01
9.176155328750610352e-01
9.086113572120666504e-01
9.059808254241943359e-01
9.024447202682495117e-01
8.984311819076538086e-01
8.936035633087158203e-01
8.929905891418457031e-01
8.834724426269531250e-01
8.791528940200805664e-01
8.441095948219299316e-01
8.371428251266479492e-01
8.354779481887817383e-01
8.315791487693786621e-01
8.292818665504455566e-01
8.286777734756469727e-01
8.214095234870910645e-01
8.073680400848388672e-01
8.005518913269042969e-01
7.991170883178710938e-01
7.890610098838806152e-01
7.850459218025207520e-01
7.840840220451354980e-01
7.792973518371582031e-01
7.707945108413696289e-01
7.664769887924194336e-01
7.656612396240234375e-01
7.632932662963867188e-01
7.528244853019714355e-01
7.524095773696899414e-01
7.507389783859252930e-01
7.445092797279357910e-01
7.291750311851501465e-01
7.243440747261047363e-01
7.193413376808166504e-01
7.142584323883056641e-01
7.140000462532043457e-01
7.120834589004516602e-01
7.092316746711730957e-01
7.044765949249267578e-01
6.898664236068725586e-01
6.897882819175720215e-01
6.642664670944213867e-01
6.614282727241516113e-01
6.497430801391601562e-01
6.491691470146179199e-01
6.487056016921997070e-01
6.440101861953735352e-01
6.353912353515625000e-01
6.345514059066772461e-01
6.324445605278015137e-01
6.249626874923706055e-01
6.226338744163513184e-01
6.180999279022216797e-01
6.142796874046325684e-01
5.970632433891296387e-01
5.920134782791137695e-01
5.863400101661682129e-01
5.854449272155761719e-01
5.823155045509338379e-01
5.789292454719543457e-01
5.729440450668334961e-01
5.706111788749694824e-01
5.425770878791809082e-01
5.404781103134155273e-01
5.387855768203735352e-01
5.366569161415100098e-01
5.277281403541564941e-01
5.187267065048217773e-01
5.161140561103820801e-01
5.155230760574340820e-01
5.103278160095214844e-01
5.056229829788208008e-01
5.053913593292236328e-01
5.002480745315551758e-01
4.908838570117950439e-01
4.905027747154235840e-01
4.828376770019531250e-01
4.823432266712188721e-01
4.802452325820922852e-01
4.735441803932189941e-01
4.726702272891998291e-01
4.680956304073333740e-01
4.658358395099639893e-01
4.641877710819244385e-01
4.623108506202697754e-01
4.510373473167419434e-01
4.508680999279022217e-01
4.489495754241943359e-01
4.489386379718780518e-01
4.469256103038787842e-01
4.405214190483093262e-01
4.336527287960052490e-01
4.315792918205261230e-01
4.313323199748992920e-01
4.295601844787597656e-01
4.250850081443786621e-01
4.250276684761047363e-01
4.236322045326232910e-01
4.222092032432556152e-01
4.197734892368316650e-01
4.189157485961914062e-01
4.187278449535369873e-01
4.183174371719360352e-01
4.115481376647949219e-01
4.113829135894775391e-01
4.107221662998199463e-01
4.044968783855438232e-01
4.010662436485290527e-01
3.969712257385253906e-01
3.967120945453643799e-01
3.962402045726776123e-01
3.952448070049285889e-01
3.931718170642852783e-01
3.911754190921783447e-01
3.888042569160461426e-01
3.874665498733520508e-01
3.785301446914672852e-01
3.774520754814147949e-01
3.737984895706176758e-01
3.700652122497558594e-01
3.631697297096252441e-01
3.603036403656005859e-01
3.600615262985229492e-01
3.596875071525573730e-01
3.539304733276367188e-01
3.534336686134338379e-01
3.533377051353454590e-01
3.504023849964141846e-01
3.501566052436828613e-01
3.496136963367462158e-01
3.490625023841857910e-01
3.487240672111511230e-01
3.478299975395202637e-01
3.468899428844451904e-01
3.444249331951141357e-01
3.442465960979461670e-01
3.369500339031219482e-01
3.363310694694519043e-01
3.361670374870300293e-01
3.342928886413574219e-01
3.332811892032623291e-01
3.308729529380798340e-01
3.274761736392974854e-01
3.263931572437286377e-01
3.256035447120666504e-01
3.252344131469726562e-01
3.247455656528472900e-01
3.209665119647979736e-01
3.175837099552154541e-01
3.174628615379333496e-01
3.172444105148315430e-01
3.169504404067993164e-01
3.167250156402587891e-01
3.154799938201904297e-01
3.128730356693267822e-01
3.119611144065856934e-01
3.112043440341949463e-01
3.094914555549621582e-01
3.071079254150390625e-01
3.047201037406921387e-01
3.034523129463195801e-01
3.025831580162048340e-01
3.006766438484191895e-01
2.981847226619720459e-01
2.976565062999725342e-01
2.945920825004577637e-01
2.939866483211517334e-01
2.928371429443359375e-01
2.921616435050964355e-01
2.916173338890075684e-01
2.915529012680053711e-01
2.895845174789428711e-01
2.870582938194274902e-01
2.863584160804748535e-01
2.848505377769470215e-01
2.840262055397033691e-01
2.835971415042877197e-01
2.827744483947753906e-01
2.820247411727905273e-01
2.818591594696044922e-01
2.813719511032104492e-01
2.813448905944824219e-01
2.806722521781921387e-01
2.801728546619415283e-01
2.784474790096282959e-01
2.771921753883361816e-01
2.745253443717956543e-01
2.738251388072967529e-01
2.702581882476806641e-01
2.697690725326538086e-01
2.682806849479675293e-01
2.680873274803161621e-01
2.679405808448791504e-01
2.675926685333251953e-01
2.647984325885772705e-01
2.637930512428283691e-01
2.622908651828765869e-01
2.620808184146881104e-01
2.617071866989135742e-01
2.615647315979003906e-01
2.588242292404174805e-01
2.587804794311523438e-01
2.581503987312316895e-01
2.581032514572143555e-01
2.578333616256713867e-01
2.575492858886718750e-01
2.573851943016052246e-01
2.554062008857727051e-01
2.527300119400024414e-01
2.519562542438507080e-01
2.516633272171020508e-01
2.515986561775207520e-01
2.507706284523010254e-01
2.501942515373229980e-01
2.497548162937164307e-01
2.494684457778930664e-01
2.478920519351959229e-01
2.475542426109313965e-01
2.462089955806732178e-01
2.457110285758972168e-01
2.447071969509124756e-01
2.446544766426086426e-01
2.439669370651245117e-01
2.432968020439147949e-01
2.426147758960723877e-01
2.425277233123779297e-01
2.412705421447753906e-01
2.412514388561248779e-01
2.407704293727874756e-01
2.405495047569274902e-01
2.405186891555786133e-01
2.404586076736450195e-01
2.392544150352478027e-01
2.391369342803955078e-01
2.391012012958526611e-01
2.381476163864135742e-01
2.380357682704925537e-01
2.377615571022033691e-01
2.377378344535827637e-01
2.377116978168487549e-01
2.365502715110778809e-01
2.358522117137908936e-01
2.346283197402954102e-01
2.342603206634521484e-01
2.340585291385650635e-01
2.325639724731445312e-01
2.315940856933593750e-01
2.310267090797424316e-01
2.305753529071807861e-01
2.303156852722167969e-01
2.302947938442230225e-01
2.300180196762084961e-01
2.297523915767669678e-01
2.291232347488403320e-01
2.265955507755279541e-01
2.260851263999938965e-01
2.257806956768035889e-01
2.253904640674591064e-01
2.251860201358795166e-01
2.250348329544067383e-01
2.246527969837188721e-01
2.245935797691345215e-01
2.243204414844512939e-01
2.241237759590148926e-01
2.232970297336578369e-01
2.229954600334167480e-01
2.221144139766693115e-01
2.220931351184844971e-01
2.209280431270599365e-01
2.205092906951904297e-01
2.203371524810791016e-01
2.203050851821899414e-01
2.201379835605621338e-01
2.200137674808502197e-01
2.199916839599609375e-01
2.196685075759887695e-01
2.183816432952880859e-01
2.180207669734954834e-01
2.179024219512939453e-01
2.177361547946929932e-01
2.171499729156494141e-01
2.170958817005157471e-01
2.167896330356597900e-01
2.157358229160308838e-01
2.152450680732727051e-01
2.150379717350006104e-01
2.144252955913543701e-01
2.138944864273071289e-01
2.138323187828063965e-01
2.137987017631530762e-01
2.136040925979614258e-01
2.134322822093963623e-01
2.125753164291381836e-01
2.123690545558929443e-01
2.117375135421752930e-01
2.112699449062347412e-01
2.108856737613677979e-01
2.103601098060607910e-01
2.103502154350280762e-01
2.101457118988037109e-01
2.100169062614440918e-01
2.096953094005584717e-01
2.094505727291107178e-01
2.094358801841735840e-01
2.091597318649291992e-01
2.091039717197418213e-01
2.090059518814086914e-01
2.087071835994720459e-01
2.085918486118316650e-01
2.085901200771331787e-01
2.081481516361236572e-01
2.078296244144439697e-01
2.070382833480834961e-01
2.067801654338836670e-01
2.063859403133392334e-01
2.063730955123901367e-01
2.059193849563598633e-01
2.058317661285400391e-01
2.052834928035736084e-01
2.051743865013122559e-01
2.051074504852294922e-01
2.049557864665985107e-01
2.048891186714172363e-01
2.048845291137695312e-01
2.048569321632385254e-01
2.039317190647125244e-01
2.036116719245910645e-01
2.033814489841461182e-01
2.032062709331512451e-01
2.031900882720947266e-01
2.024342119693756104e-01
2.022130191326141357e-01
2.008952200412750244e-01
2.008542120456695557e-01
2.001426815986633301e-01
2.000748217105865479e-01
2.000443041324615479e-01
2.000247240066528320e-01
1.998594999313354492e-01
1.997503042221069336e-01
1.990812420845031738e-01
1.988042294979095459e-01
1.985860764980316162e-01
1.985721588134765625e-01
1.981787383556365967e-01
1.980034112930297852e-01
1.975455880165100098e-01
1.971140205860137939e-01
1.970700919628143311e-01
1.969175934791564941e-01
1.964803040027618408e-01
1.959322392940521240e-01
1.956132650375366211e-01
1.953846216201782227e-01
1.947291493415832520e-01
1.947106122970581055e-01
1.946648657321929932e-01
1.944885253906250000e-01
1.943879127502441406e-01
1.942490339279174805e-01
1.936795115470886230e-01
1.935857832431793213e-01
1.934748589992523193e-01
1.932949125766754150e-01
1.930990219116210938e-01
1.929243206977844238e-01
1.927894353866577148e-01
1.927299499511718750e-01
1.922409236431121826e-01
1.920077502727508545e-01
1.919115483760833740e-01
1.918807029724121094e-01
1.917969584465026855e-01
1.916876733303070068e-01
1.915213465690612793e-01
1.910915970802307129e-01
1.910204589366912842e-01
1.910062134265899658e-01
1.909367442131042480e-01
1.907910406589508057e-01
1.903775036334991455e-01
1.903596520423889160e-01
1.899568736553192139e-01
1.897709965705871582e-01
1.897519528865814209e-01
1.894390881061553955e-01
1.890037655830383301e-01
1.888745725154876709e-01
1.886342167854309082e-01
1.886157095432281494e-01
1.883434951305389404e-01
1.882486343383789062e-01
1.882011592388153076e-01
1.881970167160034180e-01
1.876147091388702393e-01
1.875741183757781982e-01
1.874300241470336914e-01
1.873123943805694580e-01
1.868615746498107910e-01
1.867448389530181885e-01
1.867158114910125732e-01
1.866594552993774414e-01
1.865407228469848633e-01
1.864066421985626221e-01
1.860179603099822998e-01
1.860174536705017090e-01
1.852143108844757080e-01
1.851615905761718750e-01
1.851243674755096436e-01
1.849646270275115967e-01
1.846699118614196777e-01
1.846314966678619385e-01
1.843991875648498535e-01
1.843284070491790771e-01
1.843029558658599854e-01
1.842946708202362061e-01
1.840760111808776855e-01
1.840549409389495850e-01
1.837404370307922363e-01
1.837269663810729980e-01
1.835115253925323486e-01
1.833214461803436279e-01
1.832797229290008545e-01
1.832304000854492188e-01
1.832168996334075928e-01
1.830925941467285156e-01
1.829595863819122314e-01
1.829121112823486328e-01
1.828339993953704834e-01
1.828102469444274902e-01
1.824185252189636230e-01
1.824170649051666260e-01
1.822997033596038818e-01
1.822924613952636719e-01
1.820957362651824951e-01
1.820796132087707520e-01
1.817710697650909424e-01
1.815747022628784180e-01
1.814510822296142578e-01
1.814112067222595215e-01
1.813024878501892090e-01
1.812908053398132324e-01
1.812307536602020264e-01
1.810819506645202637e-01
1.808610260486602783e-01
1.807613372802734375e-01
1.805228292942047119e-01
1.804147958755493164e-01
1.803230345249176025e-01
1.802816390991210938e-01
1.796459555625915527e-01
1.795910000801086426e-01
1.795198321342468262e-01
1.794579327106475830e-01
1.785807311534881592e-01
1.784442067146301270e-01
1.783751845359802246e-01
1.783274114131927490e-01
1.783215403556823730e-01
1.781494915485382080e-01
1.781214773654937744e-01
1.780431866645812988e-01
1.780174076557159424e-01
1.779280304908752441e-01
