9.603062868118286133e-01
2.250417172908782959e-01
1.903105974197387695e-01
5.752260684967041016e-01
1.809159219264984131e-01
2.076934278011322021e-01
2.328584194183349609e-01
2.418515086174011230e-01
3.734079301357269287e-01
1.788652837276458740e-01
1.979451775550842285e-01
2.037063837051391602e-01
2.065484821796417236e-01
8.152400255203247070e-01
8.976899981498718262e-01
2.446650266647338867e-01
5.043369531631469727e-01
7.503073215484619141e-01
2.726172804832458496e-01
2.105972170829772949e-01
9.999900460243225098e-01
2.016839981079101562e-01
9.727962017059326172e-01
1.940368115901947021e-01
9.990803003311157227e-01
2.730659842491149902e-01
2.225446999073028564e-01
1.823132336139678955e-01
2.440582215785980225e-01
2.072355151176452637e-01
2.088750302791595459e-01
3.449922502040863037e-01
1.819414496421813965e-01
2.394443750381469727e-01
8.534752726554870605e-01
1.817618906497955322e-01
2.912210822105407715e-01
6.500216722488403320e-01
9.444578886032104492e-01
9.300041198730468750e-01
3.325017094612121582e-01
1.864954829216003418e-01
2.068137526512145996e-01
9.755673408508300781e-01
1.804254055023193359e-01
2.479905784130096436e-01
2.129434645175933838e-01
2.481736242771148682e-01
9.907451868057250977e-01
2.219702899456024170e-01
9.339630007743835449e-01
1.000000000000000000e+00
2.065591216087341309e-01
9.939123988151550293e-01
8.456568717956542969e-01
1.961551904678344727e-01
1.884576380252838135e-01
1.791244745254516602e-01
1.961342990398406982e-01
1.969869434833526611e-01
4.777543246746063232e-01
5.546778440475463867e-01
2.343893647193908691e-01
1.835768222808837891e-01
2.029747366905212402e-01
9.996713399887084961e-01
7.702943086624145508e-01
9.877995252609252930e-01
3.070162534713745117e-01
1.962243020534515381e-01
2.082042694091796875e-01
2.510695457458496094e-01
2.318095266819000244e-01
4.421204924583435059e-01
9.879725575447082520e-01
1.873320937156677246e-01
2.354365885257720947e-01
1.857559382915496826e-01
1.790420711040496826e-01
2.317441403865814209e-01
4.065855741500854492e-01
1.885731816291809082e-01
2.342172861099243164e-01
2.024743258953094482e-01
2.339590787887573242e-01
1.890587806701660156e-01
3.288860619068145752e-01
1.808662712574005127e-01
1.788829267024993896e-01
9.939924478530883789e-01
1.907256543636322021e-01
2.107338905334472656e-01
1.827833652496337891e-01
1.955303847789764404e-01
3.676899671554565430e-01
1.787490248680114746e-01
1.823781728744506836e-01
1.793699562549591064e-01
2.125611901283264160e-01
2.658419311046600342e-01
9.998674392700195312e-01
2.760119438171386719e-01
1.948455870151519775e-01
2.505957484245300293e-01
9.997398853302001953e-01
1.918575763702392578e-01
6.206420660018920898e-01
9.428045153617858887e-01
2.896975278854370117e-01
3.001877665519714355e-01
1.818391978740692139e-01
4.653674662113189697e-01
1.964916586875915527e-01
2.005554735660552979e-01
1.861084997653961182e-01
5.536635518074035645e-01
3.111008405685424805e-01
1.925072371959686279e-01
4.125387072563171387e-01
1.898247897624969482e-01
4.701299369335174561e-01
6.721922755241394043e-01
3.044747412204742432e-01
3.670790791511535645e-01
1.865392625331878662e-01
8.243098258972167969e-01
1.000000000000000000e+00
2.377590239048004150e-01
2.196443974971771240e-01
2.104982435703277588e-01
9.271094799041748047e-01
9.999835491180419922e-01
1.890453994274139404e-01
2.807832956314086914e-01
2.070560753345489502e-01
4.191024601459503174e-01
9.999306797981262207e-01
1.998516023159027100e-01
2.106520533561706543e-01
2.072807550430297852e-01
2.819322943687438965e-01
4.954473972320556641e-01
7.228103876113891602e-01
6.480156183242797852e-01
2.333706021308898926e-01
9.634152650833129883e-01
7.281458377838134766e-01
2.206945717334747314e-01
9.954462051391601562e-01
2.240931391716003418e-01
8.758484721183776855e-01
1.842406690120697021e-01
9.945948123931884766e-01
2.017440497875213623e-01
1.000000000000000000e+00
2.057166099548339844e-01
8.617397546768188477e-01
2.509714365005493164e-01
9.941737651824951172e-01
4.135991930961608887e-01
2.194269597530364990e-01
2.446664869785308838e-01
9.999978542327880859e-01
2.359697520732879639e-01
1.813388466835021973e-01
1.961056292057037354e-01
1.840711832046508789e-01
9.488624334335327148e-01
2.188194990158081055e-01
8.384620547294616699e-01
9.876290559768676758e-01
4.655054211616516113e-01
2.133634686470031738e-01
1.865648627281188965e-01
3.646120429039001465e-01
1.996689140796661377e-01
9.999998807907104492e-01
1.793919205665588379e-01
5.283713936805725098e-01
5.455857515335083008e-01
3.159980475902557373e-01
9.830462336540222168e-01
3.928957879543304443e-01
5.016604065895080566e-01
6.612924933433532715e-01
1.838027238845825195e-01
2.603560984134674072e-01
1.895970404148101807e-01
9.999861717224121094e-01
1.874663531780242920e-01
2.110627293586730957e-01
1.880559027194976807e-01
1.845079958438873291e-01
9.768178462982177734e-01
2.193619906902313232e-01
1.000000000000000000e+00
2.018752396106719971e-01
5.328218936920166016e-01
2.452348172664642334e-01
3.045866787433624268e-01
9.845501184463500977e-01
1.960221230983734131e-01
1.959753036499023438e-01
2.062959074974060059e-01
1.885614693164825439e-01
1.853529214859008789e-01
1.952992081642150879e-01
2.503635883331298828e-01
2.060235142707824707e-01
2.135969996452331543e-01
9.999997615814208984e-01
1.874085366725921631e-01
9.746352434158325195e-01
7.410212159156799316e-01
4.283070564270019531e-01
5.888722538948059082e-01
2.299740314483642578e-01
3.798969388008117676e-01
2.577224373817443848e-01
1.807944178581237793e-01
2.234328687191009521e-01
4.738989770412445068e-01
2.092095613479614258e-01
1.000000000000000000e+00
4.288670420646667480e-01
2.082842886447906494e-01
4.833763539791107178e-01
1.839984059333801270e-01
2.295599579811096191e-01
9.999941587448120117e-01
2.609545588493347168e-01
9.975539445877075195e-01
1.904327571392059326e-01
9.999901652336120605e-01
4.188975989818572998e-01
2.909760475158691406e-01
9.747100472450256348e-01
3.419831395149230957e-01
7.147147059440612793e-01
9.999387264251708984e-01
2.037094831466674805e-01
2.089667618274688721e-01
8.194000720977783203e-01
1.991272568702697754e-01
1.000000000000000000e+00
2.153336703777313232e-01
2.496750652790069580e-01
3.140498101711273193e-01
8.194549083709716797e-01
7.925519943237304688e-01
1.828935444355010986e-01
2.725795507431030273e-01
1.882189810276031494e-01
9.461251497268676758e-01
2.175192534923553467e-01
1.816805601119995117e-01
1.904561817646026611e-01
7.809289693832397461e-01
1.893784403800964355e-01
2.404709458351135254e-01
9.066457152366638184e-01
2.179171442985534668e-01
3.885196447372436523e-01
9.999936819076538086e-01
9.999923706054687500e-01
9.999539852142333984e-01
2.259139716625213623e-01
2.382898628711700439e-01
2.046844959259033203e-01
9.994047880172729492e-01
2.269053161144256592e-01
2.052846848964691162e-01
8.274080753326416016e-01
3.521986007690429688e-01
3.278065621852874756e-01
1.997547447681427002e-01
2.194762825965881348e-01
1.980514526367187500e-01
2.190040051937103271e-01
1.782502830028533936e-01
9.999561905860900879e-01
1.978442966938018799e-01
1.913650631904602051e-01
2.052016854286193848e-01
2.264460921287536621e-01
2.010678648948669434e-01
1.897545754909515381e-01
3.602100014686584473e-01
3.698151707649230957e-01
2.629057168960571289e-01
2.088277041912078857e-01
1.852644979953765869e-01
9.999997615814208984e-01
2.111867368221282959e-01
9.999979138374328613e-01
2.395857870578765869e-01
9.999977350234985352e-01
1.917277276515960693e-01
1.825894713401794434e-01
1.848023533821105957e-01
8.310275077819824219e-01
2.008281648159027100e-01
4.948411285877227783e-01
2.689806222915649414e-01
1.780992746353149414e-01
6.892794966697692871e-01
1.940052509307861328e-01
1.782888770103454590e-01
1.000000000000000000e+00
2.511824965476989746e-01
2.036633491516113281e-01
3.162501156330108643e-01
2.448060512542724609e-01
9.366877079010009766e-01
2.114954590797424316e-01
1.837083101272583008e-01
9.998341798782348633e-01
2.297070324420928955e-01
1.971223354339599609e-01
3.536385893821716309e-01
9.993022680282592773e-01
7.245758175849914551e-01
2.702803015708923340e-01
1.000000000000000000e+00
9.999761581420898438e-01
1.865726709365844727e-01
9.986983537673950195e-01
1.835804879665374756e-01
9.998507499694824219e-01
1.890251934528350830e-01
1.889844238758087158e-01
3.731590807437896729e-01
3.502129912376403809e-01
8.291238546371459961e-01
1.800236999988555908e-01
9.716196060180664062e-01
1.956053078174591064e-01
1.794588863849639893e-01
2.006925642490386963e-01
2.520369887351989746e-01
3.634369075298309326e-01
5.070705413818359375e-01
2.228177189826965332e-01
3.283988833427429199e-01
2.330947816371917725e-01
9.999541044235229492e-01
2.202592194080352783e-01
1.960391700267791748e-01
1.944371163845062256e-01
6.109534502029418945e-01
2.427502870559692383e-01
9.999908208847045898e-01
1.984759867191314697e-01
9.999927282333374023e-01
9.667628407478332520e-01
3.251047730445861816e-01
2.027913928031921387e-01
9.992219209671020508e-01
4.661688208580017090e-01
1.000000000000000000e+00
1.000000000000000000e+00
7.827334403991699219e-01
1.854815185070037842e-01
7.307099103927612305e-01
4.363625049591064453e-01
9.999974370002746582e-01
4.986215829849243164e-01
5.677905678749084473e-01
1.839370429515838623e-01
1.884231269359588623e-01
9.997193813323974609e-01
6.087904572486877441e-01
1.809673607349395752e-01
3.011341691017150879e-01
2.261364459991455078e-01
2.810665667057037354e-01
1.888963878154754639e-01
1.894933283329010010e-01
4.471313655376434326e-01
4.272941350936889648e-01
2.620401680469512939e-01
1.953480839729309082e-01
9.480769634246826172e-01
2.284676730632781982e-01
2.981775104999542236e-01
1.823728680610656738e-01
1.784403622150421143e-01
4.996762573719024658e-01
1.806748211383819580e-01
9.999667406082153320e-01
1.809443831443786621e-01
2.192339897155761719e-01
2.515551447868347168e-01
2.226142883300781250e-01
9.999984502792358398e-01
6.968486309051513672e-01
5.872097611427307129e-01
5.701859593391418457e-01
6.286622881889343262e-01
2.519926130771636963e-01
1.984779834747314453e-01
1.000000000000000000e+00
1.898556053638458252e-01
2.131966054439544678e-01
5.816594362258911133e-01
9.986310601234436035e-01
2.296507358551025391e-01
3.144293427467346191e-01
9.572639465332031250e-01
5.778912305831909180e-01
1.791997551918029785e-01
3.501507937908172607e-01
6.409192085266113281e-01
7.185365557670593262e-01
2.212984859943389893e-01
5.379949212074279785e-01
2.722459137439727783e-01
9.973524808883666992e-01
2.100507020950317383e-01
1.867499351501464844e-01
1.856410503387451172e-01
3.640347123146057129e-01
1.836140453815460205e-01
2.069606184959411621e-01
8.085846304893493652e-01
8.705153465270996094e-01
2.193735539913177490e-01
2.110989391803741455e-01
1.981601119041442871e-01
2.349071800708770752e-01
1.892777383327484131e-01
9.996631145477294922e-01
2.104069888591766357e-01
9.858803749084472656e-01
2.739098668098449707e-01
4.239074587821960449e-01
5.036309957504272461e-01
5.406805276870727539e-01
5.409259200096130371e-01
2.399664819240570068e-01
5.664551258087158203e-01
2.655919492244720459e-01
9.999996423721313477e-01
9.810429811477661133e-01
4.112801551818847656e-01
3.231109380722045898e-01
7.510192394256591797e-01
1.000000000000000000e+00
2.467237412929534912e-01
9.991216063499450684e-01
8.059948682785034180e-01
9.999995231628417969e-01
1.000000000000000000e+00
4.616609215736389160e-01
9.840867519378662109e-01
3.158252835273742676e-01
9.877201318740844727e-01
1.827612221240997314e-01
2.400394678115844727e-01
2.447210550308227539e-01
2.191911339759826660e-01
2.397398054599761963e-01
2.132774889469146729e-01
2.170876860618591309e-01
9.999991655349731445e-01
1.895194649696350098e-01
2.633095681667327881e-01
1.000000000000000000e+00
5.530889630317687988e-01
1.787791848182678223e-01
1.796854436397552490e-01
3.912495374679565430e-01
7.821311950683593750e-01
2.103337943553924561e-01
2.274929881095886230e-01
2.479057908058166504e-01
5.875861644744873047e-01
2.882979512214660645e-01
1.818416416645050049e-01
2.972764372825622559e-01
8.802189826965332031e-01
6.073113679885864258e-01
9.999845623970031738e-01
2.070410549640655518e-01
2.009635567665100098e-01
2.192461788654327393e-01
2.678996324539184570e-01
9.999995827674865723e-01
3.066880702972412109e-01
3.121847808361053467e-01
1.000000000000000000e+00
3.819404244422912598e-01
2.947729825973510742e-01
8.845387697219848633e-01
1.946406364440917969e-01
9.981688261032104492e-01
6.159107685089111328e-01
2.164534330368041992e-01
9.999440312385559082e-01
2.190015017986297607e-01
1.898703873157501221e-01
2.098122537136077881e-01
5.595084428787231445e-01
1.983145773410797119e-01
1.000000000000000000e+00
2.647139430046081543e-01
1.805798113346099854e-01
2.204686999320983887e-01
1.000000000000000000e+00
2.135518789291381836e-01
9.825531244277954102e-01
9.254295825958251953e-01
9.941885471343994141e-01
9.523531794548034668e-01
8.329311609268188477e-01
9.999994039535522461e-01
2.992012500762939453e-01
2.006899416446685791e-01
4.120324254035949707e-01
2.418224811553955078e-01
4.699405133724212646e-01
9.834003448486328125e-01
4.612560868263244629e-01
2.017845213413238525e-01
3.169878721237182617e-01
1.818614602088928223e-01
5.753514170646667480e-01
9.156194925308227539e-01
9.284405708312988281e-01
6.930652856826782227e-01
9.235177040100097656e-01
9.999861717224121094e-01
2.404448390007019043e-01
9.814402461051940918e-01
9.887644648551940918e-01
1.000000000000000000e+00
9.272741079330444336e-01
6.130245327949523926e-01
1.939294934272766113e-01
7.834569215774536133e-01
1.924037635326385498e-01
9.942654371261596680e-01
9.999959468841552734e-01
1.988153457641601562e-01
9.271937012672424316e-01
1.964904069900512695e-01
2.508921623229980469e-01
2.768566608428955078e-01
3.514482975006103516e-01
3.163979351520538330e-01
2.174093425273895264e-01
7.895222902297973633e-01
2.993100881576538086e-01
1.000000000000000000e+00
9.990759491920471191e-01
2.768521606922149658e-01
2.166459560394287109e-01
2.057056128978729248e-01
2.151328921318054199e-01
2.909698188304901123e-01
9.953806400299072266e-01
5.069625377655029297e-01
9.149670004844665527e-01
1.000000000000000000e+00
1.828763484954833984e-01
6.688853502273559570e-01
1.944462358951568604e-01
6.361635327339172363e-01
1.915552616119384766e-01
4.041970372200012207e-01
9.013718962669372559e-01
3.323742151260375977e-01
1.825399100780487061e-01
7.938971519470214844e-01
5.490160584449768066e-01
2.370859086513519287e-01
9.999632835388183594e-01
1.000000000000000000e+00
9.654476642608642578e-01
2.641144096851348877e-01
4.076717197895050049e-01
2.046961784362792969e-01
4.805358648300170898e-01
6.263610124588012695e-01
8.422302603721618652e-01
7.079470753669738770e-01
5.080381035804748535e-01
4.378607571125030518e-01
1.930065155029296875e-01
1.000000000000000000e+00
1.791065037250518799e-01
9.999723434448242188e-01
2.255810499191284180e-01
6.443029642105102539e-01
2.612824440002441406e-01
2.296130061149597168e-01
2.637644410133361816e-01
2.293986678123474121e-01
9.374836683273315430e-01
1.897204220294952393e-01
9.775549173355102539e-01
2.435180842876434326e-01
2.060019373893737793e-01
2.967373728752136230e-01
3.422666192054748535e-01
3.154042363166809082e-01
8.345544338226318359e-01
1.826187968254089355e-01
2.348383367061614990e-01
2.183372676372528076e-01
9.999995231628417969e-01
3.008772730827331543e-01
7.682923078536987305e-01
2.400794923305511475e-01
5.906618833541870117e-01
6.075391173362731934e-01
9.999998211860656738e-01
2.937452197074890137e-01
7.665193080902099609e-01
9.521336555480957031e-01
2.063343822956085205e-01
9.886955618858337402e-01
9.979209899902343750e-01
9.804180860519409180e-01
4.022763967514038086e-01
2.029921114444732666e-01
3.053126931190490723e-01
4.617526233196258545e-01
9.999997615814208984e-01
6.563777327537536621e-01
3.402049243450164795e-01
8.329324126243591309e-01
9.998036026954650879e-01
2.447694838047027588e-01
7.800682783126831055e-01
1.832709908485412598e-01
2.537995576858520508e-01
9.323732852935791016e-01
9.914833307266235352e-01
3.837465941905975342e-01
2.018399834632873535e-01
1.927343308925628662e-01
9.998589754104614258e-01
8.180835843086242676e-01
2.993966341018676758e-01
2.805702686309814453e-01
1.000000000000000000e+00
2.375879287719726562e-01
9.999990463256835938e-01
2.782429456710815430e-01
2.756480574607849121e-01
1.800564229488372803e-01
9.963549375534057617e-01
1.980115473270416260e-01
9.987154006958007812e-01
1.932591795921325684e-01
9.901506900787353516e-01
2.883831858634948730e-01
2.719359397888183594e-01
2.219014167785644531e-01
1.885675787925720215e-01
1.817278265953063965e-01
7.611908912658691406e-01
3.936627805233001709e-01
6.954919099807739258e-01
9.999783039093017578e-01
2.915227413177490234e-01
6.404029726982116699e-01
1.982985138893127441e-01
2.736996412277221680e-01
2.130597829818725586e-01
9.978235960006713867e-01
9.986793398857116699e-01
2.335301935672760010e-01
3.392222821712493896e-01
8.622465729713439941e-01
1.796886026859283447e-01
2.234234511852264404e-01
3.354100584983825684e-01
2.318532764911651611e-01
2.938582301139831543e-01
2.323903143405914307e-01
1.991732418537139893e-01
2.079913616180419922e-01
1.883745193481445312e-01
1.858797967433929443e-01
1.833241879940032959e-01
4.299362897872924805e-01
1.916888654232025146e-01
2.640275955200195312e-01
2.651030123233795166e-01
5.757800340652465820e-01
2.106797099113464355e-01
2.243078351020812988e-01
2.231521904468536377e-01
9.995228052139282227e-01
2.342336773872375488e-01
9.999974370002746582e-01
1.980822384357452393e-01
5.259332060813903809e-01
1.803326308727264404e-01
2.925670742988586426e-01
3.832886815071105957e-01
7.139575481414794922e-01
9.999678134918212891e-01
4.623267650604248047e-01
1.000000000000000000e+00
2.007645368576049805e-01
9.999888539314270020e-01
1.840647757053375244e-01
1.971895992755889893e-01
2.005006074905395508e-01
9.999552965164184570e-01
1.935831904411315918e-01
1.856050491333007812e-01
1.850391328334808350e-01
5.661121606826782227e-01
2.342709600925445557e-01
2.191231548786163330e-01
5.707725882530212402e-01
3.389320969581604004e-01
2.393728494644165039e-01
1.816692352294921875e-01
2.531373500823974609e-01
1.813168227672576904e-01
2.237462401390075684e-01
2.481725215911865234e-01
1.795846819877624512e-01
2.003837227821350098e-01
1.891265809535980225e-01
3.213991522789001465e-01
1.880717873573303223e-01
4.726113080978393555e-01
2.005590796470642090e-01
2.334893643856048584e-01
9.999641776084899902e-01
2.731411755084991455e-01
2.149257957935333252e-01
4.278488159179687500e-01
4.435296356678009033e-01
1.804216206073760986e-01
3.616122007369995117e-01
1.922879517078399658e-01
3.848373889923095703e-01
1.980561017990112305e-01
3.019049465656280518e-01
2.082960903644561768e-01
1.973217725753784180e-01
6.723362207412719727e-01
9.951346516609191895e-01
7.077459692955017090e-01
1.801652014255523682e-01
2.373977899551391602e-01
2.372931241989135742e-01
5.172064900398254395e-01
4.130091071128845215e-01
7.257222533226013184e-01
2.018545866012573242e-01
1.947179138660430908e-01
2.129331231117248535e-01
2.113845944404602051e-01
2.295776605606079102e-01
2.146814763545989990e-01
2.687362432479858398e-01
2.312471270561218262e-01
1.000000000000000000e+00
3.016762733459472656e-01
2.034572660923004150e-01
9.999998211860656738e-01
5.270665287971496582e-01
4.408902525901794434e-01
2.154496014118194580e-01
8.163784742355346680e-01
1.858104467391967773e-01
1.791917979717254639e-01
9.438897371292114258e-01
1.893932819366455078e-01
1.979961991310119629e-01
2.463209629058837891e-01
2.193458378314971924e-01
3.188427686691284180e-01
1.982490718364715576e-01
2.391655445098876953e-01
1.970176994800567627e-01
2.337980568408966064e-01
9.533908367156982422e-01
2.060030400753021240e-01
2.077798247337341309e-01
9.609133005142211914e-01
2.337218225002288818e-01
1.795631051063537598e-01
8.487459421157836914e-01
8.867439627647399902e-01
8.478212356567382812e-01
1.867483556270599365e-01
2.029990255832672119e-01
8.811767101287841797e-01
1.955316066741943359e-01
9.337635040283203125e-01
1.000000000000000000e+00
9.999866485595703125e-01
1.806609332561492920e-01
9.945850968360900879e-01
1.892275214195251465e-01
1.000000000000000000e+00
9.920402765274047852e-01
2.074791193008422852e-01
2.029430568218231201e-01
2.874805331230163574e-01
3.313996195793151855e-01
1.782345175743103027e-01
1.000000000000000000e+00
2.060894966125488281e-01
1.905698776245117188e-01
3.084558844566345215e-01
1.812808215618133545e-01
2.355999946594238281e-01
2.978391647338867188e-01
2.041337192058563232e-01
2.978963553905487061e-01
2.161955535411834717e-01
4.153363704681396484e-01
1.918083429336547852e-01
2.981368601322174072e-01
2.005904018878936768e-01
2.953816354274749756e-01
8.679454922676086426e-01
2.794132828712463379e-01
9.999899864196777344e-01
1.875709295272827148e-01
1.948810815811157227e-01
2.025025784969329834e-01
3.402050137519836426e-01
1.825969815254211426e-01
9.999915361404418945e-01
1.866122782230377197e-01
2.807643413543701172e-01
9.992700815200805664e-01
1.871365606784820557e-01
2.227178812026977539e-01
3.243790864944458008e-01
3.979657888412475586e-01
5.415564775466918945e-01
9.999996423721313477e-01
2.072511017322540283e-01
2.350447773933410645e-01
1.917248666286468506e-01
2.441906630992889404e-01
9.994838237762451172e-01
2.028506398200988770e-01
4.861028194427490234e-01
4.272321462631225586e-01
1.803478598594665527e-01
2.715302407741546631e-01
1.984404623508453369e-01
1.936790049076080322e-01
1.846409142017364502e-01
2.039548456668853760e-01
1.882121562957763672e-01
9.999983906745910645e-01
1.790364682674407959e-01
1.780299544334411621e-01
9.290965795516967773e-01
2.514991760253906250e-01
9.631654024124145508e-01
9.596744775772094727e-01
9.992765188217163086e-01
2.840667068958282471e-01
2.358622252941131592e-01
2.714167237281799316e-01
2.103210091590881348e-01
5.126017332077026367e-01
5.558125972747802734e-01
8.347683548927307129e-01
8.732609748840332031e-01
9.994465112686157227e-01
1.947043240070343018e-01
2.263010740280151367e-01
2.252497971057891846e-01
1.948349177837371826e-01
8.069280385971069336e-01
9.999837875366210938e-01
1.889805495738983154e-01
3.684091866016387939e-01
3.244758248329162598e-01
9.999803304672241211e-01
2.772178649902343750e-01
1.885806322097778320e-01
2.842747271060943604e-01
2.874146103858947754e-01
2.767874598503112793e-01
9.999997615814208984e-01
9.998523592948913574e-01
9.305747747421264648e-01
9.991024136543273926e-01
3.623067140579223633e-01
9.950198531150817871e-01
2.400892376899719238e-01
3.349055051803588867e-01
1.838197708129882812e-01
1.788216233253479004e-01
3.014226555824279785e-01
2.391342520713806152e-01
1.809635758399963379e-01
3.799930512905120850e-01
2.310186028480529785e-01
2.070161402225494385e-01
9.691554903984069824e-01
8.167794942855834961e-01
2.208287715911865234e-01
5.112571120262145996e-01
1.797258555889129639e-01
4.223575294017791748e-01
8.611179590225219727e-01
8.486089706420898438e-01
2.150712311267852783e-01
9.523597359657287598e-01
3.082551360130310059e-01
8.125979900360107422e-01
2.224790155887603760e-01
9.999382495880126953e-01
9.977130293846130371e-01
3.075919449329376221e-01
3.203021883964538574e-01
5.743234157562255859e-01
9.999375343322753906e-01
2.430274784564971924e-01
1.000000000000000000e+00
1.825674772262573242e-01
2.338091731071472168e-01
1.785780489444732666e-01
3.885792791843414307e-01
1.000000000000000000e+00
1.860262155532836914e-01
2.949828505516052246e-01
1.909347176551818848e-01
2.685938477516174316e-01
9.999650120735168457e-01
9.999186396598815918e-01
3.566420078277587891e-01
4.770082235336303711e-01
1.000000000000000000e+00
9.997248649597167969e-01
3.574149608612060547e-01
2.261287569999694824e-01
1.906047463417053223e-01
1.820294559001922607e-01
1.000000000000000000e+00
9.999825358390808105e-01
9.135315418243408203e-01
2.734261751174926758e-01
9.235376119613647461e-01
1.000000000000000000e+00
9.917458295822143555e-01
8.069846034049987793e-01
1.871487498283386230e-01
3.955271542072296143e-01
9.658719897270202637e-01
7.092573046684265137e-01
1.870814263820648193e-01
2.037239968776702881e-01
9.559028148651123047e-01
1.000000000000000000e+00
1.895355284214019775e-01
5.877670049667358398e-01
9.999989867210388184e-01
3.514295816421508789e-01
3.433504104614257812e-01
1.962353587150573730e-01
1.794653236865997314e-01
2.305745482444763184e-01
1.840427517890930176e-01
6.555322408676147461e-01
9.998047351837158203e-01
3.307495713233947754e-01
3.719678223133087158e-01
2.166274487972259521e-01
2.909495830535888672e-01
2.896338105201721191e-01
2.514346837997436523e-01
3.642125129699707031e-01
2.441345751285552979e-01
5.701059699058532715e-01
2.414105236530303955e-01
1.779348552227020264e-01
2.052869498729705811e-01
9.994188547134399414e-01
2.527994215488433838e-01
2.527697980403900146e-01
8.217273354530334473e-01
2.653428614139556885e-01
2.224337160587310791e-01
9.860602617263793945e-01
2.080264389514923096e-01
9.667638540267944336e-01
1.000000000000000000e+00
9.831259846687316895e-01
1.894256770610809326e-01
2.039682567119598389e-01
1.863253116607666016e-01
6.238932609558105469e-01
9.196207523345947266e-01
9.923334121704101562e-01
1.951694190502166748e-01
1.817149221897125244e-01
9.514148831367492676e-01
4.538338184356689453e-01
6.816053390502929688e-01
2.497143745422363281e-01
9.986791610717773438e-01
2.263469994068145752e-01
7.211287617683410645e-01
9.997919797897338867e-01
3.911805152893066406e-01
9.999989271163940430e-01
1.857370436191558838e-01
3.021838068962097168e-01
2.014898955821990967e-01
8.777835965156555176e-01
2.340551912784576416e-01
2.010272443294525146e-01
5.429958701133728027e-01
2.818735241889953613e-01
2.263667285442352295e-01
2.056449353694915771e-01
4.860897660255432129e-01
2.074240744113922119e-01
1.978998482227325439e-01
2.126619815826416016e-01
3.147432208061218262e-01
4.830919504165649414e-01
3.700990378856658936e-01
1.865340769290924072e-01
3.334844708442687988e-01
5.384252667427062988e-01
9.224399328231811523e-01
9.388957023620605469e-01
9.999698400497436523e-01
2.638961374759674072e-01
6.918748021125793457e-01
2.445177733898162842e-01
5.432347655296325684e-01
3.655196428298950195e-01
9.987590312957763672e-01
1.946291923522949219e-01
3.584028184413909912e-01
4.479713737964630127e-01
2.020110487937927246e-01
1.000000000000000000e+00
2.596970200538635254e-01
3.433500230312347412e-01
6.034038066864013672e-01
8.538413643836975098e-01
9.996297359466552734e-01
3.430599570274353027e-01
1.901308894157409668e-01
3.216034173965454102e-01
1.909916996955871582e-01
2.581839859485626221e-01
5.926833152770996094e-01
4.900355041027069092e-01
3.743423819541931152e-01
5.475001931190490723e-01
1.000000000000000000e+00
9.997141361236572266e-01
2.197586894035339355e-01
2.078705728054046631e-01
8.958996534347534180e-01
9.652477502822875977e-01
1.877246201038360596e-01
9.999996423721313477e-01
1.899113357067108154e-01
2.771965861320495605e-01
9.999858140945434570e-01
2.282177507877349854e-01
6.408661007881164551e-01
9.999961853027343750e-01
1.000000000000000000e+00
3.451961278915405273e-01
2.242328822612762451e-01
9.089318513870239258e-01
1.901941895484924316e-01
2.023255825042724609e-01
1.000000000000000000e+00
2.214218080043792725e-01
9.821657538414001465e-01
8.623759746551513672e-01
1.000000000000000000e+00
2.446666061878204346e-01
1.000000000000000000e+00
1.880114376544952393e-01
1.944876015186309814e-01
9.919741749763488770e-01
9.999333620071411133e-01
2.982803583145141602e-01
2.406174838542938232e-01
2.374000251293182373e-01
2.680120766162872314e-01
4.630991220474243164e-01
9.998660683631896973e-01
1.784260272979736328e-01
1.845600306987762451e-01
9.948624968528747559e-01
2.677714526653289795e-01
9.942775964736938477e-01
9.895440340042114258e-01
2.704337239265441895e-01
8.729529380798339844e-01
3.538827300071716309e-01
9.999321699142456055e-01
3.385503888130187988e-01
8.238252997398376465e-01
5.479711294174194336e-01
1.928427219390869141e-01
9.774334430694580078e-01
1.836377382278442383e-01
4.419615864753723145e-01
1.975781917572021484e-01
1.781991422176361084e-01
2.485688328742980957e-01
1.945998370647430420e-01
4.012786149978637695e-01
9.929925203323364258e-01
2.795546054840087891e-01
7.881477475166320801e-01
1.825897991657257080e-01
1.784258782863616943e-01
2.284196019172668457e-01
9.999902248382568359e-01
8.192024827003479004e-01
1.882994771003723145e-01
2.002140879631042480e-01
1.933844685554504395e-01
4.528447687625885010e-01
9.999797344207763672e-01
9.972493052482604980e-01
9.996876716613769531e-01
8.318176269531250000e-01
5.492473840713500977e-01
9.866175651550292969e-01
1.000000000000000000e+00
2.775766849517822266e-01
2.175441384315490723e-01
9.477291107177734375e-01
2.410730421543121338e-01
1.000000000000000000e+00
2.362736463546752930e-01
1.000000000000000000e+00
2.175548970699310303e-01
9.999835491180419922e-01
2.023673951625823975e-01
1.831750571727752686e-01
2.193680107593536377e-01
1.000000000000000000e+00
1.000000000000000000e+00
9.624997973442077637e-01
9.999953508377075195e-01
9.867712259292602539e-01
6.014263629913330078e-01
2.034707367420196533e-01
9.857261180877685547e-01
1.000000000000000000e+00
1.900713741779327393e-01
3.332619369029998779e-01
4.302126169204711914e-01
1.000000000000000000e+00
4.957436025142669678e-01
2.142402827739715576e-01
2.399680912494659424e-01
9.953393936157226562e-01
2.647879123687744141e-01
2.592357397079467773e-01
4.695442318916320801e-01
2.028915286064147949e-01
2.586988508701324463e-01
1.870597898960113525e-01
9.998880028724670410e-01
9.764338135719299316e-01
1.835319399833679199e-01
2.678930163383483887e-01
1.000000000000000000e+00
2.784249782562255859e-01
9.999979734420776367e-01
1.000000000000000000e+00
2.380755245685577393e-01
2.106781601905822754e-01
1.944507360458374023e-01
3.253167867660522461e-01
2.002775967121124268e-01
1.891518235206604004e-01
3.589457869529724121e-01
9.215366840362548828e-01
9.866622686386108398e-01
2.185545265674591064e-01
3.263086378574371338e-01
2.317242622375488281e-01
2.149202227592468262e-01
2.334495484828948975e-01
1.831837296485900879e-01
2.009168565273284912e-01
4.564322233200073242e-01
1.797047257423400879e-01
1.853708922863006592e-01
3.327794671058654785e-01
5.463416576385498047e-01
9.999972581863403320e-01
9.280002117156982422e-01
1.810180246829986572e-01
1.993517279624938965e-01
1.916996836662292480e-01
2.461172342300415039e-01
9.889515638351440430e-01
1.934626400470733643e-01
1.809324622154235840e-01
2.695904970169067383e-01
1.968313455581665039e-01
2.059030532836914062e-01
6.786152720451354980e-01
4.547639191150665283e-01
1.789448857307434082e-01
1.869688034057617188e-01
3.593484163284301758e-01
1.814394295215606689e-01
2.159432768821716309e-01
4.337215721607208252e-01
3.171714544296264648e-01
1.964315772056579590e-01
6.131104826927185059e-01
9.829739332199096680e-01
3.815322220325469971e-01
1.862167119979858398e-01
9.691843986511230469e-01
9.796485900878906250e-01
4.897038042545318604e-01
1.779202222824096680e-01
2.105364203453063965e-01
9.820426106452941895e-01
9.927281141281127930e-01
3.299981951713562012e-01
3.521893024444580078e-01
2.384508550167083740e-01
9.892484545707702637e-01
2.363016605377197266e-01
2.834480404853820801e-01
3.564111292362213135e-01
6.342796087265014648e-01
2.318906188011169434e-01
1.923489570617675781e-01
4.141952097415924072e-01
2.382942140102386475e-01
1.876412928104400635e-01
2.518381774425506592e-01
2.325268387794494629e-01
2.379136383533477783e-01
2.332403957843780518e-01
6.622833013534545898e-01
5.052974820137023926e-01
9.994597434997558594e-01
2.179827690124511719e-01
3.711116313934326172e-01
2.090235054492950439e-01
1.881807446479797363e-01
4.576590657234191895e-01
2.091379463672637939e-01
2.149575352668762207e-01
2.328847348690032959e-01
1.863853335380554199e-01
2.240729331970214844e-01
9.998317956924438477e-01
3.109866976737976074e-01
2.556520402431488037e-01
2.534153163433074951e-01
3.464282155036926270e-01
2.560962438583374023e-01
4.089511930942535400e-01
1.816914975643157959e-01
3.869437575340270996e-01
2.143476903438568115e-01
4.658727347850799561e-01
5.935505628585815430e-01
2.597280740737915039e-01
1.881259977817535400e-01
5.643083453178405762e-01
2.400969266891479492e-01
3.598265945911407471e-01
3.956231772899627686e-01
4.352923035621643066e-01
2.346493601799011230e-01
3.210056424140930176e-01
2.503131330013275146e-01
9.998365044593811035e-01
1.994332671165466309e-01
4.235414564609527588e-01
3.255329132080078125e-01
2.465624511241912842e-01
2.813385725021362305e-01
5.527827143669128418e-01
6.118471622467041016e-01
2.199757695198059082e-01
4.564114511013031006e-01
2.062977552413940430e-01
2.211789190769195557e-01
1.880531311035156250e-01
2.234311103820800781e-01
8.518919348716735840e-01
6.836555004119873047e-01
2.348962724208831787e-01
3.063136339187622070e-01
2.334049344062805176e-01
1.845547854900360107e-01
2.746883630752563477e-01
2.350176572799682617e-01
2.324625849723815918e-01
1.895970404148101807e-01
1.884917020797729492e-01
1.963554620742797852e-01
1.844117939472198486e-01
3.988190889358520508e-01
2.339628338813781738e-01
1.856416761875152588e-01
1.780378520488739014e-01
4.019511938095092773e-01
2.202090024948120117e-01
4.993280172348022461e-01
2.321632802486419678e-01
1.804519593715667725e-01
2.696199417114257812e-01
2.156034111976623535e-01
1.862570345401763916e-01
3.860296905040740967e-01
1.817756295204162598e-01
8.441240787506103516e-01
1.992361545562744141e-01
2.156901955604553223e-01
3.360913097858428955e-01
5.562402009963989258e-01
4.025264680385589600e-01
2.075016200542449951e-01
1.941760480403900146e-01
4.893855154514312744e-01
2.117223441600799561e-01
3.439511656761169434e-01
2.149613797664642334e-01
1.831119656562805176e-01
2.056075930595397949e-01
3.901895284652709961e-01
1.819874942302703857e-01
5.042778849601745605e-01
1.936969757080078125e-01
2.492283582687377930e-01
3.047735691070556641e-01
2.027845680713653564e-01
1.851716637611389160e-01
7.543071508407592773e-01
1.930051147937774658e-01
1.839836537837982178e-01
1.960419714450836182e-01
5.596776604652404785e-01
1.831897497177124023e-01
2.175716459751129150e-01
3.903246521949768066e-01
2.760538756847381592e-01
1.943736970424652100e-01
1.834239363670349121e-01
2.740251421928405762e-01
2.054490745067596436e-01
2.792983949184417725e-01
2.245927453041076660e-01
2.978059351444244385e-01
1.942694187164306641e-01
1.820684671401977539e-01
1.827786266803741455e-01
3.734207153320312500e-01
3.048943281173706055e-01
1.840715110301971436e-01
1.792027056217193604e-01
2.277874350547790527e-01
5.539919734001159668e-01
9.564779996871948242e-01
2.216899096965789795e-01
2.220924794673919678e-01
2.387262284755706787e-01
2.566445171833038330e-01
4.125138521194458008e-01
2.058812379837036133e-01
2.011638581752777100e-01
5.404689908027648926e-01
6.390920281410217285e-01
8.992857933044433594e-01
7.021993398666381836e-01
4.037265181541442871e-01
2.309690117835998535e-01
4.790729284286499023e-01
1.852058172225952148e-01
1.886293888092041016e-01
1.958740651607513428e-01
2.618547677993774414e-01
4.669995605945587158e-01
2.130927145481109619e-01
1.976958513259887695e-01
2.941601872444152832e-01
4.967724680900573730e-01
2.369337081909179688e-01
3.362343311309814453e-01
2.119795083999633789e-01
2.223419845104217529e-01
1.885267794132232666e-01
2.427729070186614990e-01
1.997252106666564941e-01
4.241429269313812256e-01
2.022688388824462891e-01
1.945791244506835938e-01
1.959859728813171387e-01
2.380881905555725098e-01
2.340561747550964355e-01
6.568255424499511719e-01
2.135320305824279785e-01
1.861456632614135742e-01
7.545931339263916016e-01
5.586981773376464844e-01
1.800570785999298096e-01
2.175761163234710693e-01
2.039603590965270996e-01
3.100728690624237061e-01
1.944378614425659180e-01
2.007594406604766846e-01
2.118020057678222656e-01
3.254871368408203125e-01
1.970375180244445801e-01
1.869969069957733154e-01
2.092785537242889404e-01
3.618583083152770996e-01
2.534422576427459717e-01
5.827859044075012207e-01
2.039763927459716797e-01
3.491482436656951904e-01
2.458991110324859619e-01
5.209400057792663574e-01
3.906346559524536133e-01
1.808108985424041748e-01
1.904753148555755615e-01
1.914457380771636963e-01
6.940612196922302246e-01
3.591240942478179932e-01
2.475718557834625244e-01
4.403433799743652344e-01
1.890725791454315186e-01
3.817789554595947266e-01
1.871673762798309326e-01
1.848138272762298584e-01
2.019819021224975586e-01
2.195115685462951660e-01
2.177487611770629883e-01
9.990901947021484375e-01
3.563187122344970703e-01
4.753721654415130615e-01
4.139988720417022705e-01
1.834152042865753174e-01
2.031569480895996094e-01
2.925206422805786133e-01
2.257249951362609863e-01
1.832828819751739502e-01
1.952384412288665771e-01
3.136525750160217285e-01
1.908178627490997314e-01
2.139546275138854980e-01
2.105888128280639648e-01
1.834743022918701172e-01
2.773206233978271484e-01
2.314009666442871094e-01
2.638946473598480225e-01
3.206204175949096680e-01
2.996669411659240723e-01
8.974524140357971191e-01
2.052060365676879883e-01
1.795044839382171631e-01
2.165953516960144043e-01
2.060309648513793945e-01
2.038248181343078613e-01
2.366910874843597412e-01
2.215837240219116211e-01
1.963884234428405762e-01
1.781629323959350586e-01
2.000277340412139893e-01
1.807056367397308350e-01
1.788252890110015869e-01
1.886895000934600830e-01
2.132717669010162354e-01
7.584258913993835449e-01
2.076836228370666504e-01
1.940499246120452881e-01
1.890037655830383301e-01
2.562220394611358643e-01
2.173416912555694580e-01
2.655061483383178711e-01
2.413163185119628906e-01
8.791452646255493164e-01
1.916126906871795654e-01
7.541983723640441895e-01
2.235634326934814453e-01
1.918460428714752197e-01
6.481927037239074707e-01
3.019425272941589355e-01
7.652795314788818359e-01
3.941870331764221191e-01
5.391033887863159180e-01
2.848746180534362793e-01
1.855988204479217529e-01
1.782657802104949951e-01
1.870762109756469727e-01
1.826346218585968018e-01
2.438453435897827148e-01
5.355687141418457031e-01
2.028748393058776855e-01
1.854774355888366699e-01
2.039303481578826904e-01
2.113498747348785400e-01
1.883628666400909424e-01
2.275690436363220215e-01
2.025030851364135742e-01
3.716444671154022217e-01
1.940237879753112793e-01
4.925153255462646484e-01
1.834194660186767578e-01
3.451088070869445801e-01
1.880384087562561035e-01
1.829447448253631592e-01
2.999764680862426758e-01
1.859901249408721924e-01
2.621037364006042480e-01
2.074037492275238037e-01
1.904356479644775391e-01
1.911153793334960938e-01
1.843879222869873047e-01
7.410171031951904297e-01
2.055675685405731201e-01
3.603838086128234863e-01
2.247731089591979980e-01
2.061302363872528076e-01
5.242127776145935059e-01
2.742319107055664062e-01
2.062336802482604980e-01
1.886540055274963379e-01
9.448079466819763184e-01
6.056017875671386719e-01
1.978741288185119629e-01
1.943245232105255127e-01
2.287686467170715332e-01
3.642250299453735352e-01
1.801823973655700684e-01
2.055601775646209717e-01
2.305574715137481689e-01
2.343276143074035645e-01
1.915636062622070312e-01
1.950568258762359619e-01
1.963560581207275391e-01
3.146768212318420410e-01
1.835955083370208740e-01
2.135303914546966553e-01
5.101846456527709961e-01
3.172978758811950684e-01
2.708672285079956055e-01
2.360583245754241943e-01
2.037688195705413818e-01
3.149005770683288574e-01
1.861140131950378418e-01
5.835969448089599609e-01
4.336652755737304688e-01
2.068510055541992188e-01
1.907789111137390137e-01
3.088080286979675293e-01
2.874180078506469727e-01
1.919123828411102295e-01
2.302879095077514648e-01
1.979559063911437988e-01
1.985080838203430176e-01
6.500006318092346191e-01
1.935474276542663574e-01
4.907024204730987549e-01
2.832350134849548340e-01
1.989025473594665527e-01
1.858488619327545166e-01
7.406840324401855469e-01
1.918773651123046875e-01
1.980361342430114746e-01
2.409815192222595215e-01
2.702728509902954102e-01
1.904411613941192627e-01
2.619935274124145508e-01
1.846714019775390625e-01
1.814766824245452881e-01
2.208628058433532715e-01
2.077020406723022461e-01
3.712624311447143555e-01
1.861954331398010254e-01
2.145493328571319580e-01
4.430983364582061768e-01
2.230018377304077148e-01
1.947723627090454102e-01
2.914815545082092285e-01
4.537972211837768555e-01
1.880221962928771973e-01
1.972657442092895508e-01
2.353792190551757812e-01
5.291308760643005371e-01
2.022501230239868164e-01
1.942541003227233887e-01
3.356937170028686523e-01
1.782162785530090332e-01
2.238685786724090576e-01
3.408280611038208008e-01
1.781915426254272461e-01
2.005635797977447510e-01
4.223907589912414551e-01
2.163635492324829102e-01
2.143840491771697998e-01
2.392686605453491211e-01
4.001933932304382324e-01
8.157171010971069336e-01
8.244807720184326172e-01
1.924859583377838135e-01
2.115025818347930908e-01
3.579186201095581055e-01
1.846301257610321045e-01
1.959484219551086426e-01
2.370549738407135010e-01
6.333630084991455078e-01
2.144117951393127441e-01
1.870616078376770020e-01
3.259864449501037598e-01
2.823134362697601318e-01
2.540083527565002441e-01
2.154782414436340332e-01
6.240478157997131348e-01
9.949308633804321289e-01
2.155987620353698730e-01
2.055524587631225586e-01
4.105787277221679688e-01
2.465505897998809814e-01
1.883840262889862061e-01
2.064397633075714111e-01
6.131964921951293945e-01
2.842812538146972656e-01
1.984925866127014160e-01
7.121196985244750977e-01
9.994434714317321777e-01
4.117244780063629150e-01
3.710057139396667480e-01
2.041194438934326172e-01
2.719363570213317871e-01
8.086540102958679199e-01
2.160079479217529297e-01
6.643796563148498535e-01
1.836292445659637451e-01
2.072726786136627197e-01
2.012280821800231934e-01
1.845609545707702637e-01
5.585045814514160156e-01
2.204486131668090820e-01
2.710282206535339355e-01
2.027880847454071045e-01
1.896584331989288330e-01
1.837414205074310303e-01
7.229015827178955078e-01
2.035735249519348145e-01
2.846651077270507812e-01
3.098892569541931152e-01
4.279863834381103516e-01
1.908080279827117920e-01
1.897383928298950195e-01
3.938935995101928711e-01
9.885297417640686035e-01
8.328312635421752930e-01
1.817823648452758789e-01
3.799920976161956787e-01
3.033710122108459473e-01
3.568571507930755615e-01
5.709592700004577637e-01
2.298056781291961670e-01
6.419994235038757324e-01
3.040691912174224854e-01
2.945013344287872314e-01
2.052046656608581543e-01
8.429071903228759766e-01
2.095126807689666748e-01
2.933310568332672119e-01
4.859330654144287109e-01
3.549180030822753906e-01
3.325588703155517578e-01
2.618510723114013672e-01
8.376645445823669434e-01
2.300002574920654297e-01
1.868461668491363525e-01
2.281836867332458496e-01
2.213876247406005859e-01
2.070927321910858154e-01
2.777283787727355957e-01
2.239365875720977783e-01
2.411555945873260498e-01
2.103139758110046387e-01
1.806157529354095459e-01
1.834585666656494141e-01
1.900086402893066406e-01
2.597473561763763428e-01
2.497709691524505615e-01
9.469953775405883789e-01
2.052034437656402588e-01
4.749813377857208252e-01
1.991263926029205322e-01
1.917108893394470215e-01
1.799986064434051514e-01
2.354447245597839355e-01
1.865579783916473389e-01
3.963586688041687012e-01
1.929129064083099365e-01
1.881952285766601562e-01
2.241771221160888672e-01
1.843782961368560791e-01
5.226649045944213867e-01
1.816330850124359131e-01
5.048449635505676270e-01
5.922176241874694824e-01
2.078448235988616943e-01
2.474704682826995850e-01
1.929237842559814453e-01
2.121756970882415771e-01
1.802315413951873779e-01
2.084376215934753418e-01
3.128463327884674072e-01
2.307685613632202148e-01
2.302819788455963135e-01
1.957136392593383789e-01
3.969879150390625000e-01
4.088958501815795898e-01
1.814427375793457031e-01
8.336883783340454102e-01
3.130263090133666992e-01
1.984753906726837158e-01
8.531422019004821777e-01
2.076550722122192383e-01
2.228507995605468750e-01
2.601321935653686523e-01
5.163528323173522949e-01
1.867563426494598389e-01
1.881796717643737793e-01
8.086290359497070312e-01
1.846314966678619385e-01
4.033556580543518066e-01
2.134204506874084473e-01
1.835667788982391357e-01
2.714099287986755371e-01
1.800084114074707031e-01
8.222757577896118164e-01
3.713526129722595215e-01
1.962878704071044922e-01
1.964010000228881836e-01
2.134785354137420654e-01
2.776138782501220703e-01
3.019755482673645020e-01
2.105187475681304932e-01
1.851348876953125000e-01
2.301920056343078613e-01
3.114336133003234863e-01
2.119975686073303223e-01
2.641310691833496094e-01
2.291480600833892822e-01
1.860395669937133789e-01
2.324641048908233643e-01
9.448003768920898438e-01
1.913746595382690430e-01
3.404892086982727051e-01
2.450999617576599121e-01
2.075460851192474365e-01
4.965538382530212402e-01
1.848701536655426025e-01
3.213492035865783691e-01
8.274354338645935059e-01
3.593624830245971680e-01
3.765243887901306152e-01
2.502969503402709961e-01
4.007565975189208984e-01
7.030935883522033691e-01
4.434437155723571777e-01
2.184646725654602051e-01
2.303700745105743408e-01
2.307709157466888428e-01
2.920550704002380371e-01
2.339054048061370850e-01
1.874242424964904785e-01
5.733403563499450684e-01
5.050857067108154297e-01
2.057942450046539307e-01
1.832562088966369629e-01
1.976090669631958008e-01
4.317125678062438965e-01
6.446089744567871094e-01
8.165534734725952148e-01
3.933278322219848633e-01
2.117213308811187744e-01
7.132642269134521484e-01
8.152164220809936523e-01
3.643302619457244873e-01
8.493248820304870605e-01
2.680473923683166504e-01
5.740041732788085938e-01
1.783325672149658203e-01
8.416843414306640625e-01
1.779059171676635742e-01
1.803685128688812256e-01
9.706560969352722168e-01
3.652034401893615723e-01
2.092545330524444580e-01
1.963118314743041992e-01
2.636708021163940430e-01
2.991616725921630859e-01
2.000400722026824951e-01
2.573497891426086426e-01
1.834263503551483154e-01
9.999866485595703125e-01
2.711793780326843262e-01
9.121129512786865234e-01
1.810619235038757324e-01
4.626877605915069580e-01
1.902984082698822021e-01
1.783358454704284668e-01
2.218559682369232178e-01
5.608162879943847656e-01
5.205956101417541504e-01
3.227541446685791016e-01
2.833428680896759033e-01
6.494752168655395508e-01
5.176677703857421875e-01
1.810117363929748535e-01
1.911535561084747314e-01
9.530262947082519531e-01
9.441568851470947266e-01
3.623443245887756348e-01
9.766526222229003906e-01
1.899848878383636475e-01
2.217704653739929199e-01
1.861924827098846436e-01
2.850866317749023438e-01
1.871504187583923340e-01
1.895732283592224121e-01
7.300318479537963867e-01
3.942716717720031738e-01
2.051620781421661377e-01
1.943363249301910400e-01
2.307384312152862549e-01
1.794372498989105225e-01
2.740935087203979492e-01
2.112698554992675781e-01
3.324180245399475098e-01
1.983283758163452148e-01
5.545950531959533691e-01
3.467118144035339355e-01
4.474438428878784180e-01
1.869279444217681885e-01
2.827371954917907715e-01
2.015154361724853516e-01
2.115902006626129150e-01
3.607913851737976074e-01
3.507615923881530762e-01
2.007514834403991699e-01
8.584559559822082520e-01
7.169106006622314453e-01
1.876018047332763672e-01
7.317014932632446289e-01
4.415311217308044434e-01
2.990741431713104248e-01
3.946782052516937256e-01
1.863939166069030762e-01
5.216304659843444824e-01
1.977876424789428711e-01
4.417108595371246338e-01
9.780610203742980957e-01
2.088766396045684814e-01
1.827706694602966309e-01
4.235032796859741211e-01
2.071801424026489258e-01
1.831082105636596680e-01
5.754880905151367188e-01
2.634893655776977539e-01
9.250072836875915527e-01
3.802684247493743896e-01
2.543728053569793701e-01
1.866382062435150146e-01
1.964924037456512451e-01
1.957426965236663818e-01
1.798282265663146973e-01
9.914844632148742676e-01
2.237991988658905029e-01
2.137969732284545898e-01
4.273771047592163086e-01
4.459654986858367920e-01
2.368845343589782715e-01
2.411589920520782471e-01
2.352646589279174805e-01
6.266144514083862305e-01
2.406693696975708008e-01
5.367349386215209961e-01
1.903738081455230713e-01
3.418628275394439697e-01
2.649321556091308594e-01
2.776545882225036621e-01
7.696521282196044922e-01
1.851645112037658691e-01
2.169173657894134521e-01
2.556922435760498047e-01
1.837431788444519043e-01
2.007109820842742920e-01
2.102895081043243408e-01
4.162751734256744385e-01
5.771599411964416504e-01
7.118731737136840820e-01
5.525563359260559082e-01
4.101522862911224365e-01
2.226051688194274902e-01
1.897237002849578857e-01
3.207888603210449219e-01
2.643496990203857422e-01
2.304331958293914795e-01
2.338991165161132812e-01
4.570450186729431152e-01
9.995480775833129883e-01
7.522604465484619141e-01
1.805819869041442871e-01
9.038849472999572754e-01
2.214856743812561035e-01
2.176075279712677002e-01
3.291324377059936523e-01
2.071595788002014160e-01
3.166402578353881836e-01
2.317612469196319580e-01
1.981557607650756836e-01
2.164303660392761230e-01
4.831386208534240723e-01
1.806371808052062988e-01
3.425203561782836914e-01
1.969713270664215088e-01
1.785882413387298584e-01
2.025796473026275635e-01
2.149853706359863281e-01
5.728105902671813965e-01
5.037017464637756348e-01
2.051408290863037109e-01
1.787683069705963135e-01
2.382247149944305420e-01
3.028861284255981445e-01
2.318617701530456543e-01
1.797762811183929443e-01
2.000198066234588623e-01
5.894637703895568848e-01
3.604342043399810791e-01
1.801358759403228760e-01
1.911228597164154053e-01
2.240390479564666748e-01
2.222108244895935059e-01
2.598130106925964355e-01
2.027610242366790771e-01
2.755848169326782227e-01
1.918199956417083740e-01
8.087613582611083984e-01
2.505802512168884277e-01
4.908271431922912598e-01
2.794059216976165771e-01
2.031481266021728516e-01
2.110730409622192383e-01
4.282969832420349121e-01
2.485140264034271240e-01
2.122446000576019287e-01
2.995091080665588379e-01
8.577396869659423828e-01
2.025101780891418457e-01
3.011480867862701416e-01
2.325240969657897949e-01
8.615266084671020508e-01
2.284555137157440186e-01
2.042108476161956787e-01
2.853044569492340088e-01
3.315324783325195312e-01
1.843354701995849609e-01
2.888737320899963379e-01
2.439460754394531250e-01
2.409799098968505859e-01
2.107720077037811279e-01
1.981910467147827148e-01
1.916777193546295166e-01
5.631223320960998535e-01
2.418370246887207031e-01
1.826131343841552734e-01
1.843980550765991211e-01
2.979801893234252930e-01
2.314338684082031250e-01
1.988630592823028564e-01
5.970952510833740234e-01
2.346691489219665527e-01
2.019170522689819336e-01
2.907369136810302734e-01
4.583631753921508789e-01
2.404614984989166260e-01
1.997406184673309326e-01
2.571412920951843262e-01
2.929489016532897949e-01
1.855565905570983887e-01
2.855236530303955078e-01
2.252731323242187500e-01
2.227595746517181396e-01
5.257190465927124023e-01
4.072758555412292480e-01
1.899547576904296875e-01
1.800129413604736328e-01
2.566790580749511719e-01
5.099340677261352539e-01
3.273168504238128662e-01
2.526520490646362305e-01
2.645036578178405762e-01
2.911148071289062500e-01
2.025863230228424072e-01
1.837003529071807861e-01
1.840630471706390381e-01
1.891715228557586670e-01
2.167911231517791748e-01
1.850792169570922852e-01
3.169609904289245605e-01
2.378972470760345459e-01
2.000773549079895020e-01
2.543606460094451904e-01
2.199573218822479248e-01
6.231436729431152344e-01
2.641792893409729004e-01
2.313819229602813721e-01
6.241787672042846680e-01
6.750310659408569336e-01
2.044198513031005859e-01
2.054912745952606201e-01
2.835217118263244629e-01
8.879317641258239746e-01
2.048988640308380127e-01
2.030945122241973877e-01
4.038183093070983887e-01
1.000000000000000000e+00
2.057928442955017090e-01
4.780715405941009521e-01
2.183609306812286377e-01
2.996318936347961426e-01
4.704369902610778809e-01
2.216769456863403320e-01
4.819745719432830811e-01
2.056105136871337891e-01
2.614491283893585205e-01
2.422491312026977539e-01
3.352241516113281250e-01
1.896050572395324707e-01
1.978090405464172363e-01
1.974478065967559814e-01
2.040597200393676758e-01
1.947280764579772949e-01
2.277882993221282959e-01
1.784933805465698242e-01
1.878808736801147461e-01
2.211441695690155029e-01
2.740727663040161133e-01
2.594689130783081055e-01
4.442638158798217773e-01
4.828405380249023438e-01
6.797085404396057129e-01
4.235990345478057861e-01
2.256933748722076416e-01
2.050737440586090088e-01
1.879437565803527832e-01
2.706333398818969727e-01
2.095870971679687500e-01
1.796017885208129883e-01
2.227328419685363770e-01
7.998788356781005859e-01
2.025276720523834229e-01
2.414484322071075439e-01
2.484220862388610840e-01
1.928542554378509521e-01
2.018899917602539062e-01
2.032649219036102295e-01
1.838476061820983887e-01
1.839182376861572266e-01
1.949611008167266846e-01
2.817024588584899902e-01
1.858950853347778320e-01
2.085014581680297852e-01
3.327040374279022217e-01
4.782497286796569824e-01
1.783126294612884521e-01
2.488250732421875000e-01
8.970042467117309570e-01
2.422135174274444580e-01
3.291369378566741943e-01
1.942392289638519287e-01
2.511662244796752930e-01
1.832133233547210693e-01
1.964668035507202148e-01
2.344767153263092041e-01
1.892904341220855713e-01
3.883564472198486328e-01
1.821165084838867188e-01
3.140366673469543457e-01
4.066916406154632568e-01
2.068370580673217773e-01
3.011637926101684570e-01
3.297362923622131348e-01
2.107520997524261475e-01
2.892957329750061035e-01
1.838574409484863281e-01
9.921502470970153809e-01
2.296636998653411865e-01
2.510392069816589355e-01
9.951190948486328125e-01
1.981856226921081543e-01
5.774976015090942383e-01
7.603456377983093262e-01
2.486584782600402832e-01
2.075305283069610596e-01
2.449673414230346680e-01
2.881568670272827148e-01
1.830820441246032715e-01
5.821988582611083984e-01
1.783465743064880371e-01
3.630887567996978760e-01
2.019387185573577881e-01
3.331329226493835449e-01
6.682016849517822266e-01
2.603458464145660400e-01
1.990448534488677979e-01
6.341610550880432129e-01
2.110715508460998535e-01
2.082462012767791748e-01
1.842044293880462646e-01
2.665902674198150635e-01
5.343714356422424316e-01
2.686873078346252441e-01
2.097454667091369629e-01
2.325696349143981934e-01
3.081138730049133301e-01
1.785675287246704102e-01
3.241342008113861084e-01
2.320648729801177979e-01
1.929738819599151611e-01
7.729026079177856445e-01
1.857515871524810791e-01
5.783210396766662598e-01
4.196929335594177246e-01
2.078875005245208740e-01
8.821067810058593750e-01
1.000000000000000000e+00
2.549080550670623779e-01
2.120597064495086670e-01
3.453589081764221191e-01
2.033259570598602295e-01
3.423880338668823242e-01
2.373606264591217041e-01
2.066772282123565674e-01
3.002801239490509033e-01
4.349042475223541260e-01
2.570566534996032715e-01
1.895538866519927979e-01
9.311671853065490723e-01
1.827435493469238281e-01
2.098461687564849854e-01
7.508132457733154297e-01
1.874431073665618896e-01
2.697005271911621094e-01
4.475634098052978516e-01
2.081779837608337402e-01
1.812581717967987061e-01
2.048885822296142578e-01
2.795653641223907471e-01
2.098098397254943848e-01
1.896017789840698242e-01
2.460685968399047852e-01
2.139950394630432129e-01
2.629113197326660156e-01
3.257431089878082275e-01
1.949429512023925781e-01
2.324387133121490479e-01
1.789092421531677246e-01
1.874071657657623291e-01
3.553893268108367920e-01
1.925083994865417480e-01
2.875912189483642578e-01
1.950357258319854736e-01
2.055369317531585693e-01
1.936908364295959473e-01
1.987356245517730713e-01
1.992800831794738770e-01
1.849188804626464844e-01
2.434864342212677002e-01
2.193870544433593750e-01
5.512814521789550781e-01
1.856026649475097656e-01
3.388268351554870605e-01
5.397408008575439453e-01
1.908353567123413086e-01
2.100592255592346191e-01
1.971111297607421875e-01
7.258286476135253906e-01
6.028261184692382812e-01
2.017495930194854736e-01
1.867346763610839844e-01
1.927878558635711670e-01
1.868714690208435059e-01
1.894463598728179932e-01
1.892940104007720947e-01
3.603096008300781250e-01
3.066675662994384766e-01
1.864679157733917236e-01
1.825380325317382812e-01
2.342405319213867188e-01
4.614230394363403320e-01
2.583472430706024170e-01
1.987680196762084961e-01
7.042937278747558594e-01
1.951702833175659180e-01
1.970995068550109863e-01
3.677449822425842285e-01
6.254843473434448242e-01
1.917650997638702393e-01
1.835799813270568848e-01
3.059334754943847656e-01
2.421766519546508789e-01
1.844238936901092529e-01
3.260142803192138672e-01
2.001976966857910156e-01
2.146769762039184570e-01
2.202679514884948730e-01
2.118249237537384033e-01
4.693547487258911133e-01
2.058813869953155518e-01
2.053537070751190186e-01
5.884029865264892578e-01
1.875592172145843506e-01
3.114558160305023193e-01
4.556346833705902100e-01
1.972869932651519775e-01
1.884509921073913574e-01
3.083843588829040527e-01
2.013817131519317627e-01
6.309353113174438477e-01
2.256425619125366211e-01
4.383797049522399902e-01
2.198351025581359863e-01
1.932411789894104004e-01
1.890833973884582520e-01
2.500720620155334473e-01
1.947185993194580078e-01
2.103409767150878906e-01
3.013270795345306396e-01
1.929469406604766846e-01
2.352444529533386230e-01
2.275635004043579102e-01
3.921587765216827393e-01
1.824958324432373047e-01
1.812090873718261719e-01
4.700880348682403564e-01
1.829563379287719727e-01
2.557547092437744141e-01
1.896227896213531494e-01
1.971370279788970947e-01
2.006255388259887695e-01
1.828002631664276123e-01
4.601716399192810059e-01
3.807037472724914551e-01
2.034619450569152832e-01
1.787403821945190430e-01
3.143378198146820068e-01
2.704579830169677734e-01
3.125099539756774902e-01
5.157031416893005371e-01
1.819046437740325928e-01
2.122973501682281494e-01
2.040759921073913574e-01
1.905099749565124512e-01
3.201506137847900391e-01
2.011412680149078369e-01
2.535776495933532715e-01
2.710797190666198730e-01
3.227139711380004883e-01
9.555459022521972656e-01
2.455431222915649414e-01
2.015103995800018311e-01
1.779212653636932373e-01
2.591199874877929688e-01
2.438822388648986816e-01
2.470339536666870117e-01
8.190004825592041016e-01
4.384247362613677979e-01
2.781978547573089600e-01
2.210413515567779541e-01
3.695610165596008301e-01
3.012660741806030273e-01
2.475894093513488770e-01
1.864576637744903564e-01
2.216658890247344971e-01
3.086529672145843506e-01
1.856218576431274414e-01
2.053334712982177734e-01
2.265128195285797119e-01
1.969256401062011719e-01
2.140780091285705566e-01
5.005092620849609375e-01
4.988691210746765137e-01
2.222072780132293701e-01
2.060802280902862549e-01
9.597548246383666992e-01
2.858820557594299316e-01
2.166953682899475098e-01
2.289625406265258789e-01
1.961386203765869141e-01
1.947194039821624756e-01
3.844013214111328125e-01
9.190003871917724609e-01
1.872517466545104980e-01
1.817677319049835205e-01
1.878434121608734131e-01
4.043331742286682129e-01
1.807469427585601807e-01
1.863853335380554199e-01
3.566236197948455811e-01
1.976076364517211914e-01
1.978282928466796875e-01
4.136250615119934082e-01
1.880828738212585449e-01
3.686551451683044434e-01
2.061910927295684814e-01
3.299086093902587891e-01
3.689227104187011719e-01
2.243748605251312256e-01
1.931789219379425049e-01
3.348207473754882812e-01
1.912912428379058838e-01
3.187990188598632812e-01
2.018820047378540039e-01
1.880005300045013428e-01
2.559236288070678711e-01
1.995636224746704102e-01
1.865647137165069580e-01
5.078043937683105469e-01
3.322921991348266602e-01
1.864906847476959229e-01
8.426075577735900879e-01
5.157779455184936523e-01
4.384057521820068359e-01
7.833697795867919922e-01
1.903448998928070068e-01
1.889558732509613037e-01
2.191431224346160889e-01
5.233086943626403809e-01
3.121295273303985596e-01
3.889771401882171631e-01
1.869904994964599609e-01
4.414049983024597168e-01
3.326799869537353516e-01
3.006557822227478027e-01
2.031175494194030762e-01
9.255059957504272461e-01
2.412741184234619141e-01
2.408225238323211670e-01
2.792537808418273926e-01
3.464666604995727539e-01
1.830342113971710205e-01
3.609049320220947266e-01
2.115794122219085693e-01
2.459398210048675537e-01
1.907003521919250488e-01
1.955714821815490723e-01
2.324952781200408936e-01
1.863671243190765381e-01
2.098258435726165771e-01
1.882712543010711670e-01
2.511892914772033691e-01
1.779281198978424072e-01
1.897121369838714600e-01
1.800948083400726318e-01
2.498158514499664307e-01
1.990900337696075439e-01
5.845866799354553223e-01
2.317717075347900391e-01
1.972178220748901367e-01
2.181120812892913818e-01
8.647317290306091309e-01
2.028643190860748291e-01
8.603099584579467773e-01
6.594151258468627930e-01
1.918953359127044678e-01
1.881951391696929932e-01
3.231367468833923340e-01
4.483514428138732910e-01
2.944586575031280518e-01
2.177853882312774658e-01
2.450085580348968506e-01
2.665390372276306152e-01
3.280779421329498291e-01
