0.000000000000000000e+00
9.636363636363635965e-02
1.000000000000000056e-01
1.036363636363636376e-01
1.072727272727272696e-01
1.090909090909090856e-01
1.145454545454545475e-01
1.181818181818181795e-01
1.218181818181818116e-01
1.236363636363636415e-01
1.345454545454545514e-01
1.400000000000000133e-01
1.436363636363636453e-01
1.472727272727272774e-01
1.527272727272727393e-01
1.527272727272727393e-01
1.563636363636363713e-01
1.872727272727272851e-01
1.909090909090909172e-01
2.090909090909090773e-01
2.090909090909090773e-01
2.127272727272727371e-01
2.127272727272727371e-01
2.345454545454545570e-01
2.345454545454545570e-01
2.381818181818181890e-01
2.381818181818181890e-01
2.509090909090909149e-01
2.509090909090909149e-01
2.545454545454545192e-01
2.545454545454545192e-01
2.600000000000000089e-01
2.600000000000000089e-01
2.781818181818181968e-01
2.781818181818181968e-01
2.818181818181818010e-01
2.818181818181818010e-01
3.236363636363636109e-01
3.236363636363636109e-01
3.327272727272727049e-01
3.327272727272727049e-01
3.400000000000000244e-01
3.400000000000000244e-01
3.436363636363636287e-01
3.436363636363636287e-01
3.472727272727272885e-01
3.472727272727272885e-01
3.545454545454545525e-01
3.545454545454545525e-01
3.563636363636363824e-01
3.563636363636363824e-01
3.654545454545454763e-01
3.654545454545454763e-01
3.672727272727272507e-01
3.672727272727272507e-01
3.781818181818181746e-01
3.781818181818181746e-01
3.890909090909090984e-01
3.890909090909090984e-01
3.909090909090909283e-01
3.909090909090909283e-01
3.945454545454545325e-01
3.945454545454545325e-01
4.036363636363636265e-01
4.036363636363636265e-01
4.054545454545454564e-01
4.054545454545454564e-01
4.145454545454545503e-01
4.145454545454545503e-01
4.218181818181818143e-01
4.218181818181818143e-01
4.236363636363636442e-01
4.236363636363636442e-01
4.254545454545454741e-01
4.254545454545454741e-01
4.290909090909090784e-01
4.290909090909090784e-01
4.345454545454545681e-01
4.345454545454545681e-01
4.381818181818181723e-01
4.381818181818181723e-01
4.400000000000000022e-01
4.400000000000000022e-01
4.418181818181818321e-01
4.418181818181818321e-01
4.454545454545454364e-01
4.454545454545454364e-01
4.472727272727272663e-01
4.472727272727272663e-01
4.490909090909090962e-01
4.490909090909090962e-01
4.545454545454545303e-01
4.545454545454545303e-01
4.563636363636363602e-01
4.563636363636363602e-01
4.581818181818181901e-01
4.581818181818181901e-01
4.636363636363636243e-01
4.636363636363636243e-01
4.690909090909091139e-01
4.690909090909091139e-01
4.709090909090908883e-01
4.709090909090908883e-01
4.727272727272727182e-01
4.727272727272727182e-01
4.745454545454545481e-01
4.745454545454545481e-01
4.781818181818182079e-01
4.781818181818182079e-01
4.799999999999999822e-01
4.799999999999999822e-01
4.818181818181818121e-01
4.818181818181818121e-01
4.836363636363636420e-01
4.836363636363636420e-01
4.854545454545454719e-01
4.854545454545454719e-01
4.872727272727272463e-01
4.872727272727272463e-01
4.927272727272727360e-01
4.927272727272727360e-01
4.945454545454545658e-01
4.945454545454545658e-01
4.963636363636363402e-01
4.963636363636363402e-01
4.981818181818181701e-01
4.981818181818181701e-01
5.018181818181818299e-01
5.018181818181818299e-01
5.036363636363636598e-01
5.036363636363636598e-01
5.054545454545454897e-01
5.054545454545454897e-01
5.072727272727273196e-01
5.072727272727273196e-01
5.090909090909090384e-01
5.090909090909090384e-01
5.109090909090908683e-01
5.109090909090908683e-01
5.127272727272726982e-01
5.127272727272726982e-01
5.163636363636363580e-01
5.163636363636363580e-01
5.200000000000000178e-01
5.200000000000000178e-01
5.236363636363636775e-01
5.236363636363636775e-01
5.290909090909090562e-01
5.290909090909090562e-01
5.309090909090908861e-01
5.309090909090908861e-01
5.327272727272727160e-01
5.327272727272727160e-01
5.345454545454545459e-01
5.345454545454545459e-01
5.381818181818182056e-01
5.381818181818182056e-01
5.400000000000000355e-01
5.400000000000000355e-01
5.418181818181818654e-01
5.418181818181818654e-01
5.454545454545454142e-01
5.454545454545454142e-01
5.472727272727272441e-01
5.472727272727272441e-01
5.490909090909090740e-01
5.490909090909090740e-01
5.509090909090909038e-01
5.509090909090909038e-01
5.527272727272727337e-01
5.527272727272727337e-01
5.563636363636363935e-01
5.563636363636363935e-01
5.581818181818182234e-01
5.581818181818182234e-01
5.600000000000000533e-01
5.600000000000000533e-01
5.636363636363636020e-01
5.636363636363636020e-01
5.672727272727272618e-01
5.672727272727272618e-01
5.709090909090909216e-01
5.709090909090909216e-01
5.745454545454545814e-01
5.745454545454545814e-01
5.763636363636364113e-01
5.763636363636364113e-01
5.781818181818181301e-01
5.781818181818181301e-01
5.872727272727272796e-01
5.872727272727272796e-01
5.890909090909091095e-01
5.890909090909091095e-01
5.909090909090909394e-01
5.909090909090909394e-01
5.927272727272727693e-01
5.927272727272727693e-01
5.963636363636363180e-01
5.963636363636363180e-01
6.072727272727272974e-01
6.072727272727272974e-01
6.109090909090909571e-01
6.109090909090909571e-01
6.127272727272726760e-01
6.127272727272726760e-01
6.145454545454545059e-01
6.145454545454545059e-01
6.199999999999999956e-01
6.199999999999999956e-01
6.218181818181818254e-01
6.218181818181818254e-01
6.381818181818181834e-01
6.381818181818181834e-01
6.400000000000000133e-01
6.400000000000000133e-01
6.472727272727272219e-01
6.472727272727272219e-01
6.527272727272727115e-01
6.527272727272727115e-01
6.545454545454545414e-01
6.545454545454545414e-01
6.563636363636363713e-01
6.563636363636363713e-01
6.600000000000000311e-01
6.600000000000000311e-01
6.636363636363636909e-01
6.636363636363636909e-01
6.654545454545454097e-01
6.654545454545454097e-01
6.690909090909090695e-01
6.690909090909090695e-01
6.727272727272727293e-01
6.727272727272727293e-01
6.745454545454545592e-01
6.745454545454545592e-01
6.763636363636363891e-01
6.763636363636363891e-01
6.781818181818182190e-01
6.781818181818182190e-01
6.818181818181817677e-01
6.818181818181817677e-01
6.854545454545454275e-01
6.854545454545454275e-01
6.872727272727272574e-01
6.872727272727272574e-01
6.890909090909090873e-01
6.890909090909090873e-01
6.909090909090909172e-01
6.909090909090909172e-01
6.945454545454545769e-01
6.945454545454545769e-01
6.999999999999999556e-01
6.999999999999999556e-01
7.018181818181817855e-01
7.018181818181817855e-01
7.036363636363636154e-01
7.036363636363636154e-01
7.109090909090909349e-01
7.109090909090909349e-01
7.181818181818181435e-01
7.181818181818181435e-01
7.199999999999999734e-01
7.199999999999999734e-01
7.254545454545454630e-01
7.254545454545454630e-01
7.309090909090909527e-01
7.309090909090909527e-01
7.381818181818181612e-01
7.381818181818181612e-01
7.399999999999999911e-01
7.399999999999999911e-01
7.418181818181818210e-01
7.418181818181818210e-01
7.472727272727273107e-01
7.472727272727273107e-01
7.490909090909091406e-01
7.490909090909091406e-01
7.509090909090908594e-01
7.509090909090908594e-01
7.600000000000000089e-01
7.600000000000000089e-01
7.636363636363636687e-01
7.636363636363636687e-01
7.654545454545454986e-01
7.654545454545454986e-01
7.690909090909090473e-01
7.690909090909090473e-01
7.763636363636363669e-01
7.763636363636363669e-01
7.781818181818181968e-01
7.781818181818181968e-01
7.890909090909090651e-01
7.890909090909090651e-01
7.909090909090908950e-01
7.909090909090908950e-01
7.945454545454545547e-01
7.945454545454545547e-01
7.981818181818182145e-01
7.981818181818182145e-01
8.036363636363635932e-01
8.036363636363635932e-01
8.054545454545454231e-01
8.054545454545454231e-01
8.090909090909090828e-01
8.090909090909090828e-01
8.127272727272727426e-01
8.127272727272727426e-01
8.145454545454545725e-01
8.145454545454545725e-01
8.163636363636364024e-01
8.163636363636364024e-01
8.181818181818182323e-01
8.181818181818182323e-01
8.236363636363636109e-01
8.236363636363636109e-01
8.272727272727272707e-01
8.272727272727272707e-01
8.290909090909091006e-01
8.290909090909091006e-01
8.363636363636363091e-01
8.363636363636363091e-01
8.418181818181817988e-01
8.418181818181817988e-01
8.436363636363636287e-01
8.436363636363636287e-01
8.454545454545454586e-01
8.454545454545454586e-01
8.472727272727272885e-01
8.472727272727272885e-01
8.509090909090909483e-01
8.509090909090909483e-01
8.527272727272727781e-01
8.527272727272727781e-01
8.545454545454544970e-01
8.545454545454544970e-01
8.563636363636363269e-01
8.563636363636363269e-01
8.581818181818181568e-01
8.581818181818181568e-01
8.618181818181818166e-01
8.618181818181818166e-01
8.672727272727273062e-01
8.672727272727273062e-01
8.690909090909091361e-01
8.690909090909091361e-01
8.709090909090908550e-01
8.709090909090908550e-01
8.727272727272726849e-01
8.727272727272726849e-01
8.745454545454545148e-01
8.745454545454545148e-01
8.763636363636363447e-01
8.763636363636363447e-01
8.781818181818181746e-01
8.781818181818181746e-01
8.818181818181818343e-01
8.818181818181818343e-01
8.836363636363636642e-01
8.836363636363636642e-01
8.854545454545454941e-01
8.854545454545454941e-01
8.890909090909090429e-01
8.890909090909090429e-01
8.927272727272727026e-01
8.927272727272727026e-01
8.945454545454545325e-01
8.945454545454545325e-01
8.981818181818181923e-01
8.981818181818181923e-01
9.000000000000000222e-01
9.000000000000000222e-01
9.072727272727272307e-01
9.072727272727272307e-01
9.090909090909090606e-01
9.090909090909090606e-01
9.109090909090908905e-01
9.109090909090908905e-01
9.127272727272727204e-01
9.127272727272727204e-01
9.163636363636363802e-01
9.163636363636363802e-01
9.218181818181818699e-01
9.218181818181818699e-01
9.254545454545454186e-01
9.254545454545454186e-01
9.272727272727272485e-01
9.272727272727272485e-01
9.290909090909090784e-01
9.290909090909090784e-01
9.309090909090909083e-01
9.309090909090909083e-01
9.363636363636363980e-01
9.363636363636363980e-01
9.381818181818182278e-01
9.381818181818182278e-01
9.436363636363636065e-01
9.436363636363636065e-01
9.454545454545454364e-01
9.454545454545454364e-01
9.472727272727272663e-01
9.472727272727272663e-01
9.509090909090909260e-01
9.509090909090909260e-01
9.527272727272727559e-01
9.527272727272727559e-01
9.545454545454545858e-01
9.545454545454545858e-01
9.581818181818181346e-01
9.581818181818181346e-01
9.599999999999999645e-01
9.599999999999999645e-01
9.618181818181817944e-01
9.618181818181817944e-01
9.636363636363636243e-01
9.636363636363636243e-01
9.654545454545454541e-01
9.654545454545454541e-01
9.672727272727272840e-01
9.672727272727272840e-01
9.690909090909091139e-01
9.690909090909091139e-01
9.727272727272727737e-01
9.727272727272727737e-01
9.745454545454544926e-01
9.745454545454544926e-01
9.763636363636363225e-01
9.763636363636363225e-01
9.781818181818181523e-01
9.781818181818181523e-01
9.799999999999999822e-01
9.799999999999999822e-01
9.818181818181818121e-01
9.818181818181818121e-01
9.836363636363636420e-01
9.836363636363636420e-01
9.854545454545454719e-01
9.854545454545454719e-01
9.872727272727273018e-01
9.872727272727273018e-01
9.890909090909091317e-01
9.890909090909091317e-01
9.909090909090909616e-01
9.909090909090909616e-01
9.945454545454545103e-01
9.945454545454545103e-01
9.963636363636363402e-01
9.963636363636363402e-01
1.000000000000000000e+00
