0.000000000000000000e+00
2.203451628722037040e-03
2.203451628722037040e-03
2.203451628722037040e-03
2.203451628722037040e-03
2.203451628722037040e-03
2.203451628722037040e-03
2.203451628722037040e-03
2.203451628722037040e-03
2.203451628722037040e-03
3.115005322882829965e-03
3.115005322882829965e-03
3.115005322882829965e-03
3.115005322882829965e-03
3.115005322882829965e-03
3.115005322882829965e-03
3.813682897726513449e-03
3.813682897726513449e-03
4.402040018967092946e-03
4.402040018967092946e-03
4.919816603707567911e-03
4.919816603707567911e-03
5.387401460908432943e-03
5.387401460908432943e-03
5.816911000628487843e-03
5.816911000628487843e-03
6.216242649609158427e-03
6.216242649609158427e-03
6.944831953478250615e-03
6.944831953478250615e-03
7.281104995513937826e-03
7.281104995513937826e-03
7.602049003439552075e-03
7.602049003439552075e-03
7.909530210262003674e-03
7.909530210262003674e-03
8.205062293776387711e-03
8.205062293776387711e-03
8.489893188009352970e-03
8.489893188009352970e-03
9.031464141875281820e-03
9.031464141875281820e-03
9.289841960393828771e-03
9.289841960393828771e-03
9.540851259377303856e-03
9.540851259377303856e-03
9.785059113739776743e-03
9.785059113739776743e-03
1.002296268408473315e-02
1.002296268408473315e-02
1.025500073501123439e-02
1.025500073501123439e-02
1.048156282168645134e-02
1.048156282168645134e-02
1.070299669700925868e-02
1.070299669700925868e-02
1.091961434340862382e-02
1.091961434340862382e-02
1.113169692916189321e-02
1.113169692916189321e-02
1.133949891476700514e-02
1.133949891476700514e-02
1.174316541110785594e-02
1.174316541110785594e-02
1.193943352894047405e-02
1.193943352894047405e-02
1.213223277524334495e-02
1.213223277524334495e-02
1.232172598440423213e-02
1.232172598440423213e-02
1.250806341358040932e-02
1.250806341358040932e-02
1.269138406490434579e-02
1.269138406490434579e-02
1.287181683403783652e-02
1.287181683403783652e-02
1.339694539794322389e-02
1.339694539794322389e-02
1.356694605012473756e-02
1.356694605012473756e-02
1.373458278433935253e-02
1.373458278433935253e-02
1.389994112915948418e-02
1.389994112915948418e-02
1.406310145485983182e-02
1.406310145485983182e-02
1.422413939985877479e-02
1.422413939985877479e-02
1.438312625283187998e-02
1.438312625283187998e-02
1.454012929600494164e-02
1.454012929600494164e-02
1.469521211434300992e-02
1.469521211434300992e-02
1.484843487468893650e-02
1.484843487468893650e-02
1.499985457834763711e-02
1.499985457834763711e-02
1.529749834656080748e-02
1.529749834656080748e-02
1.544382254530227497e-02
1.544382254530227497e-02
1.558854431818108323e-02
1.558854431818108323e-02
1.573170788917584509e-02
1.573170788917584509e-02
1.587335541913467013e-02
1.587335541913467013e-02
1.601352713849573187e-02
1.601352713849573187e-02
1.628959513694960143e-02
1.628959513694960143e-02
1.642556327444991138e-02
1.642556327444991138e-02
1.669353609039939471e-02
1.669353609039939471e-02
1.695643257072040194e-02
1.695643257072040194e-02
1.708605058781510755e-02
1.708605058781510755e-02
1.734176297327968269e-02
1.734176297327968269e-02
1.759294748923165633e-02
1.759294748923165633e-02
1.771690211435440754e-02
1.771690211435440754e-02
1.783979539405431552e-02
1.783979539405431552e-02
1.796164911346339807e-02
1.796164911346339807e-02
1.808248428866985127e-02
1.808248428866985127e-02
1.820232120434523912e-02
1.820232120434523912e-02
1.832117944903311618e-02
1.832117944903311618e-02
1.843907794827450916e-02
1.843907794827450916e-02
1.855603499573025422e-02
1.855603499573025422e-02
1.867206828244641348e-02
1.867206828244641348e-02
1.878719492439649696e-02
1.878719492439649696e-02
1.890143148842305179e-02
1.890143148842305179e-02
1.901479401669090019e-02
1.901479401669090019e-02
1.934979041390892662e-02
1.934979041390892662e-02
1.945980750812419113e-02
1.945980750812419113e-02
1.989199801505503462e-02
1.989199801505503462e-02
2.010354405143340017e-02
2.010354405143340017e-02
2.020822165922665781e-02
2.020822165922665781e-02
2.031218407336602555e-02
2.031218407336602555e-02
2.051800673160276978e-02
2.051800673160276978e-02
2.061988795905597693e-02
2.061988795905597693e-02
2.072109598093932123e-02
2.072109598093932123e-02
2.092153142267348664e-02
2.092153142267348664e-02
2.102077772779233078e-02
2.102077772779233078e-02
2.121737294548929620e-02
2.121737294548929620e-02
2.131473935856068036e-02
2.131473935856068036e-02
2.141149628447584774e-02
2.141149628447584774e-02
2.150765194897442251e-02
2.150765194897442251e-02
2.160321438068132233e-02
2.160321438068132233e-02
2.179259071383299676e-02
2.179259071383299676e-02
2.197968581370114693e-02
2.197968581370114693e-02
2.216455744928830240e-02
2.216455744928830240e-02
2.225617680896078282e-02
2.225617680896078282e-02
2.234726080265764941e-02
2.234726080265764941e-02
2.252784862889946338e-02
2.252784862889946338e-02
2.261736507820795439e-02
2.261736507820795439e-02
2.270637140356483036e-02
2.270637140356483036e-02
2.288287745874756363e-02
2.288287745874756363e-02
2.297038876536054014e-02
2.297038876536054014e-02
2.314395598240173019e-02
2.314395598240173019e-02
2.323002276708207442e-02
2.323002276708207442e-02
2.331561873518065570e-02
2.331561873518065570e-02
2.365339624659547335e-02
2.365339624659547335e-02
2.373671361520747480e-02
2.373671361520747480e-02
2.381958967958197615e-02
2.381958967958197615e-02
2.414677141007186972e-02
2.414677141007186972e-02
2.422750810112959952e-02
2.422750810112959952e-02
2.470335370711684853e-02
2.470335370711684853e-02
2.478126880626634054e-02
2.478126880626634054e-02
2.485879608748757172e-02
2.485879608748757172e-02
2.493593916802609722e-02
2.493593916802609722e-02
2.508908688533677961e-02
2.508908688533677961e-02
2.516509845035872633e-02
2.516509845035872633e-02
2.524073967406401456e-02
2.524073967406401456e-02
2.539092432057508258e-02
2.539092432057508258e-02
2.546547421774924408e-02
2.546547421774924408e-02
2.568699194121430371e-02
2.568699194121430371e-02
2.576013071152978562e-02
2.576013071152978562e-02
2.612070310559898301e-02
2.612070310559898301e-02
2.619181303434445218e-02
2.619181303434445218e-02
2.626259448955142392e-02
2.626259448955142392e-02
2.640318253392564402e-02
2.640318253392564402e-02
2.654248794899202735e-02
2.654248794899202735e-02
2.695290638062295546e-02
2.695290638062295546e-02
2.702024096254632829e-02
2.702024096254632829e-02
2.715401480998725497e-02
2.715401480998725497e-02
2.722045847550159936e-02
2.722045847550159936e-02
2.728660951700226725e-02
2.728660951700226725e-02
2.754832946322326864e-02
2.754832946322326864e-02
2.780553206678260808e-02
2.780553206678260808e-02
2.793247844671652158e-02
2.793247844671652158e-02
2.799554449386572330e-02
2.799554449386572330e-02
2.818313590627079951e-02
2.818313590627079951e-02
2.836835433236865878e-02
2.836835433236865878e-02
2.855124595450229952e-02
2.855124595450229952e-02
2.867190304542684837e-02
2.867190304542684837e-02
2.873185520627450154e-02
2.873185520627450154e-02
2.879155853620365621e-02
2.879155853620365621e-02
2.885101457998164032e-02
2.885101457998164032e-02
2.891022486329598157e-02
2.891022486329598157e-02
2.902791415783166629e-02
2.902791415783166629e-02
2.914463825591187204e-02
2.914463825591187204e-02
2.920264197682718998e-02
2.920264197682718998e-02
2.926040870847312902e-02
2.926040870847312902e-02
2.931793985170826761e-02
2.931793985170826761e-02
2.937523679072613289e-02
2.937523679072613289e-02
2.948913351119325857e-02
2.948913351119325857e-02
2.954573598013570529e-02
2.954573598013570529e-02
2.960210962036562490e-02
2.960210962036562490e-02
2.971417561899902804e-02
2.971417561899902804e-02
2.976987054202674676e-02
2.976987054202674676e-02
2.999042563205501014e-02
2.999042563205501014e-02
3.009938551451397937e-02
3.009938551451397937e-02
3.015354021890496311e-02
3.015354021890496311e-02
3.036801780284295593e-02
3.036801780284295593e-02
3.047398766246776219e-02
3.047398766246776219e-02
3.052665922506902704e-02
3.052665922506902704e-02
3.063138100429131996e-02
3.063138100429131996e-02
3.068343334155047841e-02
3.068343334155047841e-02
3.088960989103213539e-02
3.088960989103213539e-02
3.099149267179069495e-02
3.099149267179069495e-02
3.134188689098885150e-02
3.134188689098885150e-02
3.153787423959740488e-02
3.153787423959740488e-02
3.168288607143780744e-02
3.168288607143780744e-02
3.201479042271183906e-02
3.201479042271183906e-02
3.206147946123746872e-02
3.206147946123746872e-02
3.210798942129348965e-02
3.210798942129348965e-02
3.215432107996980815e-02
3.215432107996980815e-02
3.224645256442389141e-02
3.224645256442389141e-02
3.265241641897161096e-02
3.265241641897161096e-02
3.274074765339878013e-02
3.274074765339878013e-02
3.278466068694889379e-02
3.278466068694889379e-02
3.295864460488685810e-02
3.295864460488685810e-02
3.325679404949963280e-02
3.325679404949963280e-02
3.329874006508207196e-02
3.329874006508207196e-02
3.338215314907197473e-02
3.338215314907197473e-02
3.354708015277509808e-02
3.354708015277509808e-02
3.362860338668770266e-02
3.362860338668770266e-02
3.370950585082762435e-02
3.370950585082762435e-02
3.378979200409838041e-02
3.378979200409838041e-02
3.382970533671383895e-02
3.382970533671383895e-02
3.398783960679212235e-02
3.398783960679212235e-02
3.406600270253636736e-02
3.406600270253636736e-02
3.422054146459146962e-02
3.422054146459146962e-02
3.433489735887504390e-02
3.433489735887504390e-02
3.444794094240351268e-02
3.444794094240351268e-02
3.452258064218222122e-02
3.452258064218222122e-02
3.459664656041160774e-02
3.459664656041160774e-02
3.470667762522485628e-02
3.470667762522485628e-02
3.495849608403561043e-02
3.495849608403561043e-02
3.499391415643758607e-02
3.499391415643758607e-02
3.502919450287238917e-02
3.502919450287238917e-02
3.506433753906324641e-02
3.506433753906324641e-02
3.520354478174134161e-02
3.520354478174134161e-02
3.527233511240131236e-02
3.527233511240131236e-02
3.530652834567996751e-02
3.530652834567996751e-02
3.547549071624545025e-02
3.547549071624545025e-02
3.550888510090534356e-02
3.550888510090534356e-02
3.554214766529355252e-02
3.554214766529355252e-02
3.560827880942937784e-02
3.560827880942937784e-02
3.564114812020439949e-02
3.564114812020439949e-02
3.577132535376689043e-02
3.577132535376689043e-02
3.580354643227541545e-02
3.580354643227541545e-02
3.589943949179967564e-02
3.589943949179967564e-02
3.596272980411349685e-02
3.596272980411349685e-02
3.602551254468659009e-02
3.602551254468659009e-02
3.608779036262098339e-02
3.608779036262098339e-02
3.611874074262644285e-02
3.611874074262644285e-02
3.621084163024840263e-02
3.621084163024840263e-02
3.624129290123250663e-02
3.624129290123250663e-02
3.627162018350259948e-02
3.627162018350259948e-02
3.636186119403725381e-02
3.636186119403725381e-02
3.642140756029758203e-02
3.642140756029758203e-02
3.650981166004219070e-02
3.650981166004219070e-02
3.676850614126379868e-02
3.676850614126379868e-02
3.679665261226693074e-02
3.679665261226693074e-02
3.682468062423489147e-02
3.682468062423489147e-02
3.685259044744756962e-02
3.685259044744756962e-02
3.693561345810611463e-02
3.693561345810611463e-02
3.699037605593662875e-02
3.699037605593662875e-02
3.704467222149497585e-02
3.704467222149497585e-02
3.707164603331265795e-02
3.707164603331265795e-02
3.709850400274657817e-02
3.709850400274657817e-02
3.717838536189614629e-02
3.717838536189614629e-02
3.723106495085769241e-02
3.723106495085769241e-02
3.728328709539604352e-02
3.728328709539604352e-02
3.730922722693576915e-02
3.730922722693576915e-02
3.733505371505280168e-02
3.733505371505280168e-02
3.738636670204049245e-02
3.738636670204049245e-02
3.743722792166129937e-02
3.743722792166129937e-02
3.758711923422446838e-02
3.758711923422446838e-02
3.763619151333495033e-02
3.763619151333495033e-02
3.778075819200495122e-02
3.778075819200495122e-02
3.780446837641292246e-02
3.780446837641292246e-02
3.782806932537018108e-02
3.782806932537018108e-02
3.785156124320598198e-02
3.785156124320598198e-02
3.794444263939508732e-02
3.794444263939508732e-02
3.796739241618087707e-02
3.796739241618087707e-02
3.801296865844834560e-02
3.801296865844834560e-02
3.805811510804883724e-02
3.805811510804883724e-02
3.814712471854680986e-02
3.814712471854680986e-02
3.816911086172253276e-02
3.816911086172253276e-02
3.821276492669330865e-02
3.821276492669330865e-02
3.825599590543149464e-02
3.825599590543149464e-02
3.832005221534855177e-02
3.832005221534855177e-02
3.852678157823633681e-02
3.852678157823633681e-02
3.854688416050744415e-02
3.854688416050744415e-02
3.862626564040206462e-02
3.862626564040206462e-02
3.864585459057824635e-02
3.864585459057824635e-02
3.868472588072200541e-02
3.868472588072200541e-02
3.874226859158451386e-02
3.874226859158451386e-02
3.876124630792727316e-02
3.876124630792727316e-02
3.878012267987929196e-02
3.878012267987929196e-02
3.879889785535825530e-02
3.879889785535825530e-02
3.887298951328791580e-02
3.887298951328791580e-02
3.889126088764661981e-02
3.889126088764661981e-02
3.890943193061476013e-02
3.890943193061476013e-02
3.899878705606361212e-02
3.899878705606361212e-02
3.901635902521483762e-02
3.901635902521483762e-02
3.908565453665915901e-02
3.908565453665915901e-02
3.913658786614158946e-02
3.913658786614158946e-02
3.918663508214951380e-02
3.918663508214951380e-02
3.920312116167155858e-02
3.920312116167155858e-02
3.925199215441508432e-02
3.925199215441508432e-02
3.926808714275275419e-02
3.926808714275275419e-02
3.934710239234798235e-02
3.934710239234798235e-02
3.940856995320610179e-02
3.940856995320610179e-02
3.943872469168174799e-02
3.943872469168174799e-02
3.945365768953570940e-02
3.945365768953570940e-02
3.951242974310439915e-02
3.951242974310439915e-02
3.958374291467488953e-02
3.958374291467488953e-02
3.975805428482086928e-02
3.975805428482086928e-02
3.978345761911513540e-02
3.978345761911513540e-02
3.983314021493279677e-02
3.983314021493279677e-02
3.988132869720750762e-02
3.988132869720750762e-02
3.989314300072309416e-02
3.989314300072309416e-02
3.990486434382316261e-02
3.990486434382316261e-02
3.991649280840025432e-02
3.991649280840025432e-02
3.995082173877786968e-02
3.995082173877786968e-02
4.005924682217569532e-02
4.005924682217569532e-02
4.010004208651689328e-02
4.010004208651689328e-02
4.011989026703286637e-02
4.011989026703286637e-02
4.012967723381230534e-02
4.012967723381230534e-02
4.014897725467491546e-02
4.014897725467491546e-02
4.021365804812573885e-02
4.021365804812573885e-02
4.022253464758668989e-02
4.022253464758668989e-02
4.023132055180873856e-02
4.023132055180873856e-02
4.024862051149825232e-02
4.024862051149825232e-02
4.029834974685310434e-02
4.029834974685310434e-02
4.030632198797039906e-02
4.030632198797039906e-02
4.031420409827719126e-02
4.031420409827719126e-02
4.032199613062957544e-02
4.032199613062957544e-02
4.032969813723895347e-02
4.032969813723895347e-02
4.035960692801131983e-02
4.035960692801131983e-02
4.038807931739250845e-02
4.038807931739250845e-02
4.041511834121040703e-02
4.041511834121040703e-02
4.042165447422874092e-02
4.042165447422874092e-02
4.044072687454737525e-02
4.044072687454737525e-02
4.045299556217937104e-02
4.045299556217937104e-02
4.046490763329479989e-02
4.046490763329479989e-02
4.048210777006665262e-02
4.048210777006665262e-02
4.048766317561518224e-02
4.048766317561518224e-02
4.049312965600700837e-02
4.049312965600700837e-02
4.050899590331381861e-02
4.050899590331381861e-02
4.051410703713258232e-02
4.051410703713258232e-02
4.051912941980772426e-02
4.051912941980772426e-02
4.053833209006291183e-02
4.053833209006291183e-02
4.055180376305413115e-02
4.055180376305413115e-02
4.056034231002041829e-02
4.056034231002041829e-02
4.056852706446494733e-02
4.056852706446494733e-02
4.057248683676353829e-02
4.057248683676353829e-02
4.057635824048073936e-02
4.057635824048073936e-02
4.058014130090800697e-02
4.058014130090800697e-02
4.059096066657291030e-02
4.059096066657291030e-02
4.060098579691204940e-02
4.060098579691204940e-02
4.060722826769893462e-02
4.060722826769893462e-02
4.061865565733493999e-02
4.061865565733493999e-02
4.062867395393224279e-02
4.062867395393224279e-02
4.064896661592323768e-02
4.064896661592323768e-02
4.065151346387010228e-02
4.065151346387010228e-02
4.065370889438493784e-02
4.065370889438493784e-02
4.065467484625245875e-02
4.065467484625245875e-02
4.065555296439817001e-02
4.065555296439817001e-02
4.065941645893929313e-02
4.065941645893929313e-02
4.065634325451331077e-02
4.065634325451331077e-02
4.065555296439817001e-02
4.065555296439817001e-02
4.065370889438493784e-02
4.065370889438493784e-02
4.065151346387010228e-02
4.065151346387010228e-02
4.064756139012630498e-02
4.064756139012630498e-02
4.064448728931678578e-02
4.064448728931678578e-02
4.064281839436256760e-02
4.064281839436256760e-02
4.063921686121177435e-02
4.063921686121177435e-02
4.063728419964061922e-02
4.063728419964061922e-02
4.061865565733493999e-02
4.061865565733493999e-02
4.059096066657291030e-02
4.059096066657291030e-02
4.058744249012716243e-02
4.058744249012716243e-02
4.056852706446495427e-02
4.056852706446495427e-02
4.056034231002041829e-02
4.056034231002041829e-02
4.055611727435166208e-02
4.055611727435166208e-02
4.055180376305413115e-02
4.055180376305413115e-02
4.054291120003447602e-02
4.054291120003447602e-02
4.051912941980772426e-02
4.051912941980772426e-02
4.050899590331382555e-02
4.050899590331382555e-02
4.044072687454737525e-02
4.044072687454737525e-02
4.043445869846392510e-02
4.043445869846392510e-02
4.040849280331424570e-02
4.040849280331424570e-02
4.039497333632580123e-02
4.039497333632580123e-02
4.038807931739250845e-02
4.038807931739250845e-02
4.036685956663773472e-02
4.036685956663773472e-02
4.035226451509084378e-02
4.035226451509084378e-02
4.029834974685309740e-02
4.029834974685309740e-02
4.025713468378906007e-02
4.025713468378906007e-02
4.024862051149825232e-02
4.024862051149825232e-02
4.011989026703286637e-02
4.011989026703286637e-02
4.011001190711510622e-02
4.011001190711510622e-02
4.004881866070792579e-02
4.004881866070792579e-02
4.002768662362182067e-02
4.002768662362182067e-02
4.000618648115426834e-02
4.000618648115426834e-02
3.998431763949859830e-02
3.998431763949859830e-02
3.996207949335416759e-02
3.996207949335416759e-02
3.985742087762197960e-02
3.985742087762197960e-02
3.975805428482086928e-02
3.975805428482086928e-02
3.969290089544376399e-02
3.969290089544376399e-02
3.961160136521962166e-02
3.961160136521962166e-02
3.946849458569717112e-02
3.946849458569717112e-02
3.945365768953570940e-02
3.945365768953570940e-02
3.942369548293039871e-02
3.942369548293039871e-02
3.939334799155821965e-02
3.939334799155821965e-02
3.931578775938008447e-02
3.931578775938008447e-02
3.928408466049243541e-02
3.928408466049243541e-02
3.925199215441508432e-02
3.925199215441508432e-02
3.921950928521673874e-02
3.921950928521673874e-02
3.905120498869475709e-02
3.905120498869475709e-02
3.890943193061476013e-02
3.890943193061476013e-02
3.889126088764661981e-02
3.889126088764661981e-02
3.878012267987929196e-02
3.878012267987929196e-02
3.852678157823632987e-02
3.852678157823632987e-02
3.848626663328479081e-02
3.848626663328479081e-02
3.838316454996724969e-02
3.838316454996724969e-02
3.829880523065269660e-02
3.829880523065269660e-02
3.827745318598475138e-02
3.827745318598475138e-02
3.823443321181681231e-02
3.823443321181681231e-02
3.812503225718790606e-02
3.812503225718790606e-02
3.789821879559187451e-02
3.789821879559187451e-02
3.787494433279983697e-02
3.787494433279983697e-02
3.770897016081850572e-02
3.770897016081850572e-02
3.768482096195305275e-02
3.768482096195305275e-02
3.746248969435871101e-02
3.746248969435871101e-02
3.741185366723029371e-02
3.741185366723029371e-02
3.733505371505280168e-02
3.733505371505280168e-02
3.725723308306292531e-02
3.725723308306292531e-02
3.723106495085769935e-02
3.723106495085769935e-02
3.712524638121253440e-02
3.712524638121253440e-02
3.699037605593662875e-02
3.699037605593662875e-02
3.648046529113332243e-02
3.648046529113332243e-02
3.621084163024840957e-02
3.621084163024840957e-02
3.608779036262098339e-02
3.608779036262098339e-02
3.605671440496553692e-02
3.605671440496553692e-02
3.602551254468658315e-02
3.602551254468658315e-02
3.580354643227541545e-02
3.580354643227541545e-02
3.557527877916233372e-02
3.557527877916233372e-02
3.544196413869988432e-02
3.544196413869988432e-02
3.540830499276564902e-02
3.540830499276564902e-02
3.530652834567996751e-02
3.530652834567996751e-02
3.523800738889937278e-02
3.523800738889937278e-02
3.485141130390391473e-02
3.485141130390391473e-02
3.470667762522486322e-02
3.470667762522486322e-02
3.441040475875025567e-02
3.441040475875025567e-02
3.429692518489441816e-02
3.429692518489441816e-02
3.425880671642487357e-02
3.425880671642487357e-02
3.418212893644342193e-02
3.418212893644342193e-02
3.390907521815141740e-02
3.390907521815141740e-02
3.386946622931768375e-02
3.386946622931768375e-02
3.374972569063235811e-02
3.374972569063235811e-02
3.366913193449433406e-02
3.366913193449433406e-02
3.354708015277509808e-02
3.354708015277509808e-02
3.350608433251388296e-02
3.350608433251388296e-02
3.312999082471572432e-02
3.312999082471572432e-02
3.304464484777808880e-02
3.304464484777808880e-02
3.291539753262889140e-02
3.291539753262889140e-02
3.287198496093747535e-02
3.287198496093747535e-02
3.274074765339878013e-02
3.274074765339878013e-02
3.206147946123746872e-02
3.206147946123746872e-02
3.187364095171286993e-02
3.187364095171286993e-02
3.144026037928749490e-02
3.144026037928749490e-02
3.139116903369147671e-02
3.139116903369147671e-02
3.119288661943458302e-02
3.119288661943458302e-02
3.073528137209803959e-02
3.073528137209803959e-02
3.052665922506902357e-02
3.052665922506902357e-02
3.026120497436854406e-02
3.026120497436854406e-02
2.993561808638825483e-02
2.993561808638825483e-02
2.976987054202674676e-02
2.976987054202674676e-02
2.965825573673801230e-02
2.965825573673801230e-02
2.926040870847312902e-02
2.926040870847312902e-02
2.920264197682719692e-02
2.920264197682719692e-02
2.902791415783166629e-02
2.902791415783166629e-02
2.896919089308009135e-02
2.896919089308009135e-02
2.867190304542684837e-02
2.867190304542684837e-02
2.812087143343070667e-02
2.812087143343070667e-02
2.805834155542877295e-02
2.805834155542877295e-02
2.722045847550159936e-02
2.722045847550159936e-02
2.715401480998725497e-02
2.715401480998725497e-02
2.695290638062295893e-02
2.695290638062295893e-02
2.668053082549874319e-02
2.668053082549874319e-02
2.640318253392564055e-02
2.640318253392564055e-02
2.626259448955142045e-02
2.626259448955142045e-02
2.531601387605962594e-02
2.531601387605962594e-02
2.516509845035872286e-02
2.516509845035872286e-02
2.508908688533677961e-02
2.508908688533677961e-02
2.470335370711684853e-02
2.470335370711684853e-02
2.446724436013432077e-02
2.446724436013432077e-02
2.270637140356482689e-02
2.270637140356482689e-02
2.169819141768460774e-02
2.169819141768460774e-02
2.111938861553380731e-02
2.111938861553380731e-02
2.092153142267347624e-02
2.092153142267347624e-02
2.082164061403256675e-02
2.082164061403256675e-02
2.051800673160276284e-02
2.051800673160276284e-02
1.989199801505503115e-02
1.989199801505503115e-02
1.945980750812419113e-02
1.945980750812419113e-02
1.867206828244641001e-02
1.867206828244641001e-02
1.855603499573026116e-02
1.855603499573026116e-02
1.820232120434523565e-02
1.820232120434523565e-02
1.808248428866985821e-02
1.808248428866985821e-02
1.746790892435216153e-02
1.746790892435216153e-02
1.734176297327967228e-02
1.734176297327967228e-02
1.587335541913468054e-02
1.587335541913468054e-02
1.544382254530227497e-02
1.544382254530227497e-02
1.499985457834762670e-02
1.499985457834762670e-02
1.322448966369977642e-02
1.322448966369977642e-02
1.174316541110784554e-02
1.174316541110784554e-02
1.025500073501124654e-02
1.025500073501124654e-02
9.289841960393847853e-03
9.289841960393847853e-03
8.765066197366486178e-03
8.765066197366486178e-03
7.909530210262007144e-03
7.909530210262007144e-03
7.281104995513947367e-03
7.281104995513947367e-03
6.944831953478235870e-03
6.944831953478235870e-03
6.216242649609144549e-03
6.216242649609144549e-03
5.816911000628506058e-03
5.816911000628506058e-03
0.000000000000000000e+00
