1.000000000000000000e+00
9.940425157546997070e-01
4.046931862831115723e-01
9.999045133590698242e-01
1.805436015129089355e-01
9.800249338150024414e-01
2.156818509101867676e-01
2.144128084182739258e-01
9.974328875541687012e-01
8.727909326553344727e-01
9.999561309814453125e-01
2.369047999382019043e-01
1.975358426570892334e-01
9.999498724937438965e-01
9.999645948410034180e-01
8.035830259323120117e-01
1.000000000000000000e+00
9.999779462814331055e-01
7.079670429229736328e-01
9.999952912330627441e-01
9.897611141204833984e-01
3.804207742214202881e-01
9.992163181304931641e-01
6.352208852767944336e-01
1.820783019065856934e-01
9.959584474563598633e-01
4.445981979370117188e-01
1.904945671558380127e-01
9.961619377136230469e-01
1.922521591186523438e-01
2.132704555988311768e-01
9.592384099960327148e-01
4.356355965137481689e-01
9.942339658737182617e-01
4.189510345458984375e-01
9.996182918548583984e-01
2.431984841823577881e-01
9.987798929214477539e-01
9.940536618232727051e-01
9.999868869781494141e-01
1.966894567012786865e-01
1.000000000000000000e+00
9.652280807495117188e-01
9.840993881225585938e-01
9.390168190002441406e-01
9.978314042091369629e-01
1.000000000000000000e+00
9.999766349792480469e-01
9.959403276443481445e-01
9.986568689346313477e-01
9.368866682052612305e-01
9.999965429306030273e-01
9.882931709289550781e-01
9.502158164978027344e-01
9.999994635581970215e-01
8.802269101142883301e-01
9.979219436645507812e-01
9.945107698440551758e-01
9.753533601760864258e-01
3.510790169239044189e-01
9.999858140945434570e-01
1.000000000000000000e+00
8.171138763427734375e-01
1.931013762950897217e-01
8.699085712432861328e-01
2.497422397136688232e-01
3.984783589839935303e-01
9.848617315292358398e-01
9.226791858673095703e-01
5.951038599014282227e-01
2.493042051792144775e-01
9.999997615814208984e-01
8.805977702140808105e-01
1.000000000000000000e+00
2.781776785850524902e-01
1.955948472023010254e-01
9.311939477920532227e-01
9.999266862869262695e-01
1.000000000000000000e+00
9.979372024536132812e-01
9.999994635581970215e-01
9.999966621398925781e-01
1.000000000000000000e+00
9.728936553001403809e-01
6.844966411590576172e-01
9.624139070510864258e-01
1.979214847087860107e-01
9.999932050704956055e-01
9.764003753662109375e-01
9.987756013870239258e-01
7.325978279113769531e-01
9.956161975860595703e-01
1.873445510864257812e-01
9.302477836608886719e-01
3.606335818767547607e-01
2.054171562194824219e-01
9.956293702125549316e-01
4.713146090507507324e-01
9.834346771240234375e-01
9.890379309654235840e-01
6.177177429199218750e-01
1.866181790828704834e-01
1.900867521762847900e-01
8.859761953353881836e-01
7.177171707153320312e-01
3.090859055519104004e-01
1.000000000000000000e+00
9.999582171440124512e-01
2.417219579219818115e-01
9.618707895278930664e-01
7.820352315902709961e-01
9.243145585060119629e-01
9.998326301574707031e-01
4.352005422115325928e-01
5.128715634346008301e-01
1.000000000000000000e+00
9.031399488449096680e-01
1.000000000000000000e+00
9.996425509452819824e-01
9.969726800918579102e-01
2.366301715373992920e-01
9.990462064743041992e-01
1.950189173221588135e-01
9.589329957962036133e-01
9.586137533187866211e-01
2.495886683464050293e-01
6.399937272071838379e-01
9.965338110923767090e-01
6.762761473655700684e-01
2.428108453750610352e-01
4.415398836135864258e-01
1.000000000000000000e+00
2.616754770278930664e-01
2.210533320903778076e-01
9.997439384460449219e-01
9.999639987945556641e-01
9.999983310699462891e-01
3.310641050338745117e-01
9.999780058860778809e-01
1.000000000000000000e+00
9.999309778213500977e-01
4.116589128971099854e-01
1.805364489555358887e-01
6.910988092422485352e-01
8.571420907974243164e-01
1.839048266410827637e-01
6.654891371726989746e-01
9.118707180023193359e-01
1.888813376426696777e-01
9.999812245368957520e-01
9.273748397827148438e-01
1.844093203544616699e-01
1.986025869846343994e-01
2.576836943626403809e-01
4.019525945186614990e-01
1.000000000000000000e+00
3.762935101985931396e-01
9.651621580123901367e-01
1.000000000000000000e+00
7.303017377853393555e-01
1.000000000000000000e+00
2.098532617092132568e-01
2.123880088329315186e-01
9.412699937820434570e-01
8.170022368431091309e-01
2.531914114952087402e-01
9.152284264564514160e-01
9.996736049652099609e-01
8.660818338394165039e-01
1.794232726097106934e-01
8.908748626708984375e-01
9.942936301231384277e-01
9.383626580238342285e-01
9.973378181457519531e-01
1.000000000000000000e+00
2.315192222595214844e-01
2.887841761112213135e-01
3.546218872070312500e-01
9.996158480644226074e-01
4.034331440925598145e-01
1.000000000000000000e+00
8.119449615478515625e-01
3.600861728191375732e-01
5.400332808494567871e-01
9.959193468093872070e-01
1.000000000000000000e+00
9.998522996902465820e-01
1.000000000000000000e+00
9.996527433395385742e-01
5.172532796859741211e-01
9.999169111251831055e-01
2.497728168964385986e-01
1.000000000000000000e+00
2.311113774776458740e-01
2.270005941390991211e-01
5.350158810615539551e-01
1.989193558692932129e-01
1.847725808620452881e-01
1.920340061187744141e-01
9.990206360816955566e-01
9.553050398826599121e-01
9.999345541000366211e-01
7.487344741821289062e-01
9.814553260803222656e-01
6.580143570899963379e-01
2.088565528392791748e-01
9.974472522735595703e-01
9.929832220077514648e-01
9.999766945838928223e-01
4.019060730934143066e-01
5.243233442306518555e-01
9.877516627311706543e-01
1.898002922534942627e-01
1.871956884860992432e-01
9.989668130874633789e-01
7.953608632087707520e-01
1.000000000000000000e+00
4.812047481536865234e-01
1.824923157691955566e-01
9.989864826202392578e-01
2.185233235359191895e-01
1.891624033451080322e-01
9.997633695602416992e-01
2.213886976242065430e-01
9.994511008262634277e-01
2.759286761283874512e-01
9.906259775161743164e-01
6.908974051475524902e-01
9.452017545700073242e-01
9.425445795059204102e-01
5.905507802963256836e-01
2.146027684211730957e-01
9.701815843582153320e-01
7.706096768379211426e-01
1.000000000000000000e+00
9.989587068557739258e-01
9.999257326126098633e-01
9.999960660934448242e-01
1.950130760669708252e-01
7.559533715248107910e-01
5.125138759613037109e-01
5.411403179168701172e-01
9.940384626388549805e-01
2.348661124706268311e-01
9.979318380355834961e-01
9.689803123474121094e-01
2.911742329597473145e-01
9.934507608413696289e-01
9.714486598968505859e-01
9.999994039535522461e-01
2.208869457244873047e-01
3.599080741405487061e-01
2.409362196922302246e-01
1.000000000000000000e+00
9.144555926322937012e-01
5.994538664817810059e-01
9.999438524246215820e-01
8.008911013603210449e-01
9.999961853027343750e-01
9.894798994064331055e-01
2.054782509803771973e-01
1.000000000000000000e+00
2.440949678421020508e-01
2.056202888488769531e-01
1.000000000000000000e+00
2.238593697547912598e-01
9.999997615814208984e-01
9.993485212326049805e-01
9.954719543457031250e-01
3.979250192642211914e-01
6.509403586387634277e-01
1.856564581394195557e-01
1.000000000000000000e+00
3.337938189506530762e-01
3.821051716804504395e-01
6.706190705299377441e-01
9.999904036521911621e-01
3.387903571128845215e-01
4.395791590213775635e-01
9.929482936859130859e-01
2.340619266033172607e-01
8.328699469566345215e-01
9.946316480636596680e-01
1.000000000000000000e+00
9.893164038658142090e-01
1.000000000000000000e+00
9.997819662094116211e-01
9.999808669090270996e-01
9.645388126373291016e-01
2.012768983840942383e-01
2.506696581840515137e-01
9.973840117454528809e-01
1.000000000000000000e+00
2.169423699378967285e-01
9.479320645332336426e-01
2.065249681472778320e-01
9.403725862503051758e-01
8.877401351928710938e-01
9.642774462699890137e-01
9.523596763610839844e-01
6.423429846763610840e-01
2.552807331085205078e-01
9.876664876937866211e-01
9.005304574966430664e-01
9.385694265365600586e-01
6.357915401458740234e-01
9.983282685279846191e-01
8.780215978622436523e-01
3.702920079231262207e-01
2.131068706512451172e-01
2.415424287319183350e-01
4.635936617851257324e-01
1.861637830734252930e-01
9.991752505302429199e-01
1.000000000000000000e+00
2.095389664173126221e-01
9.999845027923583984e-01
3.901970982551574707e-01
7.818105816841125488e-01
4.488618671894073486e-01
4.812284111976623535e-01
3.610264062881469727e-01
1.925283074378967285e-01
8.147760033607482910e-01
9.989698529243469238e-01
9.981145262718200684e-01
9.999986886978149414e-01
2.147400677204132080e-01
9.408286809921264648e-01
9.999940395355224609e-01
4.390278160572052002e-01
9.899450540542602539e-01
1.869024634361267090e-01
1.000000000000000000e+00
9.712662696838378906e-01
9.999095201492309570e-01
9.709019660949707031e-01
2.068637609481811523e-01
8.887265920639038086e-01
3.313712477684020996e-01
9.894254803657531738e-01
1.818413138389587402e-01
4.493628442287445068e-01
1.000000000000000000e+00
3.176342844963073730e-01
1.931966245174407959e-01
5.393896102905273438e-01
2.648307085037231445e-01
2.494571208953857422e-01
9.927684068679809570e-01
5.463638305664062500e-01
4.077869951725006104e-01
9.991956949234008789e-01
3.729078173637390137e-01
9.559452533721923828e-01
2.002176046371459961e-01
9.463309049606323242e-01
1.925631463527679443e-01
2.493501305580139160e-01
9.992564916610717773e-01
9.132246971130371094e-01
9.999996423721313477e-01
9.969919919967651367e-01
9.967982769012451172e-01
9.392336606979370117e-01
6.225866675376892090e-01
1.000000000000000000e+00
8.624447584152221680e-01
9.993594884872436523e-01
1.783631145954132080e-01
9.712709188461303711e-01
9.278666973114013672e-01
9.981824159622192383e-01
9.996498823165893555e-01
9.974765777587890625e-01
5.758182406425476074e-01
9.998965859413146973e-01
2.517531514167785645e-01
1.000000000000000000e+00
9.999985098838806152e-01
4.630902707576751709e-01
9.999985098838806152e-01
4.295950829982757568e-01
9.845085144042968750e-01
9.998785257339477539e-01
9.999992847442626953e-01
9.983505010604858398e-01
9.465566873550415039e-01
4.130645394325256348e-01
3.468649983406066895e-01
9.907903671264648438e-01
3.972929418087005615e-01
1.824437379837036133e-01
9.999848604202270508e-01
2.354601323604583740e-01
6.678836941719055176e-01
9.998087882995605469e-01
2.094015479087829590e-01
9.994316101074218750e-01
5.055924654006958008e-01
5.199213624000549316e-01
9.741975069046020508e-01
9.985231161117553711e-01
1.000000000000000000e+00
9.964708089828491211e-01
9.999774098396301270e-01
9.557521343231201172e-01
9.901837110519409180e-01
2.275866866111755371e-01
2.067758142948150635e-01
1.000000000000000000e+00
2.117435932159423828e-01
7.930575609207153320e-01
1.000000000000000000e+00
8.207772970199584961e-01
9.612510204315185547e-01
9.978998899459838867e-01
9.996592998504638672e-01
9.336374998092651367e-01
3.928068876266479492e-01
4.236704707145690918e-01
9.996381998062133789e-01
9.973477125167846680e-01
7.893747091293334961e-01
9.999743700027465820e-01
9.999551773071289062e-01
9.908038377761840820e-01
9.932518005371093750e-01
2.406015694141387939e-01
9.999960660934448242e-01
5.807382464408874512e-01
2.182949483394622803e-01
9.992345571517944336e-01
2.458552122116088867e-01
2.176979482173919678e-01
9.769071340560913086e-01
9.985183477401733398e-01
3.355513215065002441e-01
2.020362317562103271e-01
1.000000000000000000e+00
9.999703168869018555e-01
9.951040744781494141e-01
2.392108738422393799e-01
8.901714086532592773e-01
9.999994039535522461e-01
9.979916214942932129e-01
3.816789388656616211e-01
9.938982129096984863e-01
9.993625283241271973e-01
9.996376037597656250e-01
9.998041987419128418e-01
8.174691200256347656e-01
9.940066933631896973e-01
8.183609247207641602e-01
9.999953508377075195e-01
9.973090887069702148e-01
2.140722274780273438e-01
9.897640943527221680e-01
4.255800247192382812e-01
9.964888095855712891e-01
7.838835716247558594e-01
9.989036321640014648e-01
6.898440122604370117e-01
5.389414429664611816e-01
9.998604059219360352e-01
9.999835491180419922e-01
7.850624322891235352e-01
9.952663183212280273e-01
8.485412001609802246e-01
4.874183833599090576e-01
6.093875169754028320e-01
9.998452663421630859e-01
2.152089476585388184e-01
8.527116775512695312e-01
1.000000000000000000e+00
9.997644424438476562e-01
9.983561038970947266e-01
7.754449844360351562e-01
9.973172545433044434e-01
9.999977350234985352e-01
9.995447993278503418e-01
9.994144439697265625e-01
9.984273910522460938e-01
9.999939799308776855e-01
2.064533233642578125e-01
9.999961853027343750e-01
2.557584345340728760e-01
1.953990459442138672e-01
2.404510676860809326e-01
1.000000000000000000e+00
9.978067874908447266e-01
9.982620477676391602e-01
1.861262023448944092e-01
3.834356665611267090e-01
9.779700040817260742e-01
4.043757915496826172e-01
1.000000000000000000e+00
2.360343635082244873e-01
9.999745488166809082e-01
9.229931831359863281e-01
9.999992847442626953e-01
9.690956473350524902e-01
1.000000000000000000e+00
9.998680353164672852e-01
1.898275017738342285e-01
9.005138874053955078e-01
9.491123557090759277e-01
8.856019973754882812e-01
3.310438394546508789e-01
9.982441663742065430e-01
3.293799161911010742e-01
9.999102354049682617e-01
3.177886903285980225e-01
9.828420877456665039e-01
9.999704360961914062e-01
2.296855747699737549e-01
1.836889982223510742e-01
1.853518486022949219e-01
3.814989030361175537e-01
4.223989844322204590e-01
9.999995827674865723e-01
3.064821362495422363e-01
7.053585052490234375e-01
2.519654035568237305e-01
1.901593208312988281e-01
9.999889731407165527e-01
9.994809627532958984e-01
9.997500181198120117e-01
1.000000000000000000e+00
9.142093658447265625e-01
1.000000000000000000e+00
2.000538706779479980e-01
2.131434381008148193e-01
4.850819408893585205e-01
1.000000000000000000e+00
4.704257547855377197e-01
7.815151214599609375e-01
1.848610639572143555e-01
9.309557080268859863e-01
3.466071486473083496e-01
9.999982118606567383e-01
9.997234344482421875e-01
9.845324158668518066e-01
3.435357213020324707e-01
9.963545799255371094e-01
2.051753997802734375e-01
1.949533820152282715e-01
2.926226258277893066e-01
1.000000000000000000e+00
2.519086599349975586e-01
9.998891353607177734e-01
2.399255335330963135e-01
9.802457094192504883e-01
9.999994635581970215e-01
9.999868869781494141e-01
3.125590682029724121e-01
9.999974370002746582e-01
9.770469665527343750e-01
4.926150739192962646e-01
8.814488649368286133e-01
9.999998211860656738e-01
2.362368702888488770e-01
8.206338882446289062e-01
2.148779034614562988e-01
5.931011438369750977e-01
9.998499155044555664e-01
9.937052726745605469e-01
2.312156260013580322e-01
2.498854100704193115e-01
9.959220290184020996e-01
3.647123575210571289e-01
5.230898261070251465e-01
5.929565429687500000e-01
9.150371551513671875e-01
2.223755121231079102e-01
2.874190509319305420e-01
9.339109063148498535e-01
9.999992847442626953e-01
1.000000000000000000e+00
9.999980926513671875e-01
8.092951774597167969e-01
5.660097002983093262e-01
9.999997019767761230e-01
9.999938011169433594e-01
3.787181675434112549e-01
2.162592709064483643e-01
9.297291040420532227e-01
3.551934361457824707e-01
3.942928612232208252e-01
9.997685551643371582e-01
6.107979416847229004e-01
4.475187659263610840e-01
1.000000000000000000e+00
9.994621276855468750e-01
7.957143783569335938e-01
1.998919546604156494e-01
3.764400184154510498e-01
2.115820646286010742e-01
8.849064111709594727e-01
2.008849978446960449e-01
9.999567270278930664e-01
9.999885559082031250e-01
1.813833415508270264e-01
2.325133979320526123e-01
1.000000000000000000e+00
9.956407546997070312e-01
1.805722415447235107e-01
9.999996423721313477e-01
2.311904132366180420e-01
2.381499409675598145e-01
3.051674365997314453e-01
9.989855289459228516e-01
1.887123882770538330e-01
4.062759876251220703e-01
9.840993881225585938e-01
9.999988675117492676e-01
3.848024308681488037e-01
9.927890300750732422e-01
9.785073995590209961e-01
1.000000000000000000e+00
3.999682962894439697e-01
5.861055254936218262e-01
9.971216320991516113e-01
7.905145287513732910e-01
1.803905367851257324e-01
9.998658895492553711e-01
3.242028355598449707e-01
4.183656871318817139e-01
3.907491564750671387e-01
9.999496936798095703e-01
9.892596006393432617e-01
5.707594156265258789e-01
9.999706149101257324e-01
9.998407959938049316e-01
1.000000000000000000e+00
2.838611006736755371e-01
2.342060506343841553e-01
9.945869445800781250e-01
2.058635056018829346e-01
2.008371353149414062e-01
2.971992194652557373e-01
9.999862909317016602e-01
3.870801031589508057e-01
7.905235290527343750e-01
1.788934171199798584e-01
2.572973668575286865e-01
2.423578798770904541e-01
9.999995231628417969e-01
9.983254075050354004e-01
1.000000000000000000e+00
9.999947547912597656e-01
9.999981522560119629e-01
1.940108537673950195e-01
2.452436387538909912e-01
2.283599376678466797e-01
1.000000000000000000e+00
9.999995231628417969e-01
9.999974966049194336e-01
9.998469352722167969e-01
9.991456270217895508e-01
5.286187529563903809e-01
1.838307380676269531e-01
4.015701413154602051e-01
3.749170303344726562e-01
1.000000000000000000e+00
1.814917922019958496e-01
5.728209614753723145e-01
3.148646354675292969e-01
6.578522920608520508e-01
2.586761116981506348e-01
9.993428587913513184e-01
7.907145023345947266e-01
9.935306310653686523e-01
1.000000000000000000e+00
5.012406110763549805e-01
1.953152418136596680e-01
1.000000000000000000e+00
2.907053232192993164e-01
9.999934434890747070e-01
9.995152950286865234e-01
3.628758788108825684e-01
9.999969005584716797e-01
9.997887611389160156e-01
1.000000000000000000e+00
2.589084208011627197e-01
9.999998807907104492e-01
9.952876567840576172e-01
9.775097370147705078e-01
8.088527917861938477e-01
3.388669490814208984e-01
9.911292791366577148e-01
9.993877410888671875e-01
9.999427199363708496e-01
9.981330633163452148e-01
8.741056919097900391e-01
6.425961256027221680e-01
5.064404606819152832e-01
9.999574422836303711e-01
3.503235578536987305e-01
4.003239870071411133e-01
1.945438981056213379e-01
1.835642158985137939e-01
8.423259258270263672e-01
9.999970197677612305e-01
2.039099335670471191e-01
2.063220441341400146e-01
1.795096099376678467e-01
5.253981351852416992e-01
3.852169513702392578e-01
2.381156682968139648e-01
1.892118752002716064e-01
5.609196424484252930e-01
2.317829132080078125e-01
9.980868101119995117e-01
7.273954749107360840e-01
2.119621932506561279e-01
1.968753933906555176e-01
3.272313177585601807e-01
1.915464103221893311e-01
5.995542407035827637e-01
5.522668361663818359e-01
1.864912211894989014e-01
9.959371089935302734e-01
3.002682030200958252e-01
2.345891594886779785e-01
1.911300718784332275e-01
2.117202877998352051e-01
9.999995231628417969e-01
9.869294166564941406e-01
9.792114496231079102e-01
9.787048101425170898e-01
1.000000000000000000e+00
1.960164904594421387e-01
1.921812295913696289e-01
2.735653221607208252e-01
2.255324423313140869e-01
2.164816260337829590e-01
3.370085954666137695e-01
9.679361581802368164e-01
1.804136931896209717e-01
9.999749660491943359e-01
9.986922740936279297e-01
9.267401695251464844e-01
8.363058567047119141e-01
9.999831914901733398e-01
9.967307448387145996e-01
9.998176097869873047e-01
2.313249111175537109e-01
1.850467324256896973e-01
9.999995231628417969e-01
4.395446181297302246e-01
1.943134367465972900e-01
3.472306728363037109e-01
3.782416582107543945e-01
9.999969005584716797e-01
2.174095809459686279e-01
2.482767403125762939e-01
9.999808073043823242e-01
2.012826502323150635e-01
9.966335296630859375e-01
9.991099238395690918e-01
9.783658981323242188e-01
8.601557016372680664e-01
1.000000000000000000e+00
9.887658357620239258e-01
2.042710185050964355e-01
2.453230619430541992e-01
3.738052248954772949e-01
5.065218210220336914e-01
9.992136359214782715e-01
2.208152413368225098e-01
1.000000000000000000e+00
2.966904640197753906e-01
9.117370247840881348e-01
9.999940991401672363e-01
9.999266862869262695e-01
2.082711160182952881e-01
2.322871387004852295e-01
6.728551387786865234e-01
2.814613580703735352e-01
2.419811785221099854e-01
9.872571229934692383e-01
1.000000000000000000e+00
4.110178649425506592e-01
2.227667570114135742e-01
9.935451149940490723e-01
8.227431178092956543e-01
9.935446977615356445e-01
9.964520931243896484e-01
9.959924221038818359e-01
9.996776580810546875e-01
9.995006322860717773e-01
9.940483570098876953e-01
9.998903870582580566e-01
2.167198359966278076e-01
1.000000000000000000e+00
1.904574334621429443e-01
2.538851499557495117e-01
1.781327128410339355e-01
9.999024868011474609e-01
9.999971389770507812e-01
2.072305679321289062e-01
3.858461081981658936e-01
1.792666018009185791e-01
9.999997019767761230e-01
1.858523488044738770e-01
2.393642067909240723e-01
9.251509904861450195e-01
9.014050960540771484e-01
5.139907002449035645e-01
5.318592190742492676e-01
8.251762390136718750e-01
2.075803577899932861e-01
9.125521183013916016e-01
9.142411947250366211e-01
8.854159116744995117e-01
9.989957809448242188e-01
2.727723717689514160e-01
7.644181251525878906e-01
9.986981153488159180e-01
3.660622537136077881e-01
9.540902376174926758e-01
9.999973773956298828e-01
9.807968139648437500e-01
2.651096880435943604e-01
9.954463839530944824e-01
9.999789595603942871e-01
1.000000000000000000e+00
9.999727010726928711e-01
9.998722076416015625e-01
3.864588141441345215e-01
9.515597820281982422e-01
7.354708313941955566e-01
9.526597857475280762e-01
9.999446272850036621e-01
9.401112198829650879e-01
2.472840547561645508e-01
9.996854662895202637e-01
9.998971819877624512e-01
4.402137398719787598e-01
9.804639816284179688e-01
5.919403433799743652e-01
9.999995231628417969e-01
6.059024930000305176e-01
7.867787480354309082e-01
9.993283748626708984e-01
9.999974966049194336e-01
3.250224888324737549e-01
9.963649511337280273e-01
9.234139919281005859e-01
9.883471727371215820e-01
7.574601173400878906e-01
9.997811317443847656e-01
4.418637454509735107e-01
8.937815427780151367e-01
2.075978219509124756e-01
9.999306797981262207e-01
9.973065853118896484e-01
9.999347925186157227e-01
1.808409392833709717e-01
9.994460940361022949e-01
9.999979138374328613e-01
9.992073774337768555e-01
1.000000000000000000e+00
2.479572594165802002e-01
9.739899039268493652e-01
9.995646476745605469e-01
2.042334675788879395e-01
9.026259183883666992e-01
4.444939494132995605e-01
9.998997449874877930e-01
1.000000000000000000e+00
1.868396401405334473e-01
4.468324184417724609e-01
9.884208440780639648e-01
9.819488525390625000e-01
1.000000000000000000e+00
9.117674231529235840e-01
9.877765178680419922e-01
8.840932250022888184e-01
1.901304125785827637e-01
9.996541738510131836e-01
9.999817609786987305e-01
1.000000000000000000e+00
2.237097918987274170e-01
1.933354139328002930e-01
2.179990410804748535e-01
1.000000000000000000e+00
1.000000000000000000e+00
9.966683387756347656e-01
9.946082830429077148e-01
9.997893571853637695e-01
2.826895117759704590e-01
4.016183614730834961e-01
3.363735377788543701e-01
6.042670011520385742e-01
8.644554615020751953e-01
9.999403953552246094e-01
1.796634495258331299e-01
9.998447895050048828e-01
9.907853007316589355e-01
2.221965491771697998e-01
9.210312366485595703e-01
9.999051094055175781e-01
4.667651057243347168e-01
8.037031888961791992e-01
3.362955451011657715e-01
2.194041609764099121e-01
2.383529245853424072e-01
1.000000000000000000e+00
2.409150302410125732e-01
2.776145339012145996e-01
9.999980330467224121e-01
9.806658029556274414e-01
9.996440410614013672e-01
5.100471377372741699e-01
9.999994039535522461e-01
9.999665021896362305e-01
3.055803775787353516e-01
1.000000000000000000e+00
9.737471342086791992e-01
9.935746192932128906e-01
3.527327179908752441e-01
8.717401027679443359e-01
1.807949542999267578e-01
3.379792571067810059e-01
3.025373220443725586e-01
9.999809265136718750e-01
6.508855819702148438e-01
4.340674877166748047e-01
3.259618282318115234e-01
2.044745385646820068e-01
1.809518337249755859e-01
6.764649748802185059e-01
9.031682014465332031e-01
5.221476554870605469e-01
2.456910908222198486e-01
9.998557567596435547e-01
3.372115492820739746e-01
9.752168655395507812e-01
3.072946965694427490e-01
9.454066753387451172e-01
2.119067013263702393e-01
3.442812561988830566e-01
5.474128723144531250e-01
1.985755264759063721e-01
2.058324813842773438e-01
1.994931101799011230e-01
3.369166553020477295e-01
2.119007706642150879e-01
4.255731701850891113e-01
2.216531336307525635e-01
6.429512500762939453e-01
4.109321832656860352e-01
4.151388108730316162e-01
2.311565577983856201e-01
1.929643452167510986e-01
9.979577660560607910e-01
1.901723146438598633e-01
4.020335078239440918e-01
3.750806450843811035e-01
1.884028017520904541e-01
2.661351561546325684e-01
2.044161856174468994e-01
2.605559229850769043e-01
2.527667284011840820e-01
2.231743931770324707e-01
5.618155598640441895e-01
3.060855269432067871e-01
1.849267482757568359e-01
2.258291244506835938e-01
7.304157018661499023e-01
4.106842875480651855e-01
2.407991290092468262e-01
2.222879230976104736e-01
2.059450149536132812e-01
1.830839514732360840e-01
9.812266826629638672e-01
1.873442530632019043e-01
8.226308226585388184e-01
2.269918620586395264e-01
2.146388888359069824e-01
1.983883678913116455e-01
5.879189968109130859e-01
1.979499757289886475e-01
5.016123652458190918e-01
3.617168664932250977e-01
1.873653531074523926e-01
2.192831337451934814e-01
2.029440104961395264e-01
3.137716054916381836e-01
4.139080643653869629e-01
2.467167973518371582e-01
7.376971244812011719e-01
2.991800606250762939e-01
5.385323166847229004e-01
2.707143425941467285e-01
4.684333205223083496e-01
2.029026150703430176e-01
2.300043702125549316e-01
2.104371786117553711e-01
2.008175849914550781e-01
1.796689927577972412e-01
2.676337659358978271e-01
1.808910071849822998e-01
1.931123137474060059e-01
2.733971476554870605e-01
1.844092309474945068e-01
1.882224678993225098e-01
3.841493427753448486e-01
1.876041889190673828e-01
2.241517901420593262e-01
2.066733241081237793e-01
2.193093895912170410e-01
2.588899135589599609e-01
2.068045735359191895e-01
2.788564562797546387e-01
2.512805461883544922e-01
1.784763634204864502e-01
2.871664464473724365e-01
1.935069561004638672e-01
2.170373797416687012e-01
1.893151104450225830e-01
1.822371184825897217e-01
3.463707566261291504e-01
5.025418996810913086e-01
2.247042059898376465e-01
2.281031310558319092e-01
3.343316316604614258e-01
2.005341053009033203e-01
3.704860806465148926e-01
1.881120204925537109e-01
4.043229222297668457e-01
2.131735086441040039e-01
4.427019357681274414e-01
3.194597363471984863e-01
3.113225102424621582e-01
3.173499405384063721e-01
7.047200202941894531e-01
2.259811162948608398e-01
8.584829568862915039e-01
3.387892246246337891e-01
4.034199416637420654e-01
4.545386135578155518e-01
1.855110824108123779e-01
1.794086992740631104e-01
2.052684724330902100e-01
6.051918268203735352e-01
4.531044960021972656e-01
1.995837986469268799e-01
3.060500025749206543e-01
7.371017932891845703e-01
2.138735353946685791e-01
2.123132944107055664e-01
2.454503774642944336e-01
1.922061145305633545e-01
1.789481341838836670e-01
3.091223835945129395e-01
2.198685705661773682e-01
2.575411796569824219e-01
2.059749960899353027e-01
2.929357290267944336e-01
3.193946480751037598e-01
4.523138403892517090e-01
7.544903755187988281e-01
2.917594909667968750e-01
1.927873492240905762e-01
1.786549687385559082e-01
2.087741494178771973e-01
2.010340988636016846e-01
2.032751142978668213e-01
1.821468174457550049e-01
2.614772915840148926e-01
2.109810411930084229e-01
1.980582177639007568e-01
3.639551997184753418e-01
1.787234544754028320e-01
2.190573215484619141e-01
1.842732131481170654e-01
3.316025435924530029e-01
2.168532013893127441e-01
2.015321850776672363e-01
2.880570888519287109e-01
2.112047672271728516e-01
2.655162811279296875e-01
2.234619259834289551e-01
1.806467175483703613e-01
9.999442696571350098e-01
3.829261362552642822e-01
1.859926879405975342e-01
7.716492414474487305e-01
1.843360960483551025e-01
1.870839893817901611e-01
1.989790797233581543e-01
2.502513527870178223e-01
2.408897280693054199e-01
6.310048103332519531e-01
1.818919777870178223e-01
3.379349112510681152e-01
2.406636774539947510e-01
1.901798844337463379e-01
3.261755704879760742e-01
3.079481720924377441e-01
1.861294507980346680e-01
1.855091452598571777e-01
1.789488792419433594e-01
1.959715783596038818e-01
5.269320011138916016e-01
2.040209174156188965e-01
3.308695256710052490e-01
1.927233338356018066e-01
2.402019500732421875e-01
1.865428388118743896e-01
2.971482276916503906e-01
2.803753018379211426e-01
2.358837127685546875e-01
4.609846770763397217e-01
1.933556795120239258e-01
1.962985396385192871e-01
3.012396693229675293e-01
1.861425340175628662e-01
1.966679692268371582e-01
2.614104151725769043e-01
2.086011469364166260e-01
2.242092788219451904e-01
1.795343756675720215e-01
2.186590135097503662e-01
2.747463583946228027e-01
9.746427536010742188e-01
2.037774026393890381e-01
8.973482847213745117e-01
2.446613311767578125e-01
2.564273476600646973e-01
5.301653146743774414e-01
2.801866531372070312e-01
1.782561242580413818e-01
1.814427375793457031e-01
9.999994039535522461e-01
2.685459852218627930e-01
4.148899316787719727e-01
9.373617768287658691e-01
4.003482758998870850e-01
2.301631867885589600e-01
5.771527290344238281e-01
2.175590395927429199e-01
1.920543611049652100e-01
2.019630372524261475e-01
2.021001875400543213e-01
2.005301713943481445e-01
2.170216441154479980e-01
3.727228641510009766e-01
1.881189346313476562e-01
2.189582586288452148e-01
1.822220087051391602e-01
1.818294823169708252e-01
1.809024214744567871e-01
2.017630040645599365e-01
1.850871443748474121e-01
2.002457678318023682e-01
2.564312815666198730e-01
1.815974414348602295e-01
5.369740724563598633e-01
1.951037049293518066e-01
2.026245594024658203e-01
1.952514052391052246e-01
1.910876631736755371e-01
3.847628533840179443e-01
1.815403997898101807e-01
1.807860732078552246e-01
1.918672919273376465e-01
1.847493350505828857e-01
2.163530588150024414e-01
2.141796052455902100e-01
3.496519327163696289e-01
3.302512764930725098e-01
1.835129559040069580e-01
3.088071942329406738e-01
2.889836430549621582e-01
3.147952556610107422e-01
5.284314751625061035e-01
3.975567817687988281e-01
3.216267228126525879e-01
1.887243688106536865e-01
1.912147998809814453e-01
2.237922549247741699e-01
1.851919889450073242e-01
2.067872583866119385e-01
1.972489356994628906e-01
4.632690548896789551e-01
3.214108943939208984e-01
3.019651472568511963e-01
1.856577694416046143e-01
2.722930014133453369e-01
2.197591066360473633e-01
4.479831159114837646e-01
1.911692619323730469e-01
4.330491125583648682e-01
2.105845510959625244e-01
6.526932120323181152e-01
1.941151320934295654e-01
3.440011143684387207e-01
1.973425149917602539e-01
2.074751257896423340e-01
1.825438439846038818e-01
1.873429119586944580e-01
9.746367931365966797e-01
6.723824739456176758e-01
2.195306718349456787e-01
1.934612691402435303e-01
2.091422379016876221e-01
1.801977455615997314e-01
1.794698834419250488e-01
1.796474456787109375e-01
2.184825241565704346e-01
6.163491010665893555e-01
2.684274017810821533e-01
5.162449479103088379e-01
1.833385825157165527e-01
1.925759017467498779e-01
1.879146397113800049e-01
4.009735584259033203e-01
2.100383639335632324e-01
6.778683066368103027e-01
1.799806654453277588e-01
7.648082971572875977e-01
2.374451756477355957e-01
5.263252854347229004e-01
2.384703159332275391e-01
2.681029140949249268e-01
2.369340360164642334e-01
2.880204319953918457e-01
3.104617595672607422e-01
2.002047300338745117e-01
5.329370498657226562e-01
5.086138844490051270e-01
2.629590332508087158e-01
3.211678266525268555e-01
2.495890855789184570e-01
6.724905371665954590e-01
2.457268238067626953e-01
1.864316165447235107e-01
5.709316134452819824e-01
3.569762408733367920e-01
6.914616823196411133e-01
4.801606535911560059e-01
7.651385068893432617e-01
6.094588041305541992e-01
7.977116703987121582e-01
2.340946197509765625e-01
2.272785007953643799e-01
1.839687526226043701e-01
4.654772579669952393e-01
5.321811437606811523e-01
4.964091777801513672e-01
2.063380181789398193e-01
3.033784627914428711e-01
7.494887113571166992e-01
2.322784066200256348e-01
2.148708701133728027e-01
2.457672953605651855e-01
7.406703829765319824e-01
2.116054892539978027e-01
5.139938592910766602e-01
4.312752783298492432e-01
2.839545309543609619e-01
2.513297796249389648e-01
2.763743996620178223e-01
1.874196231365203857e-01
2.615715265274047852e-01
2.620178461074829102e-01
2.473702728748321533e-01
2.156245112419128418e-01
3.064540624618530273e-01
4.743275344371795654e-01
2.041165232658386230e-01
2.313936352729797363e-01
2.795556485652923584e-01
1.889633834362030029e-01
1.852103471755981445e-01
9.999722242355346680e-01
4.445472061634063721e-01
1.876733303070068359e-01
5.105736851692199707e-01
5.907217860221862793e-01
2.210736870765686035e-01
2.066432237625122070e-01
4.483494460582733154e-01
2.110019326210021973e-01
2.090916335582733154e-01
5.740873217582702637e-01
2.686775326728820801e-01
2.018409967422485352e-01
3.037303984165191650e-01
3.555788993835449219e-01
3.549125790596008301e-01
4.165286719799041748e-01
3.915977180004119873e-01
2.080133855342864990e-01
2.776909172534942627e-01
5.146138072013854980e-01
2.821888029575347900e-01
9.275944232940673828e-01
2.659683823585510254e-01
5.810862183570861816e-01
9.074994921684265137e-01
2.018705606460571289e-01
4.162933230400085449e-01
2.405202090740203857e-01
1.788948476314544678e-01
2.020189762115478516e-01
1.968845427036285400e-01
3.361757993698120117e-01
1.959799528121948242e-01
2.726269960403442383e-01
3.644212186336517334e-01
2.120679020881652832e-01
7.526657581329345703e-01
3.014135360717773438e-01
4.524321556091308594e-01
7.766336202621459961e-01
7.136203050613403320e-01
4.039884507656097412e-01
2.310185730457305908e-01
1.865276992321014404e-01
2.689077854156494141e-01
6.987273097038269043e-01
2.753033041954040527e-01
2.631804347038269043e-01
2.367138564586639404e-01
1.894334256649017334e-01
2.020103335380554199e-01
2.717453837394714355e-01
3.956002593040466309e-01
1.847535073757171631e-01
2.014681100845336914e-01
2.269246578216552734e-01
7.618633508682250977e-01
1.964475512504577637e-01
1.858940124511718750e-01
8.187963962554931641e-01
2.578153610229492188e-01
2.270438671112060547e-01
3.285193443298339844e-01
2.171510756015777588e-01
2.934787273406982422e-01
2.608557939529418945e-01
1.928228437900543213e-01
9.910755157470703125e-01
1.815735697746276855e-01
4.978651106357574463e-01
1.857030987739562988e-01
1.885986030101776123e-01
2.329176366329193115e-01
2.375549972057342529e-01
4.915524721145629883e-01
2.496550381183624268e-01
1.962648928165435791e-01
2.817257642745971680e-01
3.967985808849334717e-01
5.463883280754089355e-01
1.828178167343139648e-01
1.846811175346374512e-01
3.705146312713623047e-01
2.258043289184570312e-01
1.988436579704284668e-01
2.088701426982879639e-01
2.090606391429901123e-01
3.744608163833618164e-01
1.831580400466918945e-01
2.426525652408599854e-01
1.905967891216278076e-01
1.853678822517395020e-01
1.970552206039428711e-01
1.969712972640991211e-01
1.907064020633697510e-01
1.956001520156860352e-01
1.787016093730926514e-01
2.233345508575439453e-01
2.549619078636169434e-01
4.297323822975158691e-01
9.729965925216674805e-01
1.792099475860595703e-01
3.523634672164916992e-01
3.176081180572509766e-01
1.879235506057739258e-01
2.303407490253448486e-01
7.032150030136108398e-01
1.893317103385925293e-01
2.276064157485961914e-01
1.877626180648803711e-01
6.563531160354614258e-01
9.177948236465454102e-01
2.389312088489532471e-01
2.190900444984436035e-01
3.868683874607086182e-01
3.745776414871215820e-01
1.782738268375396729e-01
3.071890473365783691e-01
2.605219483375549316e-01
2.079556286334991455e-01
9.588157534599304199e-01
4.301977157592773438e-01
9.563647508621215820e-01
3.765503764152526855e-01
5.946627259254455566e-01
3.010075390338897705e-01
1.826109886169433594e-01
1.894992291927337646e-01
1.818336546421051025e-01
2.199636399745941162e-01
1.791356503963470459e-01
4.105239510536193848e-01
2.058441936969757080e-01
1.798064708709716797e-01
1.884338259696960449e-01
6.703547239303588867e-01
8.475676774978637695e-01
1.881671845912933350e-01
2.658923864364624023e-01
1.939733624458312988e-01
2.421212792396545410e-01
2.786643803119659424e-01
1.827085912227630615e-01
1.780354380607604980e-01
1.800737380981445312e-01
1.804888248443603516e-01
2.329390645027160645e-01
2.047986090183258057e-01
2.770459055900573730e-01
1.791894733905792236e-01
3.189027905464172363e-01
1.790918111801147461e-01
2.739361524581909180e-01
4.966349005699157715e-01
5.482276678085327148e-01
1.997525393962860107e-01
2.188083529472351074e-01
1.869729757308959961e-01
3.747149109840393066e-01
2.281767129898071289e-01
2.614398598670959473e-01
3.629348278045654297e-01
2.203565537929534912e-01
1.800160109996795654e-01
2.080519795417785645e-01
2.188475131988525391e-01
5.928151011466979980e-01
2.608487606048583984e-01
1.928144097328186035e-01
3.206931948661804199e-01
1.872057020664215088e-01
1.878892183303833008e-01
1.946356892585754395e-01
2.658256888389587402e-01
3.514246940612792969e-01
2.626677155494689941e-01
1.886316239833831787e-01
1.842374503612518311e-01
4.562044143676757812e-01
2.095424532890319824e-01
9.080517888069152832e-01
3.992443978786468506e-01
2.353724539279937744e-01
3.824249505996704102e-01
1.843336522579193115e-01
2.317459583282470703e-01
1.833545863628387451e-01
1.794935762882232666e-01
1.794167459011077881e-01
2.260751128196716309e-01
1.838106811046600342e-01
1.816453337669372559e-01
2.919743657112121582e-01
1.790505349636077881e-01
1.954050660133361816e-01
1.785700321197509766e-01
1.838278770446777344e-01
4.245532751083374023e-01
1.900462210178375244e-01
2.156765162944793701e-01
2.296052873134613037e-01
2.125165164470672607e-01
1.871852874755859375e-01
1.979064941406250000e-01
1.878367662429809570e-01
1.962570548057556152e-01
1.906617879867553711e-01
1.820089817047119141e-01
1.899726092815399170e-01
1.827327907085418701e-01
1.787922382354736328e-01
1.810317933559417725e-01
1.864164173603057861e-01
1.779562830924987793e-01
2.073292136192321777e-01
1.893448829650878906e-01
1.784381270408630371e-01
1.809003353118896484e-01
1.988629102706909180e-01
1.874302029609680176e-01
1.792459189891815186e-01
1.803684830665588379e-01
1.865069866180419922e-01
1.883819103240966797e-01
1.797054708003997803e-01
1.866582632064819336e-01
2.019883096218109131e-01
4.865859746932983398e-01
1.957668066024780273e-01
1.835000216960906982e-01
2.213465869426727295e-01
3.472784161567687988e-01
1.796821653842926025e-01
1.795501410961151123e-01
2.612004876136779785e-01
1.886755526065826416e-01
2.334434390068054199e-01
1.935907602310180664e-01
1.800751388072967529e-01
1.788504421710968018e-01
2.161439955234527588e-01
1.801439523696899414e-01
1.807968914508819580e-01
1.787448823451995850e-01
2.054859399795532227e-01
2.047355771064758301e-01
1.829820275306701660e-01
1.797109544277191162e-01
1.787122786045074463e-01
1.905569732189178467e-01
2.339866459369659424e-01
1.847564578056335449e-01
2.582098841667175293e-01
1.898379921913146973e-01
2.117309570312500000e-01
2.203530669212341309e-01
1.780176758766174316e-01
1.900574266910552979e-01
1.950712502002716064e-01
1.829374134540557861e-01
1.804855167865753174e-01
1.838445365428924561e-01
1.791323125362396240e-01
3.218012452125549316e-01
1.980566680431365967e-01
1.883265972137451172e-01
1.805338561534881592e-01
2.261437475681304932e-01
1.954763233661651611e-01
1.898933947086334229e-01
1.838580667972564697e-01
1.808648705482482910e-01
1.888533234596252441e-01
1.785836219787597656e-01
2.251428663730621338e-01
2.066143155097961426e-01
1.850217580795288086e-01
1.908017694950103760e-01
1.925981640815734863e-01
1.797524392604827881e-01
1.832471787929534912e-01
1.787057816982269287e-01
1.793862581253051758e-01
1.804470121860504150e-01
1.794409751892089844e-01
1.865935623645782471e-01
2.488442361354827881e-01
1.790810525417327881e-01
3.037260770797729492e-01
1.902330219745635986e-01
1.874372661113739014e-01
2.703177332878112793e-01
2.024766206741333008e-01
1.961283683776855469e-01
1.784899532794952393e-01
1.790528893470764160e-01
1.794770956039428711e-01
1.794636249542236328e-01
2.594746351242065430e-01
1.806146800518035889e-01
1.837751865386962891e-01
2.788796722888946533e-01
1.851900815963745117e-01
1.881222426891326904e-01
1.792690455913543701e-01
2.117668390274047852e-01
1.785566508769989014e-01
1.937985718250274658e-01
1.862531900405883789e-01
9.814289808273315430e-01
2.224513292312622070e-01
1.994658708572387695e-01
4.585589766502380371e-01
2.141722142696380615e-01
4.495584070682525635e-01
5.449319481849670410e-01
3.570276498794555664e-01
2.043577730655670166e-01
1.789492070674896240e-01
1.971268951892852783e-01
2.600637674331665039e-01
2.042311131954193115e-01
1.864772439002990723e-01
2.020511031150817871e-01
2.492085099220275879e-01
4.999810457229614258e-01
8.933217525482177734e-01
2.227744460105895996e-01
8.238703608512878418e-01
1.844356060028076172e-01
3.555966019630432129e-01
2.390435338020324707e-01
2.069695591926574707e-01
2.295246124267578125e-01
4.247081577777862549e-01
3.558890223503112793e-01
2.298725545406341553e-01
4.600573778152465820e-01
5.914879441261291504e-01
2.037271559238433838e-01
2.052024304866790771e-01
1.833994686603546143e-01
2.106212079524993896e-01
1.858244538307189941e-01
1.851315796375274658e-01
3.298932313919067383e-01
1.933225691318511963e-01
2.054164707660675049e-01
1.874994933605194092e-01
1.886360049247741699e-01
1.911451220512390137e-01
1.815131902694702148e-01
1.933428645133972168e-01
1.795071661472320557e-01
1.999112963676452637e-01
3.028771281242370605e-01
1.783738732337951660e-01
2.791942358016967773e-01
2.077878713607788086e-01
1.871690452098846436e-01
1.954548060894012451e-01
2.053181231021881104e-01
2.119883894920349121e-01
1.807839572429656982e-01
2.166137695312500000e-01
1.974071264266967773e-01
2.015918791294097900e-01
1.862033605575561523e-01
7.582479715347290039e-01
1.876675784587860107e-01
4.729100167751312256e-01
2.427915036678314209e-01
1.835839152336120605e-01
3.475548923015594482e-01
1.903320848941802979e-01
1.800108253955841064e-01
1.836379170417785645e-01
1.847075223922729492e-01
2.092438936233520508e-01
2.565136253833770752e-01
3.711979091167449951e-01
2.312389910221099854e-01
2.036366760730743408e-01
1.800603568553924561e-01
2.298428416252136230e-01
1.985883712768554688e-01
1.926605403423309326e-01
2.897840440273284912e-01
1.965937018394470215e-01
2.697456479072570801e-01
8.015396595001220703e-01
2.378278970718383789e-01
7.493405342102050781e-01
8.951187133789062500e-01
1.813154816627502441e-01
1.940484941005706787e-01
1.800927817821502686e-01
1.789868474006652832e-01
4.959150254726409912e-01
2.292041182518005371e-01
2.114530503749847412e-01
2.098529338836669922e-01
1.890572309494018555e-01
1.908243596553802490e-01
2.453180551528930664e-01
9.170119762420654297e-01
2.969256043434143066e-01
3.910345137119293213e-01
2.575073242187500000e-01
1.896961629390716553e-01
1.839801669120788574e-01
5.913604497909545898e-01
9.209052324295043945e-01
2.247325778007507324e-01
2.134640812873840332e-01
3.017787039279937744e-01
3.075975179672241211e-01
2.123692929744720459e-01
1.829628646373748779e-01
4.162429273128509521e-01
2.037911713123321533e-01
2.876061201095581055e-01
2.140330970287322998e-01
9.999443292617797852e-01
3.993285894393920898e-01
2.252936661243438721e-01
2.242167592048645020e-01
4.688205122947692871e-01
8.223205208778381348e-01
1.855925917625427246e-01
1.858470141887664795e-01
1.962197124958038330e-01
1.880647540092468262e-01
1.875487864017486572e-01
2.236821949481964111e-01
2.568489015102386475e-01
2.190164625644683838e-01
5.230622291564941406e-01
2.070019543170928955e-01
2.079787552356719971e-01
1.849977374076843262e-01
1.951459050178527832e-01
3.442334532737731934e-01
2.226611971855163574e-01
1.893112361431121826e-01
2.824568748474121094e-01
1.920973658561706543e-01
1.989454925060272217e-01
9.901233911514282227e-01
1.815234124660491943e-01
2.105459570884704590e-01
2.135020792484283447e-01
1.874238252639770508e-01
1.936970055103302002e-01
2.426460981369018555e-01
2.925772666931152344e-01
1.790950298309326172e-01
2.050914764404296875e-01
4.189042448997497559e-01
2.830919623374938965e-01
3.427279591560363770e-01
3.331652283668518066e-01
2.651217579841613770e-01
3.638561964035034180e-01
2.417266666889190674e-01
4.017331898212432861e-01
2.262021005153656006e-01
2.851760983467102051e-01
2.421294748783111572e-01
2.716372013092041016e-01
3.539560437202453613e-01
2.393926978111267090e-01
6.861693859100341797e-01
2.246343791484832764e-01
1.787297427654266357e-01
2.181507349014282227e-01
2.651998996734619141e-01
2.085268199443817139e-01
1.872403919696807861e-01
7.497342228889465332e-01
2.869617938995361328e-01
3.747022151947021484e-01
2.203521728515625000e-01
1.813210546970367432e-01
1.851678490638732910e-01
1.881475746631622314e-01
1.964856982231140137e-01
4.319893121719360352e-01
2.950814366340637207e-01
1.896140873432159424e-01
1.962368488311767578e-01
2.236068844795227051e-01
2.967996597290039062e-01
2.743337452411651611e-01
2.056519985198974609e-01
3.106312155723571777e-01
3.229789733886718750e-01
1.784047186374664307e-01
4.591210186481475830e-01
1.828867793083190918e-01
4.911030232906341553e-01
4.440530836582183838e-01
2.431838810443878174e-01
2.172169983386993408e-01
2.019228637218475342e-01
2.005346417427062988e-01
2.256971597671508789e-01
1.904512643814086914e-01
2.294480800628662109e-01
2.285926938056945801e-01
2.125796377658843994e-01
1.843246519565582275e-01
3.690538406372070312e-01
1.859182715415954590e-01
3.672567605972290039e-01
7.360844016075134277e-01
2.658559978008270264e-01
7.498264312744140625e-01
3.769800066947937012e-01
2.713008522987365723e-01
1.943681836128234863e-01
1.965300738811492920e-01
2.612644433975219727e-01
1.852704882621765137e-01
4.399900734424591064e-01
2.076623737812042236e-01
1.807972192764282227e-01
2.388457059860229492e-01
1.862418949604034424e-01
1.793832778930664062e-01
1.807794272899627686e-01
1.822592914104461670e-01
1.892620623111724854e-01
1.916962563991546631e-01
1.816153228282928467e-01
1.877784729003906250e-01
1.895784139633178711e-01
1.828617751598358154e-01
2.313671410083770752e-01
1.820055544376373291e-01
1.868500709533691406e-01
2.083341181278228760e-01
2.440216839313507080e-01
2.102676331996917725e-01
1.924749016761779785e-01
2.391290068626403809e-01
6.892750263214111328e-01
1.930837631225585938e-01
2.493406236171722412e-01
2.215456366539001465e-01
7.100292444229125977e-01
2.382383644580841064e-01
5.501466393470764160e-01
1.958781778812408447e-01
1.859647333621978760e-01
2.261790037155151367e-01
3.573783040046691895e-01
8.123018741607666016e-01
2.482761740684509277e-01
2.336648106575012207e-01
9.219925999641418457e-01
7.599275112152099609e-01
2.228923439979553223e-01
1.879809796810150146e-01
4.960358440876007080e-01
1.991852521896362305e-01
2.274097502231597900e-01
3.128321468830108643e-01
2.538059949874877930e-01
2.009911835193634033e-01
2.856570780277252197e-01
1.982654631137847900e-01
7.118046879768371582e-01
3.594656288623809814e-01
2.452492713928222656e-01
3.254996538162231445e-01
2.717261314392089844e-01
3.693927526473999023e-01
1.870386302471160889e-01
3.227849006652832031e-01
2.984172701835632324e-01
7.287944555282592773e-01
2.101885974407196045e-01
9.104884266853332520e-01
1.782107949256896973e-01
2.497690320014953613e-01
2.191699743270874023e-01
2.282534539699554443e-01
3.236109614372253418e-01
2.970014214515686035e-01
2.049089968204498291e-01
1.980999112129211426e-01
1.884078383445739746e-01
5.834937691688537598e-01
2.465625405311584473e-01
5.689729452133178711e-01
6.179835796356201172e-01
1.809953153133392334e-01
2.253848910331726074e-01
5.242885351181030273e-01
4.448633790016174316e-01
6.188852787017822266e-01
1.818040907382965088e-01
2.458174824714660645e-01
2.239957749843597412e-01
2.880425453186035156e-01
2.271509766578674316e-01
1.876199841499328613e-01
4.226203262805938721e-01
4.546771645545959473e-01
1.861918866634368896e-01
5.109820365905761719e-01
1.998145282268524170e-01
7.852693796157836914e-01
2.043573558330535889e-01
3.606652319431304932e-01
4.291212856769561768e-01
2.718782424926757812e-01
1.919853985309600830e-01
