0.000000000000000000e+00
2.433481398613423011e-03
3.008251207441186431e-02
3.008251207441186431e-02
4.398136031939513940e-02
4.410369382886297762e-02
4.814933574105870195e-02
4.814933574105870195e-02
5.190640802166630874e-02
5.190640802166630874e-02
5.254795611806886008e-02
5.264573983195663942e-02
5.264573983195663942e-02
5.445941115635469926e-02
5.455262573324695663e-02
6.047485863432663922e-02
6.055523625514403624e-02
6.423824772186358112e-02
6.431154654482189315e-02
6.610228471438506226e-02
6.617229373301435069e-02
6.717401049215329656e-02
6.724218498467124383e-02
6.801798603505107566e-02
6.808474300876267427e-02
7.054198762009306067e-02
7.060463597329395824e-02
7.094742752479414605e-02
7.100943276859608688e-02
7.326606013156351793e-02
7.332446762262366524e-02
7.335363798832747473e-02
7.341191209271794027e-02
7.349915707780105278e-02
7.355720992677759751e-02
7.618969674196349184e-02
7.624373813109189268e-02
7.746517870612638912e-02
7.751736555956316443e-02
8.046800188183438063e-02
8.046800188183438063e-02
8.063541821500166962e-02
8.068310069663034434e-02
8.146030647338420305e-02
8.150683694390853384e-02
8.228803259936409709e-02
8.237873180597554690e-02
8.355711379682020934e-02
8.360074300732218966e-02
8.552378194505538822e-02
8.556471393609231535e-02
8.595078640384166968e-02
8.599113441831109095e-02
8.769390781379637900e-02
8.769390781379637900e-02
8.848034933725604234e-02
8.851723718014667397e-02
9.632941378903003837e-02
9.635512668260402813e-02
9.672357307679102512e-02
9.672357307679102512e-02
9.834417005014266244e-02
9.836670959502838429e-02
9.951947139526637343e-02
9.951947139526637343e-02
1.004385149485013673e-01
1.004385149485013673e-01
1.007004616875149944e-01
1.007004616875149944e-01
1.017474498848384423e-01
1.017474498848384423e-01
1.033384495749427312e-01
1.033384495749427312e-01
1.037354817363371623e-01
1.037354817363371623e-01
1.048695836253000641e-01
1.048695836253000641e-01
1.049729443626363501e-01
1.049729443626363501e-01
1.051059135808870004e-01
1.051059135808870004e-01
1.053748217531834536e-01
1.053748217531834536e-01
1.053812128832311568e-01
1.053812128832311568e-01
1.054033458329375061e-01
1.054033458329375061e-01
1.054823430863807698e-01
1.054823430863807698e-01
1.056675284315781727e-01
1.056675284315781727e-01
1.056961173291059430e-01
1.057007781498928156e-01
1.057391962809406671e-01
1.057391962809406671e-01
1.058096037287258318e-01
1.058096037287258318e-01
1.060518911527261465e-01
1.060527878658223677e-01
1.060648266074582236e-01
1.060648266074582236e-01
1.060660171779821276e-01
1.060660171779821276e-01
1.058342617845634825e-01
1.058342617845634825e-01
1.058324094073050392e-01
1.058324094073050392e-01
1.057816497554151108e-01
1.057816497554151108e-01
1.057692250335446060e-01
1.057692250335446060e-01
1.057413893908469016e-01
1.057413893908469016e-01
1.057325724442760989e-01
1.057325724442760989e-01
1.057191244476863301e-01
1.057191244476863301e-01
1.056626595823386972e-01
1.056626595823386972e-01
1.056602140075078439e-01
1.056602140075078439e-01
1.055940181281247309e-01
1.055940181281247309e-01
1.055085109065869442e-01
1.055085109065869442e-01
1.053554684675942765e-01
1.053554684675942765e-01
1.053325484255107913e-01
1.053325484255107913e-01
1.053226130080269773e-01
1.053226130080269773e-01
1.051284715185268476e-01
1.051284715185268476e-01
1.047790886325141169e-01
1.047790886325141169e-01
1.047481769852540850e-01
1.047481769852540850e-01
1.045832897518790272e-01
1.045832897518790272e-01
1.044922633429857250e-01
1.044922633429857250e-01
1.044580282363044010e-01
1.044580282363044010e-01
1.044283838147441468e-01
1.044283838147441468e-01
1.043377863158019420e-01
1.043377863158019420e-01
1.040674868058754365e-01
1.040674868058754365e-01
1.040619850394465390e-01
1.040619850394465390e-01
1.040288109759419932e-01
1.040288109759419932e-01
1.040009517250480853e-01
1.040009517250480853e-01
1.039503138387530834e-01
1.039503138387530834e-01
1.039332940614774992e-01
1.039332940614774992e-01
1.038990435772622345e-01
1.038990435772622345e-01
1.037592241022145256e-01
1.037592241022145256e-01
1.034407442266896127e-01
1.034407442266896127e-01
1.033898508128883176e-01
1.033898508128883176e-01
1.033060655852736098e-01
1.033060655852736098e-01
1.031745392201607325e-01
1.031745392201607325e-01
1.031143111080044111e-01
1.031143111080044111e-01
1.030329989449044747e-01
1.030329989449044747e-01
1.027392961895799567e-01
1.027392961895799567e-01
1.026961770860077006e-01
1.026961770860077006e-01
1.026600218581781437e-01
1.026600218581781437e-01
1.025503395343993762e-01
1.025503395343993762e-01
1.024238208794488458e-01
1.024238208794488458e-01
1.021714846652016506e-01
1.021714846652016506e-01
1.021168099744879099e-01
1.021168099744879099e-01
1.019823473003443892e-01
1.019823473003443892e-01
1.018129464214385382e-01
1.018129464214385382e-01
1.016979778790451927e-01
1.016979778790451927e-01
1.015140092435762309e-01
1.015140092435762309e-01
1.014716331467347410e-01
1.014716331467347410e-01
1.014461067858987708e-01
1.014461067858987708e-01
1.014119540333372343e-01
1.014119540333372343e-01
1.012826819359605723e-01
1.012826819359605723e-01
1.009466761606458429e-01
1.009466761606458429e-01
1.009286517307266540e-01
1.009286517307266540e-01
1.006912226906419849e-01
1.006912226906419849e-01
1.003815025123745430e-01
1.003815025123745430e-01
1.002279420200402477e-01
1.002279420200402477e-01
1.001503262889871515e-01
1.001503262889871515e-01
1.001405850647135443e-01
1.001405850647135443e-01
1.000328546931383566e-01
1.000328546931383566e-01
9.963214611981041635e-02
9.963214611981041635e-02
9.950917491166198781e-02
9.950917491166198781e-02
9.933277076327737265e-02
9.933277076327737265e-02
9.897219111006777537e-02
9.897219111006777537e-02
9.884243707141067425e-02
9.882068440281221999e-02
9.878798723952054994e-02
9.878798723952054994e-02
9.876614365529573503e-02
9.876614365529573503e-02
9.874426366261848664e-02
9.874426366261848664e-02
9.857900074447362160e-02
9.857900074447362160e-02
9.845649948922292893e-02
9.845649948922292893e-02
9.835544443089103139e-02
9.835544443089103139e-02
9.818535919280749202e-02
9.818535919280749202e-02
9.805930578854664403e-02
9.805930578854664403e-02
9.796692400401453560e-02
9.796692400401453560e-02
9.775687993980555768e-02
9.775687993980555768e-02
9.774512183033257084e-02
9.774512183033257084e-02
9.768619035999484557e-02
9.768619035999484557e-02
9.760329109702239880e-02
9.760329109702239880e-02
9.751992969785827636e-02
9.751992969785827636e-02
9.741206978869595967e-02
9.741206978869595967e-02
9.733973642539635318e-02
9.733973642539635318e-02
9.686119153849422070e-02
9.686119153849422070e-02
9.682377523730417712e-02
9.682377523730417712e-02
9.673613222587371108e-02
9.673613222587371108e-02
9.667323953244856549e-02
9.667323953244856549e-02
9.641923743923792867e-02
9.641923743923792867e-02
9.634227513908680263e-02
9.634227513908680263e-02
9.592582624960727111e-02
9.592582624960727111e-02
9.583337655707158120e-02
9.583337655707158120e-02
9.553963535123327633e-02
9.553963535123327633e-02
9.547219883468571755e-02
9.547219883468571755e-02
9.536377617518349004e-02
9.536377617518349004e-02
9.528203461705334054e-02
9.528203461705334054e-02
9.521363790861762932e-02
9.521363790861762932e-02
9.518620813993713958e-02
9.518620813993713958e-02
9.471365009005466851e-02
9.471365009005466851e-02
9.441582678326185252e-02
9.441582678326185252e-02
9.438722370282334739e-02
9.438722370282334739e-02
9.431553341769222110e-02
9.431553341769222110e-02
9.424358182177092202e-02
9.424358182177092202e-02
9.414240944416257806e-02
9.414240944416257806e-02
9.356926005658906809e-02
9.356926005658906809e-02
9.346467232820000748e-02
9.346467232820000748e-02
9.338964469589007555e-02
9.338964469589007555e-02
9.329925618830775536e-02
9.329925618830775536e-02
9.301045602188384720e-02
9.301045602188384720e-02
9.291844030891700801e-02
9.291844030891700801e-02
9.259327861845609298e-02
9.259327861845609298e-02
9.246812887582032958e-02
9.246812887582032958e-02
9.243673063773834297e-02
9.243673063773834297e-02
9.235804064415395476e-02
9.235804064415395476e-02
9.212029811449533312e-02
9.212029811449533312e-02
9.210435908778315250e-02
9.210435908778315250e-02
9.205647464367609778e-02
9.205647464367609778e-02
9.197644233930804547e-02
9.197644233930804547e-02
9.153938025398847267e-02
9.153938025398847267e-02
9.137539673313524458e-02
9.137539673313524458e-02
9.125992472987184967e-02
9.125992472987184967e-02
9.117709871561555102e-02
9.117709871561555102e-02
9.116049882991902886e-02
9.116049882991902886e-02
9.092688209137538002e-02
9.092688209137538002e-02
9.084289436240003401e-02
9.084289436240003401e-02
9.058917327778266693e-02
9.058917327778266693e-02
9.048694293792712562e-02
9.048694293792712562e-02
9.041855274485903482e-02
9.041855274485903482e-02
9.031561143038803474e-02
9.031561143038803474e-02
9.026398016615308495e-02
9.026398016615308495e-02
9.024674590577567990e-02
9.024674590577567990e-02
9.014308955556193936e-02
9.014308955556193936e-02
9.010844173567529591e-02
9.010844173567529591e-02
9.005638009438693414e-02
9.005638009438693414e-02
8.989954605640337881e-02
8.989954605640337881e-02
8.972413916893470787e-02
8.972413916893470787e-02
8.968891233252994366e-02
8.968891233252994366e-02
8.961831274386999890e-02
8.961831274386999890e-02
8.960063240565971365e-02
8.960063240565971365e-02
8.958293987661969382e-02
8.958293987661969382e-02
8.952978907222343408e-02
8.952978907222343408e-02
8.949429411574345850e-02
8.949429411574345850e-02
8.940534249589529581e-02
8.940534249589529581e-02
8.938751538855130296e-02
8.938751538855130296e-02
8.935182433180824391e-02
8.935182433180824391e-02
8.928029464380177194e-02
8.928029464380177194e-02
8.924445589425693270e-02
8.924445589425693270e-02
8.919060522099647725e-02
8.919060522099647725e-02
8.915464298590378145e-02
8.915464298590378145e-02
8.910060680425944957e-02
8.910060680425944957e-02
8.879228823626567069e-02
8.879228823626567069e-02
8.873750434650393148e-02
8.873750434650393148e-02
8.851723718014667397e-02
8.851723718014667397e-02
8.823934118376416946e-02
8.823934118376416946e-02
8.818341822964287369e-02
8.818341822964287369e-02
8.803372707847507972e-02
8.803372707847507972e-02
8.795857328224049310e-02
8.795857328224049310e-02
8.782655769218586372e-02
8.782655769218586372e-02
8.778872257571346260e-02
8.778872257571346260e-02
8.776978557963843741e-02
8.776978557963843741e-02
8.746502401122435710e-02
8.746502401122435710e-02
8.744586537760073996e-02
8.744586537760073996e-02
8.742669362957017354e-02
8.742669362957017354e-02
8.740750875850328283e-02
8.740750875850328283e-02
8.717626354925159249e-02
8.717626354925159249e-02
8.709875899425734147e-02
8.709875899425734147e-02
8.707934969808919790e-02
8.707934969808919790e-02
8.704049125476261140e-02
8.704049125476261140e-02
8.702104208980905586e-02
8.702104208980905586e-02
8.678661156721589887e-02
8.678661156721589887e-02
8.676698870507523753e-02
8.676698870507523753e-02
8.664896929495663480e-02
8.664896929495663480e-02
8.658977773934996292e-02
8.658977773934996292e-02
8.653046461849309146e-02
8.653046461849309146e-02
8.641147267920212816e-02
8.641147267920212816e-02
8.637170007097207114e-02
8.637170007097207114e-02
8.621206449047272291e-02
8.621206449047272291e-02
8.619204855765200124e-02
8.619204855765200124e-02
8.617201892974134247e-02
8.617201892974134247e-02
8.609176327592747702e-02
8.609176327592747702e-02
8.580913280242073726e-02
8.580913280242073726e-02
8.576853557882038737e-02
8.576853557882038737e-02
8.574821612350363997e-02
8.574821612350363997e-02
8.570753547642137593e-02
8.570753547642137593e-02
8.562600695871554202e-02
8.562600695871554202e-02
8.554425494486130044e-02
8.554425494486130044e-02
8.531827925337094609e-02
8.531827925337094609e-02
8.529765149144724612e-02
8.529765149144724612e-02
8.525635356605584803e-02
8.525635356605584803e-02
8.521499903676356402e-02
8.521499903676356402e-02
8.519430051989992925e-02
8.519430051989992925e-02
8.500737443647178593e-02
8.500737443647178593e-02
8.498653363268988958e-02
8.498653363268988958e-02
8.492392546215002391e-02
8.492392546215002391e-02
8.488211511035173573e-02
8.488211511035173573e-02
8.481929201381663286e-02
8.481929201381663286e-02
8.471429929324444941e-02
8.471429929324444941e-02
8.469325751896063237e-02
8.469325751896063237e-02
8.460894596295190362e-02
8.460894596295190362e-02
8.458783190523624929e-02
8.458783190523624929e-02
8.452440275373673817e-02
8.452440275373673817e-02
8.448204406191907323e-02
8.448204406191907323e-02
8.443962719550303364e-02
8.443962719550303364e-02
8.439715206677531056e-02
8.439715206677531056e-02
8.429070876903788090e-02
8.429070876903788090e-02
8.422666716404883513e-02
8.422666716404883513e-02
8.416249347191857855e-02
8.416249347191857855e-02
8.411963747949376125e-02
8.411963747949376125e-02
8.396917684112392699e-02
8.396917684112392699e-02
8.338199472957039116e-02
8.338199472957039116e-02
8.333806393189936712e-02
8.333806393189936712e-02
8.327205407415511074e-02
8.327205407415511074e-02
8.322797158793829309e-02
8.322797158793829309e-02
8.296219553979487793e-02
8.296219553979487793e-02
8.267177514853224496e-02
8.267177514853224496e-02
8.255937809910440794e-02
8.255937809910440794e-02
8.249175296807442770e-02
8.249175296807442770e-02
8.240136735942044099e-02
8.240136735942044099e-02
8.235608056620577488e-02
8.235608056620577488e-02
8.226531848459529839e-02
8.226531848459529839e-02
8.203730885263146866e-02
8.203730885263146866e-02
8.183074255144912046e-02
8.183074255144912046e-02
8.180771090170077531e-02
8.180771090170077531e-02
8.164604011450103671e-02
8.164604011450103671e-02
8.159970365400481818e-02
8.159970365400481818e-02
8.153007787954247299e-02
8.153007787954247299e-02
8.146030647338420305e-02
8.146030647338420305e-02
8.136705074601963128e-02
8.136705074601963128e-02
8.122667851077035317e-02
8.122667851077035317e-02
8.096779721943429819e-02
8.096779721943429819e-02
8.094416371988927272e-02
8.094416371988927272e-02
8.084946422438352154e-02
8.084946422438352154e-02
8.080201497453966264e-02
8.080201497453966264e-02
8.075449923411667785e-02
8.075449923411667785e-02
8.061155189278269850e-02
8.061155189278269850e-02
8.058766882982290602e-02
8.058766882982290602e-02
8.049196887238678488e-02
8.049196887238678488e-02
8.039599986695110390e-02
8.039599986695110390e-02
8.032384597010572280e-02
8.032384597010572280e-02
8.027565879113116032e-02
8.027565879113116032e-02
8.017908088950570500e-02
8.017908088950570500e-02
8.015489391976914069e-02
8.015489391976914069e-02
8.013068992153275782e-02
8.013068992153275782e-02
8.000941396157942864e-02
8.000941396157942864e-02
7.986331762419826563e-02
7.986331762419826563e-02
7.983890807149765512e-02
7.983890807149765512e-02
7.981448128731007119e-02
7.981448128731007119e-02
7.976557596114079718e-02
7.976557596114079718e-02
7.974109738741598508e-02
7.974109738741598508e-02
7.969208833909774414e-02
7.969208833909774414e-02
7.959386219134637064e-02
7.959386219134637064e-02
7.956926221680556133e-02
7.956926221680556133e-02
7.942129625007227078e-02
7.942129625007227078e-02
7.934707717241440417e-02
7.934707717241440417e-02
7.929751004510282586e-02
7.929751004510282586e-02
7.927270010942603917e-02
7.927270010942603917e-02
7.924787257038920507e-02
7.924787257038920507e-02
7.922302741144228444e-02
7.922302741144228444e-02
7.914838604915233611e-02
7.914838604915233611e-02
7.899862533804230535e-02
7.899862533804230535e-02
7.892350508222245598e-02
7.892350508222245598e-02
7.889842934347306158e-02
7.889842934347306158e-02
7.887333574965796346e-02
7.887333574965796346e-02
7.884822428372986747e-02
7.884822428372986747e-02
7.879794766717654331e-02
7.879794766717654331e-02
7.872239827336613427e-02
7.872239827336613427e-02
7.869717921486527046e-02
7.869717921486527046e-02
7.867194216396725115e-02
7.867194216396725115e-02
7.857081368946711164e-02
7.857081368946711164e-02
7.852014104584355281e-02
7.852014104584355281e-02
7.839314212724170228e-02
7.839314212724170228e-02
7.836768780658256994e-02
7.836768780658256994e-02
7.834221526562737403e-02
7.834221526562737403e-02
7.829121545167917751e-02
7.829121545167917751e-02
7.826568814302140020e-02
7.826568814302140020e-02
7.824014254273797819e-02
7.824014254273797819e-02
7.821457863290624812e-02
7.821457863290624812e-02
7.818899639556725623e-02
7.818899639556725623e-02
7.795792854037018882e-02
7.795792854037018882e-02
7.790637699646948966e-02
7.790637699646948966e-02
7.785475126900064102e-02
7.785475126900064102e-02
7.780305121029154614e-02
7.780305121029154614e-02
7.777717326040883838e-02
7.777717326040883838e-02
7.775127667206435667e-02
7.775127667206435667e-02
7.772536142662822556e-02
7.772536142662822556e-02
7.759550468833897874e-02
7.759550468833897874e-02
7.754343073702721356e-02
7.754343073702721356e-02
7.749128155560211506e-02
7.749128155560211506e-02
7.743905699207882798e-02
7.743905699207882798e-02
7.738675689384214018e-02
7.738675689384214018e-02
7.736057847134078513e-02
7.736057847134078513e-02
7.728192947959497405e-02
7.728192947959497405e-02
7.722940185517021550e-02
7.722940185517021550e-02
7.715046758570934249e-02
7.715046758570934249e-02
7.712411799585140726e-02
7.712411799585140726e-02
7.709774929004266364e-02
7.709774929004266364e-02
7.707136144866247318e-02
7.707136144866247318e-02
7.704495445204910531e-02
7.704495445204910531e-02
7.693913451858228059e-02
7.693913451858228059e-02
7.685956746894599678e-02
7.685956746894599678e-02
7.680642623233188693e-02
7.680642623233188693e-02
7.669991134815662415e-02
7.669991134815662415e-02
7.661982118924409724e-02
7.661982118924409724e-02
7.656633030439718990e-02
7.656633030439718990e-02
7.651276127237678637e-02
7.651276127237678637e-02
7.637849571878926880e-02
7.637849571878926880e-02
7.635158364721002233e-02
7.635158364721002233e-02
7.624373813109189268e-02
7.624373813109189268e-02
7.618969674196349184e-02
7.618969674196349184e-02
7.605424590937831519e-02
7.605424590937831519e-02
7.602709602575963288e-02
7.602709602575963288e-02
7.599992618669970668e-02
7.599992618669970668e-02
7.597273637078877373e-02
7.597273637078877373e-02
7.589104684715532179e-02
7.589104684715532179e-02
7.586377690881235258e-02
7.586377690881235258e-02
7.567232375366907127e-02
7.567232375366907127e-02
7.561744104397648270e-02
7.561744104397648270e-02
7.556247720813402680e-02
7.556247720813402680e-02
7.550743206898014037e-02
7.550743206898014037e-02
7.547987895508545542e-02
7.547987895508545542e-02
7.545230544857386978e-02
7.545230544857386978e-02
7.542471152708025983e-02
7.542471152708025983e-02
7.534180704831455744e-02
7.534180704831455744e-02
7.531413124225230793e-02
7.531413124225230793e-02
7.525871802481232109e-02
7.525871802481232109e-02
7.523098056805770095e-02
7.523098056805770095e-02
7.506412251772295874e-02
7.506412251772295874e-02
7.503624041024359315e-02
7.503624041024359315e-02
7.498041390272323914e-02
7.498041390272323914e-02
7.492450418371066068e-02
7.492450418371066068e-02
7.481243436469187102e-02
7.481243436469187102e-02
7.467187568786062823e-02
7.467187568786062823e-02
7.458728792991864420e-02
7.458728792991864420e-02
7.450250996985559315e-02
7.450250996985559315e-02
7.447420827047035452e-02
7.447420827047035452e-02
7.444588534114021661e-02
7.444588534114021661e-02
7.438917569563008314e-02
7.438917569563008314e-02
7.436078893080444452e-02
7.436078893080444452e-02
7.430395139498180423e-02
7.430395139498180423e-02
7.427550057500564851e-02
7.427550057500564851e-02
7.421853470805578334e-02
7.421853470805578334e-02
7.416148304062868124e-02
7.416148304062868124e-02
7.413292496984391633e-02
7.413292496984391633e-02
7.410434537455545811e-02
7.410434537455545811e-02
7.407574422984980478e-02
7.407574422984980478e-02
7.404712151075623638e-02
7.404712151075623638e-02
7.396112365657689369e-02
7.396112365657689369e-02
7.393241438907152685e-02
7.393241438907152685e-02
7.378854204268213424e-02
7.378854204268213424e-02
7.373084049157763165e-02
7.373084049157763165e-02
7.370195691100150936e-02
7.370195691100150936e-02
7.364412401113860918e-02
7.364412401113860918e-02
7.358620328741090344e-02
7.358620328741090344e-02
7.352819453227266155e-02
7.352819453227266155e-02
7.349915707780105278e-02
7.349915707780105278e-02
7.344101588427191796e-02
7.344101588427191796e-02
7.341191209271794027e-02
7.341191209271794027e-02
7.335363798832746085e-02
7.335363798832746085e-02
7.329527501256551114e-02
7.329527501256551114e-02
7.326606013156351793e-02
7.326606013156351793e-02
7.323682295296533862e-02
7.323682295296533862e-02
7.320756345005574595e-02
7.320756345005574595e-02
7.314897736412560858e-02
7.314897736412560858e-02
7.311965072735804316e-02
7.311965072735804316e-02
7.306093013137250625e-02
7.306093013137250625e-02
7.303153611802432055e-02
7.303153611802432055e-02
7.294321889042403029e-02
7.294321889042403029e-02
7.291373466106826351e-02
7.291373466106826351e-02
7.288422780932006517e-02
7.288422780932006517e-02
7.285469830769256139e-02
7.285469830769256139e-02
7.273635325034830124e-02
7.273635325034830124e-02
7.267704410289245465e-02
7.267704410289245465e-02
7.261764357881256293e-02
7.261764357881256293e-02
7.258790898044978346e-02
7.258790898044978346e-02
7.255815145368924024e-02
7.255815145368924024e-02
7.246874102046257926e-02
7.246874102046257926e-02
7.243889149721083331e-02
7.243889149721083331e-02
7.240901890376867656e-02
7.240901890376867656e-02
7.237912321157126405e-02
7.237912321157126405e-02
7.234920439198445907e-02
7.234920439198445907e-02
7.231926241630448615e-02
7.231926241630448615e-02
7.228929725575786169e-02
7.228929725575786169e-02
7.225930888150100539e-02
7.225930888150100539e-02
7.222929726462011535e-02
7.222929726462011535e-02
7.216920418697825301e-02
7.216920418697825301e-02
7.213912266803618190e-02
7.213912266803618190e-02
7.210901779010740753e-02
7.210901779010740753e-02
7.207888952392313420e-02
7.207888952392313420e-02
7.201856270935450000e-02
7.201856270935450000e-02
7.198836410207305747e-02
7.198836410207305747e-02
7.192789633973033225e-02
7.192789633973033225e-02
7.189762712533655231e-02
7.189762712533655231e-02
7.186733431578430642e-02
7.186733431578430642e-02
7.183701788122419385e-02
7.183701788122419385e-02
7.177631401731410232e-02
7.177631401731410232e-02
7.171551529333247688e-02
7.171551529333247688e-02
7.168508028340361826e-02
7.168508028340361826e-02
7.165462146781383102e-02
7.165462146781383102e-02
7.162413881619231204e-02
7.162413881619231204e-02
7.159363229809290186e-02
7.159363229809290186e-02
7.156310188299357111e-02
7.156310188299357111e-02
7.147136694933368950e-02
7.147136694933368950e-02
7.144074063948985254e-02
7.144074063948985254e-02
7.137941583655241229e-02
7.137941583655241229e-02
7.134871728141675695e-02
7.134871728141675695e-02
7.131799458234537592e-02
7.131799458234537592e-02
7.128724770812236433e-02
7.128724770812236433e-02
7.125647662745321353e-02
7.125647662745321353e-02
7.122568130896478333e-02
7.122568130896478333e-02
7.119486172120491341e-02
7.119486172120491341e-02
7.110225702658351521e-02
7.110225702658351521e-02
7.104039863694074086e-02
7.104039863694074086e-02
7.097844240857868747e-02
7.097844240857868747e-02
7.094742752479414605e-02
7.094742752479414605e-02
7.091638808506645075e-02
7.091638808506645075e-02
7.076082141537468062e-02
7.076082141537468062e-02
7.069842172051757356e-02
7.069842172051757356e-02
7.066718466502475149e-02
7.066718466502475149e-02
7.051062598744339827e-02
7.051062598744339827e-02
7.047923933965756504e-02
7.047923933965756504e-02
7.038492897070079690e-02
7.038492897070079690e-02
7.025882956188145290e-02
7.025882956188145290e-02
7.019562828303489710e-02
7.019562828303489710e-02
7.016398963060768712e-02
7.016398963060768712e-02
7.013232559045701198e-02
7.013232559045701198e-02
7.006892120928580325e-02
7.006892120928580325e-02
7.003718079919032946e-02
7.003718079919032946e-02
7.000541486322105211e-02
7.000541486322105211e-02
6.984620107532960032e-02
6.984620107532960032e-02
6.981428125087038583e-02
6.981428125087038583e-02
6.978233565526256732e-02
6.978233565526256732e-02
6.975036425309670551e-02
6.975036425309670551e-02
6.968634388698456694e-02
6.968634388698456694e-02
6.965429485175005098e-02
6.965429485175005098e-02
6.962221986738023616e-02
6.962221986738023616e-02
6.955799190761591255e-02
6.955799190761591255e-02
6.952583886017330017e-02
6.952583886017330017e-02
6.942922301329823576e-02
6.942922301329823576e-02
6.939696537495343431e-02
6.939696537495343431e-02
6.933237134499573018e-02
6.933237134499573018e-02
6.930003487997744849e-02
6.930003487997744849e-02
6.926767206583198111e-02
6.926767206583198111e-02
6.923528286560998168e-02
6.923528286560998168e-02
6.920286724226287767e-02
6.920286724226287767e-02
6.917042515864227359e-02
6.917042515864227359e-02
6.910546146148649482e-02
6.910546146148649482e-02
6.907293977315273614e-02
6.907293977315273614e-02
6.904039147494762940e-02
6.904039147494762940e-02
6.900781652921858522e-02
6.900781652921858522e-02
6.897521489821115126e-02
6.897521489821115126e-02
6.887724951443544019e-02
6.887724951443544019e-02
6.884454076271606660e-02
6.884454076271606660e-02
6.881180513540238741e-02
6.881180513540238741e-02
6.877904259411983523e-02
6.877904259411983523e-02
6.874625310038900983e-02
6.874625310038900983e-02
6.871343661562553939e-02
6.871343661562553939e-02
6.868059310113935889e-02
6.868059310113935889e-02
6.864772251813447412e-02
6.864772251813447412e-02
6.861482482770871194e-02
6.861482482770871194e-02
6.851596872127897753e-02
6.851596872127897753e-02
6.848296221000521600e-02
6.848296221000521600e-02
6.844992839518948546e-02
6.844992839518948546e-02
6.841686723728275521e-02
6.841686723728275521e-02
6.838377869662670694e-02
6.838377869662670694e-02
6.831751930788493299e-02
6.831751930788493299e-02
6.825114990949682214e-02
6.825114990949682214e-02
6.821792385636678280e-02
6.821792385636678280e-02
6.818467018021974468e-02
6.818467018021974468e-02
6.815138884062066360e-02
6.815138884062066360e-02
6.808474300876268814e-02
6.808474300876268814e-02
6.805137843506853246e-02
6.805137843506853246e-02
6.801798603505108953e-02
6.801798603505108953e-02
6.791764146645498657e-02
6.791764146645498657e-02
6.788413734996401327e-02
6.788413734996401327e-02
6.785060520098162851e-02
6.785060520098162851e-02
6.781704497792580277e-02
6.781704497792580277e-02
6.778345663909733643e-02
6.778345663909733643e-02
6.774984014267936006e-02
6.774984014267936006e-02
6.771619544673684876e-02
6.771619544673684876e-02
6.768252250921624746e-02
6.768252250921624746e-02
6.764882128794486027e-02
6.764882128794486027e-02
6.761509174063053129e-02
6.761509174063053129e-02
6.754754749810362724e-02
6.754754749810362724e-02
6.751373271770469420e-02
6.751373271770469420e-02
6.747988944088903485e-02
6.747988944088903485e-02
6.744601762475968543e-02
6.744601762475968543e-02
6.737818820235878803e-02
6.737818820235878803e-02
6.727622894441184775e-02
6.727622894441184775e-02
6.724218498467124383e-02
6.724218498467124383e-02
6.710572027568484366e-02
6.710572027568484366e-02
6.707153166053009263e-02
6.707153166053009263e-02
6.700306719438352265e-02
6.700306719438352265e-02
6.696879125420755752e-02
6.696879125420755752e-02
6.696879125420755752e-02
6.693448611629147782e-02
6.693448611629147782e-02
6.686578806744389314e-02
6.686578806744389314e-02
6.683139506628781035e-02
6.683139506628781035e-02
6.679697268694140266e-02
6.679697268694140266e-02
6.676252088396295026e-02
6.676252088396295026e-02
6.672803961177808940e-02
6.672803961177808940e-02
6.669352882467909083e-02
6.669352882467909083e-02
6.665898847682448503e-02
6.665898847682448503e-02
6.662441852223836836e-02
6.662441852223836836e-02
6.658981891480990345e-02
6.658981891480990345e-02
6.655518960829287511e-02
6.655518960829287511e-02
6.648584171232711781e-02
6.648584171232711781e-02
6.645112302970342111e-02
6.645112302970342111e-02
6.638159596120465911e-02
6.638159596120465911e-02
6.634678748132651072e-02
6.634678748132651072e-02
6.631194897479510131e-02
6.631194897479510131e-02
6.624218169222989561e-02
6.624218169222989561e-02
6.617229373301433681e-02
6.617229373301433681e-02
6.610228471438506226e-02
6.610228471438506226e-02
6.603215425129095595e-02
6.603215425129095595e-02
6.592673000029709851e-02
6.592673000029709851e-02
6.589152743994998451e-02
6.589152743994998451e-02
6.585629422625551010e-02
6.585629422625551010e-02
6.578573564177542243e-02
6.578573564177542243e-02
6.575041017209348748e-02
6.575041017209348748e-02
6.571505385127024423e-02
6.571505385127024423e-02
6.567966662948285239e-02
6.567966662948285239e-02
6.564424845675743969e-02
6.564424845675743969e-02
6.557331905783794768e-02
6.557331905783794768e-02
6.553780773093519085e-02
6.553780773093519085e-02
6.550226525167573977e-02
6.550226525167573977e-02
6.546669156932086175e-02
6.546669156932086175e-02
6.543108663297686478e-02
6.543108663297686478e-02
6.539545039159457007e-02
6.539545039159457007e-02
6.535978279396836843e-02
6.535978279396836843e-02
6.532408378873588717e-02
6.532408378873588717e-02
6.528835332437700478e-02
6.528835332437700478e-02
6.525259134921332360e-02
6.525259134921332360e-02
6.521679781140755916e-02
6.521679781140755916e-02
6.514511583972125430e-02
6.514511583972125430e-02
6.507330699141354591e-02
6.507330699141354591e-02
6.503735485722447751e-02
6.503735485722447751e-02
6.500137084599187653e-02
6.500137084599187653e-02
6.492930698035319359e-02
6.492930698035319359e-02
6.485711496876098159e-02
6.485711496876098159e-02
6.482097077446395683e-02
6.482097077446395683e-02
6.474858573986841392e-02
6.474858573986841392e-02
6.471234479146495411e-02
6.471234479146495411e-02
6.460342756963860511e-02
6.460342756963860511e-02
6.449421763346079028e-02
6.449421763346079028e-02
6.445774901672755852e-02
6.445774901672755852e-02
6.442124765527688923e-02
6.442124765527688923e-02
6.438471349341733097e-02
6.434814647528080966e-02
6.434814647528080966e-02
6.431154654482189315e-02
6.431154654482189315e-02
6.427491364581700006e-02
6.427491364581700006e-02
6.420154871637935579e-02
6.420154871637935579e-02
6.412805123358571169e-02
6.412805123358571169e-02
6.409125264220569274e-02
6.409125264220569274e-02
6.405442074115196005e-02
6.405442074115196005e-02
6.401755547293136450e-02
6.401755547293136450e-02
6.390675888756101874e-02
6.390675888756101874e-02
6.386975957203490373e-02
6.386975957203490373e-02
6.383272659908920121e-02
6.383272659908920121e-02
6.379565991011015846e-02
6.379565991011015846e-02
6.375855944629431338e-02
6.375855944629431338e-02
6.364705481492693995e-02
6.364705481492693995e-02
6.360981865990408823e-02
6.360981865990408823e-02
6.349790552441582359e-02
6.349790552441582359e-02
6.346053272192545003e-02
6.346053272192545003e-02
6.342312560668503241e-02
6.342312560668503241e-02
6.338568411794542889e-02
6.338568411794542889e-02
6.334820819475808773e-02
6.334820819475808773e-02
6.331069777597390924e-02
6.331069777597390924e-02
6.327315280024257971e-02
6.327315280024257971e-02
6.319795893152435617e-02
6.319795893152435617e-02
6.316030991482149415e-02
6.316030991482149415e-02
6.308490740590125267e-02
6.308490740590125267e-02
6.304715378873432252e-02
6.304715378873432252e-02
6.300936517945038284e-02
6.300936517945038284e-02
6.297154151505421349e-02
6.297154151505421349e-02
6.293368273234052623e-02
6.293368273234052623e-02
6.289578876789318762e-02
6.289578876789318762e-02
6.281989503907217665e-02
6.281989503907217665e-02
6.278189514680254657e-02
6.278189514680254657e-02
6.274385981700530968e-02
6.274385981700530968e-02
6.266768258666780000e-02
6.266768258666780000e-02
6.262954055650393759e-02
6.262954055650393759e-02
6.259136282956331843e-02
6.259136282956331843e-02
6.255314934048601672e-02
6.255314934048601672e-02
6.247661481337546396e-02
6.247661481337546396e-02
6.243829364351266564e-02
6.243829364351266564e-02
6.239993644785214039e-02
6.239993644785214039e-02
6.232311371300737479e-02
6.232311371300737479e-02
6.228464804019077927e-02
6.228464804019077927e-02
6.224614607430945662e-02
6.224614607430945662e-02
6.220760774797521458e-02
6.220760774797521458e-02
6.213042174323954447e-02
6.213042174323954447e-02
6.205308948224129428e-02
6.205308948224129428e-02
6.201436833470064247e-02
6.201436833470064247e-02
6.197561041749118094e-02
6.197561041749118094e-02
6.189798399771673232e-02
6.189798399771673232e-02
6.182020966782556665e-02
6.182020966782556665e-02
6.178126686206616980e-02
6.178126686206616980e-02
6.170326961775363106e-02
6.170326961775363106e-02
6.162512305863511453e-02
6.162512305863511453e-02
6.158599360844189963e-02
6.158599360844189963e-02
6.146837971695250091e-02
6.146837971695250091e-02
6.135042600004043944e-02
6.135042600004043944e-02
6.131103223881038261e-02
6.131103223881038261e-02
6.127160042791679473e-02
6.127160042791679473e-02
6.123213049385088647e-02
6.123213049385088647e-02
6.119262236284300771e-02
6.119262236284300771e-02
6.115307596086138470e-02
6.115307596086138470e-02
6.111349121361088488e-02
6.111349121361088488e-02
6.107386804653151813e-02
6.107386804653151813e-02
6.103420638479734733e-02
6.103420638479734733e-02
6.099450615331492020e-02
6.099450615331492020e-02
6.095476727672202721e-02
6.095476727672202721e-02
6.087517328540437145e-02
6.087517328540437145e-02
6.083531801859925342e-02
6.083531801859925342e-02
6.079542380252023898e-02
6.079542380252023898e-02
6.075549056044085572e-02
6.075549056044085572e-02
6.071551821535772775e-02
6.071551821535772775e-02
6.067550668998893115e-02
6.067550668998893115e-02
6.063545590677282132e-02
6.063545590677282132e-02
6.059536578786642314e-02
6.059536578786642314e-02
6.055523625514402930e-02
6.055523625514402930e-02
6.051506723019590972e-02
6.051506723019590972e-02
6.047485863432665310e-02
6.047485863432665310e-02
6.043461038855377915e-02
6.043461038855377915e-02
6.035399462992334374e-02
6.035399462992334374e-02
6.031362695765228599e-02
6.031362695765228599e-02
6.027321931664764848e-02
6.027321931664764848e-02
6.023277162646933219e-02
6.023277162646933219e-02
6.019228380638132897e-02
6.019228380638132897e-02
6.015175577534988272e-02
6.015175577534988272e-02
6.011118745204228897e-02
6.011118745204228897e-02
6.007057875482502141e-02
6.007057875482502141e-02
6.002992960176232323e-02
6.002992960176232323e-02
5.994850959883721297e-02
5.994850959883721297e-02
5.990773858357789639e-02
5.990773858357789639e-02
5.986692678167619686e-02
5.986692678167619686e-02
5.982607410966131467e-02
5.982607410966131467e-02
5.978518048375065785e-02
5.978518048375065785e-02
5.974424581984803806e-02
5.974424581984803806e-02
5.970327003354225504e-02
5.970327003354225504e-02
5.966225304010516761e-02
5.966225304010516761e-02
5.962119475449020878e-02
5.962119475449020878e-02
5.958009509133069259e-02
5.958009509133069259e-02
5.953895396493794068e-02
5.953895396493794068e-02
5.949777128929988057e-02
5.949777128929988057e-02
5.945654697807900568e-02
5.945654697807900568e-02
5.941528094461077936e-02
5.941528094461077936e-02
5.937397310190205280e-02
5.937397310190205280e-02
5.933262336262895564e-02
5.933262336262895564e-02
5.929123163913551514e-02
5.929123163913551514e-02
5.924979784343154671e-02
5.924979784343154671e-02
5.920832188719101635e-02
5.920832188719101635e-02
5.916680368175034066e-02
5.916680368175034066e-02
5.912524313810631899e-02
5.912524313810631899e-02
5.908364016691446119e-02
5.908364016691446119e-02
5.904199467848721128e-02
5.904199467848721128e-02
5.900030658279185880e-02
5.900030658279185880e-02
5.895857578944897065e-02
5.895857578944897065e-02
5.891680220773021226e-02
5.891680220773021226e-02
5.887498574655664063e-02
5.887498574655664063e-02
5.883312631449678920e-02
5.883312631449678920e-02
5.879122381976460698e-02
5.879122381976460698e-02
5.874927817021777243e-02
5.874927817021777243e-02
5.866525703631648991e-02
5.866525703631648991e-02
5.858106216845079817e-02
5.858106216845079817e-02
5.853889935008233653e-02
5.853889935008233653e-02
5.849669281644973018e-02
5.849669281644973018e-02
5.845444247286027406e-02
5.845444247286027406e-02
5.841214822424889430e-02
5.841214822424889430e-02
5.836980997517599024e-02
5.836980997517599024e-02
5.832742762982548457e-02
5.832742762982548457e-02
5.828500109200260293e-02
5.828500109200260293e-02
5.824253026513181997e-02
5.824253026513181997e-02
5.820001505225486094e-02
5.820001505225486094e-02
5.815745535602831473e-02
5.815745535602831473e-02
5.811485107872171874e-02
5.811485107872171874e-02
5.807220212221525513e-02
5.807220212221525513e-02
5.802950838799754429e-02
5.802950838799754429e-02
5.798676977716363257e-02
5.798676977716363257e-02
5.794398619041248727e-02
5.794398619041248727e-02
5.790115752804510241e-02
5.790115752804510241e-02
5.781536457566080478e-02
5.781536457566080478e-02
5.777240008423466244e-02
5.777240008423466244e-02
5.772939011436908907e-02
5.772939011436908907e-02
5.768633456434027473e-02
5.768633456434027473e-02
5.764323333201239880e-02
5.764323333201239880e-02
5.760008631483537478e-02
5.760008631483537478e-02
5.755689340984268543e-02
5.755689340984268543e-02
5.751365451364865572e-02
5.751365451364865572e-02
5.747036952244627406e-02
5.747036952244627406e-02
5.742703833200481223e-02
5.742703833200481223e-02
5.738366083766714698e-02
5.738366083766714698e-02
5.734023693434761593e-02
5.734023693434761593e-02
5.725324947826156141e-02
5.725324947826156141e-02
5.720968571315777906e-02
5.720968571315777906e-02
5.716607511439242284e-02
5.716607511439242284e-02
5.712241757469889436e-02
5.712241757469889436e-02
5.707871298636665869e-02
5.707871298636665869e-02
5.699116223070947035e-02
5.699116223070947035e-02
5.694731584572108873e-02
5.694731584572108873e-02
5.690342197676191011e-02
5.690342197676191011e-02
5.685948051386317814e-02
5.685948051386317814e-02
5.681549134659647643e-02
5.681549134659647643e-02
5.677145436407117496e-02
5.677145436407117496e-02
5.672736945493145333e-02
5.672736945493145333e-02
5.668323650735380970e-02
5.668323650735380970e-02
5.659482604723476556e-02
5.659482604723476556e-02
5.655054830868223859e-02
5.655054830868223859e-02
5.650622207966375654e-02
5.650622207966375654e-02
5.646184724597488186e-02
5.646184724597488186e-02
5.641742369292630788e-02
5.641742369292630788e-02
5.637295130534113186e-02
5.637295130534113186e-02
5.632842996755196147e-02
5.632842996755196147e-02
5.628385956339779228e-02
5.628385956339779228e-02
5.623923997622132243e-02
5.623923997622132243e-02
5.619457108886564967e-02
5.619457108886564967e-02
5.614985278367145421e-02
5.614985278367145421e-02
5.610508494247400807e-02
5.610508494247400807e-02
5.606026744659987904e-02
5.606026744659987904e-02
5.601540017686416906e-02
5.601540017686416906e-02
5.597048301356709332e-02
5.597048301356709332e-02
5.592551583649101044e-02
5.592551583649101044e-02
5.588049852489737623e-02
5.588049852489737623e-02
5.583543095752326740e-02
5.583543095752326740e-02
5.579031301257839082e-02
5.579031301257839082e-02
5.574514456774191246e-02
5.574514456774191246e-02
5.569992550015891858e-02
5.569992550015891858e-02
5.565465568643746669e-02
5.565465568643746669e-02
5.560933500264500506e-02
5.560933500264500506e-02
5.556396332430516699e-02
5.556396332430516699e-02
5.551854052639446091e-02
5.551854052639446091e-02
5.547306648333868995e-02
5.547306648333868995e-02
5.542754106900982247e-02
5.542754106900982247e-02
5.538196415672223816e-02
5.538196415672223816e-02
5.529065532872057265e-02
5.529065532872057265e-02
5.524492315681678312e-02
5.524492315681678312e-02
5.519913897456781016e-02
5.519913897456781016e-02
5.515330265244820784e-02
5.515330265244820784e-02
5.510741406035385426e-02
5.510741406035385426e-02
5.506147306759842652e-02
5.506147306759842652e-02
5.501547954290941789e-02
5.501547954290941789e-02
5.496943335442476541e-02
5.496943335442476541e-02
5.492333436968889482e-02
5.492333436968889482e-02
5.487718245564897346e-02
5.487718245564897346e-02
5.483097747865135763e-02
5.483097747865135763e-02
5.478471930443735982e-02
5.478471930443735982e-02
5.473840779813984869e-02
5.473840779813984869e-02
5.469204282427895386e-02
5.469204282427895386e-02
5.464562424675836749e-02
5.464562424675836749e-02
5.459915192886141688e-02
5.459915192886141688e-02
5.455262573324692887e-02
5.455262573324692887e-02
5.450604552194539959e-02
5.450604552194539959e-02
5.445941115635472007e-02
5.445941115635472007e-02
5.441272249723623500e-02
5.441272249723623500e-02
5.436597940471070423e-02
5.436597940471070423e-02
5.431918173825388968e-02
5.431918173825388968e-02
5.427232935669268343e-02
5.427232935669268343e-02
5.422542211820059743e-02
5.422542211820059743e-02
5.417845988029362791e-02
5.417845988029362791e-02
5.413144249982609901e-02
5.413144249982609901e-02
5.408436983298606227e-02
5.408436983298606227e-02
5.403724173529107777e-02
5.403724173529107777e-02
5.399005806158388432e-02
5.399005806158388432e-02
5.394281866602773645e-02
5.394281866602773645e-02
5.389552340210220643e-02
5.389552340210220643e-02
5.380076467961451836e-02
5.380076467961451836e-02
5.375330092455136988e-02
5.375330092455136988e-02
5.370578070810748395e-02
5.370578070810748395e-02
5.365820388027472271e-02
5.365820388027472271e-02
5.361057029033332311e-02
5.361057029033332311e-02
5.356287978684721313e-02
5.356287978684721313e-02
5.351513221765939743e-02
5.351513221765939743e-02
5.346732742988679482e-02
5.346732742988679482e-02
5.341946526991568633e-02
5.341946526991568633e-02
5.337154558339650412e-02
5.337154558339650412e-02
5.332356821523903667e-02
5.332356821523903667e-02
5.322743980991510859e-02
5.322743980991510859e-02
5.317928845881958466e-02
5.317928845881958466e-02
5.313107879821741403e-02
5.313107879821741403e-02
5.308281066923897090e-02
5.308281066923897090e-02
5.303448391224334368e-02
5.303448391224334368e-02
5.298609836681279772e-02
5.298609836681279772e-02
5.293765387174777237e-02
5.293765387174777237e-02
5.288915026506117723e-02
5.288915026506117723e-02
5.284058738397318100e-02
5.284058738397318100e-02
5.279196506490582697e-02
5.279196506490582697e-02
5.274328314347717650e-02
5.274328314347717650e-02
5.269454145449617433e-02
5.269454145449617433e-02
5.259687810903188043e-02
5.259687810903188043e-02
5.254795611806886008e-02
5.254795611806886008e-02
5.249897369058238727e-02
5.249897369058238727e-02
5.244993065724945502e-02
5.244993065724945502e-02
5.240082684790318968e-02
5.240082684790318968e-02
5.235166209152698757e-02
5.235166209152698757e-02
5.230243621624867945e-02
5.230243621624867945e-02
5.225314904933422294e-02
5.225314904933422294e-02
5.220380041718181152e-02
5.220380041718181152e-02
5.215439014531576822e-02
5.215439014531576822e-02
5.210491805838011331e-02
5.210491805838011331e-02
5.205538398013259682e-02
5.205538398013259682e-02
5.190640802166632262e-02
5.190640802166632262e-02
5.185662419779756005e-02
5.185662419779756005e-02
5.180677748788614645e-02
5.180677748788614645e-02
5.175686771023658983e-02
5.175686771023658983e-02
5.170689468222154639e-02
5.170689468222154639e-02
5.160675813988625793e-02
5.160675813988625793e-02
5.155659425559123987e-02
5.155659425559123987e-02
5.150636638096741521e-02
5.150636638096741521e-02
5.145607432862590175e-02
5.145607432862590175e-02
5.140571791020471376e-02
5.140571791020471376e-02
5.135529693636135123e-02
5.135529693636135123e-02
5.130481121676597200e-02
5.130481121676597200e-02
5.125426056009378672e-02
5.125426056009378672e-02
5.120364477401791181e-02
5.120364477401791181e-02
5.105140470091242000e-02
5.105140470091242000e-02
5.100052645365081572e-02
5.100052645365081572e-02
5.094958210005814947e-02
5.094958210005814947e-02
5.089857144163714014e-02
5.089857144163714014e-02
5.084749427883492046e-02
5.084749427883492046e-02
5.079635041103550130e-02
5.079635041103550130e-02
5.074513963655142429e-02
5.074513963655142429e-02
5.069386175261592076e-02
5.069386175261592076e-02
5.064251655537481411e-02
5.064251655537481411e-02
5.059110383987812376e-02
5.059110383987812376e-02
5.053962340007180087e-02
5.053962340007180087e-02
5.048807502878956133e-02
5.048807502878956133e-02
5.043645851774407329e-02
5.043645851774407329e-02
5.038477365751879711e-02
5.038477365751879711e-02
5.033302023755897164e-02
5.033302023755897164e-02
5.028119804616312111e-02
5.028119804616312111e-02
5.022930687047434672e-02
5.022930687047434672e-02
5.017734649647108414e-02
5.017734649647108414e-02
5.012531670895859631e-02
5.012531670895859631e-02
5.007321729155944645e-02
5.007321729155944645e-02
4.996880869562425609e-02
4.996880869562425609e-02
4.991649907833817235e-02
4.991649907833817235e-02
4.986411895364664670e-02
4.986411895364664670e-02
4.981166809912060400e-02
4.981166809912060400e-02
4.975914629109219611e-02
4.975914629109219611e-02
4.970655330464506666e-02
4.970655330464506666e-02
4.965388891360440760e-02
4.965388891360440760e-02
4.960115289052722393e-02
4.960115289052722393e-02
4.954834500669207803e-02
4.954834500669207803e-02
4.949546503208909765e-02
4.949546503208909765e-02
4.938948788403675627e-02
4.938948788403675627e-02
4.933639024403292661e-02
4.933639024403292661e-02
4.928321958013133497e-02
4.928321958013133497e-02
4.922997565572433121e-02
4.922997565572433121e-02
4.917665823285296417e-02
4.917665823285296417e-02
4.912326707219581007e-02
4.912326707219581007e-02
4.906980193305830740e-02
4.906980193305830740e-02
4.901626257336140491e-02
4.901626257336140491e-02
4.896264874963039693e-02
4.896264874963039693e-02
4.890896021698375867e-02
4.890896021698375867e-02
4.885519672912140565e-02
4.885519672912140565e-02
4.880135803831338326e-02
4.880135803831338326e-02
4.874744389538792494e-02
4.874744389538792494e-02
4.869345404971976710e-02
4.869345404971976710e-02
4.863938824921826276e-02
4.863938824921826276e-02
4.858524624031509975e-02
4.858524624031509975e-02
4.858524624031509975e-02
4.858524624031509975e-02
4.853102776795223394e-02
4.853102776795223394e-02
4.847673257556962823e-02
4.847673257556962823e-02
4.842236040509253353e-02
4.842236040509253353e-02
4.831338408990785982e-02
4.831338408990785982e-02
4.820409672702735682e-02
4.820409672702735682e-02
4.814933574105868808e-02
4.814933574105868808e-02
4.803957782289397516e-02
4.803957782289397516e-02
4.798458035100432867e-02
4.798458035100432867e-02
4.792950350806839122e-02
4.792950350806839122e-02
4.787434702014979615e-02
4.787434702014979615e-02
4.781911061165144972e-02
4.781911061165144972e-02
4.776379400530099406e-02
4.776379400530099406e-02
4.770839692213661720e-02
4.770839692213661720e-02
4.765291908149266176e-02
4.765291908149266176e-02
4.759736020098462306e-02
4.759736020098462306e-02
4.754171999649474400e-02
4.754171999649474400e-02
4.748599818215662460e-02
4.748599818215662460e-02
4.743019447034023395e-02
4.743019447034023395e-02
4.737430857163668629e-02
4.737430857163668629e-02
4.731834019484242038e-02
4.731834019484242038e-02
4.726228904694393385e-02
4.726228904694393385e-02
4.720615483310151850e-02
4.720615483310151850e-02
4.709363601899969887e-02
4.709363601899969887e-02
4.703725081978558931e-02
4.703725081978558931e-02
4.698078135668520838e-02
4.698078135668520838e-02
4.692422732548444386e-02
4.692422732548444386e-02
4.686758842004416781e-02
4.686758842004416781e-02
4.681086433228315996e-02
4.681086433228315996e-02
4.669715936765811426e-02
4.669715936765811426e-02
4.664017786476316180e-02
4.664017786476316180e-02
4.658310992744970486e-02
4.658310992744970486e-02
4.652595523766092644e-02
4.652595523766092644e-02
4.646871347529037827e-02
4.646871347529037827e-02
4.641138431816352328e-02
4.641138431816352328e-02
4.635396744201904229e-02
4.635396744201904229e-02
4.629646252048945365e-02
4.629646252048945365e-02
4.623886922508219088e-02
4.623886922508219088e-02
4.618118722515977825e-02
4.618118722515977825e-02
4.606555577837735671e-02
4.606555577837735671e-02
4.600760565933986052e-02
4.600760565933986052e-02
4.594956549139166818e-02
4.594956549139166818e-02
4.589143493287068526e-02
4.589143493287068526e-02
4.577490126610700427e-02
4.577490126610700427e-02
4.571649746312127227e-02
4.571649746312127227e-02
4.565800188003355659e-02
4.565800188003355659e-02
4.554073395833463378e-02
4.554073395833463378e-02
4.548196090615387599e-02
4.548196090615387599e-02
4.542309464668652097e-02
4.542309464668652097e-02
4.536413481708450463e-02
4.536413481708450463e-02
4.530508105203252117e-02
4.530508105203252117e-02
4.524593298372452110e-02
4.524593298372452110e-02
4.518669024183989691e-02
4.518669024183989691e-02
4.512735245351896796e-02
4.512735245351896796e-02
4.506791924333876376e-02
4.506791924333876376e-02
4.500839023328789823e-02
4.500839023328789823e-02
4.494876504274152723e-02
4.494876504274152723e-02
4.488904328843604241e-02
4.488904328843604241e-02
4.482922458444293934e-02
4.482922458444293934e-02
4.476930854214309502e-02
4.476930854214309502e-02
4.470929477019997683e-02
4.470929477019997683e-02
4.458897245829058359e-02
4.458897245829058359e-02
4.452866312182231223e-02
4.452866312182231223e-02
4.446825446265149223e-02
4.446825446265149223e-02
4.440774607544669544e-02
4.440774607544669544e-02
4.434713755199330698e-02
4.434713755199330698e-02
4.428642848116478431e-02
4.428642848116478431e-02
4.422561844889308369e-02
4.422561844889308369e-02
4.416470703813914211e-02
4.416470703813914211e-02
4.410369382886299150e-02
4.410369382886299150e-02
4.404257839799293611e-02
4.404257839799293611e-02
4.398136031939514634e-02
4.398136031939514634e-02
4.392003916384203122e-02
4.392003916384203122e-02
4.385861449898076359e-02
4.385861449898076359e-02
4.379708588930135427e-02
4.379708588930135427e-02
4.373545289610374087e-02
4.373545289610374087e-02
4.367371507746534154e-02
4.367371507746534154e-02
4.361187198820728333e-02
4.361187198820728333e-02
4.354992317986072781e-02
4.354992317986072781e-02
4.348786820063276631e-02
4.348786820063276631e-02
4.342570659537135780e-02
4.342570659537135780e-02
4.336343790553047473e-02
4.336343790553047473e-02
4.330106166913411103e-02
4.330106166913411103e-02
4.323857742074026927e-02
4.323857742074026927e-02
4.317598469140443429e-02
4.317598469140443429e-02
4.311328300864207541e-02
4.311328300864207541e-02
4.305047189639140542e-02
4.305047189639140542e-02
4.298755087497481420e-02
4.298755087497481420e-02
4.292451946106030924e-02
4.292451946106030924e-02
4.286137716762246364e-02
4.286137716762246364e-02
4.279812350390221204e-02
4.279812350390221204e-02
4.273475797536696597e-02
4.273475797536696597e-02
4.267128008366934122e-02
4.267128008366934122e-02
4.260768932660578129e-02
4.260768932660578129e-02
4.254398519807472967e-02
4.254398519807472967e-02
4.248016718803357405e-02
4.248016718803357405e-02
4.241623478245577783e-02
4.241623478245577783e-02
4.235218746328670014e-02
4.235218746328670014e-02
4.228802470839921473e-02
4.228802470839921473e-02
4.222374599154878061e-02
4.222374599154878061e-02
4.215935078232729838e-02
4.215935078232729838e-02
4.209483854611686948e-02
4.209483854611686948e-02
4.203020874404286844e-02
4.203020874404286844e-02
4.196546083292573837e-02
4.196546083292573837e-02
4.190059426523300157e-02
4.190059426523300157e-02
4.183560848902964646e-02
4.183560848902964646e-02
4.177050294792843121e-02
4.177050294792843121e-02
4.170527708103941716e-02
4.170527708103941716e-02
4.163993032291819080e-02
4.163993032291819080e-02
4.157446210351418286e-02
4.157446210351418286e-02
4.150887184811739850e-02
4.150887184811739850e-02
4.144315897730486975e-02
4.144315897730486975e-02
4.137732290688635184e-02
4.137732290688635184e-02
4.131136304784865237e-02
4.131136304784865237e-02
4.124527880629991899e-02
4.124527880629991899e-02
4.117906958341229634e-02
4.117906958341229634e-02
4.111273477536427079e-02
4.111273477536427079e-02
4.104627377328211313e-02
4.104627377328211313e-02
4.097968596317989876e-02
4.097968596317989876e-02
4.091297072589944461e-02
4.091297072589944461e-02
4.084612743704850446e-02
4.084612743704850446e-02
4.077915546693856169e-02
4.077915546693856169e-02
4.071205418052162295e-02
4.071205418052162295e-02
4.064482293732558232e-02
4.064482293732558232e-02
4.057746109138929413e-02
4.057746109138929413e-02
4.050996799119591096e-02
4.050996799119591096e-02
4.044234297960565272e-02
4.044234297960565272e-02
4.037458539378757649e-02
4.037458539378757649e-02
4.030669456514968801e-02
4.030669456514968801e-02
4.023866981926881720e-02
4.023866981926881720e-02
4.017051047581849527e-02
4.017051047581849527e-02
4.010221584849629761e-02
4.010221584849629761e-02
4.003378524495000701e-02
4.003378524495000701e-02
3.996521796670203519e-02
3.996521796670203519e-02
3.989651330907342808e-02
3.989651330907342808e-02
3.982767056110593507e-02
3.982767056110593507e-02
3.975868900548321788e-02
3.975868900548321788e-02
3.968956791845087290e-02
3.968956791845087290e-02
3.962030656973464238e-02
3.962030656973464238e-02
3.955090422245776532e-02
3.955090422245776532e-02
3.948136013305698910e-02
3.948136013305698910e-02
3.941167355119663124e-02
3.941167355119663124e-02
3.934184371968207916e-02
3.934184371968207916e-02
3.927186987437095156e-02
3.927186987437095156e-02
3.920175124408343398e-02
3.920175124408343398e-02
3.913148705051106013e-02
3.913148705051106013e-02
3.906107650812337684e-02
3.906107650812337684e-02
3.906107650812337684e-02
3.906107650812337684e-02
3.899051882407397751e-02
3.899051882407397751e-02
3.891981319810394746e-02
3.891981319810394746e-02
3.877795488171729976e-02
3.877795488171729976e-02
3.870680055283385462e-02
3.870680055283385462e-02
3.863549500489234234e-02
3.863549500489234234e-02
3.849242688853200811e-02
3.849242688853200811e-02
3.842066261829311935e-02
3.842066261829311935e-02
3.834874372513740609e-02
3.834874372513740609e-02
3.827666933749161726e-02
3.827666933749161726e-02
3.820443857531368587e-02
3.820443857531368587e-02
3.813205054997696741e-02
3.813205054997696741e-02
3.791393387748488719e-02
3.791393387748488719e-02
3.784090773737788099e-02
3.784090773737788099e-02
3.776771975800273518e-02
3.776771975800273518e-02
3.769436899667057833e-02
3.769436899667057833e-02
3.762085450123543034e-02
3.762085450123543034e-02
3.754717530996089236e-02
3.754717530996089236e-02
3.747333045138354080e-02
3.747333045138354080e-02
3.739931894417433678e-02
3.739931894417433678e-02
3.732513979699755152e-02
3.732513979699755152e-02
3.725079200836647203e-02
3.725079200836647203e-02
3.717627456649730266e-02
3.717627456649730266e-02
3.710158644915940301e-02
3.710158644915940301e-02
3.702672662352344407e-02
3.702672662352344407e-02
3.687648766211409218e-02
3.687648766211409218e-02
3.680110640627895502e-02
3.680110640627895502e-02
3.672554920169777276e-02
3.672554920169777276e-02
3.664981496016341683e-02
3.664981496016341683e-02
3.657390258189516241e-02
3.657390258189516241e-02
3.649781095536467485e-02
3.649781095536467485e-02
3.642153895711922051e-02
3.642153895711922051e-02
3.634508545160149151e-02
3.634508545160149151e-02
3.626844929096516984e-02
3.626844929096516984e-02
3.619162931488792423e-02
3.619162931488792423e-02
3.611462435037968849e-02
3.611462435037968849e-02
3.603743321158787288e-02
3.603743321158787288e-02
3.596005469959856482e-02
3.596005469959856482e-02
3.572678273509319324e-02
3.572678273509319324e-02
3.564864247275589121e-02
3.564864247275589121e-02
3.557030863948248967e-02
3.557030863948248967e-02
3.549177995358285959e-02
3.549177995358285959e-02
3.541305511879616619e-02
3.541305511879616619e-02
3.533413282405674372e-02
3.533413282405674372e-02
3.525501174325587628e-02
3.525501174325587628e-02
3.517569053499845777e-02
3.517569053499845777e-02
3.509616784235405212e-02
3.509616784235405212e-02
3.493651249697987682e-02
3.493651249697987682e-02
3.485637705040297435e-02
3.485637705040297435e-02
3.477603453121033000e-02
3.477603453121033000e-02
3.469548350088008659e-02
3.469548350088008659e-02
3.461472250374972304e-02
3.461472250374972304e-02
3.453375006672737557e-02
3.453375006672737557e-02
3.445256469899773272e-02
3.445256469899773272e-02
3.437116489172140077e-02
3.437116489172140077e-02
3.428954911772702507e-02
3.428954911772702507e-02
3.420771583119767978e-02
3.420771583119767978e-02
3.412566346734918765e-02
3.412566346734918765e-02
3.396089515174600254e-02
3.396089515174600254e-02
3.387817597259637492e-02
3.387817597259637492e-02
3.379523126064330751e-02
3.379523126064330751e-02
3.371205935119307023e-02
3.371205935119307023e-02
3.362865855850039054e-02
3.362865855850039054e-02
3.354502717539344786e-02
3.354502717539344786e-02
3.337706569980003479e-02
3.337706569980003479e-02
3.329273208233252124e-02
3.329273208233252124e-02
3.320816082367426120e-02
3.320816082367426120e-02
3.312335010357346510e-02
3.312335010357346510e-02
3.303829807790689688e-02
3.303829807790689688e-02
3.295300287823842156e-02
3.295300287823842156e-02
3.286746261136684610e-02
3.286746261136684610e-02
3.278167535886232498e-02
3.278167535886232498e-02
3.278167535886232498e-02
3.278167535886232498e-02
3.269563917659250307e-02
3.269563917659250307e-02
3.260935209423610620e-02
3.260935209423610620e-02
3.252281211478531137e-02
3.252281211478531137e-02
3.243601721403596705e-02
3.243601721403596705e-02
3.234896534006434510e-02
3.234896534006434510e-02
3.226165441269211731e-02
3.226165441269211731e-02
3.217408232293673259e-02
3.217408232293673259e-02
3.208624693244878368e-02
3.208624693244878368e-02
3.199814607293512136e-02
3.199814607293512136e-02
3.190977754556655055e-02
3.190977754556655055e-02
3.182113912037151660e-02
3.182113912037151660e-02
3.173222853561304818e-02
3.173222853561304818e-02
3.164304349715031661e-02
3.164304349715031661e-02
3.155358167778365280e-02
3.155358167778365280e-02
3.146384071658159254e-02
3.146384071658159254e-02
3.137381821819135858e-02
3.137381821819135858e-02
3.128351175212999019e-02
3.128351175212999019e-02
3.119291885205727893e-02
3.119291885205727893e-02
3.110203701502926854e-02
3.110203701502926854e-02
3.101086370073086532e-02
3.101086370073086532e-02
3.091939633068874899e-02
3.091939633068874899e-02
3.082763228746170092e-02
3.082763228746170092e-02
3.073556891380944261e-02
3.073556891380944261e-02
3.064320351183852376e-02
3.064320351183852376e-02
3.055053334212378541e-02
3.055053334212378541e-02
3.045755562280593604e-02
3.045755562280593604e-02
3.036426752866373119e-02
3.036426752866373119e-02
3.027066619015914700e-02
3.027066619015914700e-02
3.017674869245642877e-02
3.017674869245642877e-02
3.008251207441190248e-02
3.008251207441190248e-02
2.998795332753539239e-02
2.998795332753539239e-02
2.989306939492145793e-02
2.989306939492145793e-02
2.979785717014856242e-02
2.979785717014856242e-02
2.970231349614713134e-02
2.970231349614713134e-02
2.960643516403273917e-02
2.960643516403273917e-02
2.951021891190542742e-02
2.951021891190542742e-02
2.941366142361288155e-02
2.941366142361288155e-02
2.931675932747546814e-02
2.931675932747546814e-02
2.921950919497370153e-02
2.921950919497370153e-02
2.912190753939422616e-02
2.912190753939422616e-02
2.902395081443488734e-02
2.902395081443488734e-02
2.892563541276647887e-02
2.892563541276647887e-02
2.882695766454866637e-02
2.882695766454866637e-02
2.872791383590038786e-02
2.872791383590038786e-02
2.862850012732056498e-02
2.862850012732056498e-02
2.852871267205911096e-02
2.852871267205911096e-02
2.842854753443559146e-02
2.842854753443559146e-02
2.832800070810253396e-02
2.832800070810253396e-02
2.822706811425333001e-02
2.822706811425333001e-02
2.792191381333044078e-02
2.792191381333044078e-02
2.781939584604328081e-02
2.781939584604328081e-02
2.771647056330391393e-02
2.771647056330391393e-02
2.761313341042583025e-02
2.761313341042583025e-02
2.750937974592109619e-02
2.750937974592109619e-02
2.740520483916254746e-02
2.740520483916254746e-02
2.730060386796348895e-02
2.730060386796348895e-02
2.719557191607308716e-02
2.719557191607308716e-02
2.709010397058286834e-02
2.709010397058286834e-02
2.698419491923950697e-02
2.698419491923950697e-02
2.687783954766228070e-02
2.687783954766228070e-02
2.677103253645787828e-02
2.677103253645787828e-02
2.666376845823054467e-02
2.666376845823054467e-02
2.655604177448173814e-02
2.655604177448173814e-02
2.644784683239344639e-02
2.644784683239344639e-02
2.633917786149207740e-02
2.633917786149207740e-02
2.623002897018463647e-02
2.623002897018463647e-02
2.612039414216354993e-02
2.612039414216354993e-02
2.601026723267303026e-02
2.601026723267303026e-02
2.589964196462940516e-02
2.589964196462940516e-02
2.578851192459087269e-02
2.578851192459087269e-02
2.567687055856651343e-02
2.567687055856651343e-02
2.556471116765901899e-02
2.556471116765901899e-02
2.545202690353216141e-02
2.545202690353216141e-02
2.522505558658360431e-02
2.522505558658360431e-02
2.511075404646483100e-02
2.511075404646483100e-02
2.499589864809230802e-02
2.499589864809230802e-02
2.488048172116450948e-02
2.488048172116450948e-02
2.488048172116450948e-02
2.488048172116450948e-02
2.476449541453521613e-02
2.476449541453521613e-02
2.464793169017869684e-02
2.464793169017869684e-02
2.453078231689188177e-02
2.453078231689188177e-02
2.429469269310260970e-02
2.429469269310260970e-02
2.417573495368507963e-02
2.417573495368507963e-02
2.405615657284457601e-02
2.405615657284457601e-02
2.393594824884606037e-02
2.393594824884606037e-02
2.381510044264974549e-02
2.381510044264974549e-02
2.369360336933579864e-02
2.369360336933579864e-02
2.357144698912523248e-02
2.357144698912523248e-02
2.344862099797612870e-02
2.344862099797612870e-02
2.332511481772712655e-02
2.332511481772712655e-02
2.320091758576405677e-02
2.320091758576405677e-02
2.307601814417998068e-02
2.307601814417998068e-02
2.295040502839703483e-02
2.295040502839703483e-02
2.282406645521906433e-02
2.282406645521906433e-02
2.269699031027871267e-02
2.269699031027871267e-02
2.256916413484006886e-02
2.256916413484006886e-02
2.244057511191863835e-02
2.244057511191863835e-02
2.231121005167164065e-02
2.231121005167164065e-02
2.218105537601403054e-02
2.218105537601403054e-02
2.205009710240827397e-02
2.205009710240827397e-02
2.191832082677188515e-02
2.191832082677188515e-02
2.178571170544621460e-02
2.178571170544621460e-02
2.165225443615908726e-02
2.165225443615908726e-02
2.151793323791486440e-02
2.151793323791486440e-02
2.138273182973581335e-02
2.138273182973581335e-02
2.124663340817242729e-02
2.124663340817242729e-02
2.110962062349737434e-02
2.110962062349737434e-02
2.097167555448404067e-02
2.097167555448404067e-02
2.083277968166842922e-02
2.083277968166842922e-02
2.069291385898022750e-02
2.069291385898022750e-02
2.055205828361847398e-02
2.055205828361847398e-02
2.041019246404038312e-02
2.041019246404038312e-02
2.026729518591298754e-02
2.026729518591298754e-02
2.012334447587001834e-02
2.012334447587001834e-02
1.997831756289729366e-02
1.997831756289729366e-02
1.968493980601342119e-02
1.968493980601342119e-02
1.953653904711209754e-02
1.953653904711209754e-02
1.938696215811376578e-02
1.938696215811376578e-02
1.923618170294667806e-02
1.923618170294667806e-02
1.893089483119030775e-02
1.893089483119030775e-02
1.877632783378461664e-02
1.877632783378461664e-02
1.862043597077570403e-02
1.862043597077570403e-02
1.846318568312646513e-02
1.846318568312646513e-02
1.830454196108960430e-02
1.830454196108960430e-02
1.814446825478276820e-02
1.814446825478276820e-02
1.798292637754461340e-02
1.798292637754461340e-02
1.781987640135014248e-02
1.781987640135014248e-02
1.765527654347127939e-02
1.765527654347127939e-02
1.748908304346855416e-02
1.748908304346855416e-02
1.732125002948883830e-02
1.732125002948883830e-02
1.715172937270875719e-02
1.715172937270875719e-02
1.698047052861166584e-02
1.698047052861166584e-02
1.680742036361630026e-02
1.680742036361630026e-02
1.663252296536514574e-02
1.663252296536514574e-02
1.645571943475367810e-02
1.645571943475367810e-02
1.609614205276278104e-02
1.609614205276278104e-02
1.591323329585084961e-02
1.591323329585084961e-02
1.572814801181227073e-02
1.572814801181227073e-02
1.554080843594078665e-02
1.554080843594078665e-02
1.535113203681044008e-02
1.535113203681044008e-02
1.515903109662365689e-02
1.515903109662365689e-02
1.496441224282009201e-02
1.496441224282009201e-02
1.476717592383747571e-02
1.476717592383747571e-02
1.456721582066738963e-02
1.456721582066738963e-02
1.436441818432215509e-02
1.436441818432215509e-02
1.415866108747939819e-02
1.415866108747939819e-02
1.394981357631589272e-02
1.394981357631589272e-02
1.373773470575377111e-02
1.373773470575377111e-02
1.352227243791559799e-02
1.352227243791559799e-02
1.330326237930372010e-02
1.330326237930372010e-02
1.308052632686540658e-02
1.308052632686540658e-02
1.285387058635981475e-02
1.285387058635981475e-02
1.262308401785370605e-02
1.262308401785370605e-02
1.238793575219604079e-02
1.238793575219604079e-02
1.238793575219604079e-02
1.238793575219604079e-02
1.214817250812342403e-02
1.214817250812342403e-02
1.190351542114976777e-02
1.190351542114976777e-02
1.190351542114976777e-02
1.190351542114976777e-02
1.165365627105160659e-02
1.165365627105160659e-02
1.139825296235923852e-02
1.139825296235923852e-02
1.086924219242857426e-02
1.086924219242857426e-02
1.059472580916076198e-02
1.059472580916076198e-02
1.031282915172991761e-02
1.031282915172991761e-02
1.002292952494849426e-02
1.002292952494849426e-02
9.724311205387954279e-03
9.724311205387954279e-03
9.416144730420664480e-03
9.416144730420664480e-03
9.097459851907263931e-03
9.097459851907263931e-03
8.767109611367701616e-03
8.767109611367701616e-03
8.423721690930491973e-03
8.423721690930491973e-03
8.065631055447892994e-03
8.065631055447892994e-03
7.690784259541004128e-03
7.690784259541004128e-03
7.296599327004498967e-03
7.296599327004498967e-03
6.879753044893179188e-03
6.879753044893179188e-03
6.435843626630236534e-03
6.435843626630236534e-03
5.439997119980309777e-03
5.439997119980309777e-03
4.214358572275688289e-03
4.214358572275688289e-03
3.441235888839467259e-03
3.441235888839467259e-03
2.433481398613018386e-03
2.433481398613018386e-03
0.000000000000000000e+00
0.000000000000000000e+00
