8.724556565284729004e-01
3.033814430236816406e-01
2.357505261898040771e-01
7.977944016456604004e-01
9.400297403335571289e-01
6.877046823501586914e-01
9.337548017501831055e-01
8.733954429626464844e-01
8.700057268142700195e-01
3.624718189239501953e-01
1.182284057140350342e-01
9.400297403335571289e-01
8.977696299552917480e-02
9.394299983978271484e-01
8.674461841583251953e-01
3.760001659393310547e-01
1.908671855926513672e-01
2.376838028430938721e-01
9.398447275161743164e-01
3.743240237236022949e-01
2.724125981330871582e-01
9.175381064414978027e-01
9.394797086715698242e-01
9.310193657875061035e-01
9.398626685142517090e-01
9.400227069854736328e-01
9.194656610488891602e-01
9.284173250198364258e-01
9.400297403335571289e-01
9.319009780883789062e-01
8.640679121017456055e-01
9.359438419342041016e-01
2.026614248752593994e-01
9.390996694564819336e-01
6.239354610443115234e-02
9.400294423103332520e-01
7.726925611495971680e-01
1.824339926242828369e-01
9.320788383483886719e-01
4.519332647323608398e-01
9.385433197021484375e-01
2.068658173084259033e-01
1.400671899318695068e-01
6.894934177398681641e-01
8.548992872238159180e-01
9.262239933013916016e-01
9.374803304672241211e-01
1.091751456260681152e-01
9.392392635345458984e-01
9.400295019149780273e-01
9.400231838226318359e-01
9.144940376281738281e-01
9.392327666282653809e-01
9.332940578460693359e-01
1.336341202259063721e-01
9.206075072288513184e-01
9.190019369125366211e-01
9.392102956771850586e-01
9.400297403335571289e-01
5.702083706855773926e-01
9.339913725852966309e-01
9.352301359176635742e-01
9.315970540046691895e-01
9.386223554611206055e-01
8.124164938926696777e-01
7.412943840026855469e-01
9.400075674057006836e-01
9.388660192489624023e-01
1.905176043510437012e-01
8.810204863548278809e-01
9.240661263465881348e-01
1.147772371768951416e-01
9.400264024734497070e-01
9.134689569473266602e-01
8.733098506927490234e-01
9.399890899658203125e-01
6.307104825973510742e-01
3.488346636295318604e-01
9.400268793106079102e-01
9.400297403335571289e-01
8.347213268280029297e-01
2.371804416179656982e-01
2.510450482368469238e-01
9.080084562301635742e-01
9.274842739105224609e-01
9.309824109077453613e-01
9.400297403335571289e-01
9.195211529731750488e-01
9.400297403335571289e-01
9.400297403335571289e-01
9.388485550880432129e-01
9.311309456825256348e-01
9.400255680084228516e-01
9.058067798614501953e-01
9.400286674499511719e-01
9.385687112808227539e-01
9.354056715965270996e-01
8.607273101806640625e-01
9.905579686164855957e-02
1.245287358760833740e-01
9.400297403335571289e-01
9.080585241317749023e-01
5.329301357269287109e-01
9.400296211242675781e-01
9.304338693618774414e-01
9.399340748786926270e-01
1.097849607467651367e-01
9.400297403335571289e-01
8.148266077041625977e-01
9.055908918380737305e-01
2.473360300064086914e-01
9.256604313850402832e-01
9.400293827056884766e-01
5.553270578384399414e-01
9.400088787078857422e-01
9.337167739868164062e-01
8.554565906524658203e-02
5.449455380439758301e-01
9.400284290313720703e-01
9.400297403335571289e-01
9.392300248146057129e-01
1.537547111511230469e-01
5.144528150558471680e-01
9.342803955078125000e-01
7.768210768699645996e-02
3.436093032360076904e-01
2.137961983680725098e-01
9.400297403335571289e-01
9.399747252464294434e-01
9.400297403335571289e-01
6.567587852478027344e-01
9.382107257843017578e-01
1.392081379890441895e-01
9.400297403335571289e-01
3.482413887977600098e-01
9.399905204772949219e-01
9.331156611442565918e-01
9.400072097778320312e-01
9.400297403335571289e-01
9.400293827056884766e-01
9.393106102943420410e-01
9.399784803390502930e-01
3.227216005325317383e-01
9.378269910812377930e-01
8.377319574356079102e-01
1.901008188724517822e-01
1.686030626296997070e-01
9.400146007537841797e-01
7.463186979293823242e-01
6.681428551673889160e-01
9.077478647232055664e-01
6.379677057266235352e-01
9.400297403335571289e-01
2.704411745071411133e-01
6.568834185600280762e-02
9.769377112388610840e-02
9.394184350967407227e-01
4.340845942497253418e-01
9.162790775299072266e-01
5.892343521118164062e-01
5.395701527595520020e-01
9.396823644638061523e-01
9.400297403335571289e-01
3.060773611068725586e-01
8.601287603378295898e-01
9.657904505729675293e-02
9.399061203002929688e-01
9.400297403335571289e-01
3.242772817611694336e-01
1.435435116291046143e-01
9.700259566307067871e-02
3.472611904144287109e-01
9.400284290313720703e-01
9.400187730789184570e-01
2.695057988166809082e-01
4.633198380470275879e-01
9.377744197845458984e-01
4.545365869998931885e-01
7.228784561157226562e-01
9.399930238723754883e-01
9.399781823158264160e-01
8.960220813751220703e-01
9.398889541625976562e-01
9.400290846824645996e-01
8.467493057250976562e-01
9.400297403335571289e-01
9.400297403335571289e-01
9.374753236770629883e-01
4.210681617259979248e-01
7.682168483734130859e-02
3.058518171310424805e-01
9.257001280784606934e-01
1.820664703845977783e-01
1.195133924484252930e-01
9.397152662277221680e-01
3.275123834609985352e-01
1.319257318973541260e-01
8.967650532722473145e-01
2.736462354660034180e-01
9.239866733551025391e-01
9.645220637321472168e-02
6.743291020393371582e-01
8.429065346717834473e-02
8.799797296524047852e-01
7.018825411796569824e-01
7.469469308853149414e-01
9.242743253707885742e-01
9.367539882659912109e-01
1.775775551795959473e-01
8.730854988098144531e-01
5.383102297782897949e-01
4.869880974292755127e-01
9.377575516700744629e-01
4.969824254512786865e-01
9.261975884437561035e-01
9.400126934051513672e-01
8.962154984474182129e-01
9.311316013336181641e-01
9.399949312210083008e-01
3.766727447509765625e-02
9.250242710113525391e-01
3.039578795433044434e-01
9.370785951614379883e-01
1.703701317310333252e-01
9.279636144638061523e-01
3.679760992527008057e-01
9.400297403335571289e-01
9.246854782104492188e-01
9.397983551025390625e-01
9.398181438446044922e-01
9.377485513687133789e-01
8.316503763198852539e-01
9.399991035461425781e-01
9.006323814392089844e-01
4.630827903747558594e-01
8.327322602272033691e-01
9.210507869720458984e-01
8.999042510986328125e-01
9.340816736221313477e-01
9.394367933273315430e-01
4.280372858047485352e-01
5.084258913993835449e-01
2.690489590167999268e-01
8.270722031593322754e-01
9.400297403335571289e-01
9.273840188980102539e-01
7.632598280906677246e-02
9.400269985198974609e-01
8.238163590431213379e-02
9.400297403335571289e-01
6.635183095932006836e-01
2.929557561874389648e-01
9.400287866592407227e-01
9.400296211242675781e-01
9.400296807289123535e-01
9.378820061683654785e-01
5.572652220726013184e-01
3.255012631416320801e-01
9.371187686920166016e-01
4.076606929302215576e-01
9.231476783752441406e-01
9.283849000930786133e-01
8.369880914688110352e-01
9.379709959030151367e-01
4.288726449012756348e-01
9.338729381561279297e-01
9.003762006759643555e-01
9.384645223617553711e-01
8.894069194793701172e-01
2.052859365940093994e-01
9.382436275482177734e-01
3.243827223777770996e-01
1.145229041576385498e-01
8.438689708709716797e-01
9.360047578811645508e-01
9.400157928466796875e-01
8.086779117584228516e-01
8.755239248275756836e-01
9.210965633392333984e-01
8.796133995056152344e-01
9.216262102127075195e-01
9.400297403335571289e-01
3.528620004653930664e-01
8.918722867965698242e-01
8.253826498985290527e-01
1.405782997608184814e-01
9.305478930473327637e-01
8.138637542724609375e-01
9.125154018402099609e-01
7.218797206878662109e-01
9.376655817031860352e-01
9.400243759155273438e-01
7.309225797653198242e-01
5.545830130577087402e-01
9.400215148925781250e-01
9.400297403335571289e-01
9.400297403335571289e-01
4.710407853126525879e-01
8.614255189895629883e-01
9.400293231010437012e-01
9.400297403335571289e-01
9.400290846824645996e-01
3.984091281890869141e-01
9.398722052574157715e-01
3.165674805641174316e-01
9.400119185447692871e-01
9.383563995361328125e-01
9.400035142898559570e-01
9.399995207786560059e-01
3.014992773532867432e-01
4.269922971725463867e-01
8.605360388755798340e-01
9.269833564758300781e-01
5.470592975616455078e-01
8.368628025054931641e-01
9.400297403335571289e-01
7.526449561119079590e-01
9.258065223693847656e-01
9.399995803833007812e-01
9.399628639221191406e-01
2.922075688838958740e-01
8.854319453239440918e-01
3.085248470306396484e-01
9.017159938812255859e-01
2.182941734790802002e-01
8.547611236572265625e-01
2.039882838726043701e-01
7.012133598327636719e-01
9.396185278892517090e-01
6.840872168540954590e-01
9.381492137908935547e-01
4.239978194236755371e-01
9.399718046188354492e-01
9.212143421173095703e-01
9.400297403335571289e-01
7.973017692565917969e-01
9.400281906127929688e-01
8.223763108253479004e-02
8.931519985198974609e-01
6.129299998283386230e-01
6.477317214012145996e-02
5.483557581901550293e-01
2.662540972232818604e-01
9.187377095222473145e-01
9.373337030410766602e-01
7.949917316436767578e-01
2.148465514183044434e-01
9.217451810836791992e-01
5.156769752502441406e-01
9.291787147521972656e-01
9.400297403335571289e-01
9.378980398178100586e-01
1.429333090782165527e-01
9.148637652397155762e-01
9.400230646133422852e-01
9.400295019149780273e-01
9.146064519882202148e-01
8.969707489013671875e-01
9.393953084945678711e-01
8.305728435516357422e-01
6.308461427688598633e-01
1.427206397056579590e-01
8.568313717842102051e-02
8.534374833106994629e-02
6.943290233612060547e-01
9.310007095336914062e-01
9.340820908546447754e-01
7.524194717407226562e-01
5.276610255241394043e-01
9.400278329849243164e-01
8.583949804306030273e-01
8.986397385597229004e-01
8.073619008064270020e-01
3.274795413017272949e-01
9.400293231010437012e-01
9.400103688240051270e-01
9.400284290313720703e-01
1.429665684700012207e-01
9.282775521278381348e-01
7.915025353431701660e-01
9.400198459625244141e-01
9.398560523986816406e-01
4.464668631553649902e-01
9.400297403335571289e-01
5.974176526069641113e-02
5.056764483451843262e-01
8.845313787460327148e-01
9.388509988784790039e-01
3.702876865863800049e-01
5.769526362419128418e-01
8.940529823303222656e-01
9.255982637405395508e-01
9.400297403335571289e-01
3.686263859272003174e-01
6.114263534545898438e-01
9.121407270431518555e-01
9.380860328674316406e-01
9.265545606613159180e-01
3.818852305412292480e-01
6.333664655685424805e-01
9.511485695838928223e-02
9.400198459625244141e-01
1.049557328224182129e-01
9.400297403335571289e-01
8.035466670989990234e-01
9.377283453941345215e-01
9.398641586303710938e-01
9.392728805541992188e-01
9.284884929656982422e-01
9.187808036804199219e-01
1.808086335659027100e-01
2.088309526443481445e-01
3.832910656929016113e-01
9.399889707565307617e-01
1.596735715866088867e-01
2.518401145935058594e-01
1.056981980800628662e-01
1.111342608928680420e-01
9.400292038917541504e-01
3.483561277389526367e-01
9.400297403335571289e-01
9.400297403335571289e-01
8.520288467407226562e-01
9.178035259246826172e-01
6.601730585098266602e-01
9.397763609886169434e-01
9.386759996414184570e-01
9.392157793045043945e-01
8.693257570266723633e-01
3.248233199119567871e-01
2.744274735450744629e-01
9.270464777946472168e-01
8.661812543869018555e-02
9.400297403335571289e-01
8.396123647689819336e-01
9.393713474273681641e-01
5.850040912628173828e-01
8.344200849533081055e-01
1.156425774097442627e-01
7.011533975601196289e-01
2.557134032249450684e-01
9.171104431152343750e-01
9.400297403335571289e-01
1.082307398319244385e-01
2.405130565166473389e-01
2.235497832298278809e-01
6.402447819709777832e-01
9.400208592414855957e-01
9.376853704452514648e-01
9.400076866149902344e-01
2.094657421112060547e-01
7.111939787864685059e-02
6.820934414863586426e-01
9.400295019149780273e-01
8.845791220664978027e-01
7.688033580780029297e-01
9.399937391281127930e-01
3.868563175201416016e-01
9.400297403335571289e-01
8.656126260757446289e-01
9.399551153182983398e-01
9.400295019149780273e-01
7.741750478744506836e-01
3.571670353412628174e-01
9.400297403335571289e-01
9.284374117851257324e-01
9.400297403335571289e-01
3.320739269256591797e-01
9.400297403335571289e-01
8.366428613662719727e-01
8.315784931182861328e-01
9.400297403335571289e-01
2.312868535518646240e-01
9.400002956390380859e-01
9.400297403335571289e-01
9.300881624221801758e-01
9.351804852485656738e-01
2.084895372390747070e-01
1.858052909374237061e-01
3.818312883377075195e-01
9.319103360176086426e-01
9.400293827056884766e-01
9.400283098220825195e-01
7.921168208122253418e-01
3.663519620895385742e-01
2.173205018043518066e-01
9.400297403335571289e-01
1.335580945014953613e-01
2.238987982273101807e-01
2.389239072799682617e-01
8.991358280181884766e-01
6.309432387351989746e-01
9.382523298263549805e-01
7.619452476501464844e-01
8.187683820724487305e-01
9.398632049560546875e-01
9.377241134643554688e-01
9.134430289268493652e-01
9.400297403335571289e-01
5.074450373649597168e-01
5.100935697555541992e-02
1.549326181411743164e-01
1.027474403381347656e-01
2.789038121700286865e-01
7.065856456756591797e-02
1.356575191020965576e-01
2.419079840183258057e-01
8.965977430343627930e-01
9.395175576210021973e-01
3.857502341270446777e-02
2.741955518722534180e-01
3.759997487068176270e-01
2.760964334011077881e-01
6.777272224426269531e-01
9.285223484039306641e-02
1.931784152984619141e-01
4.490803778171539307e-01
3.456521630287170410e-01
2.075804471969604492e-01
8.041225671768188477e-01
1.980985105037689209e-01
4.208324551582336426e-01
5.618563294410705566e-02
8.396847248077392578e-01
9.400290846824645996e-01
6.907320022583007812e-02
9.496143460273742676e-02
7.741750478744506836e-01
7.502290010452270508e-01
9.251663088798522949e-02
1.037588417530059814e-01
2.380377352237701416e-01
1.120916306972503662e-01
1.519825756549835205e-01
8.309012055397033691e-01
3.164716958999633789e-01
2.437649965286254883e-01
2.021884918212890625e-01
1.188844442367553711e-01
3.881381750106811523e-01
6.485198736190795898e-01
2.058090567588806152e-01
1.073036193847656250e-01
3.884126245975494385e-01
1.526364684104919434e-01
1.188950836658477783e-01
2.660820484161376953e-01
3.089495301246643066e-01
7.178961634635925293e-01
7.466804981231689453e-02
6.618458032608032227e-02
1.446958184242248535e-01
9.400274157524108887e-01
7.717905640602111816e-01
8.330911397933959961e-02
2.583016753196716309e-01
1.888842284679412842e-01
2.583731710910797119e-01
2.323229610919952393e-01
1.679898202419281006e-01
2.081199288368225098e-01
1.006899476051330566e-01
4.044695496559143066e-01
7.575827836990356445e-02
2.815625667572021484e-01
1.090278029441833496e-01
1.651695072650909424e-01
2.677285075187683105e-01
5.474630594253540039e-01
1.370763480663299561e-01
3.410323560237884521e-01
7.078355550765991211e-02
1.940099895000457764e-01
1.548275351524353027e-01
7.145128846168518066e-01
4.671365022659301758e-01
3.622609972953796387e-01
2.069109380245208740e-01
6.897324323654174805e-01
9.200948476791381836e-02
2.856097519397735596e-01
3.282933235168457031e-01
9.364851713180541992e-01
1.581331491470336914e-01
3.867590427398681641e-01
2.761929929256439209e-01
3.212090134620666504e-01
1.452313661575317383e-01
3.908298611640930176e-01
6.381163001060485840e-02
9.010484814643859863e-02
1.192240417003631592e-01
2.250850796699523926e-01
5.532401204109191895e-01
6.177666783332824707e-02
5.287714004516601562e-01
8.143837451934814453e-01
3.182505369186401367e-01
9.184570312500000000e-01
3.841343522071838379e-02
2.951185703277587891e-01
2.845577001571655273e-01
3.001891374588012695e-01
7.611694931983947754e-02
2.628440260887145996e-01
7.896497249603271484e-01
2.709674537181854248e-01
9.167449474334716797e-01
2.172980308532714844e-01
2.491458952426910400e-01
9.356251358985900879e-01
4.771144390106201172e-01
8.336605429649353027e-01
3.222104310989379883e-01
3.155536353588104248e-01
9.400297403335571289e-01
5.839171409606933594e-01
8.668572902679443359e-01
4.969770610332489014e-01
9.641042351722717285e-02
1.564895510673522949e-01
1.113347411155700684e-01
2.824763655662536621e-01
1.590682864189147949e-01
1.555979251861572266e-01
4.870399832725524902e-02
5.893382430076599121e-02
7.196986675262451172e-02
1.113477051258087158e-01
1.428063511848449707e-01
2.644591033458709717e-01
3.875800669193267822e-01
9.400297403335571289e-01
9.400256276130676270e-01
3.745737373828887939e-01
4.754358530044555664e-02
3.855624794960021973e-01
3.806738257408142090e-01
1.080251336097717285e-01
2.120541632175445557e-01
9.973132610321044922e-02
9.009921550750732422e-02
1.876465082168579102e-01
1.925526559352874756e-01
1.162436902523040771e-01
2.334691286087036133e-01
1.614729464054107666e-01
9.062835574150085449e-01
8.717526793479919434e-01
1.878354847431182861e-01
1.014371812343597412e-01
5.647314786911010742e-01
1.920598447322845459e-01
1.442230641841888428e-01
4.751431941986083984e-02
1.021471917629241943e-01
8.324803113937377930e-01
1.329048573970794678e-01
2.913954555988311768e-01
1.315082907676696777e-01
1.017703711986541748e-01
2.467436790466308594e-01
6.190049648284912109e-02
9.400297403335571289e-01
3.306136131286621094e-01
1.059820353984832764e-01
1.113960146903991699e-01
1.404709517955780029e-01
1.600177288055419922e-01
9.400007724761962891e-01
1.379441320896148682e-01
3.379499316215515137e-01
9.468266367912292480e-02
9.396032094955444336e-01
3.130353987216949463e-01
5.297508239746093750e-01
4.168503284454345703e-01
9.194656610488891602e-01
7.160285115242004395e-02
1.043710410594940186e-01
4.832905530929565430e-01
1.930080056190490723e-01
3.772434592247009277e-02
4.512682557106018066e-02
1.115891933441162109e-01
2.360786199569702148e-01
6.857368946075439453e-01
1.471050083637237549e-01
1.066582500934600830e-01
4.887533187866210938e-02
8.412085771560668945e-01
3.947260975837707520e-02
8.724911808967590332e-01
4.086551964282989502e-01
6.427285075187683105e-02
1.272795200347900391e-01
9.399900436401367188e-01
1.831617057323455811e-01
5.093702673912048340e-01
3.050258457660675049e-01
2.271546125411987305e-01
8.095023632049560547e-01
1.718042790889739990e-01
1.782257854938507080e-01
1.733731031417846680e-01
1.537368595600128174e-01
7.903251051902770996e-02
5.141249299049377441e-02
2.229826450347900391e-01
1.196753382682800293e-01
3.567410707473754883e-01
2.085779905319213867e-01
2.706732153892517090e-01
6.937735080718994141e-01
2.234973013401031494e-01
6.656188964843750000e-01
5.135077834129333496e-01
6.067340373992919922e-01
3.597906231880187988e-01
9.216705560684204102e-01
7.331338524818420410e-02
2.283625006675720215e-01
1.092459261417388916e-01
1.475570499897003174e-01
4.393524527549743652e-01
1.676738858222961426e-01
4.549245238304138184e-01
4.934111237525939941e-02
8.429306745529174805e-02
1.757172048091888428e-01
1.474799215793609619e-01
1.383635103702545166e-01
8.494619131088256836e-01
1.859752833843231201e-01
6.280511617660522461e-02
9.463077783584594727e-02
5.644093155860900879e-01
1.113987267017364502e-01
1.278704106807708740e-01
3.441395163536071777e-01
3.014895915985107422e-01
1.117114722728729248e-01
1.139398515224456787e-01
9.511122107505798340e-02
6.395503878593444824e-01
1.525219678878784180e-01
8.947667479515075684e-02
6.502224206924438477e-01
8.030453324317932129e-02
5.278481841087341309e-01
1.401658058166503906e-01
1.152439415454864502e-01
5.102601051330566406e-01
4.281553626060485840e-02
5.251714587211608887e-02
6.263808608055114746e-01
4.558535814285278320e-01
1.091846823692321777e-01
2.576302289962768555e-01
1.555136442184448242e-01
8.482864499092102051e-02
3.018367886543273926e-01
6.959549188613891602e-01
1.868490874767303467e-01
1.211378574371337891e-01
1.535131931304931641e-01
9.304350614547729492e-02
1.242569684982299805e-01
4.895639419555664062e-02
2.881622612476348877e-01
1.441213488578796387e-01
2.643783986568450928e-01
5.666579604148864746e-01
1.540872156620025635e-01
1.478095352649688721e-01
4.913471043109893799e-01
4.228706955909729004e-01
1.413452923297882080e-01
1.517013311386108398e-01
5.177464485168457031e-01
1.151247024536132812e-01
3.149936795234680176e-01
8.290268182754516602e-01
9.283161163330078125e-02
4.482766985893249512e-01
9.124016761779785156e-02
2.021112740039825439e-01
1.995796263217926025e-01
3.490390181541442871e-01
7.898899912834167480e-02
1.884937286376953125e-01
1.946813464164733887e-01
7.313410043716430664e-01
2.862609922885894775e-01
2.420789301395416260e-01
1.686363518238067627e-01
9.840378165245056152e-02
8.204857110977172852e-01
6.618380546569824219e-02
4.960420727729797363e-02
1.211997568607330322e-01
2.057439684867858887e-01
9.764486551284790039e-02
4.626835286617279053e-01
1.030699312686920166e-01
9.235335588455200195e-01
8.892398476600646973e-01
7.351139187812805176e-01
1.768624484539031982e-01
7.276047468185424805e-01
8.088123798370361328e-01
3.823758363723754883e-01
1.020516753196716309e-01
1.149607300758361816e-01
5.445898771286010742e-01
3.308322131633758545e-01
4.586987793445587158e-01
4.713298678398132324e-01
3.569440841674804688e-01
9.172213673591613770e-01
3.891652524471282959e-01
1.147579252719879150e-01
9.400104284286499023e-01
6.282407045364379883e-01
3.105117678642272949e-01
1.196879446506500244e-01
4.273164272308349609e-01
1.464184820652008057e-01
6.487610340118408203e-01
7.209259271621704102e-02
1.349818706512451172e-01
4.466682076454162598e-01
2.809337079524993896e-01
7.891827821731567383e-02
1.480058431625366211e-01
3.941351771354675293e-01
1.570878326892852783e-01
9.082154035568237305e-01
1.809107661247253418e-01
5.328240990638732910e-02
1.442180573940277100e-01
2.501839399337768555e-01
2.755800485610961914e-01
1.934936642646789551e-01
7.294386029243469238e-01
3.195741474628448486e-01
9.395048618316650391e-01
8.962154984474182129e-01
3.802879154682159424e-01
1.139335036277770996e-01
2.240872979164123535e-01
1.141370534896850586e-01
6.402038931846618652e-01
9.384292364120483398e-02
6.542247533798217773e-02
1.169444918632507324e-01
8.973326683044433594e-01
2.287732958793640137e-01
1.899690330028533936e-01
2.192277610301971436e-01
5.137922167778015137e-01
5.137977600097656250e-01
8.722239136695861816e-01
1.252723634243011475e-01
5.420070886611938477e-01
1.522071063518524170e-01
6.026319861412048340e-01
1.162302792072296143e-01
4.614523649215698242e-01
9.259375929832458496e-02
4.676940143108367920e-01
2.927805781364440918e-01
8.316503763198852539e-01
1.927090585231781006e-01
2.017042338848114014e-01
1.674802899360656738e-01
3.899055719375610352e-02
4.413642883300781250e-01
5.474002957344055176e-01
3.596353530883789062e-01
1.504274010658264160e-01
3.278493583202362061e-01
1.752765476703643799e-01
3.819257020950317383e-01
7.082021236419677734e-02
6.391263008117675781e-02
3.129977285861968994e-01
1.864840090274810791e-01
1.265550255775451660e-01
9.400297403335571289e-01
4.390089511871337891e-01
6.136044859886169434e-01
2.388553917407989502e-01
1.116139590740203857e-01
7.706066966056823730e-02
2.248947024345397949e-01
8.654209971427917480e-02
7.826052904129028320e-01
5.915230512619018555e-02
1.153687238693237305e-01
3.282691836357116699e-01
2.911195755004882812e-01
5.611436367034912109e-01
3.622445166110992432e-01
2.202979028224945068e-01
9.400295615196228027e-01
1.873671710491180420e-01
3.551393151283264160e-01
7.060030102729797363e-02
4.244458675384521484e-01
2.274287343025207520e-01
4.205071926116943359e-02
2.428548336029052734e-01
1.623457372188568115e-01
6.130811572074890137e-02
8.379483222961425781e-02
1.780507564544677734e-01
1.315056383609771729e-01
5.757301449775695801e-01
4.493892192840576172e-02
9.663829207420349121e-02
7.012304663658142090e-02
1.023860573768615723e-01
1.199089884757995605e-01
2.763436436653137207e-01
1.967240571975708008e-01
1.093044579029083252e-01
1.533966958522796631e-01
6.977171897888183594e-01
7.613810896873474121e-02
9.266111254692077637e-02
3.614872694015502930e-01
1.895468831062316895e-01
1.887294650077819824e-01
1.527805328369140625e-01
3.324335217475891113e-01
2.796833515167236328e-01
6.872574687004089355e-01
4.279410541057586670e-01
2.075611948966979980e-01
8.793883323669433594e-01
1.420729160308837891e-01
5.075625777244567871e-01
6.900298595428466797e-01
3.171387910842895508e-01
1.251700520515441895e-01
4.957049190998077393e-01
5.277934670448303223e-02
4.933232069015502930e-02
2.135322690010070801e-01
7.048201560974121094e-02
5.639963746070861816e-01
1.719174683094024658e-01
5.550642013549804688e-01
2.578427195549011230e-01
8.065664768218994141e-02
3.150194287300109863e-01
1.783356070518493652e-01
1.542572677135467529e-01
1.140615642070770264e-01
1.252298951148986816e-01
7.542806863784790039e-01
1.667150855064392090e-01
1.219509840011596680e-01
1.051582098007202148e-01
8.863205909729003906e-01
3.130655884742736816e-01
1.705349683761596680e-01
2.953985035419464111e-01
3.867598772048950195e-01
7.964673638343811035e-02
7.738482952117919922e-02
1.638356149196624756e-01
8.451890945434570312e-02
9.503853321075439453e-02
2.010970115661621094e-01
3.630722165107727051e-01
4.496857523918151855e-02
1.278933286666870117e-01
1.501974165439605713e-01
3.363653719425201416e-01
6.071445345878601074e-02
1.090194582939147949e-01
3.856864869594573975e-01
3.082783818244934082e-01
1.429665684700012207e-01
9.899428486824035645e-02
8.540932536125183105e-01
1.089206933975219727e-01
4.458059370517730713e-01
1.102259755134582520e-01
8.323502540588378906e-02
2.725616693496704102e-01
4.038591980934143066e-01
2.940437793731689453e-01
1.712762117385864258e-01
3.373939394950866699e-01
9.089276194572448730e-01
3.948968648910522461e-02
3.448493480682373047e-01
