1.891903281211853027e+00
8.919032812118530273e-01
8.702753782272338867e-01
8.697679042816162109e-01
8.641154766082763672e-01
8.548114299774169922e-01
8.511982560157775879e-01
8.453409671783447266e-01
8.383662700653076172e-01
8.382618427276611328e-01
8.313351869583129883e-01
8.201351165771484375e-01
8.175946474075317383e-01
8.086686134338378906e-01
7.996289134025573730e-01
7.967427968978881836e-01
7.905887365341186523e-01
7.877194881439208984e-01
7.853764891624450684e-01
7.843808531761169434e-01
7.782997488975524902e-01
7.759045362472534180e-01
7.741028070449829102e-01
7.732703685760498047e-01
7.730972766876220703e-01
7.718694210052490234e-01
7.717101573944091797e-01
7.689993381500244141e-01
7.614300251007080078e-01
7.613896727561950684e-01
7.607518434524536133e-01
7.605131268501281738e-01
7.599185109138488770e-01
7.588399648666381836e-01
7.582027912139892578e-01
7.571379542350769043e-01
7.567442655563354492e-01
7.549901008605957031e-01
7.469537258148193359e-01
7.459712028503417969e-01
7.458162307739257812e-01
7.445602416992187500e-01
7.419776320457458496e-01
7.417632341384887695e-01
7.413572669029235840e-01
7.405451536178588867e-01
7.387993335723876953e-01
7.380425930023193359e-01
7.367787361145019531e-01
7.358985543251037598e-01
7.290037870407104492e-01
7.290012836456298828e-01
7.277576327323913574e-01
7.255051732063293457e-01
7.252979874610900879e-01
7.248598337173461914e-01
7.232480645179748535e-01
7.226309776306152344e-01
7.204322218894958496e-01
7.203780412673950195e-01
7.195001840591430664e-01
7.186443209648132324e-01
7.166225910186767578e-01
7.164073586463928223e-01
7.156030535697937012e-01
7.155719995498657227e-01
7.134621143341064453e-01
7.134400606155395508e-01
7.118005156517028809e-01
7.111407518386840820e-01
7.089750766754150391e-01
7.088693976402282715e-01
7.062038183212280273e-01
7.061002254486083984e-01
7.060657143592834473e-01
7.055301666259765625e-01
7.045881748199462891e-01
7.038100957870483398e-01
7.006796598434448242e-01
7.002677321434020996e-01
6.946924328804016113e-01
6.932456493377685547e-01
6.921297311782836914e-01
6.914311051368713379e-01
6.838423609733581543e-01
6.838322877883911133e-01
6.797685027122497559e-01
6.790480613708496094e-01
6.750695109367370605e-01
6.741689443588256836e-01
6.704269647598266602e-01
6.683892011642456055e-01
6.664139032363891602e-01
6.628603935241699219e-01
6.612380146980285645e-01
6.604148149490356445e-01
6.596019268035888672e-01
6.521574258804321289e-01
6.519952416419982910e-01
6.453238725662231445e-01
6.418585181236267090e-01
6.404434442520141602e-01
6.404170393943786621e-01
6.359666585922241211e-01
6.356464624404907227e-01
6.348686814308166504e-01
6.309431195259094238e-01
6.295322179794311523e-01
6.267130374908447266e-01
6.245359182357788086e-01
6.219720840454101562e-01
6.163636445999145508e-01
6.155154705047607422e-01
6.146314144134521484e-01
6.145377159118652344e-01
6.093669533729553223e-01
6.076782941818237305e-01
6.059482693672180176e-01
6.052784919738769531e-01
5.957618355751037598e-01
5.933004021644592285e-01
5.929025411605834961e-01
5.922572612762451172e-01
5.909280180931091309e-01
5.889729261398315430e-01
5.846970677375793457e-01
5.834854245185852051e-01
5.812649726867675781e-01
5.800621509552001953e-01
5.757097601890563965e-01
5.744265913963317871e-01
5.734365582466125488e-01
5.656117796897888184e-01
5.571756958961486816e-01
5.551183819770812988e-01
5.534859895706176758e-01
5.509638190269470215e-01
5.490344166755676270e-01
5.409904122352600098e-01
5.392637252807617188e-01
5.385821461677551270e-01
5.382493138313293457e-01
5.353378057479858398e-01
5.335093140602111816e-01
5.331623554229736328e-01
5.315097570419311523e-01
5.300186276435852051e-01
5.294516682624816895e-01
5.268418788909912109e-01
5.259098410606384277e-01
5.250416994094848633e-01
5.238594412803649902e-01
5.230225324630737305e-01
5.193293690681457520e-01
5.129993557929992676e-01
5.105262398719787598e-01
5.084375739097595215e-01
5.084219574928283691e-01
5.074917078018188477e-01
5.074777007102966309e-01
5.056194067001342773e-01
5.047540068626403809e-01
5.037941336631774902e-01
5.028741359710693359e-01
5.017443895339965820e-01
5.011762976646423340e-01
4.966441988945007324e-01
4.958824515342712402e-01
4.919539690017700195e-01
4.899177253246307373e-01
4.880597591400146484e-01
4.870431721210479736e-01
4.864664673805236816e-01
4.849923253059387207e-01
4.843720495700836182e-01
4.838748872280120850e-01
4.831337928771972656e-01
4.827240109443664551e-01
4.825597107410430908e-01
4.825377464294433594e-01
4.815932810306549072e-01
4.807741045951843262e-01
4.806696474552154541e-01
4.792380928993225098e-01
4.787798821926116943e-01
4.780630767345428467e-01
4.778653979301452637e-01
4.777660071849822998e-01
4.769965410232543945e-01
4.760279059410095215e-01
4.741920828819274902e-01
4.741189777851104736e-01
4.738782048225402832e-01
4.736186563968658447e-01
4.732917547225952148e-01
4.731380045413970947e-01
4.726417958736419678e-01
4.724964201450347900e-01
4.720433354377746582e-01
4.719920456409454346e-01
4.702531695365905762e-01
4.700844287872314453e-01
4.699139297008514404e-01
4.689966440200805664e-01
4.686172902584075928e-01
4.679644405841827393e-01
4.669544696807861328e-01
4.651405215263366699e-01
4.648593068122863770e-01
4.640148878097534180e-01
4.619783163070678711e-01
4.607597589492797852e-01
4.605685472488403320e-01
4.599510729312896729e-01
4.585625827312469482e-01
4.567277729511260986e-01
4.558020234107971191e-01
4.538035690784454346e-01
4.534759521484375000e-01
4.533109962940216064e-01
4.526892006397247314e-01
4.520131349563598633e-01
4.515556097030639648e-01
4.515541791915893555e-01
4.514347910881042480e-01
4.508273303508758545e-01
4.499650597572326660e-01
4.499416947364807129e-01
4.499176144599914551e-01
4.497994780540466309e-01
4.493747055530548096e-01
4.492262899875640869e-01
4.487026333808898926e-01
4.469474554061889648e-01
4.456251263618469238e-01
4.455240964889526367e-01
4.448790252208709717e-01
4.444898068904876709e-01
4.435967504978179932e-01
4.431263208389282227e-01
4.429913461208343506e-01
4.424878954887390137e-01
4.417164027690887451e-01
4.398850500583648682e-01
4.379903078079223633e-01
4.377316534519195557e-01
4.368719458580017090e-01
4.366447031497955322e-01
4.364781379699707031e-01
4.360392093658447266e-01
4.359776377677917480e-01
4.357891082763671875e-01
4.355257153511047363e-01
4.344514906406402588e-01
4.342520833015441895e-01
4.328384101390838623e-01
4.322468042373657227e-01
4.321672022342681885e-01
4.319259524345397949e-01
4.317372441291809082e-01
4.311666190624237061e-01
4.310544729232788086e-01
4.308663606643676758e-01
4.303621053695678711e-01
4.303561151027679443e-01
4.289818704128265381e-01
4.278670549392700195e-01
4.265753626823425293e-01
4.264808595180511475e-01
4.263873100280761719e-01
4.250072836875915527e-01
4.242411553859710693e-01
4.240878820419311523e-01
4.239149987697601318e-01
4.238568544387817383e-01
4.234491586685180664e-01
4.230919480323791504e-01
4.227513670921325684e-01
4.224348962306976318e-01
4.222360253334045410e-01
4.214892089366912842e-01
4.208434224128723145e-01
4.205715954303741455e-01
4.204684495925903320e-01
4.204207360744476318e-01
4.203257560729980469e-01
4.196464419364929199e-01
4.187055826187133789e-01
4.187054336071014404e-01
4.184988141059875488e-01
4.182491004467010498e-01
4.181908965110778809e-01
4.180455207824707031e-01
4.166477322578430176e-01
4.164509475231170654e-01
4.159926176071166992e-01
4.159303903579711914e-01
4.152741730213165283e-01
4.145254194736480713e-01
4.129958152770996094e-01
4.127748608589172363e-01
4.114069938659667969e-01
4.104217290878295898e-01
4.102844595909118652e-01
4.100944101810455322e-01
4.099824130535125732e-01
4.091317653656005859e-01
4.074727296829223633e-01
4.073083400726318359e-01
4.069232940673828125e-01
4.064082205295562744e-01
4.040422737598419189e-01
4.019973576068878174e-01
3.984580039978027344e-01
3.974238634109497070e-01
3.973512947559356689e-01
3.971818387508392334e-01
3.962886035442352295e-01
3.961326777935028076e-01
3.955528736114501953e-01
3.955303728580474854e-01
3.955210447311401367e-01
3.945575654506683350e-01
3.942329585552215576e-01
3.939967751502990723e-01
3.932271003723144531e-01
3.926656246185302734e-01
3.913837373256683350e-01
3.905608057975769043e-01
3.901972770690917969e-01
3.874251842498779297e-01
3.856875896453857422e-01
3.810468018054962158e-01
3.810182809829711914e-01
3.810111284255981445e-01
3.782142698764801025e-01
3.781067132949829102e-01
3.778331875801086426e-01
3.778155148029327393e-01
3.768212497234344482e-01
3.756588399410247803e-01
3.733862936496734619e-01
3.732370734214782715e-01
3.718167543411254883e-01
3.699223995208740234e-01
3.659933805465698242e-01
3.650015592575073242e-01
3.617689013481140137e-01
3.617607951164245605e-01
3.614516258239746094e-01
3.614484965801239014e-01
3.600441217422485352e-01
3.599969148635864258e-01
3.594840168952941895e-01
3.570421934127807617e-01
3.553881049156188965e-01
3.552214205265045166e-01
3.550722599029541016e-01
3.529561161994934082e-01
3.483134508132934570e-01
3.478014767169952393e-01
3.454875946044921875e-01
3.452898859977722168e-01
3.425398766994476318e-01
3.425036668777465820e-01
3.418179452419281006e-01
3.412111997604370117e-01
3.408145606517791748e-01
3.407464325428009033e-01
3.401712775230407715e-01
3.390259742736816406e-01
3.386648893356323242e-01
3.382747471332550049e-01
3.382678031921386719e-01
3.375246524810791016e-01
3.369155526161193848e-01
3.368951678276062012e-01
3.367617130279541016e-01
3.367272615432739258e-01
3.366723954677581787e-01
3.366386294364929199e-01
3.355920314788818359e-01
3.341055512428283691e-01
3.333878517150878906e-01
3.327344059944152832e-01
3.306437730789184570e-01
3.305513560771942139e-01
3.290593028068542480e-01
3.278551697731018066e-01
3.254954218864440918e-01
3.236065506935119629e-01
3.233442902565002441e-01
3.230821490287780762e-01
3.220308721065521240e-01
3.215327560901641846e-01
3.206402063369750977e-01
3.206060826778411865e-01
3.200754821300506592e-01
3.188715279102325439e-01
3.168552517890930176e-01
3.159612417221069336e-01
3.074964284896850586e-01
3.055923581123352051e-01
3.021567463874816895e-01
3.018951416015625000e-01
2.977275848388671875e-01
2.976786196231842041e-01
2.975583970546722412e-01
2.953260540962219238e-01
2.863359451293945312e-01
2.837619781494140625e-01
2.829774916172027588e-01
2.781226634979248047e-01
2.777983546257019043e-01
2.775326967239379883e-01
2.771761119365692139e-01
2.742794156074523926e-01
2.719534635543823242e-01
2.712024450302124023e-01
2.707438468933105469e-01
2.688496112823486328e-01
2.640147209167480469e-01
2.637054026126861572e-01
2.627646327018737793e-01
2.627061605453491211e-01
2.618073225021362305e-01
2.606006562709808350e-01
2.599878311157226562e-01
2.598713040351867676e-01
2.481352686882019043e-01
2.480104267597198486e-01
2.464230954647064209e-01
2.452864646911621094e-01
2.450068593025207520e-01
2.449271976947784424e-01
2.288619875907897949e-01
2.235094010829925537e-01
2.160151898860931396e-01
2.037366032600402832e-01
2.033007442951202393e-01
1.944765746593475342e-01
1.486233472824096680e-01
1.094290018081665039e-01
