0.000000000000000000e+00
5.993996996996244810e-03
8.468293806901127513e-03
8.468293806901127513e-03
1.334915727677219235e-02
1.334915727677219235e-02
1.683425080008017771e-02
1.683425080008017771e-02
1.783726436424599299e-02
1.878297101099823257e-02
1.878297101099823257e-02
1.967963414294076480e-02
1.967963414294076480e-02
2.135022248127639577e-02
2.135022248127639577e-02
2.213341365447273404e-02
2.213341365447273404e-02
2.288667734731278033e-02
2.288667734731278033e-02
2.361287784239778087e-02
2.361287784239778087e-02
2.431444015394966518e-02
2.431444015394966518e-02
2.565166661252246683e-02
2.565166661252246683e-02
2.629068276024797146e-02
2.629068276024797146e-02
2.691185612327770885e-02
2.691185612327770885e-02
2.751639511273233293e-02
2.751639511273233293e-02
2.810537315176583895e-02
2.810537315176583895e-02
2.867974895287613707e-02
2.867974895287613707e-02
2.867974895287613707e-02
2.867974895287613707e-02
2.924038303442689363e-02
2.924038303442689363e-02
3.135997448978553731e-02
3.135997448978553731e-02
3.235441237296699662e-02
3.235441237296699662e-02
3.283705224285517199e-02
3.283705224285517199e-02
3.331053887285524012e-02
3.331053887285524012e-02
3.377525721589696300e-02
3.377525721589696300e-02
3.467979238692180805e-02
3.467979238692180805e-02
3.512025056858222166e-02
3.512025056858222166e-02
3.555322770157443718e-02
3.555322770157443718e-02
3.597899387142447503e-02
3.597899387142447503e-02
3.639780213144744314e-02
3.639780213144744314e-02
3.721548064985860660e-02
3.721548064985860660e-02
3.761478432744231465e-02
3.761478432744231465e-02
3.839531221386277560e-02
3.839531221386277560e-02
3.915293092477241388e-02
3.915293092477241388e-02
4.024922359499621960e-02
4.024922359499621960e-02
4.060453176678682080e-02
4.060453176678682080e-02
4.263885551934995521e-02
4.296268148055937958e-02
4.296268148055937958e-02
4.328242137404052226e-02
4.328242137404052226e-02
4.359816509900388271e-02
4.359816509900388271e-02
4.390999886130720481e-02
4.390999886130720481e-02
4.421800538242311868e-02
4.421800538242311868e-02
4.452226409337243368e-02
4.452226409337243368e-02
4.482285131492641517e-02
4.482285131492641517e-02
4.511984042524973260e-02
4.511984042524973260e-02
4.655319537904997751e-02
4.655319537904997751e-02
4.737417017742896752e-02
4.737417017742896752e-02
4.764166243950771623e-02
4.764166243950771623e-02
4.790615826801394167e-02
4.790615826801394167e-02
4.816770702452006364e-02
4.816770702452006364e-02
4.842635646009309236e-02
4.842635646009309236e-02
4.893514074772850608e-02
4.893514074772850608e-02
4.918536367660607256e-02
4.918536367660607256e-02
4.943286356261388653e-02
4.943286356261388653e-02
4.967768110530119963e-02
4.967768110530119963e-02
4.991985576902241428e-02
4.991985576902241428e-02
5.015942583403441846e-02
5.015942583403441846e-02
5.039642844488089607e-02
5.039642844488089607e-02
5.063089965623759903e-02
5.063089965623759903e-02
5.086287447638011133e-02
5.086287447638011133e-02
5.109238690842306252e-02
5.109238690842306252e-02
5.131946998946890909e-02
5.131946998946890909e-02
5.154415582779487554e-02
5.154415582779487554e-02
5.305235150302010927e-02
5.305235150302010927e-02
5.325891474673512260e-02
5.325891474673512260e-02
5.386583332688726911e-02
5.386583332688726911e-02
5.593596338671570634e-02
5.593596338671570634e-02
5.628754746833441319e-02
5.628754746833441319e-02
5.663186382241008898e-02
5.663186382241008898e-02
5.680133801240953850e-02
5.680133801240953850e-02
5.696904422578984856e-02
5.696904422578984856e-02
5.713499803097921853e-02
5.713499803097921853e-02
5.778158876320380749e-02
5.778158876320380749e-02
5.793900240770460952e-02
5.793900240770460952e-02
5.855213061879131764e-02
5.855213061879131764e-02
5.870134581080743708e-02
5.870134581080743708e-02
5.884895920914830214e-02
5.884895920914830214e-02
5.899498283752610539e-02
5.899498283752610539e-02
5.913942847204393255e-02
5.913942847204393255e-02
5.942363166283259890e-02
5.942363166283259890e-02
5.970165826842668139e-02
5.970165826842668139e-02
5.983838233107575955e-02
5.983838233107575955e-02
5.997359418944307047e-02
5.997359418944307047e-02
6.037025757771785628e-02
6.037025757771785628e-02
6.062732057414380038e-02
6.062732057414380038e-02
6.075366655601947830e-02
6.075366655601947830e-02
6.100203275301570305e-02
6.100203275301570305e-02
6.112407054508067761e-02
6.112407054508067761e-02
6.171314284656063964e-02
6.171314284656063964e-02
6.258434308994542672e-02
6.258434308994542672e-02
6.288904515096409298e-02
6.288904515096409298e-02
6.308565605587374003e-02
6.308565605587374003e-02
6.327710486423979153e-02
6.327710486423979153e-02
6.346343829324092856e-02
6.346343829324092856e-02
6.364470127198335048e-02
6.364470127198335048e-02
6.407595492850652608e-02
6.407595492850652608e-02
6.415849125408108755e-02
6.415849125408108755e-02
6.455286205893584484e-02
6.455286205893584484e-02
6.462810534125226769e-02
6.462810534125226769e-02
6.491711638697456044e-02
6.491711638697456044e-02
6.505450022865444382e-02
6.505450022865444382e-02
6.518717665308108866e-02
6.518717665308108866e-02
6.537742729719486778e-02
6.537742729719486778e-02
6.543852076567746590e-02
6.543852076567746590e-02
6.549845799711623284e-02
6.549845799711623284e-02
6.555724216286099026e-02
6.555724216286099026e-02
6.561487636199583862e-02
6.561487636199583862e-02
6.578090908462728981e-02
6.578090908462728981e-02
6.588590137502864374e-02
6.588590137502864374e-02
6.634328903513904419e-02
6.634328903513904419e-02
6.668966936490239306e-02
6.668966936490239306e-02
6.671827335895316735e-02
6.671827335895316735e-02
6.677220978820455621e-02
6.677220978820455621e-02
6.684495493303889424e-02
6.684495493303889424e-02
6.688802583422537307e-02
6.688802583422537307e-02
6.703855607036894593e-02
6.703855607036894593e-02
6.704768452377754540e-02
6.704768452377754540e-02
6.706271691484025355e-02
6.706271691484025355e-02
6.706862157521950585e-02
6.706862157521950585e-02
6.707720924427311437e-02
6.707720924427311437e-02
6.708203932499369471e-02
6.708203932499369471e-02
6.708150266653245541e-02
6.708150266653245541e-02
6.707720924427311437e-02
6.707720924427311437e-02
6.707345227435367041e-02
6.707345227435367041e-02
6.706271691484025355e-02
6.706271691484025355e-02
6.701707245172680572e-02
6.701707245172680572e-02
6.700471625191767311e-02
6.700471625191767311e-02
6.699128301503114169e-02
6.699128301503114169e-02
6.694451433836830223e-02
6.694451433836830223e-02
6.690793674893882881e-02
6.690793674893882881e-02
6.688802583422535919e-02
6.688802583422535919e-02
6.684495493303888036e-02
6.684495493303888036e-02
6.677220978820455621e-02
6.677220978820455621e-02
6.671827335895316735e-02
6.671827335895316735e-02
6.659729724245570803e-02
6.659729724245570803e-02
6.656431476399346514e-02
6.656431476399346514e-02
6.653023372873419217e-02
6.653023372873419217e-02
6.649505244753176059e-02
6.649505244753176059e-02
6.645876917307451393e-02
6.645876917307451393e-02
6.638288936164198073e-02
6.638288936164198073e-02
6.626075761715979895e-02
6.626075761715979895e-02
6.621782237434269136e-02
6.621782237434269136e-02
6.617377123906419134e-02
6.617377123906419134e-02
6.608231230821150215e-02
6.608231230821150215e-02
6.598636222735725088e-02
6.598636222735725088e-02
6.543852076567746590e-02
6.543852076567746590e-02
6.531517434716070658e-02
6.531517434716070658e-02
6.525175859699108849e-02
6.525175859699108849e-02
6.470214834145772420e-02
6.470214834145772420e-02
6.462810534125226769e-02
6.462810534125226769e-02
6.455286205893584484e-02
6.455286205893584484e-02
6.439875775199394026e-02
6.439875775199394026e-02
6.431988805960407729e-02
6.431988805960407729e-02
6.399218702310462137e-02
6.399218702310462137e-02
6.382093700346305742e-02
6.382093700346305742e-02
6.364470127198335048e-02
6.364470127198335048e-02
6.308565605587374003e-02
6.308565605587374003e-02
6.298799885692511757e-02
6.298799885692511757e-02
6.226774445890905646e-02
6.226774445890905646e-02
6.215953667780995534e-02
6.215953667780995534e-02
6.204997985495240564e-02
6.204997985495240564e-02
6.182679030970311684e-02
6.182679030970311684e-02
6.171314284656065352e-02
6.171314284656065352e-02
6.159811685433249501e-02
6.159811685433249501e-02
6.148170459575759417e-02
6.148170459575759417e-02
6.136389818125964624e-02
6.136389818125964624e-02
6.124468956570847111e-02
6.124468956570847111e-02
6.112407054508069149e-02
6.112407054508069149e-02
6.100203275301570305e-02
6.100203275301570305e-02
6.087856765726342573e-02
6.087856765726342573e-02
5.983838233107575955e-02
5.983838233107575955e-02
5.970165826842668139e-02
5.970165826842668139e-02
5.928230764739172987e-02
5.928230764739172987e-02
5.884895920914830214e-02
5.884895920914830214e-02
5.840130135536364397e-02
5.840130135536364397e-02
5.824884548212092700e-02
5.824884548212092700e-02
5.729921465430394545e-02
5.729921465430394545e-02
5.663186382241008898e-02
5.663186382241008898e-02
5.646060573532663690e-02
5.646060573532663690e-02
5.539465678203991245e-02
5.539465678203991245e-02
5.483619242799411819e-02
5.483619242799411819e-02
5.305235150302010233e-02
5.305235150302010233e-02
5.154415582779487554e-02
5.154415582779487554e-02
5.109238690842306946e-02
5.109238690842306946e-02
5.086287447638011827e-02
5.086287447638011827e-02
5.039642844488089607e-02
5.039642844488089607e-02
4.991985576902241428e-02
4.991985576902241428e-02
4.967768110530119963e-02
4.967768110530119963e-02
4.737417017742896752e-02
4.737417017742896752e-02
4.598991193729337623e-02
4.598991193729337623e-02
4.570330403811085490e-02
4.570330403811085490e-02
4.452226409337243368e-02
4.452226409337243368e-02
4.421800538242311868e-02
4.421800538242311868e-02
4.296268148055937958e-02
4.296268148055937958e-02
4.231084967239490124e-02
4.231084967239490124e-02
4.095499969478696295e-02
4.095499969478696295e-02
4.024922359499620572e-02
4.024922359499620572e-02
3.721548064985859272e-02
3.721548064985859272e-02
3.423156438143018510e-02
3.377525721589695606e-02
3.235441237296701050e-02
3.235441237296701050e-02
3.084723650507449622e-02
3.032345626738484207e-02
3.032345626738484207e-02
2.867974895287615095e-02
2.867974895287615095e-02
2.810537315176584935e-02
2.810537315176584935e-02
2.751639511273235028e-02
2.751639511273235028e-02
2.691185612327771925e-02
2.691185612327771925e-02
2.361287784239779475e-02
2.361287784239779475e-02
1.967963414294077520e-02
1.967963414294077520e-02
1.334915727677219929e-02
1.334915727677219929e-02
1.195190361406918769e-02
1.195190361406918769e-02
0.000000000000000000e+00
