0.000000000000000000e+00
9.477341399358787596e-03
2.309805186590419002e-02
2.309805186590419002e-02
3.111623370525423704e-02
3.111623370525423704e-02
3.733523804664970469e-02
3.733523804664970469e-02
3.844450545916801992e-02
3.844450545916801992e-02
4.156921938165305391e-02
4.156921938165305391e-02
4.709904457629687791e-02
4.709904457629687791e-02
5.037856687123999644e-02
5.037856687123999644e-02
5.115681772745447192e-02
5.115681772745447192e-02
5.340337068013591149e-02
5.340337068013591149e-02
6.009592332263478942e-02
6.009592332263478942e-02
6.249223951819937728e-02
6.249223951819937728e-02
6.306996115426106997e-02
6.306996115426106997e-02
6.475554030351379775e-02
6.530222048292079473e-02
6.530222048292079473e-02
6.741795013199378128e-02
6.741795013199378128e-02
6.942780422856537070e-02
6.942780422856537070e-02
7.039588056129421345e-02
7.039588056129421345e-02
7.180473521990037022e-02
7.180473521990037022e-02
7.226326867780062668e-02
7.226326867780062668e-02
7.316433557410331745e-02
7.316433557410331745e-02
7.447737911607792138e-02
7.447737911607792138e-02
7.490514001054933424e-02
7.490514001054933424e-02
7.656879259855152442e-02
7.656879259855152442e-02
7.697324210399351940e-02
7.697324210399351940e-02
7.737325119186862221e-02
7.737325119186862221e-02
7.776888838089432432e-02
7.776888838089432432e-02
7.930901588091987531e-02
7.930901588091987531e-02
8.114320673968955511e-02
8.114320673968955511e-02
8.219781018980980292e-02
8.219781018980980292e-02
8.254198931453009258e-02
8.321958904008117108e-02
8.321958904008117108e-02
8.355309689054021827e-02
8.355309689054021827e-02
8.420973815420637609e-02
8.420973815420637609e-02
8.453295215476624991e-02
8.453295215476624991e-02
8.516936068798450221e-02
8.516936068798450221e-02
8.548262981448336018e-02
8.548262981448336018e-02
8.579265702844270092e-02
8.579265702844270092e-02
8.609947735033006422e-02
8.609947735033006422e-02
8.670363314187012893e-02
8.670363314187012893e-02
8.729536070147142501e-02
8.729536070147142501e-02
8.758664281726981360e-02
8.758664281726981360e-02
8.787491109526085475e-02
8.787491109526085475e-02
8.816019509960262845e-02
8.816019509960262845e-02
8.844252370890373638e-02
8.844252370890373638e-02
9.033836394356496713e-02
9.033836394356496713e-02
9.257904730553237482e-02
9.257904730553237482e-02
9.327925814456287934e-02
9.327925814456287934e-02
9.395701144672494176e-02
9.395701144672494176e-02
9.417802291405356907e-02
9.417802291405356907e-02
9.461278983308757384e-02
9.461278983308757384e-02
9.482657855263998403e-02
9.482657855263998403e-02
9.503799240303847928e-02
9.503799240303847928e-02
9.524704719832527422e-02
9.524704719832527422e-02
9.565814131583363911e-02
9.565814131583363911e-02
9.586021072374083241e-02
9.586021072374083241e-02
9.605998126170960105e-02
9.605998126170960105e-02
9.625746724280667688e-02
9.625746724280667688e-02
9.645268269986066734e-02
9.645268269986066734e-02
9.721111047611788458e-02
9.721111047611788458e-02
9.739517441844847134e-02
9.739517441844847134e-02
9.878977679901904119e-02
9.878977679901904119e-02
9.895453501482384673e-02
9.895453501482384673e-02
9.989954954853400015e-02
9.989954954853400015e-02
1.000498875561586926e-01
1.000498875561586926e-01
1.004888053466653497e-01
1.004888053466653497e-01
1.006311085102414987e-01
1.006311085102414987e-01
1.010461280801991102e-01
1.010461280801991102e-01
1.013129804121860739e-01
1.013129804121860739e-01
1.015720433977775339e-01
1.015720433977775339e-01
1.016986725577084250e-01
1.016986725577084250e-01
1.018233764908628436e-01
1.020670367944519069e-01
1.020670367944519069e-01
1.021860068698253743e-01
1.021860068698253743e-01
1.024182600906693719e-01
1.024182600906693719e-01
1.028601963832463106e-01
1.028601963832463106e-01
1.030699762297440369e-01
1.030699762297440369e-01
1.031720892489824543e-01
1.031720892489824543e-01
1.036551011769319408e-01
1.036551011769319408e-01
1.038355430476481794e-01
1.038355430476481794e-01
1.041747570191550731e-01
1.041747570191550731e-01
1.050214263852857766e-01
1.050214263852857766e-01
1.050805405391502662e-01
1.050805405391502662e-01
1.051379094332772213e-01
1.051379094332772213e-01
1.053499881347881306e-01
1.053499881347881306e-01
1.055343545960271689e-01
1.055343545960271689e-01
1.057907368345641086e-01
1.057907368345641086e-01
1.058485710815219305e-01
1.058485710815219305e-01
1.058995750699689986e-01
1.058995750699689986e-01
1.059437586646801988e-01
1.059437586646801988e-01
1.059632955319906866e-01
1.059632955319906866e-01
1.059811303959341672e-01
1.059811303959341672e-01
1.059972641156365081e-01
1.059972641156365081e-01
1.060244311467880562e-01
1.060244311467880562e-01
1.060448018528018232e-01
1.060448018528018232e-01
1.060660171779821276e-01
1.060660171779821276e-01
1.060626230111248874e-01
1.060626230111248874e-01
1.060583801498024004e-01
1.060583801498024004e-01
1.059972641156365081e-01
1.059972641156365081e-01
1.059811303959341672e-01
1.059811303959341672e-01
1.059632955319906866e-01
1.059632955319906866e-01
1.059225188522252004e-01
1.059225188522252004e-01
1.058749262101277566e-01
1.058749262101277566e-01
1.058485710815219305e-01
1.058485710815219305e-01
1.057907368345641086e-01
1.057907368345641086e-01
1.057260611202365808e-01
1.057260611202365808e-01
1.056911538398554867e-01
1.056911538398554867e-01
1.055761336666578287e-01
1.055761336666578287e-01
1.055343545960271689e-01
1.055343545960271689e-01
1.054908526840123706e-01
1.054908526840123706e-01
1.054456257983232004e-01
1.054456257983232004e-01
1.053499881347881306e-01
1.053499881347881306e-01
1.050805405391502662e-01
1.050805405391502662e-01
1.048979504089569970e-01
1.048979504089569970e-01
1.047674567792881012e-01
1.047674567792881012e-01
1.046995701996908945e-01
1.046995701996908945e-01
1.044103443151108424e-01
1.044103443151108424e-01
1.042550718190726755e-01
1.042550718190726755e-01
1.040926510374291514e-01
1.040926510374291514e-01
1.040087496319420379e-01
1.040087496319420379e-01
1.035621552498788012e-01
1.035621552498788012e-01
1.030699762297440369e-01
1.030699762297440369e-01
1.027525182173167073e-01
1.027525182173167073e-01
1.025315561181044388e-01
1.025315561181044388e-01
1.013129804121860739e-01
1.013129804121860739e-01
1.007714245210416804e-01
1.007714245210416804e-01
1.006311085102414987e-01
1.006311085102414987e-01
1.003445065760951299e-01
1.003445065760951299e-01
9.989954954853400015e-02
9.989954954853400015e-02
9.974718041127779433e-02
9.974718041127779433e-02
9.959277082198285391e-02
9.959277082198285391e-02
9.911720335037707552e-02
9.911720335037707552e-02
9.862291822897960303e-02
9.862291822897960303e-02
9.845394862574075034e-02
9.845394862574075034e-02
9.828285710132769748e-02
9.828285710132769748e-02
9.810963255460700139e-02
9.810963255460700139e-02
9.793426366701289687e-02
9.793426366701289687e-02
9.757704648122939028e-02
9.757704648122939028e-02
9.721111047611791234e-02
9.721111047611791234e-02
9.664564139163234202e-02
9.664564139163234202e-02
9.605998126170960105e-02
9.605998126170960105e-02
9.565814131583365298e-02
9.565814131583365298e-02
9.545375843831399587e-02
9.545375843831399587e-02
9.482657855263998403e-02
9.482657855263998403e-02
9.395701144672494176e-02
9.395701144672494176e-02
9.327925814456287934e-02
9.327925814456287934e-02
9.281497723966752877e-02
9.281497723966752877e-02
9.234056530041387378e-02
9.234056530041387378e-02
9.209951139935543263e-02
9.209951139935543263e-02
9.185586535436918165e-02
9.185586535436918165e-02
9.160960648316310295e-02
9.160960648316310295e-02
9.136071365745782047e-02
9.136071365745782047e-02
9.110916529087509375e-02
9.110916529087509375e-02
9.085493932637894732e-02
9.085493932637894732e-02
8.954283890965263060e-02
8.954283890965263060e-02
8.899842695239056078e-02
8.899842695239056078e-02
8.844252370890373638e-02
8.844252370890373638e-02
8.787491109526085475e-02
8.787491109526085475e-02
8.729536070147142501e-02
8.729536070147142501e-02
8.670363314187011505e-02
8.670363314187011505e-02
8.640312494348800776e-02
8.640312494348800776e-02
8.609947735033006422e-02
8.609947735033006422e-02
8.579265702844270092e-02
8.579265702844270092e-02
8.548262981448334630e-02
8.548262981448334630e-02
8.516936068798448833e-02
8.516936068798448833e-02
8.485281374238570762e-02
8.485281374238570762e-02
8.388313298870041235e-02
8.388313298870041235e-02
8.321958904008117108e-02
8.321958904008117108e-02
8.288256752779801784e-02
8.288256752779801784e-02
8.219781018980981679e-02
8.219781018980981679e-02
8.184998472815986637e-02
8.184998472815986637e-02
8.149846624323675570e-02
8.149846624323675570e-02
8.114320673968955511e-02
8.114320673968955511e-02
8.078415686259281248e-02
8.078415686259281248e-02
8.042126584430266123e-02
8.042126584430266123e-02
8.005448144857350845e-02
8.005448144857350845e-02
7.968374991176056799e-02
7.968374991176056799e-02
7.930901588091987531e-02
7.930901588091987531e-02
7.854731058413139122e-02
7.854731058413139122e-02
7.776888838089432432e-02
7.776888838089432432e-02
7.737325119186863609e-02
7.737325119186863609e-02
7.697324210399353328e-02
7.697324210399353328e-02
7.656879259855153830e-02
7.656879259855153830e-02
7.490514001054934812e-02
7.490514001054934812e-02
7.404471621932250114e-02
7.404471621932250114e-02
7.226326867780062668e-02
7.226326867780062668e-02
7.087115068912033800e-02
7.087115068912033800e-02
7.039588056129421345e-02
7.039588056129421345e-02
6.991480529902090180e-02
6.991480529902090180e-02
6.942780422856537070e-02
6.942780422856537070e-02
6.893475175845634184e-02
6.893475175845634184e-02
6.843551709456136001e-02
6.843551709456136001e-02
6.741795013199378128e-02
6.741795013199378128e-02
6.637394066951274318e-02
6.637394066951274318e-02
6.584162816941876994e-02
6.584162816941876994e-02
6.530222048292079473e-02
6.530222048292079473e-02
5.266858646290023538e-02
5.266858646290023538e-02
5.191993836668142015e-02
5.191993836668142015e-02
5.115681772745449274e-02
5.115681772745449274e-02
5.037856687124001032e-02
5.037856687124001032e-02
4.958447337624956319e-02
4.958447337624956319e-02
4.709904457629689178e-02
4.709904457629689178e-02
4.623310502226734425e-02
4.623310502226734425e-02
4.443849682426264519e-02
4.443849682426264519e-02
4.350724077667993822e-02
4.350724077667993822e-02
4.255138070615337165e-02
4.255138070615337165e-02
4.156921938165307473e-02
4.156921938165307473e-02
3.844450545916804074e-02
3.844450545916804074e-02
3.499599977140246260e-02
3.499599977140246260e-02
3.375766579608253937e-02
3.375766579608253937e-02
3.246659822032485487e-02
3.246659822032485487e-02
3.111623370525425092e-02
3.111623370525425092e-02
2.969848480983500530e-02
2.969848480983500530e-02
2.820319130878632535e-02
2.820319130878632535e-02
2.661728761538261281e-02
2.661728761538261281e-02
2.492348290267635408e-02
2.492348290267635408e-02
2.309805186590420042e-02
2.309805186590420042e-02
1.889761889762835503e-02
1.889761889762835503e-02
1.338954816265284370e-02
1.338954816265284370e-02
9.477341399358792801e-03
9.477341399358792801e-03
0.000000000000000000e+00
0.000000000000000000e+00
