iter	Logloss
0	0.6930802841
1	0.6928977669
2	0.6928161575
3	0.6926349088
4	0.6925724067
5	0.6924632762
6	0.6923347432
7	0.692281893
8	0.6922189185
9	0.6921438829
10	0.692096057
11	0.6919962777
12	0.6919049471
13	0.6918191562
14	0.6917298633
15	0.6916958374
16	0.691581451
17	0.6914649609
18	0.6913788406
19	0.6913412701
20	0.691222613
21	0.6911566371
22	0.6909711787
23	0.6908687309
24	0.6907677892
25	0.6906986799
26	0.6906221801
27	0.690510707
28	0.6904597677
29	0.6902940794
30	0.6902509315
31	0.6901911125
32	0.6900516009
33	0.6899591197
34	0.6899374331
35	0.6898268439
36	0.6897527462
37	0.6896321269
38	0.6895669006
39	0.6894900253
40	0.6894567531
41	0.6894415143
42	0.689385836
43	0.689287145
44	0.6892685566
45	0.6891913502
46	0.689130849
47	0.6891051676
48	0.689072962
49	0.689057529
50	0.6889760532
51	0.6888697262
52	0.6888078527
53	0.6886585288
54	0.6886244137
55	0.6885780075
56	0.6885072557
57	0.6884345925
58	0.688328836
59	0.6882444258
60	0.6881625758
61	0.6881239271
62	0.6880741844
63	0.6880101138
64	0.6879483852
65	0.6878417006
66	0.6877714294
67	0.6877304895
68	0.6876740056
69	0.6876077419
70	0.6875423629
71	0.6875302813
72	0.6874812871
73	0.6874403042
74	0.6873433274
75	0.6872741486
76	0.687212447
77	0.6871790852
78	0.6871386919
79	0.6871063898
80	0.687082602
81	0.6870066415
82	0.6868974127
83	0.6868493159
84	0.6868004107
85	0.6866858633
86	0.6865783996
87	0.6865118752
88	0.6864143682
89	0.6863874241
90	0.6863023936
91	0.6862229008
92	0.6861757717
93	0.6860788804
94	0.6860240687
95	0.6859913518
96	0.685926428
97	0.6858607385
98	0.6858205678
99	0.6857343185
100	0.6856589973
101	0.6856463211
102	0.6856063855
103	0.6855710875
104	0.685560588
105	0.6855442492
106	0.6855102855
107	0.6853295367
108	0.6852695848
109	0.6851738558
110	0.685129917
111	0.6851199705
112	0.685014862
113	0.684958197
114	0.6848943045
115	0.6848801127
116	0.6848325204
117	0.6847985185
118	0.6847410988
119	0.6846986573
120	0.6846686076
121	0.6845956119
122	0.684526259
123	0.6844399006
124	0.6843897015
125	0.684370472
126	0.6843412508
127	0.6842393385
128	0.6841809701
129	0.6841450917
130	0.6840360909
131	0.6840112958
132	0.6839956051
133	0.6839430016
134	0.683880191
135	0.6838306828
136	0.6838009979
137	0.6837291974
138	0.6837035855
139	0.6836798569
140	0.6836232441
141	0.6835691225
142	0.6835191557
143	0.683417874
144	0.6833740151
145	0.6833132074
146	0.6832285213
147	0.6831487113
148	0.683091948
149	0.6830743545
150	0.6830533868
151	0.6829641996
152	0.6829163848
153	0.6828102311
154	0.6827577802
155	0.6826901642
156	0.6826351342
157	0.6825989249
158	0.682552601
159	0.6824933269
160	0.6824009593
161	0.6823085954
162	0.6822144016
163	0.682179159
164	0.6820563969
165	0.681987288
166	0.6819053981
167	0.6818367567
168	0.6817269467
169	0.6816644532
170	0.6816417835
171	0.6815749352
172	0.6814900912
173	0.681458299
174	0.6814250078
175	0.6813476987
176	0.6812987746
177	0.681219538
178	0.6810212186
179	0.6809698157
180	0.6809017383
181	0.6807395679
182	0.6807117261
183	0.680640803
184	0.6805476753
185	0.6804509104
186	0.6804112562
187	0.6802738669
188	0.6801718909
189	0.6801405459
190	0.6800928088
191	0.6800724537
192	0.6800025669
193	0.6799358227
194	0.6798027312
195	0.6796759667
196	0.6795357472
197	0.6794707832
198	0.6793681033
199	0.6793035644
200	0.6792537488
201	0.679204182
202	0.6790934763
203	0.6790480268
204	0.6789897612
205	0.6789444099
206	0.678882844
207	0.6788189348
208	0.6786860396
209	0.6786245909
210	0.6785205982
211	0.6784217398
212	0.678252183
213	0.6781107977
214	0.6780373057
215	0.6779620566
216	0.6778850025
217	0.6778106019
218	0.6777627963
219	0.6776994644
220	0.6776292845
221	0.6775410777
222	0.6774507803
223	0.6773854416
224	0.6773473127
225	0.6772853189
226	0.6772296249
227	0.6771549449
228	0.6770884206
229	0.6770276984
230	0.6769623161
231	0.6768737844
232	0.6767297053
233	0.6766657962
234	0.6766191919
235	0.6764437168
236	0.6763264694
237	0.6762582464
238	0.6761665203
239	0.6760577518
240	0.6759752562
241	0.6758395142
242	0.6757811512
243	0.6757548747
244	0.6756962558
245	0.6756385401
246	0.6755420539
247	0.675477455
248	0.6753466375
249	0.6752744586
250	0.6752222426
251	0.6751184779
252	0.6750876795
253	0.6750072717
254	0.6749518344
255	0.6748925426
256	0.6748296897
257	0.6746981509
258	0.6746369427
259	0.6745497636
260	0.67443129
261	0.6743848306
262	0.6742771538
263	0.6742127321
264	0.674067063
265	0.6740026313
266	0.6739451274
267	0.6738420556
268	0.6737699241
269	0.6736625125
270	0.6736059237
271	0.673501275
272	0.6733729505
273	0.6733205787
274	0.6732775802
275	0.6732293508
276	0.6731723497
277	0.6730883475
278	0.6730345626
279	0.6728497625
280	0.6727751426
281	0.6727088159
282	0.672552428
283	0.6724826739
284	0.6724498915
285	0.6723361877
286	0.6723100468
287	0.6722432248
288	0.6721457295
289	0.6720606937
290	0.6719776565
291	0.6719312607
292	0.6718434205
293	0.6717701854
294	0.6717013177
295	0.6715974557
296	0.671525309
297	0.6714874137
298	0.6714089896
299	0.6713341948
300	0.6712556858
301	0.6711867833
302	0.6711633444
303	0.6710937698
304	0.6710763406
305	0.6710021883
306	0.6709413558
307	0.6709219333
308	0.6708219145
309	0.670753332
310	0.6706928079
311	0.6706302465
312	0.6705649339
313	0.6704995443
314	0.6704516167
315	0.670411467
316	0.670380961
317	0.6703001927
318	0.6701950419
319	0.6701462961
320	0.670104361
321	0.6700418939
322	0.669966518
323	0.6698847184
324	0.6698197166
325	0.66976085
326	0.6697132132
327	0.6696453123
328	0.6695914149
329	0.6695533295
330	0.669440371
331	0.6693532072
332	0.6693096091
333	0.6692572864
334	0.6692056729
335	0.6691649997
336	0.6691117911
337	0.6690528674
338	0.668960303
339	0.6688984074
340	0.6688381576
341	0.6687547182
342	0.668714385
343	0.6686509801
344	0.6685774922
345	0.6685436806
346	0.6684863869
347	0.6684143996
348	0.6683890164
349	0.6683421638
350	0.6682972384
351	0.6682026216
352	0.6681336506
353	0.668034231
354	0.6679717808
355	0.6679109808
356	0.6678169318
357	0.6677172794
358	0.6676511295
359	0.667618944
360	0.6675411367
361	0.6674928781
362	0.6674437183
363	0.6673715808
364	0.6673186526
365	0.667249138
366	0.6671709939
367	0.6671189095
368	0.6670172914
369	0.6669458539
370	0.6668896777
371	0.6668445338
372	0.6667461579
373	0.6666902725
374	0.666601044
375	0.6665528578
376	0.666473852
377	0.66641561
378	0.6662971477
379	0.6662228547
380	0.6661703863
381	0.6661078024
382	0.6660447753
383	0.6659984885
384	0.6659160337
385	0.6658249078
386	0.6657411703
387	0.6657057548
388	0.6656734712
389	0.6656396526
390	0.665580834
391	0.6655208764
392	0.6654904914
393	0.6654582223
394	0.665378155
395	0.6653007894
396	0.6652565685
397	0.6652107952
398	0.6651647777
399	0.6651450065
400	0.665062671
401	0.6649741488
402	0.6648800079
403	0.6647624822
404	0.6646700444
405	0.6645505102
406	0.6644757981
407	0.6644215942
408	0.6643621261
409	0.6642946552
410	0.6641985594
411	0.6641403685
412	0.6641106491
413	0.6640588201
414	0.6640223865
415	0.6639898716
416	0.6639565752
417	0.6639052516
418	0.663856089
419	0.663811899
420	0.6637248323
421	0.6636420067
422	0.6635706528
423	0.6635420235
424	0.6635103403
425	0.6634603872
426	0.6633882096
427	0.663277194
428	0.6632107943
429	0.6631487069
430	0.6630967511
431	0.6630715039
432	0.6629956756
433	0.6628606576
434	0.6628116067
435	0.6627344757
436	0.6626672599
437	0.6626389721
438	0.6625785549
439	0.6624844667
440	0.6623330114
441	0.6622934143
442	0.6622398035
443	0.6621881068
444	0.6621257857
445	0.6620413738
446	0.6619920978
447	0.6619678662
448	0.6618955818
449	0.6618426133
450	0.6618072557
451	0.6617038507
452	0.661642305
453	0.6614991889
454	0.661467403
455	0.661400863
456	0.6613396775
457	0.6612886844
458	0.6612460713
459	0.6612130784
460	0.6611821552
461	0.6611166148
462	0.6610187914
463	0.6609669525
464	0.6609177904
465	0.6608156875
466	0.6607271883
467	0.6606067392
468	0.6605543565
469	0.6604871382
470	0.6604316508
471	0.6603707441
472	0.660303845
473	0.6602383682
474	0.66019006
475	0.6600828848
476	0.6600481495
477	0.6599970821
478	0.6599200139
479	0.6598166485
480	0.6597345027
481	0.6596891076
482	0.6596262977
483	0.6595864314
484	0.6595593466
485	0.6594984094
486	0.6594661755
487	0.6593873046
488	0.6592681673
489	0.6591797816
490	0.6591536222
491	0.6590835425
492	0.6589985084
493	0.658899636
494	0.6588485278
495	0.6587537148
496	0.6586929139
497	0.6585577153
498	0.6585204462
499	0.6584126016
