0.000000000000000000e+00
9.477341399358787596e-03
5.266858646290026313e-02
5.266858646290026313e-02
5.483356636222013608e-02
5.483356636222013608e-02
5.884284153573823839e-02
5.884284153573823839e-02
6.584162816941876994e-02
6.584162816941876994e-02
7.039588056129421345e-02
7.087115068912033800e-02
8.184998472815983861e-02
8.219781018980980292e-02
8.321958904008117108e-02
8.321958904008117108e-02
9.234056530041387378e-02
9.234056530041387378e-02
9.482657855263998403e-02
9.482657855263998403e-02
9.878977679901904119e-02
9.878977679901904119e-02
1.019461622622450658e-01
1.019461622622450658e-01
1.026429734565401375e-01
1.027525182173167073e-01
1.044103443151108562e-01
1.044103443151108562e-01
1.050805405391502662e-01
1.050805405391502662e-01
1.052995726487054862e-01
1.052995726487054862e-01
1.055761336666578287e-01
1.055761336666578287e-01
1.056911538398554867e-01
1.057260611202365808e-01
1.057260611202365808e-01
1.060626230111248874e-01
1.060626230111248874e-01
1.060244311467880562e-01
1.060244311467880562e-01
1.057907368345641086e-01
1.057907368345641086e-01
1.054456257983232004e-01
1.054456257983232004e-01
1.050805405391502662e-01
1.050805405391502662e-01
1.050214263852857766e-01
1.050214263852857766e-01
1.044103443151108424e-01
1.044103443151108424e-01
1.039230484541326383e-01
1.039230484541326383e-01
1.035621552498788012e-01
1.035621552498788012e-01
1.034673861658832045e-01
1.034673861658832045e-01
1.033707889106008637e-01
1.033707889106008637e-01
1.032723583540145484e-01
1.032723583540145484e-01
1.028601963832463106e-01
1.028601963832463106e-01
1.024182600906693719e-01
1.024182600906693719e-01
1.023030791325461597e-01
1.021860068698253743e-01
1.020670367944519069e-01
1.020670367944519069e-01
1.019461622622450658e-01
1.019461622622450658e-01
1.007714245210416804e-01
1.007714245210416804e-01
1.003445065760951299e-01
1.003445065760951299e-01
9.989954954853400015e-02
9.989954954853400015e-02
9.974718041127779433e-02
9.974718041127779433e-02
9.959277082198285391e-02
9.959277082198285391e-02
9.845394862574075034e-02
9.845394862574075034e-02
9.793426366701289687e-02
9.793426366701289687e-02
9.757704648122939028e-02
9.757704648122939028e-02
9.702484217972220937e-02
9.702484217972220937e-02
9.683635680879366936e-02
9.683635680879366936e-02
9.664564139163234202e-02
9.664564139163234202e-02
9.645268269986066734e-02
9.645268269986066734e-02
9.625746724280667688e-02
9.625746724280667688e-02
9.605998126170960105e-02
9.605998126170960105e-02
9.586021072374084628e-02
9.586021072374084628e-02
9.545375843831399587e-02
9.545375843831399587e-02
9.524704719832527422e-02
9.524704719832527422e-02
9.417802291405356907e-02
9.417802291405356907e-02
9.395701144672494176e-02
9.395701144672494176e-02
9.350764674613515348e-02
9.350764674613515348e-02
9.327925814456287934e-02
9.327925814456287934e-02
9.281497723966752877e-02
9.281497723966752877e-02
9.257904730553237482e-02
9.257904730553237482e-02
9.209951139935543263e-02
9.209951139935543263e-02
9.185586535436918165e-02
9.185586535436918165e-02
9.059801322324900763e-02
9.059801322324900763e-02
9.007596793817981840e-02
9.007596793817981840e-02
8.954283890965263060e-02
8.954283890965263060e-02
8.899842695239056078e-02
8.899842695239056078e-02
8.872192513691302962e-02
8.872192513691302962e-02
8.844252370890373638e-02
8.844252370890373638e-02
8.787491109526085475e-02
8.787491109526085475e-02
8.758664281726979972e-02
8.758664281726979972e-02
8.640312494348800776e-02
8.640312494348800776e-02
8.609947735033006422e-02
8.609947735033006422e-02
8.485281374238570762e-02
8.485281374238570762e-02
8.453295215476623603e-02
8.453295215476623603e-02
8.355309689054019051e-02
8.355309689054019051e-02
8.321958904008117108e-02
8.321958904008117108e-02
8.288256752779801784e-02
8.288256752779801784e-02
8.114320673968955511e-02
8.114320673968955511e-02
8.078415686259281248e-02
8.078415686259281248e-02
8.042126584430266123e-02
8.042126584430266123e-02
7.968374991176056799e-02
7.968374991176056799e-02
7.930901588091987531e-02
7.930901588091987531e-02
7.893022234860358477e-02
7.893022234860358477e-02
7.854731058413139122e-02
7.854731058413139122e-02
7.816022006110269482e-02
7.816022006110269482e-02
7.776888838089432432e-02
7.776888838089432432e-02
7.697324210399353328e-02
7.697324210399353328e-02
7.615983193258765716e-02
7.615983193258765716e-02
7.574628703771557614e-02
7.574628703771557614e-02
7.532808241286911843e-02
7.532808241286911843e-02
7.404471621932250114e-02
7.404471621932250114e-02
7.360706487831178424e-02
7.360706487831178424e-02
7.316433557410331745e-02
7.316433557410331745e-02
7.226326867780062668e-02
7.226326867780062668e-02
7.134073170356469706e-02
7.134073170356469706e-02
7.087115068912033800e-02
7.087115068912033800e-02
7.039588056129421345e-02
7.039588056129421345e-02
6.991480529902090180e-02
6.991480529902090180e-02
6.942780422856537070e-02
6.942780422856537070e-02
6.893475175845634184e-02
6.893475175845634184e-02
6.843551709456136001e-02
6.843551709456136001e-02
6.741795013199378128e-02
6.741795013199378128e-02
6.689932735087850135e-02
6.689932735087850135e-02
6.530222048292079473e-02
6.530222048292079473e-02
6.475554030351379775e-02
6.475554030351379775e-02
6.420140185385361797e-02
6.420140185385361797e-02
6.363961030678927377e-02
6.363961030678927377e-02
6.249223951819937034e-02
6.249223951819937034e-02
6.009592332263477554e-02
6.009592332263477554e-02
5.884284153573821757e-02
5.884284153573821757e-02
5.820154637120906332e-02
5.820154637120906332e-02
5.621458885378419201e-02
5.621458885378419201e-02
5.552999189627168264e-02
5.552999189627168264e-02
5.412485565800613518e-02
5.412485565800613518e-02
5.340337068013589067e-02
5.340337068013589067e-02
5.266858646290023538e-02
5.266858646290023538e-02
5.191993836668142015e-02
5.191993836668142015e-02
4.958447337624956319e-02
4.958447337624956319e-02
4.877376343896379363e-02
4.877376343896379363e-02
4.709904457629689178e-02
4.709904457629689178e-02
4.623310502226734425e-02
4.623310502226734425e-02
4.534666470645885850e-02
4.534666470645885850e-02
4.443849682426264519e-02
4.443849682426264519e-02
4.350724077667993822e-02
4.350724077667993822e-02
4.255138070615337165e-02
4.255138070615337165e-02
4.156921938165307473e-02
4.156921938165307473e-02
4.055884613743346301e-02
4.055884613743346301e-02
3.951809712018028442e-02
3.951809712018028442e-02
3.733523804664973245e-02
3.733523804664973245e-02
3.618701424544447376e-02
3.618701424544447376e-02
3.499599977140246260e-02
3.499599977140246260e-02
3.375766579608253937e-02
3.375766579608253937e-02
3.246659822032485487e-02
3.246659822032485487e-02
3.111623370525425092e-02
3.111623370525425092e-02
2.969848480983500530e-02
2.969848480983500530e-02
2.820319130878632535e-02
2.820319130878632535e-02
2.661728761538261281e-02
2.661728761538261281e-02
2.492348290267635408e-02
2.492348290267635408e-02
2.309805186590420042e-02
2.309805186590420042e-02
2.110687091920544073e-02
2.110687091920544073e-02
1.889761889762835503e-02
1.889761889762835503e-02
1.638230752977126378e-02
1.638230752977126378e-02
1.338954816265284370e-02
1.338954816265284370e-02
9.477341399358792801e-03
9.477341399358792801e-03
0.000000000000000000e+00
