2.111388742923736572e-01
2.606107592582702637e-01
1.000000000000000000e+00
1.000000000000000000e+00
1.000000000000000000e+00
9.999763369560241699e-01
1.000000000000000000e+00
2.181020081043243408e-01
9.999961853027343750e-01
1.871182918548583984e-01
1.000000000000000000e+00
9.999997019767761230e-01
3.076874017715454102e-01
3.462605178356170654e-01
1.944178640842437744e-01
5.160068869590759277e-01
8.098409175872802734e-01
5.508698821067810059e-01
1.000000000000000000e+00
1.000000000000000000e+00
1.826817393302917480e-01
3.398667573928833008e-01
9.994394779205322266e-01
9.999523162841796875e-01
1.809487938880920410e-01
7.097434997558593750e-01
3.142940104007720947e-01
1.000000000000000000e+00
1.000000000000000000e+00
9.998638033866882324e-01
6.674311757087707520e-01
1.000000000000000000e+00
1.927855908870697021e-01
2.436436712741851807e-01
2.056655883789062500e-01
3.063399791717529297e-01
2.684839963912963867e-01
2.108596861362457275e-01
2.149884998798370361e-01
1.947278678417205811e-01
1.000000000000000000e+00
9.999771714210510254e-01
9.980920553207397461e-01
4.031713008880615234e-01
9.999990463256835938e-01
9.978321194648742676e-01
9.999881982803344727e-01
1.952785849571228027e-01
2.333645522594451904e-01
2.358954548835754395e-01
1.814998984336853027e-01
3.353681564331054688e-01
5.189678668975830078e-01
1.000000000000000000e+00
2.072443664073944092e-01
9.992505311965942383e-01
1.000000000000000000e+00
3.132655620574951172e-01
7.645336985588073730e-01
1.977752745151519775e-01
9.999997615814208984e-01
1.915713250637054443e-01
9.994483590126037598e-01
1.999242901802062988e-01
2.540745139122009277e-01
9.999278187751770020e-01
9.999966621398925781e-01
6.799269318580627441e-01
9.986026287078857422e-01
5.705100893974304199e-01
2.205177843570709229e-01
2.062113583087921143e-01
4.033039212226867676e-01
9.999690651893615723e-01
9.958657026290893555e-01
2.343528270721435547e-01
1.000000000000000000e+00
3.909848630428314209e-01
6.788323521614074707e-01
2.067427933216094971e-01
9.949115514755249023e-01
4.553814828395843506e-01
1.000000000000000000e+00
1.837136149406433105e-01
8.264350891113281250e-01
3.206701278686523438e-01
4.265967607498168945e-01
1.000000000000000000e+00
3.322804570198059082e-01
4.161562323570251465e-01
3.705253601074218750e-01
1.902403831481933594e-01
8.315128087997436523e-01
9.997797012329101562e-01
1.932210028171539307e-01
9.999966621398925781e-01
8.693746328353881836e-01
5.062518119812011719e-01
3.667617142200469971e-01
2.037028968334197998e-01
9.146682620048522949e-01
2.181045413017272949e-01
3.601699769496917725e-01
8.131148815155029297e-01
1.925305724143981934e-01
9.124771952629089355e-01
4.407346248626708984e-01
2.454633116722106934e-01
2.773115038871765137e-01
9.999934434890747070e-01
8.849236965179443359e-01
9.138792157173156738e-01
3.475354909896850586e-01
4.141011238098144531e-01
7.052046656608581543e-01
9.625999927520751953e-01
2.074426710605621338e-01
1.828090846538543701e-01
1.000000000000000000e+00
9.454306364059448242e-01
9.999831914901733398e-01
4.157274365425109863e-01
9.999996423721313477e-01
6.927475333213806152e-01
7.270285487174987793e-01
9.957966804504394531e-01
9.948660731315612793e-01
2.036045491695404053e-01
2.911607027053833008e-01
1.802493929862976074e-01
9.999915361404418945e-01
9.068403840065002441e-01
2.567846179008483887e-01
9.998855590820312500e-01
8.697789907455444336e-01
9.245533347129821777e-01
6.727212071418762207e-01
8.931255936622619629e-01
1.904851198196411133e-01
6.162100434303283691e-01
2.055212259292602539e-01
1.000000000000000000e+00
3.157334923744201660e-01
3.501560688018798828e-01
9.999519586563110352e-01
1.000000000000000000e+00
9.945695400238037109e-01
1.823080778121948242e-01
9.538462758064270020e-01
9.970738291740417480e-01
9.999709129333496094e-01
9.995993375778198242e-01
7.985963225364685059e-01
6.964659690856933594e-01
4.141950905323028564e-01
5.180943608283996582e-01
1.837513744831085205e-01
3.383260965347290039e-01
9.996337294578552246e-01
1.903167068958282471e-01
2.200994491577148438e-01
2.090013623237609863e-01
9.999101161956787109e-01
9.999336004257202148e-01
2.475615739822387695e-01
2.683643698692321777e-01
9.992700815200805664e-01
2.203689515590667725e-01
1.779875457286834717e-01
9.520890712738037109e-01
1.873966753482818604e-01
9.999568462371826172e-01
1.980247795581817627e-01
8.517428636550903320e-01
9.150435924530029297e-01
1.979125738143920898e-01
9.549046754837036133e-01
2.225030064582824707e-01
1.939258277416229248e-01
2.646925449371337891e-01
9.999977946281433105e-01
1.000000000000000000e+00
4.455412626266479492e-01
2.144641876220703125e-01
9.999993443489074707e-01
1.000000000000000000e+00
9.714962840080261230e-01
9.996227025985717773e-01
2.875038981437683105e-01
2.892504036426544189e-01
2.133100628852844238e-01
1.000000000000000000e+00
8.758186697959899902e-01
3.711477220058441162e-01
9.025645852088928223e-01
1.000000000000000000e+00
9.997617006301879883e-01
9.999890327453613281e-01
4.531188011169433594e-01
9.999849796295166016e-01
9.896092414855957031e-01
9.944829344749450684e-01
9.825033545494079590e-01
9.998885393142700195e-01
6.347232460975646973e-01
4.424470067024230957e-01
9.882113337516784668e-01
9.999990463256835938e-01
9.999995827674865723e-01
4.233703017234802246e-01
9.999985694885253906e-01
1.975651085376739502e-01
1.993480920791625977e-01
9.999940395355224609e-01
1.919388473033905029e-01
9.999996423721313477e-01
3.499843180179595947e-01
9.997315406799316406e-01
2.196335792541503906e-01
1.898988783359527588e-01
9.999899864196777344e-01
3.445140719413757324e-01
5.006605982780456543e-01
9.999989271163940430e-01
9.999998211860656738e-01
9.999997019767761230e-01
9.998652935028076172e-01
3.643857836723327637e-01
1.000000000000000000e+00
1.000000000000000000e+00
2.038451731204986572e-01
2.509608864784240723e-01
2.208576202392578125e-01
1.897408962249755859e-01
2.056487798690795898e-01
9.998570084571838379e-01
3.311235010623931885e-01
9.934788346290588379e-01
1.970542669296264648e-01
5.047063231468200684e-01
2.342943251132965088e-01
9.999122023582458496e-01
2.130707800388336182e-01
2.027630805969238281e-01
5.995227098464965820e-01
3.315296173095703125e-01
1.834848523139953613e-01
1.840271949768066406e-01
9.999978542327880859e-01
1.968987584114074707e-01
4.483650922775268555e-01
2.280852794647216797e-01
1.782879233360290527e-01
9.999994039535522461e-01
3.366717100143432617e-01
2.074598371982574463e-01
9.996692538261413574e-01
9.999953508377075195e-01
2.027738094329833984e-01
1.000000000000000000e+00
7.864024043083190918e-01
5.705150961875915527e-01
3.910161852836608887e-01
9.999974966049194336e-01
9.933984279632568359e-01
1.798869073390960693e-01
1.000000000000000000e+00
2.896479666233062744e-01
2.175427675247192383e-01
3.230218291282653809e-01
9.999990463256835938e-01
1.923453211784362793e-01
9.967023134231567383e-01
5.535485148429870605e-01
1.803499460220336914e-01
1.958785653114318848e-01
9.844795465469360352e-01
8.117584586143493652e-01
3.028204441070556641e-01
5.074223875999450684e-01
7.908698320388793945e-01
6.163264513015747070e-01
6.958758831024169922e-01
1.000000000000000000e+00
5.443435907363891602e-01
9.918156862258911133e-01
1.000000000000000000e+00
2.282591462135314941e-01
4.268651008605957031e-01
5.356265902519226074e-01
4.250100851058959961e-01
5.305873155593872070e-01
3.649331629276275635e-01
9.999237060546875000e-01
9.999945163726806641e-01
9.998508691787719727e-01
9.988005161285400391e-01
9.900588989257812500e-01
9.986308813095092773e-01
1.866469979286193848e-01
9.999986886978149414e-01
9.946319460868835449e-01
9.999998807907104492e-01
9.999970197677612305e-01
3.752752542495727539e-01
9.995819330215454102e-01
4.322150349617004395e-01
1.820807158946990967e-01
9.911763668060302734e-01
9.999865293502807617e-01
2.410780191421508789e-01
1.837463378906250000e-01
4.896717965602874756e-01
3.085463643074035645e-01
7.866200804710388184e-01
2.867296338081359863e-01
9.998376965522766113e-01
4.665059149265289307e-01
1.000000000000000000e+00
2.310957312583923340e-01
9.987313747406005859e-01
7.246131300926208496e-01
9.999676942825317383e-01
9.987555742263793945e-01
5.866159796714782715e-01
2.032389640808105469e-01
1.875748634338378906e-01
9.947082996368408203e-01
1.934043765068054199e-01
7.457973361015319824e-01
2.488879263401031494e-01
2.226128578186035156e-01
9.998185634613037109e-01
9.038615226745605469e-01
2.471950650215148926e-01
2.483908236026763916e-01
4.604739546775817871e-01
2.278962135314941406e-01
9.999995231628417969e-01
1.960742771625518799e-01
9.999994039535522461e-01
9.988232851028442383e-01
2.063558399677276611e-01
9.959661364555358887e-01
1.832755208015441895e-01
1.942136585712432861e-01
4.629877209663391113e-01
7.651227712631225586e-01
5.485239624977111816e-01
9.999932050704956055e-01
1.891261339187622070e-01
9.999998211860656738e-01
9.567321538925170898e-01
3.192561268806457520e-01
9.995632767677307129e-01
9.086122512817382812e-01
9.130700230598449707e-01
7.500203251838684082e-01
5.141312479972839355e-01
2.909981012344360352e-01
9.069088697433471680e-01
9.982895851135253906e-01
9.999762773513793945e-01
3.085294961929321289e-01
2.133648693561553955e-01
1.858603656291961670e-01
4.295839965343475342e-01
2.705607116222381592e-01
7.624209523200988770e-01
2.315466403961181641e-01
5.287090539932250977e-01
8.454554080963134766e-01
9.979357123374938965e-01
7.200003862380981445e-01
3.813088536262512207e-01
8.149992227554321289e-01
7.422616481781005859e-01
1.000000000000000000e+00
1.798637807369232178e-01
9.986146688461303711e-01
1.000000000000000000e+00
1.000000000000000000e+00
2.694312930107116699e-01
3.861275911331176758e-01
9.999783635139465332e-01
9.999994039535522461e-01
9.512128829956054688e-01
1.973740458488464355e-01
2.531178593635559082e-01
4.352340698242187500e-01
3.781703412532806396e-01
2.407097518444061279e-01
1.850077211856842041e-01
9.922637939453125000e-01
9.999989867210388184e-01
3.085584342479705811e-01
1.911398470401763916e-01
1.000000000000000000e+00
1.971351504325866699e-01
2.553429603576660156e-01
2.275312244892120361e-01
9.885265827178955078e-01
7.941691875457763672e-01
7.262775897979736328e-01
9.999995231628417969e-01
4.729054868221282959e-01
9.276455640792846680e-01
3.642274737358093262e-01
4.414944350719451904e-01
9.736564159393310547e-01
9.166663885116577148e-01
9.984562993049621582e-01
8.080206513404846191e-01
9.999986886978149414e-01
8.462903499603271484e-01
9.999868869781494141e-01
5.123556256294250488e-01
1.000000000000000000e+00
9.999983310699462891e-01
5.701270699501037598e-01
7.774757742881774902e-01
2.982711195945739746e-01
3.191709816455841064e-01
3.852672278881072998e-01
3.104898929595947266e-01
2.660751938819885254e-01
9.979479312896728516e-01
2.465090751647949219e-01
2.387645542621612549e-01
2.625767588615417480e-01
4.078490138053894043e-01
2.586845159530639648e-01
1.813099980354309082e-01
7.489031553268432617e-01
2.219816148281097412e-01
9.999884366989135742e-01
1.951912343502044678e-01
3.662934899330139160e-01
9.317080974578857422e-01
9.987356662750244141e-01
6.256316900253295898e-01
1.809644401073455811e-01
9.999895095825195312e-01
7.835082411766052246e-01
1.906552910804748535e-01
4.147983491420745850e-01
2.847818136215209961e-01
9.998869895935058594e-01
6.602064371109008789e-01
6.191024780273437500e-01
1.000000000000000000e+00
9.996752738952636719e-01
9.845005869865417480e-01
7.293977737426757812e-01
8.070701360702514648e-01
3.882779479026794434e-01
2.115441262722015381e-01
2.495656907558441162e-01
1.000000000000000000e+00
5.201930403709411621e-01
7.181927561759948730e-01
2.363972663879394531e-01
1.000000000000000000e+00
2.824581861495971680e-01
6.782624721527099609e-01
3.684674501419067383e-01
5.316164493560791016e-01
1.000000000000000000e+00
2.395896911621093750e-01
9.999885559082031250e-01
2.404295802116394043e-01
3.160325288772583008e-01
9.999961853027343750e-01
9.999917745590209961e-01
9.999998211860656738e-01
3.239252567291259766e-01
1.786977350711822510e-01
2.131634056568145752e-01
6.608338356018066406e-01
2.995421290397644043e-01
2.277906537055969238e-01
9.901111721992492676e-01
3.524259924888610840e-01
2.791696786880493164e-01
4.329784810543060303e-01
2.389328181743621826e-01
1.000000000000000000e+00
1.000000000000000000e+00
1.822825372219085693e-01
3.189777731895446777e-01
9.999259710311889648e-01
2.297993898391723633e-01
2.241099476814270020e-01
3.192066550254821777e-01
2.147498726844787598e-01
2.417532205581665039e-01
1.000000000000000000e+00
3.182986378669738770e-01
3.704780340194702148e-01
1.000000000000000000e+00
9.999962449073791504e-01
9.999446272850036621e-01
2.073794305324554443e-01
1.830883622169494629e-01
3.514815270900726318e-01
6.323767900466918945e-01
4.540967047214508057e-01
3.520008623600006104e-01
3.111871778964996338e-01
9.997571706771850586e-01
9.994546175003051758e-01
2.421760261058807373e-01
2.166499495506286621e-01
6.512899398803710938e-01
4.446807801723480225e-01
9.972792267799377441e-01
9.999912381172180176e-01
6.578628420829772949e-01
9.993776679039001465e-01
6.872631311416625977e-01
9.956163763999938965e-01
1.798070371150970459e-01
5.505849719047546387e-01
3.449123501777648926e-01
2.367363274097442627e-01
2.131294906139373779e-01
3.093986511230468750e-01
1.915094256401062012e-01
9.999998211860656738e-01
9.998411536216735840e-01
3.386893868446350098e-01
3.748550713062286377e-01
9.940845966339111328e-01
1.978822350502014160e-01
2.648041844367980957e-01
2.879927158355712891e-01
2.349295914173126221e-01
2.080320119857788086e-01
2.151874005794525146e-01
9.998832941055297852e-01
1.000000000000000000e+00
1.871553659439086914e-01
2.497357428073883057e-01
3.580437898635864258e-01
9.999997615814208984e-01
9.917654991149902344e-01
9.167305231094360352e-01
1.000000000000000000e+00
9.999141693115234375e-01
7.825465202331542969e-01
1.863946616649627686e-01
1.953567266464233398e-01
2.212001681327819824e-01
3.839581012725830078e-01
2.284798920154571533e-01
3.281960189342498779e-01
2.054662704467773438e-01
1.849111020565032959e-01
2.791988253593444824e-01
5.622987151145935059e-01
2.007850706577301025e-01
8.707377910614013672e-01
2.276213467121124268e-01
2.356576323509216309e-01
3.340930342674255371e-01
1.984587609767913818e-01
9.592369794845581055e-01
1.910191178321838379e-01
1.836827695369720459e-01
2.042499780654907227e-01
2.764238715171813965e-01
9.999012947082519531e-01
1.868575811386108398e-01
2.763937711715698242e-01
2.012813389301300049e-01
2.640473246574401855e-01
2.589638829231262207e-01
2.529036402702331543e-01
4.381173551082611084e-01
5.368060469627380371e-01
2.283678352832794189e-01
1.806866228580474854e-01
1.843230128288269043e-01
2.059634923934936523e-01
2.054232358932495117e-01
3.213666081428527832e-01
2.201231420040130615e-01
2.029805779457092285e-01
6.300182342529296875e-01
3.118761777877807617e-01
3.595379590988159180e-01
1.986795365810394287e-01
2.738970518112182617e-01
5.218453407287597656e-01
2.013564705848693848e-01
2.055402100086212158e-01
1.937285959720611572e-01
7.938001155853271484e-01
2.662640213966369629e-01
6.909055709838867188e-01
4.701798260211944580e-01
1.797468066215515137e-01
9.075452089309692383e-01
4.764376282691955566e-01
1.987392604351043701e-01
2.321200668811798096e-01
1.823282837867736816e-01
6.660324335098266602e-01
3.066118657588958740e-01
2.115300297737121582e-01
1.883884072303771973e-01
1.968790292739868164e-01
5.607515573501586914e-01
2.702007591724395752e-01
5.920872688293457031e-01
2.024467289447784424e-01
2.525954246520996094e-01
1.928648054599761963e-01
1.851154267787933350e-01
2.591600418090820312e-01
2.010771632194519043e-01
8.650875091552734375e-01
6.808723211288452148e-01
3.545421361923217773e-01
4.169586896896362305e-01
2.480804324150085449e-01
2.836989760398864746e-01
9.604091048240661621e-01
8.024301528930664062e-01
8.603289127349853516e-01
2.896545827388763428e-01
1.995491981506347656e-01
2.003097236156463623e-01
3.058963418006896973e-01
2.496516108512878418e-01
2.443382441997528076e-01
9.540978074073791504e-01
4.856783747673034668e-01
1.790715157985687256e-01
2.331133782863616943e-01
2.072425484657287598e-01
1.894404590129852295e-01
3.042823672294616699e-01
2.005929052829742432e-01
3.011013865470886230e-01
1.853632330894470215e-01
2.073768079280853271e-01
2.126147150993347168e-01
5.145150423049926758e-01
2.030457854270935059e-01
2.778439521789550781e-01
2.007554471492767334e-01
1.924985051155090332e-01
1.798516809940338135e-01
3.436738252639770508e-01
5.232843756675720215e-01
2.360850274562835693e-01
2.658568620681762695e-01
2.681290805339813232e-01
1.992510259151458740e-01
8.983172774314880371e-01
9.940675497055053711e-01
1.939393877983093262e-01
2.989021539688110352e-01
3.855201303958892822e-01
4.195928275585174561e-01
2.143446207046508789e-01
2.613245844841003418e-01
3.246397972106933594e-01
1.818204820156097412e-01
2.301693558692932129e-01
1.907435953617095947e-01
2.749223113059997559e-01
2.529837191104888916e-01
1.960619688034057617e-01
3.428368270397186279e-01
2.224069237709045410e-01
2.261401712894439697e-01
6.360920071601867676e-01
2.217229902744293213e-01
3.445270061492919922e-01
1.891710162162780762e-01
8.846879005432128906e-01
3.131949007511138916e-01
2.661530971527099609e-01
3.817348480224609375e-01
1.983935832977294922e-01
5.656464695930480957e-01
2.500062584877014160e-01
1.975816786289215088e-01
2.026244997978210449e-01
4.161538779735565186e-01
1.945335268974304199e-01
1.881006062030792236e-01
2.670144438743591309e-01
5.599578619003295898e-01
2.165547311305999756e-01
7.558932304382324219e-01
4.288322329521179199e-01
2.239784896373748779e-01
3.698620796203613281e-01
1.830613613128662109e-01
1.852623522281646729e-01
2.213583290576934814e-01
2.803525626659393311e-01
1.803148686885833740e-01
1.781038343906402588e-01
2.026915550231933594e-01
1.795975565910339355e-01
1.843565106391906738e-01
2.581020891666412354e-01
1.956725418567657471e-01
9.283548593521118164e-01
5.813679695129394531e-01
3.485584855079650879e-01
4.662139117717742920e-01
2.029037773609161377e-01
4.649422168731689453e-01
2.133314311504364014e-01
3.094412088394165039e-01
2.672215998172760010e-01
1.929655075073242188e-01
3.580868840217590332e-01
5.111415982246398926e-01
1.786543428897857666e-01
7.775884866714477539e-01
2.064947187900543213e-01
5.396731495857238770e-01
2.915169596672058105e-01
8.247640728950500488e-01
9.931868910789489746e-01
8.667834401130676270e-01
1.780639886856079102e-01
4.181205630302429199e-01
5.082804560661315918e-01
2.386101484298706055e-01
2.462619245052337646e-01
7.768813371658325195e-01
1.942742466926574707e-01
9.923408627510070801e-01
2.976599037647247314e-01
3.562609255313873291e-01
3.009376227855682373e-01
3.261789679527282715e-01
2.475885152816772461e-01
2.575179934501647949e-01
3.087652325630187988e-01
4.236699044704437256e-01
6.660330295562744141e-01
3.668189048767089844e-01
5.272438526153564453e-01
2.867548465728759766e-01
1.961936652660369873e-01
5.351619124412536621e-01
5.540218353271484375e-01
2.654744386672973633e-01
5.248548984527587891e-01
2.048254013061523438e-01
2.200260460376739502e-01
1.783971786499023438e-01
2.074513137340545654e-01
4.628626704216003418e-01
2.923477590084075928e-01
5.711630582809448242e-01
7.072938680648803711e-01
4.392654895782470703e-01
1.982008218765258789e-01
3.682082891464233398e-01
9.380655884742736816e-01
6.443915963172912598e-01
1.910535395145416260e-01
3.800972700119018555e-01
7.952554225921630859e-01
1.897370815277099609e-01
7.132499217987060547e-01
4.593721926212310791e-01
3.364431262016296387e-01
1.896123886108398438e-01
1.952863335609436035e-01
2.353076934814453125e-01
1.793804764747619629e-01
1.977384984493255615e-01
2.338348329067230225e-01
3.748162984848022461e-01
2.017357647418975830e-01
2.531039714813232422e-01
9.969323873519897461e-01
3.069208860397338867e-01
2.242214381694793701e-01
1.784563064575195312e-01
1.848455071449279785e-01
1.797725856304168701e-01
1.825318038463592529e-01
6.350548863410949707e-01
3.826537728309631348e-01
6.073638200759887695e-01
7.761964201927185059e-01
1.848791241645812988e-01
6.535965800285339355e-01
2.123189866542816162e-01
2.170038819313049316e-01
2.531059682369232178e-01
2.298487424850463867e-01
4.997550547122955322e-01
6.367367506027221680e-01
2.625029683113098145e-01
4.118585586547851562e-01
8.595054745674133301e-01
1.800399720668792725e-01
6.660953760147094727e-01
9.572331905364990234e-01
3.508178591728210449e-01
2.342605590820312500e-01
5.903399586677551270e-01
4.068930149078369141e-01
2.164817452430725098e-01
2.212976217269897461e-01
2.955856323242187500e-01
1.889608502388000488e-01
4.793474078178405762e-01
3.034564852714538574e-01
1.916400492191314697e-01
2.031879425048828125e-01
1.896606087684631348e-01
9.971230030059814453e-01
2.305743098258972168e-01
8.760904073715209961e-01
1.945038437843322754e-01
3.190245628356933594e-01
2.254931330680847168e-01
1.830466091632843018e-01
1.864637136459350586e-01
1.838026046752929688e-01
2.277004420757293701e-01
1.830443441867828369e-01
2.150076925754547119e-01
2.308333814144134521e-01
1.833656728267669678e-01
1.890590488910675049e-01
5.235701203346252441e-01
6.473602652549743652e-01
3.293753564357757568e-01
2.082602083683013916e-01
2.225445806980133057e-01
3.758729100227355957e-01
2.727058529853820801e-01
1.825120449066162109e-01
8.256598114967346191e-01
2.069969177246093750e-01
8.337910175323486328e-01
3.890702426433563232e-01
2.406637966632843018e-01
2.222437560558319092e-01
1.842976510524749756e-01
1.809683144092559814e-01
1.797264516353607178e-01
2.207710742950439453e-01
1.928564310073852539e-01
8.795220255851745605e-01
1.894536316394805908e-01
3.858684897422790527e-01
1.779926717281341553e-01
1.853363513946533203e-01
2.827119827270507812e-01
2.967838048934936523e-01
3.494781553745269775e-01
1.811969280242919922e-01
1.797412037849426270e-01
2.310408055782318115e-01
1.967850923538208008e-01
3.585860133171081543e-01
2.017903923988342285e-01
2.020382881164550781e-01
2.467058897018432617e-01
1.916639208793640137e-01
3.835684061050415039e-01
2.236202061176300049e-01
1.900352835655212402e-01
2.245241403579711914e-01
3.846937119960784912e-01
2.849733233451843262e-01
1.934735774993896484e-01
6.235365867614746094e-01
5.281022191047668457e-01
5.346280336380004883e-01
1.788086593151092529e-01
1.838469207286834717e-01
2.056172788143157959e-01
1.797460019588470459e-01
1.825888156890869141e-01
1.906121075153350830e-01
1.784852445125579834e-01
2.448078393936157227e-01
2.103163003921508789e-01
1.794149875640869141e-01
1.864199638366699219e-01
1.787975132465362549e-01
1.873891055583953857e-01
2.387179136276245117e-01
1.967207491397857666e-01
2.255868315696716309e-01
2.035748064517974854e-01
1.971041560173034668e-01
1.856183707714080811e-01
2.353658676147460938e-01
1.891810595989227295e-01
2.189732193946838379e-01
1.792080700397491455e-01
1.798195540904998779e-01
1.995907425880432129e-01
2.096183001995086670e-01
2.148830294609069824e-01
1.808678209781646729e-01
2.137120068073272705e-01
1.977810561656951904e-01
1.780339181423187256e-01
1.788213253021240234e-01
2.017970681190490723e-01
1.865023672580718994e-01
4.519319534301757812e-01
4.022110402584075928e-01
2.128882706165313721e-01
1.944414079189300537e-01
2.547579407691955566e-01
2.082778215408325195e-01
3.296517729759216309e-01
3.678758144378662109e-01
1.830205619335174561e-01
2.301089465618133545e-01
2.707812190055847168e-01
2.693467140197753906e-01
2.064489722251892090e-01
6.997232437133789062e-01
1.892240345478057861e-01
1.941742599010467529e-01
2.000935375690460205e-01
1.850297451019287109e-01
1.791241765022277832e-01
2.787712812423706055e-01
2.079655528068542480e-01
1.879435777664184570e-01
1.832648515701293945e-01
2.264569103717803955e-01
2.157415151596069336e-01
2.031861543655395508e-01
2.971849143505096436e-01
1.957685947418212891e-01
2.516902089118957520e-01
7.434241175651550293e-01
1.880680024623870850e-01
1.793355941772460938e-01
1.824434101581573486e-01
2.044710814952850342e-01
2.081016302108764648e-01
2.205832898616790771e-01
1.823740601539611816e-01
2.439520955085754395e-01
1.829457879066467285e-01
1.992965042591094971e-01
1.800143718719482422e-01
1.923104524612426758e-01
5.731011629104614258e-01
2.055163979530334473e-01
4.355682134628295898e-01
1.947946846485137939e-01
1.813349127769470215e-01
7.621095180511474609e-01
2.458938658237457275e-01
2.482797503471374512e-01
4.324043989181518555e-01
2.125768363475799561e-01
6.620233654975891113e-01
4.528201818466186523e-01
1.791588962078094482e-01
2.451294660568237305e-01
1.845616400241851807e-01
7.857408523559570312e-01
2.149309515953063965e-01
8.271656632423400879e-01
2.822747528553009033e-01
1.935083866119384766e-01
4.264569282531738281e-01
9.800207614898681641e-01
1.833685934543609619e-01
2.399264574050903320e-01
1.827363371849060059e-01
6.742618680000305176e-01
1.853221952915191650e-01
5.289950966835021973e-01
1.814303100109100342e-01
1.828728020191192627e-01
2.027474939823150635e-01
1.929840743541717529e-01
2.859611511230468750e-01
1.802086532115936279e-01
2.219792306423187256e-01
2.015685737133026123e-01
1.800740063190460205e-01
1.983695626258850098e-01
1.932058632373809814e-01
1.867921054363250732e-01
1.797948479652404785e-01
1.830842792987823486e-01
2.345852553844451904e-01
1.834006309509277344e-01
1.882159411907196045e-01
2.055747509002685547e-01
1.984632015228271484e-01
1.796706020832061768e-01
1.786035299301147461e-01
1.872434616088867188e-01
2.046599090099334717e-01
1.998327970504760742e-01
1.917068660259246826e-01
1.948771178722381592e-01
1.839975416660308838e-01
1.941553354263305664e-01
1.875502169132232666e-01
2.440925538539886475e-01
1.808623075485229492e-01
3.299203813076019287e-01
1.789563894271850586e-01
2.205253243446350098e-01
1.804777681827545166e-01
1.955506503582000732e-01
1.823581159114837646e-01
2.024409472942352295e-01
2.064694762229919434e-01
1.955066919326782227e-01
1.817349493503570557e-01
1.789991855621337891e-01
1.847392320632934570e-01
2.042854428291320801e-01
1.792946457862854004e-01
9.828567504882812500e-01
1.929332613945007324e-01
2.573837935924530029e-01
2.117494344711303711e-01
1.786489188671112061e-01
1.820943057537078857e-01
1.927914917469024658e-01
2.441934645175933838e-01
1.873595416545867920e-01
8.956716060638427734e-01
1.807200610637664795e-01
1.869249343872070312e-01
1.998718380928039551e-01
2.025940120220184326e-01
2.106390595436096191e-01
2.317034602165222168e-01
5.013531446456909180e-01
3.545642197132110596e-01
1.979125142097473145e-01
2.883201539516448975e-01
2.261677086353302002e-01
2.469785213470458984e-01
5.879775285720825195e-01
9.999619722366333008e-01
1.949978768825531006e-01
2.555366456508636475e-01
1.817271113395690918e-01
9.959390759468078613e-01
2.776917815208435059e-01
1.805570125579833984e-01
2.065313458442687988e-01
1.904727816581726074e-01
2.140619158744812012e-01
1.798831224441528320e-01
2.752533257007598877e-01
2.203958332538604736e-01
2.013740837574005127e-01
1.814636290073394775e-01
1.959150135517120361e-01
4.787247776985168457e-01
1.914250552654266357e-01
1.804135143756866455e-01
4.490382075309753418e-01
1.919499635696411133e-01
8.771079778671264648e-01
9.999794960021972656e-01
2.041884362697601318e-01
3.377410471439361572e-01
1.846157610416412354e-01
2.494411766529083252e-01
2.130585014820098877e-01
1.850408017635345459e-01
1.877712607383728027e-01
2.051258087158203125e-01
1.946988105773925781e-01
1.838362514972686768e-01
1.839188933372497559e-01
1.833757758140563965e-01
1.804037094116210938e-01
2.323226332664489746e-01
1.915551126003265381e-01
1.788767874240875244e-01
1.905773282051086426e-01
1.803237497806549072e-01
2.307934761047363281e-01
