0.000000000000000000e+00
0.000000000000000000e+00
0.000000000000000000e+00
5.993996996996244810e-03
5.993996996996244810e-03
8.468293806901127513e-03
8.468293806901127513e-03
1.036108102468077420e-02
1.036108102468077420e-02
1.195190361406918422e-02
1.195190361406918422e-02
1.334915727677219235e-02
1.334915727677219235e-02
1.460849068179187124e-02
1.460849068179187124e-02
1.576299463934438885e-02
1.576299463934438885e-02
1.683425080008017771e-02
1.683425080008017771e-02
1.783726436424599299e-02
1.783726436424599299e-02
1.967963414294076480e-02
1.967963414294076480e-02
2.053367965075914015e-02
2.053367965075914015e-02
2.135022248127639577e-02
2.135022248127639577e-02
2.213341365447273404e-02
2.213341365447273404e-02
2.288667734731278033e-02
2.288667734731278033e-02
2.361287784239778087e-02
2.361287784239778087e-02
2.431444015394966518e-02
2.431444015394966518e-02
2.499343913910208673e-02
2.499343913910208673e-02
2.691185612327770885e-02
2.691185612327770885e-02
2.810537315176583895e-02
2.810537315176583895e-02
3.032345626738482472e-02
3.032345626738482472e-02
3.084723650507448581e-02
3.084723650507448581e-02
3.283705224285517199e-02
3.283705224285517199e-02
3.331053887285524012e-02
3.331053887285524012e-02
3.512025056858222166e-02
3.512025056858222166e-02
3.555322770157443718e-02
3.555322770157443718e-02
3.597899387142447503e-02
3.597899387142447503e-02
3.680988997538569424e-02
3.680988997538569424e-02
3.721548064985860660e-02
3.721548064985860660e-02
3.761478432744231465e-02
3.761478432744231465e-02
3.800799915807197282e-02
3.800799915807197282e-02
3.839531221386277560e-02
3.839531221386277560e-02
3.952356259245869141e-02
3.952356259245869141e-02
4.024922359499621960e-02
4.024922359499621960e-02
4.130075059850607522e-02
4.130075059850607522e-02
4.164190197385321535e-02
4.164190197385321535e-02
4.197856595930832269e-02
4.197856595930832269e-02
4.296268148055937958e-02
4.296268148055937958e-02
4.452226409337243368e-02
4.452226409337243368e-02
4.511984042524973260e-02
4.511984042524973260e-02
4.570330403811085490e-02
4.570330403811085490e-02
4.655319537904997751e-02
4.655319537904997751e-02
4.682999039077415104e-02
4.682999039077415104e-02
4.737417017742896752e-02
4.737417017742896752e-02
4.764166243950771623e-02
4.764166243950771623e-02
4.816770702452006364e-02
4.816770702452006364e-02
4.842635646009309236e-02
4.842635646009309236e-02
4.967768110530119963e-02
4.967768110530119963e-02
4.991985576902241428e-02
4.991985576902241428e-02
5.015942583403441846e-02
5.015942583403441846e-02
5.086287447638011133e-02
5.086287447638011133e-02
5.154415582779487554e-02
5.154415582779487554e-02
5.176647563819658515e-02
5.176647563819658515e-02
5.241953834211057761e-02
5.241953834211057761e-02
5.305235150302010927e-02
5.305235150302010927e-02
5.386583332688726911e-02
5.386583332688726911e-02
5.406396211895684450e-02
5.406396211895684450e-02
5.464613435550587373e-02
5.464613435550587373e-02
5.502428554738353350e-02
5.502428554738353350e-02
5.593596338671570634e-02
5.593596338671570634e-02
5.611267236551828463e-02
5.611267236551828463e-02
5.628754746833441319e-02
5.628754746833441319e-02
5.646060573532664384e-02
5.646060573532664384e-02
5.680133801240953850e-02
5.680133801240953850e-02
5.746170898955233614e-02
5.746170898955233614e-02
5.762249560718452068e-02
5.762249560718452068e-02
5.793900240770460952e-02
5.793900240770460952e-02
5.899498283752610539e-02
5.913942847204393255e-02
5.913942847204393255e-02
5.942363166283259890e-02
5.942363166283259890e-02
5.956341158798746788e-02
5.956341158798746788e-02
5.970165826842668139e-02
5.983838233107575955e-02
5.983838233107575955e-02
6.023952191045343907e-02
6.023952191045343907e-02
6.049952065925812139e-02
6.049952065925812139e-02
6.075366655601947830e-02
6.075366655601947830e-02
6.112407054508067761e-02
6.112407054508067761e-02
6.159811685433248807e-02
6.159811685433248807e-02
6.258434308994542672e-02
6.258434308994542672e-02
6.268722357865276484e-02
6.268722357865276484e-02
6.288904515096409298e-02
6.288904515096409298e-02
6.355470084895373239e-02
6.355470084895373239e-02
6.364470127198335048e-02
6.364470127198335048e-02
6.373344490924683081e-02
6.373344490924683081e-02
6.399218702310462137e-02
6.399218702310462137e-02
6.407595492850652608e-02
6.407595492850652608e-02
6.415849125408108755e-02
6.415849125408108755e-02
6.431988805960407729e-02
6.431988805960407729e-02
6.491711638697456044e-02
6.491711638697456044e-02
6.505450022865444382e-02
6.505450022865444382e-02
6.512142504583265379e-02
6.512142504583265379e-02
6.518717665308108866e-02
6.518717665308108866e-02
6.525175859699108849e-02
6.525175859699108849e-02
6.537742729719486778e-02
6.537742729719486778e-02
6.543852076567746590e-02
6.543852076567746590e-02
6.555724216286099026e-02
6.555724216286099026e-02
6.567136362220599155e-02
6.567136362220599155e-02
6.588590137502864374e-02
6.588590137502864374e-02
6.598636222735725088e-02
6.598636222735725088e-02
6.612860198129097422e-02
6.612860198129097422e-02
6.621782237434269136e-02
6.621782237434269136e-02
6.638288936164198073e-02
6.638288936164198073e-02
6.642138209944144223e-02
6.642138209944144223e-02
6.677220978820455621e-02
6.677220978820455621e-02
6.679754486506223055e-02
6.679754486506223055e-02
6.684495493303889424e-02
6.684495493303889424e-02
6.696118278525253764e-02
6.696118278525253764e-02
6.697677209301743095e-02
6.697677209301743095e-02
6.704768452377754540e-02
6.704768452377754540e-02
6.707345227435367041e-02
6.707345227435367041e-02
6.707720924427311437e-02
6.707720924427311437e-02
6.707989266538819106e-02
6.707989266538819106e-02
6.708203932499369471e-02
6.708203932499369471e-02
6.706862157521950585e-02
6.706862157521950585e-02
6.705573800950967445e-02
6.705573800950967445e-02
6.703855607036894593e-02
6.703855607036894593e-02
6.702835221009091626e-02
6.702835221009091626e-02
6.690793674893882881e-02
6.690793674893882881e-02
6.679754486506221667e-02
6.679754486506221667e-02
6.677220978820455621e-02
6.677220978820455621e-02
6.671827335895316735e-02
6.671827335895316735e-02
6.668966936490239306e-02
6.668966936490239306e-02
6.662918279552887402e-02
6.662918279552887402e-02
6.653023372873419217e-02
6.653023372873419217e-02
6.649505244753176059e-02
6.649505244753176059e-02
6.634328903513904419e-02
6.634328903513904419e-02
6.626075761715979895e-02
6.626075761715979895e-02
6.621782237434269136e-02
6.621782237434269136e-02
6.617377123906419134e-02
6.617377123906419134e-02
6.608231230821150215e-02
6.608231230821150215e-02
6.593669691454069615e-02
6.593669691454069615e-02
6.567136362220599155e-02
6.567136362220599155e-02
6.537742729719486778e-02
6.537742729719486778e-02
6.491711638697456044e-02
6.491711638697456044e-02
6.470214834145772420e-02
6.470214834145772420e-02
6.423980074688899478e-02
6.423980074688899478e-02
6.399218702310462137e-02
6.399218702310462137e-02
6.390718269490526515e-02
6.390718269490526515e-02
6.382093700346305742e-02
6.382093700346305742e-02
6.364470127198335048e-02
6.364470127198335048e-02
6.355470084895373239e-02
6.355470084895373239e-02
6.215953667780995534e-02
6.215953667780995534e-02
6.193906683184692563e-02
6.193906683184692563e-02
6.159811685433249501e-02
6.159811685433249501e-02
6.049952065925812139e-02
6.049952065925812139e-02
5.997359418944307047e-02
5.997359418944307047e-02
5.913942847204393255e-02
5.913942847204393255e-02
5.884895920914830214e-02
5.884895920914830214e-02
5.870134581080743708e-02
5.870134581080743708e-02
5.713499803097921853e-02
5.713499803097921853e-02
5.696904422578984856e-02
5.696904422578984856e-02
5.680133801240952462e-02
5.680133801240952462e-02
5.663186382241008898e-02
5.663186382241008898e-02
5.611267236551828463e-02
5.611267236551828463e-02
5.575740309591183802e-02
5.575740309591183802e-02
5.557697364916516780e-02
5.557697364916516780e-02
5.502428554738353350e-02
5.502428554738353350e-02
5.406396211895683757e-02
5.406396211895683757e-02
5.305235150302010233e-02
5.305235150302010233e-02
5.263268946196839049e-02
5.263268946196839049e-02
5.109238690842306946e-02
5.109238690842306946e-02
5.086287447638011827e-02
5.086287447638011827e-02
5.063089965623759903e-02
5.063089965623759903e-02
4.737417017742896752e-02
4.737417017742896752e-02
4.598991193729337623e-02
4.598991193729337623e-02
3.988894583716144637e-02
3.988894583716144637e-02
3.952356259245868447e-02
3.952356259245868447e-02
3.915293092477240694e-02
3.915293092477240694e-02
3.839531221386276866e-02
3.839531221386276866e-02
3.639780213144743620e-02
3.639780213144743620e-02
3.377525721589695606e-02
3.377525721589695606e-02
3.186220331364422731e-02
3.186220331364422731e-02
2.924038303442690750e-02
2.924038303442690750e-02
2.565166661252248417e-02
2.565166661252248417e-02
2.499343913910209714e-02
2.499343913910209714e-02
2.288667734731279074e-02
2.288667734731279074e-02
2.213341365447274445e-02
2.213341365447274445e-02
2.053367965075914708e-02
2.053367965075914708e-02
1.878297101099823951e-02
1.878297101099823951e-02
1.036108102468077767e-02
1.036108102468077767e-02
5.993996996996247412e-03
5.993996996996247412e-03
0.000000000000000000e+00
