0.000000000000000000e+00
5.993996996996244810e-03
5.993996996996244810e-03
8.468293806901127513e-03
8.468293806901127513e-03
1.036108102468077420e-02
1.036108102468077420e-02
1.195190361406918422e-02
1.195190361406918422e-02
1.334915727677219235e-02
1.334915727677219235e-02
1.576299463934438885e-02
1.576299463934438885e-02
1.683425080008017771e-02
1.683425080008017771e-02
1.878297101099823257e-02
1.878297101099823257e-02
2.053367965075914015e-02
2.053367965075914015e-02
2.135022248127639577e-02
2.135022248127639577e-02
2.213341365447273404e-02
2.213341365447273404e-02
2.361287784239778087e-02
2.361287784239778087e-02
2.431444015394966518e-02
2.431444015394966518e-02
2.499343913910208673e-02
2.499343913910208673e-02
2.565166661252246683e-02
2.565166661252246683e-02
2.629068276024797146e-02
2.629068276024797146e-02
2.691185612327770885e-02
2.691185612327770885e-02
2.751639511273233293e-02
2.751639511273233293e-02
2.924038303442689363e-02
2.924038303442689363e-02
3.032345626738482472e-02
3.032345626738482472e-02
3.135997448978553731e-02
3.135997448978553731e-02
3.186220331364419955e-02
3.186220331364419955e-02
3.235441237296699662e-02
3.235441237296699662e-02
3.331053887285524012e-02
3.331053887285524012e-02
3.377525721589696300e-02
3.377525721589696300e-02
3.423156438143019203e-02
3.423156438143019203e-02
3.512025056858222166e-02
3.512025056858222166e-02
3.555322770157443718e-02
3.555322770157443718e-02
3.597899387142447503e-02
3.597899387142447503e-02
3.639780213144744314e-02
3.639780213144744314e-02
3.680988997538569424e-02
3.680988997538569424e-02
3.761478432744231465e-02
3.761478432744231465e-02
3.800799915807197282e-02
3.800799915807197282e-02
3.839531221386277560e-02
3.839531221386277560e-02
3.877690034027990451e-02
3.877690034027990451e-02
3.915293092477241388e-02
3.915293092477241388e-02
3.952356259245869141e-02
3.952356259245869141e-02
3.988894583716145331e-02
3.988894583716145331e-02
4.060453176678682080e-02
4.060453176678682080e-02
4.095499969478696295e-02
4.095499969478696295e-02
4.197856595930832269e-02
4.197856595930832269e-02
4.263885551934995521e-02
4.263885551934995521e-02
4.296268148055937958e-02
4.296268148055937958e-02
4.328242137404052226e-02
4.328242137404052226e-02
4.359816509900388271e-02
4.359816509900388271e-02
4.390999886130720481e-02
4.390999886130720481e-02
4.421800538242311868e-02
4.421800538242311868e-02
4.452226409337243368e-02
4.452226409337243368e-02
4.482285131492641517e-02
4.482285131492641517e-02
4.570330403811085490e-02
4.570330403811085490e-02
4.598991193729337623e-02
4.627318878140990882e-02
4.627318878140990882e-02
4.655319537904997751e-02
4.655319537904997751e-02
4.682999039077415104e-02
4.682999039077415104e-02
4.737417017742896752e-02
4.737417017742896752e-02
4.790615826801394167e-02
4.790615826801394167e-02
4.842635646009309236e-02
4.842635646009309236e-02
4.868215278723816292e-02
4.868215278723816292e-02
4.918536367660607256e-02
4.918536367660607256e-02
4.943286356261388653e-02
4.943286356261388653e-02
4.967768110530119963e-02
4.967768110530119963e-02
4.991985576902241428e-02
4.991985576902241428e-02
5.015942583403441846e-02
5.015942583403441846e-02
5.063089965623759903e-02
5.086287447638011133e-02
5.086287447638011133e-02
5.154415582779487554e-02
5.154415582779487554e-02
5.176647563819658515e-02
5.176647563819658515e-02
5.284361834696787996e-02
5.284361834696787996e-02
5.305235150302010927e-02
5.305235150302010927e-02
5.325891474673512260e-02
5.325891474673512260e-02
5.346333322941996397e-02
5.346333322941996397e-02
5.366563145999495715e-02
5.366563145999495715e-02
5.406396211895684450e-02
5.406396211895684450e-02
5.445409075542442107e-02
5.445409075542442107e-02
5.483619242799413207e-02
5.483619242799413207e-02
5.521043379652074146e-02
5.521043379652074146e-02
5.539465678203991245e-02
5.539465678203991245e-02
5.575740309591184496e-02
5.575740309591184496e-02
5.593596338671570634e-02
5.593596338671570634e-02
5.611267236551828463e-02
5.611267236551828463e-02
5.628754746833441319e-02
5.628754746833441319e-02
5.680133801240953850e-02
5.680133801240953850e-02
5.696904422578984856e-02
5.696904422578984856e-02
5.713499803097921853e-02
5.713499803097921853e-02
5.729921465430394545e-02
5.729921465430394545e-02
5.762249560718452068e-02
5.762249560718452068e-02
5.778158876320380749e-02
5.778158876320380749e-02
5.793900240770460952e-02
5.793900240770460952e-02
5.840130135536364397e-02
5.840130135536364397e-02
5.870134581080743708e-02
5.870134581080743708e-02
5.884895920914830214e-02
5.884895920914830214e-02
5.956341158798746788e-02
5.956341158798746788e-02
6.037025757771785628e-02
6.037025757771785628e-02
6.049952065925812139e-02
6.049952065925812139e-02
6.075366655601947830e-02
6.075366655601947830e-02
6.112407054508067761e-02
6.112407054508067761e-02
6.124468956570846417e-02
6.124468956570846417e-02
6.136389818125963236e-02
6.136389818125963236e-02
6.148170459575758029e-02
6.148170459575758029e-02
6.159811685433248807e-02
6.159811685433248807e-02
6.171314284656063964e-02
6.171314284656063964e-02
6.182679030970311684e-02
6.182679030970311684e-02
6.215953667780994840e-02
6.215953667780994840e-02
6.237461021922301174e-02
6.237461021922301174e-02
6.278878880819410702e-02
6.278878880819410702e-02
6.308565605587374003e-02
6.308565605587374003e-02
6.318202275964263093e-02
6.318202275964263093e-02
6.337090815192725213e-02
6.337090815192725213e-02
6.390718269490526515e-02
6.390718269490526515e-02
6.439875775199394026e-02
6.439875775199394026e-02
6.447641429235964616e-02
6.447641429235964616e-02
6.462810534125226769e-02
6.462810534125226769e-02
6.470214834145772420e-02
6.470214834145772420e-02
6.484664987491643717e-02
6.484664987491643717e-02
6.491711638697456044e-02
6.491711638697456044e-02
6.498639857693300215e-02
6.498639857693300215e-02
6.505450022865444382e-02
6.505450022865444382e-02
6.525175859699108849e-02
6.525175859699108849e-02
6.537742729719486778e-02
6.537742729719486778e-02
6.543852076567746590e-02
6.543852076567746590e-02
6.549845799711623284e-02
6.549845799711623284e-02
6.555724216286099026e-02
6.561487636199583862e-02
6.561487636199583862e-02
6.572670690061993559e-02
6.572670690061993559e-02
6.593669691454069615e-02
6.593669691454069615e-02
6.598636222735725088e-02
6.598636222735725088e-02
6.603489986363271502e-02
6.603489986363271502e-02
6.617377123906419134e-02
6.617377123906419134e-02
6.626075761715979895e-02
6.626075761715979895e-02
6.630257913535492209e-02
6.630257913535492209e-02
6.634328903513904419e-02
6.634328903513904419e-02
6.645876917307451393e-02
6.645876917307451393e-02
6.649505244753176059e-02
6.649505244753176059e-02
6.653023372873419217e-02
6.653023372873419217e-02
6.659729724245572191e-02
6.659729724245572191e-02
6.662918279552887402e-02
6.662918279552887402e-02
6.677220978820455621e-02
6.677220978820455621e-02
6.679754486506223055e-02
6.679754486506223055e-02
6.682179285233225130e-02
6.682179285233225130e-02
6.688802583422537307e-02
6.688802583422537307e-02
6.692676594606973561e-02
6.692676594606973561e-02
6.697677209301743095e-02
6.697677209301743095e-02
6.699128301503114169e-02
6.699128301503114169e-02
6.700471625191767311e-02
6.700471625191767311e-02
6.702835221009091626e-02
6.702835221009091626e-02
6.703855607036894593e-02
6.703855607036894593e-02
6.705573800950967445e-02
6.705573800950967445e-02
6.706271691484025355e-02
6.706271691484025355e-02
6.706862157521950585e-02
6.707345227435367041e-02
6.707345227435367041e-02
6.707989266538819106e-02
6.707989266538819106e-02
6.707989266538819106e-02
6.707989266538819106e-02
6.706862157521950585e-02
6.706862157521950585e-02
6.706271691484025355e-02
6.706271691484025355e-02
6.705573800950967445e-02
6.705573800950967445e-02
6.701707245172680572e-02
6.701707245172680572e-02
6.699128301503114169e-02
6.699128301503114169e-02
6.692676594606973561e-02
6.692676594606973561e-02
6.682179285233223742e-02
6.682179285233223742e-02
6.679754486506221667e-02
6.679754486506221667e-02
6.668966936490239306e-02
6.668966936490239306e-02
6.662918279552887402e-02
6.662918279552887402e-02
6.659729724245570803e-02
6.659729724245570803e-02
6.656431476399346514e-02
6.656431476399346514e-02
6.649505244753176059e-02
6.649505244753176059e-02
6.642138209944144223e-02
6.642138209944144223e-02
6.638288936164198073e-02
6.638288936164198073e-02
6.630257913535490821e-02
6.630257913535490821e-02
6.626075761715979895e-02
6.626075761715979895e-02
6.598636222735725088e-02
6.598636222735725088e-02
6.583397299267301772e-02
6.583397299267301772e-02
6.567136362220599155e-02
6.567136362220599155e-02
6.549845799711623284e-02
6.549845799711623284e-02
6.525175859699108849e-02
6.525175859699108849e-02
6.498639857693300215e-02
6.498639857693300215e-02
6.462810534125226769e-02
6.462810534125226769e-02
6.447641429235964616e-02
6.447641429235964616e-02
6.399218702310462137e-02
6.399218702310462137e-02
6.382093700346305742e-02
6.382093700346305742e-02
6.327710486423979153e-02
6.327710486423979153e-02
6.308565605587374003e-02
6.308565605587374003e-02
6.215953667780995534e-02
6.215953667780995534e-02
6.182679030970311684e-02
6.182679030970311684e-02
6.112407054508069149e-02
6.112407054508069149e-02
6.100203275301570305e-02
6.100203275301570305e-02
6.075366655601947830e-02
6.075366655601947830e-02
6.037025757771785628e-02
6.037025757771785628e-02
5.997359418944307047e-02
5.997359418944307047e-02
5.983838233107575955e-02
5.983838233107575955e-02
5.928230764739172987e-02
5.928230764739172987e-02
5.899498283752610539e-02
5.899498283752610539e-02
5.884895920914830214e-02
5.884895920914830214e-02
5.824884548212092700e-02
5.824884548212092700e-02
5.793900240770460952e-02
5.793900240770460952e-02
5.713499803097921853e-02
5.713499803097921853e-02
5.646060573532663690e-02
5.646060573532663690e-02
5.575740309591183802e-02
5.575740309591183802e-02
5.557697364916516780e-02
5.557697364916516780e-02
5.406396211895683757e-02
5.406396211895683757e-02
5.284361834696787996e-02
5.284361834696787996e-02
5.220413776703912434e-02
5.220413776703912434e-02
5.131946998946891603e-02
5.131946998946891603e-02
4.893514074772851996e-02
4.893514074772851996e-02
4.737417017742896752e-02
4.737417017742896752e-02
4.482285131492641517e-02
4.482285131492641517e-02
4.452226409337243368e-02
4.452226409337243368e-02
4.060453176678681386e-02
4.060453176678681386e-02
4.024922359499620572e-02
4.024922359499620572e-02
3.952356259245868447e-02
3.952356259245868447e-02
3.915293092477240694e-02
3.915293092477240694e-02
3.800799915807197282e-02
3.800799915807197282e-02
3.721548064985859272e-02
3.721548064985859272e-02
3.467979238692180111e-02
3.467979238692180111e-02
3.331053887285522624e-02
3.331053887285522624e-02
3.235441237296701050e-02
3.235441237296701050e-02
3.186220331364422731e-02
3.186220331364422731e-02
2.751639511273235028e-02
2.751639511273235028e-02
2.691185612327771925e-02
2.629068276024798534e-02
2.565166661252248417e-02
2.565166661252248417e-02
1.878297101099823951e-02
1.878297101099823951e-02
1.460849068179187991e-02
1.460849068179187991e-02
1.334915727677219929e-02
1.334915727677219929e-02
0.000000000000000000e+00
0.000000000000000000e+00
