0.000000000000000000e+00
5.088612893457157560e-02
5.145503363708638089e-02
5.311411676362300105e-02
5.444569295151906879e-02
5.573446221173861126e-02
5.648839933817709213e-02
5.673662019332949974e-02
5.747228859407844948e-02
5.747228859407844948e-02
5.890482373899210561e-02
5.890482373899210561e-02
5.937134799909354888e-02
6.028868280005977853e-02
6.073973066120096076e-02
6.096339924290558598e-02
6.140709328766139063e-02
6.140709328766139063e-02
6.334610364985518438e-02
6.334610364985518438e-02
6.355596681346394050e-02
6.355596681346394050e-02
6.397247676482688272e-02
6.579569633871495959e-02
6.599330746517857726e-02
6.715909136028450077e-02
6.715909136028450077e-02
6.791793827582018328e-02
6.829204335095190315e-02
7.046574048541767721e-02
7.046574048541767721e-02
7.150928853344097613e-02
7.150928853344097613e-02
7.649121666407052156e-02
7.679098744052420544e-02
7.839686287269596876e-02
7.839686287269596876e-02
7.896339684981572293e-02
7.896339684981572293e-02
7.938239750082189128e-02
7.938239750082189128e-02
8.331107196766175671e-02
8.331107196766175671e-02
8.392238972495508209e-02
8.392238972495508209e-02
8.428355753951249918e-02
8.428355753951249918e-02
8.943039028441439331e-02
8.943039028441439331e-02
9.126033996647556212e-02
9.126033996647556212e-02
9.217027893941895367e-02
9.217027893941895367e-02
9.469233074940426598e-02
9.469233074940426598e-02
9.484980262328912559e-02
9.484980262328912559e-02
9.576767049406506582e-02
9.576767049406506582e-02
9.671096709133787661e-02
9.671096709133787661e-02
9.692126933668415711e-02
9.692126933668415711e-02
9.726571567544536889e-02
9.726571567544536889e-02
9.753586723844973050e-02
9.753586723844973050e-02
9.773535390334722739e-02
9.773535390334722739e-02
9.887691925322508735e-02
9.887691925322508735e-02
9.964362981997770818e-02
9.964362981997770818e-02
9.975737154783032024e-02
9.975737154783032024e-02
1.004165862264171094e-01
1.004165862264171094e-01
1.004697375484003563e-01
1.004697375484003563e-01
1.010864358856150280e-01
1.010864358856150280e-01
1.012834128330858952e-01
1.012834128330858952e-01
1.015709125021116016e-01
1.015709125021116016e-01
1.016646335719747496e-01
1.016646335719747496e-01
1.025857709783301042e-01
1.025857709783301042e-01
1.029458384411866267e-01
1.029458384411866267e-01
1.031370034438367222e-01
1.031370034438367222e-01
1.031744802296445801e-01
1.031744802296445801e-01
1.032486797935175116e-01
1.032486797935175116e-01
1.033940704272714034e-01
1.033940704272714034e-01
1.034652657247243646e-01
1.034652657247243646e-01
1.035701894569137083e-01
1.035701894569137083e-01
1.039675798081461933e-01
1.039675798081461933e-01
1.043295835343012179e-01
1.043295835343012179e-01
1.044424523821130268e-01
1.044424523821130268e-01
1.045245583321592897e-01
1.045245583321592897e-01
1.045780862687247792e-01
1.045780862687247792e-01
1.046565678396413346e-01
1.046565678396413346e-01
1.048312682872556550e-01
1.048312682872556550e-01
1.048552653731341933e-01
1.048552653731341933e-01
1.049942234228509741e-01
1.049942234228509741e-01
1.050820884285285639e-01
1.050820884285285639e-01
1.051454878553158556e-01
1.051454878553158556e-01
1.052851119731989804e-01
1.052851119731989804e-01
1.053228731362371717e-01
1.053228731362371717e-01
1.053777425458858052e-01
1.053777425458858052e-01
1.054975172010818307e-01
1.054975172010818307e-01
1.055136862498503858e-01
1.055136862498503858e-01
1.056894084768756764e-01
1.056894084768756764e-01
1.057526759160087593e-01
1.057526759160087593e-01
1.058898768091665193e-01
1.058898768091665193e-01
1.059816314011940708e-01
1.059816314011940708e-01
1.059993475664377516e-01
1.059993475664377516e-01
1.060566442962640743e-01
1.060566442962640743e-01
1.060631244016253527e-01
1.060631244016253527e-01
1.060618515550332264e-01
1.060618515550332264e-01
1.060603472620937904e-01
1.060603472620937904e-01
1.060544455991290491e-01
1.060544455991290491e-01
1.060520154071563637e-01
1.060520154071563637e-01
1.060493537044314982e-01
1.060493537044314982e-01
1.060464604735220362e-01
1.060464604735220362e-01
1.060433356954773587e-01
1.060433356954773587e-01
1.060363914145840553e-01
1.060363914145840553e-01
1.060149770183596851e-01
1.060149770183596851e-01
1.059686608274249264e-01
1.059686608274249264e-01
1.058417665702710841e-01
1.058417665702710841e-01
1.057154165578198107e-01
1.057154165578198107e-01
1.055453192367658277e-01
1.055453192367658277e-01
1.053413991260961774e-01
1.053413991260961774e-01
1.052658765456203072e-01
1.052658765456203072e-01
1.052266953496856228e-01
1.052266953496856228e-01
1.050820884285285639e-01
1.050820884285285639e-01
1.049716611026570989e-01
1.049716611026570989e-01
1.048070315083178272e-01
1.048070315083178272e-01
1.047825548699937437e-01
1.047825548699937437e-01
1.047578382041541578e-01
1.047578382041541578e-01
1.047076841083645210e-01
1.047076841083645210e-01
1.046565678396413346e-01
1.046565678396413346e-01
1.045514431118362009e-01
1.045514431118362009e-01
1.045245583321592897e-01
1.045245583321592897e-01
1.044424523821130268e-01
1.044424523821130268e-01
1.043007589005006119e-01
1.043007589005006119e-01
1.041830246278471067e-01
1.041830246278471067e-01
1.041529810928140815e-01
1.041529810928140815e-01
1.039990930224351795e-01
1.039990930224351795e-01
1.037400944882534287e-01
1.037400944882534287e-01
1.035354637694889945e-01
1.035354637694889945e-01
1.033940704272714034e-01
1.033940704272714034e-01
1.033580981659182330e-01
1.033580981659182330e-01
1.031370034438367222e-01
1.031370034438367222e-01
1.030992749572829104e-01
1.030992749572829104e-01
1.029458384411866267e-01
1.029458384411866267e-01
1.029068472592382655e-01
1.029068472592382655e-01
1.028281044251575654e-01
1.028281044251575654e-01
1.027883521904535830e-01
1.027883521904535830e-01
1.025857709783301042e-01
1.025857709783301042e-01
1.024611553099684103e-01
1.024611553099684103e-01
1.023342291969284723e-01
1.023342291969284723e-01
1.022483239653053377e-01
1.022483239653053377e-01
1.020734110040631276e-01
1.020734110040631276e-01
1.020290344737414256e-01
1.020290344737414256e-01
1.019395011014046226e-01
1.019395011014046226e-01
1.018489250236335186e-01
1.018489250236335186e-01
1.018032451017309437e-01
1.018032451017309437e-01
1.014283535407825843e-01
1.014283535407825843e-01
1.012834128330858952e-01
1.012834128330858952e-01
1.012345682235665928e-01
1.012345682235665928e-01
1.011360801389967895e-01
1.011360801389967895e-01
1.010864358856150003e-01
1.010864358856150003e-01
1.008851815829468479e-01
1.008851815829468479e-01
1.005226165862598831e-01
1.005226165862598831e-01
1.003631621877133229e-01
1.003631621877133229e-01
1.003094649965485807e-01
1.003094649965485807e-01
1.002554942140186922e-01
1.002554942140186922e-01
9.987000063617740286e-02
9.987000063617740286e-02
9.981382493566504088e-02
9.981382493566504088e-02
9.935438253339140546e-02
9.935438253339140546e-02
9.905809613126785595e-02
9.905809613126785595e-02
9.893759650286096385e-02
9.893759650286096385e-02
9.887691925322508735e-02
9.887691925322508735e-02
9.875470725682322648e-02
9.875470725682322648e-02
9.869317144821640464e-02
9.869317144821640464e-02
9.856923752692686724e-02
9.856923752692686724e-02
9.838117271886707982e-02
9.838117271886707982e-02
9.806192388609040467e-02
9.806192388609040467e-02
9.799719790005259612e-02
9.799719790005259612e-02
9.780125708846876265e-02
9.780125708846876265e-02
9.773535390334722739e-02
9.773535390334722739e-02
9.766915493525621383e-02
9.766915493525621383e-02
9.760265958235153638e-02
9.760265958235153638e-02
9.692126933668415711e-02
9.692126933668415711e-02
9.685147276376279701e-02
9.685147276376279701e-02
9.678137223563465508e-02
9.678137223563465508e-02
9.656924028634000789e-02
9.656924028634000789e-02
9.642628696432836710e-02
9.642628696432836710e-02
9.620954528942016193e-02
9.620954528942016193e-02
9.613667883664658853e-02
9.613667883664658853e-02
9.599001286335953620e-02
9.599001286335953620e-02
9.584209803516625936e-02
9.584209803516625936e-02
9.569292856091299315e-02
9.569292856091299315e-02
9.561787149845443756e-02
9.561787149845443756e-02
9.554249856400379159e-02
9.554249856400379159e-02
9.546680900939948089e-02
9.546680900939948089e-02
9.539080208095759850e-02
9.539080208095759850e-02
9.531447701942480366e-02
9.531447701942480366e-02
9.516086943194063119e-02
9.516086943194063119e-02
9.500598005971169768e-02
9.500598005971169768e-02
9.492805274563594076e-02
9.492805274563594076e-02
9.484980262328912559e-02
9.484980262328912559e-02
9.477122889306835440e-02
9.477122889306835440e-02
9.469233074940426598e-02
9.469233074940426598e-02
9.453355796932283450e-02
9.453355796932283450e-02
9.445368169146112214e-02
9.445368169146112214e-02
9.429294521021838738e-02
9.429294521021838738e-02
9.421208332814903774e-02
9.421208332814903774e-02
9.413089122211540372e-02
9.413089122211540372e-02
9.404936803687796720e-02
9.404936803687796720e-02
9.396751291073576762e-02
9.396751291073576762e-02
9.388532497546797639e-02
9.388532497546797639e-02
9.380280335627473598e-02
9.380280335627473598e-02
9.371994717171704126e-02
9.371994717171704126e-02
9.363675553365620463e-02
9.363675553365620463e-02
9.346936231060171130e-02
9.346936231060171130e-02
9.338515891527468527e-02
9.338515891527468527e-02
9.330061644565086632e-02
9.330061644565086632e-02
9.295903726607532280e-02
9.295903726607532280e-02
9.287278544372830347e-02
9.287278544372830347e-02
9.269924668107898391e-02
9.269924668107898391e-02
9.252432128315972448e-02
9.252432128315972448e-02
9.225931597467490475e-02
9.225931597467490475e-02
9.208088924447058177e-02
9.208088924447058177e-02
9.199114586176973529e-02
9.199114586176973529e-02
9.171978318470253022e-02
9.171978318470253022e-02
9.162861460736415609e-02
9.162861460736415609e-02
9.153708707899582686e-02
9.153708707899582686e-02
9.135295084929431764e-02
9.135295084929431764e-02
9.126033996647558988e-02
9.126033996647558988e-02
9.116736576948238080e-02
9.116736576948238080e-02
9.098032297330387042e-02
9.098032297330387042e-02
9.088625212185222346e-02
9.088625212185222346e-02
9.069700581329913358e-02
9.069700581329913358e-02
9.060182804893145148e-02
9.060182804893145148e-02
9.050627899071664317e-02
9.050627899071664317e-02
9.021739223297225996e-02
9.021739223297225996e-02
9.012034613095062929e-02
9.012034613095062929e-02
9.002292275211634665e-02
9.002292275211634665e-02
8.992512087026315049e-02
8.992512087026315049e-02
8.953010343225839551e-02
8.953010343225839551e-02
8.943039028441437943e-02
8.943039028441437943e-02
8.933029106009475473e-02
8.933029106009475473e-02
8.922980445998175691e-02
8.922980445998175691e-02
8.882395793126796057e-02
8.882395793126796057e-02
8.872151457676352715e-02
8.872151457676352715e-02
8.851544027520610869e-02
8.851544027520610869e-02
8.841180656005789840e-02
8.841180656005789840e-02
8.830777327019059819e-02
8.830777327019059819e-02
8.809850229868999849e-02
8.809850229868999849e-02
8.788761590299440374e-02
8.788761590299440374e-02
8.778156328621876392e-02
8.778156328621876392e-02
8.767510242628379080e-02
8.767510242628379080e-02
8.746095000806658470e-02
8.746095000806658470e-02
8.735325543264410575e-02
8.735325543264410575e-02
8.724514657947901597e-02
8.724514657947901597e-02
8.713662190661036755e-02
8.713662190661036755e-02
8.702767985844002407e-02
8.702767985844002407e-02
8.691831886557321862e-02
8.691831886557321862e-02
8.680853734465616978e-02
8.680853734465616978e-02
8.669833369821153268e-02
8.669833369821153268e-02
8.658770631447107458e-02
8.658770631447107458e-02
8.647665356720572738e-02
8.647665356720572738e-02
8.636517381555317008e-02
8.636517381555317008e-02
8.614092666141581756e-02
8.614092666141581756e-02
8.591495142576299759e-02
8.591495142576299759e-02
8.580131151464569228e-02
8.580131151464569228e-02
8.545776177047981204e-02
8.545776177047981204e-02
8.534236263702350833e-02
8.534236263702350833e-02
8.522651924574385640e-02
8.522651924574385640e-02
8.511022978260508742e-02
8.511022978260508742e-02
8.475866656641400931e-02
8.475866656641400931e-02
8.464057433362756622e-02
8.464057433362756622e-02
8.440302174819462599e-02
8.440302174819462599e-02
8.428355753951248530e-02
8.428355753951248530e-02
8.416363211882663120e-02
8.416363211882663120e-02
8.404324351175904151e-02
8.404324351175904151e-02
8.380106874583662102e-02
8.380106874583662102e-02
8.367927854235120144e-02
8.367927854235120144e-02
8.355701706271670415e-02
8.355701706271670415e-02
8.343428223516180520e-02
8.343428223516180520e-02
8.331107196766175671e-02
8.331107196766175671e-02
8.318738414766969902e-02
8.318738414766969902e-02
8.306321664184329601e-02
8.306321664184329601e-02
8.293856729576649933e-02
8.293856729576649933e-02
8.281343393366658034e-02
8.281343393366658034e-02
8.268781435812594394e-02
8.268781435812594394e-02
8.256170634978915457e-02
8.256170634978915457e-02
8.243510766706439730e-02
8.243510766706439730e-02
8.218042919907507515e-02
8.218042919907507515e-02
8.192376056502151394e-02
8.192376056502151394e-02
8.179467408664528594e-02
8.179467408664528594e-02
8.166508299997521370e-02
8.166508299997521370e-02
8.153498489894957235e-02
8.153498489894957235e-02
8.127325790510947501e-02
8.127325790510947501e-02
8.114162407463787474e-02
8.114162407463787474e-02
8.100947335377532699e-02
8.100947335377532699e-02
8.087680320876310114e-02
8.087680320876310114e-02
8.074361107919758584e-02
8.074361107919758584e-02
8.060989437764587429e-02
8.060989437764587429e-02
8.047565048925355013e-02
8.047565048925355013e-02
8.034087677134563177e-02
8.034087677134563177e-02
8.020557055301932858e-02
8.020557055301932858e-02
8.006972913472951148e-02
8.006972913472951148e-02
7.993334978786585665e-02
7.993334978786585665e-02
7.979642975432205132e-02
7.979642975432205132e-02
7.952095644464445001e-02
7.952095644464445001e-02
7.924328653401951916e-02
7.924328653401951916e-02
7.896339684981572293e-02
7.896339684981572293e-02
7.882261221043129762e-02
7.882261221043129762e-02
7.853934828342692964e-02
7.853934828342692964e-02
7.825380435737248896e-02
7.825380435737248896e-02
7.811016958853908565e-02
7.811016958853908565e-02
7.796595538134266923e-02
7.796595538134266923e-02
7.782115851442629462e-02
7.782115851442629462e-02
7.767577572934938890e-02
7.767577572934938890e-02
7.752980372999587755e-02
7.752980372999587755e-02
7.708831890720410640e-02
7.708831890720410640e-02
7.679098744052420544e-02
7.679098744052420544e-02
7.664140874949310067e-02
7.664140874949310067e-02
7.649121666407052156e-02
7.649121666407052156e-02
7.618897778495195561e-02
7.618897778495195561e-02
7.588424131260135264e-02
7.588424131260135264e-02
7.557697703513563403e-02
7.557697703513563403e-02
7.511127305365464246e-02
7.511127305365464246e-02
7.463970390718915882e-02
7.463970390718915882e-02
7.448119160663188576e-02
7.448119160663188576e-02
7.416215771271772450e-02
7.416215771271772450e-02
7.400162745695043620e-02
7.400162745695043620e-02
7.351593029440423033e-02
7.351593029440423033e-02
7.335264733620769362e-02
7.335264733620769362e-02
7.318866472367957510e-02
7.318866472367957510e-02
7.269247150985573558e-02
7.269247150985573558e-02
7.235808964768479512e-02
7.235808964768479512e-02
7.218980788191745046e-02
7.218980788191745046e-02
7.202079210353549976e-02
7.202079210353549976e-02
7.185103713266766112e-02
7.185103713266766112e-02
7.168053771761245807e-02
7.168053771761245807e-02
7.150928853344099001e-02
7.150928853344099001e-02
7.133728418056392573e-02
7.133728418056392573e-02
7.116451918326247017e-02
7.116451918326247017e-02
7.099098798818126443e-02
7.099098798818126443e-02
7.081668496278287206e-02
7.081668496278287206e-02
7.064160439376179768e-02
7.064160439376179768e-02
7.046574048541767721e-02
7.046574048541767721e-02
7.028908735798529428e-02
7.028908735798529428e-02
7.011163904592102036e-02
7.011163904592102036e-02
6.993338949614354150e-02
6.993338949614354150e-02
6.975433256622767808e-02
6.975433256622767808e-02
6.957446202254992385e-02
6.957446202254992385e-02
6.921225469194203228e-02
6.921225469194203228e-02
6.902990496436971213e-02
6.902990496436971213e-02
6.884671573767592312e-02
6.884671573767592312e-02
6.847779180649404829e-02
6.847779180649404829e-02
6.829204335095190315e-02
6.829204335095190315e-02
6.810542788963167005e-02
6.810542788963167005e-02
6.791793827582018328e-02
6.791793827582018328e-02
6.772956725000676970e-02
6.772956725000676970e-02
6.754030743737428344e-02
6.754030743737428344e-02
6.715909136028450077e-02
6.715909136028450077e-02
6.677422863987375612e-02
6.677422863987375612e-02
6.658041005014793401e-02
6.658041005014793401e-02
6.638565585326638985e-02
6.638565585326638985e-02
6.618995779057099127e-02
6.618995779057099127e-02
6.599330746517859114e-02
6.599330746517859114e-02
6.579569633871495959e-02
6.579569633871495959e-02
6.559711572794921230e-02
6.559711572794921230e-02
6.539755680132323945e-02
6.539755680132323945e-02
6.458935591005215970e-02
6.458935591005215970e-02
6.438476748242234760e-02
6.438476748242234760e-02
6.417914442622750515e-02
6.417914442622750515e-02
6.376475434122551300e-02
6.376475434122551300e-02
6.355596681346394050e-02
6.355596681346394050e-02
6.249567708235653773e-02
6.249567708235653773e-02
6.206372135897758602e-02
6.206372135897758602e-02
6.184601684293244972e-02
6.184601684293244972e-02
6.162714497990742085e-02
6.162714497990742085e-02
6.140709328766139063e-02
6.140709328766139063e-02
6.118584903661415664e-02
6.118584903661415664e-02
6.096339924290558598e-02
6.096339924290558598e-02
6.073973066120095382e-02
6.073973066120095382e-02
6.051482977723184054e-02
6.051482977723184054e-02
6.028868280005977853e-02
6.028868280005977853e-02
5.983259397054670192e-02
5.983259397054670192e-02
5.937134799909354888e-02
5.937134799909354888e-02
5.890482373899210561e-02
5.890482373899210561e-02
5.843289476588573589e-02
5.843289476588573589e-02
5.819486248081445767e-02
5.819486248081445767e-02
5.795542904877432067e-02
5.795542904877432067e-02
5.771457703146484763e-02
5.771457703146484763e-02
5.747228859407846335e-02
5.747228859407846335e-02
5.722854549250717265e-02
5.722854549250717265e-02
5.698332906001245257e-02
5.698332906001245257e-02
5.673662019332949974e-02
5.673662019332949974e-02
5.648839933817709907e-02
5.648839933817709907e-02
5.623864647414069523e-02
5.623864647414069523e-02
5.598734109889631771e-02
5.598734109889631771e-02
5.573446221173861126e-02
5.573446221173861126e-02
5.547998829637626472e-02
5.547998829637626472e-02
5.522389730295346882e-02
5.522389730295346882e-02
5.444569295151904798e-02
5.444569295151904798e-02
5.418290179973093978e-02
5.418290179973093978e-02
5.391837462808247994e-02
5.391837462808247994e-02
5.365208575867286278e-02
5.365208575867286278e-02
5.338400882852930435e-02
5.338400882852930435e-02
5.311411676362301493e-02
5.311411676362301493e-02
5.284238175160002604e-02
5.284238175160002604e-02
5.256877521314969048e-02
5.256877521314969048e-02
5.229326777192507686e-02
5.229326777192507686e-02
5.201582922292628808e-02
5.201582922292628808e-02
5.173642849924774134e-02
5.173642849924774134e-02
5.145503363708636702e-02
5.145503363708636702e-02
5.117161173889660936e-02
5.117161173889660936e-02
5.059855034051941036e-02
5.059855034051941036e-02
5.030884001649295334e-02
5.030884001649295334e-02
5.001696092002055199e-02
5.001696092002055199e-02
4.972287485827235620e-02
4.972287485827235620e-02
4.942654243718388324e-02
4.942654243718388324e-02
4.912792300764233511e-02
4.912792300764233511e-02
4.882697460852664095e-02
4.882697460852664095e-02
4.852365390637173453e-02
4.852365390637173453e-02
4.790971500972371344e-02
4.790971500972371344e-02
4.728572967299581042e-02
4.728572967299581042e-02
4.696984471812886558e-02
4.696984471812886558e-02
4.665129476884233989e-02
4.665129476884233989e-02
4.633002485430439549e-02
4.633002485430439549e-02
4.600597799219452444e-02
4.600597799219452444e-02
4.567909508366905375e-02
4.567909508366905375e-02
4.534931480115490104e-02
4.534931480115490104e-02
4.501657346836144408e-02
4.501657346836144408e-02
4.434194042336192521e-02
4.434194042336192521e-02
4.399990841226191635e-02
4.399990841226191635e-02
4.365463444690224210e-02
4.365463444690224210e-02
4.330604098419373049e-02
4.330604098419373049e-02
4.295404720609501126e-02
4.295404720609501126e-02
4.259856882183933602e-02
4.259856882183933602e-02
4.223951785450803798e-02
4.223951785450803798e-02
4.187680241040846185e-02
4.187680241040846185e-02
4.151032642953145224e-02
4.151032642953145224e-02
4.113998941515288610e-02
4.113998941515288610e-02
4.076568614040861072e-02
4.076568614040861072e-02
3.961784863564855874e-02
3.961784863564855874e-02
3.922652167148727581e-02
3.922652167148727581e-02
3.883061914259067909e-02
3.883061914259067909e-02
3.842999963800384361e-02
3.842999963800384361e-02
3.802451406637287479e-02
3.802451406637287479e-02
3.761400505685853074e-02
3.761400505685853074e-02
3.719830629850957859e-02
3.719830629850957859e-02
3.677724181018566380e-02
3.677724181018566380e-02
3.635062513188427186e-02
3.635062513188427186e-02
3.591825842687047798e-02
3.591825842687047798e-02
3.503542059375234358e-02
3.503542059375234358e-02
3.319051694725080881e-02
3.319051694725080881e-02
3.271116195664456466e-02
3.271116195664456466e-02
3.172841384453876923e-02
3.172841384453876923e-02
3.071104049253130588e-02
3.071104049253130588e-02
3.018828005362085565e-02
3.018828005362085565e-02
2.965547851046346911e-02
2.965547851046346911e-02
2.911208455950992091e-02
2.911208455950992091e-02
2.799103993622528361e-02
2.799103993622528361e-02
2.681952274985055854e-02
2.681952274985055854e-02
2.559060215890267623e-02
2.559060215890267623e-02
2.495198070210322833e-02
2.495198070210322833e-02
2.429556897230041729e-02
2.429556897230041729e-02
2.361988380674743399e-02
2.361988380674743399e-02
2.145872971250201502e-02
2.145872971250201502e-02
2.068586364495701019e-02
2.068586364495701019e-02
1.988174381758449002e-02
1.988174381758449002e-02
1.904241130595443754e-02
1.904241130595443754e-02
1.625755065983228165e-02
1.625755065983228165e-02
1.408990820878990025e-02
1.408990820878990025e-02
1.151289310791717493e-02
1.151289310791717493e-02
9.974149981105601137e-03
0.000000000000000000e+00
