0.000000000000000000e+00
5.993996996996244810e-03
5.993996996996244810e-03
1.036108102468077420e-02
1.036108102468077420e-02
1.460849068179187124e-02
1.460849068179187124e-02
1.783726436424599299e-02
1.783726436424599299e-02
1.878297101099823257e-02
1.967963414294076480e-02
1.967963414294076480e-02
2.053367965075914015e-02
2.053367965075914015e-02
2.213341365447273404e-02
2.213341365447273404e-02
2.288667734731278033e-02
2.288667734731278033e-02
2.361287784239778087e-02
2.361287784239778087e-02
2.499343913910208673e-02
2.499343913910208673e-02
2.629068276024797146e-02
2.629068276024797146e-02
2.691185612327770885e-02
2.691185612327770885e-02
2.751639511273233293e-02
2.751639511273233293e-02
2.810537315176583895e-02
2.810537315176583895e-02
2.867974895287613707e-02
2.867974895287613707e-02
2.924038303442689363e-02
2.924038303442689363e-02
2.978805129577965019e-02
2.978805129577965019e-02
2.978805129577965019e-02
2.978805129577965019e-02
2.978805129577965019e-02
2.978805129577965019e-02
3.032345626738482472e-02
3.032345626738482472e-02
3.235441237296699662e-02
3.235441237296699662e-02
3.331053887285524012e-02
3.331053887285524012e-02
3.377525721589696300e-02
3.377525721589696300e-02
3.423156438143019203e-02
3.423156438143019203e-02
3.467979238692180805e-02
3.467979238692180805e-02
3.555322770157443718e-02
3.555322770157443718e-02
3.597899387142447503e-02
3.597899387142447503e-02
3.680988997538569424e-02
3.680988997538569424e-02
3.721548064985860660e-02
3.721548064985860660e-02
3.800799915807197282e-02
3.800799915807197282e-02
3.839531221386277560e-02
3.839531221386277560e-02
3.915293092477241388e-02
3.915293092477241388e-02
3.988894583716145331e-02
3.988894583716145331e-02
4.095499969478696295e-02
4.095499969478696295e-02
4.130075059850607522e-02
4.130075059850607522e-02
4.328242137404052226e-02
4.359816509900388271e-02
4.359816509900388271e-02
4.390999886130720481e-02
4.390999886130720481e-02
4.421800538242311868e-02
4.421800538242311868e-02
4.452226409337243368e-02
4.452226409337243368e-02
4.482285131492641517e-02
4.482285131492641517e-02
4.511984042524973260e-02
4.511984042524973260e-02
4.541330201603931138e-02
4.541330201603931138e-02
4.570330403811085490e-02
4.570330403811085490e-02
4.682999039077415104e-02
4.682999039077415104e-02
4.764166243950771623e-02
4.764166243950771623e-02
4.790615826801394167e-02
4.790615826801394167e-02
4.816770702452006364e-02
4.816770702452006364e-02
4.868215278723816292e-02
4.868215278723816292e-02
4.893514074772850608e-02
4.893514074772850608e-02
4.918536367660607256e-02
4.918536367660607256e-02
4.943286356261388653e-02
4.943286356261388653e-02
4.967768110530119963e-02
4.967768110530119963e-02
4.991985576902241428e-02
4.991985576902241428e-02
5.015942583403441846e-02
5.015942583403441846e-02
5.039642844488089607e-02
5.039642844488089607e-02
5.063089965623759903e-02
5.063089965623759903e-02
5.086287447638011133e-02
5.086287447638011133e-02
5.109238690842306252e-02
5.109238690842306252e-02
5.263268946196840437e-02
5.263268946196840437e-02
5.284361834696787996e-02
5.284361834696787996e-02
5.325891474673512260e-02
5.325891474673512260e-02
5.539465678203991245e-02
5.539465678203991245e-02
5.575740309591184496e-02
5.575740309591184496e-02
5.611267236551828463e-02
5.611267236551828463e-02
5.628754746833441319e-02
5.628754746833441319e-02
5.646060573532664384e-02
5.646060573532664384e-02
5.663186382241008898e-02
5.663186382241008898e-02
5.729921465430394545e-02
5.729921465430394545e-02
5.746170898955233614e-02
5.746170898955233614e-02
5.809475019311124977e-02
5.809475019311124977e-02
5.824884548212092700e-02
5.824884548212092700e-02
5.840130135536364397e-02
5.840130135536364397e-02
5.855213061879131764e-02
5.855213061879131764e-02
5.870134581080743708e-02
5.870134581080743708e-02
5.899498283752610539e-02
5.899498283752610539e-02
5.913942847204393255e-02
5.913942847204393255e-02
5.928230764739172987e-02
5.928230764739172987e-02
5.942363166283259890e-02
5.942363166283259890e-02
5.983838233107575955e-02
5.983838233107575955e-02
6.010730404867615367e-02
6.010730404867615367e-02
6.023952191045343907e-02
6.023952191045343907e-02
6.049952065925812139e-02
6.049952065925812139e-02
6.062732057414380038e-02
6.062732057414380038e-02
6.087856765726341879e-02
6.087856765726341879e-02
6.112407054508067761e-02
6.112407054508067761e-02
6.204997985495240564e-02
6.204997985495240564e-02
6.237461021922301174e-02
6.237461021922301174e-02
6.258434308994542672e-02
6.258434308994542672e-02
6.268722357865276484e-02
6.268722357865276484e-02
6.288904515096409298e-02
6.288904515096409298e-02
6.318202275964263093e-02
6.318202275964263093e-02
6.327710486423979153e-02
6.327710486423979153e-02
6.337090815192725213e-02
6.337090815192725213e-02
6.346343829324092856e-02
6.346343829324092856e-02
6.382093700346305742e-02
6.382093700346305742e-02
6.407595492850652608e-02
6.407595492850652608e-02
6.462810534125226769e-02
6.462810534125226769e-02
6.470214834145772420e-02
6.470214834145772420e-02
6.484664987491643717e-02
6.484664987491643717e-02
6.498639857693300215e-02
6.498639857693300215e-02
6.505450022865444382e-02
6.505450022865444382e-02
6.543852076567746590e-02
6.543852076567746590e-02
6.578090908462728981e-02
6.578090908462728981e-02
6.583397299267301772e-02
6.583397299267301772e-02
6.588590137502864374e-02
6.588590137502864374e-02
6.593669691454069615e-02
6.593669691454069615e-02
6.598636222735725088e-02
6.598636222735725088e-02
6.603489986363271502e-02
6.603489986363271502e-02
6.608231230821150215e-02
6.608231230821150215e-02
6.612860198129097422e-02
6.612860198129097422e-02
6.617377123906419134e-02
6.617377123906419134e-02
6.621782237434269136e-02
6.621782237434269136e-02
6.626075761715979895e-02
6.626075761715979895e-02
6.642138209944144223e-02
6.642138209944144223e-02
6.649505244753176059e-02
6.649505244753176059e-02
6.656431476399347902e-02
6.656431476399347902e-02
6.665997299729425896e-02
6.665997299729425896e-02
6.668966936490239306e-02
6.668966936490239306e-02
6.671827335895316735e-02
6.671827335895316735e-02
6.674578638386095830e-02
6.674578638386095830e-02
6.677220978820455621e-02
6.677220978820455621e-02
6.696118278525253764e-02
6.696118278525253764e-02
6.699128301503114169e-02
6.699128301503114169e-02
6.702835221009091626e-02
6.702835221009091626e-02
6.705573800950967445e-02
6.705573800950967445e-02
6.706862157521950585e-02
6.706862157521950585e-02
6.707989266538819106e-02
6.707989266538819106e-02
6.706862157521950585e-02
6.706862157521950585e-02
6.706271691484025355e-02
6.706271691484025355e-02
6.704768452377754540e-02
6.704768452377754540e-02
6.703855607036894593e-02
6.703855607036894593e-02
6.702835221009091626e-02
6.702835221009091626e-02
6.700471625191767311e-02
6.700471625191767311e-02
6.696118278525253764e-02
6.696118278525253764e-02
6.692676594606973561e-02
6.692676594606973561e-02
6.688802583422535919e-02
6.688802583422535919e-02
6.686703223562415199e-02
6.686703223562415199e-02
6.682179285233223742e-02
6.682179285233223742e-02
6.677220978820455621e-02
6.677220978820455621e-02
6.674578638386095830e-02
6.674578638386095830e-02
6.665997299729425896e-02
6.665997299729425896e-02
6.653023372873419217e-02
6.653023372873419217e-02
6.645876917307451393e-02
6.645876917307451393e-02
6.634328903513904419e-02
6.634328903513904419e-02
6.612860198129097422e-02
6.612860198129097422e-02
6.608231230821150215e-02
6.608231230821150215e-02
6.598636222735725088e-02
6.598636222735725088e-02
6.593669691454069615e-02
6.593669691454069615e-02
6.583397299267301772e-02
6.583397299267301772e-02
6.561487636199583862e-02
6.561487636199583862e-02
6.555724216286099026e-02
6.555724216286099026e-02
6.537742729719486778e-02
6.537742729719486778e-02
6.525175859699108849e-02
6.525175859699108849e-02
6.518717665308108866e-02
6.518717665308108866e-02
6.512142504583265379e-02
6.512142504583265379e-02
6.484664987491643717e-02
6.484664987491643717e-02
6.447641429235964616e-02
6.447641429235964616e-02
6.439875775199394026e-02
6.439875775199394026e-02
6.431988805960407729e-02
6.431988805960407729e-02
6.373344490924683081e-02
6.373344490924683081e-02
6.364470127198335048e-02
6.364470127198335048e-02
6.337090815192725213e-02
6.337090815192725213e-02
6.318202275964263093e-02
6.318202275964263093e-02
6.288904515096409298e-02
6.288904515096409298e-02
6.268722357865276484e-02
6.268722357865276484e-02
6.258434308994542672e-02
6.258434308994542672e-02
6.193906683184692563e-02
6.193906683184692563e-02
6.171314284656065352e-02
6.171314284656065352e-02
6.136389818125964624e-02
6.136389818125964624e-02
6.124468956570847111e-02
6.124468956570847111e-02
6.112407054508069149e-02
6.112407054508069149e-02
6.062732057414380038e-02
6.062732057414380038e-02
5.970165826842668139e-02
5.970165826842668139e-02
5.942363166283259890e-02
5.942363166283259890e-02
5.913942847204393255e-02
5.913942847204393255e-02
5.899498283752610539e-02
5.899498283752610539e-02
5.809475019311124977e-02
5.809475019311124977e-02
5.762249560718452068e-02
5.762249560718452068e-02
5.502428554738353350e-02
5.502428554738353350e-02
5.426004054550641331e-02
5.426004054550641331e-02
5.406396211895683757e-02
5.406396211895683757e-02
5.386583332688726911e-02
5.386583332688726911e-02
5.346333322941995703e-02
5.346333322941995703e-02
5.325891474673512260e-02
5.325891474673512260e-02
5.284361834696787996e-02
5.284361834696787996e-02
5.220413776703912434e-02
5.220413776703912434e-02
5.198645977559926412e-02
5.198645977559926412e-02
5.109238690842306946e-02
5.109238690842306946e-02
5.063089965623759903e-02
5.063089965623759903e-02
4.816770702452007058e-02
4.816770702452007058e-02
4.570330403811085490e-02
4.570330403811085490e-02
4.511984042524973260e-02
4.511984042524973260e-02
4.482285131492641517e-02
4.482285131492641517e-02
4.359816509900388271e-02
4.359816509900388271e-02
4.164190197385320841e-02
4.164190197385320841e-02
4.095499969478696295e-02
4.095499969478696295e-02
3.915293092477240694e-02
3.915293092477240694e-02
3.877690034027989757e-02
3.877690034027989757e-02
3.721548064985859272e-02
3.721548064985859272e-02
3.283705224285515811e-02
3.283705224285515811e-02
2.924038303442690750e-02
2.924038303442690750e-02
2.867974895287615095e-02
2.867974895287615095e-02
2.751639511273235028e-02
2.751639511273235028e-02
2.565166661252248417e-02
2.565166661252248417e-02
2.053367965075914708e-02
2.053367965075914708e-02
1.967963414294077520e-02
1.967963414294077520e-02
1.878297101099823951e-02
1.878297101099823951e-02
1.783726436424599993e-02
1.783726436424599993e-02
8.468293806901130982e-03
8.468293806901130982e-03
0.000000000000000000e+00
