2.644168734550476074e-01
7.333609461784362793e-01
8.404135704040527344e-01
7.655640840530395508e-01
9.998412728309631348e-01
8.995507955551147461e-01
6.937951445579528809e-01
9.861973524093627930e-01
9.999258518218994141e-01
1.931138634681701660e-01
7.832882404327392578e-01
4.734273850917816162e-01
1.835487186908721924e-01
3.508372902870178223e-01
9.331718087196350098e-01
9.671466946601867676e-01
9.999278783798217773e-01
1.000000000000000000e+00
9.998859763145446777e-01
2.479212880134582520e-01
1.850966811180114746e-01
9.966775178909301758e-01
1.000000000000000000e+00
8.317800760269165039e-01
6.056154370307922363e-01
7.433142066001892090e-01
9.999868869781494141e-01
7.970892190933227539e-01
6.220970749855041504e-01
8.339958190917968750e-01
9.280264973640441895e-01
9.999024868011474609e-01
6.057850718498229980e-01
2.033319175243377686e-01
4.714054763317108154e-01
3.738645315170288086e-01
9.992814660072326660e-01
2.261435091495513916e-01
2.221693098545074463e-01
7.418717741966247559e-01
2.381299436092376709e-01
2.107130885124206543e-01
9.999554753303527832e-01
9.953770637512207031e-01
4.525816142559051514e-01
9.990221858024597168e-01
7.583593130111694336e-01
6.880460381507873535e-01
9.930409193038940430e-01
9.983588457107543945e-01
2.423582971096038818e-01
1.859557032585144043e-01
1.814996004104614258e-01
9.974064230918884277e-01
1.781145036220550537e-01
2.090991437435150146e-01
9.224079847335815430e-01
9.984853267669677734e-01
7.974979877471923828e-01
9.177458286285400391e-01
9.965146780014038086e-01
4.628758430480957031e-01
2.821849584579467773e-01
2.530602514743804932e-01
6.315400600433349609e-01
7.277605533599853516e-01
2.194930613040924072e-01
3.770283460617065430e-01
6.117159128189086914e-01
9.837402105331420898e-01
6.968078017234802246e-01
9.529041051864624023e-01
5.468889474868774414e-01
7.449828386306762695e-01
9.799145460128784180e-01
6.555166244506835938e-01
2.525991797447204590e-01
4.876375198364257812e-01
2.901523709297180176e-01
1.805778145790100098e-01
2.611173689365386963e-01
6.807125210762023926e-01
2.915509939193725586e-01
1.967781782150268555e-01
2.839962542057037354e-01
8.058893084526062012e-01
9.999977350234985352e-01
9.500036835670471191e-01
8.409405946731567383e-01
5.965267419815063477e-01
1.814830601215362549e-01
7.461028099060058594e-01
9.996906518936157227e-01
9.255501031875610352e-01
1.849835216999053955e-01
7.703449726104736328e-01
7.778646945953369141e-01
2.136925756931304932e-01
2.374397516250610352e-01
6.206801533699035645e-01
8.729245662689208984e-01
1.782938241958618164e-01
3.478928804397583008e-01
7.783578634262084961e-01
4.760852754116058350e-01
9.075340032577514648e-01
1.951997578144073486e-01
9.862899184226989746e-01
5.258979797363281250e-01
3.705503940582275391e-01
9.998521804809570312e-01
9.778790473937988281e-01
3.614016175270080566e-01
8.371933698654174805e-01
4.459457397460937500e-01
9.988733530044555664e-01
9.977029561996459961e-01
8.562784194946289062e-01
2.312692105770111084e-01
3.084580898284912109e-01
9.695000648498535156e-01
9.122031927108764648e-01
8.871370553970336914e-01
9.877260923385620117e-01
6.025058627128601074e-01
9.830129146575927734e-01
9.988746047019958496e-01
9.999644756317138672e-01
8.023718595504760742e-01
5.143032670021057129e-01
8.769570589065551758e-01
9.719181656837463379e-01
9.978163242340087891e-01
5.917171239852905273e-01
7.936589717864990234e-01
1.813544034957885742e-01
2.031966745853424072e-01
2.014477849006652832e-01
1.855813860893249512e-01
9.132275581359863281e-01
9.998783469200134277e-01
9.915034174919128418e-01
3.860747814178466797e-01
9.022780656814575195e-01
9.847520589828491211e-01
5.232046246528625488e-01
8.283772468566894531e-01
9.852106571197509766e-01
9.357857108116149902e-01
2.769734859466552734e-01
3.145033121109008789e-01
7.523322105407714844e-01
9.939032793045043945e-01
2.935742139816284180e-01
2.223540246486663818e-01
9.876649379730224609e-01
9.963216781616210938e-01
7.111831307411193848e-01
8.566759824752807617e-01
9.942727088928222656e-01
9.952542781829833984e-01
6.042872667312622070e-01
2.531363368034362793e-01
7.698222398757934570e-01
8.513101339340209961e-01
5.685602426528930664e-01
3.410589694976806641e-01
2.984280288219451904e-01
9.650539755821228027e-01
1.791226863861083984e-01
5.222038030624389648e-01
2.553781270980834961e-01
9.318039417266845703e-01
9.378253817558288574e-01
9.598349332809448242e-01
7.716969251632690430e-01
7.506213188171386719e-01
4.435212910175323486e-01
3.370485007762908936e-01
6.324082016944885254e-01
5.101220011711120605e-01
3.167978227138519287e-01
8.984938263893127441e-01
8.583470582962036133e-01
7.377399206161499023e-01
3.616931438446044922e-01
6.783589720726013184e-01
3.956505060195922852e-01
2.484102547168731689e-01
5.503168106079101562e-01
4.698024690151214600e-01
9.810816049575805664e-01
5.463926792144775391e-01
3.955473899841308594e-01
9.031527042388916016e-01
6.847193837165832520e-01
9.984017610549926758e-01
5.340454578399658203e-01
9.563182592391967773e-01
3.845554888248443604e-01
9.495732784271240234e-01
9.680080413818359375e-01
9.992846846580505371e-01
1.849541068077087402e-01
9.999991655349731445e-01
3.899481594562530518e-01
6.457532644271850586e-01
5.731441974639892578e-01
3.921134471893310547e-01
9.998216629028320312e-01
9.351669549942016602e-01
1.989445984363555908e-01
9.335073232650756836e-01
1.781644225120544434e-01
9.999927878379821777e-01
2.138109207153320312e-01
8.798117637634277344e-01
1.783512830734252930e-01
9.998750090599060059e-01
4.938983023166656494e-01
1.916081309318542480e-01
8.744024634361267090e-01
5.458381772041320801e-01
9.359204769134521484e-01
1.838231980800628662e-01
8.208939433097839355e-01
4.818537533283233643e-01
6.288806200027465820e-01
9.868464469909667969e-01
4.454864561557769775e-01
3.914176821708679199e-01
1.892317235469818115e-01
1.837828457355499268e-01
2.622379362583160400e-01
4.774133563041687012e-01
1.000000000000000000e+00
2.371903359889984131e-01
8.702393770217895508e-01
9.994950294494628906e-01
3.545287251472473145e-01
5.915095806121826172e-01
5.226970314979553223e-01
9.998747110366821289e-01
3.126794099807739258e-01
9.864235520362854004e-01
1.000000000000000000e+00
5.676826238632202148e-01
1.913821101188659668e-01
3.858299553394317627e-01
1.847663223743438721e-01
7.527168393135070801e-01
5.498616099357604980e-01
3.668467998504638672e-01
8.336149454116821289e-01
7.790897488594055176e-01
1.897538602352142334e-01
9.945775270462036133e-01
9.336813688278198242e-01
9.992061853408813477e-01
1.868094503879547119e-01
5.275697708129882812e-01
9.977357387542724609e-01
4.312778115272521973e-01
2.274960279464721680e-01
2.183189690113067627e-01
9.282296299934387207e-01
1.975544095039367676e-01
2.359284460544586182e-01
7.929265499114990234e-01
4.421341121196746826e-01
1.837653815746307373e-01
2.140430510044097900e-01
1.851623654365539551e-01
1.818028986454010010e-01
2.509540319442749023e-01
9.988951683044433594e-01
2.633963525295257568e-01
9.999903440475463867e-01
7.337660789489746094e-01
9.999531507492065430e-01
2.722890973091125488e-01
1.000000000000000000e+00
9.842702150344848633e-01
9.817070364952087402e-01
9.943135976791381836e-01
9.999994039535522461e-01
9.999791979789733887e-01
1.000000000000000000e+00
9.950420856475830078e-01
2.798967957496643066e-01
5.426513552665710449e-01
2.440320551395416260e-01
2.093216180801391602e-01
9.938334226608276367e-01
2.336317896842956543e-01
2.210215926170349121e-01
2.141544222831726074e-01
5.240331888198852539e-01
1.000000000000000000e+00
4.847344160079956055e-01
9.998224973678588867e-01
9.999916553497314453e-01
9.936001300811767578e-01
3.159717917442321777e-01
5.033985972404479980e-01
2.484022378921508789e-01
5.733667612075805664e-01
2.243295609951019287e-01
9.999986290931701660e-01
6.219356656074523926e-01
9.852225184440612793e-01
9.998315572738647461e-01
5.187469720840454102e-01
9.769535660743713379e-01
9.991203546524047852e-01
4.615295231342315674e-01
8.565343022346496582e-01
8.745203018188476562e-01
2.738305032253265381e-01
9.417712092399597168e-01
2.168394327163696289e-01
9.975190162658691406e-01
9.999881982803344727e-01
9.999914169311523438e-01
8.454626202583312988e-01
9.993560314178466797e-01
9.999688863754272461e-01
9.428965449333190918e-01
6.870419979095458984e-01
9.946719408035278320e-01
4.709733724594116211e-01
9.929965734481811523e-01
9.984586238861083984e-01
9.994821548461914062e-01
7.181124091148376465e-01
7.147837877273559570e-01
9.986723661422729492e-01
9.844429492950439453e-01
9.575806856155395508e-01
9.662407040596008301e-01
9.941352605819702148e-01
2.000593543052673340e-01
9.932010173797607422e-01
1.883600354194641113e-01
9.668183922767639160e-01
2.938701510429382324e-01
9.936274886131286621e-01
2.431572973728179932e-01
9.975327253341674805e-01
2.687380909919738770e-01
6.804727911949157715e-01
9.137184619903564453e-01
9.786686301231384277e-01
9.698320031166076660e-01
1.788546442985534668e-01
8.059494495391845703e-01
9.999099969863891602e-01
7.004098296165466309e-01
3.380185961723327637e-01
7.811557650566101074e-01
5.211409330368041992e-01
8.661283850669860840e-01
2.006789445877075195e-01
2.446829974651336670e-01
8.126970529556274414e-01
3.104935288429260254e-01
7.313202619552612305e-01
9.946129322052001953e-01
6.419175863265991211e-01
8.656213283538818359e-01
2.817218899726867676e-01
4.010490179061889648e-01
7.409846782684326172e-01
9.992718696594238281e-01
1.987046897411346436e-01
9.999881982803344727e-01
3.063567876815795898e-01
3.271724581718444824e-01
6.067914366722106934e-01
3.863283693790435791e-01
7.538940906524658203e-01
1.786714196205139160e-01
5.631263852119445801e-01
1.000000000000000000e+00
9.935734272003173828e-01
7.779379487037658691e-01
2.324181497097015381e-01
2.865563333034515381e-01
3.106675148010253906e-01
8.572009801864624023e-01
7.284729480743408203e-01
5.340924859046936035e-01
3.195832967758178711e-01
6.870008707046508789e-01
9.991304278373718262e-01
8.333275318145751953e-01
3.531634807586669922e-01
5.406362414360046387e-01
1.998791396617889404e-01
3.982662856578826904e-01
6.443228721618652344e-01
9.169024229049682617e-01
3.696598410606384277e-01
9.918565154075622559e-01
9.996494054794311523e-01
5.233084559440612793e-01
9.970570802688598633e-01
2.445792853832244873e-01
2.842219173908233643e-01
3.519097566604614258e-01
9.991221427917480469e-01
9.348416328430175781e-01
4.605318903923034668e-01
2.998000085353851318e-01
2.761822342872619629e-01
7.475804090499877930e-01
9.898663163185119629e-01
5.097473263740539551e-01
1.903027892112731934e-01
9.395216703414916992e-01
9.885599613189697266e-01
6.648584604263305664e-01
7.081255316734313965e-01
2.353419363498687744e-01
4.534380435943603516e-01
2.213695347309112549e-01
7.035777568817138672e-01
4.714065492153167725e-01
6.786168813705444336e-01
2.475544512271881104e-01
9.996024370193481445e-01
4.000195562839508057e-01
1.877471208572387695e-01
2.165398299694061279e-01
3.327359855175018311e-01
2.173609435558319092e-01
9.998965263366699219e-01
1.853616535663604736e-01
1.928443312644958496e-01
9.999996423721313477e-01
1.811727881431579590e-01
9.436818361282348633e-01
9.999717473983764648e-01
8.130345344543457031e-01
3.193773031234741211e-01
9.999406337738037109e-01
2.064050436019897461e-01
8.696243762969970703e-01
1.828106641769409180e-01
4.110534787178039551e-01
3.828730881214141846e-01
1.891286373138427734e-01
9.954940676689147949e-01
6.853448152542114258e-01
2.869189381599426270e-01
7.432506084442138672e-01
2.558848857879638672e-01
1.896947920322418213e-01
1.878016591072082520e-01
4.316061139106750488e-01
8.208299875259399414e-01
1.810411214828491211e-01
2.249865531921386719e-01
2.182190120220184326e-01
2.404840886592864990e-01
1.795874834060668945e-01
8.378154039382934570e-01
6.668289899826049805e-01
1.809512078762054443e-01
3.431711792945861816e-01
9.890896677970886230e-01
3.290325403213500977e-01
8.987393379211425781e-01
4.971177577972412109e-01
4.684929549694061279e-01
9.995831251144409180e-01
8.163123130798339844e-01
2.380261421203613281e-01
9.917813539505004883e-01
8.466941714286804199e-01
2.917623519897460938e-01
2.206641137599945068e-01
3.891802728176116943e-01
9.921340942382812500e-01
9.939565658569335938e-01
9.999378323554992676e-01
1.827746927738189697e-01
3.219004869461059570e-01
2.766702771186828613e-01
3.027049303054809570e-01
9.999840259552001953e-01
7.545599937438964844e-01
2.327302098274230957e-01
5.555575489997863770e-01
3.276224732398986816e-01
9.700341224670410156e-01
7.748019099235534668e-01
4.796672463417053223e-01
1.805011034011840820e-01
6.075233817100524902e-01
9.055118560791015625e-01
4.916535615921020508e-01
1.000000000000000000e+00
9.910010099411010742e-01
9.997524619102478027e-01
4.309260845184326172e-01
3.412887454032897949e-01
3.169764578342437744e-01
9.625050425529479980e-01
1.988089382648468018e-01
1.964361071586608887e-01
7.920055389404296875e-01
9.592212438583374023e-01
7.356437444686889648e-01
1.843011677265167236e-01
9.926664233207702637e-01
9.999851584434509277e-01
9.995324611663818359e-01
9.998498558998107910e-01
9.068974852561950684e-01
1.875334382057189941e-01
2.415108680725097656e-01
9.835330247879028320e-01
9.698178768157958984e-01
9.990778565406799316e-01
5.917435288429260254e-01
9.963796138763427734e-01
2.280051708221435547e-01
5.421762466430664062e-01
4.876103401184082031e-01
9.759207963943481445e-01
9.849555492401123047e-01
8.993207216262817383e-01
9.993654489517211914e-01
7.893468141555786133e-01
9.997007846832275391e-01
9.990147352218627930e-01
2.491073310375213623e-01
1.801055967807769775e-01
4.591525197029113770e-01
7.453540563583374023e-01
8.871194124221801758e-01
1.844961643218994141e-01
3.118703961372375488e-01
9.053481817245483398e-01
9.123452901840209961e-01
2.782281637191772461e-01
8.156225681304931641e-01
2.877354621887207031e-01
3.724613785743713379e-01
5.475720763206481934e-01
2.393127083778381348e-01
9.172251224517822266e-01
6.909459829330444336e-01
6.247246861457824707e-01
3.383360207080841064e-01
9.047222137451171875e-01
8.255130052566528320e-01
3.189982175827026367e-01
5.047693848609924316e-01
1.900708377361297607e-01
9.999969601631164551e-01
9.975244998931884766e-01
9.999939203262329102e-01
9.535231590270996094e-01
9.234855175018310547e-01
6.402307748794555664e-01
2.459861338138580322e-01
9.981333017349243164e-01
9.999540448188781738e-01
9.682823419570922852e-01
9.796112775802612305e-01
3.387656509876251221e-01
9.754848480224609375e-01
9.706848859786987305e-01
9.999932646751403809e-01
9.983243942260742188e-01
9.997297525405883789e-01
1.993174552917480469e-01
8.296840190887451172e-01
9.876900315284729004e-01
6.467195749282836914e-01
9.993692636489868164e-01
9.997898340225219727e-01
8.859454989433288574e-01
9.710266590118408203e-01
9.992676973342895508e-01
5.876698493957519531e-01
9.455928802490234375e-01
7.947877049446105957e-01
1.811292469501495361e-01
9.834909439086914062e-01
9.866720438003540039e-01
9.533197879791259766e-01
8.958278894424438477e-01
9.757012128829956055e-01
9.965587854385375977e-01
2.538190484046936035e-01
2.174639403820037842e-01
7.347558736801147461e-01
8.603470325469970703e-01
8.395663499832153320e-01
9.109561443328857422e-01
9.999878406524658203e-01
9.555760622024536133e-01
9.963201284408569336e-01
9.999989271163940430e-01
7.438138723373413086e-01
2.489708662033081055e-01
9.185552597045898438e-01
1.784227490425109863e-01
1.000000000000000000e+00
3.615095615386962891e-01
9.763838052749633789e-01
3.870430290699005127e-01
5.185258984565734863e-01
2.097859382629394531e-01
8.785961866378784180e-01
3.835693001747131348e-01
2.043443620204925537e-01
7.714102268218994141e-01
4.138289093971252441e-01
6.343742609024047852e-01
9.845812320709228516e-01
9.995595216751098633e-01
9.993280172348022461e-01
7.719452381134033203e-01
1.841661036014556885e-01
9.561504721641540527e-01
9.646402597427368164e-01
9.999855160713195801e-01
7.198596000671386719e-01
2.858963608741760254e-01
4.673083424568176270e-01
1.000000000000000000e+00
3.452497720718383789e-01
4.341829419136047363e-01
9.851805567741394043e-01
8.390896320343017578e-01
1.860885918140411377e-01
1.887764334678649902e-01
2.172183096408843994e-01
2.497683763504028320e-01
2.007057070732116699e-01
8.326042890548706055e-01
2.747118473052978516e-01
2.121293246746063232e-01
9.149981737136840820e-01
2.498126029968261719e-01
9.989182949066162109e-01
9.989100098609924316e-01
2.033761441707611084e-01
9.999953508377075195e-01
9.468561410903930664e-01
9.939759969711303711e-01
9.867616891860961914e-01
5.890355110168457031e-01
3.892612755298614502e-01
2.279063463211059570e-01
9.637629985809326172e-01
6.544207930564880371e-01
3.197569549083709717e-01
9.507348537445068359e-01
1.875272989273071289e-01
7.876881361007690430e-01
7.929311990737915039e-01
5.669130086898803711e-01
8.688313961029052734e-01
5.976278781890869141e-01
1.798799037933349609e-01
2.790845036506652832e-01
6.869937181472778320e-01
7.277812957763671875e-01
1.827737987041473389e-01
8.342454433441162109e-01
4.418032467365264893e-01
2.485649883747100830e-01
3.507171869277954102e-01
2.740272283554077148e-01
3.610005974769592285e-01
5.512607097625732422e-01
1.919226646423339844e-01
9.353622198104858398e-01
1.783291399478912354e-01
9.978137016296386719e-01
2.331369519233703613e-01
9.999941587448120117e-01
5.436307191848754883e-01
2.038668692111968994e-01
9.350123405456542969e-01
3.047562241554260254e-01
6.592381596565246582e-01
1.973705887794494629e-01
2.234036326408386230e-01
6.580080986022949219e-01
2.042104005813598633e-01
9.999969005584716797e-01
1.996509432792663574e-01
1.865379810333251953e-01
9.743968248367309570e-01
9.651833176612854004e-01
7.923811674118041992e-01
1.000000000000000000e+00
9.754642248153686523e-01
7.720621824264526367e-01
2.962089776992797852e-01
4.417784214019775391e-01
3.406261801719665527e-01
9.998501539230346680e-01
9.998563528060913086e-01
9.917043447494506836e-01
9.696511030197143555e-01
9.767640829086303711e-01
2.487134635448455811e-01
2.321498990058898926e-01
2.166886925697326660e-01
2.512762546539306641e-01
8.922138810157775879e-01
1.831088364124298096e-01
1.993296146392822266e-01
9.999963641166687012e-01
3.492940068244934082e-01
2.848995923995971680e-01
6.903274059295654297e-01
9.999996423721313477e-01
1.000000000000000000e+00
3.287111520767211914e-01
1.000000000000000000e+00
2.036445438861846924e-01
2.367707788944244385e-01
2.144480645656585693e-01
9.489738941192626953e-01
2.121851444244384766e-01
2.152561843395233154e-01
3.126448392868041992e-01
2.751216292381286621e-01
4.492796063423156738e-01
7.453434467315673828e-01
9.987607002258300781e-01
4.863089025020599365e-01
9.737998247146606445e-01
9.999970793724060059e-01
3.944598734378814697e-01
9.995632767677307129e-01
2.956329584121704102e-01
9.694280624389648438e-01
6.528846621513366699e-01
9.996931552886962891e-01
7.739238142967224121e-01
6.725023984909057617e-01
9.076030254364013672e-01
5.489988327026367188e-01
9.169082641601562500e-01
9.574004411697387695e-01
5.141993761062622070e-01
8.321096897125244141e-01
9.727665185928344727e-01
6.850252747535705566e-01
9.462492465972900391e-01
3.248475492000579834e-01
4.143221974372863770e-01
9.995193481445312500e-01
3.778249025344848633e-01
8.137748837471008301e-01
4.040677845478057861e-01
6.636438369750976562e-01
6.676521301269531250e-01
9.708086252212524414e-01
2.555509209632873535e-01
5.821175575256347656e-01
9.996771812438964844e-01
9.734008908271789551e-01
8.988500833511352539e-01
2.875384092330932617e-01
1.000000000000000000e+00
2.966258525848388672e-01
8.769308328628540039e-01
9.524266123771667480e-01
9.273349046707153320e-01
9.696148633956909180e-01
9.670469164848327637e-01
9.517873525619506836e-01
9.600300788879394531e-01
5.722185373306274414e-01
2.051770389080047607e-01
1.807001233100891113e-01
3.378209769725799561e-01
2.460265159606933594e-01
6.206794977188110352e-01
8.321755528450012207e-01
2.602170109748840332e-01
9.956902265548706055e-01
1.846758425235748291e-01
3.488184809684753418e-01
6.968982815742492676e-01
1.000000000000000000e+00
3.302214741706848145e-01
1.928298473358154297e-01
1.963357329368591309e-01
7.694686651229858398e-01
9.017212986946105957e-01
8.477203845977783203e-01
2.657612562179565430e-01
2.147189080715179443e-01
8.108415603637695312e-01
7.248392701148986816e-01
9.943085908889770508e-01
9.549701213836669922e-01
8.539885282516479492e-01
2.435705959796905518e-01
9.711383581161499023e-01
8.638420104980468750e-01
9.999850988388061523e-01
1.000000000000000000e+00
9.800817370414733887e-01
9.923492670059204102e-01
9.999997019767761230e-01
9.229848384857177734e-01
9.967060089111328125e-01
8.022298812866210938e-01
6.980124711990356445e-01
9.981241226196289062e-01
6.873146295547485352e-01
6.307209730148315430e-01
6.973366737365722656e-01
5.088011622428894043e-01
9.955241084098815918e-01
9.999994635581970215e-01
9.787642955780029297e-01
9.351058006286621094e-01
3.156276941299438477e-01
8.030961751937866211e-01
3.605675697326660156e-01
1.802597343921661377e-01
2.056945860385894775e-01
5.618016123771667480e-01
2.166618704795837402e-01
8.007235527038574219e-01
9.995810985565185547e-01
9.702796936035156250e-01
9.692932367324829102e-01
9.999998211860656738e-01
8.923610448837280273e-01
9.999989271163940430e-01
1.000000000000000000e+00
2.288531363010406494e-01
6.012921333312988281e-01
1.827891170978546143e-01
9.802600145339965820e-01
4.760163128376007080e-01
4.643642008304595947e-01
3.049053549766540527e-01
9.999023079872131348e-01
5.627877712249755859e-01
8.333297967910766602e-01
2.225009500980377197e-01
3.077384233474731445e-01
2.990803122520446777e-01
2.092832326889038086e-01
9.610117673873901367e-01
5.512676835060119629e-01
6.001447439193725586e-01
2.030939161777496338e-01
9.451184272766113281e-01
2.485955953598022461e-01
9.981356859207153320e-01
5.063372254371643066e-01
2.389782965183258057e-01
2.354233562946319580e-01
1.892291605472564697e-01
9.964596629142761230e-01
8.420826196670532227e-01
9.995205402374267578e-01
9.808659553527832031e-01
9.998298883438110352e-01
2.768051624298095703e-01
1.000000000000000000e+00
5.031615495681762695e-01
9.999340772628784180e-01
5.185235142707824707e-01
4.043192267417907715e-01
5.513417720794677734e-01
2.926502525806427002e-01
9.997941255569458008e-01
5.697658658027648926e-01
3.135934472084045410e-01
1.000000000000000000e+00
1.935489773750305176e-01
4.595592021942138672e-01
2.921763062477111816e-01
6.682685613632202148e-01
9.857050180435180664e-01
9.979083538055419922e-01
6.380018591880798340e-01
5.045804381370544434e-01
9.999805688858032227e-01
6.694590449333190918e-01
7.351331710815429688e-01
5.511571764945983887e-01
1.801639497280120850e-01
9.997951388359069824e-01
9.092884063720703125e-01
2.102400064468383789e-01
9.998768568038940430e-01
3.049673438072204590e-01
9.999893903732299805e-01
2.231513559818267822e-01
2.683795690536499023e-01
6.213877797126770020e-01
9.272934198379516602e-01
9.832589626312255859e-01
3.828327059745788574e-01
3.765224516391754150e-01
4.176693260669708252e-01
1.000000000000000000e+00
9.819622039794921875e-01
9.765639305114746094e-01
1.959720253944396973e-01
9.777891635894775391e-01
8.802825212478637695e-01
1.000000000000000000e+00
6.499989032745361328e-01
9.799879789352416992e-01
8.311308026313781738e-01
2.362867295742034912e-01
2.607407271862030029e-01
9.895422458648681641e-01
9.330459237098693848e-01
8.578987121582031250e-01
7.854754924774169922e-01
9.146347045898437500e-01
9.999970197677612305e-01
2.515788674354553223e-01
8.405547738075256348e-01
8.178236484527587891e-01
9.999305605888366699e-01
2.652416229248046875e-01
2.646409869194030762e-01
9.991072416305541992e-01
4.453354775905609131e-01
1.963677704334259033e-01
9.999549388885498047e-01
2.334252595901489258e-01
2.233230769634246826e-01
9.999997615814208984e-01
2.377513647079467773e-01
3.085294365882873535e-01
7.041493654251098633e-01
2.341092228889465332e-01
9.528396129608154297e-01
1.875617802143096924e-01
9.999703168869018555e-01
9.936276674270629883e-01
2.943494915962219238e-01
9.999995231628417969e-01
9.944709539413452148e-01
2.594103217124938965e-01
2.371903955936431885e-01
9.999990463256835938e-01
9.998825788497924805e-01
4.297044873237609863e-01
9.999997615814208984e-01
1.915136873722076416e-01
3.681935966014862061e-01
8.403713703155517578e-01
5.535641908645629883e-01
3.330824673175811768e-01
2.321325242519378662e-01
5.057590007781982422e-01
9.994717240333557129e-01
1.963381171226501465e-01
3.206121921539306641e-01
1.928374469280242920e-01
6.770544052124023438e-01
9.135029315948486328e-01
9.240811467170715332e-01
9.999727010726928711e-01
9.999957084655761719e-01
3.391762971878051758e-01
5.009518265724182129e-01
6.014690995216369629e-01
2.315035164356231689e-01
9.960173368453979492e-01
9.998059272766113281e-01
9.581422209739685059e-01
3.369538784027099609e-01
2.513593733310699463e-01
9.997664093971252441e-01
7.560594081878662109e-01
9.518094658851623535e-01
2.226272225379943848e-01
9.934401512145996094e-01
9.737806916236877441e-01
1.826159060001373291e-01
1.000000000000000000e+00
7.312788367271423340e-01
7.778576612472534180e-01
9.572877883911132812e-01
2.245413959026336670e-01
6.293919086456298828e-01
9.999951720237731934e-01
7.356348037719726562e-01
3.586171865463256836e-01
2.431999444961547852e-01
9.999639391899108887e-01
4.257860481739044189e-01
6.578112840652465820e-01
7.992180585861206055e-01
7.811616659164428711e-01
9.999588727951049805e-01
1.000000000000000000e+00
2.461764514446258545e-01
2.525550425052642822e-01
8.473482131958007812e-01
9.999721050262451172e-01
9.987530112266540527e-01
9.998384714126586914e-01
9.759169816970825195e-01
9.925504922866821289e-01
1.803852319717407227e-01
1.955702304840087891e-01
7.202801704406738281e-01
9.999541044235229492e-01
9.960299730300903320e-01
9.799536466598510742e-01
9.999759793281555176e-01
8.951159715652465820e-01
1.000000000000000000e+00
2.288934588432312012e-01
9.998922348022460938e-01
8.037918806076049805e-01
9.950452446937561035e-01
9.999452829360961914e-01
7.837737798690795898e-01
7.990152835845947266e-01
8.176388740539550781e-01
2.136672437191009521e-01
3.848517537117004395e-01
2.911138534545898438e-01
2.167214751243591309e-01
9.704633951187133789e-01
1.981981098651885986e-01
5.615559816360473633e-01
1.808381080627441406e-01
1.000000000000000000e+00
1.854426562786102295e-01
2.074632048606872559e-01
4.459849894046783447e-01
9.999685883522033691e-01
8.160589933395385742e-01
2.355460524559020996e-01
9.643293619155883789e-01
4.796879887580871582e-01
2.097565829753875732e-01
9.981765151023864746e-01
6.631594300270080566e-01
6.747785806655883789e-01
2.993044853210449219e-01
9.822214841842651367e-01
9.830582141876220703e-01
2.176906764507293701e-01
9.828724265098571777e-01
8.591670393943786621e-01
9.948947429656982422e-01
4.693175256252288818e-01
9.722657203674316406e-01
9.318351149559020996e-01
1.903816163539886475e-01
2.402557730674743652e-01
5.956971645355224609e-01
1.782871186733245850e-01
2.518093585968017578e-01
4.339945316314697266e-01
7.813731431961059570e-01
9.965115785598754883e-01
6.843633651733398438e-01
1.848092377185821533e-01
9.997821450233459473e-01
7.253561019897460938e-01
9.858473539352416992e-01
3.050705194473266602e-01
1.916562318801879883e-01
4.157822430133819580e-01
5.184274315834045410e-01
8.276436924934387207e-01
8.544428348541259766e-01
9.982915520668029785e-01
9.996527433395385742e-01
6.805918216705322266e-01
9.454917907714843750e-01
4.935237467288970947e-01
3.369759917259216309e-01
6.390250325202941895e-01
2.238956689834594727e-01
9.654835462570190430e-01
7.919903993606567383e-01
2.103512883186340332e-01
1.000000000000000000e+00
7.905306816101074219e-01
9.970904588699340820e-01
1.000000000000000000e+00
5.057363510131835938e-01
9.818968176841735840e-01
6.969993114471435547e-01
9.899877309799194336e-01
5.618670582771301270e-01
9.890083074569702148e-01
9.766378402709960938e-01
2.043088674545288086e-01
4.411065876483917236e-01
3.687893152236938477e-01
8.077394366264343262e-01
6.661773920059204102e-01
2.026041448116302490e-01
7.415335178375244141e-01
7.856835722923278809e-01
4.145548641681671143e-01
1.873524487018585205e-01
2.011905014514923096e-01
3.634826540946960449e-01
8.338624238967895508e-01
1.859397888183593750e-01
3.356507420539855957e-01
4.893563091754913330e-01
8.920682668685913086e-01
9.559376239776611328e-01
8.891266584396362305e-01
9.143868684768676758e-01
6.285943388938903809e-01
5.971813201904296875e-01
8.452807664871215820e-01
6.463798284530639648e-01
8.748404383659362793e-01
1.833490133285522461e-01
6.387932896614074707e-01
4.850715100765228271e-01
2.765174508094787598e-01
9.128931164741516113e-01
2.795643210411071777e-01
3.648684322834014893e-01
3.605734109878540039e-01
5.384071469306945801e-01
6.862945556640625000e-01
1.954659819602966309e-01
2.225910425186157227e-01
9.999986886978149414e-01
5.053798556327819824e-01
9.996486902236938477e-01
9.970875978469848633e-01
1.846600174903869629e-01
1.884382069110870361e-01
1.885355412960052490e-01
1.000000000000000000e+00
2.667570114135742188e-01
2.208037078380584717e-01
2.491734623908996582e-01
2.432239949703216553e-01
9.323979616165161133e-01
9.999996423721313477e-01
7.429577112197875977e-01
6.133412122726440430e-01
1.850655674934387207e-01
2.345547676086425781e-01
3.219484686851501465e-01
1.948417723178863525e-01
1.797804832458496094e-01
3.740165829658508301e-01
2.088688910007476807e-01
6.921302676200866699e-01
1.905325353145599365e-01
1.976411640644073486e-01
1.827651262283325195e-01
3.155201673507690430e-01
6.404353380203247070e-01
1.850112080574035645e-01
2.094120085239410400e-01
9.994430541992187500e-01
9.999976158142089844e-01
9.408913254737854004e-01
4.957047700881958008e-01
3.262296617031097412e-01
9.378093481063842773e-01
7.437832355499267578e-01
1.784521937370300293e-01
1.861296892166137695e-01
9.804793596267700195e-01
9.999983310699462891e-01
5.333569645881652832e-01
1.838932037353515625e-01
4.908372759819030762e-01
7.633922100067138672e-01
4.328095316886901855e-01
1.000000000000000000e+00
9.731016159057617188e-01
9.953858852386474609e-01
9.763703346252441406e-01
9.999945163726806641e-01
5.232974886894226074e-01
4.033834636211395264e-01
1.000000000000000000e+00
9.999998807907104492e-01
9.971386194229125977e-01
6.669917106628417969e-01
1.924492120742797852e-01
9.977801442146301270e-01
9.897822141647338867e-01
9.939864873886108398e-01
9.995374679565429688e-01
9.999991655349731445e-01
9.688858389854431152e-01
9.999758005142211914e-01
8.406262397766113281e-01
3.786255717277526855e-01
6.499817967414855957e-01
8.925837278366088867e-01
9.998437762260437012e-01
3.794562518596649170e-01
4.893266558647155762e-01
9.682083725929260254e-01
4.252986013889312744e-01
3.182233572006225586e-01
9.329757690429687500e-01
2.347349524497985840e-01
9.950603842735290527e-01
7.648265957832336426e-01
8.560473918914794922e-01
9.986101388931274414e-01
9.359719157218933105e-01
9.999670386314392090e-01
5.555148720741271973e-01
6.238452196121215820e-01
8.630059957504272461e-01
9.998737573623657227e-01
9.999990463256835938e-01
9.995416998863220215e-01
9.910608530044555664e-01
9.176275134086608887e-01
8.941726684570312500e-01
8.608531951904296875e-01
1.972927153110504150e-01
9.471071958541870117e-01
9.940959215164184570e-01
2.734987139701843262e-01
3.179437518119812012e-01
9.927812814712524414e-01
2.869427800178527832e-01
9.999995231628417969e-01
6.175081133842468262e-01
1.824815869331359863e-01
9.999982714653015137e-01
9.180895090103149414e-01
9.987573623657226562e-01
8.743988275527954102e-01
9.966396093368530273e-01
9.799051880836486816e-01
1.888928115367889404e-01
9.833915233612060547e-01
2.636582255363464355e-01
1.000000000000000000e+00
9.233562946319580078e-01
9.630304574966430664e-01
9.999822378158569336e-01
4.530033171176910400e-01
4.988564550876617432e-01
5.511894822120666504e-01
3.944383263587951660e-01
9.999749660491943359e-01
2.395489513874053955e-01
9.999758005142211914e-01
9.999864697456359863e-01
3.036299645900726318e-01
9.635242819786071777e-01
9.999942779541015625e-01
9.999351501464843750e-01
9.996147155761718750e-01
9.942818284034729004e-01
9.962769746780395508e-01
4.229337573051452637e-01
9.486903548240661621e-01
6.236251592636108398e-01
9.999985694885253906e-01
5.326733589172363281e-01
3.112984299659729004e-01
9.999460577964782715e-01
1.783013939857482910e-01
9.984130859375000000e-01
2.486320137977600098e-01
1.895642280578613281e-01
9.993160963058471680e-01
1.000000000000000000e+00
9.989097118377685547e-01
2.031383514404296875e-01
2.127662599086761475e-01
5.198301076889038086e-01
9.999967813491821289e-01
9.791295528411865234e-01
2.454403638839721680e-01
3.340931832790374756e-01
1.784686744213104248e-01
2.405622899532318115e-01
2.108846008777618408e-01
2.607572674751281738e-01
2.155949771404266357e-01
1.000000000000000000e+00
3.287217915058135986e-01
2.218516170978546143e-01
4.285411834716796875e-01
9.996431469917297363e-01
9.993556737899780273e-01
2.140494883060455322e-01
9.908633232116699219e-01
9.975627660751342773e-01
7.367868423461914062e-01
4.392836391925811768e-01
2.819151878356933594e-01
9.951689243316650391e-01
1.782513856887817383e-01
4.007218480110168457e-01
9.630545973777770996e-01
1.784814894199371338e-01
1.968489587306976318e-01
9.998840093612670898e-01
9.417197704315185547e-01
2.035193145275115967e-01
2.174186408519744873e-01
4.540373682975769043e-01
1.940279006958007812e-01
9.999582767486572266e-01
9.999876618385314941e-01
5.060049891471862793e-01
4.359287619590759277e-01
9.833437204360961914e-01
9.971497058868408203e-01
9.008402228355407715e-01
3.601845204830169678e-01
1.000000000000000000e+00
9.000127315521240234e-01
9.845551252365112305e-01
9.977166056632995605e-01
1.000000000000000000e+00
1.000000000000000000e+00
2.521787881851196289e-01
1.000000000000000000e+00
9.974871873855590820e-01
2.019085884094238281e-01
3.841518163681030273e-01
1.785210371017456055e-01
2.578701376914978027e-01
4.469543695449829102e-01
2.285231947898864746e-01
4.275646805763244629e-01
2.617926001548767090e-01
3.682061433792114258e-01
4.825334846973419189e-01
1.829861402511596680e-01
2.018557488918304443e-01
1.818194985389709473e-01
2.052295804023742676e-01
1.784820854663848877e-01
1.969833076000213623e-01
3.233827352523803711e-01
1.830292940139770508e-01
2.227519452571868896e-01
1.854476928710937500e-01
2.076257467269897461e-01
4.372496604919433594e-01
1.962583363056182861e-01
1.884966790676116943e-01
2.701666653156280518e-01
1.927249431610107422e-01
2.512155473232269287e-01
1.984161138534545898e-01
1.967768669128417969e-01
2.036008834838867188e-01
2.781019508838653564e-01
9.693900346755981445e-01
4.431647658348083496e-01
4.415870606899261475e-01
2.614767253398895264e-01
3.135029077529907227e-01
2.327120304107666016e-01
7.940765619277954102e-01
5.975614190101623535e-01
2.463209629058837891e-01
2.020244300365447998e-01
1.980595290660858154e-01
1.848126053810119629e-01
1.808753609657287598e-01
3.237935900688171387e-01
1.988075375556945801e-01
1.000000000000000000e+00
9.520761966705322266e-01
2.220430374145507812e-01
2.318544387817382812e-01
1.854681968688964844e-01
2.392083406448364258e-01
1.984407007694244385e-01
2.050495445728302002e-01
1.968117654323577881e-01
2.257789671421051025e-01
1.948270797729492188e-01
1.909920275211334229e-01
2.005242109298706055e-01
1.834617257118225098e-01
1.850185394287109375e-01
1.915891170501708984e-01
1.918492317199707031e-01
2.468624711036682129e-01
2.146135270595550537e-01
1.938645839691162109e-01
1.924584805965423584e-01
1.840244829654693604e-01
2.293870449066162109e-01
1.779596209526062012e-01
1.834942102432250977e-01
2.375282645225524902e-01
2.361618876457214355e-01
1.813733279705047607e-01
2.109026908874511719e-01
1.888422667980194092e-01
1.807788908481597900e-01
1.895003616809844971e-01
1.894903182983398438e-01
2.492016255855560303e-01
1.800945997238159180e-01
1.918648183345794678e-01
1.937818527221679688e-01
2.628052234649658203e-01
2.045800387859344482e-01
2.327151596546173096e-01
2.286942899227142334e-01
2.091185152530670166e-01
2.135023772716522217e-01
1.849291324615478516e-01
2.042961120605468750e-01
9.698505997657775879e-01
4.629319310188293457e-01
2.933731675148010254e-01
8.637991547584533691e-01
2.140255272388458252e-01
3.712019324302673340e-01
1.910474002361297607e-01
3.930810689926147461e-01
3.015451431274414062e-01
2.424090504646301270e-01
4.589480757713317871e-01
1.888551712036132812e-01
9.990876913070678711e-01
4.085348248481750488e-01
6.780680418014526367e-01
1.819201409816741943e-01
2.168732583522796631e-01
4.604633152484893799e-01
2.655560374259948730e-01
2.182576656341552734e-01
1.943964362144470215e-01
2.063288688659667969e-01
4.157853126525878906e-01
2.471044659614562988e-01
2.863765060901641846e-01
2.226676940917968750e-01
4.066685140132904053e-01
5.860393047332763672e-01
2.255225777626037598e-01
6.823687553405761719e-01
2.309673726558685303e-01
2.309998869895935059e-01
2.110054194927215576e-01
3.508982956409454346e-01
2.670831680297851562e-01
2.832359075546264648e-01
2.714591622352600098e-01
6.273310780525207520e-01
3.112097978591918945e-01
2.273837625980377197e-01
8.769457340240478516e-01
8.326034545898437500e-01
2.173323631286621094e-01
7.066717743873596191e-01
3.260744214057922363e-01
3.642310500144958496e-01
2.713505625724792480e-01
3.002065420150756836e-01
3.985356092453002930e-01
3.965892493724822998e-01
2.468354105949401855e-01
1.892893314361572266e-01
1.787573397159576416e-01
2.170773744583129883e-01
4.082582592964172363e-01
7.559453248977661133e-01
3.759683370590209961e-01
4.518784880638122559e-01
3.371753394603729248e-01
1.976821422576904297e-01
3.959457278251647949e-01
4.060913026332855225e-01
2.941492795944213867e-01
9.428250789642333984e-01
2.125114202499389648e-01
5.895369052886962891e-01
4.352793693542480469e-01
1.844889819622039795e-01
8.833890557289123535e-01
1.853546500205993652e-01
4.204873144626617432e-01
9.123910665512084961e-01
2.929293513298034668e-01
2.008087038993835449e-01
4.849687516689300537e-01
2.529902458190917969e-01
2.610525190830230713e-01
2.803382873535156250e-01
2.128812074661254883e-01
1.926634609699249268e-01
2.475164532661437988e-01
1.947209835052490234e-01
2.163262367248535156e-01
2.272475063800811768e-01
9.910569190979003906e-01
1.968717277050018311e-01
2.204082906246185303e-01
5.479947924613952637e-01
1.928155124187469482e-01
2.148755490779876709e-01
2.570736408233642578e-01
2.132709324359893799e-01
1.989601552486419678e-01
1.819829344749450684e-01
2.581344842910766602e-01
4.970538020133972168e-01
2.080506980419158936e-01
6.478289961814880371e-01
2.428495585918426514e-01
1.782425343990325928e-01
4.631053805351257324e-01
8.909818530082702637e-01
2.343741059303283691e-01
1.802500486373901367e-01
9.999943971633911133e-01
1.885034739971160889e-01
9.985229969024658203e-01
3.314824700355529785e-01
1.853839159011840820e-01
2.768353223800659180e-01
2.217835187911987305e-01
8.493523597717285156e-01
2.125784456729888916e-01
1.958783566951751709e-01
3.850462436676025391e-01
1.840080022811889648e-01
9.996891021728515625e-01
1.808191537857055664e-01
2.758935689926147461e-01
6.620734930038452148e-01
5.017101168632507324e-01
1.828790903091430664e-01
6.028898358345031738e-01
2.044269442558288574e-01
8.433886170387268066e-01
2.508563399314880371e-01
2.064443826675415039e-01
2.110388278961181641e-01
1.928359568119049072e-01
1.920546889305114746e-01
1.947310566902160645e-01
2.266024053096771240e-01
1.832675933837890625e-01
1.955156922340393066e-01
2.211493551731109619e-01
9.911445379257202148e-01
2.668679654598236084e-01
1.990453600883483887e-01
2.561393976211547852e-01
2.408271431922912598e-01
1.844099164009094238e-01
2.106053829193115234e-01
1.924543976783752441e-01
6.795675754547119141e-01
2.623289525508880615e-01
2.624022960662841797e-01
3.955715298652648926e-01
2.109963893890380859e-01
3.586555123329162598e-01
1.934820711612701416e-01
1.890069246292114258e-01
2.587380409240722656e-01
2.388723194599151611e-01
2.399920821189880371e-01
1.830539107322692871e-01
3.174835741519927979e-01
1.947712898254394531e-01
2.075343132019042969e-01
2.563329935073852539e-01
2.205807566642761230e-01
3.558832406997680664e-01
2.149240970611572266e-01
1.857662200927734375e-01
1.791183054447174072e-01
2.134071290493011475e-01
2.199949920177459717e-01
1.965072154998779297e-01
1.868780553340911865e-01
2.498627007007598877e-01
1.810722649097442627e-01
1.799642443656921387e-01
1.979926526546478271e-01
1.827699542045593262e-01
1.949870884418487549e-01
2.159556150436401367e-01
2.007332146167755127e-01
2.156553268432617188e-01
1.809901893138885498e-01
1.798099577426910400e-01
2.191635668277740479e-01
1.918028891086578369e-01
4.986322224140167236e-01
1.953505873680114746e-01
1.820518970489501953e-01
2.211914956569671631e-01
1.937091052532196045e-01
1.808569729328155518e-01
1.868111789226531982e-01
1.845305860042572021e-01
1.780503094196319580e-01
1.863456666469573975e-01
1.782693862915039062e-01
2.829618155956268311e-01
1.851829886436462402e-01
2.016874849796295166e-01
1.785683631896972656e-01
2.636235654354095459e-01
1.908768415451049805e-01
1.930175423622131348e-01
1.986927986145019531e-01
2.251501977443695068e-01
1.875286996364593506e-01
3.188689649105072021e-01
2.330386638641357422e-01
2.460121512413024902e-01
6.403652429580688477e-01
2.494936287403106689e-01
1.826323866844177246e-01
6.345493197441101074e-01
1.877581477165222168e-01
6.027055978775024414e-01
2.235078513622283936e-01
4.423880279064178467e-01
9.889128208160400391e-01
7.553359270095825195e-01
6.967310905456542969e-01
3.657111525535583496e-01
4.999262988567352295e-01
6.255173683166503906e-01
2.349832952022552490e-01
1.862374544143676758e-01
2.826601564884185791e-01
3.545133769512176514e-01
2.885747849941253662e-01
2.657647430896759033e-01
2.973690032958984375e-01
2.120600044727325439e-01
1.899776756763458252e-01
1.830236911773681641e-01
1.831060051918029785e-01
5.637781023979187012e-01
1.816332042217254639e-01
2.104220390319824219e-01
3.293908238410949707e-01
2.156441211700439453e-01
2.072795927524566650e-01
2.433919608592987061e-01
5.129662752151489258e-01
1.840002238750457764e-01
1.846197843551635742e-01
3.636510968208312988e-01
2.018255293369293213e-01
8.637023568153381348e-01
2.568414807319641113e-01
4.606322944164276123e-01
6.639357209205627441e-01
4.515335559844970703e-01
6.191148161888122559e-01
7.338904142379760742e-01
2.596914172172546387e-01
2.321389913558959961e-01
3.778471648693084717e-01
2.907035946846008301e-01
5.723867416381835938e-01
2.476921379566192627e-01
9.901474714279174805e-01
3.245801031589508057e-01
3.640050292015075684e-01
4.362049400806427002e-01
3.979065418243408203e-01
5.476974248886108398e-01
1.876761317253112793e-01
9.997011423110961914e-01
2.521417737007141113e-01
1.845186054706573486e-01
2.931683361530303955e-01
2.559340596199035645e-01
1.814479231834411621e-01
2.060817778110504150e-01
3.734529018402099609e-01
6.104358434677124023e-01
7.564860582351684570e-01
5.617616176605224609e-01
3.976302444934844971e-01
2.115301489830017090e-01
2.535688877105712891e-01
4.742688238620758057e-01
2.979032397270202637e-01
8.260046839714050293e-01
2.502964437007904053e-01
1.952928304672241211e-01
2.642656266689300537e-01
1.811474263668060303e-01
2.763202786445617676e-01
6.612435579299926758e-01
3.517105579376220703e-01
1.943176984786987305e-01
3.208362162113189697e-01
9.915230274200439453e-01
9.549057483673095703e-01
2.042377591133117676e-01
8.696783781051635742e-01
2.316233813762664795e-01
2.112858295440673828e-01
2.187203466892242432e-01
9.983060956001281738e-01
1.992521286010742188e-01
5.259172320365905762e-01
4.489029645919799805e-01
2.511895596981048584e-01
2.976915240287780762e-01
2.459254860877990723e-01
2.606831789016723633e-01
8.710973262786865234e-01
7.843195796012878418e-01
2.590402364730834961e-01
2.793262600898742676e-01
2.003827989101409912e-01
2.260320186614990234e-01
3.191813230514526367e-01
8.566201925277709961e-01
2.654641866683959961e-01
2.608838677406311035e-01
2.172457277774810791e-01
5.590552687644958496e-01
5.359571576118469238e-01
2.340634167194366455e-01
2.121069133281707764e-01
1.966557800769805908e-01
4.090614914894104004e-01
2.230814695358276367e-01
6.026833057403564453e-01
7.496031522750854492e-01
3.339817821979522705e-01
3.137935996055603027e-01
4.475942850112915039e-01
2.601871788501739502e-01
1.789268255233764648e-01
5.589365363121032715e-01
3.816401958465576172e-01
6.076582670211791992e-01
1.803172528743743896e-01
2.428864836692810059e-01
3.070276677608489990e-01
2.563445568084716797e-01
3.681220412254333496e-01
3.926749825477600098e-01
2.313341796398162842e-01
3.054325580596923828e-01
5.288331508636474609e-01
3.246256709098815918e-01
2.536217868328094482e-01
1.897577047348022461e-01
2.577493190765380859e-01
1.875234544277191162e-01
2.348648011684417725e-01
2.511174082756042480e-01
4.223946630954742432e-01
4.116113483905792236e-01
2.803827524185180664e-01
2.112438082695007324e-01
2.048072516918182373e-01
2.260212898254394531e-01
3.298458456993103027e-01
3.172145485877990723e-01
7.141446471214294434e-01
7.215242981910705566e-01
5.079811215400695801e-01
6.586976051330566406e-01
1.783084273338317871e-01
1.844503581523895264e-01
4.381913542747497559e-01
3.647016584873199463e-01
1.939080059528350830e-01
2.660638689994812012e-01
2.280659675598144531e-01
3.738507628440856934e-01
2.642032802104949951e-01
2.141082584857940674e-01
2.394773364067077637e-01
1.849160790443420410e-01
9.801063537597656250e-01
5.158606767654418945e-01
5.342095494270324707e-01
6.749381422996520996e-01
2.760021090507507324e-01
2.181177437305450439e-01
3.967912197113037109e-01
3.305099606513977051e-01
2.090624272823333740e-01
2.574751079082489014e-01
3.747186660766601562e-01
2.937958538532257080e-01
2.178391218185424805e-01
1.879234910011291504e-01
4.545675218105316162e-01
1.994819045066833496e-01
5.003100633621215820e-01
6.285596489906311035e-01
2.023001015186309814e-01
3.643423318862915039e-01
3.253060579299926758e-01
3.870739042758941650e-01
2.846507728099822998e-01
3.604351282119750977e-01
3.364059031009674072e-01
2.296951115131378174e-01
3.412441015243530273e-01
1.915855407714843750e-01
4.360720217227935791e-01
3.877126574516296387e-01
3.243884444236755371e-01
7.559719085693359375e-01
2.190630733966827393e-01
2.240728735923767090e-01
6.769179701805114746e-01
2.297510802745819092e-01
2.021099030971527100e-01
5.527887344360351562e-01
9.420597553253173828e-01
1.896735727787017822e-01
2.730114459991455078e-01
2.369995713233947754e-01
2.175573408603668213e-01
2.587269544601440430e-01
5.967079401016235352e-01
2.984186708927154541e-01
4.592301547527313232e-01
3.559557795524597168e-01
2.279573678970336914e-01
3.722859025001525879e-01
1.828264594078063965e-01
1.894166469573974609e-01
2.126124203205108643e-01
2.495944499969482422e-01
6.375700235366821289e-01
3.405637741088867188e-01
8.846909999847412109e-01
2.013471126556396484e-01
1.945982575416564941e-01
6.421566605567932129e-01
2.561493515968322754e-01
2.039914429187774658e-01
2.807322740554809570e-01
8.393211960792541504e-01
5.535946488380432129e-01
9.930034875869750977e-01
7.651360034942626953e-01
3.351822495460510254e-01
2.393024563789367676e-01
3.459857106208801270e-01
5.896719694137573242e-01
2.429390251636505127e-01
4.437796771526336670e-01
3.530049622058868408e-01
9.998253583908081055e-01
9.795579910278320312e-01
2.053574621677398682e-01
2.001789808273315430e-01
2.367996573448181152e-01
3.244171142578125000e-01
8.528977632522583008e-01
2.671198248863220215e-01
3.389122188091278076e-01
2.820432782173156738e-01
3.081744909286499023e-01
3.651961088180541992e-01
3.384322524070739746e-01
4.576743543148040771e-01
1.980312466621398926e-01
3.582407832145690918e-01
2.708750367164611816e-01
8.673613071441650391e-01
3.805511593818664551e-01
7.476009726524353027e-01
2.576047778129577637e-01
2.756032347679138184e-01
2.005616426467895508e-01
2.782254815101623535e-01
4.692904055118560791e-01
8.552483916282653809e-01
2.170584499835968018e-01
4.616330862045288086e-01
5.007818937301635742e-01
2.196981906890869141e-01
2.502688765525817871e-01
1.873211264610290527e-01
5.184492468833923340e-01
2.554581761360168457e-01
4.963030219078063965e-01
1.804677248001098633e-01
3.402064442634582520e-01
2.561670541763305664e-01
9.504441618919372559e-01
7.447667717933654785e-01
2.131212651729583740e-01
4.309070706367492676e-01
2.028456628322601318e-01
3.421554267406463623e-01
1.880578100681304932e-01
1.931827068328857422e-01
3.036985099315643311e-01
2.822527587413787842e-01
2.898617982864379883e-01
1.812275052070617676e-01
4.205765128135681152e-01
2.975152730941772461e-01
1.860188841819763184e-01
2.171148061752319336e-01
2.863578796386718750e-01
2.024817168712615967e-01
5.153732299804687500e-01
2.321562469005584717e-01
2.846212983131408691e-01
9.417898654937744141e-01
4.107328057289123535e-01
2.312867939472198486e-01
3.748274445533752441e-01
5.604434013366699219e-01
3.245829343795776367e-01
5.367572307586669922e-01
8.446184396743774414e-01
4.526770114898681641e-01
4.728480577468872070e-01
1.972417831420898438e-01
4.514398574829101562e-01
2.124803960323333740e-01
1.850051581859588623e-01
2.996540069580078125e-01
2.533363699913024902e-01
2.776714563369750977e-01
2.550505399703979492e-01
1.868075728416442871e-01
5.682689547538757324e-01
1.807635128498077393e-01
4.872118234634399414e-01
2.075587809085845947e-01
2.001344859600067139e-01
3.823262453079223633e-01
2.502802610397338867e-01
2.169993817806243896e-01
9.583573341369628906e-01
7.151435613632202148e-01
2.933997809886932373e-01
2.371414601802825928e-01
2.975589931011199951e-01
6.650545597076416016e-01
3.752882778644561768e-01
3.403091728687286377e-01
2.193068861961364746e-01
2.613028883934020996e-01
5.124049186706542969e-01
2.498374581336975098e-01
2.448759377002716064e-01
1.858190000057220459e-01
2.394985556602478027e-01
2.828445434570312500e-01
9.441155195236206055e-01
3.567177653312683105e-01
2.271081209182739258e-01
3.391433060169219971e-01
4.141373634338378906e-01
1.797971725463867188e-01
1.815833747386932373e-01
4.903349578380584717e-01
3.109717667102813721e-01
3.975064158439636230e-01
3.938425481319427490e-01
3.019292950630187988e-01
2.347856163978576660e-01
2.009294331073760986e-01
4.426246881484985352e-01
2.407305240631103516e-01
4.849199354648590088e-01
2.117174565792083740e-01
1.827054321765899658e-01
2.744817137718200684e-01
2.117944955825805664e-01
2.098408639430999756e-01
7.544323801994323730e-01
1.858057081699371338e-01
1.799135804176330566e-01
1.843473911285400391e-01
1.825253665447235107e-01
3.915137350559234619e-01
2.300223708152770996e-01
5.362122654914855957e-01
1.791590452194213867e-01
1.911339163780212402e-01
1.857150495052337646e-01
2.926403880119323730e-01
1.972013711929321289e-01
1.843406856060028076e-01
2.414861321449279785e-01
4.004312455654144287e-01
2.106191813945770264e-01
8.538693785667419434e-01
1.829598546028137207e-01
1.847459673881530762e-01
1.859864294528961182e-01
1.803366541862487793e-01
1.822744011878967285e-01
1.815957427024841309e-01
1.862501204013824463e-01
1.854398548603057861e-01
1.859905421733856201e-01
1.876240968704223633e-01
2.767820954322814941e-01
2.084012329578399658e-01
2.798015177249908447e-01
2.034185528755187988e-01
1.967017054557800293e-01
2.286206781864166260e-01
2.153964340686798096e-01
1.799646914005279541e-01
1.786113381385803223e-01
4.222443103790283203e-01
8.989759683609008789e-01
2.919014692306518555e-01
1.936805844306945801e-01
1.904006004333496094e-01
3.721577525138854980e-01
1.949720084667205811e-01
9.209249615669250488e-01
2.001396715641021729e-01
1.968723237514495850e-01
1.810187101364135742e-01
2.092528939247131348e-01
1.967644393444061279e-01
3.518176078796386719e-01
6.250131130218505859e-01
1.944338083267211914e-01
1.869952380657196045e-01
1.917736828327178955e-01
1.829898655414581299e-01
4.457777440547943115e-01
1.807258427143096924e-01
1.835986077785491943e-01
2.009836733341217041e-01
2.139832973480224609e-01
2.479929924011230469e-01
2.403359115123748779e-01
2.583753466606140137e-01
1.820411384105682373e-01
1.830609738826751709e-01
1.958788633346557617e-01
1.924281418323516846e-01
2.037134766578674316e-01
1.854022145271301270e-01
1.953549087047576904e-01
1.985881328582763672e-01
2.137800753116607666e-01
1.824758648872375488e-01
6.743551492691040039e-01
2.453012764453887939e-01
2.130208313465118408e-01
1.893801987171173096e-01
1.923168301582336426e-01
2.005099356174468994e-01
2.005159258842468262e-01
1.820890903472900391e-01
1.855503022670745850e-01
2.686971724033355713e-01
2.033964991569519043e-01
1.943979859352111816e-01
1.847097873687744141e-01
1.886769235134124756e-01
3.003514111042022705e-01
5.571147203445434570e-01
2.793188691139221191e-01
3.938499689102172852e-01
1.967256069183349609e-01
5.605635643005371094e-01
3.854911327362060547e-01
2.004639506340026855e-01
2.075035274028778076e-01
2.043154239654541016e-01
1.884938478469848633e-01
2.053278684616088867e-01
1.923062205314636230e-01
1.787464618682861328e-01
1.819539070129394531e-01
1.828493475914001465e-01
2.025987505912780762e-01
1.795399785041809082e-01
2.614482045173645020e-01
1.932828724384307861e-01
2.167296409606933594e-01
1.799160838127136230e-01
1.838576197624206543e-01
6.734599471092224121e-01
1.848199069499969482e-01
4.116069972515106201e-01
1.873255670070648193e-01
1.781010925769805908e-01
1.910253465175628662e-01
1.954526901245117188e-01
2.668899595737457275e-01
4.918252825736999512e-01
2.181785702705383301e-01
1.787880361080169678e-01
6.891905069351196289e-01
1.902648210525512695e-01
1.845156848430633545e-01
1.907336413860321045e-01
2.048950195312500000e-01
1.826557219028472900e-01
4.379958808422088623e-01
4.456746876239776611e-01
1.809704601764678955e-01
1.803677678108215332e-01
1.813842952251434326e-01
2.105206847190856934e-01
1.789534687995910645e-01
1.853954792022705078e-01
2.060045897960662842e-01
2.311765849590301514e-01
1.785712838172912598e-01
2.364879250526428223e-01
1.856210827827453613e-01
2.346110641956329346e-01
1.901003420352935791e-01
1.807456910610198975e-01
1.784045100212097168e-01
2.890229225158691406e-01
1.939876973628997803e-01
1.792505979537963867e-01
1.791783571243286133e-01
1.783146262168884277e-01
1.805625557899475098e-01
1.831232309341430664e-01
1.846677958965301514e-01
1.813370585441589355e-01
1.879895925521850586e-01
1.887214183807373047e-01
1.845944523811340332e-01
1.849301457405090332e-01
1.844426691532135010e-01
2.070429325103759766e-01
1.966585218906402588e-01
1.789588332176208496e-01
1.844647824764251709e-01
2.099790573120117188e-01
2.274659276008605957e-01
1.800885796546936035e-01
1.907087862491607666e-01
1.868639588356018066e-01
1.871094107627868652e-01
1.786881089210510254e-01
3.083114624023437500e-01
1.837843656539916992e-01
1.835351586341857910e-01
1.873529553413391113e-01
2.281178236007690430e-01
3.378059864044189453e-01
4.026254415512084961e-01
1.785323321819305420e-01
1.797615885734558105e-01
1.840557157993316650e-01
1.839874684810638428e-01
2.105215787887573242e-01
1.813878118991851807e-01
1.964100301265716553e-01
4.064025580883026123e-01
3.841651082038879395e-01
5.020174980163574219e-01
2.507165968418121338e-01
2.179381251335144043e-01
3.999218940734863281e-01
2.159667611122131348e-01
2.194328308105468750e-01
1.861023902893066406e-01
2.237528562545776367e-01
1.919766366481781006e-01
1.829568147659301758e-01
9.528692960739135742e-01
1.852617263793945312e-01
1.842275857925415039e-01
1.939367949962615967e-01
2.138473391532897949e-01
2.401466369628906250e-01
2.021977603435516357e-01
4.497693777084350586e-01
1.854543685913085938e-01
1.996874511241912842e-01
1.787891089916229248e-01
3.946185410022735596e-01
1.840540468692779541e-01
6.962313652038574219e-01
2.015638649463653564e-01
2.456554472446441650e-01
1.966871321201324463e-01
2.196999192237854004e-01
1.863238811492919922e-01
2.018199861049652100e-01
2.043511569499969482e-01
8.555340766906738281e-01
1.946935951709747314e-01
1.905952990055084229e-01
2.056939899921417236e-01
1.816424131393432617e-01
2.180351018905639648e-01
1.840039491653442383e-01
8.010101318359375000e-01
2.421439886093139648e-01
1.783968806266784668e-01
9.905923604965209961e-01
2.096911966800689697e-01
1.903953254222869873e-01
1.835703253746032715e-01
1.816693544387817383e-01
3.543533086776733398e-01
2.824588418006896973e-01
1.808566749095916748e-01
1.994187235832214355e-01
2.010659873485565186e-01
1.811083555221557617e-01
1.856780946254730225e-01
4.342479407787322998e-01
2.400743067264556885e-01
3.095735609531402588e-01
2.653305232524871826e-01
2.049808800220489502e-01
1.913184523582458496e-01
1.818815767765045166e-01
9.472165107727050781e-01
1.914065778255462646e-01
1.896432638168334961e-01
2.023900151252746582e-01
3.442590832710266113e-01
2.418839633464813232e-01
2.162353098392486572e-01
2.208333909511566162e-01
1.901754140853881836e-01
1.820744276046752930e-01
2.036129832267761230e-01
1.901717782020568848e-01
1.972136497497558594e-01
2.127200961112976074e-01
1.820174455642700195e-01
2.497113049030303955e-01
7.990608215332031250e-01
2.452882230281829834e-01
1.781573295593261719e-01
1.841133534908294678e-01
1.987275779247283936e-01
2.461510896682739258e-01
6.000902652740478516e-01
1.810905933380126953e-01
2.323112189769744873e-01
1.887787580490112305e-01
1.852641105651855469e-01
9.183586835861206055e-01
6.030639410018920898e-01
2.263783812522888184e-01
2.512920796871185303e-01
3.235346078872680664e-01
1.816600561141967773e-01
2.037354111671447754e-01
2.106397747993469238e-01
2.025167047977447510e-01
1.821394860744476318e-01
2.338802218437194824e-01
1.995852589607238770e-01
9.987316131591796875e-01
2.197968959808349609e-01
3.705402016639709473e-01
3.640934526920318604e-01
2.168006598949432373e-01
2.137094438076019287e-01
1.800302267074584961e-01
1.988186538219451904e-01
1.803156137466430664e-01
1.878487467765808105e-01
2.191920578479766846e-01
2.632942795753479004e-01
2.037013769149780273e-01
1.990022063255310059e-01
2.038442790508270264e-01
4.788137376308441162e-01
1.817238032817840576e-01
1.848542094230651855e-01
6.976513266563415527e-01
2.158135175704956055e-01
2.832832336425781250e-01
3.150883615016937256e-01
2.448965311050415039e-01
1.834227740764617920e-01
2.173903584480285645e-01
4.652064442634582520e-01
1.986844837665557861e-01
2.197924852371215820e-01
2.350738942623138428e-01
2.642540931701660156e-01
1.781843602657318115e-01
1.827454268932342529e-01
1.994524598121643066e-01
3.701270818710327148e-01
2.995801568031311035e-01
3.915722966194152832e-01
1.799933612346649170e-01
4.429897964000701904e-01
2.183430194854736328e-01
2.129686176776885986e-01
1.861319839954376221e-01
4.033562242984771729e-01
1.877709329128265381e-01
1.965187191963195801e-01
2.384212613105773926e-01
1.949739456176757812e-01
9.847545027732849121e-01
6.103469133377075195e-01
3.238183259963989258e-01
1.943244636058807373e-01
9.798561334609985352e-01
3.453999757766723633e-01
2.001874744892120361e-01
1.862577795982360840e-01
1.997860968112945557e-01
1.815709471702575684e-01
1.922220289707183838e-01
1.806174516677856445e-01
5.678922533988952637e-01
1.821926534175872803e-01
1.822940111160278320e-01
2.010131478309631348e-01
2.045539021492004395e-01
3.426895737648010254e-01
1.900793313980102539e-01
9.799056649208068848e-01
1.870517134666442871e-01
4.307781457901000977e-01
7.066357135772705078e-01
1.794058978557586670e-01
1.893078088760375977e-01
1.872945725917816162e-01
1.853981912136077881e-01
1.898419559001922607e-01
1.901080012321472168e-01
1.821401715278625488e-01
1.865248382091522217e-01
1.840430498123168945e-01
1.788459122180938721e-01
1.779855787754058838e-01
4.561436474323272705e-01
1.808856427669525146e-01
1.794676482677459717e-01
1.817573010921478271e-01
2.118989229202270508e-01
1.785108447074890137e-01
1.836581230163574219e-01
1.837882101535797119e-01
1.794643104076385498e-01
2.004911899566650391e-01
1.815020740032196045e-01
1.860424876213073730e-01
4.308919310569763184e-01
5.420207381248474121e-01
6.873367428779602051e-01
2.317255437374114990e-01
1.970356404781341553e-01
3.482732772827148438e-01
1.800313293933868408e-01
1.798017919063568115e-01
7.888368368148803711e-01
3.329787254333496094e-01
3.122832775115966797e-01
3.152816295623779297e-01
2.632465958595275879e-01
8.660200834274291992e-01
8.348966836929321289e-01
2.146989405155181885e-01
1.868374347686767578e-01
1.869465708732604980e-01
7.298176288604736328e-01
3.429031372070312500e-01
2.567092776298522949e-01
6.439476013183593750e-01
2.595190107822418213e-01
2.407183945178985596e-01
9.957383871078491211e-01
2.270956337451934814e-01
2.175846099853515625e-01
1.788899302482604980e-01
1.962627470493316650e-01
2.164585292339324951e-01
1.815572381019592285e-01
2.852433323860168457e-01
2.949626445770263672e-01
9.596902132034301758e-01
8.862253427505493164e-01
1.926209330558776855e-01
1.866788864135742188e-01
1.927648186683654785e-01
4.348618388175964355e-01
4.143711030483245850e-01
2.152445316314697266e-01
1.939767599105834961e-01
3.418762087821960449e-01
1.840912401676177979e-01
1.826302409172058105e-01
1.839936971664428711e-01
1.905300915241241455e-01
1.855831742286682129e-01
1.830077767372131348e-01
1.792958676815032959e-01
2.344816327095031738e-01
1.839977502822875977e-01
1.879872679710388184e-01
2.220027148723602295e-01
1.902102231979370117e-01
2.121462225914001465e-01
1.850559115409851074e-01
1.902177929878234863e-01
6.229619979858398438e-01
1.865302026271820068e-01
1.945085227489471436e-01
1.819228827953338623e-01
2.266353070735931396e-01
2.066015601158142090e-01
1.907585561275482178e-01
1.781013309955596924e-01
2.001998722553253174e-01
1.944841444492340088e-01
2.828819155693054199e-01
1.824600994586944580e-01
4.226088523864746094e-01
3.000156581401824951e-01
9.162992238998413086e-01
3.344967067241668701e-01
4.780393838882446289e-01
2.019606232643127441e-01
4.055842161178588867e-01
1.858557462692260742e-01
6.043919324874877930e-01
1.935306489467620850e-01
2.345709800720214844e-01
1.799022853374481201e-01
3.815631866455078125e-01
2.291864454746246338e-01
2.899855375289916992e-01
1.911752223968505859e-01
1.814241111278533936e-01
5.632550716400146484e-01
8.331683874130249023e-01
1.979493498802185059e-01
2.265999019145965576e-01
2.489564120769500732e-01
3.313277363777160645e-01
5.329165458679199219e-01
1.943310201168060303e-01
2.306545078754425049e-01
4.942291975021362305e-01
1.847026646137237549e-01
2.060755193233489990e-01
1.977732181549072266e-01
1.873781979084014893e-01
1.796827614307403564e-01
2.439822554588317871e-01
1.862238049507141113e-01
2.266442477703094482e-01
1.976616680622100830e-01
2.448775470256805420e-01
3.111369013786315918e-01
5.419411063194274902e-01
4.387686252593994141e-01
2.276837825775146484e-01
1.977023482322692871e-01
1.944752931594848633e-01
1.951980590820312500e-01
1.936780214309692383e-01
4.971415698528289795e-01
3.672298491001129150e-01
2.040311992168426514e-01
6.109710335731506348e-01
9.983242154121398926e-01
2.054514884948730469e-01
4.192970991134643555e-01
1.827778220176696777e-01
1.852267980575561523e-01
2.831171154975891113e-01
1.810333430767059326e-01
2.016550302505493164e-01
1.825819015502929688e-01
2.073631584644317627e-01
5.377681255340576172e-01
2.115578651428222656e-01
2.600829601287841797e-01
1.786839962005615234e-01
2.320163846015930176e-01
2.501428425312042236e-01
2.156689763069152832e-01
4.535337984561920166e-01
9.390112161636352539e-01
2.616726160049438477e-01
2.874549627304077148e-01
2.321641743183135986e-01
3.140742778778076172e-01
2.445853948593139648e-01
2.848572731018066406e-01
9.751828908920288086e-01
1.977195143699645996e-01
2.313440144062042236e-01
5.670101046562194824e-01
2.478317618370056152e-01
1.960144042968750000e-01
1.807414591312408447e-01
1.995373666286468506e-01
9.584041833877563477e-01
4.459626376628875732e-01
3.996833562850952148e-01
2.094234228134155273e-01
1.875856220722198486e-01
1.807662844657897949e-01
2.030650973320007324e-01
2.108085453510284424e-01
1.904579102993011475e-01
6.035994291305541992e-01
7.220400571823120117e-01
5.167914628982543945e-01
8.392341136932373047e-01
6.779029369354248047e-01
2.552536129951477051e-01
5.076159834861755371e-01
1.956987977027893066e-01
1.847721040248870850e-01
3.024351596832275391e-01
3.510156869888305664e-01
6.289821267127990723e-01
7.484943866729736328e-01
2.055520415306091309e-01
1.964322626590728760e-01
4.108746051788330078e-01
1.868289411067962646e-01
4.540073871612548828e-01
1.826023459434509277e-01
7.443785667419433594e-01
2.084581553936004639e-01
1.844065785408020020e-01
2.554016709327697754e-01
6.303641796112060547e-01
2.071390151977539062e-01
2.445182800292968750e-01
2.417740523815155029e-01
7.482970952987670898e-01
1.840143799781799316e-01
2.380374968051910400e-01
5.663497447967529297e-01
1.814720630645751953e-01
4.982277750968933105e-01
1.915715634822845459e-01
5.311967134475708008e-01
2.666456103324890137e-01
1.844224035739898682e-01
1.883623003959655762e-01
2.577395141124725342e-01
1.780337989330291748e-01
2.321487665176391602e-01
1.849909126758575439e-01
2.335880994796752930e-01
2.259112298488616943e-01
3.625943064689636230e-01
2.089338600635528564e-01
2.500988245010375977e-01
2.852831482887268066e-01
1.895530819892883301e-01
2.345881164073944092e-01
2.068613767623901367e-01
2.295499145984649658e-01
2.920969128608703613e-01
2.539215087890625000e-01
2.083022594451904297e-01
1.868414282798767090e-01
2.017722129821777344e-01
1.803075969219207764e-01
1.882363855838775635e-01
3.383758664131164551e-01
2.047561407089233398e-01
2.080097794532775879e-01
3.783711194992065430e-01
2.833985686302185059e-01
1.789324879646301270e-01
1.897124946117401123e-01
4.191002249717712402e-01
6.041789054870605469e-01
2.189371883869171143e-01
2.450385987758636475e-01
2.387759387493133545e-01
2.249132096767425537e-01
2.059435844421386719e-01
2.720156013965606689e-01
2.804705500602722168e-01
4.354418516159057617e-01
3.733454942703247070e-01
2.543842196464538574e-01
2.312802076339721680e-01
4.417447745800018311e-01
3.989897966384887695e-01
1.916323900222778320e-01
1.810378730297088623e-01
2.418417334556579590e-01
1.836740970611572266e-01
2.016786932945251465e-01
1.796979904174804688e-01
2.241441905498504639e-01
4.596299231052398682e-01
9.333023428916931152e-01
3.088238835334777832e-01
2.274333238601684570e-01
3.640071153640747070e-01
1.779637336730957031e-01
2.254483699798583984e-01
1.822043955326080322e-01
2.200760841369628906e-01
2.331881225109100342e-01
1.809935569763183594e-01
1.827762722969055176e-01
1.850570738315582275e-01
3.034243583679199219e-01
1.951452493667602539e-01
1.866551637649536133e-01
1.980727016925811768e-01
5.049825906753540039e-01
1.870501637458801270e-01
2.488737106323242188e-01
3.499115705490112305e-01
3.952271342277526855e-01
2.051324844360351562e-01
2.300204336643218994e-01
2.006381750106811523e-01
1.852841675281524658e-01
1.805259883403778076e-01
5.112937092781066895e-01
5.372484326362609863e-01
1.789128482341766357e-01
3.958088755607604980e-01
2.753678560256958008e-01
1.940470933914184570e-01
1.944639682769775391e-01
1.974219679832458496e-01
9.371054768562316895e-01
8.134596347808837891e-01
5.101382732391357422e-01
1.848494112491607666e-01
5.156196355819702148e-01
1.882212758064270020e-01
4.384642243385314941e-01
2.537361085414886475e-01
3.515495657920837402e-01
2.157147824764251709e-01
3.038088083267211914e-01
1.867401301860809326e-01
3.347577750682830811e-01
1.837999224662780762e-01
2.073932886123657227e-01
1.793357133865356445e-01
2.164240777492523193e-01
2.324627935886383057e-01
2.114048898220062256e-01
1.791819632053375244e-01
1.881860792636871338e-01
2.174484431743621826e-01
2.905566096305847168e-01
3.668459653854370117e-01
1.858306229114532471e-01
2.038638591766357422e-01
5.014006495475769043e-01
3.030806183815002441e-01
2.468305826187133789e-01
1.922221779823303223e-01
2.162262499332427979e-01
3.251450061798095703e-01
2.151084542274475098e-01
1.798979341983795166e-01
1.792794764041900635e-01
2.022693455219268799e-01
2.648670077323913574e-01
1.873266398906707764e-01
1.818125545978546143e-01
3.177120089530944824e-01
2.187781333923339844e-01
1.943255960941314697e-01
1.915066242218017578e-01
2.473106682300567627e-01
1.879487037658691406e-01
1.805628836154937744e-01
1.784066855907440186e-01
2.501103281974792480e-01
1.822777986526489258e-01
1.790583133697509766e-01
