9.999915957450866699e-01
2.300804853439331055e-02
2.752727866172790527e-01
9.383264780044555664e-01
9.999746680259704590e-01
8.898345232009887695e-01
9.577746987342834473e-01
8.888430595397949219e-01
9.999266862869262695e-01
3.195348083972930908e-01
6.635934114456176758e-01
1.000000000000000000e+00
4.388740658760070801e-02
9.995446205139160156e-01
9.903542995452880859e-01
1.964157223701477051e-01
1.409707665443420410e-01
2.908554971218109131e-01
9.709514379501342773e-01
2.094539999961853027e-01
3.659099936485290527e-01
9.692287445068359375e-01
9.990436434745788574e-01
8.786689043045043945e-01
9.923073053359985352e-01
9.990192651748657227e-01
9.946873188018798828e-01
9.964395165443420410e-01
9.999978542327880859e-01
8.767704963684082031e-01
8.045865893363952637e-01
9.884972572326660156e-01
6.777073144912719727e-01
7.371942996978759766e-01
1.826747059822082520e-01
9.979941248893737793e-01
8.705363273620605469e-01
2.301961183547973633e-03
9.974486231803894043e-01
6.349186897277832031e-01
9.957261085510253906e-01
1.098504960536956787e-01
8.342754840850830078e-02
7.379906773567199707e-01
8.211756944656372070e-01
9.997009038925170898e-01
9.950952529907226562e-01
4.035997390747070312e-02
9.750370383262634277e-01
9.994543194770812988e-01
9.856608510017395020e-01
2.032024264335632324e-01
9.875949025154113770e-01
9.993779063224792480e-01
1.593321561813354492e-01
9.511108398437500000e-01
9.770436286926269531e-01
9.918495416641235352e-01
9.999396800994873047e-01
1.477096974849700928e-01
9.994860887527465820e-01
9.714587926864624023e-01
9.224164485931396484e-01
9.989120960235595703e-01
9.990087151527404785e-01
9.147640466690063477e-01
1.000000000000000000e+00
7.742616534233093262e-01
4.355907440185546875e-03
9.996036291122436523e-01
9.988282322883605957e-01
1.344854831695556641e-01
1.000000000000000000e+00
9.994748830795288086e-01
8.304493427276611328e-01
9.765001535415649414e-01
7.783794403076171875e-01
7.277821302413940430e-01
9.988820552825927734e-01
9.996763467788696289e-01
9.879956245422363281e-01
4.254341721534729004e-01
6.788305044174194336e-01
9.950487017631530762e-01
9.999986886978149414e-01
9.829798340797424316e-01
9.999976158142089844e-01
9.236720204353332520e-01
9.999989271163940430e-01
9.999966025352478027e-01
7.239080667495727539e-01
1.000000000000000000e+00
9.999880790710449219e-01
9.587194919586181641e-01
9.992249011993408203e-01
9.798487424850463867e-01
9.269483089447021484e-01
1.000000000000000000e+00
4.613825678825378418e-02
9.632205963134765625e-02
9.997152090072631836e-01
9.969915151596069336e-01
3.060924708843231201e-01
9.970898628234863281e-01
9.683137536048889160e-01
9.941661953926086426e-01
1.033241748809814453e-01
1.000000000000000000e+00
9.999338984489440918e-01
9.998093843460083008e-01
3.183463215827941895e-02
8.935995101928710938e-01
9.995896816253662109e-01
9.068921804428100586e-01
9.995925426483154297e-01
9.337717294692993164e-01
8.112922310829162598e-02
6.005518436431884766e-01
9.992915391921997070e-01
9.999988079071044922e-01
9.999855756759643555e-01
3.271375000476837158e-01
8.894693851470947266e-01
9.629662036895751953e-01
8.734515309333801270e-02
4.409559369087219238e-01
4.487633705139160156e-03
9.999996423721313477e-01
9.962121248245239258e-01
6.381152272224426270e-01
3.920663595199584961e-01
9.327394962310791016e-01
6.994187831878662109e-03
1.000000000000000000e+00
2.671754360198974609e-01
9.999951124191284180e-01
9.989636540412902832e-01
9.996116161346435547e-01
1.000000000000000000e+00
9.999990463256835938e-01
9.863402843475341797e-01
9.995132088661193848e-01
1.000000000000000000e+00
9.988724589347839355e-01
9.309204816818237305e-01
1.907959580421447754e-01
8.362942934036254883e-01
9.896756410598754883e-01
9.990441799163818359e-01
9.809130430221557617e-01
7.789471745491027832e-01
7.400256395339965820e-01
1.000000000000000000e+00
1.715540885925292969e-03
1.000000000000000000e+00
1.274449229240417480e-01
8.998095989227294922e-01
5.621828436851501465e-01
9.347496628761291504e-01
4.191980063915252686e-01
7.847485542297363281e-01
9.618420600891113281e-01
9.999763965606689453e-01
4.601957201957702637e-01
9.739661216735839844e-01
2.798560857772827148e-01
9.985220432281494141e-01
9.999989867210388184e-01
4.676193460229072230e-11
3.169713616371154785e-01
2.455490827560424805e-01
4.210164546966552734e-01
9.999974966049194336e-01
6.414068341255187988e-01
3.998447060585021973e-01
5.870231986045837402e-01
9.986085891723632812e-01
9.930634498596191406e-01
9.823421239852905273e-01
1.000000000000000000e+00
9.999068975448608398e-01
9.745362997055053711e-01
9.857125282287597656e-01
9.980880618095397949e-01
7.191604375839233398e-01
1.000000000000000000e+00
9.999988079071044922e-01
8.404215574264526367e-01
5.941471457481384277e-02
2.542713284492492676e-02
9.560684561729431152e-01
9.990648627281188965e-01
3.539131283760070801e-01
8.797881007194519043e-02
8.826218843460083008e-01
6.606546640396118164e-01
5.348643660545349121e-01
9.995955228805541992e-01
2.626869678497314453e-01
9.999668598175048828e-01
8.131265640258789062e-03
7.565409541130065918e-01
2.633330225944519043e-02
9.596470594406127930e-01
6.933070421218872070e-01
9.535776376724243164e-01
9.131178855895996094e-01
8.403638601303100586e-01
3.987547755241394043e-02
9.975613355636596680e-01
9.450681209564208984e-01
3.243258595466613770e-01
8.323304653167724609e-01
2.682217359542846680e-01
9.938203096389770508e-01
9.906690716743469238e-01
9.106147289276123047e-01
8.996240496635437012e-01
9.999711513519287109e-01
1.000000000000000000e+00
9.993128180503845215e-01
5.818989276885986328e-01
9.952608346939086914e-01
2.173531353473663330e-01
8.175156116485595703e-01
5.285359621047973633e-01
1.000000000000000000e+00
7.487013339996337891e-01
9.990241527557373047e-01
9.997498989105224609e-01
1.000000000000000000e+00
6.267390251159667969e-01
9.676670432090759277e-01
9.814814329147338867e-01
4.538302123546600342e-01
9.996092319488525391e-01
9.442867040634155273e-01
9.887802600860595703e-01
9.995488524436950684e-01
9.635685086250305176e-01
3.701649904251098633e-01
4.380525946617126465e-01
4.102342724800109863e-01
9.729088544845581055e-01
9.994278550148010254e-01
9.948083162307739258e-01
7.442021369934082031e-02
9.990379810333251953e-01
4.046775698661804199e-01
9.999369978904724121e-01
5.848402380943298340e-01
9.872336983680725098e-01
9.950933456420898438e-01
9.985401034355163574e-01
1.000000000000000000e+00
9.915344715118408203e-01
8.915516734123229980e-01
1.000000000000000000e+00
9.999772310256958008e-01
3.626971840858459473e-01
9.650002717971801758e-01
1.000000000000000000e+00
9.999666213989257812e-01
9.375653862953186035e-01
5.030531287193298340e-01
9.989820718765258789e-01
1.000000000000000000e+00
1.000000000000000000e+00
9.989141225814819336e-01
1.973671615123748779e-01
9.854929447174072266e-01
2.396366894245147705e-01
2.735196352005004883e-01
8.145520687103271484e-01
9.388010501861572266e-01
1.000000000000000000e+00
8.393492698669433594e-01
9.375410079956054688e-01
9.999836087226867676e-01
9.238051176071166992e-01
9.121490716934204102e-01
9.999987483024597168e-01
4.029405713081359863e-01
9.997715950012207031e-01
7.055749893188476562e-01
1.251570582389831543e-01
9.972732067108154297e-01
5.277475714683532715e-01
9.999796152114868164e-01
9.972385168075561523e-01
9.883484840393066406e-01
9.732087850570678711e-01
9.934794902801513672e-01
7.354831695556640625e-01
9.999783039093017578e-01
9.873343110084533691e-01
1.000000000000000000e+00
4.300410449504852295e-01
9.658141136169433594e-01
9.996137022972106934e-01
1.000000000000000000e+00
9.610226154327392578e-01
1.177718937397003174e-01
9.740966558456420898e-01
1.312126517295837402e-01
9.994289875030517578e-01
9.977576732635498047e-01
9.559627175331115723e-01
9.999997615814208984e-01
3.740481734275817871e-01
3.951585590839385986e-01
9.993875622749328613e-01
9.541584253311157227e-01
4.816740155220031738e-01
8.494163155555725098e-01
1.000000000000000000e+00
9.993357658386230469e-01
9.896987080574035645e-01
9.997596740722656250e-01
9.994695186614990234e-01
3.950715363025665283e-01
7.941602468490600586e-01
5.086846947669982910e-01
5.706399679183959961e-01
1.961641311645507812e-01
9.529320001602172852e-01
2.058131694793701172e-01
6.037196516990661621e-01
9.708753824234008789e-01
9.606766104698181152e-01
9.616404175758361816e-01
9.502925872802734375e-01
9.995185136795043945e-01
9.495025277137756348e-01
9.964935779571533203e-01
9.827979207038879395e-01
9.991958141326904297e-01
4.871833324432373047e-02
6.521233916282653809e-01
5.709398984909057617e-01
3.006592392921447754e-02
4.734096229076385498e-01
4.576641321182250977e-02
9.862519502639770508e-01
9.947367310523986816e-01
8.832528591156005859e-01
4.470468461513519287e-01
9.998294115066528320e-01
2.061229944229125977e-01
9.990372657775878906e-01
9.999730587005615234e-01
1.000000000000000000e+00
1.560880541801452637e-01
8.867076635360717773e-01
9.989852905273437500e-01
9.999946355819702148e-01
1.000000000000000000e+00
1.000000000000000000e+00
9.945740699768066406e-01
9.962189197540283203e-01
4.792396724224090576e-01
4.650569098885171115e-05
7.378518581390380859e-02
1.465800404548645020e-01
7.289219498634338379e-01
9.994254112243652344e-01
9.960516095161437988e-01
8.499154448509216309e-01
8.640210628509521484e-01
9.999983906745910645e-01
9.100380539894104004e-01
9.997453689575195312e-01
3.237419724464416504e-01
9.478807449340820312e-03
9.986215233802795410e-01
9.999017715454101562e-01
9.997216463088989258e-01
4.982746839523315430e-01
9.994683265686035156e-01
9.890366792678833008e-01
9.979123473167419434e-01
9.843484163284301758e-01
9.724199771881103516e-01
9.996932744979858398e-01
1.781917512416839600e-01
9.993268251419067383e-01
9.982814788818359375e-01
8.621470332145690918e-01
3.470699489116668701e-01
6.109272837638854980e-01
8.763610124588012695e-01
9.999676942825317383e-01
1.000000000000000000e+00
9.121587276458740234e-01
8.661121726036071777e-01
7.159398794174194336e-01
9.953126907348632812e-01
9.995441436767578125e-01
5.564278960227966309e-01
9.122616052627563477e-02
8.504986763000488281e-03
9.991481304168701172e-01
1.104435324668884277e-02
1.000000000000000000e+00
9.999997615814208984e-01
9.883731603622436523e-01
8.971067070960998535e-01
4.965025782585144043e-01
9.737933874130249023e-01
8.615430593490600586e-01
6.331712007522583008e-03
4.146044254302978516e-01
4.094081521034240723e-01
9.972320199012756348e-01
2.924096584320068359e-02
2.601328492164611816e-01
3.083521127700805664e-01
5.526781082153320312e-03
9.914005994796752930e-01
4.314228594303131104e-01
9.999842643737792969e-01
9.848698377609252930e-01
6.615902185440063477e-01
9.897228479385375977e-01
9.998484849929809570e-01
9.958430528640747070e-01
9.954512119293212891e-01
9.904506206512451172e-01
9.884275794029235840e-01
3.402364253997802734e-02
1.853231191635131836e-01
7.589956521987915039e-01
1.000000000000000000e+00
1.000000000000000000e+00
5.239091515541076660e-01
9.994482994079589844e-01
2.177049219608306885e-01
9.877634048461914062e-01
7.468301057815551758e-02
5.206707715988159180e-01
2.442727684974670410e-01
9.991877079010009766e-01
1.000000000000000000e+00
3.189682960510253906e-03
2.639260888099670410e-01
4.179428815841674805e-01
1.000000000000000000e+00
9.992266893386840820e-01
9.895164370536804199e-01
9.999271631240844727e-01
6.325140595436096191e-02
3.635951876640319824e-02
3.342342376708984375e-02
9.999848008155822754e-01
8.900001049041748047e-01
9.807331562042236328e-01
9.720363616943359375e-01
6.306128501892089844e-01
9.998457431793212891e-01
9.737904071807861328e-01
9.941512346267700195e-01
9.763603806495666504e-01
1.000000000000000000e+00
5.614855885505676270e-02
1.000000000000000000e+00
9.999946355819702148e-01
9.998567700386047363e-01
6.549178957939147949e-01
9.994086027145385742e-01
6.925230026245117188e-01
9.887077212333679199e-01
9.999969005584716797e-01
4.358912408351898193e-01
9.654177427291870117e-01
9.999539852142333984e-01
9.545381069183349609e-01
9.990473985671997070e-01
2.738373279571533203e-01
6.715381741523742676e-01
8.999962210655212402e-01
6.422879695892333984e-01
9.989297389984130859e-01
1.000000000000000000e+00
9.417752623558044434e-01
3.789663314819335938e-04
1.175710558891296387e-01
1.000000000000000000e+00
8.791247010231018066e-02
5.092527270317077637e-01
9.999809265136718750e-01
8.417498469352722168e-01
7.062821388244628906e-01
9.090994596481323242e-01
7.397503852844238281e-01
8.595165014266967773e-01
9.920543432235717773e-01
9.916612505912780762e-01
9.504808187484741211e-01
8.194985389709472656e-01
9.714505672454833984e-01
9.651213884353637695e-03
1.544149219989776611e-01
5.595952272415161133e-02
8.478567004203796387e-02
8.154690265655517578e-03
2.941668033599853516e-03
1.646578311920166016e-04
1.000000000000000000e+00
9.999830126762390137e-01
5.315266389516182244e-05
4.754006862640380859e-02
3.367255330085754395e-01
3.473569750785827637e-01
9.994316101074218750e-01
1.042308509349822998e-01
3.772383928298950195e-02
2.871779501438140869e-01
3.706889152526855469e-01
4.183441400527954102e-02
3.528535366058349609e-03
6.831991672515869141e-01
3.139104843139648438e-01
6.864279508590698242e-03
7.232051491737365723e-01
9.610226154327392578e-01
4.127755761146545410e-02
6.543338298797607422e-03
1.000000000000000000e+00
1.000000000000000000e+00
1.367136836051940918e-01
1.401507556438446045e-01
1.856982111930847168e-01
4.283809661865234375e-02
7.955971360206604004e-02
9.951117038726806641e-01
8.210587501525878906e-02
8.215007185935974121e-02
1.395348310470581055e-01
6.701955199241638184e-02
2.456735670566558838e-01
8.259004354476928711e-01
4.164544939994812012e-01
3.431648015975952148e-03
4.986502230167388916e-01
2.496571242809295654e-01
9.452939033508300781e-03
4.158814251422882080e-01
4.301387667655944824e-01
5.552771091461181641e-01
2.892696857452392578e-02
6.937086582183837891e-04
2.731204032897949219e-02
8.616764545440673828e-01
3.737552762031555176e-01
2.718496322631835938e-02
1.014187037944793701e-01
1.763608157634735107e-01
3.664330840110778809e-01
9.301924705505371094e-02
9.058722853660583496e-02
4.160314798355102539e-03
8.561944961547851562e-02
8.286306858062744141e-01
3.995269536972045898e-03
7.406785488128662109e-01
3.104637265205383301e-01
1.773920655250549316e-02
2.212087512016296387e-01
5.818765163421630859e-01
1.339634358882904053e-01
8.868231773376464844e-01
1.253427565097808838e-01
1.126422584056854248e-01
4.203408956527709961e-02
3.941885828971862793e-01
7.972227334976196289e-01
5.595551729202270508e-01
2.446937263011932373e-01
4.485350847244262695e-01
5.479219555854797363e-02
1.900514960289001465e-02
1.249642968177795410e-01
9.996340870857238770e-01
9.298312664031982422e-02
1.015785038471221924e-01
2.049082517623901367e-01
6.088796854019165039e-01
7.388752698898315430e-02
5.562241077423095703e-01
4.569679498672485352e-03
5.043858289718627930e-02
4.783231019973754883e-02
3.142201900482177734e-02
7.508908510208129883e-01
2.267676591873168945e-02
4.131530523300170898e-01
9.985097646713256836e-01
8.720394372940063477e-01
9.999439120292663574e-01
1.128882169723510742e-03
1.994132995605468750e-03
2.281680107116699219e-01
3.513568639755249023e-01
1.739397644996643066e-02
3.230462670326232910e-01
8.847175836563110352e-01
3.024805784225463867e-01
9.963349103927612305e-01
1.302460730075836182e-01
9.030115604400634766e-02
9.938958883285522461e-01
1.707386970520019531e-02
7.816958427429199219e-01
9.957263469696044922e-01
5.423545241355895996e-01
9.999623298645019531e-01
9.768921136856079102e-01
7.059116959571838379e-01
1.274474263191223145e-01
5.371874570846557617e-02
1.182174682617187500e-02
4.957398772239685059e-02
6.996509432792663574e-01
2.158248424530029297e-02
2.087807655334472656e-02
1.674887537956237793e-02
1.979199051856994629e-02
1.860737800598144531e-02
1.297259628772735596e-01
1.678765416145324707e-01
2.519079446792602539e-01
7.874029874801635742e-02
1.000000000000000000e+00
9.994977712631225586e-01
2.705661654472351074e-01
1.718819141387939453e-03
3.029078841209411621e-01
2.042436897754669189e-01
5.595867037773132324e-01
2.003172039985656738e-01
3.177058696746826172e-02
9.224712848663330078e-04
2.353733479976654053e-01
2.596243023872375488e-01
4.445123672485351562e-02
2.891643047332763672e-01
1.478579938411712646e-01
9.999922513961791992e-01
9.131118059158325195e-01
3.977458477020263672e-01
1.641049981117248535e-02
3.561485409736633301e-01
3.406117856502532959e-01
3.372928500175476074e-02
7.621526718139648438e-03
5.816698074340820312e-02
2.221223711967468262e-01
1.058025956153869629e-01
3.440052568912506104e-01
4.740658402442932129e-01
1.050512790679931641e-01
1.233266592025756836e-01
2.400743687758222222e-05
9.999929666519165039e-01
5.986002683639526367e-01
4.707783460617065430e-03
2.016451954841613770e-02
1.247284308192320168e-05
3.173285722732543945e-01
9.985047578811645508e-01
3.032314777374267578e-02
4.386506378650665283e-01
4.320716857910156250e-02
9.704606533050537109e-01
2.734169363975524902e-01
6.294310092926025391e-01
5.900174379348754883e-03
9.946873188018798828e-01
5.295574665069580078e-04
6.833797693252563477e-02
5.525833964347839355e-01
1.201006770133972168e-02
2.077217491575295192e-23
6.786555051803588867e-03
4.015759825706481934e-01
1.528763771057128906e-02
2.074417471885681152e-02
2.088263630867004395e-02
6.314659118652343750e-02
9.639620780944824219e-03
8.658190965652465820e-01
5.724132061004638672e-04
9.834303259849548340e-01
4.488646984100341797e-03
4.125943779945373535e-02
2.531297802925109863e-01
9.958066940307617188e-01
1.000000000000000000e+00
1.907933056354522705e-01
3.386008143424987793e-01
4.071739315986633301e-02
7.520186305046081543e-01
2.195626497268676758e-03
1.329017877578735352e-01
5.895170569419860840e-02
1.017187237739562988e-01
3.932017087936401367e-02
2.492725849151611328e-03
1.187860965728759766e-03
8.190321922302246094e-02
3.178557753562927246e-02
5.903512239456176758e-03
4.101859033107757568e-01
9.022995233535766602e-01
2.837781310081481934e-01
8.543202280998229980e-01
9.688593745231628418e-01
2.239943444728851318e-01
2.706533074378967285e-01
8.031945228576660156e-01
1.680850982666015625e-03
3.017214536666870117e-01
1.397317647933959961e-02
6.220197677612304688e-02
8.633605241775512695e-01
1.517269015312194824e-02
3.927946090698242188e-03
9.748339653015136719e-03
7.580724358558654785e-02
1.606114804744720459e-01
1.555016636848449707e-02
5.897361040115356445e-02
9.985864162445068359e-01
9.836047887802124023e-03
3.678897023200988770e-02
4.306223988533020020e-02
6.211559772491455078e-01
9.945338964462280273e-02
2.752193808555603027e-02
9.437608718872070312e-01
2.740235328674316406e-01
2.208051085472106934e-02
1.426500976085662842e-01
8.972764015197753906e-02
9.960969686508178711e-01
2.145588397979736328e-03
1.751266121864318848e-01
9.980785846710205078e-01
5.020391941070556641e-02
3.960778713226318359e-01
2.360168099403381348e-01
6.517469882965087891e-04
2.709231376647949219e-01
1.936048269271850586e-03
2.494990825653076172e-02
4.840210974216461182e-01
7.847869396209716797e-01
1.500684022903442383e-01
2.809274196624755859e-02
1.000000000000000000e+00
5.602914094924926758e-02
2.065850794315338135e-01
8.031687736511230469e-01
4.919399023056030273e-01
1.143628358840942383e-02
2.545636594295501709e-01
6.200671195983886719e-04
2.342820167541503906e-01
6.968975067138671875e-04
4.251208007335662842e-01
7.778751850128173828e-02
2.307952344417572021e-01
2.381996214389801025e-01
6.146335601806640625e-02
1.701977849006652832e-02
6.685622930526733398e-01
9.031426906585693359e-01
2.593329548835754395e-02
4.616424441337585449e-02
8.004207611083984375e-01
6.373822689056396484e-02
3.704168796539306641e-01
7.513195276260375977e-01
2.139726281166076660e-02
4.718289375305175781e-01
1.735003888607025146e-01
4.982510209083557129e-02
1.323896050453186035e-01
6.598149538040161133e-01
4.046857357025146484e-04
8.875029087066650391e-01
1.617945134639739990e-01
6.655361056327819824e-01
1.989840567111968994e-01
2.588444948196411133e-01
3.701462745666503906e-01
1.356310258415760472e-05
3.439410328865051270e-01
5.183607339859008789e-03
5.254805088043212891e-03
4.800733923912048340e-02
8.295190334320068359e-02
4.317086935043334961e-02
3.618451654911041260e-01
3.842803835868835449e-02
1.000000000000000000e+00
9.391571283340454102e-01
9.914194941520690918e-01
2.935398817062377930e-01
1.450043320655822754e-01
9.278959035873413086e-01
1.493872404098510742e-01
2.428120374679565430e-02
1.022172570228576660e-01
4.146842360496520996e-01
4.699277579784393311e-01
3.695662915706634521e-01
7.813639640808105469e-01
2.600044012069702148e-01
8.145393133163452148e-01
4.615117311477661133e-01
3.081309795379638672e-02
9.997541308403015137e-01
8.843863010406494141e-01
8.832073211669921875e-02
3.229796886444091797e-02
5.551362633705139160e-01
2.442811131477355957e-01
1.000000000000000000e+00
6.406873464584350586e-03
2.072514593601226807e-01
9.559214115142822266e-01
9.691487550735473633e-01
1.222485899925231934e-01
1.681395173072814941e-01
2.122474610805511475e-01
3.018572032451629639e-01
1.000000000000000000e+00
1.059002578258514404e-01
2.946236600109841675e-05
4.490733146667480469e-03
1.195152699947357178e-01
3.341126441955566406e-02
1.311006546020507812e-01
9.701337814331054688e-01
2.253316640853881836e-01
9.876989126205444336e-01
9.106147289276123047e-01
2.265843152999877930e-01
5.032688379287719727e-02
7.530242204666137695e-02
6.994840502738952637e-02
3.864923119544982910e-01
1.304876804351806641e-01
1.303106546401977539e-03
1.686912775039672852e-01
9.999998807907104492e-01
1.783420443534851074e-01
5.711996555328369141e-01
2.630198895931243896e-01
9.920632839202880859e-02
7.556968927383422852e-01
9.344240427017211914e-01
1.258174479007720947e-01
6.958919763565063477e-01
2.369442582130432129e-02
9.989190101623535156e-01
2.348938584327697754e-02
9.542332887649536133e-01
2.849280834197998047e-02
1.141961216926574707e-01
5.468863844871520996e-01
6.267390251159667969e-01
9.963470697402954102e-02
3.560404777526855469e-01
1.330089569091796875e-01
2.866983413696289062e-04
8.706381320953369141e-01
3.359481096267700195e-01
7.579742670059204102e-01
1.506537199020385742e-03
1.068977415561676025e-01
3.696209192276000977e-02
3.026081323623657227e-01
1.274926364421844482e-01
2.478682994842529297e-02
1.449904441833496094e-01
2.078641057014465332e-01
9.407475590705871582e-02
1.000000000000000000e+00
7.685511112213134766e-01
4.755804538726806641e-01
1.259404718875885010e-01
6.637752056121826172e-03
6.344428658485412598e-02
2.228763699531555176e-01
1.323900222778320312e-01
1.637446880340576172e-02
2.278634905815124512e-02
8.372148871421813965e-02
4.908902347087860107e-01
2.839012444019317627e-01
9.620429873466491699e-01
4.186636507511138916e-01
2.906620502471923828e-03
9.980911612510681152e-01
2.986823320388793945e-01
3.978286981582641602e-01
2.618226408958435059e-02
4.724231958389282227e-01
5.504173636436462402e-01
4.962894672644324601e-05
4.471102952957153320e-01
1.293151080608367920e-01
3.896662592887878418e-02
3.851962089538574219e-02
1.293037235736846924e-01
4.491299390792846680e-03
3.767002522945404053e-01
3.211303192074410617e-05
1.278375983238220215e-01
1.225262880325317383e-03
4.418829083442687988e-02
4.172500967979431152e-02
9.143141508102416992e-01
7.724463939666748047e-02
1.328980922698974609e-01
1.381359994411468506e-01
9.460129141807556152e-01
4.268437623977661133e-03
1.906608275703547406e-07
4.512194395065307617e-01
5.944976210594177246e-02
7.386062145233154297e-01
3.065562248229980469e-02
4.569339752197265625e-01
1.552729010581970215e-01
8.700254559516906738e-02
1.980404257774353027e-01
2.969349566228629556e-07
1.000000000000000000e+00
1.878338158130645752e-01
6.505063772201538086e-01
7.482933998107910156e-01
3.750592470169067383e-01
1.994286477565765381e-01
2.069347202777862549e-01
3.374516963958740234e-04
1.022875308990478516e-03
5.141198635101318359e-04
1.846650242805480957e-02
9.920236468315124512e-01
3.008514642715454102e-03
9.013341665267944336e-01
2.425108551979064941e-01
2.171531915664672852e-01
1.712047457695007324e-01
8.791255950927734375e-02
5.023354887962341309e-01
3.793454170227050781e-02
1.326915621757507324e-02
8.678482174873352051e-01
2.885884046554565430e-01
8.528062701225280762e-02
2.559208869934082031e-01
9.333763718605041504e-01
2.801080942153930664e-01
1.503933072090148926e-01
1.349371075630187988e-01
3.322901129722595215e-01
4.683288931846618652e-02
5.761891657130036037e-07
6.235003471374511719e-02
1.397812366485595703e-01
6.927055120468139648e-02
5.214112997055053711e-02
3.495942354202270508e-01
9.356141090393066406e-04
7.978945970535278320e-02
2.176721394062042236e-01
1.356445848941802979e-01
1.139352917671203613e-01
3.713250160217285156e-03
8.489638566970825195e-03
2.605148851871490479e-01
2.581996321678161621e-01
3.873741626739501953e-02
9.934942126274108887e-01
6.807944178581237793e-02
8.975967764854431152e-02
1.993730664253234863e-01
1.796901226043701172e-03
3.564492464065551758e-01
4.303531944751739502e-01
6.766736507415771484e-02
7.082882523536682129e-02
1.283288002014160156e-04
9.533395171165466309e-01
1.089823246002197266e-02
3.830766081809997559e-01
