0.000000000000000000e+00
3.494758121534412027e-03
3.494758121534412027e-03
3.494758121534412027e-03
3.494758121534412027e-03
3.494758121534412027e-03
3.494758121534412027e-03
3.494758121534412027e-03
3.494758121534412027e-03
3.494758121534412027e-03
4.278419509283787336e-03
4.278419509283787336e-03
4.938251445305198370e-03
4.938251445305198370e-03
4.938251445305198370e-03
4.938251445305198370e-03
4.938251445305198370e-03
5.518849141528239799e-03
5.518849141528239799e-03
6.043093498125314683e-03
6.043093498125314683e-03
6.524582505990039923e-03
6.524582505990039923e-03
6.972179673395361398e-03
6.972179673395361398e-03
7.392044141439698887e-03
7.392044141439698887e-03
7.788662173321414528e-03
7.788662173321414528e-03
8.165421910808535327e-03
8.165421910808535327e-03
8.524956667523049189e-03
8.524956667523049189e-03
8.869361423181978260e-03
8.869361423181978260e-03
9.200335461121020297e-03
9.200335461121020297e-03
9.519279794687338786e-03
9.519279794687338786e-03
1.012558453843796780e-02
1.012558453843796780e-02
1.041478379363603227e-02
1.041478379363603227e-02
1.069569517897564319e-02
1.069569517897564319e-02
1.096895546190206940e-02
1.096895546190206940e-02
1.123512292585484088e-02
1.123512292585484088e-02
1.174809506420392870e-02
1.174809506420392870e-02
1.199572777626262132e-02
1.199572777626262132e-02
1.247504402325692527e-02
1.247504402325692527e-02
1.270732917011172143e-02
1.270732917011172143e-02
1.293505394512120196e-02
1.293505394512120196e-02
1.315845512053250878e-02
1.315845512053250878e-02
1.337774930342134141e-02
1.337774930342134141e-02
1.359313526606579191e-02
1.359313526606579191e-02
1.401290013684006533e-02
1.401290013684006533e-02
1.421760402431336903e-02
1.421760402431336903e-02
1.441905242412068119e-02
1.441905242412068119e-02
1.461737993270882316e-02
1.461737993270882316e-02
1.481271190751464253e-02
1.481271190751464253e-02
1.500516533341578543e-02
1.500516533341578543e-02
1.519484958732757879e-02
1.519484958732757879e-02
1.538186711521473925e-02
1.538186711521473925e-02
1.556631403348235007e-02
1.556631403348235007e-02
1.574828066482508726e-02
1.574828066482508726e-02
1.592785201706329798e-02
1.592785201706329798e-02
1.628012487197019742e-02
1.628012487197019742e-02
1.645297346491066126e-02
1.645297346491066126e-02
1.662372161994465566e-02
1.662372161994465566e-02
1.679243340996252817e-02
1.679243340996252817e-02
1.695916960906062448e-02
1.695916960906062448e-02
1.712398792629785116e-02
1.712398792629785116e-02
1.760747104313444694e-02
1.760747104313444694e-02
1.807551776856988757e-02
1.807551776856988757e-02
1.852929790092429363e-02
1.852929790092429363e-02
1.867756825913909416e-02
1.867756825913909416e-02
1.882440294189040297e-02
1.882440294189040297e-02
1.896983528744394451e-02
1.896983528744394451e-02
1.911389730581139826e-02
1.911389730581139826e-02
1.925661975196333101e-02
1.925661975196333101e-02
1.939803219392507647e-02
1.939803219392507647e-02
1.953816307618637393e-02
1.953816307618637393e-02
1.967703977881329197e-02
1.967703977881329197e-02
1.981468867261351047e-02
1.981468867261351047e-02
1.995113517067249528e-02
1.995113517067249528e-02
2.008640377654848444e-02
2.008640377654848444e-02
2.048537456148473435e-02
2.048537456148473435e-02
2.061615996448949370e-02
2.061615996448949370e-02
2.074587783413279693e-02
2.074587783413279693e-02
2.087454807190696621e-02
2.087454807190696621e-02
2.100218993281882662e-02
2.100218993281882662e-02
2.112882205453696371e-02
2.112882205453696371e-02
2.186838279608417646e-02
2.186838279608417646e-02
2.198842214088830155e-02
2.198842214088830155e-02
2.234331718113746409e-02
2.234331718113746409e-02
2.245992037981760919e-02
2.245992037981760919e-02
2.257569797257284738e-02
2.257569797257284738e-02
2.269066259720421697e-02
2.269066259720421697e-02
2.280482654881954216e-02
2.280482654881954216e-02
2.314263244334980110e-02
2.314263244334980110e-02
2.347364460254250731e-02
2.347364460254250731e-02
2.358252188464585175e-02
2.358252188464585175e-02
2.369068594666219607e-02
2.369068594666219607e-02
2.401099488142055538e-02
2.401099488142055538e-02
2.432522110485483419e-02
2.432522110485483419e-02
2.453144158464743221e-02
2.453144158464743221e-02
2.483603939599026214e-02
2.483603939599026214e-02
2.493634077216923262e-02
2.493634077216923262e-02
2.503603890399933030e-02
2.503603890399933030e-02
2.513514096975856885e-02
2.513514096975856885e-02
2.552572679749590817e-02
2.552572679749590817e-02
2.562195092998804588e-02
2.562195092998804588e-02
2.590731132779230256e-02
2.590731132779230256e-02
2.600134765419798849e-02
2.600134765419798849e-02
2.618782967417956214e-02
2.618782967417956214e-02
2.628028665471325576e-02
2.628028665471325576e-02
2.637222828913417944e-02
2.637222828913417944e-02
2.646365994878198402e-02
2.646365994878198402e-02
2.664501431406321452e-02
2.664501431406321452e-02
2.673494725556683008e-02
2.673494725556683008e-02
2.682439069931499137e-02
2.682439069931499137e-02
2.691334952567781685e-02
2.691334952567781685e-02
2.726443314285147829e-02
2.726443314285147829e-02
2.735103899770666147e-02
2.735103899770666147e-02
2.752288352573042940e-02
2.752288352573042940e-02
2.760813070880974857e-02
2.760813070880974857e-02
2.794471475238956976e-02
2.794471475238956976e-02
2.827443931670624647e-02
2.827443931670624647e-02
2.851737452454180394e-02
2.851737452454180394e-02
2.867730886706108817e-02
2.867730886706108817e-02
2.891424380836274052e-02
2.891424380836274052e-02
2.899244398231171083e-02
2.899244398231171083e-02
2.922475381013665829e-02
2.922475381013665829e-02
2.945369067690763176e-02
2.945369067690763176e-02
2.952926701157244233e-02
2.952926701157244233e-02
3.012102694743320347e-02
3.012102694743320347e-02
3.033721891876103860e-02
3.033721891876103860e-02
3.047966781283280996e-02
3.047966781283280996e-02
3.055039559668438348e-02
3.055039559668438348e-02
3.076061967085897894e-02
3.076061967085897894e-02
3.089915851336460378e-02
3.089915851336460378e-02
3.096795127206197068e-02
3.096795127206197068e-02
3.110459400649840528e-02
3.110459400649840528e-02
3.123999342686208797e-02
3.123999342686208797e-02
3.144079644091718473e-02
3.144079644091718473e-02
3.157315708862473008e-02
3.157315708862473008e-02
3.163889069484326910e-02
3.163889069484326910e-02
3.170432896195335415e-02
3.170432896195335415e-02
3.183432675577626408e-02
3.183432675577626408e-02
3.202715328622057767e-02
3.202715328622057767e-02
3.215427777741775711e-02
3.215427777741775711e-02
3.221741714161535652e-02
3.221741714161535652e-02
3.228027679306065545e-02
3.228027679306065545e-02
3.240516346150527915e-02
3.240516346150527915e-02
3.246719368127438943e-02
3.246719368127438943e-02
3.252895059448030618e-02
3.252895059448030618e-02
3.259043575482147709e-02
3.259043575482147709e-02
3.307271440487113967e-02
3.307271440487113967e-02
3.313182074757469592e-02
3.313182074757469592e-02
3.319066990379856974e-02
3.319066990379856974e-02
3.330760210373402697e-02
3.330760210373402697e-02
3.342352174471463488e-02
3.342352174471463488e-02
3.353843932593097987e-02
3.353843932593097987e-02
3.370895922964155939e-02
3.370895922964155939e-02
3.393290582356755375e-02
3.393290582356755375e-02
3.420746094521706637e-02
3.420746094521706637e-02
3.431563931628368869e-02
3.431563931628368869e-02
3.436938073887876866e-02
3.436938073887876866e-02
3.442289176889408442e-02
3.442289176889408442e-02
3.463465325178571863e-02
3.463465325178571863e-02
3.468702818895938456e-02
3.468702818895938456e-02
3.473917900529810421e-02
3.473917900529810421e-02
3.489429675641973760e-02
3.489429675641973760e-02
3.494556106555686548e-02
3.494556106555686548e-02
3.499660619143364626e-02
3.499660619143364626e-02
3.519861387253336860e-02
3.519861387253336860e-02
3.529832706211298576e-02
3.529832706211298576e-02
3.534786419017946213e-02
3.534786419017946213e-02
3.554390365736098678e-02
3.554390365736098678e-02
3.559239061904216628e-02
3.559239061904216628e-02
3.573661016834330656e-02
3.573661016834330656e-02
3.587898514035813696e-02
3.587898514035813696e-02
3.606598681014287766e-02
3.606598681014287766e-02
3.611223682821189385e-02
3.611223682821189385e-02
3.615828822766055384e-02
3.615828822766055384e-02
3.634052269200211543e-02
3.634052269200211543e-02
3.647514948626732340e-02
3.647514948626732340e-02
3.651963863765980700e-02
3.651963863765980700e-02
3.669568173023331215e-02
3.669568173023331215e-02
3.673921756349110557e-02
3.673921756349110557e-02
3.678256477434298233e-02
3.678256477434298233e-02
3.682572402886588603e-02
3.682572402886588603e-02
3.703872385303245973e-02
3.703872385303245973e-02
3.716430961757249962e-02
3.716430961757249962e-02
3.720580627072189728e-02
3.720580627072189728e-02
3.724712130928289205e-02
3.724712130928289205e-02
3.732920895206696954e-02
3.732920895206696954e-02
3.741057731212812237e-02
3.741057731212812237e-02
3.745099322784255919e-02
3.745099322784255919e-02
3.765041312431533643e-02
3.765041312431533643e-02
3.784545137618994248e-02
3.784545137618994248e-02
3.788393921130026737e-02
3.788393921130026737e-02
3.792225501118939857e-02
3.792225501118939857e-02
3.811127156142062045e-02
3.811127156142062045e-02
3.814856593658574185e-02
3.814856593658574185e-02
3.818569183186237836e-02
3.818569183186237836e-02
3.836881114956987304e-02
3.836881114956987304e-02
3.840493633262245798e-02
3.840493633262245798e-02
3.844089638736929160e-02
3.844089638736929160e-02
3.851232296004179767e-02
3.851232296004179767e-02
3.861823580740819661e-02
3.861823580740819661e-02
3.865321468196089572e-02
3.865321468196089572e-02
3.875718124929587727e-02
3.875718124929587727e-02
3.879151486401300614e-02
3.879151486401300614e-02
3.882568823819304571e-02
3.882568823819304571e-02
3.899416617707320010e-02
3.899416617707320010e-02
3.902738686603441504e-02
3.902738686603441504e-02
3.909335658515004919e-02
3.909335658515004919e-02
3.925554794649423196e-02
3.925554794649423196e-02
3.928752081370645577e-02
3.928752081370645577e-02
3.953778188871599764e-02
3.953778188871599764e-02
3.959882661936130199e-02
3.959882661936130199e-02
3.965926879383675774e-02
3.965926879383675774e-02
3.977835643371780555e-02
3.977835643371780555e-02
3.980775599139002585e-02
3.980775599139002585e-02
3.989506629394157927e-02
3.989506629394157927e-02
3.995253608514153648e-02
3.995253608514153648e-02
3.998105081358145629e-02
3.998105081358145629e-02
4.000941918288838939e-02
4.000941918288838939e-02
4.003764150416731782e-02
4.003764150416731782e-02
4.017657310660882608e-02
4.017657310660882608e-02
4.025819887002340253e-02
4.025819887002340253e-02
4.039137844197435157e-02
4.039137844197435157e-02
4.041758740561372798e-02
4.041758740561372798e-02
4.044365470142764762e-02
4.044365470142764762e-02
4.052100930854833638e-02
4.052100930854833638e-02
4.057187566839219606e-02
4.057187566839219606e-02
4.064712542210537766e-02
4.064712542210537766e-02
4.069659508670071812e-02
4.069659508670071812e-02
4.079387111852562225e-02
4.079387111852562225e-02
4.084168144736916722e-02
4.084168144736916722e-02
4.093565639779542936e-02
4.093565639779542936e-02
4.098182479313069310e-02
4.098182479313069310e-02
4.100470503135562883e-02
4.100470503135562883e-02
4.102744960038767763e-02
4.102744960038767763e-02
4.109487153825225336e-02
4.109487153825225336e-02
4.113914523644648241e-02
4.113914523644648241e-02
4.118288155904607784e-02
4.118288155904607784e-02
4.120454874006366369e-02
4.120454874006366369e-02
4.122608221633963788e-02
4.122608221633963788e-02
4.124748219727790433e-02
4.124748219727790433e-02
4.128988250211220595e-02
4.128988250211220595e-02
4.133175129537463438e-02
4.133175129537463438e-02
4.135248688048050875e-02
4.135248688048050875e-02
4.149394322513300787e-02
4.149394322513300787e-02
4.161008273173617128e-02
4.161008273173617128e-02
4.164775531159367605e-02
4.164775531159367605e-02
4.166639729177432083e-02
4.166639729177432083e-02
4.172154807341492411e-02
4.172154807341492411e-02
4.179328007603801132e-02
4.179328007603801132e-02
4.181089233271336608e-02
4.181089233271336608e-02
4.182837661769331361e-02
4.182837661769331361e-02
4.193060380473777327e-02
4.193060380473777327e-02
4.194719669936811113e-02
4.194719669936811113e-02
4.205980682601364457e-02
4.205980682601364457e-02
4.212138660743987295e-02
4.212138660743987295e-02
4.213646830575620839e-02
4.213646830575620839e-02
4.215142497592254400e-02
4.215142497592254400e-02
4.218096376268844899e-02
4.218096376268844899e-02
4.219554614149241545e-02
4.219554614149241545e-02
4.221000401656748585e-02
4.221000401656748585e-02
4.226659301836911686e-02
4.226659301836911686e-02
4.228043026781448666e-02
4.228043026781448666e-02
4.230773362098732421e-02
4.230773362098732421e-02
4.232119996415795865e-02
4.232119996415795865e-02
4.233454290928764102e-02
4.233454290928764102e-02
4.238668302390620479e-02
4.238668302390620479e-02
4.244909534828966713e-02
4.244909534828966713e-02
4.246121052823097208e-02
4.246121052823097208e-02
4.247320352678342348e-02
4.247320352678342348e-02
4.248507444741779493e-02
4.248507444741779493e-02
4.264855573004228129e-02
4.264855573004228129e-02
4.267798674921806368e-02
4.267798674921806368e-02
4.268755632120717347e-02
4.268755632120717347e-02
4.269700564508343427e-02
4.269700564508343427e-02
4.270633480066612919e-02
4.270633480066612919e-02
4.271554386669023512e-02
4.271554386669023512e-02
4.272463292080971864e-02
4.272463292080971864e-02
4.273360203960094306e-02
4.273360203960094306e-02
4.277665120878412081e-02
4.277665120878412081e-02
4.280104615422799380e-02
4.280104615422799380e-02
4.281671286721098341e-02
4.281671286721098341e-02
4.284661683855394559e-02
4.284661683855394559e-02
4.286085509424284595e-02
4.286085509424284595e-02
4.289437280563286603e-02
4.289437280563286603e-02
4.291306078362354393e-02
4.291306078362354393e-02
4.293068349422782259e-02
4.293068349422782259e-02
4.293632123400415584e-02
4.293632123400415584e-02
4.294184080367161732e-02
4.294184080367161732e-02
4.295769094264977050e-02
4.295769094264977050e-02
4.296273827752941643e-02
4.296273827752941643e-02
4.296766766014904759e-02
4.296766766014904759e-02
4.298620646502340770e-02
4.298620646502340770e-02
4.300286110339883450e-02
4.300286110339883450e-02
4.300673062393819274e-02
4.300673062393819274e-02
4.301048255381476060e-02
4.301048255381476060e-02
4.301411692379925739e-02
4.301411692379925739e-02
4.302431496749924839e-02
4.302431496749924839e-02
4.303052638417713405e-02
4.303052638417713405e-02
4.303626821713454897e-02
4.303626821713454897e-02
4.303896309905026751e-02
4.303896309905026751e-02
4.305067801575807040e-02
4.305067801575807040e-02
4.305266923458098138e-02
4.305266923458098138e-02
4.305454323875990141e-02
4.305454323875990141e-02
4.305946211168659027e-02
4.305946211168659027e-02
4.306086740074775709e-02
4.306086740074775709e-02
4.306215554210028607e-02
4.306215554210028607e-02
4.306531718024732280e-02
4.306531718024732280e-02
4.306613682632283446e-02
4.306613682632283446e-02
4.306683936768594678e-02
4.306683936768594678e-02
4.306742481006749224e-02
4.306742481006749224e-02
4.306789315824283843e-02
4.306789315824283843e-02
4.306847858629990478e-02
4.306847858629990478e-02
4.306859567095638885e-02
4.306859567095638885e-02
4.306847858629989784e-02
4.306847858629989784e-02
4.306824441603200604e-02
4.306824441603200604e-02
4.306332654625678880e-02
4.306332654625678880e-02
4.305793966344668294e-02
4.305793966344668294e-02
4.305454323875990141e-02
4.305454323875990141e-02
4.304634386815796299e-02
4.304634386815796299e-02
4.303626821713455591e-02
4.303626821713455591e-02
4.301411692379925739e-02
4.301411692379925739e-02
4.301048255381476060e-02
4.301048255381476060e-02
4.300673062393819274e-02
4.300673062393819274e-02
4.299476916236924517e-02
4.299476916236924517e-02
4.299054667545405828e-02
4.299054667545405828e-02
4.296766766014904759e-02
4.296766766014904759e-02
4.296273827752941643e-02
4.296273827752941643e-02
4.294724224879178931e-02
4.294724224879178931e-02
4.294184080367162426e-02
4.294184080367162426e-02
4.292492753778139741e-02
4.292492753778139741e-02
4.291905331710209326e-02
4.291905331710209326e-02
4.288790651515099472e-02
4.288790651515099472e-02
4.288132165391238260e-02
4.288132165391238260e-02
4.287461816728526526e-02
4.287461816728526526e-02
4.286085509424284595e-02
4.286085509424284595e-02
4.284661683855394559e-02
4.284661683855394559e-02
4.283931936977190824e-02
4.283931936977190824e-02
4.280893912478617169e-02
4.280893912478617169e-02
4.275118077213578560e-02
4.275118077213578560e-02
4.274245129856597825e-02
4.274245129856597825e-02
4.270633480066612919e-02
4.270633480066612919e-02
4.268755632120718041e-02
4.268755632120718041e-02
4.264855573004228129e-02
4.264855573004228129e-02
4.263850434559961905e-02
4.263850434559961905e-02
4.262833229755958603e-02
4.262833229755958603e-02
4.261803949952244763e-02
4.261803949952244763e-02
4.258643572476374095e-02
4.258643572476374095e-02
4.256476115750052608e-02
4.256476115750052608e-02
4.250845046297864471e-02
4.250845046297864471e-02
4.249682339243660012e-02
4.249682339243660012e-02
4.246121052823097208e-02
4.246121052823097208e-02
4.244909534828966019e-02
4.244909534828966019e-02
4.242449802448820112e-02
4.242449802448820112e-02
4.234776257301721414e-02
4.234776257301721414e-02
4.230773362098732421e-02
4.230773362098732421e-02
4.229414376190689107e-02
4.229414376190689107e-02
4.222433751580621786e-02
4.222433751580621786e-02
4.216625675098403803e-02
4.216625675098403803e-02
4.210617974662488050e-02
4.210617974662488050e-02
4.209084758765260087e-02
4.209084758765260087e-02
4.207538999354810266e-02
4.207538999354810266e-02
4.186296191276995399e-02
4.186296191276995399e-02
4.182837661769331361e-02
4.182837661769331361e-02
4.179328007603801132e-02
4.179328007603801132e-02
4.175767099872447485e-02
4.175767099872447485e-02
4.170329350123231499e-02
4.170329350123231499e-02
4.168490996425237849e-02
4.168490996425237849e-02
4.162898384999361157e-02
4.162898384999361157e-02
4.159105178005333137e-02
4.159105178005333137e-02
4.147412947394082255e-02
4.147412947394082255e-02
4.143410843898109874e-02
4.143410843898109874e-02
4.141390077491659966e-02
4.141390077491659966e-02
4.137309019070452981e-02
4.137309019070452981e-02
4.135248688048050875e-02
4.135248688048050875e-02
4.133175129537463438e-02
4.133175129537463438e-02
4.131088323620474984e-02
4.131088323620474984e-02
4.128988250211220595e-02
4.128988250211220595e-02
4.126874889055118928e-02
4.126874889055118928e-02
4.116108046214048133e-02
4.116108046214048133e-02
4.113914523644648241e-02
4.113914523644648241e-02
4.111707566729815022e-02
4.111707566729815022e-02
4.105005872573715825e-02
4.105005872573715825e-02
4.100470503135562883e-02
4.100470503135562883e-02
4.098182479313069310e-02
4.098182479313069310e-02
4.095880865835200418e-02
4.095880865835200418e-02
4.093565639779542936e-02
4.093565639779542936e-02
4.086538054099707329e-02
4.086538054099707329e-02
4.081784505343838410e-02
4.081784505343838410e-02
4.069659508670071812e-02
4.069659508670071812e-02
4.044365470142764762e-02
4.044365470142764762e-02
4.036502753455525894e-02
4.036502753455525894e-02
4.023113402617696510e-02
4.023113402617696510e-02
4.017657310660882608e-02
4.017657310660882608e-02
4.006571808604727364e-02
4.006571808604727364e-02
4.003764150416732476e-02
4.003764150416732476e-02
3.995253608514153648e-02
3.995253608514153648e-02
3.992387468396748490e-02
3.992387468396748490e-02
3.989506629394157233e-02
3.989506629394157233e-02
3.971911116294456201e-02
3.971911116294456201e-02
3.965926879383675774e-02
3.965926879383675774e-02
3.941387353231794871e-02
3.941387353231794871e-02
3.935100417923267230e-02
3.935100417923267230e-02
3.919113795712538678e-02
3.919113795712538678e-02
3.915870007134138187e-02
3.915870007134138187e-02
3.909335658515005613e-02
3.909335658515005613e-02
3.896078773291851427e-02
3.896078773291851427e-02
3.892725112776545399e-02
3.892725112776545399e-02
3.882568823819304571e-02
3.882568823819304571e-02
3.879151486401301308e-02
3.879151486401301308e-02
3.875718124929587727e-02
3.875718124929587727e-02
3.872268696780804820e-02
3.872268696780804820e-02
3.854779039245942451e-02
3.854779039245942451e-02
3.847669177679374081e-02
3.847669177679374081e-02
3.829606352719885920e-02
3.829606352719885920e-02
3.811127156142062045e-02
3.811127156142062045e-02
3.796039929679500408e-02
3.796039929679500408e-02
3.792225501118939857e-02
3.792225501118939857e-02
3.788393921130026737e-02
3.788393921130026737e-02
3.780679098045575115e-02
3.780679098045575115e-02
3.776795749418325465e-02
3.776795749418325465e-02
3.772895038289886260e-02
3.772895038289886260e-02
3.768976910752182274e-02
3.768976910752182274e-02
3.765041312431533643e-02
3.765041312431533643e-02
3.741057731212812237e-02
3.741057731212812237e-02
3.736998274781207219e-02
3.736998274781207219e-02
3.724712130928289205e-02
3.724712130928289205e-02
3.720580627072189728e-02
3.720580627072189728e-02
3.708076902592696844e-02
3.708076902592696844e-02
3.691148130329971466e-02
3.691148130329971466e-02
3.656393574377916900e-02
3.656393574377916900e-02
3.651963863765980700e-02
3.651963863765980700e-02
3.647514948626732340e-02
3.647514948626732340e-02
3.643046758602048324e-02
3.643046758602048324e-02
3.624979819531068403e-02
3.624979819531068403e-02
3.620414176641310877e-02
3.620414176641310877e-02
3.611223682821189385e-02
3.611223682821189385e-02
3.592603735688791600e-02
3.592603735688791600e-02
3.573661016834329962e-02
3.573661016834329962e-02
3.568874303668692627e-02
3.568874303668692627e-02
3.564067013151479141e-02
3.564067013151479141e-02
3.559239061904216628e-02
3.559239061904216628e-02
3.519861387253337554e-02
3.519861387253337554e-02
3.514843599841923488e-02
3.514843599841923488e-02
3.504743309174396249e-02
3.504743309174396249e-02
3.494556106555686548e-02
3.494556106555686548e-02
3.484281229656778500e-02
3.484281229656778500e-02
3.452922693113349983e-02
3.452922693113349983e-02
3.447617347911787616e-02
3.447617347911787616e-02
3.442289176889408442e-02
3.442289176889408442e-02
3.436938073887877559e-02
3.436938073887877559e-02
3.431563931628369563e-02
3.431563931628369563e-02
3.415302179369437974e-02
3.415302179369437974e-02
3.404343796233476327e-02
3.404343796233476327e-02
3.398829100775876966e-02
3.398829100775876966e-02
3.387728124133287250e-02
3.387728124133287250e-02
3.370895922964155939e-02
3.370895922964155939e-02
3.359552556106837340e-02
3.359552556106837340e-02
3.336568783233630903e-02
3.336568783233630903e-02
3.313182074757468898e-02
3.313182074757468898e-02
3.307271440487113967e-02
3.307271440487113967e-02
3.295372461847702328e-02
3.295372461847702328e-02
3.283368929979790796e-02
3.283368929979790796e-02
3.271259693943460306e-02
3.271259693943460306e-02
3.265165069748238169e-02
3.265165069748238169e-02
3.246719368127439637e-02
3.246719368127439637e-02
3.234285836265278491e-02
3.234285836265278491e-02
3.202715328622058460e-02
3.196316479543770406e-02
3.183432675577626408e-02
3.183432675577626408e-02
3.176947371495975059e-02
3.176947371495975059e-02
3.163889069484326216e-02
3.163889069484326216e-02
3.150712629479174992e-02
3.150712629479174992e-02
3.137416563022311922e-02
3.137416563022311922e-02
3.130723194114109348e-02
3.130723194114109348e-02
3.123999342686208797e-02
3.123999342686208797e-02
3.103642907639063420e-02
3.103642907639063420e-02
3.089915851336460725e-02
3.089915851336460725e-02
3.083004869197435160e-02
3.083004869197435160e-02
3.076061967085897894e-02
3.076061967085897894e-02
3.069086928373343168e-02
3.069086928373343168e-02
3.062079533450164093e-02
3.062079533450164093e-02
3.019342995007401331e-02
3.019342995007401331e-02
2.997519162265166459e-02
2.997519162265166459e-02
2.967933263655129009e-02
2.967933263655129009e-02
2.952926701157244233e-02
2.952926701157244233e-02
2.945369067690763176e-02
2.945369067690763176e-02
2.930143694432295678e-02
2.930143694432295678e-02
2.922475381013665829e-02
2.922475381013665829e-02
2.899244398231171083e-02
2.899244398231171083e-02
2.883565668788648853e-02
2.883565668788648853e-02
2.827443931670624300e-02
2.827443931670624300e-02
2.811041926568799004e-02
2.811041926568799004e-02
2.794471475238956976e-02
2.794471475238956976e-02
2.760813070880974163e-02
2.743718769439339178e-02
2.735103899770666147e-02
2.735103899770666147e-02
2.682439069931498443e-02
2.682439069931498443e-02
2.673494725556682661e-02
2.673494725556682661e-02
2.655458690142959571e-02
2.655458690142959571e-02
2.646365994878199096e-02
2.646365994878199096e-02
2.637222828913417944e-02
2.637222828913417944e-02
2.628028665471325576e-02
2.628028665471325576e-02
2.618782967417955868e-02
2.618782967417955868e-02
2.590731132779230603e-02
2.590731132779230603e-02
2.571761896146840948e-02
2.571761896146840948e-02
2.523365399237598866e-02
2.523365399237598866e-02
2.493634077216923262e-02
2.493634077216923262e-02
2.483603939599026214e-02
2.483603939599026214e-02
2.453144158464742181e-02
2.453144158464742181e-02
2.442865216657271257e-02
2.442865216657271257e-02
2.379814651348301224e-02
2.379814651348301224e-02
2.358252188464585869e-02
2.358252188464585869e-02
2.347364460254251772e-02
2.347364460254251772e-02
2.336404412946087306e-02
2.336404412946087306e-02
2.303079997689304326e-02
2.303079997689304326e-02
2.280482654881953175e-02
2.280482654881953175e-02
2.269066259720422737e-02
2.269066259720422737e-02
2.257569797257285432e-02
2.257569797257285432e-02
2.245992037981761613e-02
2.245992037981761613e-02
2.234331718113746756e-02
2.234331718113746756e-02
2.222587538245294689e-02
2.222587538245294689e-02
2.150283766734188695e-02
2.150283766734188695e-02
2.137912870767229648e-02
2.137912870767229648e-02
2.087454807190695927e-02
2.087454807190695927e-02
2.008640377654848097e-02
2.008640377654848097e-02
1.995113517067248834e-02
1.995113517067248834e-02
1.967703977881329891e-02
1.967703977881329891e-02
1.939803219392507994e-02
1.939803219392507994e-02
1.925661975196333447e-02
1.925661975196333447e-02
1.896983528744394104e-02
1.896983528744394104e-02
1.867756825913908375e-02
1.867756825913908375e-02
1.852929790092430404e-02
1.852929790092430404e-02
1.837955712191793878e-02
1.837955712191793878e-02
1.792114186957070865e-02
1.792114186957070865e-02
1.776514069426201811e-02
1.776514069426201811e-02
1.712398792629785810e-02
1.712398792629785810e-02
1.628012487197019048e-02
1.628012487197019048e-02
1.610510821221267097e-02
1.610510821221267097e-02
1.592785201706330839e-02
1.592785201706330839e-02
1.556631403348235354e-02
1.556631403348235354e-02
1.500516533341578196e-02
1.500516533341578196e-02
1.481271190751463560e-02
1.481271190751463560e-02
1.461737993270880928e-02
1.461737993270880928e-02
1.421760402431337597e-02
1.421760402431337597e-02
1.359313526606579017e-02
1.359313526606579017e-02
1.247504402325693568e-02
1.247504402325693568e-02
1.223793882960173829e-02
1.223793882960173829e-02
1.199572777626262306e-02
1.199572777626262306e-02
1.174809506420392696e-02
1.174809506420392696e-02
1.149469029870731247e-02
1.149469029870731247e-02
1.123512292585482873e-02
1.123512292585482873e-02
1.069569517897565880e-02
1.069569517897565880e-02
1.041478379363604267e-02
1.041478379363604267e-02
1.012558453843797127e-02
1.012558453843797127e-02
9.519279794687335317e-03
9.519279794687335317e-03
8.869361423181962648e-03
8.869361423181962648e-03
7.392044141439706693e-03
7.392044141439706693e-03
6.972179673395362265e-03
6.972179673395362265e-03
6.524582505990033851e-03
6.524582505990033851e-03
5.518849141528212043e-03
5.518849141528212043e-03
4.938251445305156737e-03
4.938251445305156737e-03
0.000000000000000000e+00
