0.000000000000000000e+00
0.000000000000000000e+00
0.000000000000000000e+00
8.468293806901127513e-03
8.468293806901127513e-03
1.036108102468077420e-02
1.036108102468077420e-02
1.195190361406918422e-02
1.195190361406918422e-02
1.334915727677219235e-02
1.334915727677219235e-02
1.576299463934438885e-02
1.576299463934438885e-02
1.683425080008017771e-02
1.683425080008017771e-02
1.878297101099823257e-02
1.878297101099823257e-02
1.967963414294076480e-02
1.967963414294076480e-02
2.053367965075914015e-02
2.053367965075914015e-02
2.213341365447273404e-02
2.213341365447273404e-02
2.361287784239778087e-02
2.361287784239778087e-02
2.431444015394966518e-02
2.431444015394966518e-02
2.499343913910208673e-02
2.499343913910208673e-02
2.565166661252246683e-02
2.565166661252246683e-02
2.629068276024797146e-02
2.629068276024797146e-02
2.691185612327770885e-02
2.691185612327770885e-02
2.751639511273233293e-02
2.751639511273233293e-02
2.810537315176583895e-02
2.810537315176583895e-02
2.867974895287613707e-02
2.867974895287613707e-02
2.924038303442689363e-02
2.924038303442689363e-02
2.978805129577965019e-02
2.978805129577965019e-02
3.084723650507448581e-02
3.084723650507448581e-02
3.135997448978553731e-02
3.135997448978553731e-02
3.235441237296699662e-02
3.235441237296699662e-02
3.331053887285524012e-02
3.331053887285524012e-02
3.467979238692180805e-02
3.467979238692180805e-02
3.512025056858222166e-02
3.512025056858222166e-02
3.761478432744231465e-02
3.800799915807197282e-02
3.800799915807197282e-02
3.839531221386277560e-02
3.839531221386277560e-02
3.877690034027990451e-02
3.877690034027990451e-02
3.915293092477241388e-02
3.915293092477241388e-02
3.952356259245869141e-02
3.952356259245869141e-02
3.988894583716145331e-02
3.988894583716145331e-02
4.024922359499621960e-02
4.024922359499621960e-02
4.060453176678682080e-02
4.060453176678682080e-02
4.231084967239490124e-02
4.231084967239490124e-02
4.328242137404052226e-02
4.328242137404052226e-02
4.359816509900388271e-02
4.359816509900388271e-02
4.390999886130720481e-02
4.390999886130720481e-02
4.482285131492641517e-02
4.482285131492641517e-02
4.541330201603931138e-02
4.541330201603931138e-02
4.570330403811085490e-02
4.598991193729337623e-02
4.598991193729337623e-02
4.627318878140990882e-02
4.627318878140990882e-02
4.682999039077415104e-02
4.918536367660607256e-02
4.918536367660607256e-02
4.991985576902241428e-02
4.991985576902241428e-02
5.015942583403441846e-02
5.015942583403441846e-02
5.176647563819658515e-02
5.176647563819658515e-02
5.198645977559925718e-02
5.198645977559925718e-02
5.220413776703911046e-02
5.220413776703911046e-02
5.263268946196840437e-02
5.263268946196840437e-02
5.284361834696787996e-02
5.284361834696787996e-02
5.305235150302010927e-02
5.305235150302010927e-02
5.325891474673512260e-02
5.325891474673512260e-02
5.346333322941996397e-02
5.346333322941996397e-02
5.366563145999495715e-02
5.366563145999495715e-02
5.386583332688726911e-02
5.386583332688726911e-02
5.406396211895684450e-02
5.406396211895684450e-02
5.445409075542442107e-02
5.445409075542442107e-02
5.464613435550587373e-02
5.464613435550587373e-02
5.483619242799413207e-02
5.483619242799413207e-02
5.502428554738353350e-02
5.502428554738353350e-02
5.521043379652074146e-02
5.521043379652074146e-02
5.593596338671570634e-02
5.593596338671570634e-02
5.628754746833441319e-02
5.628754746833441319e-02
5.680133801240953850e-02
5.680133801240953850e-02
5.809475019311124977e-02
5.809475019311124977e-02
5.840130135536364397e-02
5.840130135536364397e-02
5.884895920914830214e-02
5.884895920914830214e-02
5.899498283752610539e-02
5.899498283752610539e-02
5.928230764739172987e-02
5.928230764739172987e-02
5.942363166283259890e-02
5.942363166283259890e-02
5.970165826842668139e-02
5.970165826842668139e-02
6.010730404867615367e-02
6.010730404867615367e-02
6.023952191045343907e-02
6.023952191045343907e-02
6.037025757771785628e-02
6.037025757771785628e-02
6.062732057414380038e-02
6.062732057414380038e-02
6.087856765726341879e-02
6.087856765726341879e-02
6.100203275301570305e-02
6.100203275301570305e-02
6.112407054508067761e-02
6.112407054508067761e-02
6.124468956570846417e-02
6.124468956570846417e-02
6.136389818125963236e-02
6.136389818125963236e-02
6.171314284656063964e-02
6.171314284656063964e-02
6.182679030970311684e-02
6.182679030970311684e-02
6.193906683184692563e-02
6.193906683184692563e-02
6.237461021922301174e-02
6.237461021922301174e-02
6.248014084491167186e-02
6.248014084491167186e-02
6.258434308994542672e-02
6.258434308994542672e-02
6.268722357865276484e-02
6.268722357865276484e-02
6.288904515096409298e-02
6.288904515096409298e-02
6.298799885692511757e-02
6.298799885692511757e-02
6.308565605587374003e-02
6.308565605587374003e-02
6.346343829324092856e-02
6.346343829324092856e-02
6.382093700346305742e-02
6.382093700346305742e-02
6.390718269490526515e-02
6.390718269490526515e-02
6.399218702310462137e-02
6.399218702310462137e-02
6.407595492850652608e-02
6.407595492850652608e-02
6.415849125408108755e-02
6.415849125408108755e-02
6.423980074688899478e-02
6.423980074688899478e-02
6.439875775199394026e-02
6.439875775199394026e-02
6.447641429235964616e-02
6.447641429235964616e-02
6.455286205893584484e-02
6.455286205893584484e-02
6.498639857693300215e-02
6.498639857693300215e-02
6.543852076567746590e-02
6.543852076567746590e-02
6.549845799711623284e-02
6.549845799711623284e-02
6.561487636199583862e-02
6.561487636199583862e-02
6.572670690061993559e-02
6.572670690061993559e-02
6.578090908462728981e-02
6.578090908462728981e-02
6.626075761715979895e-02
6.626075761715979895e-02
6.630257913535492209e-02
6.630257913535492209e-02
6.662918279552887402e-02
6.662918279552887402e-02
6.665997299729425896e-02
6.665997299729425896e-02
6.671827335895316735e-02
6.671827335895316735e-02
6.679754486506223055e-02
6.679754486506223055e-02
6.684495493303889424e-02
6.684495493303889424e-02
6.694451433836831611e-02
6.694451433836831611e-02
6.700471625191767311e-02
6.700471625191767311e-02
6.701707245172680572e-02
6.701707245172680572e-02
6.706271691484025355e-02
6.706271691484025355e-02
6.707720924427311437e-02
6.707720924427311437e-02
6.708203932499369471e-02
6.708203932499369471e-02
6.708150266653245541e-02
6.708150266653245541e-02
6.706862157521950585e-02
6.706862157521950585e-02
6.706271691484025355e-02
6.706271691484025355e-02
6.701707245172680572e-02
6.701707245172680572e-02
6.700471625191767311e-02
6.700471625191767311e-02
6.694451433836830223e-02
6.694451433836830223e-02
6.684495493303888036e-02
6.684495493303888036e-02
6.682179285233223742e-02
6.682179285233223742e-02
6.674578638386095830e-02
6.674578638386095830e-02
6.668966936490239306e-02
6.668966936490239306e-02
6.665997299729425896e-02
6.665997299729425896e-02
6.662918279552887402e-02
6.662918279552887402e-02
6.653023372873419217e-02
6.653023372873419217e-02
6.645876917307451393e-02
6.645876917307451393e-02
6.642138209944144223e-02
6.642138209944144223e-02
6.630257913535490821e-02
6.630257913535490821e-02
6.626075761715979895e-02
6.626075761715979895e-02
6.621782237434269136e-02
6.621782237434269136e-02
6.608231230821150215e-02
6.608231230821150215e-02
6.598636222735725088e-02
6.598636222735725088e-02
6.583397299267301772e-02
6.583397299267301772e-02
6.578090908462728981e-02
6.578090908462728981e-02
6.572670690061993559e-02
6.572670690061993559e-02
6.549845799711623284e-02
6.549845799711623284e-02
6.531517434716070658e-02
6.531517434716070658e-02
6.518717665308108866e-02
6.518717665308108866e-02
6.512142504583265379e-02
6.512142504583265379e-02
6.462810534125226769e-02
6.462810534125226769e-02
6.455286205893584484e-02
6.455286205893584484e-02
6.423980074688899478e-02
6.423980074688899478e-02
6.390718269490526515e-02
6.390718269490526515e-02
6.364470127198335048e-02
6.364470127198335048e-02
6.346343829324092856e-02
6.346343829324092856e-02
6.327710486423979153e-02
6.327710486423979153e-02
6.298799885692511757e-02
6.298799885692511757e-02
6.288904515096409298e-02
6.288904515096409298e-02
6.268722357865276484e-02
6.268722357865276484e-02
6.258434308994542672e-02
6.258434308994542672e-02
6.148170459575759417e-02
6.148170459575759417e-02
6.124468956570847111e-02
6.124468956570847111e-02
6.112407054508069149e-02
6.112407054508069149e-02
6.100203275301570305e-02
6.100203275301570305e-02
6.049952065925812139e-02
6.049952065925812139e-02
6.010730404867615367e-02
6.010730404867615367e-02
5.970165826842668139e-02
5.970165826842668139e-02
5.928230764739172987e-02
5.928230764739172987e-02
5.899498283752610539e-02
5.899498283752610539e-02
5.870134581080743708e-02
5.870134581080743708e-02
5.855213061879131764e-02
5.855213061879131764e-02
5.809475019311124977e-02
5.809475019311124977e-02
5.778158876320380749e-02
5.778158876320380749e-02
5.696904422578984856e-02
5.696904422578984856e-02
5.646060573532663690e-02
5.646060573532663690e-02
5.628754746833441319e-02
5.628754746833441319e-02
5.539465678203991245e-02
5.539465678203991245e-02
5.521043379652074146e-02
5.521043379652074146e-02
5.406396211895683757e-02
5.406396211895683757e-02
5.305235150302010233e-02
5.305235150302010233e-02
5.284361834696787996e-02
5.284361834696787996e-02
5.263268946196839049e-02
5.263268946196839049e-02
5.220413776703912434e-02
5.220413776703912434e-02
5.176647563819659209e-02
5.176647563819659209e-02
5.154415582779487554e-02
5.154415582779487554e-02
5.109238690842306946e-02
5.109238690842306946e-02
5.063089965623759903e-02
5.063089965623759903e-02
4.967768110530119963e-02
4.967768110530119963e-02
4.764166243950771623e-02
4.764166243950771623e-02
4.682999039077415798e-02
4.682999039077415798e-02
4.541330201603931138e-02
4.541330201603931138e-02
4.511984042524973260e-02
4.511984042524973260e-02
4.296268148055937958e-02
4.296268148055937958e-02
4.263885551934995521e-02
4.263885551934995521e-02
4.095499969478696295e-02
4.095499969478696295e-02
3.761478432744230771e-02
3.761478432744230771e-02
3.721548064985859272e-02
3.721548064985859272e-02
3.186220331364422731e-02
3.186220331364422731e-02
2.867974895287615095e-02
2.867974895287615095e-02
2.751639511273235028e-02
2.751639511273235028e-02
2.499343913910209714e-02
2.499343913910209714e-02
1.967963414294077520e-02
1.967963414294077520e-02
1.783726436424599993e-02
1.783726436424599993e-02
8.468293806901130982e-03
8.468293806901130982e-03
0.000000000000000000e+00
