0.000000000000000000e+00
1.033707889106008637e-01
1.037462288471248661e-01
1.044103443151108562e-01
1.046299192391927646e-01
1.047674567792881012e-01
1.047674567792881012e-01
1.049605640228748193e-01
1.050805405391502662e-01
1.057907368345641086e-01
1.057907368345641086e-01
1.058485710815219305e-01
1.058485710815219305e-01
1.059632955319906866e-01
1.059632955319906866e-01
1.060244311467880562e-01
1.060244311467880562e-01
1.060354657649976995e-01
1.060448018528018232e-01
1.057592549141681548e-01
1.057592549141681548e-01
1.057260611202365808e-01
1.057260611202365808e-01
1.056545313746646564e-01
1.056545313746646564e-01
1.054456257983232004e-01
1.054456257983232004e-01
1.049605640228747916e-01
1.049605640228747916e-01
1.046995701996908945e-01
1.046995701996908945e-01
1.046299192391927646e-01
1.046299192391927646e-01
1.044853099722635736e-01
1.044853099722635736e-01
1.042550718190726755e-01
1.042550718190726755e-01
1.040087496319420379e-01
1.040087496319420379e-01
1.036551011769319408e-01
1.036551011769319408e-01
1.032723583540145484e-01
1.032723583540145484e-01
1.028601963832463106e-01
1.028601963832463106e-01
1.026429734565401375e-01
1.025315561181044388e-01
1.019461622622450658e-01
1.019461622622450658e-01
1.015720433977775339e-01
1.015720433977775339e-01
1.013129804121860739e-01
1.013129804121860739e-01
1.010461280801991102e-01
1.000498875561586926e-01
1.000498875561586926e-01
9.989954954853400015e-02
9.989954954853400015e-02
9.974718041127779433e-02
9.974718041127779433e-02
9.927779207859126209e-02
9.927779207859126209e-02
9.895453501482384673e-02
9.895453501482384673e-02
9.878977679901904119e-02
9.878977679901904119e-02
9.845394862574075034e-02
9.845394862574075034e-02
9.828285710132769748e-02
9.828285710132769748e-02
9.810963255460700139e-02
9.810963255460700139e-02
9.775673889814452677e-02
9.775673889814452677e-02
9.757704648122939028e-02
9.757704648122939028e-02
9.739517441844847134e-02
9.739517441844847134e-02
9.683635680879366936e-02
9.683635680879366936e-02
9.664564139163234202e-02
9.664564139163234202e-02
9.645268269986066734e-02
9.645268269986066734e-02
9.625746724280667688e-02
9.625746724280667688e-02
9.605998126170960105e-02
9.605998126170960105e-02
9.586021072374084628e-02
9.586021072374084628e-02
9.565814131583365298e-02
9.565814131583365298e-02
9.545375843831399587e-02
9.545375843831399587e-02
9.524704719832527422e-02
9.524704719832527422e-02
9.461278983308757384e-02
9.461278983308757384e-02
9.439661010862626656e-02
9.439661010862626656e-02
9.417802291405356907e-02
9.417802291405356907e-02
9.373355855828796601e-02
9.373355855828796601e-02
9.350764674613515348e-02
9.350764674613515348e-02
9.327925814456287934e-02
9.327925814456287934e-02
9.209951139935543263e-02
9.209951139935543263e-02
9.160960648316310295e-02
9.160960648316310295e-02
9.136071365745782047e-02
9.136071365745782047e-02
9.110916529087509375e-02
9.110916529087509375e-02
9.059801322324900763e-02
9.059801322324900763e-02
9.007596793817981840e-02
9.007596793817981840e-02
8.981080113215782201e-02
8.981080113215782201e-02
8.844252370890373638e-02
8.844252370890373638e-02
8.816019509960262845e-02
8.816019509960262845e-02
8.787491109526085475e-02
8.787491109526085475e-02
8.758664281726979972e-02
8.758664281726979972e-02
8.729536070147142501e-02
8.729536070147142501e-02
8.640312494348800776e-02
8.640312494348800776e-02
8.609947735033006422e-02
8.609947735033006422e-02
8.579265702844270092e-02
8.548262981448334630e-02
8.548262981448334630e-02
8.516936068798448833e-02
8.516936068798448833e-02
8.485281374238570762e-02
8.485281374238570762e-02
8.388313298870041235e-02
8.388313298870041235e-02
8.321958904008117108e-02
8.321958904008117108e-02
8.288256752779801784e-02
8.288256752779801784e-02
8.254198931453010646e-02
8.254198931453010646e-02
8.219781018980981679e-02
8.219781018980981679e-02
8.114320673968955511e-02
8.114320673968955511e-02
8.078415686259281248e-02
8.078415686259281248e-02
8.042126584430266123e-02
8.042126584430266123e-02
8.005448144857350845e-02
8.005448144857350845e-02
7.968374991176056799e-02
7.968374991176056799e-02
7.968374991176056799e-02
7.968374991176056799e-02
7.930901588091987531e-02
7.930901588091987531e-02
7.930901588091987531e-02
7.893022234860358477e-02
7.893022234860358477e-02
7.816022006110269482e-02
7.816022006110269482e-02
7.776888838089432432e-02
7.776888838089432432e-02
7.737325119186863609e-02
7.737325119186863609e-02
7.697324210399353328e-02
7.615983193258765716e-02
7.615983193258765716e-02
7.574628703771557614e-02
7.574628703771557614e-02
7.532808241286911843e-02
7.532808241286911843e-02
7.490514001054934812e-02
7.490514001054934812e-02
7.447737911607792138e-02
7.447737911607792138e-02
7.404471621932250114e-02
7.404471621932250114e-02
7.360706487831178424e-02
7.360706487831178424e-02
7.316433557410331745e-02
7.316433557410331745e-02
7.271643555620696531e-02
7.271643555620696531e-02
7.226326867780062668e-02
7.226326867780062668e-02
7.180473521990037022e-02
7.180473521990037022e-02
7.134073170356469706e-02
7.134073170356469706e-02
7.087115068912033800e-02
7.087115068912033800e-02
7.087115068912033800e-02
7.087115068912033800e-02
7.087115068912033800e-02
7.087115068912033800e-02
7.039588056129421345e-02
7.039588056129421345e-02
6.942780422856537070e-02
6.893475175845634184e-02
6.893475175845634184e-02
6.893475175845634184e-02
6.843551709456136001e-02
6.792996393345133999e-02
6.792996393345133999e-02
6.792996393345133999e-02
6.741795013199378128e-02
6.741795013199378128e-02
6.741795013199378128e-02
6.741795013199378128e-02
6.741795013199378128e-02
6.689932735087850135e-02
6.689932735087850135e-02
6.689932735087850135e-02
6.637394066951274318e-02
6.637394066951274318e-02
6.584162816941876994e-02
6.584162816941876994e-02
6.475554030351379775e-02
6.475554030351379775e-02
6.363961030678927377e-02
6.363961030678927377e-02
6.190621939676173302e-02
6.070831903454418366e-02
6.070831903454418366e-02
6.070831903454418366e-02
6.070831903454418366e-02
5.947419608536123892e-02
5.947419608536123892e-02
5.884284153573821757e-02
5.754997827975261854e-02
5.688778427747031435e-02
5.552999189627168264e-02
5.552999189627168264e-02
0.000000000000000000e+00
