0.000000000000000000e+00
0.000000000000000000e+00
0.000000000000000000e+00
2.000000000000000042e-03
2.000000000000000042e-03
4.000000000000000083e-03
4.000000000000000083e-03
6.000000000000000125e-03
6.000000000000000125e-03
8.000000000000000167e-03
8.000000000000000167e-03
1.200000000000000025e-02
1.200000000000000025e-02
1.799999999999999864e-02
1.799999999999999864e-02
2.400000000000000050e-02
2.400000000000000050e-02
2.599999999999999881e-02
2.800000000000000058e-02
2.800000000000000058e-02
2.999999999999999889e-02
2.999999999999999889e-02
3.200000000000000067e-02
3.200000000000000067e-02
3.400000000000000244e-02
3.400000000000000244e-02
3.799999999999999906e-02
3.799999999999999906e-02
4.200000000000000261e-02
4.200000000000000261e-02
4.399999999999999745e-02
4.399999999999999745e-02
4.599999999999999922e-02
4.599999999999999922e-02
4.800000000000000100e-02
4.800000000000000100e-02
5.000000000000000278e-02
5.000000000000000278e-02
5.000000000000000278e-02
5.000000000000000278e-02
5.199999999999999761e-02
5.199999999999999761e-02
5.999999999999999778e-02
5.999999999999999778e-02
6.400000000000000133e-02
6.400000000000000133e-02
6.600000000000000311e-02
6.600000000000000311e-02
6.800000000000000488e-02
6.800000000000000488e-02
7.000000000000000666e-02
7.000000000000000666e-02
7.399999999999999634e-02
7.399999999999999634e-02
7.599999999999999811e-02
7.599999999999999811e-02
8.200000000000000344e-02
8.200000000000000344e-02
8.400000000000000522e-02
8.400000000000000522e-02
8.999999999999999667e-02
8.999999999999999667e-02
9.199999999999999845e-02
9.199999999999999845e-02
9.400000000000000022e-02
9.400000000000000022e-02
9.600000000000000200e-02
9.600000000000000200e-02
1.019999999999999934e-01
1.019999999999999934e-01
1.079999999999999988e-01
1.079999999999999988e-01
1.120000000000000023e-01
1.120000000000000023e-01
1.160000000000000059e-01
1.160000000000000059e-01
1.179999999999999938e-01
1.179999999999999938e-01
1.300000000000000044e-01
1.320000000000000062e-01
1.320000000000000062e-01
1.340000000000000080e-01
1.340000000000000080e-01
1.360000000000000098e-01
1.360000000000000098e-01
1.380000000000000115e-01
1.380000000000000115e-01
1.400000000000000133e-01
1.400000000000000133e-01
1.479999999999999927e-01
1.479999999999999927e-01
1.519999999999999962e-01
1.519999999999999962e-01
1.559999999999999998e-01
1.559999999999999998e-01
1.580000000000000016e-01
1.580000000000000016e-01
1.600000000000000033e-01
1.600000000000000033e-01
1.640000000000000069e-01
1.640000000000000069e-01
1.660000000000000087e-01
1.660000000000000087e-01
1.680000000000000104e-01
1.680000000000000104e-01
1.700000000000000122e-01
1.700000000000000122e-01
1.719999999999999862e-01
1.719999999999999862e-01
1.739999999999999880e-01
1.739999999999999880e-01
1.779999999999999916e-01
1.779999999999999916e-01
1.799999999999999933e-01
1.799999999999999933e-01
1.819999999999999951e-01
1.819999999999999951e-01
1.839999999999999969e-01
1.839999999999999969e-01
1.859999999999999987e-01
1.859999999999999987e-01
1.900000000000000022e-01
1.920000000000000040e-01
1.920000000000000040e-01
1.980000000000000093e-01
1.980000000000000093e-01
2.020000000000000129e-01
2.020000000000000129e-01
2.079999999999999905e-01
2.079999999999999905e-01
2.240000000000000047e-01
2.240000000000000047e-01
2.260000000000000064e-01
2.260000000000000064e-01
2.280000000000000082e-01
2.280000000000000082e-01
2.300000000000000100e-01
2.300000000000000100e-01
2.379999999999999893e-01
2.379999999999999893e-01
2.399999999999999911e-01
2.399999999999999911e-01
2.479999999999999982e-01
2.479999999999999982e-01
2.520000000000000018e-01
2.520000000000000018e-01
2.540000000000000036e-01
2.540000000000000036e-01
2.560000000000000053e-01
2.560000000000000053e-01
2.580000000000000071e-01
2.580000000000000071e-01
2.600000000000000089e-01
2.600000000000000089e-01
2.620000000000000107e-01
2.620000000000000107e-01
2.660000000000000142e-01
2.660000000000000142e-01
2.680000000000000160e-01
2.680000000000000160e-01
2.720000000000000195e-01
2.720000000000000195e-01
2.740000000000000213e-01
2.740000000000000213e-01
2.760000000000000231e-01
2.760000000000000231e-01
2.800000000000000266e-01
2.800000000000000266e-01
2.819999999999999729e-01
2.819999999999999729e-01
2.899999999999999800e-01
2.899999999999999800e-01
2.919999999999999818e-01
2.919999999999999818e-01
2.959999999999999853e-01
2.959999999999999853e-01
2.979999999999999871e-01
2.979999999999999871e-01
2.999999999999999889e-01
2.999999999999999889e-01
3.039999999999999925e-01
3.039999999999999925e-01
3.059999999999999942e-01
3.059999999999999942e-01
3.099999999999999978e-01
3.099999999999999978e-01
3.119999999999999996e-01
3.119999999999999996e-01
3.160000000000000031e-01
3.160000000000000031e-01
3.180000000000000049e-01
3.180000000000000049e-01
3.260000000000000120e-01
3.260000000000000120e-01
3.420000000000000262e-01
3.420000000000000262e-01
3.479999999999999760e-01
3.479999999999999760e-01
3.519999999999999796e-01
3.519999999999999796e-01
3.679999999999999938e-01
3.679999999999999938e-01
3.719999999999999973e-01
3.719999999999999973e-01
3.780000000000000027e-01
3.780000000000000027e-01
3.800000000000000044e-01
3.800000000000000044e-01
3.820000000000000062e-01
3.820000000000000062e-01
3.840000000000000080e-01
3.840000000000000080e-01
3.860000000000000098e-01
3.860000000000000098e-01
3.940000000000000169e-01
3.940000000000000169e-01
3.960000000000000187e-01
3.960000000000000187e-01
3.980000000000000204e-01
3.980000000000000204e-01
4.000000000000000222e-01
4.000000000000000222e-01
4.020000000000000240e-01
4.020000000000000240e-01
4.060000000000000275e-01
4.060000000000000275e-01
4.079999999999999738e-01
4.079999999999999738e-01
4.199999999999999845e-01
4.199999999999999845e-01
4.219999999999999862e-01
4.219999999999999862e-01
4.239999999999999880e-01
4.239999999999999880e-01
4.480000000000000093e-01
4.480000000000000093e-01
4.520000000000000129e-01
4.520000000000000129e-01
4.540000000000000147e-01
4.540000000000000147e-01
4.580000000000000182e-01
4.580000000000000182e-01
4.600000000000000200e-01
4.600000000000000200e-01
4.640000000000000235e-01
4.640000000000000235e-01
4.660000000000000253e-01
4.660000000000000253e-01
4.719999999999999751e-01
5.140000000000000124e-01
5.140000000000000124e-01
5.180000000000000160e-01
5.180000000000000160e-01
5.240000000000000213e-01
5.240000000000000213e-01
5.280000000000000249e-01
5.280000000000000249e-01
5.440000000000000391e-01
5.440000000000000391e-01
5.500000000000000444e-01
5.500000000000000444e-01
5.520000000000000462e-01
5.520000000000000462e-01
5.560000000000000497e-01
5.560000000000000497e-01
5.600000000000000533e-01
5.600000000000000533e-01
5.620000000000000551e-01
5.620000000000000551e-01
5.659999999999999476e-01
5.659999999999999476e-01
5.679999999999999494e-01
5.679999999999999494e-01
5.719999999999999529e-01
5.719999999999999529e-01
5.759999999999999565e-01
5.759999999999999565e-01
5.819999999999999618e-01
5.819999999999999618e-01
5.839999999999999636e-01
5.839999999999999636e-01
5.859999999999999654e-01
5.859999999999999654e-01
5.879999999999999671e-01
5.879999999999999671e-01
5.899999999999999689e-01
5.899999999999999689e-01
5.919999999999999707e-01
5.919999999999999707e-01
6.059999999999999831e-01
6.059999999999999831e-01
6.079999999999999849e-01
6.079999999999999849e-01
6.340000000000000080e-01
6.340000000000000080e-01
6.380000000000000115e-01
6.380000000000000115e-01
6.420000000000000151e-01
6.420000000000000151e-01
6.440000000000000169e-01
6.440000000000000169e-01
6.560000000000000275e-01
6.560000000000000275e-01
6.620000000000000329e-01
6.620000000000000329e-01
6.780000000000000471e-01
6.780000000000000471e-01
6.979999999999999538e-01
6.979999999999999538e-01
7.039999999999999591e-01
7.039999999999999591e-01
7.079999999999999627e-01
7.079999999999999627e-01
7.179999999999999716e-01
7.179999999999999716e-01
7.299999999999999822e-01
7.299999999999999822e-01
7.319999999999999840e-01
7.319999999999999840e-01
7.359999999999999876e-01
7.359999999999999876e-01
7.379999999999999893e-01
7.379999999999999893e-01
7.399999999999999911e-01
7.399999999999999911e-01
7.419999999999999929e-01
7.419999999999999929e-01
7.479999999999999982e-01
7.479999999999999982e-01
7.500000000000000000e-01
7.500000000000000000e-01
7.540000000000000036e-01
7.540000000000000036e-01
7.620000000000000107e-01
7.620000000000000107e-01
7.640000000000000124e-01
7.640000000000000124e-01
7.660000000000000142e-01
7.660000000000000142e-01
7.680000000000000160e-01
7.680000000000000160e-01
7.800000000000000266e-01
7.800000000000000266e-01
7.860000000000000320e-01
7.860000000000000320e-01
7.900000000000000355e-01
7.900000000000000355e-01
7.920000000000000373e-01
7.920000000000000373e-01
7.940000000000000391e-01
7.940000000000000391e-01
7.960000000000000409e-01
7.960000000000000409e-01
7.980000000000000426e-01
7.980000000000000426e-01
8.020000000000000462e-01
8.020000000000000462e-01
8.040000000000000480e-01
8.040000000000000480e-01
8.139999999999999458e-01
8.139999999999999458e-01
8.159999999999999476e-01
8.159999999999999476e-01
8.199999999999999512e-01
8.199999999999999512e-01
8.219999999999999529e-01
8.219999999999999529e-01
8.259999999999999565e-01
8.259999999999999565e-01
8.299999999999999600e-01
8.299999999999999600e-01
8.459999999999999742e-01
8.459999999999999742e-01
8.599999999999999867e-01
8.599999999999999867e-01
8.719999999999999973e-01
8.719999999999999973e-01
8.760000000000000009e-01
8.760000000000000009e-01
8.800000000000000044e-01
8.800000000000000044e-01
8.860000000000000098e-01
8.860000000000000098e-01
8.980000000000000204e-01
8.980000000000000204e-01
9.000000000000000222e-01
9.000000000000000222e-01
9.220000000000000417e-01
9.220000000000000417e-01
9.659999999999999698e-01
9.659999999999999698e-01
9.739999999999999769e-01
9.739999999999999769e-01
9.799999999999999822e-01
9.799999999999999822e-01
9.939999999999999947e-01
9.939999999999999947e-01
9.979999999999999982e-01
9.979999999999999982e-01
1.000000000000000000e+00
1.000000000000000000e+00
