0.000000000000000000e+00
7.347538574577516454e-03
7.347538574577516454e-03
7.347538574577516454e-03
7.347538574577516454e-03
7.347538574577516454e-03
7.347538574577516454e-03
7.347538574577516454e-03
7.347538574577516454e-03
8.817046289493020092e-03
8.817046289493020092e-03
9.551800146950771911e-03
9.551800146950771911e-03
9.551800146950771911e-03
9.551800146950771911e-03
1.028655400440852373e-02
1.028655400440852373e-02
1.102130786186627555e-02
1.102130786186627555e-02
1.175606171932402563e-02
1.249081557678177745e-02
1.322556943423952927e-02
1.322556943423952927e-02
1.322556943423952927e-02
1.396032329169728109e-02
1.396032329169728109e-02
1.469507714915503291e-02
1.469507714915503291e-02
1.469507714915503291e-02
1.469507714915503291e-02
1.542983100661278473e-02
1.542983100661278473e-02
1.616458486407053655e-02
1.616458486407053655e-02
1.616458486407053655e-02
1.616458486407053655e-02
1.689933872152828837e-02
1.689933872152828837e-02
1.836884643644379200e-02
1.836884643644379200e-02
1.910360029390154382e-02
1.910360029390154382e-02
1.983835415135929564e-02
1.983835415135929564e-02
2.130786186627479928e-02
2.130786186627479928e-02
2.204261572373255110e-02
2.204261572373255110e-02
2.277736958119030292e-02
2.277736958119030292e-02
2.351212343864805127e-02
2.351212343864805127e-02
2.424687729610580308e-02
2.424687729610580308e-02
2.498163115356355490e-02
2.498163115356355490e-02
2.645113886847905854e-02
2.645113886847905854e-02
2.718589272593681036e-02
2.718589272593681036e-02
2.792064658339456218e-02
2.792064658339456218e-02
2.865540044085231400e-02
2.865540044085231400e-02
3.012490815576781764e-02
3.012490815576781764e-02
3.085966201322556945e-02
3.085966201322556945e-02
3.232916972814107309e-02
3.232916972814107309e-02
3.306392358559882144e-02
3.306392358559882144e-02
3.379867744305657673e-02
3.379867744305657673e-02
3.453343130051432508e-02
3.453343130051432508e-02
3.526818515797208037e-02
3.526818515797208037e-02
3.600293901542982872e-02
3.600293901542982872e-02
3.747244673034533236e-02
3.747244673034533236e-02
3.820720058780308764e-02
3.820720058780308764e-02
3.894195444526083599e-02
3.894195444526083599e-02
3.967670830271859128e-02
3.967670830271859128e-02
4.041146216017633963e-02
4.041146216017633963e-02
4.114621601763409492e-02
4.114621601763409492e-02
4.188096987509184327e-02
4.188096987509184327e-02
4.261572373254959856e-02
4.261572373254959856e-02
4.481998530492285054e-02
4.481998530492285054e-02
4.628949301983835418e-02
4.628949301983835418e-02
4.775900073475385782e-02
4.775900073475385782e-02
4.922850844966936146e-02
4.922850844966936146e-02
4.996326230712710981e-02
4.996326230712710981e-02
5.069801616458486510e-02
5.069801616458486510e-02
5.143277002204261344e-02
5.143277002204261344e-02
5.216752387950036873e-02
5.216752387950036873e-02
5.290227773695811708e-02
5.290227773695811708e-02
5.363703159441587237e-02
5.363703159441587237e-02
5.437178545187362072e-02
5.437178545187362072e-02
5.510653930933137601e-02
5.510653930933137601e-02
5.584129316678912436e-02
5.584129316678912436e-02
5.657604702424687965e-02
5.657604702424687965e-02
5.731080088170462800e-02
5.731080088170462800e-02
5.804555473916238328e-02
5.804555473916238328e-02
5.951506245407788692e-02
5.951506245407788692e-02
6.024981631153563527e-02
6.024981631153563527e-02
6.098457016899339056e-02
6.098457016899339056e-02
6.171932402645113891e-02
6.171932402645113891e-02
6.318883174136663561e-02
6.318883174136663561e-02
6.392358559882439784e-02
6.392358559882439784e-02
6.465833945628214618e-02
6.465833945628214618e-02
6.539309331373989453e-02
6.539309331373989453e-02
6.612784717119764288e-02
6.612784717119764288e-02
6.686260102865540511e-02
6.686260102865540511e-02
6.833210874357090181e-02
6.833210874357090181e-02
6.980161645848641239e-02
6.980161645848641239e-02
7.053637031594416074e-02
7.053637031594416074e-02
7.200587803085965743e-02
7.200587803085965743e-02
7.274063188831741966e-02
7.274063188831741966e-02
7.347538574577516801e-02
7.347538574577516801e-02
7.494489346069066471e-02
7.494489346069066471e-02
7.714915503306392364e-02
7.714915503306392364e-02
7.788390889052167199e-02
7.788390889052167199e-02
7.861866274797942034e-02
7.861866274797942034e-02
8.008817046289493091e-02
8.008817046289493091e-02
8.082292432035267926e-02
8.082292432035267926e-02
8.155767817781042761e-02
8.155767817781042761e-02
8.302718589272593819e-02
8.302718589272593819e-02
8.449669360764143489e-02
8.449669360764143489e-02
8.596620132255694546e-02
8.596620132255694546e-02
8.817046289493020439e-02
8.817046289493020439e-02
8.890521675238795274e-02
8.890521675238795274e-02
8.963997060984570109e-02
8.963997060984570109e-02
9.037472446730344944e-02
9.037472446730344944e-02
9.184423218221896001e-02
9.184423218221896001e-02
9.404849375459220506e-02
9.404849375459220506e-02
9.478324761204996729e-02
9.478324761204996729e-02
9.551800146950771564e-02
9.551800146950771564e-02
9.772226304188097457e-02
9.772226304188097457e-02
9.845701689933872292e-02
9.845701689933872292e-02
9.919177075679647126e-02
9.919177075679647126e-02
1.021307861866274785e-01
1.021307861866274785e-01
1.028655400440852269e-01
1.028655400440852269e-01
1.043350477590007375e-01
1.043350477590007375e-01
1.050698016164584858e-01
1.050698016164584858e-01
1.058045554739162342e-01
1.058045554739162342e-01
1.065393093313739964e-01
1.065393093313739964e-01
1.072740631888317447e-01
1.072740631888317447e-01
1.080088170462894931e-01
1.080088170462894931e-01
1.094783247612049898e-01
1.094783247612049898e-01
1.109478324761205004e-01
1.109478324761205004e-01
1.124173401910359971e-01
1.124173401910359971e-01
1.146216017634092560e-01
1.146216017634092560e-01
1.153563556208670043e-01
1.153563556208670043e-01
1.160911094783247666e-01
1.160911094783247666e-01
1.168258633357825149e-01
1.168258633357825149e-01
1.175606171932402633e-01
1.175606171932402633e-01
1.190301249081557738e-01
1.190301249081557738e-01
1.204996326230712705e-01
1.204996326230712705e-01
1.212343864805290189e-01
1.212343864805290189e-01
1.219691403379867811e-01
1.219691403379867811e-01
1.234386480529022778e-01
1.234386480529022778e-01
1.241734019103600262e-01
1.241734019103600262e-01
1.249081557678177745e-01
1.249081557678177745e-01
1.256429096252755229e-01
1.256429096252755229e-01
1.263776634827332712e-01
1.263776634827332712e-01
1.278471711976487957e-01
1.278471711976487957e-01
1.322556943423952858e-01
1.322556943423952858e-01
1.329904481998530619e-01
1.329904481998530619e-01
1.337252020573108102e-01
1.337252020573108102e-01
1.344599559147685586e-01
1.344599559147685586e-01
1.351947097722263069e-01
1.351947097722263069e-01
1.359294636296840553e-01
1.359294636296840553e-01
1.388684790595150487e-01
1.388684790595150487e-01
1.403379867744305731e-01
1.403379867744305731e-01
1.410727406318883215e-01
1.410727406318883215e-01
1.418074944893460698e-01
1.418074944893460698e-01
1.425422483468038182e-01
1.425422483468038182e-01
1.440117560617193149e-01
1.440117560617193149e-01
1.447465099191770632e-01
1.447465099191770632e-01
1.454812637766348393e-01
1.454812637766348393e-01
1.462160176340925877e-01
1.462160176340925877e-01
1.484202792064658327e-01
1.484202792064658327e-01
1.491550330639235811e-01
1.491550330639235811e-01
1.498897869213813294e-01
1.498897869213813294e-01
1.520940484937546022e-01
1.520940484937546022e-01
1.528288023512123506e-01
1.528288023512123506e-01
1.535635562086700989e-01
1.535635562086700989e-01
1.542983100661278473e-01
1.542983100661278473e-01
1.557678177810433440e-01
1.557678177810433440e-01
1.565025716385010923e-01
1.565025716385010923e-01
1.587068332108743651e-01
1.587068332108743651e-01
1.594415870683321135e-01
1.594415870683321135e-01
1.616458486407053585e-01
1.616458486407053585e-01
1.638501102130786313e-01
1.638501102130786313e-01
1.653196179279941280e-01
1.653196179279941280e-01
1.660543717854518764e-01
1.660543717854518764e-01
1.667891256429096247e-01
1.667891256429096247e-01
1.682586333578251214e-01
1.682586333578251214e-01
1.697281410727406181e-01
1.697281410727406181e-01
1.719324026451138909e-01
1.719324026451138909e-01
1.726671565025716393e-01
1.726671565025716393e-01
1.741366642174871360e-01
1.741366642174871360e-01
1.748714180749448843e-01
1.748714180749448843e-01
1.807494489346068989e-01
1.807494489346068989e-01
1.814842027920646472e-01
1.814842027920646472e-01
1.836884643644379200e-01
1.836884643644379200e-01
1.858927259368111651e-01
1.858927259368111651e-01
1.873622336517266618e-01
1.873622336517266618e-01
1.888317413666421862e-01
1.888317413666421862e-01
1.903012490815576829e-01
1.903012490815576829e-01
1.925055106539309280e-01
1.925055106539309280e-01
1.961792799412196975e-01
1.961792799412196975e-01
1.969140337986774458e-01
1.969140337986774458e-01
1.998530492285084392e-01
1.998530492285084392e-01
2.005878030859661876e-01
2.005878030859661876e-01
2.013225569434239637e-01
2.013225569434239637e-01
2.027920646583394604e-01
2.027920646583394604e-01
2.042615723732549571e-01
2.042615723732549571e-01
2.049963262307127054e-01
2.049963262307127054e-01
2.057310800881704538e-01
2.057310800881704538e-01
2.064658339456282021e-01
2.064658339456282021e-01
2.072005878030859782e-01
2.072005878030859782e-01
2.079353416605437266e-01
2.079353416605437266e-01
2.108743570903747200e-01
2.108743570903747200e-01
2.160176340925789862e-01
2.160176340925789862e-01
2.174871418074944829e-01
2.174871418074944829e-01
2.189566495224099796e-01
2.189566495224099796e-01
2.204261572373255040e-01
2.204261572373255040e-01
2.233651726671564974e-01
2.233651726671564974e-01
2.285084496693607636e-01
2.285084496693607636e-01
2.321822189566495331e-01
2.321822189566495331e-01
2.329169728141072815e-01
2.329169728141072815e-01
2.351212343864805265e-01
2.351212343864805265e-01
2.358559882439382749e-01
2.358559882439382749e-01
2.387950036737692960e-01
2.387950036737692960e-01
2.417340191036002894e-01
2.417340191036002894e-01
2.476120499632623040e-01
2.476120499632623040e-01
2.490815576781778007e-01
2.490815576781778007e-01
2.498163115356355490e-01
2.498163115356355490e-01
2.512858192505510457e-01
2.512858192505510457e-01
2.549595885378398430e-01
2.549595885378398430e-01
2.571638501102130880e-01
2.571638501102130880e-01
2.593681116825863331e-01
2.593681116825863331e-01
2.615723732549595781e-01
2.615723732549595781e-01
2.637766348273328232e-01
2.637766348273328232e-01
2.703894195444526138e-01
2.703894195444526138e-01
2.711241734019103622e-01
2.711241734019103622e-01
2.718589272593681105e-01
2.718589272593681105e-01
2.777369581190300973e-01
2.777369581190300973e-01
2.806759735488611462e-01
2.806759735488611462e-01
2.850844966936076363e-01
2.850844966936076363e-01
2.858192505510653847e-01
2.858192505510653847e-01
2.909625275532696786e-01
2.909625275532696786e-01
2.939015429831006720e-01
2.939015429831006720e-01
2.953710506980161687e-01
2.953710506980161687e-01
2.961058045554739171e-01
2.961058045554739171e-01
2.997795738427626588e-01
2.997795738427626588e-01
3.012490815576781555e-01
3.012490815576781555e-01
3.041880969875092044e-01
3.041880969875092044e-01
3.056576047024247011e-01
3.056576047024247011e-01
3.071271124173401978e-01
3.071271124173401978e-01
3.122703894195444363e-01
3.122703894195444363e-01
3.130051432770021846e-01
3.130051432770021846e-01
3.144746509919176813e-01
3.144746509919176813e-01
3.152094048493754852e-01
3.152094048493754852e-01
3.159441587068332336e-01
3.159441587068332336e-01
3.166789125642909819e-01
3.166789125642909819e-01
3.181484202792064786e-01
3.181484202792064786e-01
3.188831741366642269e-01
3.188831741366642269e-01
3.203526818515797236e-01
3.203526818515797236e-01
3.210874357090374720e-01
3.210874357090374720e-01
3.218221895664952203e-01
3.218221895664952203e-01
3.225569434239529687e-01
3.225569434239529687e-01
3.240264511388684654e-01
3.240264511388684654e-01
3.247612049963262137e-01
3.247612049963262137e-01
3.262307127112417104e-01
3.262307127112417104e-01
3.277002204261572627e-01
3.277002204261572627e-01
3.291697281410727594e-01
3.291697281410727594e-01
3.306392358559882561e-01
3.306392358559882561e-01
3.313739897134460044e-01
3.313739897134460044e-01
3.335782512858192494e-01
3.335782512858192494e-01
3.365172667156502428e-01
3.365172667156502428e-01
3.372520205731079912e-01
3.372520205731079912e-01
3.394562821454812362e-01
3.394562821454812362e-01
3.401910360029390401e-01
3.401910360029390401e-01
3.423952975753122852e-01
3.423952975753122852e-01
3.453343130051432786e-01
3.453343130051432786e-01
3.460690668626010269e-01
3.460690668626010269e-01
3.504775900073475170e-01
3.504775900073475170e-01
3.541513592946363143e-01
3.541513592946363143e-01
3.556208670095518110e-01
3.556208670095518110e-01
3.585598824393828044e-01
3.585598824393828044e-01
3.622336517266715461e-01
3.622336517266715461e-01
3.644379132990448467e-01
3.644379132990448467e-01
3.673769287288758401e-01
3.673769287288758401e-01
3.703159441587068335e-01
3.703159441587068335e-01
3.754592211609110719e-01
3.754592211609110719e-01
3.783982365907421208e-01
3.783982365907421208e-01
3.798677443056576175e-01
3.798677443056576175e-01
3.813372520205731142e-01
3.813372520205731142e-01
3.857457751653196043e-01
3.857457751653196043e-01
3.879500367376928494e-01
3.879500367376928494e-01
3.916238060249816466e-01
3.916238060249816466e-01
3.938280675973548917e-01
3.938280675973548917e-01
3.952975753122703884e-01
3.952975753122703884e-01
4.019103600293901790e-01
4.019103600293901790e-01
4.055841293166789208e-01
4.055841293166789208e-01
4.070536370315944175e-01
4.070536370315944175e-01
4.077883908890521658e-01
4.077883908890521658e-01
4.136664217487142081e-01
4.136664217487142081e-01
4.158706833210874532e-01
4.158706833210874532e-01
4.202792064658339433e-01
4.202792064658339433e-01
4.283614988978692306e-01
4.283614988978692306e-01
4.290962527553269790e-01
4.290962527553269790e-01
4.327700220426157207e-01
4.327700220426157207e-01
4.357090374724467141e-01
4.357090374724467141e-01
4.379132990448199592e-01
4.379132990448199592e-01
4.437913299044820015e-01
4.437913299044820015e-01
4.445260837619397498e-01
4.445260837619397498e-01
4.489346069066862399e-01
4.489346069066862399e-01
4.518736223365172888e-01
4.518736223365172888e-01
4.540778839088905339e-01
4.540778839088905339e-01
4.562821454812637789e-01
4.562821454812637789e-01
4.614254224834680174e-01
4.614254224834680174e-01
4.643644379132990663e-01
4.643644379132990663e-01
4.665686994856723113e-01
4.665686994856723113e-01
4.680382072005878080e-01
4.680382072005878080e-01
4.695077149155033047e-01
4.695077149155033047e-01
4.819985304922850822e-01
4.819985304922850822e-01
4.849375459221160756e-01
4.849375459221160756e-01
4.893460690668626212e-01
4.893460690668626212e-01
4.981631153563556014e-01
4.981631153563556014e-01
5.040411462160175882e-01
5.040411462160175882e-01
5.055106539309330849e-01
5.055106539309330849e-01
5.062454077883908887e-01
5.062454077883908887e-01
5.106539309331373788e-01
5.106539309331373788e-01
5.143277002204261761e-01
5.143277002204261761e-01
5.150624540778838689e-01
5.150624540778838689e-01
5.231447465099191563e-01
5.231447465099191563e-01
5.238795003673769601e-01
5.238795003673769601e-01
5.304922850844966398e-01
5.304922850844966398e-01
5.312270389419544436e-01
5.312270389419544436e-01
5.334313005143277442e-01
5.334313005143277442e-01
5.385745775165319271e-01
5.385745775165319271e-01
5.393093313739897310e-01
5.393093313739897310e-01
5.400440852314474238e-01
5.400440852314474238e-01
5.415135929463629205e-01
5.415135929463629205e-01
5.451873622336517178e-01
5.451873622336517178e-01
5.466568699485672145e-01
5.466568699485672145e-01
5.503306392358560117e-01
5.503306392358560117e-01
5.510653930933137046e-01
5.510653930933137046e-01
5.562086700955179985e-01
5.562086700955179985e-01
5.598824393828067958e-01
5.598824393828067958e-01
5.613519470977222925e-01
5.613519470977222925e-01
5.620867009551799853e-01
5.620867009551799853e-01
5.642909625275532859e-01
5.642909625275532859e-01
5.686994856722997760e-01
5.686994856722997760e-01
5.701689933872152727e-01
5.701689933872152727e-01
5.767817781043350633e-01
5.767817781043350633e-01
5.775165319617927562e-01
5.775165319617927562e-01
5.900073475385745336e-01
5.900073475385745336e-01
5.951506245407788276e-01
5.951506245407788276e-01
5.973548861131521281e-01
5.973548861131521281e-01
6.010286554004408144e-01
6.010286554004408144e-01
6.091109478324761017e-01
6.091109478324761017e-01
6.105804555473915984e-01
6.105804555473915984e-01
6.142542248346803957e-01
6.142542248346803957e-01
6.171932402645113891e-01
6.171932402645113891e-01
6.230712711241733759e-01
6.230712711241733759e-01
6.274797942689198660e-01
6.274797942689198660e-01
6.304188096987509704e-01
6.304188096987509704e-01
6.333578251285819638e-01
6.333578251285819638e-01
6.362968405584129572e-01
6.362968405584129572e-01
6.407053637031594473e-01
6.407053637031594473e-01
6.429096252755327479e-01
6.429096252755327479e-01
6.443791329904482446e-01
6.443791329904482446e-01
6.465833945628214341e-01
6.465833945628214341e-01
6.473181484202792380e-01
6.473181484202792380e-01
6.480529022777369308e-01
6.480529022777369308e-01
6.531961792799412247e-01
6.531961792799412247e-01
6.546656869948567214e-01
6.546656869948567214e-01
6.561351947097722181e-01
6.561351947097722181e-01
6.576047024246877148e-01
6.576047024246877148e-01
6.678912564290963028e-01
6.678912564290963028e-01
6.708302718589272962e-01
6.708302718589272962e-01
6.722997795738427929e-01
6.722997795738427929e-01
6.811168258633357731e-01
6.811168258633357731e-01
6.847905951506245703e-01
6.847905951506245703e-01
6.869948567229977598e-01
6.869948567229977598e-01
6.891991182953710604e-01
6.891991182953710604e-01
6.899338721528287532e-01
6.899338721528287532e-01
6.965466568699485439e-01
6.965466568699485439e-01
6.987509184423218445e-01
6.987509184423218445e-01
7.119764878765613147e-01
7.119764878765613147e-01
7.178545187362234126e-01
7.178545187362234126e-01
7.200587803085966021e-01
7.200587803085966021e-01
7.266715650257163928e-01
7.266715650257163928e-01
7.303453343130051900e-01
7.303453343130051900e-01
7.318148420279206867e-01
7.318148420279206867e-01
7.354886113152093730e-01
7.354886113152093730e-01
7.362233651726671768e-01
7.362233651726671768e-01
7.435709037472446603e-01
7.435709037472446603e-01
7.472446730345334576e-01
7.472446730345334576e-01
7.553269654665687449e-01
7.553269654665687449e-01
7.612049963262307317e-01
7.612049963262307317e-01
7.634092578986039213e-01
7.634092578986039213e-01
7.656135194709772218e-01
7.656135194709772218e-01
7.663482733284350257e-01
7.663482733284350257e-01
7.795738427626744960e-01
7.795738427626744960e-01
7.861866274797942866e-01
7.861866274797942866e-01
7.883908890521674762e-01
7.883908890521674762e-01
7.891256429096252800e-01
7.891256429096252800e-01
7.905951506245407767e-01
7.905951506245407767e-01
7.913299044819985806e-01
7.913299044819985806e-01
7.957384276267450707e-01
7.957384276267450707e-01
7.972079353416605674e-01
7.972079353416605674e-01
8.052902277736958547e-01
8.052902277736958547e-01
8.096987509184423448e-01
8.096987509184423448e-01
8.273328434974284162e-01
8.273328434974284162e-01
8.302718589272594096e-01
8.302718589272594096e-01
8.339456282145480959e-01
8.339456282145480959e-01
8.390889052167523898e-01
8.390889052167523898e-01
8.420279206465833832e-01
8.420279206465833832e-01
8.493754592211608667e-01
8.493754592211608667e-01
8.523144746509919711e-01
8.523144746509919711e-01
8.537839823659074678e-01
8.537839823659074678e-01
8.545187362233651607e-01
8.545187362233651607e-01
8.559882439382806574e-01
8.559882439382806574e-01
8.567229977957384612e-01
8.567229977957384612e-01
8.640705363703159447e-01
8.640705363703159447e-01
8.662747979426892453e-01
8.662747979426892453e-01
8.670095518001469381e-01
8.670095518001469381e-01
8.750918442321822255e-01
8.750918442321822255e-01
8.787656135194710227e-01
8.787656135194710227e-01
8.795003673769287156e-01
8.795003673769287156e-01
8.831741366642175128e-01
8.831741366642175128e-01
8.883174136664216958e-01
8.883174136664216958e-01
8.912564290962528002e-01
8.912564290962528002e-01
8.927259368111682969e-01
8.927259368111682969e-01
8.978692138133724798e-01
8.978692138133724798e-01
9.037472446730345776e-01
9.037472446730345776e-01
9.177075679647318518e-01
9.177075679647318518e-01
9.221160911094783419e-01
9.221160911094783419e-01
9.235855988243938386e-01
9.235855988243938386e-01
9.257898603967670281e-01
9.257898603967670281e-01
9.265246142542248320e-01
9.265246142542248320e-01
9.324026451138868188e-01
9.324026451138868188e-01
9.346069066862601193e-01
9.346069066862601193e-01
9.368111682586333089e-01
9.368111682586333089e-01
9.412196914033799100e-01
9.412196914033799100e-01
9.419544452608376028e-01
9.419544452608376028e-01
9.448934606906685962e-01
9.448934606906685962e-01
9.478324761204995896e-01
9.478324761204995896e-01
9.485672299779573935e-01
9.485672299779573935e-01
9.500367376928728902e-01
9.500367376928728902e-01
9.537105069801616875e-01
9.537105069801616875e-01
9.566495224099926808e-01
9.566495224099926808e-01
9.581190301249081775e-01
9.581190301249081775e-01
9.610580455547391709e-01
9.610580455547391709e-01
9.632623071271124715e-01
9.632623071271124715e-01
9.639970609845701643e-01
9.639970609845701643e-01
9.654665686994856610e-01
9.654665686994856610e-01
9.662013225569434649e-01
9.662013225569434649e-01
9.706098457016899550e-01
9.706098457016899550e-01
9.772226304188097457e-01
9.772226304188097457e-01
9.779573842762674385e-01
9.779573842762674385e-01
9.794268919911829352e-01
9.794268919911829352e-01
9.867744305657604187e-01
9.867744305657604187e-01
9.875091844232182225e-01
9.875091844232182225e-01
9.882439382806760264e-01
9.882439382806760264e-01
9.889786921381337192e-01
9.889786921381337192e-01
9.897134459955915231e-01
9.897134459955915231e-01
9.904481998530492159e-01
9.904481998530492159e-01
9.919177075679647126e-01
9.919177075679647126e-01
9.948567229977957060e-01
9.948567229977957060e-01
9.955914768552535099e-01
9.955914768552535099e-01
9.985304922850845033e-01
9.985304922850845033e-01
1.000000000000000000e+00
1.000000000000000000e+00
1.000000000000000000e+00
