1.996201992034912109e+00
9.962019920349121094e-01
9.924739003181457520e-01
9.918935298919677734e-01
9.327725172042846680e-01
9.274048805236816406e-01
9.156632423400878906e-01
9.151796698570251465e-01
9.087458252906799316e-01
9.056406021118164062e-01
8.905264139175415039e-01
8.898248672485351562e-01
8.732848167419433594e-01
8.724138736724853516e-01
8.510255813598632812e-01
8.298984766006469727e-01
8.037489056587219238e-01
8.034667968750000000e-01
7.520388960838317871e-01
7.520325779914855957e-01
7.500922679901123047e-01
7.459860444068908691e-01
7.310994863510131836e-01
7.224336266517639160e-01
7.210154533386230469e-01
7.206175327301025391e-01
7.092631459236145020e-01
7.063583731651306152e-01
7.062352895736694336e-01
6.989005804061889648e-01
6.949051618576049805e-01
6.945126652717590332e-01
6.904753446578979492e-01
6.901454925537109375e-01
6.890034079551696777e-01
6.861047744750976562e-01
6.859907507896423340e-01
6.796322464942932129e-01
6.629918813705444336e-01
6.599260568618774414e-01
6.492778658866882324e-01
6.469690203666687012e-01
6.308515071868896484e-01
6.274010539054870605e-01
6.226111650466918945e-01
6.217152476310729980e-01
6.216783523559570312e-01
6.212322711944580078e-01
6.186293959617614746e-01
6.169765591621398926e-01
6.112810373306274414e-01
6.105473041534423828e-01
6.028888821601867676e-01
5.994852781295776367e-01
5.984608530998229980e-01
5.938766002655029297e-01
5.856201648712158203e-01
5.845909118652343750e-01
5.803204178810119629e-01
5.712532997131347656e-01
5.663355588912963867e-01
5.656434297561645508e-01
5.641510486602783203e-01
5.581510663032531738e-01
5.535746216773986816e-01
5.521250963211059570e-01
5.473914146423339844e-01
5.472236275672912598e-01
5.463593006134033203e-01
5.455960631370544434e-01
5.389541387557983398e-01
5.301722288131713867e-01
5.181616544723510742e-01
5.170915126800537109e-01
5.153762102127075195e-01
5.138595104217529297e-01
5.129143595695495605e-01
5.080437660217285156e-01
5.058176517486572266e-01
5.052351355552673340e-01
5.050091147422790527e-01
5.047180652618408203e-01
5.035694241523742676e-01
5.027418732643127441e-01
4.986638426780700684e-01
4.953027665615081787e-01
4.868789613246917725e-01
4.839213490486145020e-01
4.780625700950622559e-01
4.771072268486022949e-01
4.770186245441436768e-01
4.708957374095916748e-01
4.700374007225036621e-01
4.680402874946594238e-01
4.674296379089355469e-01
4.664018750190734863e-01
4.628739953041076660e-01
4.588248133659362793e-01
4.583126306533813477e-01
4.580878019332885742e-01
4.568859636783599854e-01
4.566769003868103027e-01
4.559052884578704834e-01
4.543826580047607422e-01
4.516098201274871826e-01
4.505844116210937500e-01
4.491230547428131104e-01
4.471318125724792480e-01
4.465117752552032471e-01
4.461965560913085938e-01
4.457271993160247803e-01
4.454828202724456787e-01
4.448001682758331299e-01
4.442874193191528320e-01
4.435546100139617920e-01
4.431990981101989746e-01
4.422454237937927246e-01
4.349682927131652832e-01
4.333921968936920166e-01
4.317106902599334717e-01
4.296110272407531738e-01
4.290864169597625732e-01
4.282538294792175293e-01
4.272319674491882324e-01
4.271517097949981689e-01
4.264928400516510010e-01
4.244947433471679688e-01
4.232864379882812500e-01
4.219295084476470947e-01
4.214560687541961670e-01
4.204207062721252441e-01
4.177936911582946777e-01
4.157330691814422607e-01
4.154232740402221680e-01
4.137381017208099365e-01
4.135096371173858643e-01
4.127611517906188965e-01
4.122298359870910645e-01
4.113824367523193359e-01
4.099807441234588623e-01
4.096924066543579102e-01
4.096266031265258789e-01
4.091012477874755859e-01
4.080490171909332275e-01
4.080122709274291992e-01
4.072958230972290039e-01
4.064131677150726318e-01
4.059231579303741455e-01
4.058055579662322998e-01
4.056823849678039551e-01
4.054970741271972656e-01
4.041874408721923828e-01
4.039353132247924805e-01
4.033737778663635254e-01
4.031395614147186279e-01
4.027573764324188232e-01
4.021676778793334961e-01
4.016989469528198242e-01
3.997898101806640625e-01
3.994345366954803467e-01
3.987078666687011719e-01
3.974378705024719238e-01
3.960866332054138184e-01
3.951350748538970947e-01
3.936783671379089355e-01
3.927995860576629639e-01
3.918918371200561523e-01
3.915970921516418457e-01
3.894853293895721436e-01
3.892909884452819824e-01
3.887208104133605957e-01
3.880128264427185059e-01
3.879820406436920166e-01
3.867659270763397217e-01
3.857600986957550049e-01
3.848416805267333984e-01
3.847891390323638916e-01
3.845632076263427734e-01
3.843608498573303223e-01
3.843016624450683594e-01
3.836790919303894043e-01
3.812088072299957275e-01
3.807222843170166016e-01
3.804332613945007324e-01
3.801724910736083984e-01
3.798456788063049316e-01
3.797630965709686279e-01
3.779096603393554688e-01
3.778543174266815186e-01
3.778298795223236084e-01
3.772784471511840820e-01
3.769583702087402344e-01
3.764286935329437256e-01
3.761844038963317871e-01
3.760348260402679443e-01
3.737840354442596436e-01
3.714805245399475098e-01
3.713428080081939697e-01
3.712872862815856934e-01
3.711771965026855469e-01
3.703479766845703125e-01
3.702901303768157959e-01
3.696102797985076904e-01
3.685454726219177246e-01
3.681511878967285156e-01
3.678416013717651367e-01
3.668771982192993164e-01
3.654871582984924316e-01
3.654072582721710205e-01
3.647688627243041992e-01
3.644487261772155762e-01
3.641301989555358887e-01
3.639630675315856934e-01
3.634957969188690186e-01
3.633176684379577637e-01
3.610036373138427734e-01
3.606479167938232422e-01
3.595515489578247070e-01
3.591709733009338379e-01
3.590846061706542969e-01
3.588118553161621094e-01
3.585224151611328125e-01
3.572196662425994873e-01
3.565480709075927734e-01
3.561451435089111328e-01
3.553251624107360840e-01
3.544031679630279541e-01
3.536130785942077637e-01
3.535568714141845703e-01
3.529971837997436523e-01
3.517538309097290039e-01
3.501791954040527344e-01
3.501746654510498047e-01
3.473721146583557129e-01
3.472605943679809570e-01
3.470097780227661133e-01
3.468285799026489258e-01
3.464794158935546875e-01
3.459105491638183594e-01
3.453438878059387207e-01
3.451324105262756348e-01
3.435595631599426270e-01
3.435127139091491699e-01
3.425729870796203613e-01
3.417840003967285156e-01
3.414545655250549316e-01
3.412619829177856445e-01
3.412135839462280273e-01
3.411648869514465332e-01
3.404725193977355957e-01
3.397533595561981201e-01
3.393629789352416992e-01
3.392952680587768555e-01
3.391075134277343750e-01
3.389672040939331055e-01
3.379166722297668457e-01
3.376984596252441406e-01
3.366485834121704102e-01
3.362718224525451660e-01
3.352848291397094727e-01
3.346449732780456543e-01
3.345875144004821777e-01
3.345475196838378906e-01
3.345212340354919434e-01
3.332560062408447266e-01
3.330276310443878174e-01
3.328737318515777588e-01
3.325296044349670410e-01
3.323940336704254150e-01
3.322654068470001221e-01
3.318864703178405762e-01
3.314357995986938477e-01
3.313024044036865234e-01
3.305099904537200928e-01
3.303405940532684326e-01
3.302440047264099121e-01
3.299702703952789307e-01
3.275657594203948975e-01
3.274372220039367676e-01
3.269061446189880371e-01
3.264939486980438232e-01
3.253615796566009521e-01
3.252459764480590820e-01
3.246525526046752930e-01
3.221010565757751465e-01
3.220523595809936523e-01
3.217860460281372070e-01
3.216088414192199707e-01
3.210634589195251465e-01
3.210369348526000977e-01
3.200295269489288330e-01
3.194558322429656982e-01
3.193670809268951416e-01
3.175891339778900146e-01
3.174713253974914551e-01
3.166320919990539551e-01
3.163602650165557861e-01
3.159238994121551514e-01
3.158579170703887939e-01
3.157182931900024414e-01
3.155547976493835449e-01
3.154875040054321289e-01
3.154817819595336914e-01
3.141880035400390625e-01
3.141103982925415039e-01
3.137018084526062012e-01
3.135882019996643066e-01
3.129642903804779053e-01
3.118437230587005615e-01
3.111135065555572510e-01
3.102441132068634033e-01
3.093686103820800781e-01
3.093315362930297852e-01
3.092280030250549316e-01
3.091354072093963623e-01
3.088099062442779541e-01
3.082770705223083496e-01
3.077632784843444824e-01
3.073195815086364746e-01
3.068268895149230957e-01
3.063311278820037842e-01
3.062764406204223633e-01
3.061301708221435547e-01
3.060073852539062500e-01
3.057399392127990723e-01
3.045468330383300781e-01
3.044996857643127441e-01
3.032560646533966064e-01
3.031263351440429688e-01
3.030094504356384277e-01
3.021926879882812500e-01
3.008717298507690430e-01
3.004439473152160645e-01
3.003177642822265625e-01
3.002840876579284668e-01
2.986397147178649902e-01
2.979218363761901855e-01
2.975627183914184570e-01
2.975532412528991699e-01
2.971840798854827881e-01
2.969265580177307129e-01
2.968474030494689941e-01
2.962467074394226074e-01
2.961208224296569824e-01
2.958611249923706055e-01
2.950499057769775391e-01
2.949975728988647461e-01
2.937265634536743164e-01
2.936494946479797363e-01
2.935494780540466309e-01
2.930597066879272461e-01
2.919620275497436523e-01
2.918468117713928223e-01
2.912105917930603027e-01
2.911219000816345215e-01
2.898148894309997559e-01
2.890744209289550781e-01
2.885944843292236328e-01
2.881018221378326416e-01
2.876361310482025146e-01
2.872313857078552246e-01
2.869597077369689941e-01
2.867586612701416016e-01
2.866052687168121338e-01
2.865694761276245117e-01
2.856659889221191406e-01
2.855189442634582520e-01
2.849560379981994629e-01
2.838178873062133789e-01
2.804700732231140137e-01
2.804152965545654297e-01
2.788434624671936035e-01
2.788187861442565918e-01
2.751686573028564453e-01
2.751135230064392090e-01
2.747936546802520752e-01
2.746764421463012695e-01
2.714497447013854980e-01
2.712795138359069824e-01
2.703377008438110352e-01
2.702116072177886963e-01
2.624438405036926270e-01
2.621798217296600342e-01
2.598552107810974121e-01
2.595222294330596924e-01
2.486767470836639404e-01
2.451696395874023438e-01
2.406732738018035889e-01
2.399241626262664795e-01
2.302975654602050781e-01
2.290599048137664795e-01
2.276011705398559570e-01
2.251407504081726074e-01
2.249172329902648926e-01
2.238469719886779785e-01
2.207853794097900391e-01
2.163714170455932617e-01
2.156078517436981201e-01
2.056893110275268555e-01
2.037882506847381592e-01
1.901712119579315186e-01
1.599677205085754395e-01
1.546140313148498535e-01
1.294426023960113525e-01
1.156282722949981689e-01
9.094220399856567383e-02
