0.000000000000000000e+00
2.000000000000000042e-03
2.000000000000000042e-02
2.199999999999999872e-02
2.599999999999999881e-02
2.599999999999999881e-02
2.999999999999999889e-02
2.999999999999999889e-02
3.599999999999999728e-02
3.599999999999999728e-02
3.799999999999999906e-02
3.799999999999999906e-02
4.399999999999999745e-02
4.399999999999999745e-02
5.000000000000000278e-02
5.000000000000000278e-02
5.399999999999999939e-02
5.399999999999999939e-02
5.600000000000000117e-02
7.000000000000000666e-02
7.000000000000000666e-02
7.599999999999999811e-02
7.599999999999999811e-02
7.799999999999999989e-02
7.799999999999999989e-02
8.999999999999999667e-02
8.999999999999999667e-02
9.199999999999999845e-02
9.400000000000000022e-02
9.600000000000000200e-02
9.600000000000000200e-02
9.800000000000000377e-02
9.800000000000000377e-02
1.100000000000000006e-01
1.100000000000000006e-01
1.219999999999999973e-01
1.219999999999999973e-01
1.239999999999999991e-01
1.239999999999999991e-01
1.300000000000000044e-01
1.300000000000000044e-01
1.320000000000000062e-01
1.320000000000000062e-01
1.340000000000000080e-01
1.340000000000000080e-01
1.439999999999999891e-01
1.439999999999999891e-01
1.459999999999999909e-01
1.459999999999999909e-01
1.759999999999999898e-01
1.759999999999999898e-01
2.000000000000000111e-01
2.000000000000000111e-01
2.020000000000000129e-01
2.020000000000000129e-01
2.059999999999999887e-01
2.059999999999999887e-01
2.079999999999999905e-01
2.079999999999999905e-01
2.119999999999999940e-01
2.119999999999999940e-01
2.139999999999999958e-01
2.139999999999999958e-01
2.220000000000000029e-01
2.220000000000000029e-01
2.260000000000000064e-01
2.260000000000000064e-01
2.379999999999999893e-01
2.379999999999999893e-01
2.399999999999999911e-01
2.399999999999999911e-01
2.419999999999999929e-01
2.419999999999999929e-01
2.540000000000000036e-01
2.540000000000000036e-01
2.560000000000000053e-01
2.560000000000000053e-01
2.640000000000000124e-01
2.640000000000000124e-01
2.700000000000000178e-01
2.700000000000000178e-01
2.760000000000000231e-01
2.760000000000000231e-01
2.839999999999999747e-01
2.839999999999999747e-01
2.879999999999999782e-01
2.879999999999999782e-01
2.979999999999999871e-01
2.979999999999999871e-01
3.079999999999999960e-01
3.079999999999999960e-01
3.140000000000000013e-01
3.140000000000000013e-01
3.160000000000000031e-01
3.160000000000000031e-01
3.200000000000000067e-01
3.200000000000000067e-01
3.260000000000000120e-01
3.260000000000000120e-01
3.320000000000000173e-01
3.320000000000000173e-01
3.360000000000000209e-01
3.360000000000000209e-01
3.400000000000000244e-01
3.400000000000000244e-01
3.420000000000000262e-01
3.420000000000000262e-01
3.479999999999999760e-01
3.479999999999999760e-01
3.499999999999999778e-01
3.499999999999999778e-01
3.559999999999999831e-01
3.559999999999999831e-01
3.599999999999999867e-01
3.599999999999999867e-01
3.619999999999999885e-01
3.619999999999999885e-01
3.659999999999999920e-01
3.659999999999999920e-01
3.739999999999999991e-01
3.739999999999999991e-01
3.760000000000000009e-01
3.760000000000000009e-01
3.780000000000000027e-01
3.780000000000000027e-01
3.860000000000000098e-01
3.860000000000000098e-01
3.980000000000000204e-01
3.980000000000000204e-01
4.000000000000000222e-01
4.000000000000000222e-01
4.040000000000000258e-01
4.040000000000000258e-01
4.099999999999999756e-01
4.099999999999999756e-01
4.119999999999999774e-01
4.119999999999999774e-01
4.139999999999999791e-01
4.139999999999999791e-01
4.179999999999999827e-01
4.179999999999999827e-01
4.199999999999999845e-01
4.199999999999999845e-01
4.219999999999999862e-01
4.219999999999999862e-01
4.400000000000000022e-01
4.400000000000000022e-01
4.440000000000000058e-01
4.440000000000000058e-01
4.460000000000000075e-01
4.460000000000000075e-01
4.540000000000000147e-01
4.540000000000000147e-01
4.600000000000000200e-01
4.600000000000000200e-01
4.620000000000000218e-01
4.620000000000000218e-01
4.680000000000000271e-01
4.680000000000000271e-01
4.739999999999999769e-01
4.739999999999999769e-01
4.819999999999999840e-01
4.819999999999999840e-01
4.839999999999999858e-01
4.839999999999999858e-01
4.899999999999999911e-01
4.899999999999999911e-01
4.939999999999999947e-01
4.939999999999999947e-01
5.080000000000000071e-01
5.080000000000000071e-01
5.120000000000000107e-01
5.120000000000000107e-01
5.180000000000000160e-01
5.180000000000000160e-01
5.220000000000000195e-01
5.220000000000000195e-01
5.240000000000000213e-01
5.240000000000000213e-01
5.260000000000000231e-01
5.260000000000000231e-01
5.280000000000000249e-01
5.280000000000000249e-01
5.340000000000000302e-01
5.340000000000000302e-01
5.360000000000000320e-01
5.360000000000000320e-01
5.380000000000000338e-01
5.380000000000000338e-01
5.400000000000000355e-01
5.400000000000000355e-01
5.420000000000000373e-01
5.420000000000000373e-01
5.480000000000000426e-01
5.480000000000000426e-01
5.500000000000000444e-01
5.500000000000000444e-01
5.520000000000000462e-01
5.520000000000000462e-01
5.540000000000000480e-01
5.540000000000000480e-01
5.560000000000000497e-01
5.560000000000000497e-01
5.600000000000000533e-01
5.600000000000000533e-01
5.679999999999999494e-01
5.679999999999999494e-01
5.799999999999999600e-01
5.799999999999999600e-01
5.839999999999999636e-01
5.839999999999999636e-01
5.859999999999999654e-01
5.859999999999999654e-01
5.879999999999999671e-01
5.879999999999999671e-01
5.899999999999999689e-01
5.899999999999999689e-01
5.919999999999999707e-01
5.919999999999999707e-01
5.939999999999999725e-01
5.939999999999999725e-01
6.019999999999999796e-01
6.019999999999999796e-01
6.059999999999999831e-01
6.059999999999999831e-01
6.119999999999999885e-01
6.119999999999999885e-01
6.260000000000000009e-01
6.260000000000000009e-01
6.280000000000000027e-01
6.280000000000000027e-01
6.300000000000000044e-01
6.300000000000000044e-01
6.400000000000000133e-01
6.420000000000000151e-01
6.420000000000000151e-01
6.440000000000000169e-01
6.440000000000000169e-01
6.460000000000000187e-01
6.460000000000000187e-01
6.480000000000000204e-01
6.480000000000000204e-01
6.520000000000000240e-01
6.520000000000000240e-01
6.560000000000000275e-01
6.560000000000000275e-01
6.660000000000000364e-01
6.660000000000000364e-01
6.740000000000000435e-01
6.740000000000000435e-01
6.780000000000000471e-01
6.780000000000000471e-01
6.800000000000000488e-01
6.800000000000000488e-01
6.840000000000000524e-01
6.840000000000000524e-01
6.860000000000000542e-01
6.860000000000000542e-01
6.899999999999999467e-01
6.899999999999999467e-01
6.919999999999999485e-01
6.919999999999999485e-01
6.939999999999999503e-01
6.939999999999999503e-01
6.979999999999999538e-01
6.979999999999999538e-01
7.019999999999999574e-01
7.019999999999999574e-01
7.039999999999999591e-01
7.039999999999999591e-01
7.099999999999999645e-01
7.099999999999999645e-01
7.119999999999999662e-01
7.119999999999999662e-01
7.139999999999999680e-01
7.139999999999999680e-01
7.159999999999999698e-01
7.159999999999999698e-01
7.179999999999999716e-01
7.179999999999999716e-01
7.199999999999999734e-01
7.199999999999999734e-01
7.239999999999999769e-01
7.239999999999999769e-01
7.259999999999999787e-01
7.259999999999999787e-01
7.279999999999999805e-01
7.279999999999999805e-01
7.299999999999999822e-01
7.299999999999999822e-01
7.399999999999999911e-01
7.399999999999999911e-01
7.439999999999999947e-01
7.439999999999999947e-01
7.459999999999999964e-01
7.459999999999999964e-01
7.500000000000000000e-01
7.500000000000000000e-01
7.520000000000000018e-01
7.520000000000000018e-01
7.540000000000000036e-01
7.540000000000000036e-01
7.560000000000000053e-01
7.560000000000000053e-01
7.620000000000000107e-01
7.620000000000000107e-01
7.660000000000000142e-01
7.660000000000000142e-01
7.680000000000000160e-01
7.680000000000000160e-01
7.760000000000000231e-01
7.760000000000000231e-01
7.780000000000000249e-01
7.780000000000000249e-01
7.800000000000000266e-01
7.800000000000000266e-01
7.820000000000000284e-01
7.820000000000000284e-01
7.860000000000000320e-01
7.860000000000000320e-01
7.880000000000000338e-01
7.880000000000000338e-01
7.900000000000000355e-01
7.900000000000000355e-01
7.960000000000000409e-01
7.960000000000000409e-01
7.980000000000000426e-01
7.980000000000000426e-01
8.000000000000000444e-01
8.000000000000000444e-01
8.060000000000000497e-01
8.060000000000000497e-01
8.080000000000000515e-01
8.080000000000000515e-01
8.100000000000000533e-01
8.100000000000000533e-01
8.120000000000000551e-01
8.120000000000000551e-01
8.139999999999999458e-01
8.139999999999999458e-01
8.179999999999999494e-01
8.179999999999999494e-01
8.219999999999999529e-01
8.219999999999999529e-01
8.259999999999999565e-01
8.259999999999999565e-01
8.279999999999999583e-01
8.279999999999999583e-01
8.299999999999999600e-01
8.299999999999999600e-01
8.319999999999999618e-01
8.319999999999999618e-01
8.339999999999999636e-01
8.339999999999999636e-01
8.359999999999999654e-01
8.359999999999999654e-01
8.399999999999999689e-01
8.399999999999999689e-01
8.439999999999999725e-01
8.439999999999999725e-01
8.459999999999999742e-01
8.459999999999999742e-01
8.479999999999999760e-01
8.479999999999999760e-01
8.539999999999999813e-01
8.539999999999999813e-01
8.559999999999999831e-01
8.559999999999999831e-01
8.579999999999999849e-01
8.579999999999999849e-01
8.599999999999999867e-01
8.599999999999999867e-01
8.619999999999999885e-01
8.619999999999999885e-01
8.639999999999999902e-01
8.639999999999999902e-01
8.679999999999999938e-01
8.679999999999999938e-01
8.699999999999999956e-01
8.699999999999999956e-01
8.719999999999999973e-01
8.719999999999999973e-01
8.739999999999999991e-01
8.739999999999999991e-01
8.760000000000000009e-01
8.760000000000000009e-01
8.820000000000000062e-01
8.820000000000000062e-01
8.840000000000000080e-01
8.840000000000000080e-01
8.860000000000000098e-01
8.860000000000000098e-01
8.880000000000000115e-01
8.880000000000000115e-01
8.900000000000000133e-01
8.900000000000000133e-01
8.920000000000000151e-01
8.920000000000000151e-01
8.940000000000000169e-01
8.940000000000000169e-01
8.960000000000000187e-01
8.960000000000000187e-01
8.980000000000000204e-01
8.980000000000000204e-01
9.000000000000000222e-01
9.000000000000000222e-01
9.020000000000000240e-01
9.020000000000000240e-01
9.060000000000000275e-01
9.060000000000000275e-01
9.080000000000000293e-01
9.080000000000000293e-01
9.100000000000000311e-01
9.100000000000000311e-01
9.120000000000000329e-01
9.120000000000000329e-01
9.140000000000000346e-01
9.140000000000000346e-01
9.220000000000000417e-01
9.220000000000000417e-01
9.260000000000000453e-01
9.260000000000000453e-01
9.300000000000000488e-01
9.300000000000000488e-01
9.320000000000000506e-01
9.320000000000000506e-01
9.360000000000000542e-01
9.360000000000000542e-01
9.379999999999999449e-01
9.379999999999999449e-01
9.399999999999999467e-01
9.399999999999999467e-01
9.479999999999999538e-01
9.479999999999999538e-01
9.519999999999999574e-01
9.519999999999999574e-01
9.539999999999999591e-01
9.539999999999999591e-01
9.579999999999999627e-01
9.579999999999999627e-01
9.599999999999999645e-01
9.599999999999999645e-01
9.679999999999999716e-01
9.679999999999999716e-01
9.699999999999999734e-01
9.699999999999999734e-01
9.719999999999999751e-01
9.719999999999999751e-01
9.739999999999999769e-01
9.739999999999999769e-01
9.759999999999999787e-01
9.759999999999999787e-01
9.799999999999999822e-01
9.799999999999999822e-01
9.819999999999999840e-01
9.819999999999999840e-01
9.839999999999999858e-01
9.839999999999999858e-01
9.859999999999999876e-01
9.859999999999999876e-01
9.879999999999999893e-01
9.879999999999999893e-01
9.899999999999999911e-01
9.899999999999999911e-01
9.939999999999999947e-01
9.939999999999999947e-01
1.000000000000000000e+00
