1.971140205860137939e-01
7.507389783859252930e-01
1.000000000000000000e+00
1.814112067222595215e-01
1.794579327106475830e-01
3.487240672111511230e-01
5.713814496994018555e-01
4.129494428634643555e-01
2.333283126354217529e-01
8.900859951972961426e-01
2.895845174789428711e-01
9.558769464492797852e-01
9.999637007713317871e-01
2.180207669734954834e-01
6.142796874046325684e-01
1.000000000000000000e+00
1.886163949966430664e-01
1.000000000000000000e+00
3.617550134658813477e-01
9.999962449073791504e-01
1.959322392940521240e-01
2.033814489841461182e-01
2.863584160804748535e-01
3.025831580162048340e-01
9.998174905776977539e-01
4.107221662998199463e-01
1.833214461803436279e-01
1.000000000000000000e+00
9.994872212409973145e-01
5.187267065048217773e-01
9.999842643737792969e-01
2.581032514572143555e-01
9.921816587448120117e-01
2.257541120052337646e-01
1.980034112930297852e-01
3.047201037406921387e-01
3.174628615379333496e-01
2.159715890884399414e-01
9.367840290069580078e-01
8.943921923637390137e-01
3.774520754814147949e-01
9.086113572120666504e-01
1.000000000000000000e+00
9.999946355819702148e-01
4.354397654533386230e-01
2.141352593898773193e-01
9.999990463256835938e-01
6.713448762893676758e-01
9.997770786285400391e-01
9.974265098571777344e-01
5.265960097312927246e-01
1.000000000000000000e+00
9.998133182525634766e-01
2.140932083129882812e-01
1.810947656631469727e-01
2.412514388561248779e-01
1.779817044734954834e-01
7.416545748710632324e-01
2.063730955123901367e-01
9.998401403427124023e-01
9.342724084854125977e-01
6.984339356422424316e-01
2.138944864273071289e-01
1.000000000000000000e+00
1.907910406589508057e-01
8.945645689964294434e-01
2.142670452594757080e-01
1.850188374519348145e-01
2.475542426109313965e-01
9.999997615814208984e-01
1.822924613952636719e-01
2.377116978168487549e-01
9.996961951255798340e-01
8.936035633087158203e-01
1.944885253906250000e-01
2.702228426933288574e-01
2.358522117137908936e-01
6.487056016921997070e-01
9.999943375587463379e-01
1.795910000801086426e-01
2.501942515373229980e-01
9.984256029129028320e-01
2.196685075759887695e-01
9.999744892120361328e-01
1.000000000000000000e+00
9.999417066574096680e-01
9.999668002128601074e-01
2.124900519847869873e-01
2.911331653594970703e-01
1.000000000000000000e+00
1.000000000000000000e+00
3.308729529380798340e-01
9.998790025711059570e-01
1.000000000000000000e+00
9.655266404151916504e-01
9.988908767700195312e-01
2.300180196762084961e-01
9.994748830795288086e-01
9.998728632926940918e-01
9.999880790710449219e-01
1.000000000000000000e+00
6.571620106697082520e-01
9.998859167098999023e-01
2.031900882720947266e-01
4.760073125362396240e-01
1.886157095432281494e-01
2.163270413875579834e-01
2.337860465049743652e-01
1.828102469444274902e-01
1.824170649051666260e-01
1.910915970802307129e-01
4.641877710819244385e-01
9.826266765594482422e-01
9.474050402641296387e-01
9.984452128410339355e-01
1.867448389530181885e-01
3.442465960979461670e-01
2.494684457778930664e-01
3.510715365409851074e-01
1.843284070491790771e-01
1.000000000000000000e+00
9.999881982803344727e-01
1.000000000000000000e+00
9.172770380973815918e-01
2.157358229160308838e-01
6.656365394592285156e-01
5.002480745315551758e-01
1.000000000000000000e+00
9.999418258666992188e-01
9.999616146087646484e-01
5.366569161415100098e-01
1.000000000000000000e+00
2.555747032165527344e-01
2.091039717197418213e-01
2.250348329544067383e-01
9.956520199775695801e-01
3.169504404067993164e-01
1.000000000000000000e+00
1.000000000000000000e+00
9.860757589340209961e-01
7.193413376808166504e-01
1.000000000000000000e+00
2.425277233123779297e-01
9.050445556640625000e-01
1.851615905761718750e-01
7.953637242317199707e-01
1.000000000000000000e+00
2.916173338890075684e-01
9.922518730163574219e-01
1.930411458015441895e-01
2.177361547946929932e-01
6.245222687721252441e-01
1.000000000000000000e+00
6.587992906570434570e-01
2.291232347488403320e-01
1.000000000000000000e+00
1.000000000000000000e+00
8.070945739746093750e-01
2.034534215927124023e-01
1.837269663810729980e-01
9.999953508377075195e-01
9.999564886093139648e-01
9.999366998672485352e-01
9.953171610832214355e-01
9.683070182800292969e-01
8.214095234870910645e-01
9.997750520706176758e-01
8.967002630233764648e-01
9.994055032730102539e-01
9.870815277099609375e-01
5.404781103134155273e-01
8.649343848228454590e-01
9.999948143959045410e-01
9.998509883880615234e-01
1.988042294979095459e-01
8.737118840217590332e-01
2.330747544765472412e-01
9.999803304672241211e-01
9.999846220016479492e-01
2.242528498172760010e-01
6.724436283111572266e-01
1.969175934791564941e-01
6.353912353515625000e-01
2.262652814388275146e-01
1.000000000000000000e+00
9.990244507789611816e-01
5.155230760574340820e-01
2.039317190647125244e-01
1.897709965705871582e-01
9.993727207183837891e-01
9.999837875366210938e-01
1.883049607276916504e-01
2.049679756164550781e-01
2.000247240066528320e-01
3.609904050827026367e-01
1.000000000000000000e+00
9.912542104721069336e-01
7.921645641326904297e-01
1.000000000000000000e+00
1.842946708202362061e-01
9.994770288467407227e-01
2.981847226619720459e-01
9.999973773956298828e-01
1.864066421985626221e-01
9.998581409454345703e-01
5.017751455307006836e-01
9.998031854629516602e-01
3.342928886413574219e-01
1.953846216201782227e-01
4.115481376647949219e-01
1.830925941467285156e-01
1.829121112823486328e-01
3.700652122497558594e-01
9.998455643653869629e-01
2.457110285758972168e-01
2.974791824817657471e-01
1.971794366836547852e-01
2.102396190166473389e-01
3.874665498733520508e-01
2.738251388072967529e-01
1.804147958755493164e-01
1.000000000000000000e+00
1.840549409389495850e-01
9.999195337295532227e-01
9.931697845458984375e-01
1.000000000000000000e+00
4.489495754241943359e-01
9.762642383575439453e-01
1.910062134265899658e-01
2.740508019924163818e-01
4.735441803932189941e-01
1.000000000000000000e+00
9.993113875389099121e-01
1.000000000000000000e+00
6.565806865692138672e-01
2.432968020439147949e-01
5.789292454719543457e-01
1.916876733303070068e-01
9.999585747718811035e-01
2.558956742286682129e-01
9.786478281021118164e-01
8.292818665504455566e-01
9.999974370002746582e-01
1.000000000000000000e+00
2.265497446060180664e-01
9.996429681777954102e-01
4.236322045326232910e-01
1.000000000000000000e+00
2.801728546619415283e-01
9.701855182647705078e-01
9.999920129776000977e-01
3.499070107936859131e-01
9.999132156372070312e-01
9.962491989135742188e-01
1.873123943805694580e-01
2.675926685333251953e-01
9.997594952583312988e-01
2.303156852722167969e-01
2.697690725326538086e-01
4.512516856193542480e-01
1.927299499511718750e-01
1.000000000000000000e+00
4.515899419784545898e-01
2.229954600334167480e-01
2.384656071662902832e-01
1.889969706535339355e-01
2.067801654338836670e-01
1.820796132087707520e-01
9.960032701492309570e-01
2.253904640674591064e-01
2.554062008857727051e-01
9.999890327453613281e-01
9.508916139602661133e-01
3.209665119647979736e-01
1.903596520423889160e-01
3.504023849964141846e-01
4.131915271282196045e-01
9.999983906745910645e-01
2.377615571022033691e-01
1.000000000000000000e+00
9.988316893577575684e-01
9.978781342506408691e-01
9.999997019767761230e-01
2.361199855804443359e-01
4.469256103038787842e-01
2.123690545558929443e-01
2.515986561775207520e-01
4.123104512691497803e-01
6.810581088066101074e-01
2.079582214355468750e-01
1.000000000000000000e+00
9.790866374969482422e-01
3.496136963367462158e-01
9.999969601631164551e-01
1.947106122970581055e-01
1.000000000000000000e+00
9.908598661422729492e-01
6.324445605278015137e-01
9.982209205627441406e-01
2.325639724731445312e-01
3.596875071525573730e-01
9.999685287475585938e-01
4.379311501979827881e-01
9.999977350234985352e-01
1.849646270275115967e-01
4.205392301082611084e-01
2.818591594696044922e-01
1.000000000000000000e+00
1.000000000000000000e+00
3.252344131469726562e-01
2.022130191326141357e-01
3.068112134933471680e-01
1.917474269866943359e-01
1.783274114131927490e-01
9.999995231628417969e-01
9.999914765357971191e-01
2.150379717350006104e-01
4.514932632446289062e-01
9.999475479125976562e-01
9.984652996063232422e-01
1.894390881061553955e-01
2.049557864665985107e-01
1.000000000000000000e+00
7.419983744621276855e-01
5.252991914749145508e-01
9.992408752441406250e-01
1.000000000000000000e+00
2.813448905944824219e-01
1.779280304908752441e-01
6.916095018386840820e-01
9.997088313102722168e-01
2.137987017631530762e-01
9.999997615814208984e-01
9.999805092811584473e-01
4.313928186893463135e-01
8.750985860824584961e-01
6.642664670944213867e-01
9.973220229148864746e-01
8.836520910263061523e-01
1.832781136035919189e-01
9.999884963035583496e-01
2.106316387653350830e-01
1.898852884769439697e-01
2.962344884872436523e-01
9.999861121177673340e-01
9.999971389770507812e-01
2.087071835994720459e-01
1.985721588134765625e-01
2.771921753883361816e-01
4.340851306915283203e-01
7.565145492553710938e-01
1.899314522743225098e-01
8.005518913269042969e-01
1.865243911743164062e-01
9.975218176841735840e-01
9.696378111839294434e-01
9.256551265716552734e-01
9.999438524246215820e-01
9.999764561653137207e-01
9.779283404350280762e-01
1.997503042221069336e-01
9.455018043518066406e-01
4.313323199748992920e-01
1.961339116096496582e-01
2.000748217105865479e-01
5.099377632141113281e-01
9.826683402061462402e-01
9.143217802047729492e-01
2.404586076736450195e-01
1.000000000000000000e+00
9.988801479339599609e-01
9.999375343322753906e-01
1.981208622455596924e-01
4.388633668422698975e-01
1.779720783233642578e-01
9.090517759323120117e-01
9.999095797538757324e-01
3.473773002624511719e-01
9.999744892120361328e-01
9.280530214309692383e-01
1.866594552993774414e-01
9.998820424079895020e-01
9.730459451675415039e-01
9.999998807907104492e-01
2.206844687461853027e-01
1.780431866645812988e-01
8.785619735717773438e-01
9.404894113540649414e-01
8.215487599372863770e-01
2.069821059703826904e-01
4.823432266712188721e-01
1.875741183757781982e-01
2.928371429443359375e-01
9.999632835388183594e-01
9.900679588317871094e-01
4.187278449535369873e-01
2.080509364604949951e-01
3.918786644935607910e-01
3.119611144065856934e-01
4.745805263519287109e-01
1.811936199665069580e-01
2.296297848224639893e-01
1.920077502727508545e-01
3.263931572437286377e-01
9.999701976776123047e-01
9.989357590675354004e-01
9.996964931488037109e-01
7.840840220451354980e-01
2.405495047569274902e-01
8.515063524246215820e-01
2.134322822093963623e-01
9.996345043182373047e-01
2.200137674808502197e-01
9.926263093948364258e-01
9.882301092147827148e-01
2.615647315979003906e-01
2.291364073753356934e-01
9.999790191650390625e-01
1.000000000000000000e+00
9.204083681106567383e-01
6.898664236068725586e-01
1.000000000000000000e+00
1.812908053398132324e-01
5.920134782791137695e-01
8.766208887100219727e-01
9.376766681671142578e-01
2.520572245121002197e-01
9.998017549514770508e-01
9.999616742134094238e-01
1.000000000000000000e+00
9.999886751174926758e-01
2.096953094005584717e-01
2.170958817005157471e-01
1.860174536705017090e-01
2.101457118988037109e-01
8.247714042663574219e-01
8.834724426269531250e-01
9.999995231628417969e-01
2.945920825004577637e-01
2.205092906951904297e-01
7.140000462532043457e-01
9.999904632568359375e-01
1.802816390991210938e-01
3.094914555549621582e-01
2.260851263999938965e-01
2.151775062084197998e-01
9.965504407882690430e-01
2.342603206634521484e-01
7.656612396240234375e-01
2.094358801841735840e-01
2.045426070690155029e-01
9.104806184768676758e-01
9.837384223937988281e-01
4.010662436485290527e-01
9.989646673202514648e-01
7.223712801933288574e-01
6.226338744163513184e-01
9.999260902404785156e-01
9.999923706054687500e-01
2.391369342803955078e-01
2.263097167015075684e-01
3.534336686134338379e-01
1.815747022628784180e-01
9.999973773956298828e-01
9.999988079071044922e-01
9.999845027923583984e-01
1.000000000000000000e+00
9.999567270278930664e-01
9.999911785125732422e-01
1.832304000854492188e-01
2.051743865013122559e-01
2.637930512428283691e-01
2.616240382194519043e-01
9.999737739562988281e-01
2.203050851821899414e-01
1.935857832431793213e-01
9.819393754005432129e-01
1.888745725154876709e-01
2.078296244144439697e-01
1.000000000000000000e+00
2.840262055397033691e-01
9.997400641441345215e-01
9.997410178184509277e-01
2.044095695018768311e-01
2.220931351184844971e-01
2.575492858886718750e-01
4.197734892368316650e-01
5.200887918472290039e-01
7.890610098838806152e-01
9.999303817749023438e-01
9.999673366546630859e-01
1.000000000000000000e+00
9.965355396270751953e-01
9.983395338058471680e-01
8.354779481887817383e-01
2.381476163864135742e-01
6.497430801391601562e-01
2.310267090797424316e-01
2.058317661285400391e-01
2.587804794311523438e-01
1.846314966678619385e-01
9.999998211860656738e-01
9.999449253082275391e-01
6.592783927917480469e-01
9.579339027404785156e-01
6.432341933250427246e-01
2.446544766426086426e-01
9.457609653472900391e-01
9.914973974227905273e-01
2.008542120456695557e-01
1.000000000000000000e+00
2.112699449062347412e-01
6.942237615585327148e-01
5.056229829788208008e-01
1.000000000000000000e+00
3.154799938201904297e-01
1.000000000000000000e+00
9.979825019836425781e-01
9.949765205383300781e-01
3.608335852622985840e-01
7.092316746711730957e-01
3.967120945453643799e-01
9.998467564582824707e-01
9.998793601989746094e-01
1.932949125766754150e-01
9.999989271163940430e-01
3.952448070049285889e-01
9.999990463256835938e-01
7.528244853019714355e-01
2.680873274803161621e-01
2.085901200771331787e-01
8.016673326492309570e-01
9.981888532638549805e-01
9.839819669723510742e-01
9.714641571044921875e-01
8.279860019683837891e-01
9.824557304382324219e-01
1.988214850425720215e-01
1.811954975128173828e-01
9.024447202682495117e-01
9.999989867210388184e-01
9.998163580894470215e-01
4.250850081443786621e-01
7.707945108413696289e-01
9.885054826736450195e-01
9.999988079071044922e-01
1.882486343383789062e-01
2.566006183624267578e-01
3.911754190921783447e-01
2.048845291137695312e-01
1.942490339279174805e-01
9.997657537460327148e-01
2.043351233005523682e-01
2.620808184146881104e-01
9.978862404823303223e-01
3.363310694694519043e-01
9.999694824218750000e-01
9.997806549072265625e-01
4.537046253681182861e-01
7.516395449638366699e-01
9.940023422241210938e-01
7.291750311851501465e-01
2.379600703716278076e-01
9.999840259552001953e-01
9.039244651794433594e-01
4.336527287960052490e-01
9.998723864555358887e-01
8.441095948219299316e-01
9.984781742095947266e-01
2.241237759590148926e-01
1.000000000000000000e+00
9.982206821441650391e-01
4.510373473167419434e-01
9.979491233825683594e-01
3.468899428844451904e-01
1.807613372802734375e-01
9.998901486396789551e-01
9.998061656951904297e-01
9.922410249710083008e-01
5.268555283546447754e-01
4.680956304073333740e-01
3.245160579681396484e-01
9.995132684707641602e-01
8.716540336608886719e-01
2.245935797691345215e-01
5.706111788749694824e-01
2.103601098060607910e-01
9.834952354431152344e-01
9.960305094718933105e-01
6.784436702728271484e-01
5.932145714759826660e-01
6.683327555656433105e-01
1.000000000000000000e+00
9.944918155670166016e-01
1.784442067146301270e-01
4.905027747154235840e-01
1.810819506645202637e-01
9.997453689575195312e-01
2.827744483947753906e-01
9.923652410507202148e-01
9.967262744903564453e-01
1.918807029724121094e-01
7.583643198013305664e-01
9.609912037849426270e-01
2.519562542438507080e-01
3.603036403656005859e-01
1.929243206977844238e-01
1.781494915485382080e-01
5.854449272155761719e-01
1.000000000000000000e+00
1.881970167160034180e-01
9.982205033302307129e-01
1.000000000000000000e+00
7.631407976150512695e-01
9.999981522560119629e-01
1.784297525882720947e-01
2.243204414844512939e-01
3.546699285507202148e-01
9.196026325225830078e-01
2.715828418731689453e-01
1.830451190471649170e-01
1.930990219116210938e-01
2.486420273780822754e-01
3.179531097412109375e-01
6.046354770660400391e-01
2.019511461257934570e-01
2.117375135421752930e-01
1.904598176479339600e-01
2.209280431270599365e-01
1.919115483760833740e-01
3.411319851875305176e-01
1.926221251487731934e-01
1.938354969024658203e-01
1.990812420845031738e-01
6.052137017250061035e-01
2.647984325885772705e-01
2.548246085643768311e-01
1.860051751136779785e-01
4.489386379718780518e-01
1.940319240093231201e-01
2.015987336635589600e-01
9.995932579040527344e-01
2.188833355903625488e-01
2.071968615055084229e-01
2.365502715110778809e-01
2.454644143581390381e-01
3.756393194198608398e-01
4.076519012451171875e-01
1.887326240539550781e-01
2.855249047279357910e-01
1.817713975906372070e-01
9.059808254241943359e-01
1.981787383556365967e-01
9.862700700759887695e-01
3.034523129463195801e-01
1.838149428367614746e-01
2.761999070644378662e-01
2.316241264343261719e-01
2.092281877994537354e-01
2.424684762954711914e-01
2.588242292404174805e-01
1.796459555625915527e-01
1.820527911186218262e-01
2.024480104446411133e-01
4.842096567153930664e-01
2.892001271247863770e-01
2.246527969837188721e-01
3.387034535408020020e-01
2.481268346309661865e-01
1.979407668113708496e-01
3.139606714248657227e-01
1.875390708446502686e-01
2.415069639682769775e-01
3.035615384578704834e-01
8.348966836929321289e-01
2.806722521781921387e-01
1.903775036334991455e-01
2.391012012958526611e-01
2.172800898551940918e-01
2.027035355567932129e-01
1.928417384624481201e-01
3.501566052436828613e-01
1.814510822296142578e-01
4.884828925132751465e-01
3.974987864494323730e-01
1.781214773654937744e-01
4.295601844787597656e-01
1.883434951305389404e-01
2.048569321632385254e-01
2.144252955913543701e-01
9.076048731803894043e-01
2.322244346141815186e-01
2.015047073364257812e-01
4.828376770019531250e-01
1.792048215866088867e-01
1.910204589366912842e-01
2.145184874534606934e-01
6.345514059066772461e-01
2.149935066699981689e-01
2.108856737613677979e-01
9.829049110412597656e-01
1.902848482131958008e-01
2.365894615650177002e-01
2.581503987312316895e-01
1.985100209712982178e-01
2.613519430160522461e-01
1.970753371715545654e-01
2.942993342876434326e-01
3.451113700866699219e-01
2.507706284523010254e-01
1.000000000000000000e+00
1.928500533103942871e-01
1.881446242332458496e-01
1.888626515865325928e-01
4.992857277393341064e-01
1.975455880165100098e-01
3.490625023841857910e-01
2.257806956768035889e-01
1.852727234363555908e-01
2.745253443717956543e-01
1.899568736553192139e-01
9.606426954269409180e-01
1.874300241470336914e-01
3.908602595329284668e-01
7.991170883178710938e-01
2.232970297336578369e-01
3.969712257385253906e-01
2.367024123668670654e-01
1.888163983821868896e-01
2.279408276081085205e-01
2.215636372566223145e-01
2.408112585544586182e-01
3.931718170642852783e-01
2.305753529071807861e-01
2.578333616256713867e-01
2.003673613071441650e-01
3.539304733276367188e-01
1.947291493415832520e-01
3.689867854118347168e-01
5.697589516639709473e-01
1.800831258296966553e-01
2.083856165409088135e-01
2.219076454639434814e-01
1.853565871715545654e-01
1.923128664493560791e-01
1.922741830348968506e-01
3.582205176353454590e-01
2.017197906970977783e-01
2.109307050704956055e-01
1.919331252574920654e-01
2.236683666706085205e-01
2.201379835605621338e-01
1.790672540664672852e-01
2.665992975234985352e-01
2.370280027389526367e-01
1.915213465690612793e-01
1.869830191135406494e-01
2.444474101066589355e-01
1.928963065147399902e-01
1.944338381290435791e-01
1.812483072280883789e-01
2.672849297523498535e-01
1.841085553169250488e-01
1.798622608184814453e-01
1.901856660842895508e-01
2.448819279670715332e-01
2.462089955806732178e-01
3.175837099552154541e-01
1.985357999801635742e-01
2.172286212444305420e-01
2.146141231060028076e-01
3.687945008277893066e-01
3.369500339031219482e-01
3.651273846626281738e-01
7.243440747261047363e-01
1.820957362651824951e-01
2.297523915767669678e-01
1.876442730426788330e-01
3.274761736392974854e-01
3.334378898143768311e-01
5.161140561103820801e-01
1.828914582729339600e-01
1.785807311534881592e-01
2.008952200412750244e-01
2.712855339050292969e-01
2.941280603408813477e-01
2.617071866989135742e-01
1.786420941352844238e-01
3.678379952907562256e-01
1.890037655830383301e-01
2.340585291385650635e-01
1.853280961513519287e-01
3.114702999591827393e-01
1.867158114910125732e-01
3.787585794925689697e-01
3.822096288204193115e-01
3.396220207214355469e-01
1.964803040027618408e-01
1.823275387287139893e-01
1.837404370307922363e-01
2.179024219512939453e-01
5.053913593292236328e-01
2.392544150352478027e-01
1.812307536602020264e-01
2.394915521144866943e-01
1.846263408660888672e-01
2.100169062614440918e-01
4.508680999279022217e-01
6.180999279022216797e-01
2.490425407886505127e-01
1.860179603099822998e-01
3.190873265266418457e-01
1.922826468944549561e-01
1.851243674755096436e-01
2.356820702552795410e-01
2.544800043106079102e-01
2.280244827270507812e-01
2.057959437370300293e-01
4.307440221309661865e-01
2.190219163894653320e-01
5.729440450668334961e-01
1.847957968711853027e-01
2.552114129066467285e-01
8.315791487693786621e-01
2.177269756793975830e-01
6.897882819175720215e-01
2.499419152736663818e-01
2.036116719245910645e-01
6.249626874923706055e-01
2.622908651828765869e-01
1.852143108844757080e-01
2.085918486118316650e-01
2.491768896579742432e-01
9.966022968292236328e-01
2.073339223861694336e-01
3.533377051353454590e-01
2.578623294830322266e-01
4.044968783855438232e-01
1.956132650375366211e-01
3.888042569160461426e-01
1.918304860591888428e-01
2.251860201358795166e-01
3.181534707546234131e-01
2.265955507755279541e-01
2.480898797512054443e-01
1.876147091388702393e-01
3.172444105148315430e-01
3.071079254150390625e-01
2.765624523162841797e-01
1.950340569019317627e-01
2.175587415695190430e-01
3.631697297096252441e-01
2.510628700256347656e-01
1.870029270648956299e-01
2.053474187850952148e-01
1.810466349124908447e-01
2.786670923233032227e-01
1.946648657321929932e-01
3.006766438484191895e-01
4.189157485961914062e-01
1.934748589992523193e-01
1.886503398418426514e-01
5.103278160095214844e-01
3.946264684200286865e-01
8.371428251266479492e-01
6.493704319000244141e-01
1.781453192234039307e-01
8.286777734756469727e-01
1.823553144931793213e-01
1.923620998859405518e-01
1.910834908485412598e-01
2.246534228324890137e-01
5.863400101661682129e-01
2.813719511032104492e-01
4.197615683078765869e-01
2.284496128559112549e-01
2.705762982368469238e-01
1.783215403556823730e-01
1.792488694190979004e-01
2.199975848197937012e-01
8.929905891418457031e-01
4.113829135894775391e-01
3.256035447120666504e-01
1.795198321342468262e-01
2.031783163547515869e-01
1.803686916828155518e-01
2.498663365840911865e-01
1.883574426174163818e-01
1.783751845359802246e-01
2.431378960609436035e-01
1.835115253925323486e-01
1.819556355476379395e-01
5.425770878791809082e-01
2.575180530548095703e-01
2.398433685302734375e-01
1.820496320724487305e-01
1.865407228469848633e-01
1.843033432960510254e-01
1.849088072776794434e-01
1.998594999313354492e-01
2.183816432952880859e-01
1.788082718849182129e-01
2.171499729156494141e-01
1.846699118614196777e-01
1.832168996334075928e-01
1.982881724834442139e-01
2.287478744983673096e-01
1.967967450618743896e-01
1.887817978858947754e-01
1.952849924564361572e-01
1.799197494983673096e-01
1.996518671512603760e-01
1.780174076557159424e-01
2.103599905967712402e-01
1.932328641414642334e-01
1.798941195011138916e-01
1.872189939022064209e-01
1.829595863819122314e-01
1.917969584465026855e-01
1.822098791599273682e-01
1.882011592388153076e-01
3.829832077026367188e-01
9.461476802825927734e-01
3.555161058902740479e-01
1.897519528865814209e-01
5.971740484237670898e-01
2.586961984634399414e-01
7.445092797279357910e-01
4.317956268787384033e-01
2.730871438980102539e-01
5.618518590927124023e-01
3.962402045726776123e-01
2.682806849479675293e-01
2.478920519351959229e-01
2.746875286102294922e-01
1.832797229290008545e-01
9.399442672729492188e-01
4.658358395099639893e-01
2.017346918582916260e-01
1.888238787651062012e-01
2.870582938194274902e-01
6.317490935325622559e-01
2.420243918895721436e-01
9.810131788253784180e-01
9.672710299491882324e-01
2.315940856933593750e-01
9.841845035552978516e-01
5.512353777885437012e-01
4.456456005573272705e-01
2.137912809848785400e-01
1.987513005733489990e-01
3.737984895706176758e-01
2.706500291824340820e-01
2.924747467041015625e-01
1.799948513507843018e-01
2.487223446369171143e-01
2.003148794174194336e-01
8.791528940200805664e-01
7.524095773696899414e-01
2.066866755485534668e-01
3.167250156402587891e-01
2.090452611446380615e-01
4.405214190483093262e-01
2.835971415042877197e-01
3.397405445575714111e-01
2.467014193534851074e-01
2.674397826194763184e-01
4.062867462635040283e-01
9.176155328750610352e-01
4.194545745849609375e-01
1.790379285812377930e-01
1.843029558658599854e-01
2.527300119400024414e-01
1.820008754730224609e-01
2.095802426338195801e-01
3.600615262985229492e-01
1.841686964035034180e-01
1.892438530921936035e-01
1.803230345249176025e-01
1.959092915058135986e-01
5.491266250610351562e-01
2.058136165142059326e-01
2.302947938442230225e-01
2.032062709331512451e-01
2.320159673690795898e-01
4.984821081161499023e-01
8.984311819076538086e-01
2.120563685894012451e-01
1.838904321193695068e-01
2.648776769638061523e-01
1.815340518951416016e-01
2.247145771980285645e-01
4.250276684761047363e-01
5.618880987167358398e-01
1.873044371604919434e-01
2.426147758960723877e-01
9.448831081390380859e-01
8.073680400848388672e-01
1.848836243152618408e-01
4.802452325820922852e-01
3.083949387073516846e-01
2.412705421447753906e-01
2.167896330356597900e-01
2.939866483211517334e-01
1.857538521289825439e-01
2.356477677822113037e-01
9.999986886978149414e-01
2.405186891555786133e-01
2.790283560752868652e-01
2.346283197402954102e-01
2.367410957813262939e-01
4.623108506202697754e-01
3.692366778850555420e-01
2.515456676483154297e-01
3.417081236839294434e-01
3.486542701721191406e-01
3.811815381050109863e-01
2.346524000167846680e-01
2.213428616523742676e-01
2.756962180137634277e-01
2.784474790096282959e-01
3.595612049102783203e-01
2.597560286521911621e-01
3.634482622146606445e-01
2.138323187828063965e-01
3.128730356693267822e-01
2.380357682704925537e-01
2.761654853820800781e-01
3.444249331951141357e-01
2.319617867469787598e-01
1.949947476387023926e-01
2.185463607311248779e-01
5.970632433891296387e-01
2.758699655532836914e-01
1.880350708961486816e-01
1.958165168762207031e-01
2.703246474266052246e-01
1.827449202537536621e-01
4.315792918205261230e-01
6.614282727241516113e-01
1.824185252189636230e-01
1.828726232051849365e-01
2.103502154350280762e-01
2.915529012680053711e-01
2.091597318649291992e-01
1.903434097766876221e-01
1.823427677154541016e-01
1.883953213691711426e-01
2.501096427440643311e-01
1.999666094779968262e-01
2.221144139766693115e-01
2.056749761104583740e-01
1.788600087165832520e-01
1.970700919628143311e-01
3.445042967796325684e-01
2.082532346248626709e-01
2.086941301822662354e-01
3.850348591804504395e-01
2.820920348167419434e-01
3.247455656528472900e-01
6.199152469635009766e-01
2.445604801177978516e-01
1.927894353866577148e-01
2.976565062999725342e-01
2.001426815986633301e-01
3.992192745208740234e-01
4.726702272891998291e-01
1.836159229278564453e-01
2.479520738124847412e-01
2.516633272171020508e-01
2.063859403133392334e-01
2.788379192352294922e-01
2.052834928035736084e-01
3.478299975395202637e-01
2.000443041324615479e-01
5.277281403541564941e-01
2.199916839599609375e-01
1.840760111808776855e-01
2.063279449939727783e-01
1.853407025337219238e-01
2.029248178005218506e-01
1.822997033596038818e-01
2.156148254871368408e-01
2.024342119693756104e-01
2.270396053791046143e-01
2.221941947937011719e-01
7.120834589004516602e-01
3.839033246040344238e-01
2.702581882476806641e-01
2.879666686058044434e-01
2.921616435050964355e-01
2.630328536033630371e-01
2.407704293727874756e-01
1.922409236431121826e-01
1.888560652732849121e-01
2.136040925979614258e-01
2.048891186714172363e-01
7.704432606697082520e-01
2.248542606830596924e-01
5.823155045509338379e-01
3.040124773979187012e-01
2.497548162937164307e-01
9.988669157028198242e-01
3.633511960506439209e-01
3.450408577919006348e-01
6.440101861953735352e-01
3.192486464977264404e-01
9.789683818817138672e-01
2.062249481678009033e-01
2.285073697566986084e-01
1.791234612464904785e-01
2.027555704116821289e-01
7.632932662963867188e-01
1.839429140090942383e-01
1.909367442131042480e-01
1.943879127502441406e-01
3.769753277301788330e-01
3.785301446914672852e-01
2.276240289211273193e-01
2.453422248363494873e-01
2.271077930927276611e-01
2.788090407848358154e-01
2.543457746505737305e-01
2.215914130210876465e-01
1.813024878501892090e-01
1.931460499763488770e-01
2.219367623329162598e-01
7.805550098419189453e-01
1.919972300529479980e-01
2.152450680732727051e-01
1.824412941932678223e-01
3.407637774944305420e-01
2.007080018520355225e-01
2.415589094161987305e-01
1.817710697650909424e-01
2.049494385719299316e-01
1.875461041927337646e-01
2.791756391525268555e-01
3.332811892032623291e-01
1.805228292942047119e-01
3.017169237136840820e-01
2.531210780143737793e-01
5.434792041778564453e-01
2.024680972099304199e-01
2.789605259895324707e-01
1.788744926452636719e-01
1.998773515224456787e-01
2.602176368236541748e-01
1.855847835540771484e-01
1.995593011379241943e-01
2.659197151660919189e-01
1.868615746498107910e-01
2.063642144203186035e-01
1.861578524112701416e-01
1.856915354728698730e-01
2.693749666213989258e-01
2.275093793869018555e-01
1.793512701988220215e-01
2.125753164291381836e-01
3.151565492153167725e-01
2.488327026367187500e-01
1.822720766067504883e-01
7.884227633476257324e-01
6.491691470146179199e-01
2.377378344535827637e-01
2.422516644001007080e-01
2.117829620838165283e-01
1.812828183174133301e-01
9.993983507156372070e-01
2.679405808448791504e-01
2.053201794624328613e-01
1.909455358982086182e-01
1.792145371437072754e-01
2.848505377769470215e-01
1.817775666713714600e-01
2.188523113727569580e-01
1.985860764980316162e-01
2.573851943016052246e-01
3.112043440341949463e-01
2.428423464298248291e-01
1.825831532478332520e-01
2.090059518814086914e-01
7.792973518371582031e-01
1.792335212230682373e-01
1.828339993953704834e-01
1.788513362407684326e-01
3.361670374870300293e-01
2.287473380565643311e-01
1.982335448265075684e-01
1.793369948863983154e-01
1.872941851615905762e-01
2.081481516361236572e-01
6.484725475311279297e-01
1.886342167854309082e-01
1.843991875648498535e-01
2.187671661376953125e-01
1.956799030303955078e-01
2.758386731147766113e-01
3.694560527801513672e-01
2.070382833480834961e-01
2.213113903999328613e-01
2.155794501304626465e-01
2.489782869815826416e-01
2.820247411727905273e-01
7.142584323883056641e-01
9.968907833099365234e-01
9.984668493270874023e-01
1.934901773929595947e-01
7.044765949249267578e-01
4.222092032432556152e-01
7.664769887924194336e-01
2.051074504852294922e-01
5.387855768203735352e-01
4.927448332309722900e-01
2.014065384864807129e-01
8.340655565261840820e-01
2.094505727291107178e-01
1.992743909358978271e-01
5.137664079666137695e-01
1.936795115470886230e-01
1.985989511013031006e-01
1.991616189479827881e-01
2.059193849563598633e-01
2.203371524810791016e-01
2.004798054695129395e-01
7.850459218025207520e-01
2.013663649559020996e-01
2.316386401653289795e-01
4.183174371719360352e-01
2.233104407787322998e-01
4.818277060985565186e-01
1.808610260486602783e-01
2.447071969509124756e-01
9.473573565483093262e-01
2.144335210323333740e-01
2.439669370651245117e-01
4.908838570117950439e-01
2.848646640777587891e-01
