0.000000000000000000e+00
8.829405195912902460e-03
8.829405195912902460e-03
8.829405195912902460e-03
8.829405195912902460e-03
8.829405195912902460e-03
8.829405195912902460e-03
8.829405195912902460e-03
8.829405195912902460e-03
8.829405195912902460e-03
8.829405195912902460e-03
8.829405195912902460e-03
8.829405195912902460e-03
8.829405195912902460e-03
8.829405195912902460e-03
8.829405195912902460e-03
8.829405195912902460e-03
8.829405195912902460e-03
8.829405195912902460e-03
9.360062990924070819e-03
9.360062990924070819e-03
9.861167541890848709e-03
9.861167541890848709e-03
9.861167541890848709e-03
9.861167541890848709e-03
1.079095484763786979e-02
1.079095484763786979e-02
1.122563769516465859e-02
1.122563769516465859e-02
1.164322291365954380e-02
1.164322291365954380e-02
1.204548882303885238e-02
1.204548882303885238e-02
1.204548882303885238e-02
1.204548882303885238e-02
1.280978190164438341e-02
1.280978190164438341e-02
1.317414371337471968e-02
1.317414371337471968e-02
1.352793686444195981e-02
1.352793686444195981e-02
1.387197001333002194e-02
1.387197001333002194e-02
1.453350933462712463e-02
1.453350933462712463e-02
1.485219710568980514e-02
1.485219710568980514e-02
1.576575823784875929e-02
1.576575823784875929e-02
1.605745466005595312e-02
1.605745466005595312e-02
1.634331761056890403e-02
1.634331761056890403e-02
1.662364803209070638e-02
1.662364803209070638e-02
1.689872126181318768e-02
1.689872126181318768e-02
1.716878998907038836e-02
1.716878998907038836e-02
1.743408678732191047e-02
1.743408678732191047e-02
1.769482629306271676e-02
1.769482629306271676e-02
1.795120709005880097e-02
1.795120709005880097e-02
1.820341334622201102e-02
1.820341334622201102e-02
1.845161624171097470e-02
1.845161624171097470e-02
1.869597521992509906e-02
1.869597521992509906e-02
1.917374698522911897e-02
1.917374698522911897e-02
1.963780816542421218e-02
1.963780816542421218e-02
1.986499866872120518e-02
1.986499866872120518e-02
2.031024092139354850e-02
2.031024092139354850e-02
2.095670370455712112e-02
2.095670370455712112e-02
2.116683421806921789e-02
2.116683421806921789e-02
2.137441869348910214e-02
2.137441869348910214e-02
2.198261275601610248e-02
2.198261275601610248e-02
2.218071277730276555e-02
2.218071277730276555e-02
2.237660023444501545e-02
2.237660023444501545e-02
2.257033273591352307e-02
2.257033273591352307e-02
2.276196530579591842e-02
2.276196530579591842e-02
2.313913877332601787e-02
2.313913877332601787e-02
2.369039327797516775e-02
2.369039327797516775e-02
2.387045572514008562e-02
2.387045572514008562e-02
2.404874305242038143e-02
2.404874305242038143e-02
2.457333876615194063e-02
2.457333876615194063e-02
2.474490282968232202e-02
2.474490282968232202e-02
2.491487340926092087e-02
2.491487340926092087e-02
2.508328289844245773e-02
2.508328289844245773e-02
2.525016253297822366e-02
2.525016253297822366e-02
2.541554244817650215e-02
2.541554244817650215e-02
2.557945173265111644e-02
2.557945173265111644e-02
2.574191847873263939e-02
2.574191847873263939e-02
2.653353335498305487e-02
2.653353335498305487e-02
2.684096577131247358e-02
2.684096577131247358e-02
2.729280112048487750e-02
2.729280112048487750e-02
2.744101131858985021e-02
2.744101131858985021e-02
2.758805310974905833e-02
2.758805310974905833e-02
2.773394507819641752e-02
2.773394507819641752e-02
2.787870527533907114e-02
2.787870527533907114e-02
2.802235124097804397e-02
2.802235124097804397e-02
2.816490002345102897e-02
2.816490002345102897e-02
2.830636819876337570e-02
2.830636819876337570e-02
2.844677188876894650e-02
2.844677188876894650e-02
2.872444813240470490e-02
2.872444813240470490e-02
2.899804928248883237e-02
2.899804928248883237e-02
2.926768962400318891e-02
2.926768962400318891e-02
2.940105860879389452e-02
2.940105860879389452e-02
3.018175804971281670e-02
3.018175804971281670e-02
3.068450141414990479e-02
3.068450141414990479e-02
3.080807218226522259e-02
3.080807218226522259e-02
3.105274657316523662e-02
3.105274657316523662e-02
3.141373393234216105e-02
3.141373393234216105e-02
3.176771091122630036e-02
3.176771091122630036e-02
3.222917376180122612e-02
3.222917376180122612e-02
3.245554670424265209e-02
3.245554670424265209e-02
3.267909476153011555e-02
3.267909476153011555e-02
3.278982754202960925e-02
3.278982754202960925e-02
3.289987551729860876e-02
3.289987551729860876e-02
3.300924553645792625e-02
3.300924553645792625e-02
3.311794431623607537e-02
3.311794431623607537e-02
3.322597844451207622e-02
3.322597844451207622e-02
3.365159587879715947e-02
3.365159587879715947e-02
3.375640129109378634e-02
3.375640129109378634e-02
3.386057905700316090e-02
3.386057905700316090e-02
3.437225173082803648e-02
3.437225173082803648e-02
3.447278133667123351e-02
3.447278133667123351e-02
3.457272161891812579e-02
3.457272161891812579e-02
3.486905704757904678e-02
3.486905704757904678e-02
3.496669012788416325e-02
3.496669012788416325e-02
3.516026686144373137e-02
3.516026686144373137e-02
3.525621979061645261e-02
3.525621979061645261e-02
3.554079088148631022e-02
3.554079088148631022e-02
3.563456659897447365e-02
3.563456659897447365e-02
3.663177061016436448e-02
3.663177061016436448e-02
3.706509989386654047e-02
3.706509989386654047e-02
3.715033003363218955e-02
3.715033003363218955e-02
3.740320807220408328e-02
3.740320807220408328e-02
3.748657383139956945e-02
3.748657383139956945e-02
3.773393335286476247e-02
3.773393335286476247e-02
3.789658797912678900e-02
3.789658797912678900e-02
3.797724847948321519e-02
3.797724847948321519e-02
3.829551042446730641e-02
3.829551042446730641e-02
3.837399451916374826e-02
3.837399451916374826e-02
3.999686244170574945e-02
3.999686244170574945e-02
4.006612024149171919e-02
4.006612024149171919e-02
4.027164917617392925e-02
4.027164917617392925e-02
4.040681708018108165e-02
4.040681708018108165e-02
4.047385119635255740e-02
4.047385119635255740e-02
4.067277592066530223e-02
4.067277592066530223e-02
4.093299334118684352e-02
4.093299334118684352e-02
4.099716346408251166e-02
4.099716346408251166e-02
4.112445425299865454e-02
4.112445425299865454e-02
4.118757816238047959e-02
4.118757816238047959e-02
4.149804605615968478e-02
4.149804605615968478e-02
4.174032997020642871e-02
4.174032997020642871e-02
4.180006738564137625e-02
4.180006738564137625e-02
4.185947424277244172e-02
4.185947424277244172e-02
4.191855194699860981e-02
4.191855194699860981e-02
4.203572544016781487e-02
4.203572544016781487e-02
4.215159879871713949e-02
4.215159879871713949e-02
4.237948765002194640e-02
4.237948765002194640e-02
4.254706927951337758e-02
4.254706927951337758e-02
4.276612866367833499e-02
4.276612866367833499e-02
4.282011889948159067e-02
4.282011889948159067e-02
4.308548057320273766e-02
4.308548057320273766e-02
4.313764291195818640e-02
4.313764291195818640e-02
4.329232972958729081e-02
4.329232972958729081e-02
4.339396478888947473e-02
4.339396478888947473e-02
4.359369759086965251e-02
4.359369759086965251e-02
4.378876759426518495e-02
4.378876759426518495e-02
4.388457353561830282e-02
4.388457353561830282e-02
4.407276488418672422e-02
4.407276488418672422e-02
4.439127558808840524e-02
4.439127558808840524e-02
4.461048625997361683e-02
4.461048625997361683e-02
4.490598090888106575e-02
4.490598090888106575e-02
4.502860737889680109e-02
4.502860737889680109e-02
4.522770549785500027e-02
4.522770549785500027e-02
4.530551324674411684e-02
4.530551324674411684e-02
4.534402736908237780e-02
4.534402736908237780e-02
4.538228254021605540e-02
4.538228254021605540e-02
4.542027941444910788e-02
4.542027941444910788e-02
4.549550085650290454e-02
4.549550085650290454e-02
4.556969679886374580e-02
4.556969679886374580e-02
4.564287224261395770e-02
4.564287224261395770e-02
4.567907881279203997e-02
4.567907881279203997e-02
4.631952991931787000e-02
4.631952991931787000e-02
4.650338790574547188e-02
4.650338790574547188e-02
4.656274836982776666e-02
4.656274836982776666e-02
4.679065988527463665e-02
4.679065988527463665e-02
4.681808385292102193e-02
4.681808385292102193e-02
4.689894586476932303e-02
4.689894586476932303e-02
4.700348712796995065e-02
4.700348712796995065e-02
4.720143413945449007e-02
4.720143413945449007e-02
4.753311448133737405e-02
4.753311448133737405e-02
4.757349460091016280e-02
4.757349460091016280e-02
4.767052581960608271e-02
4.767052581960608271e-02
4.770777641402654257e-02
4.770777641402654257e-02
4.772606807730278566e-02
4.772606807730278566e-02
4.776198541372304179e-02
4.776198541372304179e-02
4.777961158751138637e-02
4.777961158751138637e-02
4.779701642635170167e-02
4.779701642635170167e-02
4.792831537046551849e-02
4.792831537046551849e-02
4.803168514782571452e-02
4.803168514782571452e-02
4.812437874664277082e-02
4.812437874664277082e-02
4.818408643554465687e-02
4.818408643554465687e-02
4.833898127712356330e-02
4.833898127712356330e-02
4.834684042794701320e-02
4.834684042794701320e-02
4.836191792433461312e-02
4.836191792433461312e-02
4.838293363224843019e-02
4.838293363224843019e-02
4.845927755922985192e-02
4.845927755922985192e-02
4.847643837339910000e-02
4.847643837339910000e-02
4.847855657115561490e-02
4.847855657115561490e-02
4.848215729495186643e-02
4.848215729495186643e-02
4.848787554198418642e-02
4.848787554198418642e-02
4.848745199125638339e-02
4.848745199125638339e-02
4.848681665822742598e-02
4.848681665822742598e-02
4.848215729495186643e-02
4.848215729495186643e-02
4.841921200665103009e-02
4.841921200665103009e-02
4.840797073959316604e-02
4.840797073959316604e-02
4.840203090302655498e-02
4.840203090302655498e-02
4.834684042794701320e-02
4.834684042794701320e-02
4.832262164911720059e-02
4.832262164911720059e-02
4.830540619057299007e-02
4.830540619057299007e-02
4.827797630530345635e-02
4.827797630530345635e-02
4.826840407345112105e-02
4.826840407345112105e-02
4.812437874664277082e-02
4.812437874664277082e-02
4.807271449911221239e-02
4.807271449911221239e-02
4.798869496140807656e-02
4.798869496140807656e-02
4.794373866513525206e-02
4.794373866513525206e-02
4.779701642635170167e-02
4.779701642635170167e-02
4.776198541372304179e-02
4.776198541372304179e-02
4.772606807730278566e-02
4.772606807730278566e-02
4.767052581960608271e-02
4.767052581960608271e-02
4.761297781958845343e-02
4.761297781958845343e-02
4.742822508207859833e-02
4.742822508207859833e-02
4.727186655983862951e-02
4.727186655983862951e-02
4.710430860746678272e-02
4.710430860746678272e-02
4.692543125475937688e-02
4.692543125475937688e-02
4.659206965561642905e-02
4.659206965561642905e-02
4.615963845771260676e-02
4.615963845771260676e-02
4.612692582116154766e-02
4.612692582116154766e-02
4.609396719625965394e-02
4.609396719625965394e-02
4.599361008352094438e-02
4.599361008352094438e-02
4.560641177444915706e-02
4.560641177444915706e-02
4.549550085650290454e-02
4.549550085650290454e-02
4.522770549785500027e-02
4.522770549785500027e-02
4.506895304837874733e-02
4.506895304837874733e-02
4.490598090888106575e-02
4.490598090888106575e-02
4.482289811840636101e-02
4.482289811840636101e-02
4.439127558808840524e-02
4.439127558808840524e-02
4.416516486657775381e-02
4.416516486657775381e-02
4.411910543752034508e-02
4.411910543752034508e-02
4.359369759086965251e-02
4.359369759086965251e-02
4.344433861809269409e-02
4.344433861809269409e-02
4.254706927951337758e-02
4.254706927951337758e-02
4.226618271566220247e-02
4.226618271566220247e-02
4.220905127829238657e-02
4.220905127829238657e-02
4.203572544016781487e-02
4.203572544016781487e-02
4.155912008022676074e-02
4.155912008022676074e-02
4.118757816238047959e-02
4.118757816238047959e-02
4.093299334118684352e-02
4.093299334118684352e-02
4.080359538633457350e-02
4.080359538633457350e-02
4.073836419475892340e-02
4.073836419475892340e-02
4.054052118303966279e-02
4.054052118303966279e-02
4.040681708018108859e-02
4.040681708018108859e-02
3.964487382092247297e-02
3.964487382092247297e-02
3.868368431586284573e-02
3.868368431586284573e-02
3.805746821190086893e-02
3.805746821190086893e-02
3.789658797912678900e-02
3.789658797912678900e-02
3.781548389035511992e-02
3.781548389035511992e-02
3.731938093783091631e-02
3.731938093783091631e-02
3.715033003363218955e-02
3.715033003363218955e-02
3.680655150695560235e-02
3.680655150695560235e-02
3.654364520212164541e-02
3.654364520212164541e-02
3.609552441776704701e-02
3.609552441776704701e-02
3.600437539667642600e-02
3.600437539667642600e-02
3.554079088148631022e-02
3.554079088148631022e-02
3.535162181704390449e-02
3.535162181704390449e-02
3.525621979061645955e-02
3.525621979061645955e-02
3.516026686144373137e-02
3.516026686144373137e-02
3.496669012788417019e-02
3.496669012788417019e-02
3.427112761529151064e-02
3.427112761529151064e-02
3.416940371171999641e-02
3.416940371171999641e-02
3.396413495204148730e-02
3.396413495204148730e-02
3.365159587879715947e-02
3.365159587879715947e-02
3.322597844451207622e-02
3.322597844451207622e-02
3.289987551729860876e-02
3.289987551729860876e-02
3.245554670424265209e-02
3.245554670424265209e-02
3.234271703355277860e-02
3.234271703355277860e-02
3.199991598308293828e-02
3.199991598308293828e-02
3.188418586422501338e-02
3.188418586422501338e-02
3.153249343475737071e-02
3.153249343475737071e-02
3.117386955984273803e-02
3.117386955984273803e-02
3.056009498507805330e-02
3.056009498507805330e-02
3.030873391392672339e-02
3.030873391392672339e-02
3.018175804971282711e-02
3.018175804971282711e-02
2.913335764293151220e-02
2.913335764293151220e-02
2.886175081042501034e-02
2.886175081042501034e-02
2.684096577131248051e-02
2.684096577131248051e-02
2.622093043967202095e-02
2.622093043967202095e-02
2.606263202470659665e-02
2.606263202470659665e-02
2.474490282968232202e-02
2.474490282968232202e-02
2.440014760603782806e-02
2.440014760603782806e-02
2.422529445211191179e-02
2.422529445211191179e-02
2.350851492160045686e-02
2.350851492160045686e-02
2.313913877332600399e-02
2.313913877332600399e-02
2.218071277730276208e-02
2.218071277730276208e-02
1.869597521992510947e-02
1.869597521992510947e-02
1.820341334622201102e-02
1.820341334622201102e-02
1.634331761056890403e-02
1.634331761056890403e-02
1.516351170301754973e-02
1.516351170301754973e-02
1.453350933462711769e-02
1.453350933462711769e-02
1.387197001333003409e-02
1.387197001333003409e-02
1.352793686444194420e-02
1.352793686444194420e-02
1.317414371337471621e-02
1.317414371337471621e-02
1.164322291365954380e-02
1.164322291365954380e-02
9.861167541890857383e-03
9.861167541890857383e-03
8.263502650080262885e-03
8.263502650080262885e-03
7.654542376711751493e-03
7.654542376711751493e-03
6.991282068447092317e-03
6.991282068447092317e-03
6.256476159870443671e-03
6.256476159870443671e-03
3.133157985591036431e-03
3.133157985591036431e-03
0.000000000000000000e+00
0.000000000000000000e+00
0.000000000000000000e+00
