0.000000000000000000e+00
1.047120418848167533e-01
1.099476439790575966e-01
1.125654450261780043e-01
1.230366492146596907e-01
1.413612565445026281e-01
1.465968586387434436e-01
2.068062827225130851e-01
2.068062827225130851e-01
2.460732984293193815e-01
2.460732984293193815e-01
2.539267015706806463e-01
2.539267015706806463e-01
2.565445026178010401e-01
2.565445026178010401e-01
2.853403141361256501e-01
2.853403141361256501e-01
3.010471204188481797e-01
3.010471204188481797e-01
3.167539267015706539e-01
3.167539267015706539e-01
3.193717277486911033e-01
3.193717277486911033e-01
3.376963350785340268e-01
3.376963350785340268e-01
3.429319371727748700e-01
3.429319371727748700e-01
3.586387434554973996e-01
3.586387434554973996e-01
3.664921465968586367e-01
3.664921465968586367e-01
3.717277486910994799e-01
3.717277486910994799e-01
3.743455497382198738e-01
3.743455497382198738e-01
3.795811518324607170e-01
3.795811518324607170e-01
3.821989528795811664e-01
3.821989528795811664e-01
3.848167539267015602e-01
3.848167539267015602e-01
3.874345549738220096e-01
3.874345549738220096e-01
3.926701570680628528e-01
3.926701570680628528e-01
3.952879581151832467e-01
3.952879581151832467e-01
4.031413612565444837e-01
4.031413612565444837e-01
4.057591623036649331e-01
4.057591623036649331e-01
4.083769633507853269e-01
4.083769633507853269e-01
4.136125654450261702e-01
4.136125654450261702e-01
4.214659685863874072e-01
4.214659685863874072e-01
4.240837696335078566e-01
4.240837696335078566e-01
4.371727748691099369e-01
4.371727748691099369e-01
4.502617801047120172e-01
4.502617801047120172e-01
4.528795811518324665e-01
4.528795811518324665e-01
4.554973821989528604e-01
4.554973821989528604e-01
4.607329842931937036e-01
4.607329842931937036e-01
4.659685863874345468e-01
4.659685863874345468e-01
4.712041884816753901e-01
4.712041884816753901e-01
4.738219895287957839e-01
4.738219895287957839e-01
4.764397905759162333e-01
4.764397905759162333e-01
4.790575916230366271e-01
4.790575916230366271e-01
4.816753926701570765e-01
4.816753926701570765e-01
4.842931937172774703e-01
4.842931937172774703e-01
4.869109947643979197e-01
4.869109947643979197e-01
4.895287958115183136e-01
4.895287958115183136e-01
4.921465968586387629e-01
4.921465968586387629e-01
4.947643979057591568e-01
4.947643979057591568e-01
5.000000000000000000e-01
5.000000000000000000e-01
5.052356020942407877e-01
5.052356020942407877e-01
5.130890052356020803e-01
5.130890052356020803e-01
5.183246073298429790e-01
5.183246073298429790e-01
5.314136125654450593e-01
5.314136125654450593e-01
5.340314136125654532e-01
5.340314136125654532e-01
5.471204188481675335e-01
5.471204188481675335e-01
5.549738219895288260e-01
5.549738219895288260e-01
5.575916230366492199e-01
5.575916230366492199e-01
5.654450261780105125e-01
5.654450261780105125e-01
5.706806282722513002e-01
5.706806282722513002e-01
5.785340314136125928e-01
5.785340314136125928e-01
5.837696335078533805e-01
5.837696335078533805e-01
5.863874345549737743e-01
5.863874345549737743e-01
5.942408376963350669e-01
5.942408376963350669e-01
5.968586387434554608e-01
5.968586387434554608e-01
6.020942408376963595e-01
6.020942408376963595e-01
6.047120418848167533e-01
6.047120418848167533e-01
6.073298429319371472e-01
6.073298429319371472e-01
6.178010471204188336e-01
6.178010471204188336e-01
6.204188481675392275e-01
6.204188481675392275e-01
6.308900523560209139e-01
6.308900523560209139e-01
6.335078534031413078e-01
6.335078534031413078e-01
6.361256544502618127e-01
6.361256544502618127e-01
6.413612565445026004e-01
6.413612565445026004e-01
6.439790575916229942e-01
6.439790575916229942e-01
6.465968586387434991e-01
6.465968586387434991e-01
6.492146596858638929e-01
6.492146596858638929e-01
6.596858638743455794e-01
6.596858638743455794e-01
6.727748691099476597e-01
6.727748691099476597e-01
6.753926701570680535e-01
6.753926701570680535e-01
6.806282722513089523e-01
6.806282722513089523e-01
6.832460732984293461e-01
6.832460732984293461e-01
6.858638743455497400e-01
6.858638743455497400e-01
6.884816753926701338e-01
6.884816753926701338e-01
6.910994764397905277e-01
6.910994764397905277e-01
6.989528795811518203e-01
6.989528795811518203e-01
7.015706806282722141e-01
7.015706806282722141e-01
7.041884816753927190e-01
7.041884816753927190e-01
7.068062827225131128e-01
7.068062827225131128e-01
7.120418848167539005e-01
7.120418848167539005e-01
7.146596858638742944e-01
7.146596858638742944e-01
7.225130890052355870e-01
7.225130890052355870e-01
7.277486910994764857e-01
7.277486910994764857e-01
7.303664921465968796e-01
7.303664921465968796e-01
7.356020942408376673e-01
7.356020942408376673e-01
7.382198952879580611e-01
7.382198952879580611e-01
7.408376963350785660e-01
7.408376963350785660e-01
7.486910994764397476e-01
7.486910994764397476e-01
7.513089005235602524e-01
7.513089005235602524e-01
7.539267015706806463e-01
7.539267015706806463e-01
7.565445026178010401e-01
7.565445026178010401e-01
7.617801047120419389e-01
7.617801047120419389e-01
7.643979057591623327e-01
7.643979057591623327e-01
7.670157068062827266e-01
7.670157068062827266e-01
7.696335078534031204e-01
7.696335078534031204e-01
7.722513089005235143e-01
7.722513089005235143e-01
7.748691099476440192e-01
7.748691099476440192e-01
7.774869109947644130e-01
7.774869109947644130e-01
7.879581151832460995e-01
7.879581151832460995e-01
7.905759162303664933e-01
7.905759162303664933e-01
7.958115183246072810e-01
7.958115183246072810e-01
7.984293193717277859e-01
7.984293193717277859e-01
8.010471204188481797e-01
8.010471204188481797e-01
8.062827225130889675e-01
8.062827225130889675e-01
8.089005235602094723e-01
8.089005235602094723e-01
8.141361256544502600e-01
8.141361256544502600e-01
8.219895287958115526e-01
8.219895287958115526e-01
8.246073298429319465e-01
8.246073298429319465e-01
8.272251308900523403e-01
8.272251308900523403e-01
8.298429319371727342e-01
8.298429319371727342e-01
8.324607329842932391e-01
8.324607329842932391e-01
8.350785340314136329e-01
8.350785340314136329e-01
8.403141361256544206e-01
8.403141361256544206e-01
8.429319371727748145e-01
8.429319371727748145e-01
8.534031413612565009e-01
8.534031413612565009e-01
8.586387434554973996e-01
8.586387434554973996e-01
8.638743455497381873e-01
8.638743455497381873e-01
8.743455497382198738e-01
8.743455497382198738e-01
8.769633507853402676e-01
8.769633507853402676e-01
8.795811518324607725e-01
8.795811518324607725e-01
8.821989528795811664e-01
8.821989528795811664e-01
8.848167539267015602e-01
8.848167539267015602e-01
8.874345549738219541e-01
8.874345549738219541e-01
8.926701570680628528e-01
8.926701570680628528e-01
8.979057591623036405e-01
8.979057591623036405e-01
9.031413612565445392e-01
9.031413612565445392e-01
9.083769633507853269e-01
9.083769633507853269e-01
9.109947643979057208e-01
9.109947643979057208e-01
9.136125654450262257e-01
9.136125654450262257e-01
9.162303664921466195e-01
9.162303664921466195e-01
9.188481675392670134e-01
9.188481675392670134e-01
9.214659685863874072e-01
9.214659685863874072e-01
9.240837696335078011e-01
9.240837696335078011e-01
9.267015706806283060e-01
9.267015706806283060e-01
9.293193717277486998e-01
9.293193717277486998e-01
9.319371727748690937e-01
9.319371727748690937e-01
9.345549738219894875e-01
9.345549738219894875e-01
9.397905759162303863e-01
9.397905759162303863e-01
9.424083769633507801e-01
9.424083769633507801e-01
9.450261780104711740e-01
9.450261780104711740e-01
9.476439790575915678e-01
9.476439790575915678e-01
9.528795811518324665e-01
9.528795811518324665e-01
9.581151832460732543e-01
9.581151832460732543e-01
9.607329842931937591e-01
9.607329842931937591e-01
9.712041884816754456e-01
9.712041884816754456e-01
9.738219895287958394e-01
9.738219895287958394e-01
9.764397905759162333e-01
9.764397905759162333e-01
9.842931937172775259e-01
9.842931937172775259e-01
9.921465968586387074e-01
9.921465968586387074e-01
9.973821989528796061e-01
9.973821989528796061e-01
1.000000000000000000e+00
1.000000000000000000e+00
