0.000000000000000000e+00
6.070831903454418366e-02
6.131166283832138741e-02
6.249223951819937728e-02
6.249223951819937728e-02
6.475554030351379775e-02
6.530222048292079473e-02
6.689932735087850135e-02
6.792996393345133999e-02
6.843551709456136001e-02
6.942780422856537070e-02
7.039588056129421345e-02
7.180473521990037022e-02
7.316433557410331745e-02
7.316433557410331745e-02
7.447737911607792138e-02
7.447737911607792138e-02
7.737325119186862221e-02
7.816022006110268094e-02
8.005448144857350845e-02
8.005448144857350845e-02
8.219781018980980292e-02
8.219781018980980292e-02
8.485281374238570762e-02
8.485281374238570762e-02
9.136071365745782047e-02
9.136071365745782047e-02
1.001982035767108870e-01
1.001982035767108870e-01
1.004888053466653497e-01
1.004888053466653497e-01
1.051379094332772213e-01
1.051379094332772213e-01
1.052474227712964089e-01
1.052474227712964089e-01
1.055343545960271689e-01
1.055761336666578287e-01
1.056911538398554867e-01
1.056911538398554867e-01
1.057592549141681548e-01
1.057592549141681548e-01
1.057907368345641086e-01
1.057907368345641086e-01
1.059811303959341672e-01
1.059811303959341672e-01
1.060244311467880562e-01
1.060244311467880562e-01
1.060651686464505750e-01
1.060651686464505750e-01
1.060583801498024004e-01
1.060583801498024004e-01
1.060524398587792960e-01
1.059972641156365081e-01
1.059972641156365081e-01
1.058749262101277566e-01
1.058749262101277566e-01
1.057592549141681548e-01
1.057592549141681548e-01
1.057260611202365808e-01
1.057260611202365808e-01
1.056161919404406402e-01
1.056161919404406402e-01
1.051935359230784656e-01
1.051935359230784656e-01
1.051379094332771935e-01
1.051379094332771935e-01
1.050214263852857766e-01
1.050214263852857766e-01
1.045585003718014216e-01
1.045585003718014216e-01
1.044853099722635736e-01
1.044853099722635736e-01
1.044103443151108424e-01
1.043335995736752037e-01
1.043335995736752037e-01
1.042550718190726755e-01
1.042550718190726755e-01
1.040926510374291514e-01
1.040926510374291514e-01
1.039230484541326383e-01
1.039230484541326383e-01
1.037462288471248661e-01
1.037462288471248661e-01
1.035621552498788012e-01
1.035621552498788012e-01
1.029660138103830891e-01
1.029660138103830891e-01
1.028601963832463106e-01
1.027525182173167073e-01
1.027525182173167073e-01
1.025315561181044388e-01
1.025315561181044388e-01
1.023030791325461597e-01
1.023030791325461597e-01
1.019461622622450658e-01
1.019461622622450658e-01
1.018233764908628436e-01
1.018233764908628436e-01
1.015720433977775339e-01
1.015720433977775339e-01
1.011805317242403107e-01
1.011805317242403107e-01
1.010461280801991102e-01
1.010461280801991102e-01
1.007714245210416804e-01
1.007714245210416804e-01
1.004888053466653497e-01
1.004888053466653497e-01
1.001982035767108870e-01
1.001982035767108870e-01
9.974718041127779433e-02
9.974718041127779433e-02
9.959277082198285391e-02
9.959277082198285391e-02
9.878977679901904119e-02
9.878977679901904119e-02
9.845394862574075034e-02
9.845394862574075034e-02
9.810963255460700139e-02
9.810963255460700139e-02
9.793426366701289687e-02
9.793426366701289687e-02
9.775673889814452677e-02
9.775673889814452677e-02
9.739517441844847134e-02
9.739517441844847134e-02
9.721111047611791234e-02
9.721111047611791234e-02
9.702484217972220937e-02
9.702484217972220937e-02
9.664564139163234202e-02
9.664564139163234202e-02
9.605998126170960105e-02
9.605998126170960105e-02
9.586021072374084628e-02
9.586021072374084628e-02
9.545375843831399587e-02
9.545375843831399587e-02
9.524704719832527422e-02
9.524704719832527422e-02
9.461278983308757384e-02
9.461278983308757384e-02
9.439661010862626656e-02
9.439661010862626656e-02
9.417802291405356907e-02
9.417802291405356907e-02
9.373355855828796601e-02
9.373355855828796601e-02
9.327925814456287934e-02
9.327925814456287934e-02
9.304837451562493478e-02
9.304837451562493478e-02
9.234056530041387378e-02
9.234056530041387378e-02
9.209951139935543263e-02
9.209951139935543263e-02
9.185586535436918165e-02
9.185586535436918165e-02
9.160960648316310295e-02
9.160960648316310295e-02
9.136071365745782047e-02
9.136071365745782047e-02
9.110916529087509375e-02
9.110916529087509375e-02
9.085493932637894732e-02
9.085493932637894732e-02
9.059801322324900763e-02
9.059801322324900763e-02
9.007596793817981840e-02
9.007596793817981840e-02
8.981080113215782201e-02
8.981080113215782201e-02
8.844252370890373638e-02
8.844252370890373638e-02
8.816019509960262845e-02
8.816019509960262845e-02
8.787491109526085475e-02
8.787491109526085475e-02
8.758664281726979972e-02
8.758664281726979972e-02
8.640312494348800776e-02
8.640312494348800776e-02
8.609947735033006422e-02
8.609947735033006422e-02
8.579265702844270092e-02
8.579265702844270092e-02
8.355309689054019051e-02
8.355309689054019051e-02
8.321958904008117108e-02
8.321958904008117108e-02
8.288256752779801784e-02
8.288256752779801784e-02
8.219781018980981679e-02
8.219781018980981679e-02
8.149846624323675570e-02
8.149846624323675570e-02
8.114320673968955511e-02
8.114320673968955511e-02
8.078415686259281248e-02
8.078415686259281248e-02
8.042126584430266123e-02
8.042126584430266123e-02
8.005448144857350845e-02
8.005448144857350845e-02
7.968374991176056799e-02
7.968374991176056799e-02
7.930901588091987531e-02
7.930901588091987531e-02
7.816022006110269482e-02
7.816022006110269482e-02
7.776888838089432432e-02
7.776888838089432432e-02
7.656879259855153830e-02
7.656879259855153830e-02
7.615983193258765716e-02
7.615983193258765716e-02
7.532808241286911843e-02
7.532808241286911843e-02
7.447737911607792138e-02
7.447737911607792138e-02
7.404471621932250114e-02
7.404471621932250114e-02
7.360706487831178424e-02
7.360706487831178424e-02
7.271643555620696531e-02
7.271643555620696531e-02
7.180473521990037022e-02
7.180473521990037022e-02
7.087115068912033800e-02
7.087115068912033800e-02
6.991480529902090180e-02
6.991480529902090180e-02
6.942780422856537070e-02
6.942780422856537070e-02
6.893475175845634184e-02
6.893475175845634184e-02
6.741795013199378128e-02
6.741795013199378128e-02
6.584162816941876994e-02
6.584162816941876994e-02
6.530222048292079473e-02
6.530222048292079473e-02
6.420140185385361797e-02
6.420140185385361797e-02
6.363961030678927377e-02
6.363961030678927377e-02
6.306996115426105609e-02
6.306996115426105609e-02
6.249223951819937034e-02
6.249223951819937034e-02
6.190621939676173302e-02
6.190621939676173302e-02
6.131166283832137354e-02
6.131166283832137354e-02
6.070831903454418366e-02
6.070831903454418366e-02
6.009592332263477554e-02
5.947419608536123892e-02
5.884284153573821757e-02
5.884284153573821757e-02
5.820154637120906332e-02
5.820154637120906332e-02
5.754997827975261854e-02
5.754997827975261854e-02
5.621458885378419201e-02
5.621458885378419201e-02
5.483356636222012914e-02
5.483356636222012914e-02
5.412485565800613518e-02
5.412485565800613518e-02
5.340337068013589067e-02
5.340337068013589067e-02
5.266858646290023538e-02
5.266858646290023538e-02
5.191993836668142015e-02
5.191993836668142015e-02
5.115681772745449274e-02
5.115681772745449274e-02
5.037856687124001032e-02
5.037856687124001032e-02
4.958447337624956319e-02
4.958447337624956319e-02
4.877376343896379363e-02
4.877376343896379363e-02
4.794559416672194985e-02
4.794559416672194985e-02
4.709904457629689178e-02
4.709904457629689178e-02
4.623310502226734425e-02
4.623310502226734425e-02
4.534666470645885850e-02
4.534666470645885850e-02
4.443849682426264519e-02
4.443849682426264519e-02
4.350724077667993822e-02
4.350724077667993822e-02
4.255138070615337165e-02
4.255138070615337165e-02
4.156921938165307473e-02
4.156921938165307473e-02
3.951809712018028442e-02
3.951809712018028442e-02
3.844450545916804074e-02
3.844450545916804074e-02
3.733523804664973245e-02
3.733523804664973245e-02
3.618701424544447376e-02
3.618701424544447376e-02
3.246659822032485487e-02
3.246659822032485487e-02
3.111623370525425092e-02
3.111623370525425092e-02
2.820319130878632535e-02
2.820319130878632535e-02
2.661728761538261281e-02
2.661728761538261281e-02
2.309805186590420042e-02
2.309805186590420042e-02
2.110687091920544073e-02
2.110687091920544073e-02
1.889761889762835503e-02
1.889761889762835503e-02
1.638230752977126378e-02
1.638230752977126378e-02
1.338954816265284370e-02
1.338954816265284370e-02
9.477341399358792801e-03
9.477341399358792801e-03
0.000000000000000000e+00
