0.000000000000000000e+00
2.000000000000000042e-03
2.000000000000000042e-03
6.000000000000000125e-03
6.000000000000000125e-03
1.200000000000000025e-02
1.200000000000000025e-02
1.799999999999999864e-02
1.799999999999999864e-02
2.000000000000000042e-02
2.199999999999999872e-02
2.199999999999999872e-02
2.400000000000000050e-02
2.400000000000000050e-02
2.800000000000000058e-02
2.800000000000000058e-02
2.999999999999999889e-02
2.999999999999999889e-02
3.200000000000000067e-02
3.200000000000000067e-02
3.599999999999999728e-02
3.599999999999999728e-02
4.000000000000000083e-02
4.000000000000000083e-02
4.200000000000000261e-02
4.200000000000000261e-02
4.399999999999999745e-02
4.399999999999999745e-02
4.599999999999999922e-02
4.599999999999999922e-02
4.800000000000000100e-02
4.800000000000000100e-02
5.000000000000000278e-02
5.000000000000000278e-02
5.199999999999999761e-02
5.199999999999999761e-02
5.199999999999999761e-02
5.199999999999999761e-02
5.199999999999999761e-02
5.199999999999999761e-02
5.399999999999999939e-02
5.399999999999999939e-02
6.199999999999999956e-02
6.199999999999999956e-02
6.600000000000000311e-02
6.600000000000000311e-02
6.800000000000000488e-02
6.800000000000000488e-02
7.000000000000000666e-02
7.000000000000000666e-02
7.199999999999999456e-02
7.199999999999999456e-02
7.599999999999999811e-02
7.599999999999999811e-02
7.799999999999999989e-02
7.799999999999999989e-02
8.200000000000000344e-02
8.200000000000000344e-02
8.400000000000000522e-02
8.400000000000000522e-02
8.799999999999999489e-02
8.799999999999999489e-02
8.999999999999999667e-02
8.999999999999999667e-02
9.400000000000000022e-02
9.400000000000000022e-02
9.800000000000000377e-02
9.800000000000000377e-02
1.039999999999999952e-01
1.039999999999999952e-01
1.059999999999999970e-01
1.059999999999999970e-01
1.179999999999999938e-01
1.199999999999999956e-01
1.199999999999999956e-01
1.219999999999999973e-01
1.219999999999999973e-01
1.239999999999999991e-01
1.239999999999999991e-01
1.260000000000000009e-01
1.260000000000000009e-01
1.280000000000000027e-01
1.280000000000000027e-01
1.300000000000000044e-01
1.300000000000000044e-01
1.320000000000000062e-01
1.320000000000000062e-01
1.340000000000000080e-01
1.340000000000000080e-01
1.419999999999999873e-01
1.419999999999999873e-01
1.479999999999999927e-01
1.479999999999999927e-01
1.499999999999999944e-01
1.499999999999999944e-01
1.519999999999999962e-01
1.519999999999999962e-01
1.559999999999999998e-01
1.559999999999999998e-01
1.580000000000000016e-01
1.580000000000000016e-01
1.600000000000000033e-01
1.600000000000000033e-01
1.620000000000000051e-01
1.620000000000000051e-01
1.640000000000000069e-01
1.640000000000000069e-01
1.660000000000000087e-01
1.660000000000000087e-01
1.680000000000000104e-01
1.680000000000000104e-01
1.700000000000000122e-01
1.700000000000000122e-01
1.719999999999999862e-01
1.719999999999999862e-01
1.739999999999999880e-01
1.739999999999999880e-01
1.759999999999999898e-01
1.759999999999999898e-01
1.900000000000000022e-01
1.900000000000000022e-01
1.920000000000000040e-01
1.920000000000000040e-01
1.960000000000000075e-01
1.960000000000000075e-01
2.179999999999999993e-01
2.179999999999999993e-01
2.220000000000000029e-01
2.220000000000000029e-01
2.260000000000000064e-01
2.260000000000000064e-01
2.280000000000000082e-01
2.280000000000000082e-01
2.300000000000000100e-01
2.300000000000000100e-01
2.320000000000000118e-01
2.320000000000000118e-01
2.399999999999999911e-01
2.399999999999999911e-01
2.419999999999999929e-01
2.419999999999999929e-01
2.500000000000000000e-01
2.500000000000000000e-01
2.520000000000000018e-01
2.520000000000000018e-01
2.540000000000000036e-01
2.540000000000000036e-01
2.560000000000000053e-01
2.560000000000000053e-01
2.580000000000000071e-01
2.580000000000000071e-01
2.620000000000000107e-01
2.620000000000000107e-01
2.640000000000000124e-01
2.640000000000000124e-01
2.660000000000000142e-01
2.660000000000000142e-01
2.680000000000000160e-01
2.680000000000000160e-01
2.740000000000000213e-01
2.740000000000000213e-01
2.780000000000000249e-01
2.780000000000000249e-01
2.800000000000000266e-01
2.800000000000000266e-01
2.839999999999999747e-01
2.839999999999999747e-01
2.859999999999999765e-01
2.859999999999999765e-01
2.899999999999999800e-01
2.899999999999999800e-01
2.939999999999999836e-01
2.939999999999999836e-01
3.099999999999999978e-01
3.099999999999999978e-01
3.160000000000000031e-01
3.160000000000000031e-01
3.200000000000000067e-01
3.200000000000000067e-01
3.220000000000000084e-01
3.220000000000000084e-01
3.260000000000000120e-01
3.260000000000000120e-01
3.320000000000000173e-01
3.320000000000000173e-01
3.340000000000000191e-01
3.340000000000000191e-01
3.360000000000000209e-01
3.360000000000000209e-01
3.380000000000000226e-01
3.380000000000000226e-01
3.459999999999999742e-01
3.459999999999999742e-01
3.519999999999999796e-01
3.519999999999999796e-01
3.659999999999999920e-01
3.659999999999999920e-01
3.679999999999999938e-01
3.679999999999999938e-01
3.719999999999999973e-01
3.719999999999999973e-01
3.760000000000000009e-01
3.760000000000000009e-01
3.780000000000000027e-01
3.780000000000000027e-01
3.900000000000000133e-01
3.900000000000000133e-01
4.020000000000000240e-01
4.020000000000000240e-01
4.040000000000000258e-01
4.040000000000000258e-01
4.060000000000000275e-01
4.060000000000000275e-01
4.079999999999999738e-01
4.079999999999999738e-01
4.099999999999999756e-01
4.099999999999999756e-01
4.119999999999999774e-01
4.119999999999999774e-01
4.139999999999999791e-01
4.139999999999999791e-01
4.159999999999999809e-01
4.159999999999999809e-01
4.179999999999999827e-01
4.179999999999999827e-01
4.199999999999999845e-01
4.199999999999999845e-01
4.219999999999999862e-01
4.219999999999999862e-01
4.299999999999999933e-01
4.299999999999999933e-01
4.339999999999999969e-01
4.339999999999999969e-01
4.380000000000000004e-01
4.380000000000000004e-01
4.440000000000000058e-01
4.440000000000000058e-01
4.460000000000000075e-01
4.460000000000000075e-01
4.480000000000000093e-01
4.480000000000000093e-01
4.500000000000000111e-01
4.500000000000000111e-01
4.520000000000000129e-01
4.520000000000000129e-01
4.699999999999999734e-01
4.699999999999999734e-01
4.739999999999999769e-01
4.739999999999999769e-01
4.799999999999999822e-01
4.799999999999999822e-01
4.859999999999999876e-01
4.859999999999999876e-01
4.899999999999999911e-01
4.899999999999999911e-01
5.040000000000000036e-01
5.040000000000000036e-01
5.100000000000000089e-01
5.100000000000000089e-01
5.120000000000000107e-01
5.120000000000000107e-01
5.160000000000000142e-01
5.160000000000000142e-01
5.180000000000000160e-01
5.180000000000000160e-01
5.200000000000000178e-01
5.200000000000000178e-01
5.240000000000000213e-01
5.240000000000000213e-01
5.300000000000000266e-01
5.300000000000000266e-01
5.340000000000000302e-01
5.340000000000000302e-01
5.380000000000000338e-01
5.380000000000000338e-01
5.400000000000000355e-01
5.400000000000000355e-01
5.440000000000000391e-01
5.440000000000000391e-01
5.480000000000000426e-01
5.480000000000000426e-01
5.500000000000000444e-01
5.500000000000000444e-01
5.560000000000000497e-01
5.560000000000000497e-01
5.639999999999999458e-01
5.639999999999999458e-01
5.679999999999999494e-01
5.679999999999999494e-01
5.739999999999999547e-01
5.739999999999999547e-01
5.839999999999999636e-01
5.839999999999999636e-01
5.859999999999999654e-01
5.859999999999999654e-01
5.899999999999999689e-01
5.899999999999999689e-01
5.919999999999999707e-01
5.919999999999999707e-01
5.959999999999999742e-01
5.959999999999999742e-01
6.039999999999999813e-01
6.039999999999999813e-01
6.059999999999999831e-01
6.059999999999999831e-01
6.119999999999999885e-01
6.119999999999999885e-01
6.159999999999999920e-01
6.159999999999999920e-01
6.179999999999999938e-01
6.179999999999999938e-01
6.199999999999999956e-01
6.199999999999999956e-01
6.280000000000000027e-01
6.280000000000000027e-01
6.380000000000000115e-01
6.380000000000000115e-01
6.400000000000000133e-01
6.400000000000000133e-01
6.420000000000000151e-01
6.420000000000000151e-01
6.560000000000000275e-01
6.560000000000000275e-01
6.580000000000000293e-01
6.580000000000000293e-01
6.640000000000000346e-01
6.640000000000000346e-01
6.680000000000000382e-01
6.680000000000000382e-01
6.740000000000000435e-01
6.740000000000000435e-01
6.780000000000000471e-01
6.780000000000000471e-01
6.800000000000000488e-01
6.800000000000000488e-01
6.919999999999999485e-01
6.919999999999999485e-01
6.959999999999999520e-01
6.959999999999999520e-01
7.019999999999999574e-01
7.019999999999999574e-01
7.039999999999999591e-01
7.039999999999999591e-01
7.059999999999999609e-01
7.059999999999999609e-01
7.139999999999999680e-01
7.139999999999999680e-01
7.279999999999999805e-01
7.279999999999999805e-01
7.319999999999999840e-01
7.319999999999999840e-01
7.359999999999999876e-01
7.359999999999999876e-01
7.379999999999999893e-01
7.379999999999999893e-01
7.500000000000000000e-01
7.500000000000000000e-01
7.560000000000000053e-01
7.560000000000000053e-01
7.860000000000000320e-01
7.860000000000000320e-01
7.940000000000000391e-01
7.940000000000000391e-01
7.960000000000000409e-01
7.960000000000000409e-01
7.980000000000000426e-01
7.980000000000000426e-01
8.020000000000000462e-01
8.020000000000000462e-01
8.040000000000000480e-01
8.040000000000000480e-01
8.080000000000000515e-01
8.080000000000000515e-01
8.139999999999999458e-01
8.139999999999999458e-01
8.159999999999999476e-01
8.159999999999999476e-01
8.239999999999999547e-01
8.239999999999999547e-01
8.279999999999999583e-01
8.279999999999999583e-01
8.479999999999999760e-01
8.479999999999999760e-01
8.659999999999999920e-01
8.659999999999999920e-01
8.699999999999999956e-01
8.699999999999999956e-01
8.719999999999999973e-01
8.719999999999999973e-01
8.800000000000000044e-01
8.800000000000000044e-01
8.920000000000000151e-01
8.920000000000000151e-01
8.960000000000000187e-01
8.960000000000000187e-01
9.060000000000000275e-01
9.060000000000000275e-01
9.080000000000000293e-01
9.080000000000000293e-01
9.160000000000000364e-01
9.160000000000000364e-01
9.360000000000000542e-01
9.360000000000000542e-01
9.499999999999999556e-01
9.499999999999999556e-01
9.519999999999999574e-01
9.519999999999999574e-01
9.559999999999999609e-01
9.559999999999999609e-01
9.619999999999999662e-01
9.619999999999999662e-01
9.759999999999999787e-01
9.759999999999999787e-01
9.779999999999999805e-01
9.779999999999999805e-01
9.799999999999999822e-01
9.799999999999999822e-01
9.819999999999999840e-01
9.819999999999999840e-01
9.959999999999999964e-01
9.959999999999999964e-01
1.000000000000000000e+00
