0.000000000000000000e+00
0.000000000000000000e+00
0.000000000000000000e+00
0.000000000000000000e+00
0.000000000000000000e+00
0.000000000000000000e+00
0.000000000000000000e+00
0.000000000000000000e+00
0.000000000000000000e+00
0.000000000000000000e+00
0.000000000000000000e+00
0.000000000000000000e+00
0.000000000000000000e+00
0.000000000000000000e+00
0.000000000000000000e+00
1.814882032667876517e-03
1.814882032667876517e-03
3.629764065335753034e-03
3.629764065335753034e-03
5.444646098003629552e-03
5.444646098003629552e-03
9.074410163339383453e-03
9.074410163339383453e-03
1.088929219600725910e-02
1.088929219600725910e-02
1.451905626134301214e-02
1.451905626134301214e-02
1.814882032667876691e-02
1.814882032667876691e-02
2.177858439201451821e-02
2.177858439201451821e-02
2.540834845735027298e-02
2.540834845735027298e-02
2.722323049001814863e-02
2.722323049001814863e-02
2.903811252268602427e-02
2.903811252268602427e-02
3.085299455535390339e-02
3.085299455535390339e-02
3.266787658802177557e-02
3.266787658802177557e-02
3.448275862068965469e-02
3.448275862068965469e-02
3.629764065335753381e-02
3.629764065335753381e-02
3.811252268602540599e-02
3.811252268602540599e-02
3.992740471869328511e-02
3.992740471869328511e-02
4.355716878402903641e-02
4.355716878402903641e-02
4.537205081669691553e-02
4.537205081669691553e-02
4.718693284936479465e-02
4.718693284936479465e-02
4.900181488203266683e-02
4.900181488203266683e-02
5.081669691470054595e-02
5.081669691470054595e-02
5.626134301270417637e-02
5.626134301270417637e-02
5.807622504537204855e-02
5.807622504537204855e-02
5.989110707803992767e-02
5.989110707803992767e-02
6.533575317604355115e-02
6.533575317604355115e-02
7.803992740471869805e-02
7.803992740471869805e-02
8.892921960072595888e-02
8.892921960072595888e-02
9.437386569872958930e-02
9.437386569872958930e-02
1.034482758620689641e-01
1.034482758620689641e-01
1.070780399274047223e-01
1.070780399274047223e-01
1.179673321234119832e-01
1.179673321234119832e-01
1.197822141560798553e-01
1.197822141560798553e-01
1.234119782214156136e-01
1.234119782214156136e-01
1.270417422867513579e-01
1.270417422867513579e-01
1.324863883847549884e-01
1.324863883847549884e-01
1.397459165154265048e-01
1.397459165154265048e-01
1.415607985480943631e-01
1.415607985480943631e-01
1.524500907441016240e-01
1.524500907441016240e-01
1.578947368421052544e-01
1.578947368421052544e-01
1.615245009074410265e-01
1.615245009074410265e-01
1.633393829401088848e-01
1.633393829401088848e-01
1.651542649727767709e-01
1.651542649727767709e-01
1.705989110707804013e-01
1.705989110707804013e-01
1.742286751361161456e-01
1.742286751361161456e-01
1.778584392014519178e-01
1.778584392014519178e-01
1.814882032667876621e-01
1.814882032667876621e-01
1.851179673321234065e-01
1.851179673321234065e-01
1.887477313974591786e-01
1.887477313974591786e-01
2.050816696914700421e-01
2.050816696914700421e-01
2.123411978221415586e-01
2.123411978221415586e-01
2.177858439201451890e-01
2.177858439201451890e-01
2.232304900181488194e-01
2.232304900181488194e-01
2.250453720508167055e-01
2.250453720508167055e-01
2.304900181488203359e-01
2.304900181488203359e-01
2.341197822141560803e-01
2.341197822141560803e-01
2.359346642468239663e-01
2.359346642468239663e-01
2.377495462794918246e-01
2.377495462794918246e-01
2.395644283121597107e-01
2.395644283121597107e-01
2.431941923774954550e-01
2.431941923774954550e-01
2.450090744101633411e-01
2.450090744101633411e-01
2.540834845735027159e-01
2.540834845735027159e-01
2.558983666061706019e-01
2.558983666061706019e-01
2.613430127041742046e-01
2.613430127041742046e-01
2.649727767695099767e-01
2.649727767695099767e-01
2.686025408348457488e-01
2.686025408348457488e-01
2.704174228675136349e-01
2.704174228675136349e-01
2.722323049001814654e-01
2.722323049001814654e-01
2.758620689655172376e-01
2.758620689655172376e-01
2.794918330308530097e-01
2.794918330308530097e-01
2.831215970961887263e-01
2.831215970961887263e-01
2.849364791288566123e-01
2.849364791288566123e-01
2.958257713248638732e-01
2.958257713248638732e-01
2.976406533575317592e-01
2.976406533575317592e-01
2.994555353901996453e-01
2.994555353901996453e-01
3.012704174228675313e-01
3.012704174228675313e-01
3.030852994555354174e-01
3.030852994555354174e-01
3.103448275862069061e-01
3.103448275862069061e-01
3.157894736842105088e-01
3.157894736842105088e-01
3.230490018148820530e-01
3.230490018148820530e-01
3.303085299455535417e-01
3.303085299455535417e-01
3.357531760435571444e-01
3.357531760435571444e-01
3.593466424682395521e-01
3.593466424682395521e-01
3.611615245009074382e-01
3.611615245009074382e-01
3.666061705989110964e-01
3.666061705989110964e-01
3.702359346642468130e-01
3.702359346642468130e-01
3.793103448275861878e-01
3.793103448275861878e-01
3.811252268602540738e-01
3.811252268602540738e-01
3.847549909255898459e-01
3.847549909255898459e-01
3.883847549909255625e-01
3.883847549909255625e-01
3.901996370235934486e-01
3.901996370235934486e-01
3.938294010889292207e-01
3.938294010889292207e-01
4.010889292196007094e-01
4.010889292196007094e-01
4.047186932849364815e-01
4.047186932849364815e-01
4.101633393829400842e-01
4.101633393829400842e-01
4.137931034482758563e-01
4.137931034482758563e-01
4.156079854809437424e-01
4.156079854809437424e-01
4.228675136116152311e-01
4.228675136116152311e-01
4.264972776769510032e-01
4.264972776769510032e-01
4.373865698729582641e-01
4.373865698729582641e-01
4.392014519056261501e-01
4.392014519056261501e-01
4.428312159709618667e-01
4.428312159709618667e-01
4.464609800362976388e-01
4.464609800362976388e-01
4.591651542649727857e-01
4.591651542649727857e-01
4.609800362976406718e-01
4.609800362976406718e-01
4.664246823956442745e-01
4.664246823956442745e-01
4.682395644283121605e-01
4.682395644283121605e-01
4.700544464609800466e-01
4.700544464609800466e-01
4.754990925589836492e-01
4.754990925589836492e-01
4.845735027223230240e-01
4.845735027223230240e-01
4.863883847549909101e-01
4.863883847549909101e-01
4.900181488203266822e-01
4.900181488203266822e-01
4.954627949183302849e-01
4.954627949183302849e-01
4.972776769509981709e-01
4.972776769509981709e-01
4.990925589836660570e-01
4.990925589836660570e-01
5.009074410163338875e-01
5.009074410163338875e-01
5.045372050816696596e-01
5.045372050816696596e-01
5.081669691470054318e-01
5.081669691470054318e-01
5.154264972776769760e-01
5.154264972776769760e-01
5.190562613430127481e-01
5.190562613430127481e-01
5.208711433756806342e-01
5.208711433756806342e-01
5.245009074410162953e-01
5.245009074410162953e-01
5.263157894736841813e-01
5.263157894736841813e-01
5.299455535390199534e-01
5.299455535390199534e-01
5.335753176043557255e-01
5.335753176043557255e-01
5.353901996370236116e-01
5.353901996370236116e-01
5.372050816696914977e-01
5.372050816696914977e-01
5.517241379310344751e-01
5.517241379310344751e-01
5.535390199637023612e-01
5.535390199637023612e-01
5.607985480943739054e-01
5.607985480943739054e-01
5.680580762250453386e-01
5.680580762250453386e-01
5.735027223230489968e-01
5.735027223230489968e-01
5.753176043557168828e-01
5.753176043557168828e-01
5.771324863883847689e-01
5.771324863883847689e-01
5.825771324863884271e-01
5.825771324863884271e-01
5.843920145190563131e-01
5.843920145190563131e-01
5.880217785843919742e-01
5.880217785843919742e-01
5.916515426497277463e-01
5.916515426497277463e-01
5.934664246823956324e-01
5.934664246823956324e-01
6.043557168784029487e-01
6.043557168784029487e-01
6.152450090744101541e-01
6.152450090744101541e-01
6.225045372050816983e-01
6.225045372050816983e-01
6.243194192377495844e-01
6.243194192377495844e-01
6.261343012704174704e-01
6.261343012704174704e-01
6.315789473684210176e-01
6.315789473684210176e-01
6.370235934664246757e-01
6.370235934664246757e-01
6.442831215970962200e-01
6.442831215970962200e-01
6.551724137931034253e-01
6.551724137931034253e-01
6.569872958257713114e-01
6.569872958257713114e-01
6.588021778584391974e-01
6.588021778584391974e-01
6.696914700544465138e-01
6.696914700544465138e-01
6.733212341197821749e-01
6.733212341197821749e-01
6.805807622504537191e-01
6.805807622504537191e-01
6.823956442831216052e-01
6.823956442831216052e-01
6.842105263157894912e-01
6.842105263157894912e-01
6.878402903811252633e-01
6.878402903811252633e-01
6.932849364791288105e-01
6.932849364791288105e-01
6.987295825771324687e-01
6.987295825771324687e-01
7.005444646098003547e-01
7.005444646098003547e-01
7.023593466424682408e-01
7.023593466424682408e-01
7.059891107078040129e-01
7.059891107078040129e-01
7.078039927404718989e-01
7.078039927404718989e-01
7.168784029038112182e-01
7.168784029038112182e-01
7.223230490018148764e-01
7.223230490018148764e-01
7.241379310344827624e-01
7.241379310344827624e-01
7.295825771324864206e-01
7.295825771324864206e-01
7.332123411978221927e-01
7.332123411978221927e-01
7.350272232304899678e-01
7.350272232304899678e-01
7.386569872958257399e-01
7.386569872958257399e-01
7.422867513611615120e-01
7.422867513611615120e-01
7.477313974591651702e-01
7.477313974591651702e-01
7.531760435571688284e-01
7.531760435571688284e-01
7.676950998185118058e-01
7.676950998185118058e-01
7.785843920145190111e-01
7.785843920145190111e-01
7.894736842105263275e-01
7.894736842105263275e-01
7.931034482758620996e-01
7.931034482758620996e-01
7.949183303085299857e-01
7.949183303085299857e-01
7.967332123411978717e-01
7.967332123411978717e-01
8.112522686025408492e-01
8.112522686025408492e-01
8.130671506352087352e-01
8.130671506352087352e-01
8.185117967332123934e-01
8.185117967332123934e-01
8.257713248638838266e-01
8.257713248638838266e-01
8.275862068965517127e-01
8.275862068965517127e-01
8.294010889292195987e-01
8.294010889292195987e-01
8.312159709618874848e-01
8.312159709618874848e-01
8.330308529945553708e-01
8.330308529945553708e-01
8.457350272232304622e-01
8.457350272232304622e-01
8.529945553539020064e-01
8.529945553539020064e-01
8.548094373865698925e-01
8.548094373865698925e-01
8.620689655172413257e-01
8.620689655172413257e-01
8.765880217785844142e-01
8.765880217785844142e-01
8.820326678765880724e-01
8.820326678765880724e-01
8.874773139745916195e-01
8.874773139745916195e-01
8.929219600725952777e-01
8.929219600725952777e-01
8.947368421052631637e-01
8.947368421052631637e-01
9.001814882032668219e-01
9.001814882032668219e-01
9.019963702359347080e-01
9.019963702359347080e-01
9.038112522686025940e-01
9.038112522686025940e-01
9.092558983666061412e-01
9.092558983666061412e-01
9.201451905626134575e-01
9.201451905626134575e-01
9.219600725952813436e-01
9.219600725952813436e-01
9.255898366606170047e-01
9.255898366606170047e-01
9.310344827586206629e-01
9.310344827586206629e-01
9.328493647912885489e-01
9.328493647912885489e-01
9.419237749546279792e-01
9.419237749546279792e-01
9.455535390199637513e-01
9.455535390199637513e-01
9.491833030852994124e-01
9.491833030852994124e-01
9.564428312159709566e-01
9.564428312159709566e-01
9.582577132486388427e-01
9.582577132486388427e-01
9.655172413793103869e-01
9.655172413793103869e-01
9.673321234119782730e-01
9.673321234119782730e-01
9.709618874773139341e-01
9.709618874773139341e-01
9.745916515426497062e-01
9.745916515426497062e-01
9.764065335753175923e-01
9.764065335753175923e-01
9.782214156079854783e-01
9.782214156079854783e-01
9.836660617059891365e-01
9.836660617059891365e-01
9.891107078039927947e-01
9.891107078039927947e-01
9.927404718693284558e-01
9.927404718693284558e-01
1.000000000000000000e+00
