1.924344420433044434e+00
9.243444204330444336e-01
9.229478240013122559e-01
9.034096002578735352e-01
8.916952610015869141e-01
8.796977996826171875e-01
8.544919490814208984e-01
8.526751995086669922e-01
8.360845446586608887e-01
8.331227302551269531e-01
8.238765001296997070e-01
8.190828561782836914e-01
8.126796483993530273e-01
8.069502711296081543e-01
7.982966303825378418e-01
7.981173396110534668e-01
7.975722551345825195e-01
7.897875308990478516e-01
7.876880168914794922e-01
7.870268821716308594e-01
7.814693450927734375e-01
7.808116674423217773e-01
7.804743051528930664e-01
7.756649255752563477e-01
7.746981382369995117e-01
7.728205919265747070e-01
7.539877295494079590e-01
7.509831190109252930e-01
7.491073608398437500e-01
7.489324808120727539e-01
7.462296485900878906e-01
7.458162307739257812e-01
7.433093190193176270e-01
7.422437667846679688e-01
7.417726516723632812e-01
7.413842678070068359e-01
7.403032779693603516e-01
7.401208281517028809e-01
7.302339673042297363e-01
7.289346456527709961e-01
7.286256551742553711e-01
7.276536226272583008e-01
7.227315902709960938e-01
7.223706245422363281e-01
7.188811302185058594e-01
7.183026075363159180e-01
7.173779010772705078e-01
7.171629667282104492e-01
7.167345881462097168e-01
7.158759236335754395e-01
7.149765491485595703e-01
7.149142026901245117e-01
7.146502733230590820e-01
7.142995595932006836e-01
7.137188911437988281e-01
7.136631011962890625e-01
7.124558687210083008e-01
7.121823430061340332e-01
7.114698290824890137e-01
7.094972133636474609e-01
7.062962055206298828e-01
7.060348391532897949e-01
7.021157741546630859e-01
7.008626461029052734e-01
7.008336782455444336e-01
7.001734972000122070e-01
6.996960639953613281e-01
6.941566467285156250e-01
6.938264966011047363e-01
6.907902956008911133e-01
6.906695365905761719e-01
6.885361671447753906e-01
6.885192394256591797e-01
6.870215535163879395e-01
6.865894198417663574e-01
6.856713294982910156e-01
6.840338706970214844e-01
6.828244328498840332e-01
6.825808286666870117e-01
6.804018020629882812e-01
6.803795695304870605e-01
6.796197891235351562e-01
6.790989637374877930e-01
6.749009490013122559e-01
6.747931241989135742e-01
6.743662953376770020e-01
6.733607053756713867e-01
6.729758381843566895e-01
6.711666584014892578e-01
6.709853410720825195e-01
6.702245473861694336e-01
6.698085069656372070e-01
6.687063574790954590e-01
6.662925481796264648e-01
6.649636030197143555e-01
6.647562980651855469e-01
6.647488474845886230e-01
6.641228795051574707e-01
6.639787554740905762e-01
6.616849303245544434e-01
6.605134606361389160e-01
6.579335927963256836e-01
6.568606495857238770e-01
6.563392281532287598e-01
6.561354994773864746e-01
6.558876037597656250e-01
6.557984948158264160e-01
6.523129343986511230e-01
6.516252756118774414e-01
6.477670073509216309e-01
6.456838250160217285e-01
6.454665660858154297e-01
6.448962688446044922e-01
6.448364257812500000e-01
6.428012847900390625e-01
6.415878534317016602e-01
6.409858465194702148e-01
6.407869458198547363e-01
6.393072605133056641e-01
6.389926075935363770e-01
6.371781826019287109e-01
6.361657381057739258e-01
6.361464858055114746e-01
6.356601119041442871e-01
6.353294849395751953e-01
6.352728605270385742e-01
6.350350975990295410e-01
6.333335638046264648e-01
6.321513056755065918e-01
6.296520829200744629e-01
6.293278336524963379e-01
6.270338892936706543e-01
6.256416440010070801e-01
6.250072121620178223e-01
6.249178051948547363e-01
6.247887611389160156e-01
6.234782934188842773e-01
6.222598552703857422e-01
6.214585304260253906e-01
6.212981343269348145e-01
6.207767128944396973e-01
6.201596260070800781e-01
6.198077201843261719e-01
6.195325255393981934e-01
6.186324357986450195e-01
6.185668706893920898e-01
6.183457970619201660e-01
6.177244782447814941e-01
6.172592639923095703e-01
6.172015070915222168e-01
6.155328154563903809e-01
6.148465871810913086e-01
6.140412688255310059e-01
6.138472557067871094e-01
6.133157610893249512e-01
6.132127046585083008e-01
6.126396656036376953e-01
6.117870807647705078e-01
6.094774603843688965e-01
6.089581847190856934e-01
6.075496673583984375e-01
6.071413755416870117e-01
6.061270236968994141e-01
6.046196222305297852e-01
6.027963757514953613e-01
6.013562679290771484e-01
5.985089540481567383e-01
5.970363020896911621e-01
5.962847471237182617e-01
5.962808132171630859e-01
5.960663557052612305e-01
5.956364870071411133e-01
5.932662487030029297e-01
5.931451320648193359e-01
5.927907228469848633e-01
5.923424363136291504e-01
5.919399261474609375e-01
5.918578505516052246e-01
5.912778377532958984e-01
5.895320177078247070e-01
5.857042670249938965e-01
5.856147408485412598e-01
5.850975513458251953e-01
5.839332342147827148e-01
5.826896429061889648e-01
5.808597803115844727e-01
5.805429816246032715e-01
5.804437994956970215e-01
5.796372294425964355e-01
5.785066485404968262e-01
5.769494771957397461e-01
5.759514570236206055e-01
5.677543878555297852e-01
5.671759247779846191e-01
5.664124488830566406e-01
5.652469396591186523e-01
5.652394294738769531e-01
5.649429559707641602e-01
5.625833272933959961e-01
5.624155402183532715e-01
5.621505975723266602e-01
5.614403486251831055e-01
5.584887862205505371e-01
5.575208067893981934e-01
5.565871000289916992e-01
5.556536316871643066e-01
5.540654063224792480e-01
5.540077686309814453e-01
5.536993741989135742e-01
5.535953640937805176e-01
5.525408387184143066e-01
5.524008870124816895e-01
5.521218180656433105e-01
5.520817637443542480e-01
5.488395690917968750e-01
5.469329357147216797e-01
5.468252301216125488e-01
5.461933612823486328e-01
5.459173321723937988e-01
5.456641316413879395e-01
5.431175827980041504e-01
5.403055548667907715e-01
5.394853353500366211e-01
5.372524857521057129e-01
5.351570844650268555e-01
5.334387421607971191e-01
5.330076813697814941e-01
5.293704271316528320e-01
5.278857946395874023e-01
5.274074673652648926e-01
5.265808105468750000e-01
5.265602469444274902e-01
5.248577594757080078e-01
5.245156288146972656e-01
5.243265628814697266e-01
5.242669582366943359e-01
5.200132131576538086e-01
5.181249380111694336e-01
5.181121230125427246e-01
5.177979469299316406e-01
5.141241550445556641e-01
5.134134888648986816e-01
5.123462677001953125e-01
5.103648304939270020e-01
5.099781751632690430e-01
5.080923438072204590e-01
5.077556967735290527e-01
5.075240731239318848e-01
5.071797370910644531e-01
5.060629844665527344e-01
5.050216317176818848e-01
5.036627650260925293e-01
5.023461580276489258e-01
5.021960139274597168e-01
5.021364688873291016e-01
5.021298527717590332e-01
5.020413398742675781e-01
5.020003318786621094e-01
5.019787549972534180e-01
5.019683837890625000e-01
5.019298195838928223e-01
5.016630887985229492e-01
5.002729296684265137e-01
4.976806938648223877e-01
4.945453405380249023e-01
4.895800948143005371e-01
4.880217909812927246e-01
4.837167859077453613e-01
4.824102222919464111e-01
4.807177484035491943e-01
4.801889061927795410e-01
4.800539910793304443e-01
4.790507853031158447e-01
4.743513166904449463e-01
4.715405106544494629e-01
4.686915874481201172e-01
4.686907827854156494e-01
4.686904549598693848e-01
4.686712622642517090e-01
4.686483144760131836e-01
4.685167968273162842e-01
4.657919704914093018e-01
4.649749994277954102e-01
4.638554751873016357e-01
4.630568027496337891e-01
4.626986980438232422e-01
4.612565338611602783e-01
4.600018262863159180e-01
4.596642553806304932e-01
4.595241546630859375e-01
4.581215679645538330e-01
4.543508589267730713e-01
4.541414380073547363e-01
4.541223049163818359e-01
4.540460109710693359e-01
4.540275335311889648e-01
4.539921283721923828e-01
4.539877176284790039e-01
4.500660002231597900e-01
4.497754573822021484e-01
4.488856792449951172e-01
4.443764090538024902e-01
4.438090026378631592e-01
4.434010386466979980e-01
4.433493912220001221e-01
4.429576396942138672e-01
4.420029520988464355e-01
4.414464831352233887e-01
4.393202066421508789e-01
4.380850493907928467e-01
4.373970925807952881e-01
4.357756674289703369e-01
4.339334070682525635e-01
4.316561222076416016e-01
4.307427406311035156e-01
4.288571178913116455e-01
4.288107454776763916e-01
4.288057088851928711e-01
4.287262558937072754e-01
4.286674857139587402e-01
4.286462068557739258e-01
4.286407232284545898e-01
4.286064505577087402e-01
4.285893440246582031e-01
4.283950328826904297e-01
4.283819496631622314e-01
4.283556342124938965e-01
4.282139837741851807e-01
4.278880357742309570e-01
4.276081919670104980e-01
4.199624657630920410e-01
4.195325970649719238e-01
4.171459674835205078e-01
4.156156778335571289e-01
4.150424301624298096e-01
4.124092459678649902e-01
4.109011292457580566e-01
4.108316898345947266e-01
4.107706844806671143e-01
4.107299447059631348e-01
4.102225899696350098e-01
4.060208499431610107e-01
4.055883884429931641e-01
4.051755368709564209e-01
4.049668908119201660e-01
4.047735929489135742e-01
4.033836722373962402e-01
3.984494507312774658e-01
3.943683505058288574e-01
3.937581777572631836e-01
3.916678428649902344e-01
3.898361921310424805e-01
3.880895376205444336e-01
3.880077004432678223e-01
3.857106566429138184e-01
3.857098519802093506e-01
3.828425705432891846e-01
3.826333582401275635e-01
3.813397586345672607e-01
3.800708353519439697e-01
3.796249628067016602e-01
3.791128993034362793e-01
3.785869777202606201e-01
3.785303831100463867e-01
3.737854361534118652e-01
3.732435107231140137e-01
3.711461126804351807e-01
3.708318769931793213e-01
3.706545829772949219e-01
3.703984022140502930e-01
3.703800141811370850e-01
3.703509271144866943e-01
3.703435361385345459e-01
3.699386119842529297e-01
3.652803301811218262e-01
3.643958270549774170e-01
3.587993979454040527e-01
3.587611913681030273e-01
3.587260246276855469e-01
3.586088120937347412e-01
3.584595918655395508e-01
3.584133982658386230e-01
3.579185605049133301e-01
3.566369414329528809e-01
3.553395271301269531e-01
3.553340435028076172e-01
3.553339838981628418e-01
3.553320169448852539e-01
3.490792512893676758e-01
3.489711284637451172e-01
3.473327755928039551e-01
3.467059731483459473e-01
3.448945879936218262e-01
3.447908163070678711e-01
3.421083986759185791e-01
3.400832116603851318e-01
3.392431735992431641e-01
3.347313106060028076e-01
3.336474895477294922e-01
3.321354985237121582e-01
3.308442831039428711e-01
3.299266099929809570e-01
3.295138776302337646e-01
3.278570473194122314e-01
3.125758767127990723e-01
3.084275126457214355e-01
3.011521697044372559e-01
2.991765737533569336e-01
2.991355061531066895e-01
2.982699275016784668e-01
2.978582978248596191e-01
2.950736582279205322e-01
2.945594787597656250e-01
2.872807979583740234e-01
2.827309370040893555e-01
2.826969623565673828e-01
2.790247797966003418e-01
2.784782648086547852e-01
2.766916751861572266e-01
2.744594216346740723e-01
2.729593515396118164e-01
2.721995115280151367e-01
2.713697552680969238e-01
2.710768580436706543e-01
2.685620486736297607e-01
2.661259174346923828e-01
2.641755342483520508e-01
2.637184262275695801e-01
2.634105086326599121e-01
2.631345987319946289e-01
2.596775889396667480e-01
2.592824995517730713e-01
2.508437633514404297e-01
2.503687739372253418e-01
2.426936626434326172e-01
2.413636147975921631e-01
2.218025326728820801e-01
2.201656997203826904e-01
2.095582187175750732e-01
2.085354626178741455e-01
2.024240791797637939e-01
1.999486088752746582e-01
1.798897087574005127e-01
1.793353259563446045e-01
1.513519585132598877e-01
1.149792671203613281e-01
2.427384257316589355e-02
