2.000000000000000000e+00
1.000000000000000000e+00
9.999998807907104492e-01
9.999994039535522461e-01
9.999992847442626953e-01
9.999985694885253906e-01
9.999983310699462891e-01
9.999936819076538086e-01
9.999887943267822266e-01
9.997472167015075684e-01
9.997459650039672852e-01
9.994583129882812500e-01
9.994207620620727539e-01
9.993504285812377930e-01
9.992431402206420898e-01
9.991634488105773926e-01
9.989671707153320312e-01
9.975017309188842773e-01
9.974356889724731445e-01
9.974253177642822266e-01
9.973844289779663086e-01
9.972198605537414551e-01
9.971890449523925781e-01
9.971625804901123047e-01
9.970659613609313965e-01
9.966772198677062988e-01
9.965290427207946777e-01
9.893959760665893555e-01
9.890329241752624512e-01
9.882630705833435059e-01
9.875255823135375977e-01
9.868994355201721191e-01
9.863032698631286621e-01
9.853270053863525391e-01
9.845019578933715820e-01
9.781115055084228516e-01
9.780310392379760742e-01
9.777427911758422852e-01
9.763371944427490234e-01
9.750581979751586914e-01
9.747098684310913086e-01
9.727401733398437500e-01
9.721291065216064453e-01
9.702827930450439453e-01
9.702079296112060547e-01
9.648623466491699219e-01
9.645040035247802734e-01
9.629189372062683105e-01
9.620182514190673828e-01
9.554324150085449219e-01
9.550231099128723145e-01
9.509208798408508301e-01
9.492772817611694336e-01
9.459900259971618652e-01
9.458572268486022949e-01
9.391409158706665039e-01
9.379262328147888184e-01
9.275886416435241699e-01
9.266330003738403320e-01
9.263538718223571777e-01
9.253915548324584961e-01
9.175908565521240234e-01
9.165005683898925781e-01
9.143409132957458496e-01
9.115874767303466797e-01
9.107368588447570801e-01
9.105604887008666992e-01
9.064882993698120117e-01
9.053478240966796875e-01
8.987220525741577148e-01
8.984184861183166504e-01
8.932302594184875488e-01
8.918947577476501465e-01
8.908734917640686035e-01
8.903527259826660156e-01
8.844336271286010742e-01
8.840849399566650391e-01
8.835597038269042969e-01
8.826351761817932129e-01
8.764725923538208008e-01
8.613961935043334961e-01
8.579411506652832031e-01
8.559836745262145996e-01
8.511325716972351074e-01
8.437588810920715332e-01
8.432484269142150879e-01
8.423830270767211914e-01
8.408796787261962891e-01
8.407950997352600098e-01
8.400599956512451172e-01
8.396748304367065430e-01
8.386257886886596680e-01
8.349241614341735840e-01
8.346919417381286621e-01
8.317908644676208496e-01
8.305865526199340820e-01
8.267943263053894043e-01
8.250186443328857422e-01
8.222090005874633789e-01
8.176369667053222656e-01
8.168407082557678223e-01
8.162947893142700195e-01
8.151208758354187012e-01
8.022723197937011719e-01
8.019404411315917969e-01
7.971562147140502930e-01
7.947902679443359375e-01
7.941762208938598633e-01
7.921091318130493164e-01
7.917835116386413574e-01
7.911381721496582031e-01
7.872079610824584961e-01
7.853234410285949707e-01
7.806060314178466797e-01
7.770826816558837891e-01
7.643119096755981445e-01
7.639014720916748047e-01
7.605376243591308594e-01
7.560311555862426758e-01
7.491707801818847656e-01
7.491347789764404297e-01
7.452046871185302734e-01
7.411563992500305176e-01
7.385841608047485352e-01
7.354079484939575195e-01
7.318304777145385742e-01
7.317242026329040527e-01
7.289878129959106445e-01
7.267472743988037109e-01
7.218124866485595703e-01
7.189841270446777344e-01
7.098181247711181641e-01
7.092989683151245117e-01
7.067633867263793945e-01
6.982603073120117188e-01
6.875835061073303223e-01
6.863811612129211426e-01
6.836410164833068848e-01
6.827610135078430176e-01
6.807435154914855957e-01
6.783009767532348633e-01
6.738659143447875977e-01
6.709848642349243164e-01
6.704990267753601074e-01
6.656206846237182617e-01
6.584068536758422852e-01
6.557143926620483398e-01
6.404802203178405762e-01
6.380444169044494629e-01
6.374481320381164551e-01
6.351882219314575195e-01
6.348780393600463867e-01
6.334346532821655273e-01
6.296527981758117676e-01
6.212883591651916504e-01
6.209943294525146484e-01
6.102976799011230469e-01
6.054841876029968262e-01
6.034865379333496094e-01
5.877736806869506836e-01
5.846539139747619629e-01
5.809534788131713867e-01
5.795536637306213379e-01
5.774155259132385254e-01
5.764435529708862305e-01
5.755280852317810059e-01
5.752839446067810059e-01
5.709484219551086426e-01
5.689270496368408203e-01
5.680887699127197266e-01
5.678910017013549805e-01
5.660563707351684570e-01
5.645059347152709961e-01
5.613554716110229492e-01
5.565147399902343750e-01
5.478317141532897949e-01
5.475631952285766602e-01
5.462207198143005371e-01
5.454448461532592773e-01
5.436660647392272949e-01
5.424956083297729492e-01
5.400452017784118652e-01
5.397950410842895508e-01
5.370468497276306152e-01
5.368123054504394531e-01
5.329262018203735352e-01
5.310431122779846191e-01
5.045109391212463379e-01
5.042457580566406250e-01
5.003892779350280762e-01
4.950566887855529785e-01
4.922454655170440674e-01
4.904229640960693359e-01
4.894046783447265625e-01
4.892986714839935303e-01
4.883467257022857666e-01
4.837736487388610840e-01
4.826261997222900391e-01
4.785710871219635010e-01
4.781771302223205566e-01
4.752192199230194092e-01
4.706915616989135742e-01
4.675181508064270020e-01
4.665964841842651367e-01
4.630397260189056396e-01
4.628036022186279297e-01
4.604199230670928955e-01
4.603356122970581055e-01
4.554837942123413086e-01
4.517457783222198486e-01
4.507819414138793945e-01
4.490018784999847412e-01
4.413502514362335205e-01
4.405383169651031494e-01
4.380603432655334473e-01
4.375481009483337402e-01
4.370438754558563232e-01
4.361219704151153564e-01
4.347066283226013184e-01
4.343830943107604980e-01
4.309365749359130859e-01
4.255850315093994141e-01
4.239308834075927734e-01
4.233633577823638916e-01
4.212742745876312256e-01
4.187147617340087891e-01
4.149167835712432861e-01
4.131802618503570557e-01
4.122882187366485596e-01
4.120887517929077148e-01
4.118409752845764160e-01
4.078356921672821045e-01
4.066514074802398682e-01
4.062895774841308594e-01
4.059058427810668945e-01
4.052410721778869629e-01
4.044439196586608887e-01
4.026332795619964600e-01
4.018681645393371582e-01
4.008637368679046631e-01
3.989449739456176758e-01
3.982770442962646484e-01
3.941039741039276123e-01
3.936052918434143066e-01
3.926882445812225342e-01
3.914570212364196777e-01
3.894227445125579834e-01
3.874096572399139404e-01
3.830659389495849609e-01
3.822119235992431641e-01
3.813979029655456543e-01
3.810535967350006104e-01
3.804634511470794678e-01
3.800721466541290283e-01
3.792059421539306641e-01
3.788165450096130371e-01
3.784857988357543945e-01
3.771935403347015381e-01
3.763940334320068359e-01
3.731213510036468506e-01
3.704339265823364258e-01
3.669193387031555176e-01
3.661061823368072510e-01
3.660704493522644043e-01
3.653673231601715088e-01
3.644743561744689941e-01
3.638292551040649414e-01
3.635368049144744873e-01
3.612709045410156250e-01
3.612328171730041504e-01
3.603441715240478516e-01
3.599544763565063477e-01
3.572586476802825928e-01
3.552230000495910645e-01
3.532344996929168701e-01
3.524194061756134033e-01
3.510077893733978271e-01
3.507313430309295654e-01
3.469424843788146973e-01
3.465925455093383789e-01
3.454288244247436523e-01
3.446704745292663574e-01
3.440242409706115723e-01
3.440133929252624512e-01
3.438975811004638672e-01
3.437999784946441650e-01
3.437110781669616699e-01
3.437105119228363037e-01
3.431848883628845215e-01
3.427796065807342529e-01
3.407382369041442871e-01
3.393665254116058350e-01
3.372879922389984131e-01
3.363300561904907227e-01
3.363028466701507568e-01
3.356364965438842773e-01
3.337765336036682129e-01
3.311838805675506592e-01
3.304826021194458008e-01
3.304496407508850098e-01
3.291130661964416504e-01
3.270607590675354004e-01
3.266854286193847656e-01
3.258819580078125000e-01
3.231047391891479492e-01
3.221824765205383301e-01
3.217385709285736084e-01
3.195097446441650391e-01
3.193034827709197998e-01
3.188888430595397949e-01
3.185803890228271484e-01
3.180672526359558105e-01
3.174788951873779297e-01
3.158212900161743164e-01
3.135409653186798096e-01
3.113662600517272949e-01
3.094618916511535645e-01
3.094476461410522461e-01
3.087673485279083252e-01
3.082399964332580566e-01
3.075652718544006348e-01
3.067980408668518066e-01
3.059521913528442383e-01
3.047773241996765137e-01
3.046687245368957520e-01
3.042287230491638184e-01
3.041650354862213135e-01
3.040569424629211426e-01
3.038008213043212891e-01
3.032916188240051270e-01
3.014170825481414795e-01
3.006247580051422119e-01
3.004925847053527832e-01
3.002503812313079834e-01
2.997489571571350098e-01
2.995795607566833496e-01
2.989348471164703369e-01
2.986903786659240723e-01
2.985333800315856934e-01
2.972657680511474609e-01
2.968149781227111816e-01
2.968019843101501465e-01
2.942064106464385986e-01
2.932464480400085449e-01
2.931820750236511230e-01
2.924998998641967773e-01
2.912600040435791016e-01
2.891873121261596680e-01
2.884984016418457031e-01
2.882426381111145020e-01
2.881612479686737061e-01
2.867292761802673340e-01
2.841870784759521484e-01
2.839534282684326172e-01
2.834219038486480713e-01
2.833108901977539062e-01
2.821518182754516602e-01
2.820628285408020020e-01
2.817044556140899658e-01
2.799947261810302734e-01
2.799819707870483398e-01
2.798404097557067871e-01
2.787641882896423340e-01
2.784501612186431885e-01
2.770180106163024902e-01
2.754768729209899902e-01
2.744926512241363525e-01
2.741842865943908691e-01
2.738770842552185059e-01
2.721507549285888672e-01
2.693595886230468750e-01
2.690859436988830566e-01
2.687862515449523926e-01
2.684352993965148926e-01
2.681566774845123291e-01
2.666314244270324707e-01
2.655434012413024902e-01
2.653351426124572754e-01
2.646573781967163086e-01
2.645890116691589355e-01
2.642260789871215820e-01
2.637132406234741211e-01
2.632111310958862305e-01
2.631162703037261963e-01
2.630300819873809814e-01
2.628427743911743164e-01
2.626617550849914551e-01
2.626423239707946777e-01
2.621771097183227539e-01
2.619656920433044434e-01
2.616037726402282715e-01
2.614957690238952637e-01
2.602862715721130371e-01
2.596307992935180664e-01
2.594756484031677246e-01
2.590543627738952637e-01
2.588869333267211914e-01
2.551802396774291992e-01
2.543546259403228760e-01
2.539840936660766602e-01
2.536220252513885498e-01
2.533634901046752930e-01
2.522372305393218994e-01
2.515041828155517578e-01
2.514052391052246094e-01
2.512710392475128174e-01
2.510207891464233398e-01
2.508571147918701172e-01
2.500380277633666992e-01
2.497722804546356201e-01
2.495423257350921631e-01
2.495041787624359131e-01
2.487600445747375488e-01
2.487297654151916504e-01
2.486702501773834229e-01
2.484090924263000488e-01
2.477895319461822510e-01
2.472953200340270996e-01
2.465452253818511963e-01
2.460584044456481934e-01
2.452175617218017578e-01
2.449996471405029297e-01
2.448636293411254883e-01
2.447395920753479004e-01
2.442783713340759277e-01
2.441421747207641602e-01
2.441219687461853027e-01
2.438713908195495605e-01
2.435312867164611816e-01
2.434407472610473633e-01
2.429264485836029053e-01
2.424793243408203125e-01
2.419815957546234131e-01
2.416203916072845459e-01
2.409289479255676270e-01
2.400852143764495850e-01
2.400336563587188721e-01
2.399764955043792725e-01
2.398573756217956543e-01
2.394395470619201660e-01
2.390589118003845215e-01
2.384616434574127197e-01
2.380203008651733398e-01
2.367675006389617920e-01
2.366479933261871338e-01
2.365728318691253662e-01
2.362733483314514160e-01
2.362475097179412842e-01
2.361643612384796143e-01
2.353102266788482666e-01
2.329972684383392334e-01
2.329708337783813477e-01
2.327618002891540527e-01
2.325934171676635742e-01
2.315731346607208252e-01
2.313435673713684082e-01
2.312277257442474365e-01
2.310528159141540527e-01
2.302219867706298828e-01
2.302132248878479004e-01
2.296274006366729736e-01
2.296192944049835205e-01
2.295479476451873779e-01
2.294866442680358887e-01
2.287138104438781738e-01
2.286431193351745605e-01
2.285875380039215088e-01
2.284707427024841309e-01
2.272306680679321289e-01
2.268459796905517578e-01
2.264903485774993896e-01
2.258380353450775146e-01
2.254412174224853516e-01
2.253160476684570312e-01
2.252836525440216064e-01
2.251566946506500244e-01
2.247863709926605225e-01
2.245890796184539795e-01
2.245587706565856934e-01
2.244707643985748291e-01
2.237352728843688965e-01
2.236496210098266602e-01
2.228940427303314209e-01
2.228104472160339355e-01
2.221782207489013672e-01
2.219609022140502930e-01
2.215725779533386230e-01
2.215690612792968750e-01
2.211200296878814697e-01
2.209553420543670654e-01
2.206306755542755127e-01
2.205932736396789551e-01
2.202235758304595947e-01
2.202049791812896729e-01
2.199539840221405029e-01
2.194088697433471680e-01
2.193867862224578857e-01
2.192639112472534180e-01
2.192625701427459717e-01
2.192539274692535400e-01
2.191781103610992432e-01
2.187850177288055420e-01
2.179288268089294434e-01
2.179212570190429688e-01
2.177501618862152100e-01
2.174223065376281738e-01
2.174030244350433350e-01
2.167304456233978271e-01
2.165061235427856445e-01
2.164207100868225098e-01
2.164049744606018066e-01
2.158770263195037842e-01
2.158682942390441895e-01
2.155709266662597656e-01
2.155027985572814941e-01
2.154971957206726074e-01
2.143389284610748291e-01
2.142216861248016357e-01
2.141829133033752441e-01
2.141669094562530518e-01
2.141574323177337646e-01
2.138354480266571045e-01
2.133078873157501221e-01
2.132722139358520508e-01
2.129639685153961182e-01
2.128151953220367432e-01
2.126568555831909180e-01
2.126265764236450195e-01
2.116160094738006592e-01
2.115699350833892822e-01
2.113175690174102783e-01
2.112306058406829834e-01
2.111650109291076660e-01
2.110623121261596680e-01
2.107921540737152100e-01
2.107022404670715332e-01
2.106714844703674316e-01
2.103289067745208740e-01
2.102066874504089355e-01
2.100188136100769043e-01
2.100181579589843750e-01
2.099486291408538818e-01
2.096750140190124512e-01
2.096436619758605957e-01
2.094360291957855225e-01
2.091949582099914551e-01
2.091099023818969727e-01
2.090726792812347412e-01
2.087487280368804932e-01
2.086407840251922607e-01
2.083763480186462402e-01
2.081824541091918945e-01
2.078955471515655518e-01
2.078264653682708740e-01
2.076925933361053467e-01
2.076516747474670410e-01
2.076161205768585205e-01
2.075206041336059570e-01
2.073710858821868896e-01
2.070423960685729980e-01
2.069657742977142334e-01
2.069487869739532471e-01
2.067441344261169434e-01
2.067392766475677490e-01
2.063295245170593262e-01
2.062996625900268555e-01
2.056809663772583008e-01
2.055777609348297119e-01
2.053061723709106445e-01
2.053019404411315918e-01
2.050645351409912109e-01
2.049230933189392090e-01
2.048175036907196045e-01
2.048048079013824463e-01
2.047370970249176025e-01
2.046758234500885010e-01
2.046598494052886963e-01
2.044051885604858398e-01
2.042174637317657471e-01
2.040083706378936768e-01
2.039203047752380371e-01
2.038920819759368896e-01
2.038788497447967529e-01
2.038298845291137695e-01
2.035355567932128906e-01
2.035257816314697266e-01
2.035253942012786865e-01
2.034221291542053223e-01
2.033065855503082275e-01
2.030580639839172363e-01
2.025991380214691162e-01
2.025061547756195068e-01
2.024473845958709717e-01
2.024450004100799561e-01
2.022470235824584961e-01
2.020971775054931641e-01
2.019664645195007324e-01
2.019366621971130371e-01
2.019017934799194336e-01
2.017729878425598145e-01
2.015972435474395752e-01
2.014375627040863037e-01
2.010452747344970703e-01
2.008811235427856445e-01
2.008646726608276367e-01
2.007661163806915283e-01
2.002849876880645752e-01
2.001775205135345459e-01
2.001101374626159668e-01
2.000512182712554932e-01
1.999165117740631104e-01
1.996585130691528320e-01
1.996431946754455566e-01
1.995216012001037598e-01
1.994339823722839355e-01
1.994283199310302734e-01
1.989773511886596680e-01
1.988897025585174561e-01
1.988229155540466309e-01
1.986029148101806641e-01
1.983532607555389404e-01
1.982919573783874512e-01
1.981052756309509277e-01
1.979559063911437988e-01
1.978549957275390625e-01
1.975755393505096436e-01
1.972234249114990234e-01
1.970156729221343994e-01
1.968989372253417969e-01
1.968261599540710449e-01
1.967380046844482422e-01
1.967304944992065430e-01
1.964339017868041992e-01
1.963886618614196777e-01
1.963457167148590088e-01
1.962930560111999512e-01
1.958985328674316406e-01
1.956898868083953857e-01
1.954292058944702148e-01
1.954283714294433594e-01
1.951764822006225586e-01
1.951129138469696045e-01
1.950774192810058594e-01
1.949388682842254639e-01
1.947888135910034180e-01
1.947869360446929932e-01
1.947652995586395264e-01
1.947176754474639893e-01
1.943252682685852051e-01
1.943096220493316650e-01
1.941764056682586670e-01
1.940163671970367432e-01
1.939959228038787842e-01
1.939211487770080566e-01
1.934291422367095947e-01
1.934188902378082275e-01
1.933893263339996338e-01
1.933449208736419678e-01
1.932158768177032471e-01
1.932083070278167725e-01
1.931991279125213623e-01
1.931695640087127686e-01
1.930805444717407227e-01
1.930575072765350342e-01
1.928744614124298096e-01
1.927239894866943359e-01
1.927137672901153564e-01
1.925784945487976074e-01
1.924267113208770752e-01
1.924026012420654297e-01
1.923910081386566162e-01
1.922424137592315674e-01
1.922109127044677734e-01
1.920863687992095947e-01
1.920071244239807129e-01
1.918714940547943115e-01
1.917445361614227295e-01
1.917425990104675293e-01
1.915658414363861084e-01
1.914845407009124756e-01
1.914668083190917969e-01
1.914148926734924316e-01
1.912619173526763916e-01
1.912319660186767578e-01
1.907907128334045410e-01
1.907905042171478271e-01
1.906999349594116211e-01
1.904716491699218750e-01
1.903296411037445068e-01
1.902361810207366943e-01
1.901929974555969238e-01
1.898935139179229736e-01
1.898696422576904297e-01
1.898458898067474365e-01
1.895411014556884766e-01
1.894940435886383057e-01
1.892030239105224609e-01
1.891963481903076172e-01
1.891666948795318604e-01
1.891606748104095459e-01
1.890943944454193115e-01
1.890938878059387207e-01
1.890307068824768066e-01
1.889816522598266602e-01
1.888058781623840332e-01
1.887173950672149658e-01
1.885097026824951172e-01
1.884593367576599121e-01
1.880187094211578369e-01
1.879988908767700195e-01
1.877913773059844971e-01
1.877618432044982910e-01
1.877379119396209717e-01
1.875893175601959229e-01
1.874097585678100586e-01
1.872121989727020264e-01
1.872097253799438477e-01
1.870945394039154053e-01
1.869665384292602539e-01
1.868888735771179199e-01
1.868438124656677246e-01
1.868211925029754639e-01
1.866973042488098145e-01
1.866062283515930176e-01
1.865660846233367920e-01
1.865051090717315674e-01
1.863155961036682129e-01
1.862249076366424561e-01
1.861353218555450439e-01
1.860993504524230957e-01
1.859639585018157959e-01
1.858734786510467529e-01
1.858353018760681152e-01
1.858174204826354980e-01
1.854809522628784180e-01
1.854403316974639893e-01
1.854357123374938965e-01
1.854306459426879883e-01
1.849151253700256348e-01
1.848833262920379639e-01
1.845633685588836670e-01
1.845421195030212402e-01
1.845230162143707275e-01
1.844801008701324463e-01
1.843633353710174561e-01
1.843195259571075439e-01
1.840666830539703369e-01
1.840282678604125977e-01
1.839545071125030518e-01
1.839184463024139404e-01
1.838847994804382324e-01
1.838691234588623047e-01
1.835243999958038330e-01
1.835105419158935547e-01
1.830609142780303955e-01
1.829685568809509277e-01
1.829303503036499023e-01
1.829125881195068359e-01
1.828489899635314941e-01
1.828142702579498291e-01
1.827577650547027588e-01
1.826603412628173828e-01
1.825164556503295898e-01
1.824735701084136963e-01
1.823892593383789062e-01
1.823672354221343994e-01
1.820019781589508057e-01
1.819775104522705078e-01
1.819496452808380127e-01
1.819289624691009521e-01
1.818603277206420898e-01
1.818547248840332031e-01
1.817551553249359131e-01
1.816427409648895264e-01
1.813259422779083252e-01
1.812742054462432861e-01
1.812226474285125732e-01
1.811968684196472168e-01
1.811508834362030029e-01
1.811327934265136719e-01
1.810362040996551514e-01
1.809057891368865967e-01
1.809036433696746826e-01
1.808798313140869141e-01
1.808285117149353027e-01
1.808085441589355469e-01
1.805098652839660645e-01
1.805026233196258545e-01
1.803705394268035889e-01
1.802292764186859131e-01
1.800003051757812500e-01
1.799981892108917236e-01
1.799135208129882812e-01
1.799120008945465088e-01
1.798720955848693848e-01
1.798311769962310791e-01
1.796704530715942383e-01
1.795602440834045410e-01
1.792882680892944336e-01
1.792386174201965332e-01
1.791980564594268799e-01
1.791168153285980225e-01
1.790906488895416260e-01
1.790248453617095947e-01
1.789861917495727539e-01
1.789151430130004883e-01
1.788840591907501221e-01
1.788421571254730225e-01
1.788240671157836914e-01
1.786930561065673828e-01
1.785968244075775146e-01
1.785835027694702148e-01
1.785595715045928955e-01
1.785241961479187012e-01
1.784815788269042969e-01
1.784524023532867432e-01
1.783030629158020020e-01
1.782596409320831299e-01
1.780017018318176270e-01
1.779808402061462402e-01
1.779717504978179932e-01
1.779683828353881836e-01
1.779182851314544678e-01
