1.995529413223266602e+00
9.955294132232666016e-01
8.810575604438781738e-01
7.937934398651123047e-01
7.573596239089965820e-01
7.206042408943176270e-01
7.149589061737060547e-01
7.147230505943298340e-01
7.034917473793029785e-01
6.860564351081848145e-01
6.636838316917419434e-01
6.408615112304687500e-01
6.408452987670898438e-01
6.408102512359619141e-01
6.407741904258728027e-01
6.407114863395690918e-01
6.406996250152587891e-01
6.406964659690856934e-01
6.406864523887634277e-01
6.406863331794738770e-01
6.406581401824951172e-01
6.406551599502563477e-01
6.406481266021728516e-01
6.406192779541015625e-01
6.406179666519165039e-01
6.406096816062927246e-01
6.405971050262451172e-01
6.405808925628662109e-01
6.405737400054931641e-01
6.405597925186157227e-01
6.405556201934814453e-01
6.405423879623413086e-01
6.405380964279174805e-01
6.404883861541748047e-01
6.404849886894226074e-01
6.404758691787719727e-01
6.404653191566467285e-01
6.404597759246826172e-01
6.404575705528259277e-01
6.404528021812438965e-01
6.404505372047424316e-01
6.404412984848022461e-01
6.404024362564086914e-01
6.403957605361938477e-01
6.403938531875610352e-01
6.403684020042419434e-01
6.403624415397644043e-01
6.403576731681823730e-01
6.403566598892211914e-01
6.403561234474182129e-01
6.403547525405883789e-01
6.403446197509765625e-01
6.403390765190124512e-01
6.403205990791320801e-01
6.403171420097351074e-01
6.343778967857360840e-01
6.321849822998046875e-01
6.320700049400329590e-01
6.318796277046203613e-01
6.316376924514770508e-01
6.258339881896972656e-01
6.222435235977172852e-01
6.211445927619934082e-01
6.092596650123596191e-01
6.092537641525268555e-01
6.092530488967895508e-01
6.092525124549865723e-01
6.092221736907958984e-01
6.092197299003601074e-01
6.092156171798706055e-01
6.092060804367065430e-01
6.091966629028320312e-01
6.091801524162292480e-01
6.091572642326354980e-01
6.091179847717285156e-01
6.091142296791076660e-01
6.091140508651733398e-01
6.091085076332092285e-01
6.089851856231689453e-01
6.089755296707153320e-01
6.089318394660949707e-01
6.089279055595397949e-01
6.089059114456176758e-01
6.089049577713012695e-01
6.089017391204833984e-01
6.088907122611999512e-01
6.088745594024658203e-01
6.088728308677673340e-01
6.088329553604125977e-01
6.087666749954223633e-01
6.087195277214050293e-01
6.086350083351135254e-01
6.061644554138183594e-01
6.040905117988586426e-01
6.022101640701293945e-01
6.018818616867065430e-01
5.969648361206054688e-01
5.943750143051147461e-01
5.932912826538085938e-01
5.924127697944641113e-01
5.903337597846984863e-01
5.857535004615783691e-01
5.850207209587097168e-01
5.833583474159240723e-01
5.798050761222839355e-01
5.794630050659179688e-01
5.738494992256164551e-01
5.731234550476074219e-01
5.726248025894165039e-01
5.702979564666748047e-01
5.664880275726318359e-01
5.643103718757629395e-01
5.635550618171691895e-01
5.630776286125183105e-01
5.628522038459777832e-01
5.627359747886657715e-01
5.624307394027709961e-01
5.621172189712524414e-01
5.598642230033874512e-01
5.582644939422607422e-01
5.578944683074951172e-01
5.566543936729431152e-01
5.530897974967956543e-01
5.524008274078369141e-01
5.480482578277587891e-01
5.479740500450134277e-01
5.470175147056579590e-01
5.469617843627929688e-01
5.420566201210021973e-01
5.376915931701660156e-01
5.376117229461669922e-01
5.376101136207580566e-01
5.376092195510864258e-01
5.376005768775939941e-01
5.375946760177612305e-01
5.375705957412719727e-01
5.375552177429199219e-01
5.375525951385498047e-01
5.374987125396728516e-01
5.374892950057983398e-01
5.374780297279357910e-01
5.374482870101928711e-01
5.374072790145874023e-01
5.374020338058471680e-01
5.373962521553039551e-01
5.373917818069458008e-01
5.373495817184448242e-01
5.373491048812866211e-01
5.373337268829345703e-01
5.372922420501708984e-01
5.372895002365112305e-01
5.372712612152099609e-01
5.372639894485473633e-01
5.372454524040222168e-01
5.372360348701477051e-01
5.372340679168701172e-01
5.372203588485717773e-01
5.372073650360107422e-01
5.362986326217651367e-01
5.362893342971801758e-01
5.362395048141479492e-01
5.362271666526794434e-01
5.362213850021362305e-01
5.362159013748168945e-01
5.361381173133850098e-01
5.360610485076904297e-01
5.360120534896850586e-01
5.359833240509033203e-01
5.359738469123840332e-01
5.359640121459960938e-01
5.358586907386779785e-01
5.358272194862365723e-01
5.357996821403503418e-01
5.357720851898193359e-01
5.356751680374145508e-01
5.356740355491638184e-01
5.356723070144653320e-01
5.356536507606506348e-01
5.356495380401611328e-01
5.356295108795166016e-01
5.356272459030151367e-01
5.356107950210571289e-01
5.356005430221557617e-01
5.355815887451171875e-01
5.355740189552307129e-01
5.355194807052612305e-01
5.355104207992553711e-01
5.355088710784912109e-01
5.354632139205932617e-01
5.354384183883666992e-01
5.354105234146118164e-01
5.353699326515197754e-01
5.353011488914489746e-01
5.352322459220886230e-01
5.349799394607543945e-01
5.349235534667968750e-01
5.349019169807434082e-01
5.348784327507019043e-01
5.346906185150146484e-01
5.337531566619873047e-01
5.305387377738952637e-01
5.278504490852355957e-01
5.273936986923217773e-01
5.260268449783325195e-01
5.245808362960815430e-01
5.242142677307128906e-01
5.242113471031188965e-01
5.241987109184265137e-01
5.241913199424743652e-01
5.241761803627014160e-01
5.241746902465820312e-01
5.241618752479553223e-01
5.241591334342956543e-01
5.241472721099853516e-01
5.241266489028930664e-01
5.241141915321350098e-01
5.241065621376037598e-01
5.240284204483032227e-01
5.240254998207092285e-01
5.240163803100585938e-01
5.240146517753601074e-01
5.240002870559692383e-01
5.239928364753723145e-01
5.239914655685424805e-01
5.239764451980590820e-01
5.239465832710266113e-01
5.239364504814147949e-01
5.239021778106689453e-01
5.238696932792663574e-01
5.238597393035888672e-01
5.238480567932128906e-01
5.238474011421203613e-01
5.238354206085205078e-01
5.238170027732849121e-01
5.234361886978149414e-01
5.223950743675231934e-01
5.220160484313964844e-01
5.197502374649047852e-01
5.196641087532043457e-01
5.189476013183593750e-01
5.182965993881225586e-01
5.182653665542602539e-01
5.180364251136779785e-01
5.153711438179016113e-01
5.122112035751342773e-01
5.111114978790283203e-01
5.090227127075195312e-01
5.077255368232727051e-01
5.072670578956604004e-01
5.065993070602416992e-01
4.956842660903930664e-01
4.855094552040100098e-01
4.854733049869537354e-01
4.854421913623809814e-01
4.853775501251220703e-01
4.853623211383819580e-01
4.853306114673614502e-01
4.851375818252563477e-01
4.850984811782836914e-01
4.850248992443084717e-01
4.850232601165771484e-01
4.850157797336578369e-01
4.849340915679931641e-01
4.849210083484649658e-01
4.848793745040893555e-01
4.848717153072357178e-01
4.848678410053253174e-01
4.848611056804656982e-01
4.848085343837738037e-01
4.847858250141143799e-01
4.847797453403472900e-01
4.847783446311950684e-01
4.847086369991302490e-01
4.847033917903900146e-01
4.846886992454528809e-01
3.995578885078430176e-01
3.995204567909240723e-01
3.992809951305389404e-01
3.992465138435363770e-01
3.992356956005096436e-01
3.991853594779968262e-01
3.991124927997589111e-01
3.991032242774963379e-01
3.990640640258789062e-01
3.990584015846252441e-01
3.990569114685058594e-01
3.989679217338562012e-01
3.989196717739105225e-01
3.988838493824005127e-01
3.717942535877227783e-01
3.716481328010559082e-01
3.716354966163635254e-01
3.715983629226684570e-01
3.652716577053070068e-01
3.652625679969787598e-01
3.652557432651519775e-01
3.652510643005371094e-01
3.652357757091522217e-01
3.652193546295166016e-01
3.652189671993255615e-01
3.652133941650390625e-01
3.650504350662231445e-01
3.650108277797698975e-01
3.648629784584045410e-01
3.648322224617004395e-01
3.646891117095947266e-01
3.646798133850097656e-01
3.496607542037963867e-01
3.496480882167816162e-01
3.495578169822692871e-01
3.495126068592071533e-01
3.493278026580810547e-01
3.492403030395507812e-01
3.489517569541931152e-01
3.431215286254882812e-01
3.424252867698669434e-01
3.424114584922790527e-01
3.423691391944885254e-01
3.422967195510864258e-01
3.377161622047424316e-01
3.376841843128204346e-01
3.376470804214477539e-01
3.376155495643615723e-01
3.375326395034790039e-01
3.375096917152404785e-01
3.375071883201599121e-01
3.374867141246795654e-01
3.373523354530334473e-01
3.373306989669799805e-01
3.373296856880187988e-01
3.372820019721984863e-01
3.372004032135009766e-01
3.371466398239135742e-01
3.370537161827087402e-01
3.370123505592346191e-01
3.369987010955810547e-01
3.369774818420410156e-01
3.369721174240112305e-01
3.369247615337371826e-01
3.366956710815429688e-01
3.365667760372161865e-01
3.177531361579895020e-01
3.177388906478881836e-01
3.176676630973815918e-01
3.175711035728454590e-01
3.175473809242248535e-01
3.174952864646911621e-01
3.172607421875000000e-01
3.171939551830291748e-01
3.044315576553344727e-01
3.044129610061645508e-01
3.043545484542846680e-01
3.043488860130310059e-01
3.042744696140289307e-01
3.042504787445068359e-01
3.040513992309570312e-01
3.039543926715850830e-01
3.039424419403076172e-01
3.039377331733703613e-01
3.038380146026611328e-01
3.037753105163574219e-01
3.037737011909484863e-01
3.037711679935455322e-01
3.037150502204895020e-01
2.922050356864929199e-01
2.921141088008880615e-01
2.921029329299926758e-01
2.919138073921203613e-01
2.917400598526000977e-01
2.917221784591674805e-01
2.916915416717529297e-01
2.915082573890686035e-01
2.914470434188842773e-01
2.911316156387329102e-01
2.910574674606323242e-01
2.881886959075927734e-01
2.880876660346984863e-01
2.880175113677978516e-01
2.879809141159057617e-01
2.879286110401153564e-01
2.878887057304382324e-01
2.877838611602783203e-01
2.877506613731384277e-01
2.876563072204589844e-01
2.876454591751098633e-01
2.876415848731994629e-01
2.876345515251159668e-01
2.870924174785614014e-01
2.382406890392303467e-01
2.374301254749298096e-01
2.371164262294769287e-01
2.370865345001220703e-01
2.370853722095489502e-01
2.196301817893981934e-01
2.196120023727416992e-01
2.192144989967346191e-01
2.191881239414215088e-01
1.586612462997436523e-01
1.216235756874084473e-01
1.166070699691772461e-01
4.303643107414245605e-02
