0.000000000000000000e+00
2.000000000000000042e-03
1.200000000000000025e-02
1.200000000000000025e-02
2.199999999999999872e-02
2.199999999999999872e-02
3.200000000000000067e-02
3.200000000000000067e-02
3.400000000000000244e-02
3.400000000000000244e-02
4.000000000000000083e-02
4.000000000000000083e-02
5.199999999999999761e-02
5.199999999999999761e-02
5.999999999999999778e-02
5.999999999999999778e-02
6.199999999999999956e-02
6.199999999999999956e-02
6.800000000000000488e-02
6.800000000000000488e-02
8.799999999999999489e-02
8.799999999999999489e-02
9.600000000000000200e-02
9.600000000000000200e-02
9.800000000000000377e-02
9.800000000000000377e-02
1.039999999999999952e-01
1.059999999999999970e-01
1.059999999999999970e-01
1.140000000000000041e-01
1.140000000000000041e-01
1.219999999999999973e-01
1.219999999999999973e-01
1.260000000000000009e-01
1.260000000000000009e-01
1.320000000000000062e-01
1.320000000000000062e-01
1.340000000000000080e-01
1.340000000000000080e-01
1.380000000000000115e-01
1.380000000000000115e-01
1.439999999999999891e-01
1.439999999999999891e-01
1.459999999999999909e-01
1.459999999999999909e-01
1.539999999999999980e-01
1.539999999999999980e-01
1.559999999999999998e-01
1.559999999999999998e-01
1.580000000000000016e-01
1.580000000000000016e-01
1.600000000000000033e-01
1.600000000000000033e-01
1.680000000000000104e-01
1.680000000000000104e-01
1.779999999999999916e-01
1.779999999999999916e-01
1.839999999999999969e-01
1.839999999999999969e-01
1.859999999999999987e-01
1.900000000000000022e-01
1.900000000000000022e-01
1.920000000000000040e-01
1.920000000000000040e-01
1.960000000000000075e-01
1.960000000000000075e-01
1.980000000000000093e-01
1.980000000000000093e-01
2.020000000000000129e-01
2.020000000000000129e-01
2.039999999999999869e-01
2.039999999999999869e-01
2.059999999999999887e-01
2.059999999999999887e-01
2.079999999999999905e-01
2.079999999999999905e-01
2.119999999999999940e-01
2.119999999999999940e-01
2.159999999999999976e-01
2.159999999999999976e-01
2.179999999999999993e-01
2.179999999999999993e-01
2.200000000000000011e-01
2.200000000000000011e-01
2.220000000000000029e-01
2.220000000000000029e-01
2.240000000000000047e-01
2.240000000000000047e-01
2.379999999999999893e-01
2.379999999999999893e-01
2.560000000000000053e-01
2.560000000000000053e-01
2.620000000000000107e-01
2.620000000000000107e-01
2.680000000000000160e-01
2.680000000000000160e-01
2.700000000000000178e-01
2.700000000000000178e-01
2.740000000000000213e-01
2.740000000000000213e-01
2.760000000000000231e-01
2.760000000000000231e-01
2.780000000000000249e-01
2.780000000000000249e-01
2.800000000000000266e-01
2.800000000000000266e-01
2.839999999999999747e-01
2.839999999999999747e-01
2.859999999999999765e-01
2.859999999999999765e-01
2.879999999999999782e-01
2.879999999999999782e-01
2.899999999999999800e-01
2.899999999999999800e-01
2.919999999999999818e-01
2.919999999999999818e-01
2.999999999999999889e-01
2.999999999999999889e-01
3.019999999999999907e-01
3.019999999999999907e-01
3.180000000000000049e-01
3.180000000000000049e-01
3.200000000000000067e-01
3.200000000000000067e-01
3.320000000000000173e-01
3.320000000000000173e-01
3.340000000000000191e-01
3.340000000000000191e-01
3.400000000000000244e-01
3.400000000000000244e-01
3.420000000000000262e-01
3.420000000000000262e-01
3.479999999999999760e-01
3.479999999999999760e-01
3.519999999999999796e-01
3.519999999999999796e-01
3.559999999999999831e-01
3.559999999999999831e-01
3.579999999999999849e-01
3.579999999999999849e-01
3.599999999999999867e-01
3.639999999999999902e-01
3.639999999999999902e-01
3.659999999999999920e-01
3.659999999999999920e-01
3.699999999999999956e-01
3.699999999999999956e-01
3.780000000000000027e-01
3.780000000000000027e-01
3.820000000000000062e-01
3.820000000000000062e-01
3.840000000000000080e-01
3.840000000000000080e-01
3.940000000000000169e-01
3.940000000000000169e-01
3.980000000000000204e-01
3.980000000000000204e-01
4.060000000000000275e-01
4.060000000000000275e-01
4.299999999999999933e-01
4.299999999999999933e-01
4.319999999999999951e-01
4.319999999999999951e-01
4.339999999999999969e-01
4.339999999999999969e-01
4.420000000000000040e-01
4.420000000000000040e-01
4.500000000000000111e-01
4.500000000000000111e-01
4.640000000000000235e-01
4.640000000000000235e-01
4.680000000000000271e-01
4.680000000000000271e-01
4.719999999999999751e-01
4.719999999999999751e-01
4.759999999999999787e-01
4.759999999999999787e-01
4.779999999999999805e-01
4.779999999999999805e-01
4.799999999999999822e-01
4.799999999999999822e-01
4.819999999999999840e-01
4.819999999999999840e-01
4.859999999999999876e-01
4.859999999999999876e-01
4.899999999999999911e-01
4.899999999999999911e-01
5.000000000000000000e-01
5.000000000000000000e-01
5.040000000000000036e-01
5.040000000000000036e-01
5.060000000000000053e-01
5.060000000000000053e-01
5.180000000000000160e-01
5.180000000000000160e-01
5.200000000000000178e-01
5.200000000000000178e-01
5.220000000000000195e-01
5.220000000000000195e-01
5.260000000000000231e-01
5.260000000000000231e-01
5.300000000000000266e-01
5.300000000000000266e-01
5.320000000000000284e-01
5.320000000000000284e-01
5.360000000000000320e-01
5.360000000000000320e-01
5.400000000000000355e-01
5.400000000000000355e-01
5.420000000000000373e-01
5.420000000000000373e-01
5.480000000000000426e-01
5.480000000000000426e-01
5.500000000000000444e-01
5.500000000000000444e-01
5.520000000000000462e-01
5.520000000000000462e-01
5.540000000000000480e-01
5.540000000000000480e-01
5.580000000000000515e-01
5.580000000000000515e-01
5.679999999999999494e-01
5.679999999999999494e-01
5.739999999999999547e-01
5.739999999999999547e-01
5.779999999999999583e-01
5.779999999999999583e-01
5.799999999999999600e-01
5.799999999999999600e-01
5.879999999999999671e-01
5.879999999999999671e-01
5.919999999999999707e-01
5.919999999999999707e-01
5.959999999999999742e-01
5.959999999999999742e-01
5.979999999999999760e-01
5.979999999999999760e-01
6.079999999999999849e-01
6.079999999999999849e-01
6.179999999999999938e-01
6.179999999999999938e-01
6.239999999999999991e-01
6.239999999999999991e-01
6.280000000000000027e-01
6.280000000000000027e-01
6.480000000000000204e-01
6.480000000000000204e-01
6.560000000000000275e-01
6.560000000000000275e-01
6.580000000000000293e-01
6.580000000000000293e-01
6.620000000000000329e-01
6.620000000000000329e-01
6.680000000000000382e-01
6.680000000000000382e-01
6.700000000000000400e-01
6.700000000000000400e-01
6.720000000000000417e-01
6.720000000000000417e-01
6.780000000000000471e-01
6.780000000000000471e-01
6.840000000000000524e-01
6.840000000000000524e-01
6.860000000000000542e-01
6.860000000000000542e-01
6.879999999999999449e-01
6.879999999999999449e-01
6.899999999999999467e-01
6.899999999999999467e-01
6.919999999999999485e-01
6.919999999999999485e-01
6.959999999999999520e-01
6.959999999999999520e-01
6.999999999999999556e-01
6.999999999999999556e-01
7.059999999999999609e-01
7.059999999999999609e-01
7.119999999999999662e-01
7.119999999999999662e-01
7.159999999999999698e-01
7.159999999999999698e-01
7.179999999999999716e-01
7.179999999999999716e-01
7.239999999999999769e-01
7.239999999999999769e-01
7.319999999999999840e-01
7.319999999999999840e-01
7.379999999999999893e-01
7.379999999999999893e-01
7.419999999999999929e-01
7.419999999999999929e-01
7.459999999999999964e-01
7.459999999999999964e-01
7.479999999999999982e-01
7.479999999999999982e-01
7.500000000000000000e-01
7.500000000000000000e-01
7.520000000000000018e-01
7.520000000000000018e-01
7.540000000000000036e-01
7.540000000000000036e-01
7.560000000000000053e-01
7.560000000000000053e-01
7.580000000000000071e-01
7.580000000000000071e-01
7.680000000000000160e-01
7.680000000000000160e-01
7.720000000000000195e-01
7.720000000000000195e-01
7.760000000000000231e-01
7.760000000000000231e-01
7.800000000000000266e-01
7.800000000000000266e-01
7.840000000000000302e-01
7.840000000000000302e-01
7.880000000000000338e-01
7.880000000000000338e-01
7.900000000000000355e-01
7.900000000000000355e-01
7.920000000000000373e-01
7.920000000000000373e-01
7.940000000000000391e-01
7.940000000000000391e-01
7.960000000000000409e-01
7.960000000000000409e-01
7.980000000000000426e-01
7.980000000000000426e-01
8.000000000000000444e-01
8.000000000000000444e-01
8.060000000000000497e-01
8.060000000000000497e-01
8.100000000000000533e-01
8.100000000000000533e-01
8.120000000000000551e-01
8.120000000000000551e-01
8.159999999999999476e-01
8.159999999999999476e-01
8.179999999999999494e-01
8.179999999999999494e-01
8.199999999999999512e-01
8.199999999999999512e-01
8.219999999999999529e-01
8.219999999999999529e-01
8.239999999999999547e-01
8.239999999999999547e-01
8.259999999999999565e-01
8.259999999999999565e-01
8.279999999999999583e-01
8.279999999999999583e-01
8.299999999999999600e-01
8.299999999999999600e-01
8.319999999999999618e-01
8.319999999999999618e-01
8.359999999999999654e-01
8.359999999999999654e-01
8.399999999999999689e-01
8.399999999999999689e-01
8.419999999999999707e-01
8.419999999999999707e-01
8.439999999999999725e-01
8.439999999999999725e-01
8.459999999999999742e-01
8.459999999999999742e-01
8.539999999999999813e-01
8.539999999999999813e-01
8.579999999999999849e-01
8.579999999999999849e-01
8.659999999999999920e-01
8.659999999999999920e-01
8.719999999999999973e-01
8.719999999999999973e-01
8.739999999999999991e-01
8.739999999999999991e-01
8.760000000000000009e-01
8.760000000000000009e-01
8.780000000000000027e-01
8.780000000000000027e-01
8.800000000000000044e-01
8.800000000000000044e-01
8.820000000000000062e-01
8.820000000000000062e-01
8.860000000000000098e-01
8.860000000000000098e-01
8.900000000000000133e-01
8.900000000000000133e-01
8.920000000000000151e-01
8.920000000000000151e-01
8.940000000000000169e-01
8.940000000000000169e-01
9.340000000000000524e-01
9.340000000000000524e-01
9.360000000000000542e-01
9.360000000000000542e-01
9.379999999999999449e-01
9.379999999999999449e-01
9.399999999999999467e-01
9.399999999999999467e-01
9.419999999999999485e-01
9.419999999999999485e-01
9.479999999999999538e-01
9.479999999999999538e-01
9.499999999999999556e-01
9.499999999999999556e-01
9.539999999999999591e-01
9.539999999999999591e-01
9.559999999999999609e-01
9.559999999999999609e-01
9.579999999999999627e-01
9.579999999999999627e-01
9.599999999999999645e-01
9.599999999999999645e-01
9.659999999999999698e-01
9.659999999999999698e-01
9.719999999999999751e-01
9.719999999999999751e-01
9.739999999999999769e-01
9.739999999999999769e-01
9.759999999999999787e-01
9.759999999999999787e-01
9.779999999999999805e-01
9.779999999999999805e-01
9.799999999999999822e-01
9.799999999999999822e-01
9.819999999999999840e-01
9.819999999999999840e-01
9.839999999999999858e-01
9.839999999999999858e-01
9.859999999999999876e-01
9.859999999999999876e-01
9.879999999999999893e-01
9.879999999999999893e-01
9.919999999999999929e-01
9.919999999999999929e-01
9.959999999999999964e-01
9.959999999999999964e-01
9.979999999999999982e-01
9.979999999999999982e-01
1.000000000000000000e+00
1.000000000000000000e+00
