0.000000000000000000e+00
9.477341399358787596e-03
9.477341399358787596e-03
2.110687091920543379e-02
2.110687091920543379e-02
2.820319130878631841e-02
2.820319130878631841e-02
3.111623370525423704e-02
3.111623370525423704e-02
3.499599977140244872e-02
3.499599977140244872e-02
3.618701424544445294e-02
3.618701424544445294e-02
3.951809712018027054e-02
3.951809712018027054e-02
4.055884613743344913e-02
4.055884613743344913e-02
4.156921938165305391e-02
4.255138070615335777e-02
4.350724077667991740e-02
4.350724077667991740e-02
4.534666470645884462e-02
4.534666470645884462e-02
4.958447337624954931e-02
5.037856687123999644e-02
5.266858646290026313e-02
5.266858646290026313e-02
5.754997827975263935e-02
5.754997827975263935e-02
5.820154637120907026e-02
5.820154637120907026e-02
5.884284153573823839e-02
5.884284153573823839e-02
6.131166283832138741e-02
6.131166283832138741e-02
6.363961030678927377e-02
6.363961030678927377e-02
6.637394066951275706e-02
6.637394066951275706e-02
6.893475175845634184e-02
6.893475175845634184e-02
7.087115068912033800e-02
7.087115068912033800e-02
7.134073170356469706e-02
7.134073170356469706e-02
7.447737911607792138e-02
7.447737911607792138e-02
7.574628703771557614e-02
7.574628703771557614e-02
7.656879259855152442e-02
7.656879259855152442e-02
7.854731058413139122e-02
7.854731058413139122e-02
7.893022234860358477e-02
7.893022234860358477e-02
7.968374991176055411e-02
7.968374991176055411e-02
8.078415686259281248e-02
8.078415686259281248e-02
8.184998472815983861e-02
8.184998472815983861e-02
8.254198931453009258e-02
8.254198931453009258e-02
8.355309689054021827e-02
8.355309689054021827e-02
8.388313298870041235e-02
8.388313298870041235e-02
8.485281374238570762e-02
8.485281374238570762e-02
8.670363314187012893e-02
8.670363314187012893e-02
8.729536070147142501e-02
8.729536070147142501e-02
8.758664281726981360e-02
8.758664281726981360e-02
8.844252370890373638e-02
8.844252370890373638e-02
8.954283890965263060e-02
8.954283890965263060e-02
9.160960648316310295e-02
9.160960648316310295e-02
9.209951139935543263e-02
9.209951139935543263e-02
9.234056530041387378e-02
9.234056530041387378e-02
9.395701144672494176e-02
9.395701144672494176e-02
9.586021072374083241e-02
9.625746724280667688e-02
9.757704648122936253e-02
9.775673889814451289e-02
9.775673889814451289e-02
9.810963255460700139e-02
9.810963255460700139e-02
9.895453501482384673e-02
9.895453501482384673e-02
9.911720335037707552e-02
9.911720335037707552e-02
9.943631127510714485e-02
9.943631127510714485e-02
9.959277082198285391e-02
9.959277082198285391e-02
9.974718041127779433e-02
9.974718041127779433e-02
9.989954954853400015e-02
9.989954954853400015e-02
1.003445065760951299e-01
1.003445065760951299e-01
1.004888053466653497e-01
1.004888053466653497e-01
1.006311085102414987e-01
1.006311085102414987e-01
1.010461280801991102e-01
1.010461280801991102e-01
1.011805317242403107e-01
1.011805317242403107e-01
1.013129804121860739e-01
1.013129804121860739e-01
1.014434818014444961e-01
1.014434818014444961e-01
1.021860068698253743e-01
1.023030791325461597e-01
1.027525182173167073e-01
1.027525182173167073e-01
1.038355430476481794e-01
1.038355430476481794e-01
1.039230484541326383e-01
1.039230484541326383e-01
1.040087496319420379e-01
1.040087496319420379e-01
1.041747570191550731e-01
1.041747570191550731e-01
1.045585003718014494e-01
1.045585003718014494e-01
1.046299192391927646e-01
1.046299192391927646e-01
1.049605640228748193e-01
1.049605640228748193e-01
1.050214263852857766e-01
1.050214263852857766e-01
1.052995726487054862e-01
1.052995726487054862e-01
1.054456257983232004e-01
1.054456257983232004e-01
1.055343545960271689e-01
1.055343545960271689e-01
1.055761336666578287e-01
1.055761336666578287e-01
1.056161919404406679e-01
1.056161919404406679e-01
1.056545313746646841e-01
1.056545313746646841e-01
1.056911538398554867e-01
1.056911538398554867e-01
1.057907368345641086e-01
1.057907368345641086e-01
1.059225188522252004e-01
1.059225188522252004e-01
1.059632955319906866e-01
1.059632955319906866e-01
1.060244311467880562e-01
1.060244311467880562e-01
1.060354657649976995e-01
1.060448018528018232e-01
1.060448018528018232e-01
1.060626230111248874e-01
1.060626230111248874e-01
1.060660171779821276e-01
1.060660171779821276e-01
1.060626230111248874e-01
1.060626230111248874e-01
1.059972641156365081e-01
1.059972641156365081e-01
1.059632955319906866e-01
1.059632955319906866e-01
1.058485710815219305e-01
1.058485710815219305e-01
1.057260611202365808e-01
1.057260611202365808e-01
1.056911538398554867e-01
1.056911538398554867e-01
1.056161919404406402e-01
1.056161919404406402e-01
1.055343545960271689e-01
1.055343545960271689e-01
1.054908526840123706e-01
1.054908526840123706e-01
1.054456257983232004e-01
1.054456257983232004e-01
1.053499881347881306e-01
1.053499881347881306e-01
1.050214263852857766e-01
1.050214263852857766e-01
1.049605640228747916e-01
1.049605640228747916e-01
1.047674567792881012e-01
1.047674567792881012e-01
1.044853099722635736e-01
1.044853099722635736e-01
1.044103443151108424e-01
1.044103443151108424e-01
1.040087496319420379e-01
1.040087496319420379e-01
1.039230484541326383e-01
1.039230484541326383e-01
1.038355430476481794e-01
1.038355430476481794e-01
1.037462288471248661e-01
1.037462288471248661e-01
1.036551011769319408e-01
1.036551011769319408e-01
1.033707889106008637e-01
1.033707889106008637e-01
1.029660138103830891e-01
1.029660138103830891e-01
1.028601963832463106e-01
1.028601963832463106e-01
1.026429734565401375e-01
1.026429734565401375e-01
1.024182600906693719e-01
1.024182600906693719e-01
1.019461622622450658e-01
1.019461622622450658e-01
1.015720433977775339e-01
1.015720433977775339e-01
1.013129804121860739e-01
1.013129804121860739e-01
1.010461280801991102e-01
1.010461280801991102e-01
1.009097616685323412e-01
1.009097616685323412e-01
1.006311085102414987e-01
1.006311085102414987e-01
1.004888053466653497e-01
1.004888053466653497e-01
9.974718041127779433e-02
9.974718041127779433e-02
9.959277082198285391e-02
9.959277082198285391e-02
9.943631127510714485e-02
9.943631127510714485e-02
9.862291822897960303e-02
9.862291822897960303e-02
9.845394862574075034e-02
9.845394862574075034e-02
9.828285710132769748e-02
9.828285710132769748e-02
9.793426366701289687e-02
9.793426366701289687e-02
9.775673889814452677e-02
9.775673889814452677e-02
9.605998126170960105e-02
9.605998126170960105e-02
9.586021072374084628e-02
9.586021072374084628e-02
9.565814131583365298e-02
9.565814131583365298e-02
9.503799240303847928e-02
9.503799240303847928e-02
9.439661010862626656e-02
9.439661010862626656e-02
9.373355855828796601e-02
9.373355855828796601e-02
9.327925814456287934e-02
9.327925814456287934e-02
9.304837451562493478e-02
9.304837451562493478e-02
9.281497723966752877e-02
9.281497723966752877e-02
9.234056530041387378e-02
9.234056530041387378e-02
9.209951139935543263e-02
9.209951139935543263e-02
9.185586535436918165e-02
9.185586535436918165e-02
9.110916529087509375e-02
9.110916529087509375e-02
9.085493932637894732e-02
9.085493932637894732e-02
9.007596793817981840e-02
9.007596793817981840e-02
8.927205609819904852e-02
8.927205609819904852e-02
8.899842695239056078e-02
8.899842695239056078e-02
8.787491109526085475e-02
8.787491109526085475e-02
8.729536070147142501e-02
8.729536070147142501e-02
8.670363314187011505e-02
8.670363314187011505e-02
8.640312494348800776e-02
8.640312494348800776e-02
8.609947735033006422e-02
8.609947735033006422e-02
8.579265702844270092e-02
8.579265702844270092e-02
8.548262981448334630e-02
8.548262981448334630e-02
8.420973815420636222e-02
8.420973815420636222e-02
8.355309689054019051e-02
8.355309689054019051e-02
8.321958904008117108e-02
8.321958904008117108e-02
8.219781018980981679e-02
8.219781018980981679e-02
8.149846624323675570e-02
8.149846624323675570e-02
8.078415686259281248e-02
8.078415686259281248e-02
8.042126584430266123e-02
8.042126584430266123e-02
8.005448144857350845e-02
8.005448144857350845e-02
7.968374991176056799e-02
7.968374991176056799e-02
7.930901588091987531e-02
7.930901588091987531e-02
7.854731058413139122e-02
7.854731058413139122e-02
7.816022006110269482e-02
7.816022006110269482e-02
7.656879259855153830e-02
7.656879259855153830e-02
7.615983193258765716e-02
7.615983193258765716e-02
7.574628703771557614e-02
7.574628703771557614e-02
7.490514001054934812e-02
7.490514001054934812e-02
7.404471621932250114e-02
7.404471621932250114e-02
7.360706487831178424e-02
7.360706487831178424e-02
7.316433557410331745e-02
7.316433557410331745e-02
7.226326867780062668e-02
7.226326867780062668e-02
7.180473521990037022e-02
7.180473521990037022e-02
7.039588056129421345e-02
7.039588056129421345e-02
6.991480529902090180e-02
6.991480529902090180e-02
6.893475175845634184e-02
6.893475175845634184e-02
6.843551709456136001e-02
6.843551709456136001e-02
6.792996393345133999e-02
6.792996393345133999e-02
6.689932735087850135e-02
6.689932735087850135e-02
6.637394066951274318e-02
6.637394066951274318e-02
6.584162816941876994e-02
6.584162816941876994e-02
6.420140185385361797e-02
6.420140185385361797e-02
6.363961030678927377e-02
6.363961030678927377e-02
6.306996115426105609e-02
6.306996115426105609e-02
6.131166283832137354e-02
6.131166283832137354e-02
5.947419608536123892e-02
5.947419608536123892e-02
5.884284153573821757e-02
5.884284153573821757e-02
5.820154637120906332e-02
5.820154637120906332e-02
5.688778427747031435e-02
5.688778427747031435e-02
5.552999189627168264e-02
5.552999189627168264e-02
5.412485565800613518e-02
5.412485565800613518e-02
5.340337068013589067e-02
5.340337068013589067e-02
5.266858646290023538e-02
5.266858646290023538e-02
5.191993836668142015e-02
5.191993836668142015e-02
5.115681772745449274e-02
5.115681772745449274e-02
5.037856687124001032e-02
5.037856687124001032e-02
4.958447337624956319e-02
4.958447337624956319e-02
4.877376343896379363e-02
4.877376343896379363e-02
4.534666470645885850e-02
4.534666470645885850e-02
4.443849682426264519e-02
4.443849682426264519e-02
4.255138070615337165e-02
4.255138070615337165e-02
4.156921938165307473e-02
4.156921938165307473e-02
4.055884613743346301e-02
4.055884613743346301e-02
3.951809712018028442e-02
3.951809712018028442e-02
3.844450545916804074e-02
3.844450545916804074e-02
3.733523804664973245e-02
3.733523804664973245e-02
3.618701424544447376e-02
3.618701424544447376e-02
3.375766579608253937e-02
3.375766579608253937e-02
3.246659822032485487e-02
3.246659822032485487e-02
3.111623370525425092e-02
3.111623370525425092e-02
2.969848480983500530e-02
2.969848480983500530e-02
2.820319130878632535e-02
2.820319130878632535e-02
2.110687091920544073e-02
2.110687091920544073e-02
1.889761889762835503e-02
1.889761889762835503e-02
9.477341399358792801e-03
9.477341399358792801e-03
0.000000000000000000e+00
