2.000000000000000000e+00
1.000000000000000000e+00
9.999998807907104492e-01
9.999997615814208984e-01
9.999997019767761230e-01
9.999996423721313477e-01
9.999995231628417969e-01
9.999992847442626953e-01
9.999990463256835938e-01
9.999989867210388184e-01
9.999985694885253906e-01
9.999977946281433105e-01
9.999973773956298828e-01
9.999970197677612305e-01
9.999969005584716797e-01
9.999968409538269043e-01
9.999966025352478027e-01
9.999868273735046387e-01
9.999849796295166016e-01
9.999747872352600098e-01
9.999745488166809082e-01
9.999678134918212891e-01
9.999672770500183105e-01
9.999481439590454102e-01
9.999471306800842285e-01
9.999314546585083008e-01
9.999195337295532227e-01
9.998304843902587891e-01
9.998224973678588867e-01
9.997766613960266113e-01
9.997681379318237305e-01
9.997438192367553711e-01
9.997169971466064453e-01
9.993904232978820801e-01
9.993474483489990234e-01
9.991633892059326172e-01
9.991171956062316895e-01
9.949193000793457031e-01
9.944780468940734863e-01
9.934833049774169922e-01
9.928183555603027344e-01
9.914677143096923828e-01
9.909405112266540527e-01
9.886971116065979004e-01
9.868350625038146973e-01
9.861263036727905273e-01
9.859560132026672363e-01
9.844946861267089844e-01
9.827154874801635742e-01
9.804362654685974121e-01
9.776615500450134277e-01
9.741297960281372070e-01
9.735025167465209961e-01
9.719505310058593750e-01
9.671924114227294922e-01
9.591814279556274414e-01
9.581882357597351074e-01
9.513071775436401367e-01
9.282882213592529297e-01
9.272888898849487305e-01
9.250060319900512695e-01
9.232929348945617676e-01
9.158810377120971680e-01
9.054893255233764648e-01
9.051632285118103027e-01
9.044438004493713379e-01
8.923264741897583008e-01
8.755042552947998047e-01
8.735771179199218750e-01
8.543182015419006348e-01
8.515440225601196289e-01
8.469906449317932129e-01
8.450983762741088867e-01
8.412500619888305664e-01
8.402245044708251953e-01
8.382074236869812012e-01
8.322082757949829102e-01
8.225356936454772949e-01
8.124694824218750000e-01
7.991992235183715820e-01
7.991972565650939941e-01
7.958159446716308594e-01
7.843402624130249023e-01
7.838447093963623047e-01
7.795881032943725586e-01
7.792300581932067871e-01
7.783579826354980469e-01
7.779350280761718750e-01
7.753883600234985352e-01
7.747552394866943359e-01
7.729107737541198730e-01
7.665333151817321777e-01
7.588452696800231934e-01
7.580914497375488281e-01
7.525082826614379883e-01
7.491884827613830566e-01
7.301402091979980469e-01
7.172970771789550781e-01
7.143191099166870117e-01
6.969549655914306641e-01
6.942558288574218750e-01
6.893899440765380859e-01
6.872231960296630859e-01
6.854635477066040039e-01
6.852141022682189941e-01
6.847938895225524902e-01
6.801804304122924805e-01
6.799317598342895508e-01
6.791880130767822266e-01
6.769312620162963867e-01
6.748023033142089844e-01
6.711730957031250000e-01
6.647704243659973145e-01
6.622347831726074219e-01
6.606604456901550293e-01
6.591548919677734375e-01
6.587374210357666016e-01
6.573081016540527344e-01
6.519923210144042969e-01
6.486463546752929688e-01
6.476258039474487305e-01
6.474970579147338867e-01
6.422154903411865234e-01
6.384046673774719238e-01
6.273119449615478516e-01
6.246507763862609863e-01
6.237788796424865723e-01
6.203409433364868164e-01
6.181474328041076660e-01
6.171791553497314453e-01
6.052609682083129883e-01
6.002682447433471680e-01
5.969551801681518555e-01
5.956274867057800293e-01
5.853444337844848633e-01
5.789614915847778320e-01
5.775859355926513672e-01
5.774671435356140137e-01
5.707001686096191406e-01
5.699785947799682617e-01
5.643618106842041016e-01
5.640126466751098633e-01
5.617952346801757812e-01
5.582818388938903809e-01
5.530075430870056152e-01
5.498731136322021484e-01
5.498698949813842773e-01
5.428438186645507812e-01
5.367040634155273438e-01
5.360429286956787109e-01
5.337868332862854004e-01
5.299829244613647461e-01
5.212720036506652832e-01
5.210980176925659180e-01
5.192281603813171387e-01
5.176435708999633789e-01
5.014412403106689453e-01
4.991846680641174316e-01
4.991762042045593262e-01
4.946077764034271240e-01
4.923695027828216553e-01
4.899471998214721680e-01
4.847115874290466309e-01
4.846168458461761475e-01
4.825333356857299805e-01
4.819470643997192383e-01
4.788427948951721191e-01
4.780044555664062500e-01
4.726348519325256348e-01
4.723567962646484375e-01
4.692957699298858643e-01
4.678108990192413330e-01
4.639857411384582520e-01
4.623661041259765625e-01
4.614023864269256592e-01
4.605438113212585449e-01
4.598155319690704346e-01
4.591244757175445557e-01
4.590788185596466064e-01
4.565079808235168457e-01
4.558090269565582275e-01
4.548234343528747559e-01
4.530166685581207275e-01
4.517377614974975586e-01
4.511207938194274902e-01
4.506558775901794434e-01
4.476626515388488770e-01
4.471763074398040771e-01
4.355835914611816406e-01
4.287748932838439941e-01
4.240714907646179199e-01
4.237704277038574219e-01
4.233894944190979004e-01
4.216210246086120605e-01
4.198450148105621338e-01
4.186562299728393555e-01
4.157141149044036865e-01
4.129840135574340820e-01
4.128968119621276855e-01
4.027622342109680176e-01
4.002560377120971680e-01
3.980335295200347900e-01
3.952711224555969238e-01
3.926016390323638916e-01
3.885240256786346436e-01
3.883126378059387207e-01
3.838155567646026611e-01
3.764743506908416748e-01
3.730433881282806396e-01
3.729633986949920654e-01
3.715006411075592041e-01
3.658871948719024658e-01
3.631715774536132812e-01
3.627609312534332275e-01
3.584953546524047852e-01
3.545044064521789551e-01
3.522518277168273926e-01
3.506176769733428955e-01
3.484835028648376465e-01
3.483903110027313232e-01
3.481159806251525879e-01
3.453978896141052246e-01
3.410783112049102783e-01
3.384342789649963379e-01
3.384076952934265137e-01
3.350069522857666016e-01
3.304518461227416992e-01
3.287791609764099121e-01
3.286993503570556641e-01
3.260098993778228760e-01
3.148655891418457031e-01
3.120157122611999512e-01
3.091810345649719238e-01
3.079151213169097900e-01
3.051009774208068848e-01
3.040611743927001953e-01
3.016540408134460449e-01
3.015998005867004395e-01
2.942991852760314941e-01
2.930819988250732422e-01
2.847055792808532715e-01
2.829449176788330078e-01
2.787726521492004395e-01
2.780613899230957031e-01
2.775074243545532227e-01
2.755812108516693115e-01
2.731983065605163574e-01
2.726436853408813477e-01
2.667323052883148193e-01
2.648800015449523926e-01
2.642490565776824951e-01
2.631263732910156250e-01
2.606853246688842773e-01
2.593886256217956543e-01
2.519911527633666992e-01
2.513963580131530762e-01
2.513684630393981934e-01
2.460737526416778564e-01
2.402017414569854736e-01
2.333817780017852783e-01
2.289630174636840820e-01
2.280818521976470947e-01
2.274814546108245850e-01
2.238551974296569824e-01
2.219716608524322510e-01
2.199267148971557617e-01
2.197445034980773926e-01
2.160466015338897705e-01
2.144172489643096924e-01
2.106409072875976562e-01
2.036710977554321289e-01
2.031154930591583252e-01
1.979333460330963135e-01
1.964598298072814941e-01
1.954840123653411865e-01
1.943457722663879395e-01
1.864765286445617676e-01
1.843431591987609863e-01
1.824232041835784912e-01
1.792753934860229492e-01
1.764443218708038330e-01
1.742283999919891357e-01
1.695943772792816162e-01
1.688719093799591064e-01
1.641922295093536377e-01
1.634469628334045410e-01
1.632148027420043945e-01
1.601340770721435547e-01
1.597109138965606689e-01
1.595288217067718506e-01
1.592983603477478027e-01
1.561753451824188232e-01
1.551830172538757324e-01
1.549002230167388916e-01
1.542735397815704346e-01
1.530838310718536377e-01
1.525754332542419434e-01
1.518547534942626953e-01
1.517625451087951660e-01
1.506229043006896973e-01
1.497492194175720215e-01
1.496725380420684814e-01
1.483142673969268799e-01
1.480889916419982910e-01
1.477507948875427246e-01
1.471787095069885254e-01
1.463782787322998047e-01
1.432716548442840576e-01
1.399637758731842041e-01
1.378020644187927246e-01
1.322746276855468750e-01
1.294220685958862305e-01
1.285062134265899658e-01
1.265474855899810791e-01
1.252783536911010742e-01
1.224274039268493652e-01
1.217184960842132568e-01
1.216254234313964844e-01
1.203722059726715088e-01
1.196279227733612061e-01
1.191886067390441895e-01
1.179488003253936768e-01
1.160835623741149902e-01
1.160375177860260010e-01
1.134983003139495850e-01
1.108187735080718994e-01
1.099455356597900391e-01
1.093227267265319824e-01
1.079010963439941406e-01
1.074689030647277832e-01
1.061143577098846436e-01
1.057276427745819092e-01
1.046465337276458740e-01
1.041035652160644531e-01
1.040745377540588379e-01
1.035685837268829346e-01
1.030621230602264404e-01
1.020167171955108643e-01
1.014430522918701172e-01
9.981036186218261719e-02
9.837791323661804199e-02
9.552404284477233887e-02
9.197404980659484863e-02
9.191685914993286133e-02
9.017702937126159668e-02
9.016072750091552734e-02
8.952814340591430664e-02
8.849003911018371582e-02
8.673098683357238770e-02
8.659604191780090332e-02
8.415949344635009766e-02
8.231055736541748047e-02
8.201694488525390625e-02
8.002397418022155762e-02
7.960292696952819824e-02
7.932645082473754883e-02
7.881250977516174316e-02
7.761275768280029297e-02
7.579869031906127930e-02
7.559680938720703125e-02
7.553890347480773926e-02
7.514819502830505371e-02
7.317268848419189453e-02
7.217854261398315430e-02
6.725555658340454102e-02
6.599798798561096191e-02
6.599527597427368164e-02
6.529626250267028809e-02
6.347391009330749512e-02
6.307908892631530762e-02
5.897316336631774902e-02
5.535680055618286133e-02
5.344736576080322266e-02
5.290096998214721680e-02
5.268117785453796387e-02
5.113792419433593750e-02
4.615044593811035156e-02
4.614874720573425293e-02
4.545259475708007812e-02
4.506427049636840820e-02
4.250040650367736816e-02
4.131868481636047363e-02
3.750613331794738770e-02
3.714537620544433594e-02
3.533330559730529785e-02
3.462567925453186035e-02
3.288280963897705078e-02
3.208002448081970215e-02
3.094083070755004883e-02
3.084775805473327637e-02
3.047096729278564453e-02
3.004828095436096191e-02
2.832490205764770508e-02
2.822637557983398438e-02
2.760165929794311523e-02
2.696466445922851562e-02
2.589991688728332520e-02
2.581295371055603027e-02
2.270358800888061523e-02
2.256673574447631836e-02
1.994895935058593750e-02
1.922792196273803711e-02
1.772102713584899902e-02
1.744067668914794922e-02
1.501652598381042480e-02
1.482549309730529785e-02
1.427215337753295898e-02
1.391422748565673828e-02
1.266881823539733887e-02
1.199507713317871094e-02
9.945541620254516602e-03
9.831786155700683594e-03
9.566426277160644531e-03
9.449899196624755859e-03
8.016586303710937500e-03
7.958352565765380859e-03
7.851064205169677734e-03
7.847070693969726562e-03
7.581144571304321289e-03
7.383376359939575195e-03
6.532758474349975586e-03
6.402343511581420898e-03
6.104618310928344727e-03
5.944430828094482422e-03
5.350649356842041016e-03
5.328178405761718750e-03
4.433035850524902344e-03
4.074126482009887695e-03
3.062039613723754883e-03
2.802729606628417969e-03
1.531571149826049805e-03
1.307964324951171875e-03
6.716251373291015625e-04
6.692707538604736328e-04
4.979372024536132812e-04
4.495084285736083984e-04
4.029273986816406250e-04
3.884434700012207031e-04
3.639161586761474609e-04
2.491176128387451172e-04
1.689791679382324219e-04
1.295208930969238281e-04
9.722641698317602277e-05
7.289571658475324512e-05
6.574356120836455375e-06
9.886011866910848767e-07
6.477097969082024065e-08
0.000000000000000000e+00
