9.584401249885559082e-01
6.449196338653564453e-01
5.056651830673217773e-01
9.623135328292846680e-01
5.568352341651916504e-01
9.460453987121582031e-01
1.764883995056152344e-01
2.448166906833648682e-01
2.354251146316528320e-01
9.570108056068420410e-01
9.390910863876342773e-01
5.185694098472595215e-01
7.327652573585510254e-01
9.529671669006347656e-01
9.512832164764404297e-01
6.280394792556762695e-01
3.863602280616760254e-01
9.522031545639038086e-01
4.929944872856140137e-01
9.442191123962402344e-01
9.547892808914184570e-01
5.173824429512023926e-01
9.531240463256835938e-01
5.272962450981140137e-01
3.936167657375335693e-01
9.592957496643066406e-01
1.927374899387359619e-01
2.383330464363098145e-01
9.601378440856933594e-01
2.656714320182800293e-01
4.406093060970306396e-01
9.507607221603393555e-01
5.620188117027282715e-01
9.188708066940307617e-01
3.751359581947326660e-01
9.713753461837768555e-01
5.964926481246948242e-01
9.816836118698120117e-01
9.396502971649169922e-01
9.573651552200317383e-01
2.831909954547882080e-01
5.438410639762878418e-01
5.600493550300598145e-01
9.374060630798339844e-01
9.293744564056396484e-01
9.668340682983398438e-01
7.581177949905395508e-01
5.449053645133972168e-01
9.018435478210449219e-01
9.784332513809204102e-01
6.251508593559265137e-01
5.651391148567199707e-01
4.932073354721069336e-01
5.533127784729003906e-01
9.512869119644165039e-01
5.904793739318847656e-01
9.591087102890014648e-01
9.543865323066711426e-01
2.985311150550842285e-01
2.721195518970489502e-01
3.563117980957031250e-01
6.105284094810485840e-01
4.559363722801208496e-01
2.076353132724761963e-01
6.523191928863525391e-01
1.082995533943176270e-01
9.566475152969360352e-01
5.379505157470703125e-01
9.583306312561035156e-01
4.711224436759948730e-01
4.668796658515930176e-01
4.696749746799468994e-01
7.003766298294067383e-01
9.803242683410644531e-01
2.002176046371459961e-01
2.552129626274108887e-01
8.830964565277099609e-01
3.709275126457214355e-01
9.722895026206970215e-01
6.253397464752197266e-01
6.351759433746337891e-01
9.648014903068542480e-01
6.668472290039062500e-01
5.511493086814880371e-01
5.502600669860839844e-01
9.459567070007324219e-01
7.008884549140930176e-01
3.530318737030029297e-01
8.592427968978881836e-01
4.232964515686035156e-01
1.851631402969360352e-01
9.518185853958129883e-01
1.072479486465454102e-01
4.737353324890136719e-01
5.003802776336669922e-01
3.102725148200988770e-01
9.489526748657226562e-01
3.855904340744018555e-01
9.503211975097656250e-01
5.545203685760498047e-01
4.344589114189147949e-01
1.524407565593719482e-01
2.101021409034729004e-01
7.839167714118957520e-01
5.473094582557678223e-01
2.660424113273620605e-01
9.646440744400024414e-01
9.503798484802246094e-01
4.354491829872131348e-01
9.528751373291015625e-01
5.778894424438476562e-01
8.872420191764831543e-01
9.652242660522460938e-01
2.596599459648132324e-01
3.441643714904785156e-01
7.066851258277893066e-01
8.605291843414306641e-01
9.254368543624877930e-01
9.477779269218444824e-01
8.561553955078125000e-01
3.516771197319030762e-01
9.618352651596069336e-01
5.209876298904418945e-01
9.460026621818542480e-01
8.374072909355163574e-01
7.618368864059448242e-01
8.286767005920410156e-01
6.623969078063964844e-01
8.485368490219116211e-01
2.833984494209289551e-01
2.855833172798156738e-01
9.513248205184936523e-01
6.759262681007385254e-01
2.878109216690063477e-01
9.623231291770935059e-01
9.673686027526855469e-01
6.159090995788574219e-01
5.739612579345703125e-01
9.596886634826660156e-01
7.814235687255859375e-01
9.495631456375122070e-01
3.249756395816802979e-01
2.162711918354034424e-01
2.803514003753662109e-01
9.330446720123291016e-01
5.000498294830322266e-01
4.078916311264038086e-01
9.554647207260131836e-01
3.689765334129333496e-01
5.414743423461914062e-01
9.748018980026245117e-01
1.782037019729614258e-01
1.717322766780853271e-01
3.185154199600219727e-01
1.893772482872009277e-01
5.566690564155578613e-01
6.716911196708679199e-01
5.028765201568603516e-01
9.775653481483459473e-01
4.944075644016265869e-01
9.748390913009643555e-01
4.659637808799743652e-01
2.424996197223663330e-01
3.514660000801086426e-01
9.530296325683593750e-01
2.116555869579315186e-01
9.523544311523437500e-01
6.855327486991882324e-01
5.283867120742797852e-01
4.632233977317810059e-01
8.678156137466430664e-01
9.404325485229492188e-01
9.559502005577087402e-01
4.804173707962036133e-01
6.894173622131347656e-01
3.957468271255493164e-01
2.798204720020294189e-01
4.696114361286163330e-01
9.428235888481140137e-01
2.723858356475830078e-01
9.543254971504211426e-01
6.321372985839843750e-01
2.752939462661743164e-01
4.129265546798706055e-01
9.635931253433227539e-01
5.821465253829956055e-01
9.545325040817260742e-01
8.288892507553100586e-01
9.481786489486694336e-01
2.876560091972351074e-01
9.511034488677978516e-01
5.576598644256591797e-01
9.543671607971191406e-01
2.254765629768371582e-01
3.400898575782775879e-01
4.810801148414611816e-01
2.044092118740081787e-01
1.947826147079467773e-01
1.624791920185089111e-01
9.465542435646057129e-01
9.597940444946289062e-01
6.777797937393188477e-01
8.570345640182495117e-01
6.116784214973449707e-01
5.728341937065124512e-01
2.782468199729919434e-01
5.502983927726745605e-01
4.761899709701538086e-01
5.348872542381286621e-01
3.592103719711303711e-01
4.864088594913482666e-01
7.303422689437866211e-01
1.758867204189300537e-01
2.460631728172302246e-01
5.966922640800476074e-01
6.240154504776000977e-01
5.254467725753784180e-01
6.141002774238586426e-01
4.144898355007171631e-01
9.728811979293823242e-01
7.759395837783813477e-01
2.592043280601501465e-01
9.625262022018432617e-01
4.075523614883422852e-01
9.760630726814270020e-01
6.248350739479064941e-01
9.460378885269165039e-01
5.653522014617919922e-01
9.117151498794555664e-01
8.236529827117919922e-01
4.355597794055938721e-01
6.807726025581359863e-01
8.852708339691162109e-01
5.934596657752990723e-01
9.439204931259155273e-01
7.853022813796997070e-01
9.418959021568298340e-01
9.701407551765441895e-01
1.659744381904602051e-01
8.814898729324340820e-01
5.849204659461975098e-01
3.317289948463439941e-01
9.591554999351501465e-01
2.390081882476806641e-01
9.499766230583190918e-01
6.643927693367004395e-01
9.296591877937316895e-01
9.483399391174316406e-01
9.773592352867126465e-01
9.656265377998352051e-01
2.208709418773651123e-01
2.440710663795471191e-01
3.742640614509582520e-01
6.511554121971130371e-01
5.172941088676452637e-01
4.740885198116302490e-01
7.672374248504638672e-01
4.965192973613739014e-01
6.340593099594116211e-01
8.522562384605407715e-01
2.063228189945220947e-01
9.707369804382324219e-01
2.030027210712432861e-01
1.913884282112121582e-01
8.949068784713745117e-01
4.087564349174499512e-01
5.549894571304321289e-01
8.517564535140991211e-01
9.438004493713378906e-01
7.169892787933349609e-01
9.613841772079467773e-01
4.495461583137512207e-01
6.561316251754760742e-01
2.003322541713714600e-01
9.726392030715942383e-01
4.793730378150939941e-01
9.695855379104614258e-01
9.696309566497802734e-01
9.544241428375244141e-01
9.564017653465270996e-01
8.095309734344482422e-01
5.658223628997802734e-01
9.666807651519775391e-01
4.061338305473327637e-01
4.052227437496185303e-01
8.584824800491333008e-01
3.173587322235107422e-01
2.502384185791015625e-01
5.435639619827270508e-01
5.730752348899841309e-01
7.880687713623046875e-01
6.595150232315063477e-01
9.495555162429809570e-01
2.878844141960144043e-01
6.801659464836120605e-01
7.543129920959472656e-01
8.783861398696899414e-01
3.368877768516540527e-01
7.031809091567993164e-01
4.676118791103363037e-01
4.967861771583557129e-01
9.596395492553710938e-01
6.004201769828796387e-01
5.576051473617553711e-01
5.482143163681030273e-01
3.469145298004150391e-01
6.080110669136047363e-01
6.291791796684265137e-01
4.533437788486480713e-01
2.073316276073455811e-01
1.963995695114135742e-01
1.925291121006011963e-01
1.893008649349212646e-01
9.614527225494384766e-01
9.901861548423767090e-01
3.679733276367187500e-01
9.575635790824890137e-01
5.874337553977966309e-01
6.013513803482055664e-01
2.464976906776428223e-01
1.519529521465301514e-01
1.991260349750518799e-01
1.625720858573913574e-01
2.798135876655578613e-01
7.372493743896484375e-01
9.798625707626342773e-01
6.394093036651611328e-01
1.512031555175781250e-01
2.791478037834167480e-01
4.538740217685699463e-01
3.208495676517486572e-01
4.767919182777404785e-01
2.327157557010650635e-01
8.879212141036987305e-01
2.240178585052490234e-01
5.664294958114624023e-01
6.897315979003906250e-01
4.835390746593475342e-01
7.588726282119750977e-01
3.358113765716552734e-01
9.812793731689453125e-01
2.385262250900268555e-01
3.582602143287658691e-01
9.822643399238586426e-01
2.923448085784912109e-01
1.373851001262664795e-01
2.029892206192016602e-01
2.974267899990081787e-01
4.882019460201263428e-01
8.622750043869018555e-01
2.889074385166168213e-01
8.377535939216613770e-01
5.575370788574218750e-01
6.149528026580810547e-01
6.069762706756591797e-01
3.883804082870483398e-01
4.760212898254394531e-01
7.241905927658081055e-01
7.704932689666748047e-01
4.124493300914764404e-01
6.030238866806030273e-01
5.761293172836303711e-01
2.315690219402313232e-01
8.618820309638977051e-01
6.468358039855957031e-01
2.578343152999877930e-01
4.801329374313354492e-01
6.026881933212280273e-01
9.611023068428039551e-01
5.428680181503295898e-01
9.079667329788208008e-01
9.434351921081542969e-01
9.367934465408325195e-01
8.452371954917907715e-01
8.333357572555541992e-01
5.205774307250976562e-01
9.156059622764587402e-01
9.531773328781127930e-01
9.772768020629882812e-01
9.748799800872802734e-01
4.562493264675140381e-01
8.077206611633300781e-01
3.060249090194702148e-01
6.170829534530639648e-01
7.796149253845214844e-01
9.531897306442260742e-01
9.556322097778320312e-01
8.218498229980468750e-01
7.523087263107299805e-01
2.254545092582702637e-01
9.553469419479370117e-01
5.405807495117187500e-01
7.965586781501770020e-01
9.729596376419067383e-01
6.332560181617736816e-01
9.489943981170654297e-01
9.484573006629943848e-01
7.128009796142578125e-01
9.601331949234008789e-01
2.978715002536773682e-01
7.503601908683776855e-01
8.839266896247863770e-01
9.573214054107666016e-01
9.591935276985168457e-01
9.599807262420654297e-01
9.654905796051025391e-01
7.368433475494384766e-01
9.514385461807250977e-01
6.218651533126831055e-01
7.367899417877197266e-01
9.682986736297607422e-01
1.884063184261322021e-01
3.131034374237060547e-01
9.342895150184631348e-01
6.691408157348632812e-01
9.658470153808593750e-01
9.651074409484863281e-01
9.467509984970092773e-01
4.859599471092224121e-01
9.686792492866516113e-01
9.695611000061035156e-01
5.149224400520324707e-01
9.688224792480468750e-01
3.630087375640869141e-01
8.693977594375610352e-01
9.578146934509277344e-01
6.784944534301757812e-01
9.745777845382690430e-01
4.390172064304351807e-01
9.515826106071472168e-01
8.103238344192504883e-01
8.288134336471557617e-01
7.814312577247619629e-01
6.455157995223999023e-01
3.794340491294860840e-01
6.368930339813232422e-01
9.775446653366088867e-01
5.231402516365051270e-01
6.820005178451538086e-01
9.200428724288940430e-01
7.985792160034179688e-01
9.380456805229187012e-01
3.966470360755920410e-01
6.168763041496276855e-01
6.643242239952087402e-01
4.649388492107391357e-01
4.925256073474884033e-01
9.758691191673278809e-01
9.427980184555053711e-01
8.331311941146850586e-01
9.524319171905517578e-01
6.353990435600280762e-01
9.504051208496093750e-01
9.234672784805297852e-01
6.398864984512329102e-01
9.564435482025146484e-01
5.256864428520202637e-01
9.323137998580932617e-01
3.635455965995788574e-01
7.629170417785644531e-01
4.963706135749816895e-01
9.556343555450439453e-01
5.815914869308471680e-01
3.427619338035583496e-01
7.314373850822448730e-01
9.819473028182983398e-01
6.244754791259765625e-01
8.786750435829162598e-01
5.115719437599182129e-01
8.070368766784667969e-01
7.572053074836730957e-01
9.641273021697998047e-01
3.144747018814086914e-01
5.715625882148742676e-01
9.584119915962219238e-01
9.462603330612182617e-01
9.279159307479858398e-01
7.391238212585449219e-01
7.523185014724731445e-01
9.418944120407104492e-01
9.545806050300598145e-01
9.519157409667968750e-01
6.371126770973205566e-01
9.498512744903564453e-01
5.983151197433471680e-01
9.707821607589721680e-01
1.622263193130493164e-01
2.867137789726257324e-01
1.818403303623199463e-01
9.895216226577758789e-01
9.569567441940307617e-01
9.447106122970581055e-01
2.354699671268463135e-01
2.913426756858825684e-01
9.476916790008544922e-01
3.059377670288085938e-01
9.685370922088623047e-01
4.212633967399597168e-01
9.447570443153381348e-01
8.703482151031494141e-01
6.368091106414794922e-01
4.591579139232635498e-01
9.724460840225219727e-01
9.636441469192504883e-01
2.439036965370178223e-01
3.297233581542968750e-01
5.654913187026977539e-01
2.303850948810577393e-01
1.885549426078796387e-01
6.630467176437377930e-01
1.578373610973358154e-01
9.475843310356140137e-01
2.203003168106079102e-01
9.387115240097045898e-01
9.287964105606079102e-01
2.628183364868164062e-01
1.607194840908050537e-01
3.663835525512695312e-01
4.479702413082122803e-01
3.008194565773010254e-01
6.273690462112426758e-01
2.159296274185180664e-01
1.989539563655853271e-01
2.188848257064819336e-01
1.933006644248962402e-01
9.743638634681701660e-01
5.860259532928466797e-01
9.356782436370849609e-01
9.588397741317749023e-01
9.052431583404541016e-01
8.476507663726806641e-01
1.895811557769775391e-01
2.584395706653594971e-01
5.070523619651794434e-01
9.864341020584106445e-01
2.186201512813568115e-01
2.178775966167449951e-01
2.202723026275634766e-01
9.484343528747558594e-01
9.785590171813964844e-01
9.784712791442871094e-01
9.681626558303833008e-01
9.329961538314819336e-01
1.792223751544952393e-01
8.409842252731323242e-01
1.796429157257080078e-01
2.067140638828277588e-01
1.592826843261718750e-01
9.876145720481872559e-01
1.597235202789306641e-01
9.663656949996948242e-01
2.107681334018707275e-01
9.304771423339843750e-01
9.467580914497375488e-01
9.217499494552612305e-01
3.131565451622009277e-01
9.678329825401306152e-01
5.172079205513000488e-01
1.607160270214080811e-01
6.983991265296936035e-01
9.882740974426269531e-01
1.672131717205047607e-01
4.685895144939422607e-01
2.366593480110168457e-01
3.811689019203186035e-01
1.710254549980163574e-01
9.476652145385742188e-01
1.607510447502136230e-01
2.032766938209533691e-01
2.682775855064392090e-01
7.245236635208129883e-01
4.371434450149536133e-01
4.405801296234130859e-01
2.667310535907745361e-01
2.903494238853454590e-01
3.037575483322143555e-01
9.554966092109680176e-01
9.595044255256652832e-01
1.813973784446716309e-01
9.651651978492736816e-01
6.097835898399353027e-01
2.541995644569396973e-01
9.544920921325683594e-01
9.494078159332275391e-01
2.456783950328826904e-01
3.246784806251525879e-01
9.688607454299926758e-01
1.912161707878112793e-01
2.017835676670074463e-01
9.390730857849121094e-01
9.766899347305297852e-01
6.038409471511840820e-01
9.570003747940063477e-01
9.720811843872070312e-01
2.963336706161499023e-01
1.940250694751739502e-01
3.234253227710723877e-01
1.609432995319366455e-01
4.908456802368164062e-01
9.742950797080993652e-01
9.423334598541259766e-01
9.567674994468688965e-01
2.382430732250213623e-01
1.882120370864868164e-01
7.921172380447387695e-01
4.854717254638671875e-01
1.746269464492797852e-01
9.510589838027954102e-01
1.599398553371429443e-01
2.220059037208557129e-01
2.152391672134399414e-01
9.406014680862426758e-01
2.178410589694976807e-01
1.847330927848815918e-01
9.464459419250488281e-01
9.753918647766113281e-01
1.570300757884979248e-01
9.457350373268127441e-01
7.897692918777465820e-01
4.701879620552062988e-01
3.413524627685546875e-01
5.644172430038452148e-01
9.749374389648437500e-01
5.450960993766784668e-01
2.371952235698699951e-01
9.423563480377197266e-01
2.671980261802673340e-01
7.418332695960998535e-01
1.837729513645172119e-01
9.376746416091918945e-01
4.982267916202545166e-01
6.581948995590209961e-01
4.283484518527984619e-01
9.545796513557434082e-01
9.887635707855224609e-01
1.823396682739257812e-01
1.555268764495849609e-01
9.462782144546508789e-01
1.826300024986267090e-01
4.172107875347137451e-01
3.774814307689666748e-01
9.546179771423339844e-01
1.867873370647430420e-01
6.530644297599792480e-01
1.957671046257019043e-01
1.980653107166290283e-01
4.727759361267089844e-01
9.699196815490722656e-01
9.724185466766357422e-01
9.500922560691833496e-01
9.545114040374755859e-01
9.727345705032348633e-01
1.528765857219696045e-01
1.679348945617675781e-01
2.092556357383728027e-01
9.616191387176513672e-01
9.619200229644775391e-01
9.491665363311767578e-01
9.511942863464355469e-01
6.131793856620788574e-01
1.900791227817535400e-01
1.935838758945465088e-01
2.499722242355346680e-01
2.157106995582580566e-01
9.609986543655395508e-01
1.775983572006225586e-01
2.258086502552032471e-01
1.232288479804992676e-01
3.088530004024505615e-01
2.168298661708831787e-01
5.367161035537719727e-01
6.406196355819702148e-01
7.982120513916015625e-01
9.519628286361694336e-01
5.663809776306152344e-01
2.023212015628814697e-01
9.362369775772094727e-01
2.083908915519714355e-01
9.557826519012451172e-01
9.490863680839538574e-01
8.584192991256713867e-01
9.463726878166198730e-01
5.023940801620483398e-01
7.645097970962524414e-01
1.682851016521453857e-01
7.952564358711242676e-01
8.258363008499145508e-01
4.572958052158355713e-01
4.498890340328216553e-01
1.786504685878753662e-01
6.917312741279602051e-01
6.760800480842590332e-01
9.579343795776367188e-01
5.322755575180053711e-01
1.464958190917968750e-01
6.922203898429870605e-01
5.340381264686584473e-01
9.213161468505859375e-01
1.545379459857940674e-01
1.995816528797149658e-01
1.626847088336944580e-01
1.500461995601654053e-01
4.189499616622924805e-01
9.313483238220214844e-01
1.796895563602447510e-01
1.796185970306396484e-01
2.295075058937072754e-01
3.472049832344055176e-01
9.002228975296020508e-01
1.716071367263793945e-01
1.748200654983520508e-01
3.963950872421264648e-01
1.488420963287353516e-01
6.449448466300964355e-01
3.820404708385467529e-01
6.581552624702453613e-01
2.123033702373504639e-01
3.872886598110198975e-01
3.449643850326538086e-01
3.791943788528442383e-01
5.045387148857116699e-01
1.835682392120361328e-01
9.566660523414611816e-01
6.480190157890319824e-01
1.570764183998107910e-01
3.150717318058013916e-01
2.916867136955261230e-01
9.600511789321899414e-01
9.412627816200256348e-01
9.562045335769653320e-01
2.733669281005859375e-01
9.895272254943847656e-01
2.011508345603942871e-01
2.492481172084808350e-01
2.149497568607330322e-01
1.971123218536376953e-01
1.740045547485351562e-01
2.365209162235260010e-01
5.506945252418518066e-01
1.778169572353363037e-01
9.530686736106872559e-01
9.625327587127685547e-01
6.245228648185729980e-01
3.346437215805053711e-01
9.715908765792846680e-01
9.430533647537231445e-01
8.244946002960205078e-01
4.769265055656433105e-01
1.576987802982330322e-01
9.748245477676391602e-01
3.130551576614379883e-01
1.500906944274902344e-01
3.419650495052337646e-01
2.061225473880767822e-01
9.877763986587524414e-01
2.753501832485198975e-01
1.488678455352783203e-01
9.612014293670654297e-01
1.935074031352996826e-01
9.518274068832397461e-01
9.587116837501525879e-01
5.794584155082702637e-01
5.360638499259948730e-01
4.421770274639129639e-01
2.996231317520141602e-01
1.963479518890380859e-01
3.389247059822082520e-01
1.736539602279663086e-01
9.693527221679687500e-01
9.417838454246520996e-01
2.315036356449127197e-01
9.746755957603454590e-01
4.798484444618225098e-01
5.139285326004028320e-01
9.694131612777709961e-01
9.688729047775268555e-01
3.507692217826843262e-01
5.699490904808044434e-01
6.974179744720458984e-01
2.784435749053955078e-01
4.301797747611999512e-01
9.686520099639892578e-01
9.841901063919067383e-01
2.968713641166687012e-01
3.318569362163543701e-01
9.609653353691101074e-01
8.546073436737060547e-01
9.709354639053344727e-01
5.932796597480773926e-01
2.239213287830352783e-01
9.476622343063354492e-01
9.629547595977783203e-01
9.532076120376586914e-01
9.724683165550231934e-01
3.196857571601867676e-01
9.875395298004150391e-01
3.270184397697448730e-01
2.503114044666290283e-01
1.642910838127136230e-01
9.525352716445922852e-01
1.588995158672332764e-01
1.686423122882843018e-01
2.102251946926116943e-01
1.682594120502471924e-01
9.651204347610473633e-01
1.311813294887542725e-01
1.808480620384216309e-01
6.189803481101989746e-01
6.423791646957397461e-01
4.720471203327178955e-01
2.616775035858154297e-01
5.942334532737731934e-01
1.860570013523101807e-01
5.701997280120849609e-01
4.982733726501464844e-01
3.905794918537139893e-01
9.470040798187255859e-01
5.010792016983032227e-01
5.281652808189392090e-01
9.437780380249023438e-01
3.169305026531219482e-01
3.316841125488281250e-01
9.682318568229675293e-01
9.571061730384826660e-01
1.925691962242126465e-01
8.328591585159301758e-01
9.555622339248657227e-01
9.869760274887084961e-01
9.488238692283630371e-01
9.560892581939697266e-01
2.179514765739440918e-01
5.969815254211425781e-01
6.406432390213012695e-01
9.798541069030761719e-01
5.303374528884887695e-01
6.195292472839355469e-01
3.043017089366912842e-01
9.667471647262573242e-01
9.559742808341979980e-01
2.002446651458740234e-01
5.540143847465515137e-01
9.425494670867919922e-01
9.907251000404357910e-01
6.916573047637939453e-01
4.731985628604888916e-01
9.350613355636596680e-01
9.748577475547790527e-01
2.043223679065704346e-01
9.428266286849975586e-01
6.741568446159362793e-01
8.320277929306030273e-01
9.696313142776489258e-01
9.165378808975219727e-01
3.996258974075317383e-01
3.977032303810119629e-01
4.216455221176147461e-01
9.489778876304626465e-01
9.550024271011352539e-01
9.757533073425292969e-01
2.575030624866485596e-01
9.746021032333374023e-01
6.494901180267333984e-01
9.611163139343261719e-01
9.424017071723937988e-01
9.530937075614929199e-01
7.241632938385009766e-01
9.495677947998046875e-01
2.696682810783386230e-01
2.262067794799804688e-01
3.502162694931030273e-01
9.313259124755859375e-01
9.825509786605834961e-01
2.366011440753936768e-01
4.246342182159423828e-01
9.884123206138610840e-01
2.416755557060241699e-01
9.854928255081176758e-01
6.163028478622436523e-01
9.334380626678466797e-01
5.736801624298095703e-01
1.563085317611694336e-01
9.482407569885253906e-01
9.569528102874755859e-01
9.697765707969665527e-01
3.305152356624603271e-01
3.008967041969299316e-01
1.948704123497009277e-01
9.787698984146118164e-01
9.852632284164428711e-01
9.415808916091918945e-01
6.662545800209045410e-01
9.652851819992065430e-01
1.734991669654846191e-01
1.481843888759613037e-01
3.166238069534301758e-01
6.857044100761413574e-01
4.472486078739166260e-01
9.642584323883056641e-01
2.304326295852661133e-01
9.461194276809692383e-01
9.412655830383300781e-01
1.687678694725036621e-01
5.818545818328857422e-01
9.574801921844482422e-01
3.931199312210083008e-01
5.645927786827087402e-01
1.938522756099700928e-01
2.134234905242919922e-01
1.886206269264221191e-01
8.951092958450317383e-01
1.851114034652709961e-01
2.334982156753540039e-01
9.847595095634460449e-01
9.645386934280395508e-01
9.490792155265808105e-01
7.378047704696655273e-01
1.561512649059295654e-01
9.552685022354125977e-01
4.405699074268341064e-01
9.887224435806274414e-01
6.635079979896545410e-01
9.433477520942687988e-01
4.157738089561462402e-01
7.436744570732116699e-01
1.780870556831359863e-01
1.918244063854217529e-01
2.085356116294860840e-01
9.507434368133544922e-01
2.731458544731140137e-01
2.278765738010406494e-01
6.771846413612365723e-01
4.993903934955596924e-01
2.521313428878784180e-01
2.545976042747497559e-01
4.675183594226837158e-01
5.029491186141967773e-01
1.354972720146179199e-01
9.460296034812927246e-01
6.375820040702819824e-01
6.012307405471801758e-01
3.048677742481231689e-01
4.086545109748840332e-01
1.694931387901306152e-01
3.043212592601776123e-01
1.995142102241516113e-01
4.373327493667602539e-01
2.122503519058227539e-01
1.792899668216705322e-01
2.057013511657714844e-01
1.978659331798553467e-01
2.485885322093963623e-01
1.763104796409606934e-01
7.512992620468139648e-01
3.699977397918701172e-01
1.654065847396850586e-01
1.786455512046813965e-01
4.366407394409179688e-01
3.365893959999084473e-01
1.847712695598602295e-01
3.620487451553344727e-01
2.241549491882324219e-01
1.689566671848297119e-01
1.637669801712036133e-01
3.483310341835021973e-01
2.113915979862213135e-01
2.944457828998565674e-01
1.898318529129028320e-01
2.413380742073059082e-01
3.062245845794677734e-01
2.002384662628173828e-01
1.979418992996215820e-01
1.936302185058593750e-01
2.464131414890289307e-01
2.148766517639160156e-01
1.971271038055419922e-01
1.974032223224639893e-01
1.839137077331542969e-01
2.526577711105346680e-01
1.774994134902954102e-01
2.990648150444030762e-01
1.771173477172851562e-01
3.180569112300872803e-01
1.698417663574218750e-01
2.604217529296875000e-01
1.647406816482543945e-01
1.785933077335357666e-01
2.873224020004272461e-01
1.839261054992675781e-01
1.877468228340148926e-01
1.954093277454376221e-01
2.440932095050811768e-01
2.482628822326660156e-01
2.595711946487426758e-01
2.597569227218627930e-01
2.253904044628143311e-01
2.534467577934265137e-01
2.289300262928009033e-01
2.674278318881988525e-01
2.698913812637329102e-01
1.663799881935119629e-01
1.579407155513763428e-01
1.848765313625335693e-01
1.817856132984161377e-01
3.206414580345153809e-01
1.865183115005493164e-01
2.119065225124359131e-01
1.701198518276214600e-01
1.972736716270446777e-01
1.921474635601043701e-01
2.485358715057373047e-01
2.198658883571624756e-01
2.281543910503387451e-01
2.345604002475738525e-01
1.810751557350158691e-01
2.031652033329010010e-01
1.860226690769195557e-01
1.470826566219329834e-01
1.890715658664703369e-01
1.733908951282501221e-01
3.309787213802337646e-01
1.866983771324157715e-01
2.623817324638366699e-01
2.072227299213409424e-01
2.034151256084442139e-01
4.165880084037780762e-01
2.510461807250976562e-01
3.699567914009094238e-01
1.927094161510467529e-01
1.876610815525054932e-01
2.224873602390289307e-01
3.640667498111724854e-01
1.678702235221862793e-01
6.014403700828552246e-01
1.687480211257934570e-01
3.758157491683959961e-01
2.001648843288421631e-01
2.152016162872314453e-01
1.680837273597717285e-01
6.000090241432189941e-01
2.336077988147735596e-01
4.497602283954620361e-01
2.190278470516204834e-01
1.682046949863433838e-01
2.184444963932037354e-01
1.351670920848846436e-01
1.886952221393585205e-01
1.771263480186462402e-01
2.009752392768859863e-01
3.918789625167846680e-01
1.798684000968933105e-01
1.886913478374481201e-01
3.097433447837829590e-01
1.617192924022674561e-01
1.620894968509674072e-01
2.394451797008514404e-01
1.188857555389404297e-01
1.623485982418060303e-01
2.142948210239410400e-01
1.940272748470306396e-01
1.827346682548522949e-01
2.080407738685607910e-01
2.000238895416259766e-01
1.998818218708038330e-01
3.618763089179992676e-01
5.561572313308715820e-01
2.092164158821105957e-01
1.973595917224884033e-01
1.794088184833526611e-01
1.742357015609741211e-01
1.712010204792022705e-01
2.717078030109405518e-01
1.921111941337585449e-01
1.922474503517150879e-01
2.020814120769500732e-01
2.003874480724334717e-01
2.276272773742675781e-01
1.529309749603271484e-01
1.615936160087585449e-01
1.497919261455535889e-01
1.827304065227508545e-01
2.041084170341491699e-01
1.816597282886505127e-01
1.618587672710418701e-01
1.856957972049713135e-01
1.971108615398406982e-01
1.700516641139984131e-01
2.264674007892608643e-01
3.354462385177612305e-01
2.094033360481262207e-01
1.740024983882904053e-01
5.803799629211425781e-01
2.254041433334350586e-01
1.346228718757629395e-01
2.237713038921356201e-01
1.898711025714874268e-01
2.565903663635253906e-01
3.212608098983764648e-01
1.877686381340026855e-01
2.078183293342590332e-01
2.010273635387420654e-01
3.407713174819946289e-01
2.078035473823547363e-01
2.454610168933868408e-01
1.476269364356994629e-01
2.047857642173767090e-01
3.743434548377990723e-01
2.170788943767547607e-01
2.545734643936157227e-01
1.881593167781829834e-01
1.866360604763031006e-01
1.823764145374298096e-01
1.580636501312255859e-01
2.042737603187561035e-01
3.856635093688964844e-01
1.588605046272277832e-01
1.778455674648284912e-01
2.360243201255798340e-01
1.782289743423461914e-01
1.719237267971038818e-01
2.230094969272613525e-01
1.975682079792022705e-01
1.917890608310699463e-01
1.597461402416229248e-01
1.582815051078796387e-01
1.293683350086212158e-01
1.475991308689117432e-01
2.446204125881195068e-01
3.424203991889953613e-01
8.710072040557861328e-01
2.079868912696838379e-01
7.447297573089599609e-01
2.167259454727172852e-01
1.773514449596405029e-01
2.000106871128082275e-01
1.728495955467224121e-01
1.626593172550201416e-01
1.670531034469604492e-01
2.458639144897460938e-01
1.744818389415740967e-01
2.044940888881683350e-01
1.470750272274017334e-01
1.649887859821319580e-01
1.509470343589782715e-01
4.731338322162628174e-01
1.748630404472351074e-01
1.495994925498962402e-01
1.520772874355316162e-01
1.496262550354003906e-01
1.495655477046966553e-01
1.495667994022369385e-01
1.717789471149444580e-01
1.497253179550170898e-01
1.615790128707885742e-01
1.435856819152832031e-01
1.488540470600128174e-01
1.520790159702301025e-01
1.517462134361267090e-01
1.590348482131958008e-01
1.641770899295806885e-01
1.737607121467590332e-01
1.494069397449493408e-01
1.997214853763580322e-01
1.506650447845458984e-01
1.417637765407562256e-01
1.656740605831146240e-01
1.534590721130371094e-01
1.406710445880889893e-01
1.495313644409179688e-01
1.487196683883666992e-01
1.515341997146606445e-01
1.507803797721862793e-01
1.494650840759277344e-01
1.635188758373260498e-01
4.021971523761749268e-01
2.082015275955200195e-01
3.204100728034973145e-01
1.906110644340515137e-01
1.844463944435119629e-01
4.819156825542449951e-01
2.105853855609893799e-01
3.296545743942260742e-01
3.416309952735900879e-01
1.671003401279449463e-01
1.744768321514129639e-01
2.525632977485656738e-01
1.668812930583953857e-01
1.459220051765441895e-01
1.968383491039276123e-01
2.467626035213470459e-01
1.632075607776641846e-01
1.911993026733398438e-01
2.518970966339111328e-01
4.212314784526824951e-01
2.024298906326293945e-01
1.491679549217224121e-01
2.072613239288330078e-01
2.366689741611480713e-01
1.638996303081512451e-01
1.836364269256591797e-01
1.540868878364562988e-01
2.920451164245605469e-01
1.902746558189392090e-01
1.464392840862274170e-01
1.727330684661865234e-01
1.464450359344482422e-01
4.417158663272857666e-01
1.718068718910217285e-01
1.571391522884368896e-01
1.423467099666595459e-01
1.604379713535308838e-01
1.439422369003295898e-01
1.405935585498809814e-01
1.408687233924865723e-01
1.464552283287048340e-01
1.541697084903717041e-01
1.464927792549133301e-01
1.951163411140441895e-01
2.398092746734619141e-01
2.682495713233947754e-01
1.806058883666992188e-01
2.583242952823638916e-01
3.070358037948608398e-01
2.690421938896179199e-01
1.758070588111877441e-01
3.906404972076416016e-01
5.275022983551025391e-01
2.887324988842010498e-01
2.037170529365539551e-01
3.060135841369628906e-01
1.719523668289184570e-01
2.692079842090606689e-01
1.715675592422485352e-01
1.696784496307373047e-01
4.426198601722717285e-01
2.903954982757568359e-01
1.712810099124908447e-01
2.330879867076873779e-01
5.786863565444946289e-01
1.995194852352142334e-01
1.528231203556060791e-01
3.401265740394592285e-01
2.398274540901184082e-01
2.014385163784027100e-01
2.389109730720520020e-01
1.219783425331115723e-01
2.399050593376159668e-01
6.698489785194396973e-01
3.542627692222595215e-01
1.611349582672119141e-01
1.656336784362792969e-01
1.755192279815673828e-01
1.739954650402069092e-01
1.807937622070312500e-01
1.924467086791992188e-01
1.929685473442077637e-01
1.944892108440399170e-01
1.958179473876953125e-01
6.247867941856384277e-01
1.962989270687103271e-01
1.436805427074432373e-01
3.196189999580383301e-01
1.723519861698150635e-01
1.886177062988281250e-01
4.115468859672546387e-01
1.478578746318817139e-01
2.786504030227661133e-01
2.080339789390563965e-01
1.598728895187377930e-01
1.919621527194976807e-01
3.240222334861755371e-01
2.205118238925933838e-01
1.595210134983062744e-01
1.987567543983459473e-01
2.285468280315399170e-01
3.420813679695129395e-01
1.988944709300994873e-01
1.590416431427001953e-01
1.980086565017700195e-01
2.988767027854919434e-01
4.251115024089813232e-01
4.378688037395477295e-01
2.636853754520416260e-01
2.210117578506469727e-01
1.777006983757019043e-01
1.902878880500793457e-01
1.558377146720886230e-01
4.098606705665588379e-01
1.580481529235839844e-01
1.739104092121124268e-01
4.161811172962188721e-01
1.797226071357727051e-01
1.680330634117126465e-01
2.731294631958007812e-01
2.400025725364685059e-01
2.968388497829437256e-01
1.462115347385406494e-01
3.065981268882751465e-01
1.766283512115478516e-01
1.565019488334655762e-01
2.939486503601074219e-01
1.823318898677825928e-01
6.774724721908569336e-01
2.116445600986480713e-01
1.650969386100769043e-01
2.357513606548309326e-01
9.437239170074462891e-02
1.749911606311798096e-01
2.583527565002441406e-01
1.537289917469024658e-01
1.815911531448364258e-01
1.464616656303405762e-01
2.686027288436889648e-01
1.710752844810485840e-01
3.295473754405975342e-01
2.317693531513214111e-01
2.212115526199340820e-01
3.197879493236541748e-01
1.708082258701324463e-01
2.023907303810119629e-01
2.532587051391601562e-01
2.118357419967651367e-01
1.809602975845336914e-01
1.536311209201812744e-01
3.087564110755920410e-01
1.512298882007598877e-01
3.892866969108581543e-01
2.176905572414398193e-01
1.904607415199279785e-01
2.996744513511657715e-01
4.367222785949707031e-01
1.871276199817657471e-01
1.985706686973571777e-01
2.741293013095855713e-01
3.171576857566833496e-01
1.782348453998565674e-01
1.690846979618072510e-01
7.235144972801208496e-01
2.375009953975677490e-01
2.214517295360565186e-01
2.340278923511505127e-01
2.868638634681701660e-01
2.077052593231201172e-01
1.961543858051300049e-01
2.575033307075500488e-01
2.097716331481933594e-01
1.737043559551239014e-01
1.466747522354125977e-01
3.721904754638671875e-01
1.562295556068420410e-01
1.815061271190643311e-01
1.465826630592346191e-01
1.465968191623687744e-01
1.471540927886962891e-01
2.126085758209228516e-01
2.477853298187255859e-01
1.676849424839019775e-01
1.456819474697113037e-01
1.928674280643463135e-01
1.918370723724365234e-01
5.048389434814453125e-01
1.465214788913726807e-01
1.333667337894439697e-01
1.783574819564819336e-01
1.420687735080718994e-01
1.383996903896331787e-01
1.670223176479339600e-01
1.465049684047698975e-01
1.566453278064727783e-01
1.465578973293304443e-01
1.465725600719451904e-01
1.485669612884521484e-01
1.465422511100769043e-01
1.465378999710083008e-01
1.354908347129821777e-01
1.956669092178344727e-01
1.769887506961822510e-01
1.634543836116790771e-01
3.033877015113830566e-01
1.845669746398925781e-01
2.862179875373840332e-01
4.179778695106506348e-01
1.850407719612121582e-01
2.569793164730072021e-01
1.704276502132415771e-01
1.837650835514068604e-01
1.988804936408996582e-01
3.631332516670227051e-01
3.859055936336517334e-01
1.946580111980438232e-01
2.706673741340637207e-01
1.749263405799865723e-01
4.463036060333251953e-01
2.047963440418243408e-01
2.521918416023254395e-01
5.955033898353576660e-01
2.925128042697906494e-01
1.867210566997528076e-01
1.711208224296569824e-01
1.760844588279724121e-01
1.812792718410491943e-01
2.191528975963592529e-01
1.306713521480560303e-01
8.219166398048400879e-01
1.720099151134490967e-01
3.019292354583740234e-01
2.090631723403930664e-01
1.784280240535736084e-01
1.564726829528808594e-01
1.589519381523132324e-01
1.601650118827819824e-01
1.553782820701599121e-01
6.980325579643249512e-01
2.245416641235351562e-01
2.726931571960449219e-01
1.899911165237426758e-01
1.935050189495086670e-01
5.266563296318054199e-01
1.679462492465972900e-01
2.538984417915344238e-01
1.619269251823425293e-01
1.941533386707305908e-01
1.603777110576629639e-01
1.589353084564208984e-01
1.591787636280059814e-01
1.496793031692504883e-01
1.534789502620697021e-01
1.605516076087951660e-01
2.099030315876007080e-01
1.914171576499938965e-01
2.063134610652923584e-01
2.099704444408416748e-01
1.544215381145477295e-01
1.811130046844482422e-01
3.873132467269897461e-01
2.678014636039733887e-01
1.639203727245330811e-01
3.131774365901947021e-01
3.333779275417327881e-01
2.851186990737915039e-01
2.165164351463317871e-01
2.397153675556182861e-01
2.258632481098175049e-01
1.930890977382659912e-01
2.053369283676147461e-01
2.250249087810516357e-01
3.156933784484863281e-01
5.151901245117187500e-01
2.167168259620666504e-01
1.677779853343963623e-01
4.067298173904418945e-01
2.034927606582641602e-01
1.817523539066314697e-01
2.588793635368347168e-01
2.050593495368957520e-01
2.473215758800506592e-01
4.375530779361724854e-01
1.819036602973937988e-01
1.649517118930816650e-01
8.248488903045654297e-01
4.592844843864440918e-01
7.417235374450683594e-01
3.958611488342285156e-01
4.440645277500152588e-01
2.623931765556335449e-01
1.952008903026580811e-01
1.483862698078155518e-01
1.558574736118316650e-01
1.572300195693969727e-01
1.571988761425018311e-01
1.633827686309814453e-01
1.570403873920440674e-01
1.444481015205383301e-01
2.169612646102905273e-01
1.592963635921478271e-01
1.631469130516052246e-01
1.577733755111694336e-01
1.574748754501342773e-01
1.669729650020599365e-01
1.545067727565765381e-01
1.509514451026916504e-01
1.491490602493286133e-01
1.792333424091339111e-01
1.548109948635101318e-01
1.465973258018493652e-01
1.774215698242187500e-01
1.604558229446411133e-01
1.567057669162750244e-01
1.495020091533660889e-01
1.430409252643585205e-01
1.569308042526245117e-01
1.459214389324188232e-01
1.472098231315612793e-01
1.562959253787994385e-01
1.568167507648468018e-01
1.569039225578308105e-01
1.487827599048614502e-01
1.518907546997070312e-01
1.518786549568176270e-01
1.581979691982269287e-01
1.702543497085571289e-01
1.580087840557098389e-01
1.579803526401519775e-01
1.577053070068359375e-01
1.580439805984497070e-01
1.583869457244873047e-01
1.448229849338531494e-01
1.584489345550537109e-01
5.735574960708618164e-01
1.582755148410797119e-01
1.559415459632873535e-01
1.703927814960479736e-01
2.897609472274780273e-01
1.713612079620361328e-01
1.662973463535308838e-01
1.697065234184265137e-01
1.655078828334808350e-01
1.575161814689636230e-01
1.599986553192138672e-01
1.571092009544372559e-01
1.578703522682189941e-01
1.681532263755798340e-01
1.579175591468811035e-01
1.578981876373291016e-01
1.568446159362792969e-01
1.622653007507324219e-01
1.657510399818420410e-01
1.560558974742889404e-01
1.599293351173400879e-01
1.644687354564666748e-01
1.429572999477386475e-01
1.667524874210357666e-01
1.672920584678649902e-01
2.074236869812011719e-01
1.644279360771179199e-01
1.618492007255554199e-01
1.648865640163421631e-01
1.919072866439819336e-01
1.705968081951141357e-01
1.473627090454101562e-01
1.527032256126403809e-01
1.655687689781188965e-01
1.648190021514892578e-01
1.647711694240570068e-01
1.638601124286651611e-01
1.691977381706237793e-01
1.638992130756378174e-01
1.642385721206665039e-01
1.936841309070587158e-01
1.757970154285430908e-01
1.608524918556213379e-01
1.641547083854675293e-01
1.906898915767669678e-01
2.024758160114288330e-01
1.642036437988281250e-01
3.220605850219726562e-01
1.545412242412567139e-01
1.629580259323120117e-01
1.640194952487945557e-01
1.735961139202117920e-01
1.659649908542633057e-01
1.692227125167846680e-01
1.705910563468933105e-01
1.659580767154693604e-01
1.631845831871032715e-01
1.659803688526153564e-01
1.672479808330535889e-01
2.275498509407043457e-01
2.097689509391784668e-01
2.248238921165466309e-01
1.984849572181701660e-01
2.126289606094360352e-01
2.188492417335510254e-01
4.063130021095275879e-01
2.063705921173095703e-01
1.682102680206298828e-01
1.652661263942718506e-01
1.666747033596038818e-01
1.688185334205627441e-01
1.620302796363830566e-01
1.651144325733184814e-01
1.650731265544891357e-01
1.811229586601257324e-01
1.705483198165893555e-01
1.657313108444213867e-01
1.656723022460937500e-01
1.599101424217224121e-01
1.653721928596496582e-01
1.664405465126037598e-01
1.654842495918273926e-01
4.216729104518890381e-01
2.639315128326416016e-01
1.536715924739837646e-01
1.411004960536956787e-01
4.402905106544494629e-01
2.868045866489410400e-01
6.286740899085998535e-01
5.379799604415893555e-01
1.260528564453125000e-01
1.620607972145080566e-01
1.505215167999267578e-01
1.528801023960113525e-01
2.055477499961853027e-01
1.554363965988159180e-01
1.389394700527191162e-01
5.379610061645507812e-01
2.674836218357086182e-01
4.591800570487976074e-01
4.054575860500335693e-01
2.792279720306396484e-01
3.142277002334594727e-01
2.589994668960571289e-01
2.085990607738494873e-01
4.386221766471862793e-01
3.221220374107360840e-01
1.780820786952972412e-01
2.585258483886718750e-01
3.780871033668518066e-01
3.296025991439819336e-01
6.094354391098022461e-01
1.654587984085083008e-01
1.483716070652008057e-01
1.636545658111572266e-01
1.830772757530212402e-01
1.658590137958526611e-01
1.572611033916473389e-01
1.590500175952911377e-01
1.489084064960479736e-01
1.621679365634918213e-01
1.635479927062988281e-01
1.706541776657104492e-01
1.601966917514801025e-01
1.564271152019500732e-01
1.395292580127716064e-01
1.752173602581024170e-01
1.634310483932495117e-01
1.977655589580535889e-01
1.615380942821502686e-01
1.835467815399169922e-01
1.625391840934753418e-01
1.714552342891693115e-01
1.693090498447418213e-01
1.731729507446289062e-01
1.210905313491821289e-01
1.673330664634704590e-01
1.505765914916992188e-01
1.629036366939544678e-01
1.555349826812744141e-01
1.683267951011657715e-01
2.020471990108489990e-01
1.362484693527221680e-01
1.353025734424591064e-01
1.524192392826080322e-01
1.549905240535736084e-01
1.679092943668365479e-01
1.509572565555572510e-01
1.523334681987762451e-01
1.430011987686157227e-01
1.523731648921966553e-01
1.523573398590087891e-01
2.215018272399902344e-01
5.118811130523681641e-01
2.015385329723358154e-01
2.146151363849639893e-01
1.525074243545532227e-01
1.543906629085540771e-01
1.541558206081390381e-01
1.523007452487945557e-01
1.208558678627014160e-01
1.853038668632507324e-01
3.459488153457641602e-01
4.422227740287780762e-01
4.273892045021057129e-01
2.232693135738372803e-01
1.790090203285217285e-01
1.522549986839294434e-01
1.522379219532012939e-01
1.526457965373992920e-01
1.485158503055572510e-01
3.727533817291259766e-01
2.252247035503387451e-01
1.392838358879089355e-01
2.189871072769165039e-01
1.720894575119018555e-01
1.644654273986816406e-01
5.650334358215332031e-01
4.300658106803894043e-01
3.643207550048828125e-01
2.924311757087707520e-01
1.897220313549041748e-01
1.938447952270507812e-01
2.149241566658020020e-01
3.569133281707763672e-01
4.294297695159912109e-01
2.160688340663909912e-01
2.929611504077911377e-01
1.697497963905334473e-01
1.888792812824249268e-01
3.776643276214599609e-01
1.533287763595581055e-01
4.047116041183471680e-01
1.972390115261077881e-01
3.050221204757690430e-01
2.272318303585052490e-01
1.573591828346252441e-01
2.553088963031768799e-01
1.946028470993041992e-01
1.769613921642303467e-01
2.469148039817810059e-01
3.605831861495971680e-01
2.225615680217742920e-01
1.528015732765197754e-01
1.620233058929443359e-01
1.659643352031707764e-01
1.883600354194641113e-01
4.438128471374511719e-01
2.981902360916137695e-01
1.717941462993621826e-01
2.842400372028350830e-01
1.718840599060058594e-01
1.641839444637298584e-01
1.938958764076232910e-01
1.767399311065673828e-01
1.939552724361419678e-01
1.546008586883544922e-01
1.883928775787353516e-01
2.781634330749511719e-01
1.950351297855377197e-01
1.732650995254516602e-01
4.292564392089843750e-01
1.847416162490844727e-01
1.827938556671142578e-01
2.822949290275573730e-01
1.584107279777526855e-01
1.854695975780487061e-01
1.374989748001098633e-01
1.705390512943267822e-01
2.039235234260559082e-01
1.624921858310699463e-01
1.942691802978515625e-01
1.667008697986602783e-01
3.262405395507812500e-01
3.495462238788604736e-01
2.152554094791412354e-01
1.972854137420654297e-01
1.568102538585662842e-01
4.535189270973205566e-01
1.945139467716217041e-01
3.475065827369689941e-01
1.474250555038452148e-01
4.378058612346649170e-01
1.899603307247161865e-01
2.124325037002563477e-01
1.793012917041778564e-01
1.997017264366149902e-01
1.944088041782379150e-01
2.108659446239471436e-01
4.139575958251953125e-01
1.876970827579498291e-01
2.822153270244598389e-01
2.586660385131835938e-01
1.714239716529846191e-01
2.164151072502136230e-01
1.877850294113159180e-01
2.388552427291870117e-01
2.224823832511901855e-01
1.995193660259246826e-01
2.212507724761962891e-01
2.916576266288757324e-01
6.402477025985717773e-01
2.897474765777587891e-01
3.041648864746093750e-01
2.520395517349243164e-01
3.281470537185668945e-01
1.717022061347961426e-01
2.067345976829528809e-01
2.189829647541046143e-01
2.039016187191009521e-01
1.887821257114410400e-01
2.120180428028106689e-01
2.342681586742401123e-01
2.074802815914154053e-01
3.339865207672119141e-01
1.373510360717773438e-01
2.667512893676757812e-01
1.889344453811645508e-01
7.298570275306701660e-01
1.759028136730194092e-01
1.616771519184112549e-01
2.546416521072387695e-01
1.863589882850646973e-01
1.839365065097808838e-01
1.584907770156860352e-01
2.825631797313690186e-01
1.803016960620880127e-01
1.629217267036437988e-01
3.012247681617736816e-01
4.005274772644042969e-01
3.046169877052307129e-01
2.114391326904296875e-01
3.072825670242309570e-01
2.406248748302459717e-01
1.966708898544311523e-01
1.934435069561004639e-01
2.387546002864837646e-01
3.284872770309448242e-01
1.686695814132690430e-01
1.562941372394561768e-01
1.508383154869079590e-01
1.624496281147003174e-01
1.517241895198822021e-01
2.059119641780853271e-01
1.709145009517669678e-01
1.452126204967498779e-01
1.538837552070617676e-01
1.610517203807830811e-01
1.555676460266113281e-01
1.584373712539672852e-01
1.564894318580627441e-01
1.756476461887359619e-01
1.609433591365814209e-01
1.493343412876129150e-01
1.538812518119812012e-01
2.566147744655609131e-01
1.553570032119750977e-01
1.907510459423065186e-01
3.325102925300598145e-01
2.735202312469482422e-01
2.979527711868286133e-01
1.990312337875366211e-01
1.684527993202209473e-01
3.638406395912170410e-01
1.868447959423065186e-01
4.173333942890167236e-01
2.275369465351104736e-01
1.592512130737304688e-01
2.299746274948120117e-01
5.554330348968505859e-01
4.323945343494415283e-01
3.371466696262359619e-01
2.703379392623901367e-01
4.294185042381286621e-01
5.368639826774597168e-01
3.038731813430786133e-01
2.820371389389038086e-01
3.155529797077178955e-01
3.585623502731323242e-01
2.658797204494476318e-01
3.211279511451721191e-01
1.697560548782348633e-01
1.802684068679809570e-01
3.631919026374816895e-01
1.639842092990875244e-01
2.407153844833374023e-01
2.954680621623992920e-01
1.810878217220306396e-01
2.002727389335632324e-01
1.709561049938201904e-01
3.228742480278015137e-01
2.422423362731933594e-01
1.139552295207977295e-01
1.689530313014984131e-01
4.116193056106567383e-01
1.620943844318389893e-01
1.924713253974914551e-01
3.107774853706359863e-01
3.569923341274261475e-01
3.829515874385833740e-01
2.082612514495849609e-01
2.680733799934387207e-01
3.672841787338256836e-01
1.894841492176055908e-01
1.920313537120819092e-01
2.372995316982269287e-01
2.295585274696350098e-01
3.094164133071899414e-01
3.216232955455780029e-01
3.285751044750213623e-01
1.603629589080810547e-01
2.282312512397766113e-01
3.607763648033142090e-01
3.403398990631103516e-01
1.535525918006896973e-01
3.464375734329223633e-01
3.178294003009796143e-01
2.779937088489532471e-01
2.231826186180114746e-01
1.807311773300170898e-01
2.148792147636413574e-01
4.255261421203613281e-01
5.133346915245056152e-01
1.511375606060028076e-01
2.137624323368072510e-01
1.720221042633056641e-01
2.502868771553039551e-01
1.799533367156982422e-01
2.215695083141326904e-01
3.393434882164001465e-01
1.869872808456420898e-01
2.436774671077728271e-01
