0.000000000000000000e+00
6.129985228951255471e-02
6.277695716395864656e-02
6.720827178729689433e-02
7.090103397341211700e-02
7.459379615952732578e-02
7.680945347119645661e-02
7.754800590841949559e-02
7.976366322008862642e-02
7.976366322008862642e-02
8.419497784342688806e-02
8.419497784342688806e-02
8.567208271787296603e-02
8.862629246676513584e-02
9.010339734121122768e-02
9.084194977843426666e-02
9.231905465288035850e-02
9.231905465288035850e-02
9.896602658788773710e-02
9.896602658788773710e-02
9.970457902511077608e-02
9.970457902511077608e-02
1.011816838995568679e-01
1.078286558345642604e-01
1.085672082717872994e-01
1.129985228951255471e-01
1.129985228951255471e-01
1.159527326440177308e-01
1.174298375184638088e-01
1.262924667651403321e-01
1.262924667651403321e-01
1.307237813884785937e-01
1.307237813884785937e-01
1.536189069423929132e-01
1.550960118168389912e-01
1.632200886262924755e-01
1.632200886262924755e-01
1.661742983751846314e-01
1.661742983751846314e-01
1.683899556868537761e-01
1.683899556868537761e-01
1.905465288035450566e-01
1.905465288035450566e-01
1.942392909896602793e-01
1.942392909896602793e-01
1.964549483013293962e-01
1.964549483013293962e-01
2.311669128508123949e-01
2.311669128508123949e-01
2.451994091580502189e-01
2.451994091580502189e-01
2.525849335302806642e-01
2.525849335302806642e-01
2.747415066469719447e-01
2.747415066469719447e-01
2.762186115214180226e-01
2.762186115214180226e-01
2.850812407680945459e-01
2.850812407680945459e-01
2.946824224519941082e-01
2.946824224519941082e-01
2.968980797636632252e-01
2.968980797636632252e-01
3.005908419497784201e-01
3.005908419497784201e-01
3.035450516986706315e-01
3.035450516986706315e-01
3.057607090103397485e-01
3.057607090103397485e-01
3.190546528803545057e-01
3.190546528803545057e-01
3.286558345642540679e-01
3.286558345642540679e-01
3.301329394387001459e-01
3.301329394387001459e-01
3.389955686853766692e-01
3.389955686853766692e-01
3.397341211225997082e-01
3.397341211225997082e-01
3.485967503692762315e-01
3.485967503692762315e-01
3.515509601181683874e-01
3.515509601181683874e-01
3.559822747415066213e-01
3.559822747415066213e-01
3.574593796159527548e-01
3.574593796159527548e-01
3.729689807976366289e-01
3.729689807976366289e-01
3.796159527326440353e-01
3.796159527326440353e-01
3.833087149187592302e-01
3.833087149187592302e-01
3.840472673559822692e-01
3.840472673559822692e-01
3.855243722304283471e-01
3.855243722304283471e-01
3.884785819793205586e-01
3.884785819793205586e-01
3.899556868537666365e-01
3.899556868537666365e-01
3.921713441654357535e-01
3.921713441654357535e-01
4.010339734121122768e-01
4.010339734121122768e-01
4.098966026587888001e-01
4.098966026587888001e-01
4.128508124076809560e-01
4.128508124076809560e-01
4.150664697193500730e-01
4.150664697193500730e-01
4.165435745937961509e-01
4.165435745937961509e-01
4.187592319054652679e-01
4.187592319054652679e-01
4.239290989660265963e-01
4.239290989660265963e-01
4.246676514032496352e-01
4.246676514032496352e-01
4.290989660265878691e-01
4.290989660265878691e-01
4.320531757754800806e-01
4.320531757754800806e-01
4.342688330871491975e-01
4.342688330871491975e-01
4.394387001477104704e-01
4.394387001477104704e-01
4.409158050221565484e-01
4.409158050221565484e-01
4.431314623338257208e-01
4.431314623338257208e-01
4.483013293943869937e-01
4.483013293943869937e-01
4.490398818316100327e-01
4.490398818316100327e-01
4.579025110782865560e-01
4.579025110782865560e-01
4.615952732644017509e-01
4.615952732644017509e-01
4.711964549483013132e-01
4.711964549483013132e-01
4.800590841949778365e-01
4.800590841949778365e-01
4.822747415066469534e-01
4.822747415066469534e-01
4.933530280649925936e-01
4.933530280649925936e-01
5.036927621861152504e-01
5.036927621861152504e-01
5.044313146233382339e-01
5.044313146233382339e-01
5.051698670605613284e-01
5.051698670605613284e-01
5.073855243722303898e-01
5.073855243722303898e-01
5.081240768094534843e-01
5.081240768094534843e-01
5.088626292466764678e-01
5.088626292466764678e-01
5.096011816838995623e-01
5.096011816838995623e-01
5.103397341211225458e-01
5.103397341211225458e-01
5.118168389955687347e-01
5.118168389955687347e-01
5.155096011816838741e-01
5.155096011816838741e-01
5.214180206794682970e-01
5.214180206794682970e-01
5.324963072378139373e-01
5.324963072378139373e-01
5.406203840472673106e-01
5.406203840472673106e-01
5.494830132939438894e-01
5.494830132939438894e-01
5.583456425406203572e-01
5.583456425406203572e-01
5.612998522895125131e-01
5.612998522895125131e-01
5.627769571639585910e-01
5.627769571639585910e-01
5.679468242245199194e-01
5.679468242245199194e-01
5.716395864106351699e-01
5.716395864106351699e-01
5.768094534711964982e-01
5.768094534711964982e-01
5.775480059084194817e-01
5.775480059084194817e-01
5.782865583456425762e-01
5.782865583456425762e-01
5.797636632200886542e-01
5.797636632200886542e-01
5.812407680945347321e-01
5.812407680945347321e-01
5.841949778434268881e-01
5.841949778434268881e-01
5.849335302806498715e-01
5.849335302806498715e-01
5.871491875923190440e-01
5.871491875923190440e-01
5.908419497784342944e-01
5.908419497784342944e-01
5.937961595273264503e-01
5.937961595273264503e-01
5.945347119645494338e-01
5.945347119645494338e-01
5.982274741506646842e-01
5.982274741506646842e-01
6.041358936484489961e-01
6.041358936484489961e-01
6.085672082717873410e-01
6.085672082717873410e-01
6.115214180206794969e-01
6.115214180206794969e-01
6.122599704579024804e-01
6.122599704579024804e-01
6.166912850812407143e-01
6.166912850812407143e-01
6.174298375184638088e-01
6.174298375184638088e-01
6.203840472673559647e-01
6.203840472673559647e-01
6.211225997045790592e-01
6.211225997045790592e-01
6.225997045790251372e-01
6.225997045790251372e-01
6.233382570162481207e-01
6.233382570162481207e-01
6.270310192023633711e-01
6.270310192023633711e-01
6.292466765140325435e-01
6.292466765140325435e-01
6.314623338257016050e-01
6.314623338257016050e-01
6.329394387001476829e-01
6.329394387001476829e-01
6.358936484490398389e-01
6.358936484490398389e-01
6.366322008862629334e-01
6.366322008862629334e-01
6.381093057607090113e-01
6.381093057607090113e-01
6.395864106351550893e-01
6.395864106351550893e-01
6.403249630723781838e-01
6.403249630723781838e-01
6.462333825701624956e-01
6.462333825701624956e-01
6.484490398818315571e-01
6.484490398818315571e-01
6.491875923190546516e-01
6.491875923190546516e-01
6.506646971935007295e-01
6.506646971935007295e-01
6.514032496307238240e-01
6.514032496307238240e-01
6.543574593796159800e-01
6.543574593796159800e-01
6.595273264401771973e-01
6.595273264401771973e-01
6.617429837518463698e-01
6.617429837518463698e-01
6.624815361890694643e-01
6.624815361890694643e-01
6.632200886262924477e-01
6.632200886262924477e-01
6.683899556868537761e-01
6.683899556868537761e-01
6.691285081240767596e-01
6.691285081240767596e-01
6.750369276218611825e-01
6.750369276218611825e-01
6.787296898079763219e-01
6.787296898079763219e-01
6.802067946824223998e-01
6.802067946824223998e-01
6.809453471196454943e-01
6.809453471196454943e-01
6.824224519940915723e-01
6.824224519940915723e-01
6.831610044313146668e-01
6.831610044313146668e-01
6.846381093057607448e-01
6.846381093057607448e-01
6.868537666174298062e-01
6.868537666174298062e-01
6.905465288035450566e-01
6.905465288035450566e-01
6.912850812407680401e-01
6.912850812407680401e-01
6.935007385524372125e-01
6.935007385524372125e-01
6.942392909896603070e-01
6.942392909896603070e-01
6.949778434268832905e-01
6.949778434268832905e-01
6.957163958641063850e-01
6.957163958641063850e-01
7.031019202363367748e-01
7.031019202363367748e-01
7.038404726735598693e-01
7.038404726735598693e-01
7.045790251107828528e-01
7.045790251107828528e-01
7.067946824224520252e-01
7.067946824224520252e-01
7.082717872968981032e-01
7.082717872968981032e-01
7.104874446085671647e-01
7.104874446085671647e-01
7.112259970457902591e-01
7.112259970457902591e-01
7.127031019202363371e-01
7.127031019202363371e-01
7.141802067946824151e-01
7.141802067946824151e-01
7.156573116691284930e-01
7.156573116691284930e-01
7.163958641063515875e-01
7.163958641063515875e-01
7.171344165435745710e-01
7.171344165435745710e-01
7.178729689807976655e-01
7.178729689807976655e-01
7.186115214180206490e-01
7.186115214180206490e-01
7.193500738552437435e-01
7.193500738552437435e-01
7.208271787296898214e-01
7.208271787296898214e-01
7.223042836041358994e-01
7.223042836041358994e-01
7.230428360413588829e-01
7.230428360413588829e-01
7.237813884785819774e-01
7.237813884785819774e-01
7.245199409158050718e-01
7.245199409158050718e-01
7.252584933530280553e-01
7.252584933530280553e-01
7.267355982274741333e-01
7.267355982274741333e-01
7.274741506646972278e-01
7.274741506646972278e-01
7.289512555391433057e-01
7.289512555391433057e-01
7.296898079763662892e-01
7.296898079763662892e-01
7.304283604135893837e-01
7.304283604135893837e-01
7.311669128508123672e-01
7.311669128508123672e-01
7.319054652880354617e-01
7.319054652880354617e-01
7.326440177252584451e-01
7.326440177252584451e-01
7.333825701624815396e-01
7.333825701624815396e-01
7.341211225997046341e-01
7.341211225997046341e-01
7.348596750369276176e-01
7.348596750369276176e-01
7.363367799113736956e-01
7.363367799113736956e-01
7.370753323485967901e-01
7.370753323485967901e-01
7.378138847858197735e-01
7.378138847858197735e-01
7.407680945347119295e-01
7.407680945347119295e-01
7.415066469719350239e-01
7.415066469719350239e-01
7.429837518463811019e-01
7.429837518463811019e-01
7.444608567208271799e-01
7.444608567208271799e-01
7.466765140324963523e-01
7.466765140324963523e-01
7.481536189069424303e-01
7.481536189069424303e-01
7.488921713441654138e-01
7.488921713441654138e-01
7.511078286558345862e-01
7.511078286558345862e-01
7.518463810930575697e-01
7.518463810930575697e-01
7.525849335302806642e-01
7.525849335302806642e-01
7.540620384047267422e-01
7.540620384047267422e-01
7.548005908419497256e-01
7.548005908419497256e-01
7.555391432791728201e-01
7.555391432791728201e-01
7.570162481536188981e-01
7.570162481536188981e-01
7.577548005908419926e-01
7.577548005908419926e-01
7.592319054652880705e-01
7.592319054652880705e-01
7.599704579025110540e-01
7.599704579025110540e-01
7.607090103397341485e-01
7.607090103397341485e-01
7.629246676514032099e-01
7.629246676514032099e-01
7.636632200886263044e-01
7.636632200886263044e-01
7.644017725258492879e-01
7.644017725258492879e-01
7.651403249630723824e-01
7.651403249630723824e-01
7.680945347119645383e-01
7.680945347119645383e-01
7.688330871491876328e-01
7.688330871491876328e-01
7.695716395864106163e-01
7.695716395864106163e-01
7.703101920236337108e-01
7.703101920236337108e-01
7.732644017725258667e-01
7.732644017725258667e-01
7.740029542097488502e-01
7.740029542097488502e-01
7.754800590841949282e-01
7.754800590841949282e-01
7.762186115214180226e-01
7.762186115214180226e-01
7.769571639586411171e-01
7.769571639586411171e-01
7.784342688330871951e-01
7.784342688330871951e-01
7.799113737075332731e-01
7.799113737075332731e-01
7.806499261447562565e-01
7.806499261447562565e-01
7.813884785819793510e-01
7.813884785819793510e-01
7.828655834564254290e-01
7.828655834564254290e-01
7.836041358936484125e-01
7.836041358936484125e-01
7.843426883308715070e-01
7.843426883308715070e-01
7.850812407680944904e-01
7.850812407680944904e-01
7.858197932053175849e-01
7.858197932053175849e-01
7.865583456425405684e-01
7.865583456425405684e-01
7.872968980797636629e-01
7.872968980797636629e-01
7.880354505169867574e-01
7.880354505169867574e-01
7.887740029542097409e-01
7.887740029542097409e-01
7.895125553914328353e-01
7.895125553914328353e-01
7.902511078286558188e-01
7.902511078286558188e-01
7.917282127031018968e-01
7.917282127031018968e-01
7.932053175775479748e-01
7.932053175775479748e-01
7.939438700147710692e-01
7.939438700147710692e-01
7.961595273264401307e-01
7.961595273264401307e-01
7.968980797636632252e-01
7.968980797636632252e-01
7.976366322008862086e-01
7.976366322008862086e-01
7.983751846381093031e-01
7.983751846381093031e-01
8.005908419497784756e-01
8.005908419497784756e-01
8.013293943870014591e-01
8.013293943870014591e-01
8.028064992614475370e-01
8.028064992614475370e-01
8.035450516986706315e-01
8.035450516986706315e-01
8.042836041358936150e-01
8.042836041358936150e-01
8.050221565731167095e-01
8.050221565731167095e-01
8.064992614475627875e-01
8.064992614475627875e-01
8.072378138847857709e-01
8.072378138847857709e-01
8.079763663220088654e-01
8.079763663220088654e-01
8.087149187592319599e-01
8.087149187592319599e-01
8.094534711964549434e-01
8.094534711964549434e-01
8.101920236336780379e-01
8.101920236336780379e-01
8.109305760709010213e-01
8.109305760709010213e-01
8.116691285081241158e-01
8.116691285081241158e-01
8.124076809453470993e-01
8.124076809453470993e-01
8.131462333825701938e-01
8.131462333825701938e-01
8.138847858197931773e-01
8.138847858197931773e-01
8.146233382570162718e-01
8.146233382570162718e-01
8.161004431314623497e-01
8.161004431314623497e-01
8.175775480059084277e-01
8.175775480059084277e-01
8.183161004431314112e-01
8.183161004431314112e-01
8.190546528803545057e-01
8.190546528803545057e-01
8.197932053175776002e-01
8.197932053175776002e-01
8.212703101920236781e-01
8.212703101920236781e-01
8.220088626292466616e-01
8.220088626292466616e-01
8.227474150664697561e-01
8.227474150664697561e-01
8.234859675036927396e-01
8.234859675036927396e-01
8.242245199409158340e-01
8.242245199409158340e-01
8.249630723781388175e-01
8.249630723781388175e-01
8.257016248153619120e-01
8.257016248153619120e-01
8.264401772525848955e-01
8.264401772525848955e-01
8.271787296898079900e-01
8.271787296898079900e-01
8.279172821270309734e-01
8.279172821270309734e-01
8.286558345642540679e-01
8.286558345642540679e-01
8.293943870014770514e-01
8.293943870014770514e-01
8.308714918759232404e-01
8.308714918759232404e-01
8.323485967503693184e-01
8.323485967503693184e-01
8.338257016248153963e-01
8.338257016248153963e-01
8.345642540620383798e-01
8.345642540620383798e-01
8.360413589364844578e-01
8.360413589364844578e-01
8.375184638109305357e-01
8.375184638109305357e-01
8.382570162481536302e-01
8.382570162481536302e-01
8.389955686853766137e-01
8.389955686853766137e-01
8.397341211225997082e-01
8.397341211225997082e-01
8.404726735598228027e-01
8.404726735598228027e-01
8.412112259970457862e-01
8.412112259970457862e-01
8.434268833087149586e-01
8.434268833087149586e-01
8.449039881831610366e-01
8.449039881831610366e-01
8.456425406203840200e-01
8.456425406203840200e-01
8.463810930576071145e-01
8.463810930576071145e-01
8.478581979320531925e-01
8.478581979320531925e-01
8.493353028064992705e-01
8.493353028064992705e-01
8.508124076809453484e-01
8.508124076809453484e-01
8.530280649926145209e-01
8.530280649926145209e-01
8.552437223042835823e-01
8.552437223042835823e-01
8.559822747415066768e-01
8.559822747415066768e-01
8.574593796159527548e-01
8.574593796159527548e-01
8.581979320531757383e-01
8.581979320531757383e-01
8.604135893648449107e-01
8.604135893648449107e-01
8.611521418020678942e-01
8.611521418020678942e-01
8.618906942392909887e-01
8.618906942392909887e-01
8.641063515509601611e-01
8.641063515509601611e-01
8.655834564254062391e-01
8.655834564254062391e-01
8.663220088626292226e-01
8.663220088626292226e-01
8.670605612998523171e-01
8.670605612998523171e-01
8.677991137370753005e-01
8.677991137370753005e-01
8.685376661742983950e-01
8.685376661742983950e-01
8.692762186115213785e-01
8.692762186115213785e-01
8.700147710487444730e-01
8.700147710487444730e-01
8.707533234859674565e-01
8.707533234859674565e-01
8.714918759231905510e-01
8.714918759231905510e-01
8.722304283604135344e-01
8.722304283604135344e-01
8.729689807976366289e-01
8.729689807976366289e-01
8.737075332348597234e-01
8.737075332348597234e-01
8.744460856720827069e-01
8.744460856720827069e-01
8.751846381093058014e-01
8.751846381093058014e-01
8.759231905465287849e-01
8.759231905465287849e-01
8.766617429837518793e-01
8.766617429837518793e-01
8.774002954209748628e-01
8.774002954209748628e-01
8.788774002954209408e-01
8.788774002954209408e-01
8.796159527326440353e-01
8.796159527326440353e-01
8.803545051698670187e-01
8.803545051698670187e-01
8.818316100443130967e-01
8.818316100443130967e-01
8.825701624815361912e-01
8.825701624815361912e-01
8.833087149187592857e-01
8.833087149187592857e-01
8.840472673559822692e-01
8.840472673559822692e-01
8.847858197932053637e-01
8.847858197932053637e-01
8.855243722304283471e-01
8.855243722304283471e-01
8.870014771048744251e-01
8.870014771048744251e-01
8.884785819793205031e-01
8.884785819793205031e-01
8.892171344165435976e-01
8.892171344165435976e-01
8.899556868537665810e-01
8.899556868537665810e-01
8.906942392909896755e-01
8.906942392909896755e-01
8.914327917282126590e-01
8.914327917282126590e-01
8.921713441654357535e-01
8.921713441654357535e-01
8.929098966026587370e-01
8.929098966026587370e-01
8.936484490398818314e-01
8.936484490398818314e-01
8.966026587887739874e-01
8.966026587887739874e-01
8.973412112259970819e-01
8.973412112259970819e-01
8.980797636632200653e-01
8.980797636632200653e-01
8.995568685376661433e-01
8.995568685376661433e-01
9.002954209748892378e-01
9.002954209748892378e-01
9.039881831610043772e-01
9.039881831610043772e-01
9.054652880354505662e-01
9.054652880354505662e-01
9.062038404726735497e-01
9.062038404726735497e-01
9.069423929098966441e-01
9.069423929098966441e-01
9.076809453471196276e-01
9.076809453471196276e-01
9.084194977843427221e-01
9.084194977843427221e-01
9.091580502215657056e-01
9.091580502215657056e-01
9.098966026587888001e-01
9.098966026587888001e-01
9.106351550960117835e-01
9.106351550960117835e-01
9.113737075332348780e-01
9.113737075332348780e-01
9.128508124076809560e-01
9.128508124076809560e-01
9.143279172821270340e-01
9.143279172821270340e-01
9.158050221565731119e-01
9.158050221565731119e-01
9.172821270310191899e-01
9.172821270310191899e-01
9.180206794682422844e-01
9.180206794682422844e-01
9.187592319054652679e-01
9.187592319054652679e-01
9.194977843426883624e-01
9.194977843426883624e-01
9.202363367799113458e-01
9.202363367799113458e-01
9.209748892171344403e-01
9.209748892171344403e-01
9.217134416543574238e-01
9.217134416543574238e-01
9.224519940915805183e-01
9.224519940915805183e-01
9.231905465288035018e-01
9.231905465288035018e-01
9.239290989660265963e-01
9.239290989660265963e-01
9.246676514032495797e-01
9.246676514032495797e-01
9.254062038404726742e-01
9.254062038404726742e-01
9.261447562776957687e-01
9.261447562776957687e-01
9.268833087149187522e-01
9.268833087149187522e-01
9.290989660265879246e-01
9.290989660265879246e-01
9.298375184638109081e-01
9.298375184638109081e-01
9.305760709010340026e-01
9.305760709010340026e-01
9.313146233382569861e-01
9.313146233382569861e-01
9.320531757754800806e-01
9.320531757754800806e-01
9.327917282127030640e-01
9.327917282127030640e-01
9.335302806499261585e-01
9.335302806499261585e-01
9.342688330871491420e-01
9.342688330871491420e-01
9.350073855243722365e-01
9.350073855243722365e-01
9.357459379615952200e-01
9.357459379615952200e-01
9.364844903988183145e-01
9.364844903988183145e-01
9.372230428360414090e-01
9.372230428360414090e-01
9.379615952732643924e-01
9.379615952732643924e-01
9.394387001477104704e-01
9.394387001477104704e-01
9.401772525849335649e-01
9.401772525849335649e-01
9.409158050221565484e-01
9.409158050221565484e-01
9.416543574593796428e-01
9.416543574593796428e-01
9.423929098966026263e-01
9.423929098966026263e-01
9.431314623338257208e-01
9.431314623338257208e-01
9.438700147710487043e-01
9.438700147710487043e-01
9.446085672082717988e-01
9.446085672082717988e-01
9.460856720827178767e-01
9.460856720827178767e-01
9.475627769571639547e-01
9.475627769571639547e-01
9.483013293943870492e-01
9.483013293943870492e-01
9.490398818316100327e-01
9.490398818316100327e-01
9.497784342688331272e-01
9.497784342688331272e-01
9.505169867060561106e-01
9.505169867060561106e-01
9.512555391432792051e-01
9.512555391432792051e-01
9.519940915805021886e-01
9.519940915805021886e-01
9.527326440177252831e-01
9.527326440177252831e-01
9.542097488921713611e-01
9.542097488921713611e-01
9.549483013293943445e-01
9.549483013293943445e-01
9.556868537666174390e-01
9.556868537666174390e-01
9.564254062038404225e-01
9.564254062038404225e-01
9.571639586410635170e-01
9.571639586410635170e-01
9.579025110782866115e-01
9.579025110782866115e-01
9.586410635155095950e-01
9.586410635155095950e-01
9.593796159527326894e-01
9.593796159527326894e-01
9.601181683899556729e-01
9.601181683899556729e-01
9.608567208271787674e-01
9.608567208271787674e-01
9.615952732644017509e-01
9.615952732644017509e-01
9.638109305760709233e-01
9.638109305760709233e-01
9.645494830132939068e-01
9.645494830132939068e-01
9.652880354505170013e-01
9.652880354505170013e-01
9.660265878877399848e-01
9.660265878877399848e-01
9.667651403249630793e-01
9.667651403249630793e-01
9.675036927621860627e-01
9.675036927621860627e-01
9.682422451994091572e-01
9.682422451994091572e-01
9.689807976366322517e-01
9.689807976366322517e-01
9.697193500738552352e-01
9.697193500738552352e-01
9.704579025110783297e-01
9.704579025110783297e-01
9.719350073855244077e-01
9.719350073855244077e-01
9.748892171344165636e-01
9.748892171344165636e-01
9.756277695716395471e-01
9.756277695716395471e-01
9.771048744460856250e-01
9.771048744460856250e-01
9.785819793205317030e-01
9.785819793205317030e-01
9.793205317577547975e-01
9.793205317577547975e-01
9.800590841949778920e-01
9.800590841949778920e-01
9.807976366322008754e-01
9.807976366322008754e-01
9.822747415066469534e-01
9.822747415066469534e-01
9.837518463810930314e-01
9.837518463810930314e-01
9.852289512555391093e-01
9.852289512555391093e-01
9.859675036927622038e-01
9.859675036927622038e-01
9.867060561299851873e-01
9.867060561299851873e-01
9.874446085672082818e-01
9.874446085672082818e-01
9.896602658788774542e-01
9.896602658788774542e-01
9.903988183161004377e-01
9.903988183161004377e-01
9.911373707533235322e-01
9.911373707533235322e-01
9.918759231905465157e-01
9.918759231905465157e-01
9.940915805022156881e-01
9.940915805022156881e-01
9.955686853766617661e-01
9.955686853766617661e-01
9.970457902511078441e-01
9.970457902511078441e-01
9.977843426883308275e-01
1.000000000000000000e+00
