1.657691001892089844e+00
6.576910614967346191e-01
6.576709151268005371e-01
6.575911045074462891e-01
6.574189066886901855e-01
6.572426557540893555e-01
6.569352746009826660e-01
6.568767428398132324e-01
6.568617820739746094e-01
6.568124294281005859e-01
6.568122506141662598e-01
6.566725969314575195e-01
6.566530466079711914e-01
6.566238403320312500e-01
6.564830541610717773e-01
6.564762592315673828e-01
6.564351916313171387e-01
6.564338803291320801e-01
6.563776731491088867e-01
6.563736200332641602e-01
6.563698053359985352e-01
6.563516855239868164e-01
6.562936902046203613e-01
6.562584638595581055e-01
6.562214493751525879e-01
6.562160253524780273e-01
6.561751365661621094e-01
6.561692357063293457e-01
6.560586690902709961e-01
6.560584306716918945e-01
6.558380722999572754e-01
6.558209061622619629e-01
6.557769775390625000e-01
6.557239294052124023e-01
6.556873917579650879e-01
6.556867361068725586e-01
6.556627154350280762e-01
6.556516885757446289e-01
6.555994749069213867e-01
6.554144620895385742e-01
6.553814411163330078e-01
6.553719043731689453e-01
6.552461385726928711e-01
6.552166342735290527e-01
6.551932692527770996e-01
6.551882028579711914e-01
6.551861763000488281e-01
6.551792621612548828e-01
6.551287770271301270e-01
6.551007628440856934e-01
6.550099849700927734e-01
6.549924612045288086e-01
6.413905620574951172e-01
6.413649320602416992e-01
6.413622498512268066e-01
6.413584351539611816e-01
6.412327885627746582e-01
6.412246823310852051e-01
6.412239670753479004e-01
6.412136554718017578e-01
6.411952376365661621e-01
6.411861777305603027e-01
6.411802768707275391e-01
6.411533355712890625e-01
6.410971283912658691e-01
6.410374641418457031e-01
6.409367322921752930e-01
6.407619714736938477e-01
6.407445073127746582e-01
6.407433748245239258e-01
6.407198309898376465e-01
6.401709318161010742e-01
6.401277780532836914e-01
6.399337649345397949e-01
6.399160623550415039e-01
6.398712992668151855e-01
6.398689746856689453e-01
6.398380994796752930e-01
6.398348212242126465e-01
6.398156881332397461e-01
6.398138999938964844e-01
6.397662758827209473e-01
6.397494673728942871e-01
6.396775841712951660e-01
6.396697759628295898e-01
6.395289301872253418e-01
6.395016312599182129e-01
6.394924521446228027e-01
6.391742229461669922e-01
6.389853358268737793e-01
6.384633779525756836e-01
4.934983253479003906e-01
4.934798181056976318e-01
4.933924674987792969e-01
4.933422803878784180e-01
4.932395517826080322e-01
4.932302236557006836e-01
4.931434392929077148e-01
4.931242167949676514e-01
4.930438697338104248e-01
4.930091202259063721e-01
4.929986894130706787e-01
4.929782152175903320e-01
4.929611086845397949e-01
4.929036200046539307e-01
4.928187429904937744e-01
4.927669465541839600e-01
4.926585853099822998e-01
4.922750890254974365e-01
4.922361671924591064e-01
4.922174215316772461e-01
4.921540319919586182e-01
4.921424090862274170e-01
4.920470118522644043e-01
4.919957816600799561e-01
4.919868111610412598e-01
4.919535517692565918e-01
4.918847084045410156e-01
4.918830692768096924e-01
4.918052554130554199e-01
4.917205870151519775e-01
4.916810393333435059e-01
4.916129708290100098e-01
4.913555979728698730e-01
4.911612570285797119e-01
4.910928905010223389e-01
4.910156130790710449e-01
4.910090267658233643e-01
4.908229112625122070e-01
4.907608628273010254e-01
4.897881746292114258e-01
4.897510409355163574e-01
4.796449244022369385e-01
4.793515801429748535e-01
4.792358279228210449e-01
4.791509807109832764e-01
4.791117310523986816e-01
4.789109826087951660e-01
4.785398244857788086e-01
4.782326221466064453e-01
4.781000018119812012e-01
4.780122339725494385e-01
4.776772260665893555e-01
4.774788320064544678e-01
4.774156510829925537e-01
4.773472249507904053e-01
4.766255021095275879e-01
4.764116108417510986e-01
4.762241840362548828e-01
4.762235879898071289e-01
4.761976897716522217e-01
4.760346412658691406e-01
4.758183658123016357e-01
4.756014049053192139e-01
4.753742516040802002e-01
4.753680229187011719e-01
4.752317070960998535e-01
4.752275943756103516e-01
4.751892387866973877e-01
4.750640392303466797e-01
4.750580787658691406e-01
4.749358892440795898e-01
4.748666584491729736e-01
4.747368097305297852e-01
4.746859669685363770e-01
4.745818972587585449e-01
4.745242595672607422e-01
4.743145108222961426e-01
4.742527604103088379e-01
4.741626381874084473e-01
4.739320278167724609e-01
4.735797345638275146e-01
4.735758006572723389e-01
4.731273353099822998e-01
4.724953770637512207e-01
4.723666310310363770e-01
4.706628620624542236e-01
4.702837467193603516e-01
4.701365232467651367e-01
4.701038897037506104e-01
4.700425267219543457e-01
4.699793756008148193e-01
4.637954235076904297e-01
4.637913405895233154e-01
4.637783467769622803e-01
4.637771844863891602e-01
4.637607634067535400e-01
4.637554287910461426e-01
4.636936783790588379e-01
4.636897742748260498e-01
4.636870622634887695e-01
4.636861085891723633e-01
4.636640548706054688e-01
4.636501669883728027e-01
4.636497497558593750e-01
4.636492133140563965e-01
4.592762589454650879e-01
4.591505527496337891e-01
4.586029946804046631e-01
4.583948850631713867e-01
4.581816196441650391e-01
4.580434262752532959e-01
4.578330814838409424e-01
4.577250182628631592e-01
4.575020372867584229e-01
4.574632048606872559e-01
4.573072791099548340e-01
4.572840034961700439e-01
4.572775065898895264e-01
4.569169580936431885e-01
4.567253589630126953e-01
4.565815329551696777e-01
4.559400379657745361e-01
4.525690674781799316e-01
4.522894918918609619e-01
4.522286057472229004e-01
4.510196447372436523e-01
4.509317576885223389e-01
4.409852027893066406e-01
4.404488801956176758e-01
4.391213655471801758e-01
4.350630939006805420e-01
4.308057427406311035e-01
4.306581020355224609e-01
4.305296838283538818e-01
4.302646517753601074e-01
4.302017092704772949e-01
4.300728440284729004e-01
4.292829632759094238e-01
4.291925430297851562e-01
4.291252493858337402e-01
4.291039407253265381e-01
4.289656877517700195e-01
4.288172721862792969e-01
4.287852644920349121e-01
4.284531474113464355e-01
4.284001588821411133e-01
4.282304048538208008e-01
4.281987547874450684e-01
4.281832277774810791e-01
4.281562864780426025e-01
4.279409050941467285e-01
4.278499186038970947e-01
4.278247058391571045e-01
4.278187751770019531e-01
4.275354444980621338e-01
4.275138676166534424e-01
4.237057566642761230e-01
4.167403876781463623e-01
4.167361259460449219e-01
4.163615703582763672e-01
4.162421822547912598e-01
4.158955514430999756e-01
4.158546030521392822e-01
4.155660271644592285e-01
4.154221117496490479e-01
4.148311614990234375e-01
4.145517945289611816e-01
4.144613444805145264e-01
4.144525229930877686e-01
4.141134619712829590e-01
4.139168560504913330e-01
4.136334359645843506e-01
4.115279912948608398e-01
4.112440943717956543e-01
4.109437465667724609e-01
4.107323586940765381e-01
4.105881452560424805e-01
4.105410575866699219e-01
4.104668498039245605e-01
4.104478657245635986e-01
4.101625680923461914e-01
4.099106490612030029e-01
4.095028042793273926e-01
4.094860553741455078e-01
4.094130396842956543e-01
4.093053936958312988e-01
4.090393483638763428e-01
4.087663888931274414e-01
3.989143073558807373e-01
3.963693380355834961e-01
3.892411887645721436e-01
3.890231549739837646e-01
3.887163400650024414e-01
3.882099688053131104e-01
3.875066339969635010e-01
3.874339759349822998e-01
3.873108029365539551e-01
3.865703940391540527e-01
3.863664269447326660e-01
3.863366544246673584e-01
3.863232731819152832e-01
3.862523138523101807e-01
3.861918449401855469e-01
3.858627676963806152e-01
3.858521282672882080e-01
3.858484625816345215e-01
3.858388662338256836e-01
3.858190476894378662e-01
3.857934474945068359e-01
3.857256472110748291e-01
3.856278955936431885e-01
3.856081068515777588e-01
3.856044113636016846e-01
3.855078816413879395e-01
3.854916989803314209e-01
3.854729533195495605e-01
3.854062259197235107e-01
3.853510022163391113e-01
3.853290081024169922e-01
3.850235939025878906e-01
3.848370611667633057e-01
3.848283588886260986e-01
3.847551345825195312e-01
3.845810890197753906e-01
3.845474720001220703e-01
3.845407068729400635e-01
3.845390081405639648e-01
3.845102787017822266e-01
3.844833970069885254e-01
3.844302296638488770e-01
3.842579126358032227e-01
3.842201828956604004e-01
3.842165172100067139e-01
3.841214179992675781e-01
3.839713037014007568e-01
3.839362263679504395e-01
3.838616907596588135e-01
3.838446736335754395e-01
3.837297260761260986e-01
3.836849033832550049e-01
3.835697174072265625e-01
3.835106194019317627e-01
3.834991455078125000e-01
3.834761679172515869e-01
3.834263682365417480e-01
3.834127485752105713e-01
3.833316564559936523e-01
3.694596886634826660e-01
3.690601885318756104e-01
3.690241873264312744e-01
3.689241409301757812e-01
3.686071932315826416e-01
3.683207631111145020e-01
3.674271106719970703e-01
3.672805428504943848e-01
3.672258555889129639e-01
3.670216798782348633e-01
3.670166432857513428e-01
3.438667654991149902e-01
3.215057253837585449e-01
3.214775621891021729e-01
3.213929533958435059e-01
3.213418722152709961e-01
3.213413953781127930e-01
3.213231563568115234e-01
3.208120763301849365e-01
3.206889629364013672e-01
3.202273249626159668e-01
3.201310932636260986e-01
3.196853399276733398e-01
3.196562826633453369e-01
3.018608391284942627e-01
3.018160462379455566e-01
3.017442822456359863e-01
3.016893267631530762e-01
3.016600608825683594e-01
3.016115427017211914e-01
3.015308976173400879e-01
3.012965321540832520e-01
3.012214899063110352e-01
3.010048866271972656e-01
3.003364801406860352e-01
2.969402670860290527e-01
2.846756577491760254e-01
2.844663858413696289e-01
2.838273048400878906e-01
2.835519909858703613e-01
2.833826541900634766e-01
2.831411063671112061e-01
2.830495238304138184e-01
2.649317085742950439e-01
2.646303772926330566e-01
2.645120620727539062e-01
2.643508911132812500e-01
2.643332481384277344e-01
2.642624378204345703e-01
2.642565667629241943e-01
2.640905380249023438e-01
2.638739943504333496e-01
2.638310194015502930e-01
2.638176083564758301e-01
2.618724107742309570e-01
2.618712782859802246e-01
2.618696093559265137e-01
2.618693709373474121e-01
2.576473057270050049e-01
2.576456964015960693e-01
2.576454877853393555e-01
2.576452195644378662e-01
2.572767138481140137e-01
2.457672357559204102e-01
2.456918358802795410e-01
2.456041574478149414e-01
2.455300986766815186e-01
2.453346550464630127e-01
2.452809810638427734e-01
2.452754080295562744e-01
2.452270984649658203e-01
2.448582351207733154e-01
2.444293200969696045e-01
2.296766042709350586e-01
1.978323757648468018e-01
1.970305144786834717e-01
1.967997252941131592e-01
1.967919766902923584e-01
1.967229545116424561e-01
1.750523149967193604e-01
