1.538909605705028216e+00
1.650974304522855762e+00
1.681711390526700267e+00
1.802452452943504646e+00
1.196922858856304561e+00
1.004848208542545640e+00
1.059234156428287665e+00
1.199049444853386825e+00
1.019191304048461033e+00
1.557871997173108980e+00
1.601979624424714865e+00
1.226836718964453121e+00
1.036791603657735372e+00
1.507553196495951209e+00
1.638667631761327126e+00
1.776614423664101716e+00
2.333750687217666098e+00
1.432944699335580108e+00
2.288717903032964962e+00
1.340199026350320954e+00
1.671841466443413804e+00
1.157130762175840877e+00
2.143678424249436443e+00
2.080164411452055440e+00
2.509322625244176486e+00
1.986185483719866918e+00
1.678575801261503742e+00
1.188800603359528196e+00
1.070553573654603019e+00
2.514813182589684004e+00
2.033383215316143300e+00
1.052975427007027287e+00
1.597803142089813777e+00
1.852130034375629730e+00
1.556979911281322071e+00
1.178369800410352886e+00
1.442749261086492707e+00
1.407033158402635209e+00
1.754783639299414277e+00
1.096538166946270820e+00
2.063419850464683236e+00
1.241649130307043158e+00
1.689020340766897332e+00
1.991547280921263985e+00
1.603401993433105854e+00
1.851344428100954342e+00
1.452359453713713888e+00
1.734492454874858591e+00
2.285373477068974868e+00
1.132270546891990470e+00
1.748493770997859853e+00
1.109164087989456426e+00
1.963528345520982210e+00
1.438055110186115870e+00
1.380860387420889790e+00
2.043434366233212174e+00
1.607749167299999726e+00
1.650521453187677512e+00
1.172754649571108754e+00
1.374466307736225801e+00
1.452784093799448728e+00
1.305111885368516855e+00
2.051414293178773995e+00
2.524525911168833403e+00
1.255566089190948809e+00
1.323907590374322929e+00
1.778445726953579831e+00
1.056697280066187794e+00
1.571169200857992498e+00
1.029094997951313317e+00
1.810045694021499507e+00
1.360223471159633046e+00
2.240108663267851519e+00
1.814884299780410659e+00
1.272322292058452264e+00
1.378965220577222928e+00
1.356034237823064981e+00
1.322190167750288525e+00
1.894132816025765553e+00
1.079896600064746748e+00
1.526235371159549548e+00
1.279912884075277368e+00
1.502963169130018706e+00
1.024997955253086790e+00
1.500084501708322859e+00
1.534274016236945704e+00
1.298176725442552470e+00
1.036879443535020595e+00
1.833702618085061964e+00
1.091632362622463992e+00
1.670177229946228303e+00
1.237983184327659414e+00
1.014001640421938744e+00
1.285474976936027858e+00
1.012695208130079738e+00
1.948205615065297103e+00
1.969637153682206376e+00
1.329656905392970323e+00
1.240293896660830342e+00
2.267767255310392915e+00
1.535238814965427245e+00
1.612251585329471437e+00
1.346402171581966956e+00
2.270007741951043823e+00
1.408258184634161081e+00
1.176400119319882087e+00
1.496703251061361817e+00
1.677566607443202074e+00
1.688551251807960618e+00
1.693896992467383456e+00
1.099902279921197934e+00
1.535179427246255335e+00
1.400167386835603267e+00
1.252938863560290716e+00
1.545154548407566164e+00
1.147721945607406591e+00
1.182789322925223763e+00
1.127841241502925529e+00
1.351524990380331248e+00
1.512019611561504551e+00
2.366177394647706489e+00
1.056189038432319593e+00
1.129453350836921777e+00
2.417055301650631094e+00
1.934209821571024834e+00
1.500064293608032395e+00
1.857928108337246531e+00
2.100927019200571788e+00
2.162051182715724273e+00
2.188429517813658798e+00
1.467860353302027798e+00
1.893340063652709571e+00
1.204496756400150526e+00
1.112364894315749364e+00
1.501065059034590421e+00
1.411794060238866999e+00
1.317882117897268612e+00
1.360474559001696226e+00
1.019677447678239757e+00
1.150211791171761311e+00
1.068437691720288463e+00
1.661490242798584038e+00
1.101900912649950159e+00
1.754777277920837486e+00
2.555057098029725804e+00
1.575601791550187203e+00
2.138593886073028028e+00
1.150488095439262892e+00
2.154278109797712837e+00
1.272489759081042004e+00
1.926348651474375284e+00
1.085597485648641891e+00
1.392809223713563638e+00
1.953739860659908567e+00
1.351815115366607589e+00
1.406432844452073505e+00
2.185798136333445107e+00
1.548360562848911215e+00
1.160789159921018499e+00
1.686330471600918868e+00
1.328723111245731836e+00
1.712842530217872028e+00
1.279292490724140974e+00
2.184304873835106520e+00
1.782846107703801586e+00
1.579004912734173427e+00
1.089026598815091118e+00
1.355575217837709845e+00
1.786985867025674857e+00
1.663328606831192102e+00
1.224392250934094539e+00
2.553219003394640918e+00
1.425493586395702561e+00
1.322506958226801199e+00
1.047602966854200846e+00
1.983439505993187746e+00
1.444702199478853810e+00
1.014991677578837015e+00
1.834322130240915616e+00
1.758669155890506319e+00
1.533932565275539339e+00
1.135129386295104625e+00
1.953231734476028381e+00
2.041429201578369934e+00
1.284945751511570533e+00
1.267335226970405904e+00
1.426474699574685312e+00
2.584973334260557642e+00
1.677253318105051960e+00
2.310457175571996924e+00
1.425254669139996766e+00
1.681386461104292573e+00
1.611769765552777178e+00
1.800589839434620032e+00
2.231462042764289500e+00
2.079202767188025547e+00
2.107740340186570638e+00
1.668508283301558537e+00
1.260896236472986764e+00
1.685936383529812677e+00
1.044752027794211058e+00
1.452751466712255857e+00
1.197412867484182408e+00
1.806086367299933215e+00
1.960770642689932508e+00
2.278428414148590875e+00
1.915512175689021657e+00
1.882941159089248861e+00
1.012538618707226279e+00
1.703610016965132479e+00
1.240787994118461857e+00
1.807546698585167144e+00
1.692362824823005818e+00
1.374578007664517765e+00
1.967236667055495047e+00
1.442931829179441516e+00
1.517399466008370945e+00
1.577732414979337472e+00
1.756279004201684479e+00
1.161249000638724382e+00
1.200239334820222492e+00
1.565230156072594303e+00
1.418531916486323041e+00
2.125646530853436467e+00
1.744507144967434975e+00
1.305685960691809200e+00
1.354207346767930975e+00
1.278818761421372852e+00
1.375935061414344851e+00
1.536927098377024903e+00
1.631795177041966971e+00
1.527269615793435342e+00
1.795379901484235319e+00
1.854322516474059102e+00
1.263178179713240645e+00
1.233681665099032765e+00
1.526483127506548021e+00
1.019540049906558554e+00
1.731492015683165020e+00
1.291998810515466500e+00
1.226354376508852040e+00
1.445356970593708601e+00
1.845295419944203541e+00
1.528458548862267286e+00
1.367029379454807847e+00
1.173873074928161619e+00
1.045740037488424257e+00
2.138326643734453025e+00
1.323601537334839762e+00
2.569618056775157200e+00
2.250436923940397627e+00
1.754452016428764471e+00
2.304833172731125313e+00
1.039693594540437083e+00
1.178106950996132829e+00
1.165954875671669111e+00
1.452501156202146593e+00
1.042436841433455719e+00
1.390143666747535978e+00
1.566884895657272292e+00
1.090621486869133738e+00
1.061711116477558114e+00
1.093529409675218611e+00
2.370986619543732132e+00
1.702019707525463277e+00
1.517357834039328335e+00
1.316713220495065340e+00
1.590303362123310915e+00
1.125807464275313086e+00
1.340334945889396945e+00
1.396920926958117315e+00
1.058643025567869822e+00
1.599613519998281941e+00
2.186866499693511656e+00
1.176120944331326301e+00
1.044452578103034046e+00
1.393439978608130181e+00
1.742143749727890656e+00
1.213246979459769337e+00
1.886344941294429978e+00
2.075509966745126444e+00
1.434603707538940176e+00
1.299507332858188535e+00
1.424230911543273193e+00
1.602952246999804986e+00
1.438067680450298536e+00
2.149838519206268561e+00
1.753705196306116099e+00
1.079502394699301870e+00
1.920781835484271172e+00
1.063742659533058132e+00
1.819895258493805068e+00
1.268268177501206351e+00
1.194997062949938016e+00
1.085247608187567936e+00
1.757705819224037347e+00
1.063892184472981173e+00
1.393134882832598676e+00
1.048999686129691078e+00
1.335571874427187833e+00
1.575840139611942581e+00
1.206375465104110756e+00
1.783653771919195385e+00
1.542378198716084503e+00
1.047692720276780065e+00
1.184216600799104624e+00
1.354962386275219588e+00
1.203406274385087737e+00
1.267660541428734522e+00
1.935391545084047094e+00
1.014997783279448118e+00
1.870422166456265911e+00
1.343446894632462252e+00
1.067726706694362537e+00
1.262587662657082666e+00
1.565859262762034243e+00
1.445590730492009923e+00
1.121106603686667258e+00
1.798072244219351523e+00
1.345919437852337808e+00
1.175632559418953837e+00
1.154979885197082501e+00
1.273644625545265807e+00
1.051389106098586490e+00
1.282379869125864325e+00
1.755432112975759740e+00
1.522010278853333176e+00
2.408955145600241821e+00
1.726943816200793957e+00
1.511782862721525289e+00
1.053425832413132923e+00
1.162939838499738920e+00
1.363411495554704533e+00
1.298962114044673655e+00
1.565071717489290082e+00
1.453846593991381386e+00
1.235113591278060197e+00
2.253603704318280165e+00
1.412047806558482943e+00
1.532518643156373317e+00
2.079292272417391452e+00
1.458034628135681299e+00
1.254814479982615083e+00
1.792094509153582038e+00
1.741842979360295862e+00
1.150347319948022307e+00
1.819324486132814611e+00
1.602644495791564871e+00
1.912919220053260094e+00
1.042830362694035395e+00
1.226437849386787793e+00
1.440179106766247719e+00
1.750424955928079784e+00
1.183377926130601665e+00
1.305502057917720116e+00
1.636345705121157623e+00
1.236149265313789769e+00
1.151125678491803583e+00
1.343222169401657728e+00
2.011585707179854410e+00
1.177603081514114303e+00
1.814771234605077055e+00
1.129977251850843079e+00
1.326395362061315142e+00
1.660483626125655698e+00
1.721488225254595106e+00
1.643340198234861438e+00
1.444102901674235495e+00
1.727216391507470972e+00
2.029228379994334919e+00
1.199775990393150860e+00
2.220447092660763566e+00
1.463048073951340511e+00
1.021303424183674036e+00
2.396707178792848225e+00
1.206181800325099251e+00
1.660413441620583574e+00
1.315314815709591745e+00
1.681092545432485874e+00
1.809859571866048844e+00
1.930681784455920091e+00
1.210563890533183473e+00
1.715533450397501491e+00
1.182059903477648000e+00
1.203234402027038019e+00
1.780236388343651166e+00
1.085556982456132635e+00
1.483405388834822203e+00
1.346348604880537536e+00
1.206944227365273514e+00
1.462599874041534243e+00
1.408097428222095049e+00
1.358746471700858827e+00
1.529406656292836120e+00
1.433474952220609833e+00
1.049033801507154529e+00
1.103178515483035360e+00
1.573922220457046661e+00
1.149385466578900949e+00
1.136295352365511713e+00
1.919735898552339171e+00
1.510467657526672225e+00
1.308042145412887436e+00
1.267911254850156100e+00
1.576556900428795371e+00
1.152675715247992949e+00
2.088506578039941886e+00
1.018391596155638013e+00
2.058504877419916834e+00
1.808321185629956585e+00
1.280330529818277441e+00
1.149963236636957431e+00
1.422743328875813784e+00
1.569989101905714168e+00
2.213911310931293563e+00
1.297694050830683787e+00
1.636432497159304500e+00
1.006091089122334248e+00
1.124965862076993117e+00
2.043090412736838335e+00
1.372082801751513870e+00
1.417530753374743879e+00
1.498452824998840915e+00
1.133791709804500281e+00
1.122297534943829778e+00
1.177900135317904384e+00
2.286870786117289001e+00
1.149249145257792426e+00
2.298931968832457873e+00
1.261187894464881998e+00
1.252916077978344367e+00
1.104005243726638552e+00
1.236924062223327514e+00
1.336679660025928751e+00
1.682326897458677140e+00
1.085334188486869023e+00
1.689113084902251094e+00
1.139778044357762310e+00
1.004388709737449537e+00
1.629640953694926564e+00
1.622067741466782120e+00
1.206688893570124765e+00
1.073976015073352164e+00
1.071450134295278245e+00
1.887517262262806028e+00
1.557618696463277885e+00
1.043208017459106962e+00
1.221702588354877550e+00
1.390505387913312907e+00
2.048300651725911692e+00
1.599781881141807638e+00
1.423107510684300747e+00
1.413172684106809962e+00
1.247922666787641521e+00
1.174596297714639581e+00
2.108599574318930081e+00
2.003624630800745710e+00
2.245801537889424715e+00
1.047894325934860982e+00
1.487505295378757086e+00
2.315906542882567809e+00
1.647054134718126450e+00
1.986600142825270421e+00
1.887547632241638018e+00
2.658823042205802345e+00
1.739185626998340117e+00
1.953914726347637743e+00
1.353321750620601893e+00
1.295149833302840392e+00
1.231633849500126665e+00
1.206948950126833342e+00
1.097933380556225247e+00
2.382595310377366271e+00
1.579667030121065352e+00
2.191509886336281188e+00
1.227287602312338910e+00
1.137347491055600068e+00
1.276146323440455088e+00
1.027348414970068013e+00
1.198274515462717682e+00
1.453991283027530113e+00
1.374643258518489120e+00
1.606455476828764217e+00
1.115704898545009316e+00
2.352510729215469443e+00
1.745258505593880960e+00
1.210161833074744342e+00
1.911413713413479210e+00
1.163445988982016566e+00
1.220385296475730241e+00
1.244325234998168384e+00
1.930115560562811305e+00
1.317047808397576514e+00
1.086562774765444495e+00
1.212818950507392302e+00
1.532689702616263139e+00
1.606251218012665793e+00
1.080606406488405780e+00
1.768007394518882114e+00
2.440151600477349803e+00
2.094854624043542834e+00
1.081611606053090258e+00
1.872576872311839447e+00
1.172751766232310144e+00
1.498822217848987393e+00
2.328453160479018180e+00
1.160730484927388950e+00
1.027604026845357454e+00
1.889412957016646910e+00
1.134395576985827159e+00
1.246254559737478562e+00
1.128212255423719279e+00
2.415416183868821509e+00
1.007038421284263796e+00
1.501343764733135799e+00
1.013864358821381595e+00
1.328755078751402863e+00
1.958052855042008877e+00
1.402474608322754834e+00
1.068694696524390420e+00
1.751890132352986740e+00
1.424264627499415958e+00
1.309257246432624866e+00
1.369310508165884510e+00
2.002418957786441300e+00
1.701251552182418747e+00
1.606451055257623439e+00
1.940468580593935455e+00
1.548164188843522915e+00
1.325575694972385365e+00
1.137462607030102602e+00
1.050477805998712322e+00
1.233482198857858814e+00
1.612162319223620965e+00
1.123406425534675401e+00
1.126199604816963351e+00
2.037770440057555810e+00
2.051104584925143026e+00
1.287055939388659809e+00
1.734839353233599724e+00
1.286227374912065180e+00
1.229192492929089164e+00
1.108953574720085156e+00
1.525610683631960063e+00
1.477709784355577094e+00
1.511988201622989525e+00
2.017592883830372497e+00
1.495926649665206609e+00
1.745797620243805248e+00
2.409222810632952516e+00
1.978098123496214500e+00
1.004020931380304793e+00
2.580494342914510852e+00
1.608648959264083578e+00
1.047442641299870303e+00
1.002491212196340520e+00
1.728691978125120654e+00
1.116592501806229487e+00
1.379557529220768242e+00
1.331962076384663796e+00
1.390302173081577664e+00
1.050997887868990510e+00
1.104510209456868841e+00
1.039645780186607027e+00
1.007673939824751841e+00
1.608335405593954937e+00
1.694700411015688024e+00
1.551543320886163313e+00
1.521349398035605871e+00
1.663624762041453931e+00
1.637926267468390762e+00
1.585987052922092966e+00
1.136431136201096814e+00
1.036050383415215048e+00
1.018552360128386569e+00
1.795384579312584439e+00
1.079589914307705678e+00
1.013355233927797805e+00
1.076176804324954217e+00
1.200487215823147880e+00
1.522841721268984649e+00
1.537849255987050689e+00
1.054192686821709080e+00
1.312532934103715965e+00
1.106930390034928546e+00
1.528453723716985513e+00
1.722139565011945539e+00
2.424920333535439010e+00
1.695341064115335916e+00
1.170458850613447011e+00
1.212000122634441013e+00
1.125758826907604426e+00
2.102133915667435904e+00
1.280089813665259868e+00
1.205352080127721104e+00
1.244158931189402129e+00
1.976581898162107720e+00
1.721683155951959865e+00
1.039722475813505076e+00
1.016290155069408341e+00
1.455883690922768148e+00
1.579751073217501078e+00
1.508547686462383242e+00
1.040483962383683014e+00
1.096177103199304170e+00
1.557548774959220284e+00
1.307395672156264066e+00
1.710459678266999850e+00
1.052347081414599428e+00
2.297192287263196686e+00
1.984775822611818175e+00
1.921670385687339389e+00
1.520241181730286995e+00
1.309711384280018320e+00
1.251726758749911017e+00
2.011236399411552966e+00
1.305558330386793475e+00
1.326671798309402961e+00
1.194983887414771573e+00
1.329598507724512046e+00
1.581760311437932387e+00
1.565133993594466144e+00
1.475004656164817352e+00
1.736842312854501191e+00
1.171168248011313029e+00
2.172705720390518902e+00
1.739203614813065180e+00
1.203616297993245876e+00
1.640048168750808388e+00
1.753343000845501098e+00
1.088594259115863050e+00
1.762793392983336371e+00
1.409053025376178603e+00
1.125128964705153889e+00
1.347544896367099954e+00
1.538439031784810673e+00
1.609101992770706868e+00
1.138743345571240351e+00
1.345819849823276071e+00
1.055120556841758983e+00
1.443035455557893254e+00
1.462128181563911999e+00
1.286260563387768396e+00
2.153937008796204200e+00
1.591631069429982004e+00
1.124144487942694726e+00
1.721289195820673745e+00
1.381358756165798285e+00
1.431213459498838159e+00
1.091121174752207379e+00
1.143569806741517425e+00
1.542913829869617004e+00
1.963707760354807208e+00
1.353609398670359454e+00
1.922498083207299313e+00
1.018366250157481279e+00
1.656128566036228600e+00
1.259699416409407302e+00
1.943277203448282142e+00
1.688772871991304214e+00
2.120482356364632892e+00
1.021712251588660525e+00
1.370130199013600558e+00
1.076985314152399731e+00
1.333425343597966606e+00
1.752843283804807362e+00
1.811591014404864142e+00
1.647389099212696717e+00
1.128251175681706631e+00
1.067438261827144741e+00
1.583032320267092175e+00
1.119218727609273545e+00
1.014006620809577930e+00
1.418368405857563408e+00
2.167638552743177627e+00
1.535738508250438006e+00
1.372535293839123094e+00
1.641163975051158852e+00
1.116517699958275323e+00
1.116576170555644287e+00
1.510162874668698363e+00
1.141045615854842099e+00
1.437284594903633694e+00
1.871451290900965958e+00
1.100027190927800103e+00
1.481950642374076033e+00
2.035732118768197374e+00
1.715983169819255139e+00
1.819493142057839741e+00
2.057349784905270873e+00
1.093839227961923566e+00
1.360307538272960803e+00
1.168008079209321259e+00
1.614537536614248925e+00
1.078778308857989421e+00
1.107073157500212179e+00
1.206498890183767658e+00
1.959622518160078153e+00
1.625532105830086227e+00
1.028278118775221683e+00
1.330544062194614074e+00
2.445593079814173620e+00
1.189744270250364000e+00
1.078100469346496171e+00
1.812643766426365710e+00
1.220419055626494442e+00
1.161482509630473281e+00
1.388296083124730185e+00
1.161820749486912829e+00
1.061857537334575996e+00
1.154968558051421290e+00
1.254557794629701739e+00
1.524256155677996993e+00
1.415376823146587082e+00
1.294569535761820545e+00
1.789707340339584896e+00
1.201919797160073466e+00
1.358457120063403467e+00
1.952578430530776066e+00
1.607569128011613557e+00
1.335376450700389350e+00
1.675106588885198367e+00
1.250156461222783566e+00
1.690949180975533706e+00
1.274943231002142907e+00
1.513636304398295440e+00
1.429590639872680535e+00
1.138922000971560378e+00
1.809627076631901366e+00
2.342544587391163891e+00
2.135683555120508892e+00
1.563966446377867969e+00
2.172533084338073905e+00
2.377198482012985004e+00
1.512330892660887827e+00
1.609133358179427598e+00
1.608373972286714082e+00
1.155411493464673534e+00
2.189977219516358709e+00
1.017598945202130123e+00
1.758288432877880281e+00
1.043742274731408459e+00
1.395037460736314294e+00
1.246340565737490413e+00
1.647339819901694868e+00
1.094402780388043617e+00
1.593227065767111261e+00
2.196560870339073102e+00
1.050413235369269671e+00
1.128029690649008820e+00
1.037175969426892053e+00
1.116331910244530823e+00
1.313105125585262822e+00
1.592811953452003326e+00
1.347509247983591285e+00
1.415412625663647672e+00
1.229577187223112489e+00
1.223738725486190004e+00
1.314884209867893894e+00
1.323678079116743733e+00
1.175396683044048762e+00
1.558297929576911933e+00
1.485261823252578273e+00
1.348612669759597038e+00
1.569888028010312020e+00
1.331257501147436129e+00
1.676472705554459708e+00
1.377349654649781652e+00
1.489361957855934948e+00
1.495824044883231618e+00
1.021432222941945245e+00
1.633292533346080821e+00
1.473703903745982480e+00
1.097501822246534919e+00
1.604584721946632264e+00
1.260393569567764382e+00
1.407378289727822862e+00
2.468968350498346620e+00
1.150251689165340041e+00
1.040571336096991928e+00
1.787025727330085800e+00
1.857232173050614055e+00
1.563193523319210909e+00
1.052168951643551065e+00
1.617630821939783914e+00
1.591822301601359957e+00
1.115418703364482456e+00
1.747788690522257715e+00
1.062162837044312136e+00
1.366837875106113875e+00
1.611702518869964740e+00
1.276118257373981546e+00
1.128029123589386673e+00
1.309421832120979401e+00
2.406266508201990284e+00
1.092272324124450744e+00
2.040462988282996548e+00
1.600485960023974474e+00
1.246271033314861887e+00
1.541818779366259440e+00
2.614992198597309692e+00
1.249227673836393659e+00
2.031224428527809600e+00
1.667649364110184385e+00
2.060249301450352011e+00
1.457968515968819601e+00
1.546854753878467381e+00
1.054252369853450721e+00
1.710714648204533672e+00
1.108042979568742314e+00
2.088936843011973021e+00
1.000471282322123123e+00
1.525214872781368358e+00
1.763669253980104878e+00
1.367411828365802773e+00
1.954556861374116883e+00
2.154638458308133941e+00
1.139752679172602479e+00
1.769067319170528174e+00
1.653404461831106786e+00
2.017812332165986877e+00
1.766394156852297170e+00
1.473947226228865537e+00
1.443138675504199719e+00
1.096207673811754324e+00
1.456185677054681493e+00
1.374953980469441062e+00
1.567042260279264854e+00
1.523226326232838268e+00
1.474254442108353880e+00
2.174870357251341257e+00
1.003077474951145520e+00
1.037255978203359685e+00
1.012153778149410321e+00
1.050024102378146695e+00
1.843033279124341339e+00
1.225666475224148178e+00
1.081209700735745294e+00
1.569933146900863052e+00
1.697838529421713538e+00
1.180532556032143132e+00
1.013782995012458388e+00
1.153894261749730976e+00
1.884241957254708666e+00
1.344161364124020430e+00
1.096224526348668293e+00
1.073882919904567634e+00
1.374558117525278123e+00
2.011742847393310551e+00
1.243381731599503048e+00
1.107794519408857203e+00
1.017504772345331432e+00
1.423715636591934341e+00
1.780319596689152295e+00
1.854331493550277710e+00
1.518091617349111910e+00
2.175081908560237753e+00
1.140956108093602372e+00
1.125667943168230600e+00
1.731018986230008050e+00
1.035181407623685601e+00
1.490617770006091858e+00
1.564803130066186432e+00
1.086841082267646197e+00
1.988476658376557182e+00
2.142937265544975656e+00
2.563727449550820658e+00
1.367200819177825766e+00
1.225904374559299015e+00
1.492434748151811652e+00
1.897408113050122580e+00
1.080157737370281312e+00
1.315051684097853668e+00
1.197373468828515586e+00
1.418728738555293356e+00
1.291265899425690256e+00
1.337596905143001225e+00
1.599364287665411277e+00
1.405575663330900893e+00
1.265783289851542870e+00
1.354946022502591108e+00
1.355647310645018866e+00
2.069671303388487260e+00
1.201446797098649100e+00
1.807350751864879479e+00
1.701883099276927158e+00
1.930246728601770378e+00
1.132746242882322285e+00
1.235917249337519452e+00
2.104161451086606682e+00
1.897066391434920396e+00
1.710599232206952758e+00
1.522882569293489086e+00
1.594977984517576441e+00
1.340172397174851371e+00
1.472137447111721453e+00
1.610751137778441811e+00
1.652050627835667251e+00
1.279529846042969821e+00
1.381002785441674208e+00
1.317084748548164486e+00
1.110228488178713890e+00
2.282749311722124474e+00
2.192602111743988669e+00
1.804807600250586175e+00
2.162162755126791680e+00
2.204400453241154523e+00
1.391965995957095581e+00
2.118930156434346124e+00
1.414348119911905455e+00
1.090667758477019023e+00
1.295423532080459239e+00
1.104674691717287827e+00
1.104100055297498217e+00
1.257044923330617570e+00
1.374342479903779779e+00
1.083165890023767952e+00
1.494734086417740082e+00
1.072243492653992769e+00
1.061170829195972942e+00
1.083391581411340177e+00
1.472493106298186527e+00
1.449404342700925330e+00
2.030049161395290902e+00
1.235886044723951249e+00
2.148816420004632466e+00
1.782388052319052507e+00
1.803083981054105056e+00
1.206569005918154414e+00
1.301824169044158319e+00
1.338485562347229818e+00
1.571095947470823262e+00
2.023291034560764423e+00
1.111098989896371014e+00
1.640162562599501772e+00
1.266168649303836435e+00
1.094231383977718020e+00
1.398316625467761476e+00
1.194183322662563995e+00
1.965086131577413520e+00
2.007354412964435397e+00
1.776257861997695642e+00
1.441736537397492413e+00
1.490476694028658455e+00
1.323607690856753782e+00
1.002882984263560928e+00
1.530019194734301591e+00
1.775507449330533172e+00
1.232439919704944487e+00
1.622469611049259797e+00
1.758495846329261036e+00
1.475816493467609236e+00
2.039328493347599913e+00
1.078042369547077772e+00
1.440376355445504464e+00
1.023623995385634977e+00
1.543417721457864822e+00
1.165837382154349511e+00
1.524005853380638431e+00
1.887049149734700171e+00
1.550704503645662147e+00
1.814898153240291467e+00
1.143448940195454178e+00
1.044500629861847996e+00
1.389784085637312483e+00
1.517073176365775211e+00
1.093514654893325222e+00
2.302098064190772675e+00
1.766297316846504595e+00
1.427082493803248919e+00
1.009001653597118464e+00
1.690600620255788611e+00
1.335168972267604559e+00
1.257777346290468889e+00
1.436626788480493300e+00
1.262423751644848879e+00
1.154963572187957199e+00
2.274623394349047256e+00
1.105326875926949892e+00
1.330872996393974272e+00
1.470342005647612416e+00
1.016302255693406487e+00
1.226830022145364740e+00
1.600212504442609651e+00
1.174965775878280994e+00
1.549517317314301312e+00
1.210746148533826894e+00
1.127530338349599370e+00
2.044581925403457845e+00
1.064380740169363238e+00
1.054505898295688970e+00
1.106566537525394356e+00
2.600784968173043055e+00
1.518387933879942420e+00
1.455238702695500708e+00
1.325650343319163538e+00
1.045028366537308795e+00
1.054744432842921853e+00
1.432620615373714212e+00
1.990945245118432183e+00
1.280413627098673235e+00
1.684884020420778894e+00
1.158271666170372249e+00
1.683908941065335396e+00
1.760329909046574937e+00
1.973247919200423750e+00
1.187654679709269745e+00
1.376425057899678839e+00
1.276384374087868201e+00
1.717209809774633777e+00
1.766843333327354992e+00
1.372368056511761747e+00
1.130169999068528330e+00
1.776576730634333190e+00
1.029792541961559893e+00
1.004742575041489339e+00
1.130247261398801939e+00
1.637949872788553973e+00
2.140954755392733055e+00
1.286409322940371025e+00
1.404767262365917091e+00
1.240201416252801225e+00
1.036616265661379988e+00
1.274518592739593226e+00
1.011382277013529452e+00
1.394468504077581716e+00
1.002245732547403234e+00
1.055499786056018685e+00
1.137270865447938872e+00
1.159167324827980350e+00
1.138064416811938484e+00
1.075923614022146424e+00
1.389008694515738496e+00
1.067574568489908504e+00
1.293547309804680800e+00
1.326208828199205714e+00
1.241050816534514656e+00
1.090494695779748779e+00
1.433733200863632984e+00
1.079292416377253483e+00
1.098088024894006143e+00
1.975407172566407077e+00
1.438135279487559037e+00
1.166472764053055666e+00
1.260634557701294067e+00
1.349051482897446474e+00
1.735588164841552983e+00
1.068606797624920057e+00
2.168549330022526256e+00
1.049611169098453312e+00
1.074518594899209978e+00
1.572475462514794087e+00
1.479210063893832139e+00
1.745673764395273775e+00
1.432226988785993749e+00
1.532220054800883968e+00
2.062693281551337243e+00
1.738306401264823497e+00
1.278535451148198998e+00
1.477966453439883976e+00
1.101539618733855086e+00
1.189823504007884836e+00
1.315056166692466944e+00
1.845188570951739937e+00
1.018395892605966635e+00
1.699274923672721149e+00
1.591015928741072782e+00
2.044675761994214636e+00
1.958332728249184695e+00
1.813983759437249210e+00
1.044538612131448829e+00
1.530286365589981878e+00
2.033190791418816090e+00
1.229252703799513124e+00
1.035929863337577306e+00
2.091113355268807705e+00
1.791208053267702383e+00
1.306317820647262984e+00
1.179413962787846826e+00
1.382667537365894539e+00
1.345282714812553237e+00
1.645863802983850155e+00
2.122396530498737999e+00
1.425133952463036424e+00
1.111316853891900713e+00
1.477627325984703255e+00
2.004856021460212023e+00
2.096281139956468476e+00
1.202400100318670395e+00
1.138199169107082520e+00
1.652058461703018288e+00
2.527632014478170763e+00
1.710777071939463490e+00
1.148557972278855699e+00
1.319541769206052706e+00
1.010864521913812153e+00
1.991300081325349414e+00
1.198888084771203788e+00
2.166254453070675989e+00
1.299781758140898136e+00
1.227148485078771056e+00
1.657075291099231462e+00
1.330960963213706938e+00
1.855800455867083310e+00
1.111083653335227961e+00
2.034764596931901259e+00
1.503766453888629062e+00
1.505012732928341590e+00
1.371478334187904213e+00
1.167930444599693418e+00
1.435916835769781352e+00
1.522735912494388222e+00
1.052130794034648043e+00
1.318720039318081572e+00
2.043131954417806817e+00
2.111228238367840238e+00
2.219278923125405978e+00
1.797321460341339661e+00
1.270905373879429812e+00
1.884315586699760514e+00
1.105520564883223811e+00
1.134110459413401051e+00
1.070408333654612854e+00
1.542210733053766880e+00
2.018610621465050770e+00
1.632902422384041818e+00
2.119111865968563713e+00
1.402541520574960510e+00
1.597727400230606110e+00
1.280438741631538146e+00
1.819393699402066744e+00
1.310630148196599398e+00
1.600523953023212265e+00
1.285387191300356058e+00
1.083673761745682640e+00
1.242539448359544663e+00
1.778746650285572439e+00
1.081968714399347942e+00
2.214010250606504471e+00
1.311439091826962278e+00
1.231209907328094655e+00
1.231924748196447483e+00
1.156414475545321396e+00
1.460605740607058722e+00
1.819806934967822531e+00
1.739539377221358762e+00
1.066141797653002543e+00
1.051274757310237451e+00
1.123856651423374098e+00
1.163085220051419011e+00
1.043455088246959317e+00
1.702690719041105138e+00
1.983025208402687145e+00
1.610134131485937869e+00
1.861560550145897608e+00
1.017898216236605258e+00
1.146873673708858732e+00
2.246759643676470297e+00
1.270952107264752717e+00
1.300218063250682565e+00
1.046987973386842796e+00
1.140257899556313292e+00
1.929009825335169515e+00
1.210433413356320154e+00
1.101955377914260792e+00
1.474735569498353049e+00
1.325542771189602176e+00
1.316219689106020274e+00
1.700820074128400528e+00
2.321150016221126489e+00
1.315523657452698947e+00
1.932400353940921134e+00
1.704754420965061801e+00
1.164720383702129602e+00
1.162306877905861180e+00
1.682875351734944624e+00
1.727799692710304758e+00
1.537220455515124762e+00
1.120699856921981707e+00
1.372299673114386165e+00
1.282338127062939037e+00
1.067327319338573499e+00
1.508391628912297611e+00
1.577938429122361930e+00
2.034154174864525544e+00
2.514333368425803794e+00
1.121656774826239378e+00
1.189916302422191707e+00
1.846346897961204325e+00
1.683869007647927463e+00
1.669473769599416624e+00
1.746199557339977559e+00
1.406922109950914823e+00
1.498149364717594301e+00
1.319399023803456084e+00
1.276443223031805685e+00
1.245883944531780640e+00
1.512716647632831091e+00
1.428828425637871158e+00
1.077808490267041286e+00
1.059019902865605545e+00
1.199505759252671444e+00
1.070952159267499981e+00
1.099389721053951163e+00
1.209645720969668714e+00
1.254667032287401396e+00
2.548811157342403266e+00
2.201555190047638888e+00
1.409902185934889474e+00
1.126024012646358763e+00
1.633386745649613392e+00
1.104067255365789313e+00
1.077679843494447676e+00
2.151572654885765434e+00
2.031868915650204777e+00
1.424739144927908763e+00
1.145432862258919826e+00
1.123153395589112868e+00
1.392774824542973633e+00
1.153482082816460919e+00
1.801373536022452759e+00
1.553173550290526395e+00
1.223724175670629188e+00
2.193119544421522793e+00
1.108224650008319712e+00
1.627900051882914756e+00
1.000104388058135507e+00
1.746800968224905048e+00
1.653814940367353437e+00
1.086379729870469601e+00
1.322092444998858252e+00
1.181107908129950257e+00
1.757589292476299248e+00
1.397575253148341856e+00
1.835449303727723080e+00
1.485393536776853818e+00
2.248000462177092817e+00
1.224711604130841458e+00
2.106571953802746311e+00
1.042789363575281625e+00
2.126933951030340442e+00
1.612111837011144466e+00
1.255370985292989294e+00
1.669449223222766676e+00
1.479654904670311133e+00
1.578198019975829869e+00
1.138346228541705418e+00
1.434893951239107679e+00
2.556507520292071511e+00
1.025496086670876439e+00
1.464498271237562044e+00
2.136130315705318861e+00
1.975551953893272206e+00
1.800496349449624667e+00
1.860281140829620261e+00
1.119969764035071647e+00
1.044860975829485561e+00
1.574245948718285604e+00
2.070174961033315331e+00
1.328041269623170928e+00
1.219183384129821635e+00
1.030101668508729196e+00
1.447682017216182171e+00
1.016581780845549066e+00
1.332976234638063584e+00
1.672308901217574029e+00
1.163989249666933290e+00
1.338468561586649397e+00
1.298886651117614699e+00
1.523152579220152347e+00
1.934578057789653860e+00
1.168670838318947469e+00
1.977957174627180015e+00
1.157691832671717824e+00
1.150877379502574405e+00
1.181515893564494712e+00
1.033790894534000193e+00
2.007083470019254356e+00
1.361959593935440083e+00
1.160707448922705165e+00
2.135273000384069864e+00
1.784450108834367388e+00
1.279587323116560205e+00
2.035942402311046617e+00
1.265930926001862966e+00
1.049838514838495218e+00
1.852776890936932430e+00
1.104419370836954739e+00
1.090030447147927628e+00
1.622352155571714194e+00
1.995770474432019048e+00
1.160782166417570371e+00
1.123469171669364775e+00
1.758715767295797816e+00
1.239932418241106671e+00
2.128061359556280951e+00
2.077045814218593467e+00
1.438744657873347821e+00
1.507132005780620343e+00
1.205285210959903708e+00
1.628398011646245092e+00
1.371146380608944781e+00
1.447096646510303453e+00
1.912602030802503350e+00
1.467618551827265971e+00
1.147281032036141735e+00
1.568782096016501537e+00
1.156000928769888692e+00
1.254987722432109098e+00
2.344144467600314474e+00
1.832271814282030231e+00
1.759969093781682092e+00
1.213554146633091912e+00
2.123829057166952250e+00
1.954710521904206244e+00
1.253417275426583766e+00
1.271984257304692889e+00
1.262506609888316866e+00
1.135089561323250340e+00
1.449267023718560754e+00
1.536787610268435245e+00
2.352792273004149948e+00
1.434575889122087444e+00
1.320644734259952546e+00
2.052095843287889743e+00
1.129481342041253944e+00
1.288602118831187804e+00
1.457723050161659817e+00
1.448303394008771949e+00
1.561436861856801972e+00
1.275234883766944050e+00
1.399118091168317646e+00
1.596868963667837038e+00
1.622985393581272584e+00
1.500036019469313198e+00
1.596632944262188936e+00
1.026941892075523999e+00
1.240686053546060208e+00
1.675607804195721862e+00
1.425655389737352285e+00
1.100275901396824185e+00
1.007167807038366281e+00
1.402649778716448692e+00
1.783423402363211840e+00
1.262571337530496995e+00
1.757790289274627549e+00
1.457806652173815554e+00
1.132217281608873805e+00
1.933002339056447028e+00
1.218505437762601895e+00
1.551967318418882691e+00
1.950987570309010488e+00
1.316931748148857162e+00
1.516374465739987798e+00
1.124227199500160257e+00
1.155105205043953198e+00
1.901994199066534552e+00
1.029738210866778303e+00
2.102848560515087950e+00
1.805599191631295231e+00
1.087708862493699025e+00
1.159347679258195596e+00
1.573291021256733258e+00
1.246125878226908679e+00
1.156842676895069033e+00
1.803335196233211590e+00
1.681471022766070522e+00
1.850567966722405755e+00
1.269720522735194645e+00
1.629434758390031490e+00
1.089207219681930239e+00
1.476530670853210658e+00
1.485699497980742301e+00
1.586120260077389821e+00
1.687771120657373336e+00
1.658390646277354330e+00
1.190315234636424968e+00
1.025110632212853590e+00
1.342781646191245182e+00
1.508729383461095530e+00
1.100552171740749374e+00
1.178826513214058958e+00
1.836939645393928400e+00
1.768748757311503494e+00
1.018832622528156984e+00
1.256642558111770613e+00
1.050359967460002819e+00
1.433243720507972219e+00
1.025262845337741036e+00
1.122727405641169351e+00
1.179954882743268429e+00
1.297292221589676497e+00
1.471328081795375109e+00
1.163655489212204186e+00
1.241717483197382954e+00
1.903948080779661156e+00
1.211369054838178583e+00
1.260878982610982524e+00
1.160127761819897740e+00
1.129232985537850897e+00
1.004125739591347655e+00
1.349024007627334321e+00
1.761720363583815452e+00
1.351389182019767654e+00
1.019267568441596605e+00
1.647176126610441882e+00
1.169870657033621475e+00
1.945467961931368173e+00
1.356442632122707659e+00
1.084575871055477148e+00
1.103166551063049727e+00
1.490188152192200910e+00
1.018992654422662625e+00
1.775486700073069191e+00
2.250705826825020850e+00
2.116009408165215877e+00
1.602393459810489640e+00
1.409097996493277050e+00
1.631250021081021018e+00
1.384285242018862716e+00
1.201678195915105274e+00
1.377224491452601285e+00
1.474443628977320841e+00
1.186874440593386648e+00
1.391118476979662288e+00
2.204853652225690741e+00
2.547034946767857466e+00
1.032495573066888550e+00
1.968683479356564847e+00
1.010726120336782108e+00
2.242935163177444124e+00
1.232231720704972666e+00
1.598815153781415921e+00
1.092948426166346021e+00
1.146791551045275748e+00
2.305256423794131315e+00
1.307788151878580774e+00
1.628980477403216609e+00
1.980853797993223253e+00
1.382602931430843007e+00
1.484684231415947631e+00
1.659408556542220525e+00
1.369390752961319846e+00
1.821509136864077005e+00
2.438931382535794778e+00
1.981621952995009872e+00
1.050512434162164110e+00
1.294213014896020919e+00
1.153749941139014412e+00
1.268380815887007351e+00
1.152720145674586583e+00
1.166892908829931130e+00
2.013119276815516390e+00
1.170731973958134331e+00
1.866537641887736632e+00
1.223032651328244569e+00
2.291432787953835426e+00
1.696117855568296084e+00
1.840607494365343655e+00
1.564497523990602046e+00
1.210184250875922851e+00
1.844064345318199960e+00
1.031105667733424935e+00
1.677693595747658195e+00
1.017331282208785437e+00
1.165187227421145888e+00
1.406406672338550878e+00
1.810143097760800179e+00
1.505910745061656897e+00
1.717306111709549610e+00
1.782699723993417029e+00
1.173990827172660456e+00
1.461357288443900337e+00
1.801751576301663604e+00
1.280724068517504310e+00
2.289076001082129608e+00
1.598694870172887139e+00
1.082120086993062058e+00
1.165193342818278133e+00
1.123931945689106149e+00
1.728021781296449566e+00
1.190893268424671803e+00
1.310881492951169847e+00
1.674781784862646727e+00
1.304015022157546166e+00
1.696992022373752906e+00
1.085633198858988235e+00
1.540143486113945803e+00
1.815903135946151492e+00
1.007501960756761683e+00
1.629366350324978008e+00
1.287435885730615182e+00
1.861013693605403585e+00
1.181607363643629505e+00
1.039651665045280504e+00
1.646721760626267406e+00
1.272489682076429984e+00
1.157496741674450158e+00
1.550653828323315997e+00
1.089372327647965655e+00
1.239808152618249615e+00
1.161289942464949210e+00
2.425334776993147035e+00
1.807511338412782997e+00
1.465783960325165447e+00
2.250478453299208592e+00
1.613542187175266207e+00
1.351088734717304396e+00
1.497822243779432627e+00
1.347436561921449227e+00
1.193303989318629021e+00
1.548640909766143547e+00
1.691605530949531699e+00
1.845519429237222786e+00
2.021112867229443388e+00
1.914446322778936560e+00
1.253143566920983387e+00
1.617328053823143819e+00
1.267524767192713897e+00
1.812932069323984541e+00
1.035730579192653877e+00
1.451588211378139981e+00
2.283363421344935418e+00
1.245671092019144499e+00
1.501824413801790437e+00
1.152181382441298974e+00
1.557039854144005586e+00
1.492471058022201369e+00
2.424855145287894143e+00
1.236000960777164481e+00
1.035748541419595048e+00
1.498973881412650755e+00
1.644918667884219809e+00
1.107660576096200389e+00
2.192265890776961434e+00
1.135905807727486172e+00
2.314597471896294945e+00
1.349645778192254175e+00
1.927835131245985822e+00
1.346342515112026295e+00
1.761054102345108285e+00
1.891912044828034212e+00
2.148801126620426771e+00
2.258739094921903057e+00
2.058738898631891079e+00
1.489538785014153044e+00
1.171565203731282923e+00
1.435847705584402334e+00
1.291387719832936654e+00
1.709916681413533590e+00
1.388213829687339640e+00
1.318378540013306566e+00
2.061799001281157562e+00
2.033977875841842309e+00
1.569985861269260097e+00
1.096833615318258515e+00
1.260231828892292016e+00
2.114896744149759478e+00
1.240113372268213165e+00
1.613882802786383186e+00
1.214617523518888964e+00
1.133110342699908735e+00
1.619868270427114121e+00
1.573591367320110956e+00
1.766511459176648868e+00
1.603137738514210486e+00
2.889785724907639075e+00
1.394443454202277666e+00
1.076737552951901433e+00
1.236933283506142622e+00
1.086233136235157826e+00
1.576101973121398769e+00
1.129810231167599932e+00
1.468797963459467670e+00
1.620360337137813689e+00
1.424713852184308349e+00
1.412927464751471129e+00
1.185474780173107145e+00
1.678085863523802290e+00
2.301278595294299123e+00
1.578614416811111143e+00
1.246988787509187846e+00
1.652578468047220861e+00
1.545954250805558150e+00
1.594062912269989196e+00
1.375644036923426405e+00
1.021921637123316851e+00
1.209665868984295622e+00
1.667785002903540370e+00
1.844840523822434575e+00
1.034530799167742598e+00
1.506349034256599939e+00
1.349394436448159817e+00
1.268993694800450101e+00
1.258899925070795289e+00
1.278644246718501298e+00
1.319002442392776198e+00
1.434882477949554369e+00
1.343077513886086205e+00
1.612163518307442311e+00
1.865654323956741578e+00
1.291958843141111757e+00
1.345352185192496330e+00
1.151847317978659913e+00
2.114986149012214600e+00
2.144110852305437742e+00
1.840456153112620896e+00
1.234055570471085606e+00
1.901192841149838664e+00
1.043569164383712611e+00
2.731361366107304622e+00
1.868715531262801655e+00
1.878503392511306602e+00
1.680277012950332161e+00
1.689364803306063978e+00
1.776367673353846266e+00
1.260469896723572569e+00
1.147581965533886805e+00
1.002064998312379052e+00
1.551110157492301855e+00
1.040726580798863488e+00
1.829072073815734001e+00
1.498302120638434154e+00
2.057164480602933221e+00
2.145824433835943346e+00
1.211927862936033717e+00
1.536138093255071890e+00
2.029124027434746402e+00
1.478531242599255835e+00
1.396799772947750373e+00
1.723984989232032472e+00
1.562460600432558966e+00
1.228075887484570083e+00
1.899726193025222498e+00
1.079301597367938514e+00
1.286641691339617033e+00
1.094561227606190235e+00
1.405818954617171990e+00
1.979396185569741506e+00
1.818071107458054669e+00
1.090767314142870426e+00
1.061538997133812279e+00
1.804790625958937245e+00
1.378878743132133877e+00
1.919323340658776411e+00
1.455181585832537872e+00
1.144979182949736218e+00
1.220310758685574148e+00
1.279397809646651618e+00
1.795385781643966006e+00
1.529282903536980154e+00
1.198430136206581231e+00
1.294013811026843097e+00
1.308217838524750709e+00
1.114448550097803414e+00
1.245560672387762580e+00
2.095644655233356968e+00
1.007190542394121424e+00
1.152939750801350582e+00
1.114527975945303950e+00
1.217602413319826216e+00
1.079781502336417676e+00
1.707327113588692491e+00
1.781585758765915184e+00
2.065829092802160982e+00
1.286450071131814532e+00
1.186203822935731678e+00
1.380813897324010942e+00
1.038401108098013115e+00
1.540163491866459511e+00
1.548527142872069495e+00
1.101646443470375214e+00
2.116629402254390779e+00
1.116688496462733937e+00
1.249850767298896770e+00
1.788997518687563071e+00
1.719854156278656676e+00
1.140895440202670974e+00
1.820318499446316185e+00
1.401652747914417407e+00
1.467360032619100974e+00
1.326025639904671038e+00
1.475126174938969914e+00
1.224434418289502613e+00
1.287905050908195737e+00
1.020566875836248499e+00
1.244842499045810014e+00
1.480137064484621456e+00
1.107540356316845997e+00
1.684186113854335698e+00
2.140149947159704080e+00
1.060933589122743159e+00
1.205979357675095232e+00
1.564403369933030641e+00
1.236000901368981220e+00
1.250973476824784436e+00
1.451777758825977038e+00
1.306731053424688094e+00
1.711716174388875800e+00
1.825425704248812231e+00
2.254908164225230660e+00
1.292344770384062480e+00
1.067866277003757691e+00
1.915566968608207521e+00
1.417720968133183268e+00
2.230998655574683021e+00
1.234737349951276153e+00
1.421403056524439990e+00
1.060034354575746685e+00
1.702317250885968525e+00
1.908945178827153866e+00
1.823036082488505460e+00
1.608127275408536061e+00
1.646594788214218008e+00
1.009614918026398911e+00
1.554363359373337472e+00
1.204313550510735409e+00
1.420521178892222514e+00
1.061192461234791162e+00
1.275778920903120284e+00
1.171479932200638396e+00
1.543999026718556156e+00
1.113451472891152649e+00
1.247779172148155702e+00
1.296309379428863373e+00
1.138283252442922944e+00
1.449502549608156388e+00
1.854804107765445353e+00
1.102799052237676491e+00
1.187079818603560044e+00
1.190162961881310766e+00
1.065046425444095446e+00
1.217424228727067570e+00
1.035328757863222870e+00
1.110335168628984182e+00
1.914767070834688445e+00
1.242311088036178068e+00
1.404597487965352665e+00
1.428764519898433782e+00
1.913858137310868734e+00
1.366911158619772415e+00
2.167189074968767226e+00
2.146610792041749871e+00
1.268433255647115843e+00
1.744054003035587330e+00
2.442113560761859592e+00
1.081108155195143583e+00
1.612649906952098977e+00
1.257758625231135463e+00
1.383866942142351508e+00
1.607188074111931542e+00
1.241001984707143402e+00
1.856969688692783560e+00
1.272948991415592701e+00
1.001679978024486273e+00
1.693971550514779656e+00
1.494179034497587155e+00
1.243139464004635153e+00
1.117290523097913990e+00
2.689703637417288906e+00
1.328722988717024878e+00
1.081492947957962913e+00
1.510548328581424071e+00
1.175355091812687602e+00
1.014704156011754232e+00
1.119859394064696811e+00
1.265703757725010536e+00
2.037511985357011834e+00
1.839154081727702783e+00
1.452554605931567266e+00
1.341980232083422209e+00
1.139173161070611506e+00
1.679835121536785492e+00
1.499421863902518526e+00
1.709905037248605986e+00
1.277881175167771000e+00
1.594836992029198930e+00
1.345537318122890902e+00
2.068820083309330204e+00
1.033408048178553029e+00
1.430098715123488073e+00
1.276155597102408779e+00
2.626611536332257746e+00
1.141733504329104365e+00
1.692223950534954557e+00
1.440882227709527896e+00
1.113667640593258623e+00
1.014666723126875336e+00
1.536997413657462452e+00
1.093154202359926108e+00
1.026858486152106176e+00
2.035431842291641313e+00
1.626219392449669732e+00
2.043224679129629795e+00
1.103938178149614924e+00
1.666144705786300584e+00
1.241453609025289673e+00
1.735143720494488173e+00
1.139113413092650573e+00
1.909889574762808850e+00
1.730683230130425798e+00
1.230747898513300909e+00
1.474993606587142070e+00
1.815122271380501751e+00
1.024421605563967885e+00
2.349993629848265098e+00
1.661999767510316639e+00
1.842243435177686850e+00
1.164384005837562741e+00
1.610347300503682355e+00
1.833428643464670271e+00
1.402154444506322983e+00
1.926519073009788974e+00
1.211127465612192644e+00
1.242758972088804148e+00
1.020488709559969065e+00
1.354900179011961470e+00
1.591588980295826516e+00
1.235214675247961580e+00
2.384829198884848012e+00
1.315289378851356883e+00
1.462424371715214111e+00
1.322432172008461304e+00
1.552978809093256141e+00
1.042628570331399995e+00
1.071653255026666418e+00
1.663563664636826367e+00
1.311848520334689461e+00
1.298001512123314827e+00
1.683881040555186281e+00
1.697912805068221953e+00
1.429475541817909257e+00
1.186430957978465983e+00
1.889119957395057003e+00
2.094958335928779114e+00
1.446855251843232715e+00
1.295481352179857604e+00
1.573991744838189488e+00
1.647356511589088468e+00
1.966550164095404618e+00
2.245587548036928727e+00
1.776678999538024106e+00
1.446175665362032126e+00
1.516618778123202782e+00
1.653116106122223261e+00
1.538066025465288700e+00
2.457318267273270962e+00
3.017626783328705375e+00
1.233970730272202054e+00
1.321611701957576379e+00
1.842029940559954282e+00
2.160372308209938641e+00
1.542556224606690396e+00
1.268254784495111087e+00
2.041482994588109001e+00
1.063848282489088692e+00
1.986271711105664917e+00
1.702099582519149612e+00
1.697965427469060540e+00
1.541442691707864299e+00
1.915053838443567802e+00
1.557681428555113490e+00
1.637328370927194854e+00
1.449945144602310165e+00
1.085654908942256025e+00
1.237748594465724716e+00
1.343539612664105709e+00
1.198807219692351378e+00
2.148369363386737785e+00
1.494423971903504622e+00
1.821718887881736970e+00
1.351693047803912195e+00
1.275802082533758153e+00
1.156293596561801085e+00
1.332488274957205121e+00
1.571307200382892066e+00
1.131203737646160778e+00
1.782589083968590282e+00
1.095010461651982681e+00
1.481520271604254591e+00
1.494344742927615322e+00
1.611399923555394187e+00
1.235778061316624932e+00
1.005065604536245383e+00
1.103091000483860107e+00
1.319286461378402109e+00
1.570185879190161060e+00
1.425111492759578935e+00
2.126196074684700399e+00
1.329350840397095057e+00
1.244396086360221476e+00
1.425768426107274944e+00
1.249164356844451484e+00
1.276889480521739451e+00
1.025404388506981679e+00
1.480194066051765844e+00
1.046622451562717604e+00
1.795376721415154586e+00
1.127857871565078884e+00
1.381720043758352334e+00
1.993827517782823966e+00
1.383929514965820395e+00
2.295367613639608173e+00
1.189548942661117215e+00
1.093201315029058929e+00
1.108317081504715862e+00
1.299654419250654724e+00
1.991472126789723296e+00
1.050489876136143641e+00
2.027145096712708483e+00
2.106713226841014031e+00
1.027703766606415936e+00
1.350780839857741444e+00
1.047486901367093104e+00
1.032571165280553593e+00
1.928074046094451210e+00
1.093639790461334416e+00
2.007575026087219605e+00
1.153033953476690243e+00
1.946303076540598864e+00
1.149063181658422472e+00
1.408190055516568728e+00
1.161299982851175638e+00
1.065546514170092385e+00
1.009391696684197592e+00
2.303365945148617033e+00
1.226218548694825827e+00
1.859891982291396184e+00
1.819637525025677549e+00
1.868741854429358140e+00
1.128974831323209305e+00
1.007538643738745687e+00
1.162451989155852017e+00
1.084144177018567801e+00
1.360307436914036217e+00
1.243899775313940692e+00
1.267655182225632338e+00
1.535697866164961400e+00
2.174145022443100039e+00
1.099641285561360871e+00
2.301523705344702186e+00
1.346550090998250626e+00
1.063596020616012439e+00
1.685177757441022939e+00
1.040407750410260679e+00
1.568381455343126341e+00
1.679504510884708868e+00
1.183948051441229499e+00
1.714522477395792777e+00
2.269013024169726389e+00
1.237919082715848829e+00
2.047688093649032481e+00
2.144553448610858837e+00
1.432692977641293997e+00
1.107081473419564199e+00
1.681495772900883923e+00
1.345661503768520451e+00
2.421825313458910056e+00
1.241794467395697987e+00
1.520947048088916898e+00
1.041851627839030847e+00
1.095543166450588357e+00
1.172760496543102660e+00
1.387729598018662802e+00
1.096607811110873021e+00
1.165263070203198748e+00
1.034883477593019130e+00
1.964242934678785746e+00
2.156027493009670781e+00
1.951868092606984684e+00
1.402405119938414213e+00
1.480601492317535239e+00
1.592142900003559847e+00
1.095489031958180037e+00
1.699796972038501330e+00
2.023994055301979955e+00
1.417987356393559217e+00
1.309497263445450033e+00
1.671104985422007694e+00
1.134738408199947646e+00
1.817802394810053013e+00
1.233464368538638167e+00
1.413966903298898403e+00
1.531738534685324726e+00
1.237930957990467373e+00
1.742268861001453839e+00
1.537249419906535408e+00
1.536715149886312748e+00
1.158066761376702836e+00
1.496591886510358460e+00
1.558855281887852717e+00
1.333578739941863489e+00
1.279103608975284301e+00
1.122996798093597315e+00
1.827614398155907205e+00
1.894121166327849659e+00
2.008623683967638129e+00
1.165347208701383419e+00
2.181085645009795293e+00
1.865769258369716299e+00
1.232526998143177233e+00
1.070194324107734074e+00
1.453377499865058597e+00
1.292818777753036663e+00
1.119598542794490115e+00
1.938167394688492529e+00
1.233060336670857904e+00
1.258815801182499472e+00
1.188689766128770309e+00
2.077737807617092258e+00
1.741756349127705050e+00
1.426060883726168349e+00
1.252133790055305784e+00
2.334660197246754887e+00
1.577665736273896613e+00
1.098491813088966929e+00
1.758689069482618939e+00
1.032594688879820977e+00
1.271270226051256058e+00
1.223998211337229414e+00
1.763953260619045116e+00
1.581584203241697573e+00
1.454979533838298700e+00
1.039699730883328899e+00
1.496550849772078529e+00
1.825462479614175182e+00
1.263221164561976861e+00
1.930083282661344546e+00
1.134010160824506563e+00
1.003129701887079062e+00
1.659336040743937035e+00
1.473221696824116300e+00
1.571351319058290619e+00
1.236010317642747047e+00
1.209173895729010129e+00
1.447750222133954656e+00
1.637175700968848124e+00
1.308108030331730731e+00
1.979363412346669682e+00
2.128425212195939054e+00
1.402789493756379180e+00
1.495989818934401194e+00
1.920272010157540343e+00
1.218308680350971951e+00
1.291286088256804021e+00
1.427595234697116577e+00
1.239805189383932138e+00
1.574606618465196561e+00
1.050880222810064435e+00
1.210130247329467501e+00
1.965704530301282782e+00
1.190850592717975776e+00
1.521420596507601974e+00
1.209180241038294801e+00
1.396212310084912200e+00
1.724836328292483012e+00
1.831379874051364931e+00
1.188906135022121280e+00
1.552495703112293235e+00
1.042273653522154175e+00
1.854428078872603969e+00
1.144083972369739577e+00
1.196196713359675368e+00
1.772644495149110044e+00
1.855967683863653850e+00
1.113612170319563832e+00
1.305506090556717069e+00
1.778072309990851085e+00
1.332039481037362805e+00
2.056506402469263417e+00
1.010336626234651369e+00
1.394772692699634886e+00
1.218751419500640587e+00
1.401407486750859466e+00
1.484232475938934259e+00
1.755572224867827602e+00
1.226419074133720866e+00
1.458961083954867899e+00
2.170702862981257919e+00
1.477280655705432766e+00
1.082821089423752214e+00
2.268726684034317653e+00
2.084910917850109069e+00
1.271643051463710927e+00
1.289324514187329074e+00
1.268276164987877319e+00
1.435276401072377528e+00
1.361758750884780600e+00
1.557270285555051537e+00
1.044818756444388930e+00
1.635314502451373553e+00
2.604733376275842449e+00
1.289086211819514993e+00
1.163629289483013363e+00
1.412253592933633506e+00
1.336158534423459221e+00
1.374743696357171308e+00
1.143223961542301437e+00
1.808002301753510954e+00
1.478639902812454165e+00
1.470232486805928662e+00
1.341729048017134440e+00
1.520189303613221909e+00
2.227056542734851874e+00
1.192594237887151465e+00
2.475603005011038249e+00
1.926464100491337206e+00
1.227385885531224297e+00
1.348402832991944855e+00
1.150030594582772903e+00
1.269469401485199933e+00
2.618943773946799336e+00
1.095551320117371885e+00
1.455728428073800096e+00
1.240141742123319402e+00
1.113280051043202157e+00
2.813123311309757124e+00
1.701470275747199778e+00
1.310654439082843181e+00
1.193770923123331995e+00
1.118560101825266218e+00
1.621799489300539632e+00
1.418423236598377768e+00
1.725676200458948761e+00
1.306923089867971566e+00
2.388629421025864730e+00
1.459727707154328868e+00
1.548875486363632925e+00
1.529366853922022429e+00
1.322350706697293043e+00
2.236994456780458496e+00
1.950283332815633264e+00
1.002938105498915711e+00
1.174860624884104476e+00
1.751591029442003178e+00
1.648000017732673239e+00
1.281512976489703970e+00
1.558032273057702088e+00
1.024700936385979810e+00
1.163961285824983705e+00
1.093239707886644929e+00
1.788333650738593850e+00
1.227440872720827247e+00
1.396270755417544418e+00
1.068485423129290623e+00
2.045613103627914153e+00
1.102622365545500083e+00
1.112611695519800659e+00
1.142658953861945381e+00
1.248903123974449247e+00
1.188497387052544818e+00
1.016133808245976322e+00
1.320491004627595055e+00
1.083824370007226978e+00
1.417235736432550963e+00
2.344348308220849386e+00
1.343423195348828925e+00
2.631662111984547359e+00
1.294721371783976505e+00
1.860066584492628738e+00
1.547682591121525064e+00
1.556034147432313164e+00
1.184073457996091205e+00
1.056215811507333679e+00
1.509848736727988472e+00
1.898908600165572169e+00
1.110097686829134123e+00
1.023245486383875580e+00
1.760890844367148711e+00
1.355706192073393934e+00
1.337931200569873580e+00
1.149660728894285944e+00
1.869052516591764856e+00
1.132120199221438472e+00
1.020789037294728141e+00
1.161268874670371654e+00
1.717640418142202918e+00
1.185794533584405341e+00
1.526786999989538929e+00
1.822745410786319464e+00
1.991196709953094945e+00
1.190908035155946676e+00
1.520210383857862002e+00
1.618613854952639208e+00
1.169331969171889307e+00
1.392409459070307109e+00
2.026448184463861768e+00
1.381303476140806508e+00
1.363377364061341135e+00
1.780528884990986382e+00
1.279341392985099191e+00
1.303418435586599422e+00
2.093864612939110081e+00
1.493743510823130061e+00
1.300893143070891877e+00
1.355514175612424488e+00
1.412960917372767522e+00
1.960325261902321703e+00
1.563509480998457546e+00
1.923204440019715245e+00
1.659221326396113083e+00
1.795698412530484456e+00
2.083607123136863137e+00
1.189719846537202530e+00
1.563740136778789536e+00
1.476936327546957139e+00
1.108542026134506919e+00
1.059488563803325567e+00
1.552279745822451318e+00
2.113502456994454715e+00
1.041715046139816359e+00
1.354609190175645850e+00
1.226412603801318113e+00
1.219242751386707235e+00
2.044202950196995161e+00
1.854918301635636757e+00
1.934801404207644904e+00
1.954369786524197794e+00
1.683472382068659901e+00
1.596404319349446821e+00
2.057608729920902935e+00
1.470335198804959331e+00
1.766172264601823638e+00
2.002175502259794904e+00
1.551720833815644074e+00
1.504909674337345127e+00
1.090515450261291930e+00
1.198317140966862926e+00
1.537110298599286162e+00
1.216660889781338462e+00
1.888325185252410332e+00
1.229002918218846219e+00
1.011694533594523771e+00
2.061219206177646868e+00
1.289243460148604248e+00
1.068474215847877717e+00
1.084617061443798214e+00
1.230291065518810179e+00
2.007181987714315774e+00
1.166368923510509692e+00
1.396724813351710281e+00
1.959407143062279477e+00
1.363832778594610495e+00
1.236634354396958457e+00
1.571136475462439286e+00
1.045351686123785040e+00
2.180238535317865711e+00
1.899472640440824422e+00
1.310773781026553841e+00
1.051926654326168720e+00
1.017492571025431447e+00
2.642595019561882363e+00
2.176434532295476565e+00
1.864024941129466928e+00
1.418538705386424459e+00
1.052324868476105735e+00
1.399199708105520745e+00
1.483584447476222978e+00
1.239231459136908242e+00
1.269276147953875666e+00
1.499905606686231296e+00
1.169202482255625508e+00
1.733967778079989586e+00
1.416795126689486484e+00
2.077628413269754670e+00
1.267651707163497177e+00
1.181717520657769027e+00
1.394132887770556772e+00
1.017832400683942540e+00
1.291873833241977687e+00
1.405229681043427936e+00
1.733892959355980867e+00
1.557468072083903587e+00
1.523855765113942606e+00
1.036037216589634991e+00
2.059698881708625251e+00
1.093755983048593894e+00
1.132982686854789645e+00
2.390302293142458900e+00
1.485562556125259004e+00
1.268623046886264261e+00
1.485037504596513847e+00
1.003596393336663617e+00
1.523417747344319562e+00
1.310282837690591284e+00
1.240289982352682951e+00
1.578309611138503099e+00
2.085820042415134523e+00
1.205475672537608789e+00
1.189941893011650986e+00
1.335645647865916885e+00
2.109880217358092391e+00
1.090146763219354886e+00
1.612669117796312834e+00
1.565253581398281080e+00
1.549758016032957153e+00
1.000747844945207410e+00
1.246916928574469674e+00
1.328944912879091778e+00
1.027512481843999792e+00
2.506465576219143010e+00
1.208564344960066261e+00
1.022224133188140760e+00
1.323289618119933175e+00
1.643087327541835396e+00
1.244422970139817286e+00
2.578067603102157879e+00
1.135444196247108017e+00
1.681161651470633789e+00
1.682106012221327607e+00
1.121490930783280771e+00
1.219486004839680504e+00
1.542263845246326204e+00
1.248756746377623461e+00
1.168596262799738605e+00
1.504278933656833406e+00
1.396107235304653749e+00
2.499641520421158614e+00
1.532419447982801275e+00
1.563343050978315718e+00
1.028421524810613663e+00
1.798179847002044474e+00
1.191180539048963150e+00
1.229211766845599074e+00
2.762979418777566476e+00
1.036408694674683550e+00
1.229594903751940693e+00
1.112845686911779097e+00
1.994082642607776679e+00
3.034390354254418831e+00
1.347317532313675459e+00
1.053054480865893927e+00
1.230977218339586843e+00
1.125826914000186418e+00
1.576235751399119422e+00
1.153274664986712938e+00
1.823648447403111605e+00
1.169486678987757378e+00
1.330717059810632596e+00
1.491882851574572122e+00
1.305403538625943938e+00
1.664898015850999613e+00
1.785698572729763844e+00
1.090269463330977295e+00
1.103183765478930933e+00
1.023412270161874194e+00
2.288692909934259667e+00
1.670756625196262224e+00
1.512418252008700392e+00
2.298141835998431137e+00
1.139290257934671757e+00
1.491094310615067142e+00
1.348514496501516557e+00
1.191025652352939224e+00
1.315217001209109116e+00
1.706455539291294565e+00
1.962968973620458080e+00
1.104895790012553336e+00
1.125326802845666663e+00
1.028339263054844022e+00
1.145279634030875515e+00
2.352694022415474429e+00
1.514832991985347377e+00
1.522930072175466609e+00
2.572326114438684197e+00
1.494204692727224337e+00
1.239579946273373645e+00
1.290308980957894924e+00
1.820076133326728351e+00
2.071515951583754234e+00
1.195166364941844472e+00
1.129461699728116830e+00
1.145343221953694757e+00
1.070893864168880771e+00
1.284855362152359515e+00
1.225941838712421461e+00
1.285256158890954570e+00
1.722755333839684377e+00
1.437036561495999010e+00
2.512832238117413741e+00
2.216564597172279161e+00
1.774986026939491479e+00
1.356337336701439300e+00
1.862001697073377038e+00
1.133385840465141570e+00
1.969747919032810435e+00
1.215518287163691147e+00
2.027057325809190402e+00
1.875224142465472754e+00
1.787842497783501905e+00
1.875184288977485236e+00
1.128403947858281686e+00
1.408471090825461181e+00
1.287092838298075304e+00
1.546498854525849120e+00
1.179950296337445526e+00
1.847677243304893135e+00
1.530970398228824525e+00
1.751715439117869977e+00
1.664163274982784824e+00
1.074491970480478953e+00
1.266204696893217463e+00
1.413652296245035300e+00
1.186070868570723080e+00
1.422051974555125220e+00
1.251574904289808554e+00
1.090301740562231281e+00
1.042742454891751658e+00
1.470714587365484549e+00
1.602625354260443613e+00
1.362643390002608923e+00
1.888786916385392534e+00
1.409213798231887305e+00
1.457227482912815564e+00
2.149774061085237165e+00
1.633593472331930530e+00
1.334338248418070361e+00
1.507247309616416064e+00
1.389232627130284392e+00
1.319446994301329612e+00
1.096461166737770387e+00
1.089782422257801198e+00
1.165105164923106784e+00
2.463700538668898155e+00
1.429703392105866833e+00
1.536497917694836568e+00
1.088032853576209602e+00
1.155018516855211397e+00
1.798835639464240410e+00
1.497314493414083403e+00
1.254509659013551159e+00
2.564409217425715592e+00
1.959260441573588585e+00
1.310091843735575079e+00
1.532263223237840366e+00
1.124318551851772874e+00
1.360246758504048303e+00
1.048554999495119322e+00
1.053782698107896154e+00
2.150965069693682619e+00
1.099695799049239087e+00
1.689746158802220233e+00
1.293490413037324593e+00
1.559047866826463347e+00
1.766326249532586878e+00
1.678285728328054338e+00
1.592620745506061697e+00
1.327175303565160336e+00
1.340520086031119051e+00
1.014050410044018191e+00
1.217006892684340258e+00
1.132661239683733001e+00
1.256078740473908439e+00
1.938728600345915210e+00
1.110197023107771130e+00
1.082556678379521520e+00
1.040034008502231044e+00
1.553656438981904753e+00
1.178965514703774753e+00
1.492493780002301040e+00
1.750892078997922763e+00
1.838731056005033615e+00
1.972213323616900604e+00
1.986344072828889695e+00
1.664545448744743972e+00
1.325857369035483124e+00
2.380033785259663581e+00
1.883011143099762030e+00
1.834074230864578103e+00
1.315148291104749845e+00
2.011414608268610849e+00
1.426121183566166462e+00
1.355447412561287868e+00
1.316288803059629808e+00
1.053431491283029819e+00
1.552674088875865888e+00
1.158429702080461032e+00
1.755290761893072427e+00
1.892015708530002227e+00
1.995168501287462037e+00
1.938335275980159977e+00
1.429184289849128708e+00
1.072216287447641969e+00
1.621766912377186509e+00
1.312905668079896948e+00
2.074394971817569377e+00
1.031769754930415006e+00
1.940429189928985387e+00
1.571551603864282276e+00
1.038479163894141077e+00
1.525389180649323162e+00
1.216545671715460353e+00
1.432131917524286369e+00
1.477027612564072445e+00
1.174163695438732224e+00
1.351254229618055858e+00
1.592696454509656245e+00
1.574479806269842630e+00
2.224283067872239172e+00
1.262849131913127421e+00
1.740446732805737140e+00
2.288976945221489423e+00
1.913519508060225860e+00
1.111108767728374636e+00
1.442738603181675572e+00
1.582373448646827274e+00
2.221781810510281119e+00
1.491614843520877809e+00
1.475236038520256088e+00
1.134492612756914820e+00
2.037393221562670664e+00
1.733806320875371787e+00
1.466645348239612012e+00
1.475703437978334920e+00
1.815868812690595080e+00
2.144546123694082596e+00
1.444062192655826138e+00
1.268982933432008409e+00
1.366120924912764156e+00
1.048157114009991009e+00
1.018521440211468621e+00
1.304193057787997434e+00
1.227158739295280077e+00
1.039932675144657148e+00
2.007939267751941870e+00
1.581188976771299881e+00
1.175731055891529930e+00
1.864934194934210865e+00
1.337719894819538569e+00
1.311622919393137465e+00
1.095858126779849950e+00
1.150579546849987533e+00
2.207217853232382954e+00
2.247101755227664199e+00
1.178276293939418240e+00
1.633725002381997138e+00
1.489682011904542858e+00
1.097337132427560702e+00
1.112490321372618718e+00
1.220181451255127225e+00
2.069552139615522979e+00
2.298226859234641317e+00
1.303211076784569489e+00
1.790712106493287825e+00
2.726416644387164023e+00
1.841257760140993405e+00
1.630152740207188256e+00
1.334112705141308641e+00
1.394824093962857559e+00
1.151040583162318498e+00
1.379575334822699118e+00
1.458779480551765984e+00
1.320277441193014267e+00
1.355394568929153110e+00
1.754705048402585010e+00
1.580168526347345948e+00
1.636990265882749540e+00
1.187794451915904492e+00
2.264282845184831139e+00
1.322402898659529979e+00
1.019644858063472048e+00
1.773767997182978284e+00
2.321604355996455649e+00
1.444477324939688723e+00
1.435574115479945290e+00
1.398249791130199648e+00
1.404518094774116266e+00
1.793037765906064118e+00
1.846124765864121331e+00
1.008213701039741617e+00
1.795573663928287989e+00
1.692663609309231765e+00
1.921900195712410220e+00
2.029467496824495676e+00
1.554265312739388838e+00
1.900647486440725453e+00
1.439263995592092060e+00
1.268526076436162331e+00
1.670649618727830354e+00
1.188913535874320360e+00
1.080841904964751299e+00
1.250717882380428581e+00
1.427313854059532261e+00
1.421437236293508377e+00
1.063498204912823653e+00
1.627222770685784914e+00
1.177543722862660847e+00
1.833674422198968479e+00
1.470560350312482445e+00
1.022191695101323905e+00
1.085903298492884250e+00
1.420226575575988637e+00
1.176597735038031889e+00
1.904786332655161951e+00
2.232222803211308282e+00
2.019422231188644723e+00
1.091223185025666398e+00
1.959717606103447807e+00
1.171892949430018760e+00
1.130388884559088369e+00
1.277395942828161157e+00
1.138331017121963828e+00
1.220213223768978672e+00
1.648131520362410285e+00
2.475103625378364036e+00
1.252313922439881599e+00
1.183367613377590777e+00
1.115373216719449667e+00
1.439566131046504882e+00
1.227680026782179468e+00
1.259936002428739821e+00
1.282106084251308564e+00
2.117959918086168347e+00
1.232234136770250288e+00
1.355227613442685941e+00
1.082953816816605297e+00
1.054908112952624766e+00
1.449853937714418839e+00
1.806183350417267297e+00
1.166439773007834413e+00
2.794974080058966859e+00
1.212489235936901499e+00
1.025924626530127615e+00
1.099577772718919544e+00
1.134752588720117528e+00
1.045667827773698599e+00
1.481590902858875847e+00
1.077741471261242534e+00
1.786385964995393927e+00
1.368709628053597305e+00
1.166261371081009912e+00
1.188639449001634096e+00
1.452810415435010549e+00
1.162527133575129712e+00
1.255741767580587975e+00
1.036163637276872773e+00
1.199796027187832959e+00
1.371747725053068523e+00
1.736351609323529832e+00
1.183900900574031079e+00
1.132907068787639693e+00
1.552149408552940146e+00
1.204252091933235569e+00
1.869096637142283246e+00
1.441086977565678495e+00
1.188564214052086454e+00
1.002645643337666925e+00
1.102776745308068573e+00
1.204917623466315701e+00
1.145287074760205526e+00
1.297424346813708329e+00
1.304555042460420200e+00
1.994131386294653918e+00
1.301791628840095916e+00
1.084422233746997533e+00
1.913157920092421360e+00
1.071113230105675163e+00
1.867585563339329902e+00
2.026410647287746336e+00
1.567870143816371575e+00
1.524440565816033155e+00
1.752547442957692159e+00
1.489714559847839626e+00
1.117305426901422649e+00
1.273939345876609286e+00
2.645404469285334681e+00
1.281759986180629918e+00
1.107345757636896577e+00
1.096174965381947031e+00
1.020770837845945023e+00
1.445857351570007499e+00
1.523963035216633344e+00
1.353149314127042313e+00
1.341988097637644151e+00
1.522421487742304569e+00
1.321534329125596541e+00
1.345595969885357901e+00
2.254236897669954054e+00
1.056863310034141135e+00
1.284916866225037202e+00
1.760884538565161250e+00
1.646591588068894829e+00
1.297634246115391798e+00
2.180985646884198381e+00
1.055837403250815099e+00
1.772284505834571089e+00
2.255782003382542200e+00
1.068673499129975113e+00
1.216959517272696800e+00
1.402826005736098169e+00
1.529722253122630882e+00
1.261877612271207205e+00
1.740074150442616041e+00
1.398985892828977562e+00
1.207834605016690377e+00
1.439103947576145570e+00
1.929428920905426725e+00
1.589254289917433116e+00
2.094695482050965119e+00
1.305077479093087911e+00
1.441855498560455473e+00
1.346046659627350817e+00
