3.625070883614957662e+00
2.294278006935290382e+00
2.314338272549665732e+00
3.534008544962718545e+00
2.940169511050263473e+00
3.251585940629497795e+00
2.712939037051393498e+00
3.794866391492321078e+00
2.449651883194760238e+00
4.387122417232676597e+00
4.029178238952646041e+00
2.941561239508299952e+00
2.809539858509762844e+00
2.340388187649439011e+00
3.256570747242067299e+00
2.222950865522847153e+00
3.057053754883886310e+00
2.999038342667132540e+00
4.383043545356945181e+00
4.223664015188216325e+00
3.821718466182228546e+00
3.303918414442403417e+00
2.132757738873473308e+00
3.840249723312196828e+00
2.300934879206514072e+00
3.143253493967132162e+00
3.647188537080372495e+00
2.503199166520110097e+00
4.271798895614085545e+00
4.317854992277273318e+00
2.399272767963868347e+00
2.760809375871684956e+00
3.500679631213642118e+00
3.723566929095518674e+00
3.865087328062535743e+00
3.326750942410069189e+00
3.315164078673087822e+00
3.508965336035654303e+00
2.512255917927936011e+00
2.619772032898419312e+00
2.559774677773415164e+00
3.281677834998736998e+00
3.066355304213178368e+00
4.114823970858036972e+00
4.260040300074255271e+00
2.134910848316605048e+00
2.454457939654913101e+00
3.675251690231181811e+00
3.916140035892023530e+00
3.869090313168897843e+00
3.741920767672423320e+00
4.444832229319759520e+00
3.364726919957761186e+00
4.324238291190210859e+00
2.766543466177973976e+00
3.698120384854215459e+00
3.879749547993992742e+00
4.342603597587500808e+00
2.133978530978677401e+00
4.341358075042806242e+00
3.819911155272778025e+00
4.228941369981334297e+00
3.314608973704341821e+00
3.766565229311735319e+00
4.382652402299509475e+00
3.972130618119587897e+00
3.426827171343262979e+00
3.155126277721824302e+00
3.047105666073428143e+00
3.929932163306126824e+00
3.249053140157220465e+00
3.773504551129180484e+00
3.650297695234822726e+00
3.376533651490490673e+00
3.901723749467883806e+00
2.533942709209904720e+00
3.264355046381050229e+00
2.583651497299272570e+00
2.522268366123273431e+00
3.021327485328401785e+00
4.237498760939981679e+00
2.311842439158814599e+00
4.288151682093573669e+00
3.672995382457113323e+00
3.807006997097265089e+00
3.031825370339649162e+00
2.837567624490024976e+00
3.676422746960626320e+00
3.326443862407383989e+00
2.221495748403418791e+00
2.897482357442357159e+00
3.142755551082279553e+00
2.537038709366264300e+00
4.122509268821521466e+00
4.498617506477414096e+00
2.491368895045404486e+00
3.743421296016334665e+00
3.613260621994982991e+00
3.692155400615007466e+00
3.677710256858233606e+00
2.615531068937266834e+00
2.892013995632813028e+00
2.502190885462516334e+00
2.584008219467250012e+00
3.119375769221952144e+00
3.899614001994154755e+00
3.356954516938019495e+00
3.009092643475695716e+00
4.460512472343750368e+00
2.996337605932708925e+00
3.657145101507874418e+00
2.481106691656083107e+00
4.315423495292361800e+00
3.287443323944169382e+00
2.551322122490145894e+00
2.958899539269622458e+00
4.289781601044968085e+00
3.709853793402345445e+00
2.601319531552622522e+00
2.695437113769275861e+00
3.611760477881378772e+00
2.820341182788335566e+00
2.231993173790570939e+00
2.878855623917855322e+00
3.382896633116649898e+00
2.127607806437172400e+00
2.383974748825349543e+00
2.815190126656688996e+00
3.792792075870727864e+00
3.150858233247383566e+00
2.987986551890482900e+00
3.842294573716693584e+00
2.391796297317688058e+00
2.538044661454240014e+00
4.418947879388440469e+00
3.923683321902890597e+00
2.644866248350409510e+00
3.237900506926209232e+00
2.030176012227236093e+00
3.014949062306756300e+00
2.053762239544834500e+00
2.638096193470866435e+00
3.271864656745492095e+00
4.214589732210253459e+00
4.059140956592564464e+00
4.048164202848020921e+00
3.501637801881655854e+00
3.768043991924240999e+00
3.485843619064509902e+00
4.085572459942094170e+00
3.258029464256639862e+00
3.698828932613737575e+00
2.617913611699583587e+00
4.477410473511554301e+00
4.144265699517061918e+00
3.215390063742125992e+00
3.270530500598413770e+00
3.468908577775872359e+00
2.468837165436242653e+00
3.384612240861534449e+00
2.699614938155807664e+00
3.825867902698573353e+00
4.129706051008018797e+00
4.010957241138912721e+00
2.989342794273485371e+00
2.426131736089789825e+00
4.020563523289409247e+00
3.698153089964762330e+00
2.148972197706335407e+00
3.005804117242379725e+00
2.414501044853967215e+00
2.788285335660111386e+00
2.152870653204272955e+00
3.522915168825238474e+00
4.197850422045604546e+00
2.503335871252350575e+00
3.579059465499120130e+00
2.309045002676406000e+00
3.491083060384632120e+00
2.937336128202356900e+00
2.921260725321792151e+00
4.135033248668637640e+00
4.400153668724285261e+00
2.712025825524877476e+00
2.379881936105426199e+00
2.139206102638200324e+00
4.063353144454710630e+00
2.483874523404640655e+00
3.626515853886767005e+00
3.406667567082813264e+00
3.272078894009623706e+00
2.591371717871281177e+00
2.934146116961253270e+00
3.905114733969411667e+00
2.720853098469619979e+00
4.064913843384895031e+00
3.910085735610573821e+00
3.152460904968360289e+00
3.847581950464542544e+00
3.640722332789646742e+00
2.188408114311394481e+00
3.017989446712228130e+00
3.515233068136764061e+00
4.046846548422753820e+00
4.409139746796801873e+00
3.696432995076287753e+00
2.972291641360864656e+00
4.074106412023238200e+00
4.012084407657670049e+00
3.919977127496551805e+00
2.485232535039225255e+00
3.433213549366453066e+00
3.577677202382269162e+00
3.797472833766107669e+00
4.213019674838908379e+00
2.794137763767144733e+00
2.064333841113803025e+00
2.267057087242211111e+00
3.620030621509053859e+00
2.487143925240156594e+00
2.385204885994194779e+00
2.751943082929022566e+00
3.824855422014173723e+00
3.270953327170861513e+00
3.155982464861657899e+00
3.502330589296422048e+00
4.442687002499056348e+00
3.514568511442175414e+00
2.400015459187571309e+00
2.316454713983378433e+00
3.177834533238646841e+00
3.290018159862745151e+00
3.765433611551134874e+00
4.494387887953335436e+00
2.598763326015042452e+00
3.953285235835534817e+00
2.505569021091040849e+00
4.349086095896584681e+00
2.059487374645670332e+00
3.728176435395578636e+00
4.137741857803240997e+00
2.911613545720665996e+00
2.770133625463895299e+00
3.215978834061067104e+00
2.583777361410227069e+00
2.314563957131746452e+00
3.894518098373293213e+00
4.040043463283378600e+00
3.227144134044025670e+00
3.839055701115420050e+00
4.452118222358077304e+00
3.817904005130576373e+00
2.913471411506877828e+00
3.839941128485072852e+00
3.410781957687649246e+00
2.231872403396699234e+00
2.174777607008064884e+00
2.415601247422406228e+00
2.777974665011972100e+00
2.848258850500442918e+00
3.483236101424006304e+00
3.495851258069771816e+00
3.238910665533414779e+00
2.605024731307238994e+00
2.383319195102399757e+00
3.867455710811299241e+00
4.390982906598368096e+00
2.125930584598352713e+00
2.477473918605888059e+00
3.939934521695255043e+00
3.949647392650540212e+00
2.879129634629115309e+00
3.007918613344888747e+00
4.258783044475375590e+00
2.746691075056286291e+00
4.153280579557811159e+00
4.476799134700009120e+00
3.838056774607455868e+00
2.247864963050261622e+00
2.941444982385306162e+00
3.190194218483871857e+00
2.604322789031153107e+00
2.467998160353674919e+00
3.838103444949579668e+00
3.247666266845609329e+00
4.017378326553824763e+00
2.913132176876919832e+00
3.399218279866545345e+00
2.761562845983696945e+00
3.947086391511922088e+00
2.517937467288054787e+00
3.479154325071097453e+00
4.340017316781421997e+00
2.159591053131680205e+00
4.240663905693430102e+00
3.013562192142683838e+00
2.470109412457683007e+00
2.191659658460423543e+00
3.994470646602259478e+00
2.265508725904157750e+00
2.110988283710170776e+00
3.134568555115237132e+00
3.909099218857272184e+00
3.556375908014146603e+00
3.022435291721943251e+00
3.288282937392213334e+00
4.370462331790655242e+00
2.226623084895685167e+00
4.279156037350468900e+00
3.443106087365971568e+00
3.842117835761507116e+00
2.272394731188394079e+00
3.632986584290677001e+00
3.236732664291532835e+00
3.807620538564455259e+00
4.207903661760113323e+00
2.661439791979528291e+00
2.444178258490763866e+00
2.072509739903291681e+00
3.132656549918981348e+00
3.946271952197189847e+00
4.049406257121367148e+00
2.270833738386202061e+00
3.892330349275116674e+00
4.243223649644026985e+00
2.317400878549001675e+00
2.488310185190826473e+00
3.694571424158115125e+00
2.541140248320702621e+00
2.709820067169708580e+00
2.020787695076887047e+00
3.039360419339292463e+00
4.114669593042183493e+00
4.294354216915611033e+00
2.604948437066900713e+00
3.675060412903993878e+00
3.314912875908490264e+00
3.498281860017431910e+00
3.765885314869139577e+00
3.322423986412647245e+00
2.740076851625635079e+00
4.286304405077295598e+00
2.802814744956128479e+00
3.641216862557990375e+00
2.690449499342963513e+00
4.037918519008352192e+00
2.822042628697896571e+00
3.995936372031473560e+00
2.240011660674227745e+00
2.874146010903350756e+00
4.048802217125055058e+00
2.249810932653504736e+00
3.208480560527746661e+00
4.372616926335139098e+00
2.787244368798757144e+00
4.497279020791460802e+00
4.049833560223996543e+00
2.244799854844635956e+00
3.228921114606611464e+00
3.023484727586925658e+00
4.036305350800327041e+00
2.309426203894001439e+00
2.583508135593287847e+00
3.995373397925913839e+00
3.514196983319616052e+00
2.565393613025155339e+00
2.959267066380334654e+00
3.824358032158442278e+00
3.739895124025121476e+00
3.517820444342242503e+00
4.456788949792496624e+00
4.031971035671223724e+00
4.184293313010757132e+00
2.482860539108768361e+00
3.040072741697026792e+00
3.747385841920361838e+00
2.728935740583579239e+00
3.783546003223586141e+00
3.349010051418189082e+00
3.982332150655108816e+00
3.549538015056700857e+00
3.451720996379843420e+00
4.484128407645355807e+00
3.172751944848407391e+00
3.927820770164997644e+00
2.315037523318927981e+00
4.260418939710726605e+00
2.420867749788708778e+00
4.324876478202401842e+00
4.348511760121446912e+00
3.404808562679634054e+00
2.173644025607242014e+00
2.987625651852079400e+00
2.225858162001082885e+00
2.853897613700532965e+00
2.809354149046479954e+00
2.981655533164994321e+00
3.831889817257523312e+00
4.463218551375959464e+00
2.271754031778454141e+00
2.763256753217263828e+00
4.146136950862988613e+00
2.039727567462470414e+00
4.215798000629327191e+00
2.831427748526293087e+00
4.104526381970768689e+00
4.187044245607153492e+00
3.687284318080561896e+00
4.324596782067080980e+00
2.455163649244365143e+00
4.064816672848166945e+00
4.182460284158104891e+00
4.191285498392748998e+00
2.906857296624580034e+00
4.030053167810946135e+00
2.117162556069956736e+00
3.201841336130038851e+00
3.661394048261701339e+00
3.230056662333319561e+00
4.388882552444816731e+00
3.490392210605788303e+00
2.633618282106872321e+00
3.497755550610926356e+00
3.654547125287189502e+00
2.946534433107931950e+00
2.448055833151196126e+00
3.668701377193444912e+00
3.116782284381537593e+00
2.192053000365246529e+00
4.448675906503275712e+00
3.349890145356766880e+00
2.360239663241417318e+00
3.569057697920460459e+00
2.029805714502717073e+00
4.166457410785369575e+00
3.260914510362696639e+00
3.023588663892123662e+00
2.344147928628981248e+00
2.645800000253501150e+00
2.162669620483871569e+00
3.567144941313593165e+00
3.603815270472761512e+00
2.955753150210547631e+00
3.058151967806219673e+00
3.314473171693723685e+00
2.923682786141002410e+00
2.052831929473374117e+00
3.365923623453920932e+00
2.426217246203937083e+00
2.810970114910289919e+00
2.521111030239416628e+00
3.986961491945355540e+00
2.193667891561027261e+00
3.156671517430634566e+00
3.453318491861268047e+00
2.720592918619800571e+00
3.385332306355637755e+00
4.128619048786774215e+00
4.226886262081060330e+00
3.130425000675169045e+00
2.811612202136580585e+00
2.695547859076896202e+00
3.717001416265063973e+00
3.903160367109405726e+00
4.280916846288933542e+00
2.097215742340080791e+00
4.174130653461338269e+00
2.865048649479928322e+00
4.394430268285095309e+00
3.492266429255050042e+00
3.128429430637366337e+00
2.875548394119945339e+00
4.428939981163892980e+00
3.259098158278050494e+00
3.617107401077378270e+00
2.286293722231497405e+00
4.033446228012085299e+00
4.122529376168799331e+00
3.490184947036129692e+00
2.352318755715420373e+00
2.072719741558413986e+00
2.727045724516810044e+00
4.264665301691460186e+00
3.581059333078027596e+00
3.885920261043340762e+00
2.874365787705300601e+00
3.138505303187193007e+00
3.681361767586930789e+00
3.066633066492581605e+00
4.336474274433829379e+00
2.658873419091553281e+00
3.733904551027281915e+00
2.076993390579073839e+00
3.022386817426062411e+00
4.347115077473543643e+00
2.238564813086547201e+00
3.939395333440518510e+00
4.459223047966309750e+00
3.010722731449188228e+00
3.442922860319162393e+00
2.762487367808132532e+00
2.287187808962270807e+00
3.535796465514782660e+00
3.064050110845421671e+00
2.188730866337240677e+00
3.473974576030005590e+00
2.679694491126600298e+00
3.034288813201375223e+00
2.121632129051637783e+00
2.624448754993668587e+00
3.702911093684042143e+00
4.045577930746663498e+00
3.058349755693058114e+00
2.353274715410641260e+00
3.557445504068463382e+00
2.531878542294546452e+00
3.282877913947161552e+00
3.549686132070203115e+00
3.259186758577924614e+00
2.740173237459766487e+00
2.279761958889134910e+00
3.998764212599231538e+00
2.553395934609104856e+00
3.724654710626274401e+00
3.618280854353117970e+00
3.585336601539910184e+00
2.896284870084814944e+00
2.497829191023782869e+00
3.167233376031507230e+00
4.285072850217266804e+00
4.007244256220163336e+00
2.321633584999847955e+00
3.111119048449901392e+00
2.302615244282709916e+00
3.402147408527953942e+00
2.693558292933377896e+00
2.684154918073411888e+00
3.701042657907377631e+00
3.217426748459239150e+00
3.194143294143276801e+00
3.428842365428198313e+00
3.726102263081717325e+00
2.595428659988026965e+00
2.145650058107911207e+00
4.064539528263775736e+00
2.056620664161638246e+00
2.998408716715062816e+00
2.860254193717402416e+00
3.356595088830832907e+00
3.204836563397146065e+00
2.938583592105066256e+00
2.900483836295977724e+00
3.515806739759993249e+00
2.763543800647664916e+00
3.425320122227627273e+00
4.396575065530498705e+00
3.342392966709698321e+00
2.205707450636780642e+00
3.290765943994332865e+00
2.573905183179008294e+00
2.769118088593074400e+00
2.398436012091301084e+00
2.625132847409518355e+00
3.604825173011120043e+00
3.850352743410669909e+00
2.016290486135975613e+00
2.634687498168163167e+00
3.167383692293018083e+00
2.918274794271685124e+00
2.456971211826004531e+00
2.387418297210726958e+00
3.837800772195332666e+00
3.762899328317477199e+00
2.254269060156405935e+00
2.738497316865899922e+00
2.798041535011754011e+00
3.104159341278390549e+00
3.520325512053187111e+00
2.820741265276415000e+00
2.749450243223119372e+00
3.313329732942812633e+00
2.271561010641345746e+00
3.777123283731925518e+00
4.324248490725389971e+00
2.686463505726131018e+00
2.954069493503807209e+00
3.152289305166557476e+00
2.814821124151897003e+00
3.772044699736363249e+00
3.863010422241490716e+00
3.053283850173409419e+00
3.005054800285861472e+00
3.956991386345199313e+00
2.252925234795152942e+00
2.454155217962330937e+00
3.941348803270379619e+00
3.616488540119755069e+00
3.973538097212681031e+00
3.466269044619695094e+00
3.335031289766461349e+00
2.479993763781928262e+00
3.624342939399982200e+00
2.923692531589370702e+00
4.260717297325165021e+00
4.422054362653811133e+00
4.096765358441469829e+00
4.049433874804802436e+00
2.756202292244857688e+00
2.905090784308995921e+00
2.591159604207246225e+00
2.870843895356719244e+00
3.514577223631008884e+00
2.233580096261308157e+00
4.204742724024650435e+00
2.108901448387149102e+00
2.487609223138766534e+00
2.719422425227942863e+00
3.679374448352572990e+00
3.420088829043090417e+00
4.003797826642197855e+00
4.327206367552408395e+00
2.549608868363774761e+00
3.030423129504157487e+00
4.269747835252658774e+00
2.067423641724374761e+00
2.630770185943845263e+00
3.390543461754779386e+00
3.271964996372311418e+00
4.060005864581532009e+00
3.007686210737002153e+00
3.991719127756199637e+00
4.248848636109523902e+00
3.641616936656106418e+00
2.308519492857332267e+00
3.930666395722958395e+00
2.628636078414292143e+00
4.063844574410548027e+00
4.469559953579545386e+00
4.448613028280705706e+00
4.363139691527276653e+00
2.294641068900188596e+00
3.987877256971243511e+00
3.346922980740345999e+00
3.798128359802086074e+00
4.017271664102475270e+00
3.547544122577163783e+00
3.584161012960742632e+00
2.750430230106343465e+00
3.678696652858477467e+00
3.922007071705352566e+00
3.207588584982508095e+00
2.111185082232924337e+00
2.713897330332270652e+00
3.712883570794018873e+00
2.227568916233573670e+00
2.695581675959026313e+00
2.701206645347344004e+00
3.505468966526307462e+00
2.852868126977833541e+00
2.512702160294461251e+00
2.770748492232863125e+00
2.362662542672678612e+00
2.088847396401859680e+00
2.124351640056757251e+00
2.577155889854227500e+00
3.009526206970930762e+00
2.817973399378722377e+00
2.310421884069800313e+00
2.692936745190364967e+00
2.604710507610531245e+00
3.152277068720474418e+00
4.334032769899513582e+00
3.728115965660116604e+00
3.307222037993456709e+00
2.740436602853023373e+00
2.820241562160147542e+00
3.953931240929752011e+00
2.396730584686403986e+00
4.242806980038229092e+00
2.829781535462990050e+00
2.219615185726262041e+00
2.214879125264820559e+00
3.383250539785416233e+00
2.686461066406609532e+00
3.235883360061208691e+00
2.533137772142733724e+00
2.680217204170040279e+00
3.772966548591490721e+00
2.962929031158545445e+00
3.778679399502580250e+00
3.112444757088153935e+00
2.960161414760128729e+00
3.617555694121793675e+00
2.829924305769871751e+00
4.422124869790944324e+00
2.536672849625841497e+00
2.240518903404387974e+00
4.290903707498906705e+00
2.676930203771295869e+00
4.138123871187321612e+00
3.665460632800491947e+00
2.856006861665908225e+00
2.619498641051950738e+00
3.169607712807744448e+00
2.838631525889153462e+00
2.755314710081802065e+00
2.200836917337546161e+00
2.777499353561534434e+00
3.888573681752461653e+00
2.559408055912693047e+00
3.567248087563919423e+00
2.715294654189909451e+00
4.354653756920012775e+00
3.715358108537745174e+00
3.934375949848436527e+00
2.561239832101560587e+00
2.221902831306374004e+00
3.156179303982161066e+00
3.017277944118969657e+00
3.012053846775661015e+00
2.871073696433885658e+00
2.819992755990576416e+00
2.804587391184619527e+00
3.402030199664766386e+00
3.404960874580700292e+00
3.280873410152654213e+00
3.889660901561296846e+00
3.303746543142728420e+00
3.301022991503837378e+00
3.421284087776413685e+00
3.252283769363042421e+00
3.221872960676279707e+00
2.812825170493184146e+00
4.193808269709203174e+00
2.395014202984103058e+00
2.770742493957474295e+00
3.207998592103136204e+00
3.552189034651895838e+00
3.011121199080837307e+00
2.489195774938552930e+00
4.193782487360712352e+00
4.412734911408294991e+00
3.094818213518022887e+00
4.197442358698344478e+00
4.335552996596993225e+00
3.600592874779767527e+00
2.295753062726883620e+00
3.495254519106223423e+00
4.494108001511474271e+00
4.362667906809644336e+00
2.796251740694546406e+00
2.908803422804159489e+00
3.775233658132126191e+00
2.455481562135883422e+00
2.895695630424766076e+00
2.118849574279468850e+00
2.255738713384599414e+00
4.435186224150462486e+00
3.996465243573145809e+00
3.249724587710105084e+00
3.388192026834566661e+00
3.055654150021467785e+00
3.859283934508339620e+00
2.828355232173528577e+00
3.838118757576987061e+00
2.113349078147579885e+00
2.573930550490755476e+00
2.437079141782297675e+00
2.249683045289232464e+00
2.926917659323105880e+00
3.194255306451026843e+00
2.137630153533462973e+00
3.203194026450905341e+00
3.807698461425545133e+00
3.003869570364412489e+00
4.471169287610265997e+00
3.286943680278727076e+00
2.326888506280578639e+00
3.804840533549644022e+00
3.294047706511979534e+00
2.030400017342999242e+00
2.605457747745835384e+00
3.020920365504300875e+00
4.279261899448614237e+00
2.935816058517794147e+00
2.216718416009897830e+00
2.785950259036312548e+00
2.776869790174581354e+00
4.361271957716462921e+00
2.922462594218996124e+00
4.028381994128448440e+00
3.759277546036546624e+00
2.816784739433691342e+00
2.434068760360876382e+00
3.172060051056019070e+00
2.628350595274109303e+00
2.348964092617782828e+00
4.312394614536120940e+00
3.659749702877786337e+00
4.472507002589778402e+00
2.739138582580735726e+00
2.531834043702531289e+00
3.656650902873234354e+00
3.884554827063566584e+00
3.312441896384737738e+00
2.977827311863730397e+00
3.727537973397675675e+00
3.510330311741269416e+00
2.836120306603838515e+00
2.782091162574648280e+00
3.144643583011662358e+00
2.679898346197113312e+00
4.494870867239765033e+00
2.112109023095098514e+00
2.111865452611243477e+00
3.211644726836500041e+00
4.385021148797535240e+00
4.453318420282766255e+00
2.840711839565985386e+00
4.165313399556906049e+00
3.241487175085936645e+00
3.974803985418832397e+00
2.684142466128704552e+00
3.724778542366234291e+00
3.912676658455557011e+00
4.325855448945628012e+00
2.686590402522027965e+00
2.848514592840240667e+00
4.034557917170802810e+00
3.349777311230653254e+00
3.189161549281090302e+00
3.510840522880139591e+00
3.447661346097134594e+00
2.327155793507339254e+00
2.267612394457056979e+00
3.780801210717775973e+00
4.084183358677655917e+00
3.147832415040538123e+00
3.148113058131010167e+00
3.128982958315122520e+00
3.355771260501338560e+00
2.642003410008157971e+00
2.235649917478885307e+00
3.661760523936463230e+00
3.891364650066023056e+00
3.786010099313986466e+00
4.205896765212819410e+00
4.371661353328794242e+00
2.503970277961693469e+00
3.946377844751971509e+00
3.730924852038164818e+00
2.388766644737522427e+00
4.430179719897082258e+00
2.653319407061172086e+00
2.265568861737641271e+00
3.308266897961661179e+00
3.291121246227662667e+00
4.005443631223933210e+00
2.665112829611846479e+00
2.826225225443299571e+00
4.007750783778125658e+00
2.810640801838974578e+00
2.221715993457307192e+00
2.243168548391195394e+00
3.789738119883200085e+00
2.203017232630071653e+00
2.679632683472477517e+00
3.864986013901360984e+00
2.252234478368076331e+00
3.211614325160596195e+00
2.271366467511570342e+00
4.061397809323731067e+00
2.817612739902044972e+00
2.468649266426285571e+00
2.132972115131669177e+00
3.775212032584291499e+00
2.384408498075856642e+00
3.969817762438613062e+00
3.943370834496164434e+00
3.580942277200705348e+00
3.088609798094579695e+00
2.968264714042654351e+00
4.218715768757978601e+00
3.480788312961753395e+00
2.580716898844856111e+00
2.027563004870147623e+00
2.967416070777514125e+00
4.493064085186531997e+00
3.883396001036664824e+00
4.438179272752847737e+00
3.435568727538096390e+00
2.132322975895825312e+00
2.702130527982830710e+00
3.503635761845562246e+00
2.158145151922121308e+00
2.835428121017949721e+00
4.353217178710607094e+00
2.924695684288248998e+00
2.939580351382542034e+00
2.852830794200837516e+00
2.825140841099197608e+00
2.478745823626634426e+00
3.961613801106239841e+00
4.124037953943280321e+00
4.077579916662597448e+00
3.279154356526126080e+00
3.854233821406706895e+00
2.891129361211906001e+00
3.361149722450087474e+00
4.253456069760416014e+00
2.007761652393023510e+00
3.375947720383510653e+00
2.758033959593105600e+00
2.993998595753673442e+00
2.466160631838942852e+00
4.115899809315049396e+00
4.493423876617148593e+00
3.126673099184789528e+00
2.733546340024100463e+00
2.702021859125096626e+00
4.034254924012989463e+00
4.216253536075757147e+00
4.190982374141993816e+00
4.314845919108346806e+00
3.007195198949445647e+00
3.339282013487745004e+00
3.660009297602560885e+00
4.303911758275750898e+00
4.408489032306828648e+00
4.496849141682716322e+00
2.763172239597801116e+00
2.276280654506201540e+00
3.425619023025578969e+00
2.096094255451676158e+00
2.392327296468375497e+00
4.445848045439480423e+00
2.045755176111829776e+00
3.684738974866804906e+00
4.360147181333251964e+00
4.156047280315591230e+00
2.588064933231761344e+00
3.104657270199923769e+00
3.413603905696280361e+00
2.985955266691581400e+00
2.217969286056778344e+00
2.207960598825621013e+00
3.498877937757261414e+00
3.602311181901573178e+00
3.133514813680506883e+00
3.686645259610388248e+00
2.764332370163309349e+00
2.602942270415482540e+00
4.123605851391760169e+00
4.420345032451001188e+00
4.118910966960822151e+00
4.426767756202679038e+00
3.269688074393855004e+00
2.529417167452482573e+00
2.980069877397905742e+00
4.003629132790298861e+00
3.308820618907846622e+00
2.657644294806920549e+00
2.609247589509688048e+00
3.417239056141259113e+00
4.280389324818686170e+00
2.604300009968016916e+00
4.229455114036763774e+00
2.635114389665901058e+00
4.105474094624716130e+00
2.784789674413525873e+00
3.132608602084566485e+00
3.686475688587028010e+00
3.604715717473453651e+00
3.701534902672282357e+00
4.477788546543352233e+00
2.218575972535085317e+00
3.476448352601796632e+00
3.693591304845090129e+00
4.193192433401513597e+00
4.151651769484340448e+00
2.006044166868916179e+00
3.426670225459850894e+00
2.819363277109407928e+00
2.692465932025665865e+00
3.045795547704151396e+00
3.228306981498914485e+00
3.703443220765361588e+00
3.238158366400499144e+00
2.519570903652885718e+00
2.543779871678418125e+00
4.376955587431189620e+00
4.167713906629560761e+00
4.396207498445664719e+00
4.182849941187587461e+00
2.573668134908503546e+00
2.152502143581281668e+00
4.347585416451548390e+00
2.469413630399166948e+00
2.350712551516288329e+00
3.049774613477905127e+00
2.884545435868763441e+00
4.235946287115649689e+00
2.455305656217559473e+00
2.683295889151965596e+00
4.137275368824236743e+00
3.640767526442435287e+00
4.434703424456666099e+00
2.500232521104379657e+00
3.901833344839398698e+00
3.922303770687310287e+00
2.990861533926236326e+00
3.076815924161796278e+00
3.509424187699153208e+00
3.869316135419978764e+00
2.958166534488794408e+00
4.289057088404364393e+00
4.140800871076768530e+00
4.311861186760619802e+00
2.029751657479670790e+00
3.030897076150750991e+00
3.645654253893613639e+00
3.918169784436590142e+00
2.305539320480332943e+00
3.724799407699362686e+00
2.086450809340496537e+00
3.263198416676932112e+00
3.119622291347303733e+00
3.680171500351784530e+00
3.702443579507187721e+00
3.532709265477613325e+00
2.889657605626198666e+00
2.624116962942194320e+00
4.374625041363236377e+00
2.721605608848922220e+00
2.098912259291369597e+00
2.537872170401739957e+00
3.036268272316583250e+00
3.626140782658259898e+00
3.093901872690095978e+00
3.889312218983912217e+00
3.171056257508790388e+00
4.281527018499243553e+00
3.564407788060327320e+00
4.483169899246702172e+00
2.899175307131372392e+00
2.658912336693721290e+00
2.655348600110644774e+00
3.872536029311344663e+00
2.315361772088266434e+00
3.377216055114877324e+00
4.391362709728752201e+00
3.439524251280133171e+00
3.890357321003430346e+00
4.296498469311281099e+00
3.808195036055090466e+00
2.906015987542538426e+00
2.350117008797084850e+00
3.453439619663811300e+00
2.790412783968074351e+00
4.360848188081281052e+00
3.621779802805196624e+00
4.287886732885189289e+00
2.685632927764689093e+00
3.724820413426169541e+00
4.033835253850816649e+00
3.745155505496538417e+00
3.316532850906071417e+00
2.238481010277065586e+00
3.435876512698158081e+00
4.068087704117276715e+00
3.409957367186343902e+00
4.439835961786445573e+00
4.479651165618101061e+00
4.366838012815343006e+00
2.983220246874766612e+00
3.518441461325326536e+00
3.875136820103662671e+00
3.407658649160735909e+00
3.677527588329315478e+00
2.155271369046967589e+00
2.393773027541880261e+00
3.010690867689840289e+00
3.084635547195961891e+00
4.405315000162569383e+00
2.708223933801806815e+00
2.326092051622390855e+00
3.084785221264111144e+00
2.461211987466914497e+00
3.903673540891969829e+00
4.187186578041128371e+00
2.065525206327195384e+00
3.503842627279886379e+00
3.017256938525242127e+00
3.618556516833342673e+00
3.430973602091460961e+00
3.656898761690907662e+00
2.843208888278544677e+00
3.164146200146360499e+00
4.327777609685974802e+00
3.101090876632834892e+00
3.341170111173923374e+00
4.202214444295629292e+00
3.002195281570658736e+00
2.891325851064253882e+00
4.269689725653885048e+00
3.599525369335474512e+00
3.308580549008630634e+00
4.470918562764958359e+00
4.385087616364743646e+00
3.080383052824714696e+00
3.049681674526180331e+00
3.470211986623613853e+00
3.027814517693238727e+00
2.288648035266448666e+00
3.305651589006225244e+00
3.892750755553406439e+00
2.696298007441304989e+00
2.652300918108906558e+00
2.665339584853437582e+00
4.357515294453413901e+00
3.106666869146440746e+00
2.346880469835121996e+00
4.149979736653582663e+00
3.398298453891630544e+00
4.461506254658041293e+00
2.913822729191643646e+00
2.331394065276394478e+00
4.302320198317913125e+00
3.018725338654641543e+00
3.500165126777552871e+00
2.375294770743169526e+00
3.173010150090322057e+00
3.769940678858287875e+00
2.420020026729861939e+00
3.612720081558226326e+00
4.477317663247932344e+00
4.077098597093021581e+00
3.398943108421019765e+00
3.137086331990129651e+00
2.918629667040521625e+00
3.585759010979985728e+00
3.767460233149990678e+00
3.049135403846257475e+00
4.391474336112343835e+00
3.054081395772846541e+00
3.034355200146860110e+00
2.006364557526285175e+00
4.438643749041021991e+00
2.442925645098748877e+00
3.185140903478680841e+00
2.269835764093129704e+00
2.802331637005828213e+00
2.327128304515033719e+00
3.173637328782456635e+00
2.413049585560907762e+00
3.100331231013009337e+00
2.586014251371813621e+00
3.784564902279443199e+00
2.815636676307351038e+00
2.403239638136675183e+00
4.454846738082300917e+00
3.255642815720636740e+00
4.013154071692976110e+00
4.328785162784938301e+00
3.273884410243972365e+00
3.229133069735454775e+00
4.334553805413298377e+00
4.319451080798186737e+00
2.685459006152605355e+00
4.194637112458185157e+00
4.399663529159329123e+00
3.202553968604504142e+00
2.974678581213842321e+00
2.295141076876479058e+00
4.156288514667613399e+00
4.376173971811383012e+00
3.693663692738754722e+00
4.150772715465276264e+00
3.922748819327029679e+00
2.186059582487146269e+00
2.784894155804067850e+00
3.640303775660164831e+00
3.666460444034564503e+00
4.314562296923218909e+00
3.045217791751968051e+00
2.507087583013506649e+00
3.151983583702548497e+00
3.373122934239919601e+00
2.874724983624947328e+00
3.178493354920772340e+00
2.573703008597741260e+00
3.059011549780525030e+00
3.656743914759381653e+00
3.958666367139874520e+00
2.096283352142521927e+00
3.444792956753043089e+00
4.313317260126510178e+00
3.286345158706971858e+00
2.842111379360427570e+00
3.830970469565614600e+00
3.532889922423923412e+00
3.838013070000515281e+00
3.907368256164027720e+00
4.073316582636741678e+00
4.457292159645197316e+00
3.677026804528298776e+00
2.561420096269912072e+00
2.195157356159915807e+00
4.408972677556522335e+00
3.311830047923902676e+00
2.530868089864281245e+00
3.779161377076211803e+00
4.045424044632468963e+00
4.484007176950479234e+00
2.259593634313512567e+00
2.693041386870580478e+00
3.226807145371481056e+00
2.539721730878756301e+00
4.301557237588974125e+00
3.740557882659058642e+00
3.575004837183134665e+00
2.094780099405525675e+00
2.392436687756640090e+00
2.665803376246890011e+00
3.385657233610900096e+00
3.599832669132007723e+00
2.598490008350867519e+00
3.248144232433634038e+00
3.444209317486009780e+00
3.130242753296528235e+00
3.737232730978979678e+00
2.793679494253304529e+00
3.841977155418135226e+00
3.104534797648944355e+00
2.187315172563280452e+00
3.587877168823295548e+00
4.138399364254508939e+00
4.027088135567382210e+00
3.490405852002385068e+00
3.250255850632015608e+00
2.850934229364990635e+00
2.314148231375930731e+00
2.193329977971003153e+00
3.489518638560064279e+00
3.729946036351442729e+00
2.797329617797791101e+00
3.674404866280186255e+00
3.809689230861440290e+00
3.334518267742112130e+00
2.662048075048135676e+00
2.374255418304986431e+00
4.074804876657159625e+00
4.133243727026492564e+00
3.163665109590489077e+00
3.606673467982370873e+00
4.027865850229477296e+00
2.510808078110236430e+00
4.299470174819122192e+00
3.711235524340965597e+00
3.519826884872923944e+00
4.189652138654645697e+00
2.907532068021810190e+00
4.352575923560520366e+00
2.533121201269807443e+00
4.466922309921025125e+00
2.810185001171420005e+00
2.740771123917451035e+00
2.868020378998735076e+00
3.175868748208121151e+00
3.656498179956988892e+00
4.233517342682239892e+00
4.498457482172745436e+00
4.096707156639693537e+00
4.181480933064205985e+00
3.343006704739754031e+00
3.845265047401119851e+00
3.476281884448024329e+00
4.191105218104674179e+00
4.259618709631536326e+00
2.974857770002571122e+00
2.798992524339248611e+00
2.252905867540676788e+00
2.748003096974967363e+00
3.592977092833379071e+00
