4.414359464123024601e+00
2.971583786211734246e+00
3.939892128061519561e+00
3.946176085824589563e+00
2.658311989288069110e+00
3.223537607956850515e+00
2.831271189609631200e+00
2.689110123016017262e+00
2.871924577536998147e+00
1.710373559712582425e+00
1.768937860671822682e+00
3.696793364824559003e+00
3.546332315932686718e+00
3.708920300704428019e+00
2.212596933152479739e+00
3.951207539794639789e+00
1.955416845623310085e+00
4.248367548679085282e+00
1.801279060608167448e+00
1.220259991609199623e+00
3.515051898079456727e+00
2.357829629420839623e+00
1.651996058213957896e+00
2.726179163544463879e+00
2.136033910809840286e+00
1.585031018379370327e+00
2.284360800284641613e+00
1.839781523576587752e+00
2.797547471830610366e+00
1.757609419091956227e+00
2.969305258076329501e+00
3.952407294640185142e+00
1.511291827438831170e+00
2.441556547331365401e+00
2.436830915923295038e+00
2.793421326860850762e+00
2.393994373352052119e+00
4.471826369658232103e+00
4.484645021653998143e+00
1.786247562918642728e+00
2.457648469719271311e+00
1.964091346284822404e+00
2.705759183870293683e+00
3.657234267983272780e+00
1.457062063455367040e+00
2.753867468765345272e+00
3.042401948430899949e+00
2.909915069925643749e+00
2.972825399934921453e+00
2.077220911541288295e+00
2.340623855869804704e+00
2.500948083494914265e+00
1.588269970418656030e+00
1.936168661252911427e+00
1.856631147132480342e+00
2.904027096730452673e+00
1.890858212415655659e+00
1.547833482574330510e+00
2.185445709846340900e+00
1.596509244536951089e+00
3.196278317240374811e+00
3.416985174714526785e+00
2.452131916473307527e+00
2.137913229582623309e+00
1.887371790390168336e+00
1.613621140280421473e+00
4.346361009909024631e+00
2.541487685525753548e+00
1.745897102230775211e+00
3.011490310406430559e+00
3.085067922862068546e+00
1.233141805627744780e+00
1.960250526572755447e+00
4.210689770398773568e+00
2.790144960193170043e+00
1.594184950062580208e+00
1.444161151324310888e+00
2.159560557947383774e+00
3.155310392493898775e+00
2.994716758439558202e+00
2.681215312883105550e+00
3.087435919748194646e+00
4.444410549045918479e+00
2.880443816398791768e+00
3.040662505923514836e+00
2.747672112105140396e+00
4.280882853430327373e+00
2.935673273408870187e+00
1.972275265679725997e+00
3.168132931989834145e+00
1.193570468194876222e+00
2.875788134552601072e+00
3.683783528526358708e+00
3.478553384588745523e+00
1.223600872283842289e+00
1.282368389728701707e+00
1.655536517103152194e+00
2.116628530183830570e+00
1.897421632764491939e+00
2.748550010255208065e+00
3.725441045434072063e+00
1.953730058315602092e+00
2.805696369029525794e+00
2.902039641729824204e+00
2.236329235568496721e+00
3.015875622122630606e+00
2.687126273770170215e+00
2.139923846896430781e+00
2.472841073197046491e+00
4.280940712751823973e+00
2.781925977672620842e+00
4.282101421363134541e+00
1.641403111208376453e+00
1.384926544402242721e+00
1.718197486229167570e+00
4.344113614380316513e+00
1.651101785199273309e+00
1.125991335853435693e+00
3.512498399616704958e+00
2.542620602967144983e+00
2.706178160254507858e+00
2.312918343804029053e+00
4.054388338922488622e+00
2.965722939032522820e+00
2.852619931882576232e+00
2.863055537079007618e+00
4.227698004765610307e+00
3.478254848579190206e+00
2.552107164350712054e+00
4.216802747930223916e+00
2.580570267144315366e+00
1.590315223285067692e+00
2.290111845658675094e+00
2.461630006539617277e+00
2.484332718819405539e+00
2.967686252843522610e+00
1.311707474880908331e+00
1.280052908232012898e+00
3.184879846147485871e+00
2.775562107042698567e+00
1.747721190747552500e+00
2.572757823023996693e+00
1.986662170669772687e+00
1.931689530004656818e+00
3.951825007267975032e+00
1.571995369634955564e+00
1.459417248220733043e+00
1.451115798726888784e+00
1.437666371106844698e+00
3.165485821209674810e+00
3.709921766187841197e+00
1.879655169127896208e+00
2.284913573722179070e+00
2.482339593116194010e+00
2.776756571352386516e+00
2.158312175296730917e+00
2.160879356653363281e+00
2.183238517115784205e+00
3.469738060508336108e+00
3.652251276829815652e+00
1.816708399577430022e+00
1.618849690147604159e+00
2.271275853553981872e+00
3.352650999796626063e+00
3.600337793519011953e+00
1.244253668555912462e+00
1.627698609830971366e+00
1.988039640774986516e+00
4.276254788349136859e+00
4.414626285482143864e+00
4.472378171476533382e+00
1.664738969467668639e+00
2.940930107027318829e+00
1.284192517159615132e+00
1.134983735211119171e+00
2.055792390663720326e+00
2.884756198601700294e+00
4.217966851339204126e+00
2.759509571171869347e+00
1.439371803826276386e+00
2.764830516947325734e+00
1.979421539095464810e+00
2.378819227221511845e+00
3.510113322148372017e+00
2.667407031927794936e+00
2.477309093032900034e+00
2.217570663515053386e+00
3.984448319810059758e+00
4.115853743875944382e+00
2.033005393662143945e+00
3.894368029578572088e+00
2.937375609009710509e+00
3.464480080140685203e+00
3.951663305261018166e+00
2.617721231425955697e+00
2.566768020701697850e+00
2.162262811075884361e+00
1.527311948696341126e+00
2.603258074936142030e+00
4.369502165097105539e+00
3.929608552756916673e+00
1.399055083967313262e+00
3.997739210100466956e+00
3.244153160000251113e+00
3.269792490007467300e+00
2.727644492105605778e+00
2.479752784059427562e+00
2.218730477114075672e+00
1.357053481603998746e+00
2.264083240450843526e+00
2.619102190100056848e+00
4.152357676293608080e+00
2.721781467578166858e+00
2.679870232814907105e+00
1.517094459415321284e+00
1.113243307178467312e+00
2.634520618574206718e+00
3.471336352623052512e+00
1.156962166064516850e+00
1.294364014218322367e+00
2.527877033143551611e+00
1.886683631059478117e+00
2.594655207671895170e+00
1.191674074956091456e+00
2.348514369361440757e+00
4.472996304737232087e+00
1.693367995803511494e+00
4.115754195394375259e+00
3.318123243007443435e+00
1.329983537176574693e+00
2.975475400634467249e+00
2.614725368430089070e+00
2.232770370442577423e+00
1.641758476642305453e+00
4.427233799336677933e+00
2.622785526190287264e+00
2.155413678525596843e+00
2.448349999490051943e+00
3.363414482689648821e+00
4.215262711178577426e+00
2.706398453275201454e+00
1.781606302538505160e+00
2.711931848304995896e+00
2.018798225725344064e+00
1.792215768486244754e+00
1.189052522913634391e+00
1.979786889277198370e+00
1.678347473553811975e+00
2.653006867361556775e+00
1.219035169674165475e+00
2.053451758098347568e+00
1.897523513225017666e+00
2.947468112712997801e+00
3.030450195505057565e+00
3.027907849798119333e+00
3.565408837882751314e+00
3.432519919286072252e+00
1.702719272897221803e+00
2.958569462250618010e+00
1.613083185841948763e+00
3.782304038130931634e+00
1.931243888453225921e+00
2.994455058688112459e+00
2.541306689460363089e+00
1.770429952148654618e+00
1.619841645099558747e+00
2.833606982517463901e+00
3.830796219398404645e+00
1.506009110898157699e+00
2.576430076854485218e+00
1.406623207802589093e+00
1.553522388168555590e+00
1.185009023626000246e+00
2.426773066295097259e+00
4.051427893751148979e+00
2.669805130460162879e+00
1.143662844135597823e+00
2.670617421160079275e+00
1.394119343316399195e+00
3.108226841609114111e+00
2.513132626269727332e+00
1.101092056839820144e+00
2.895846533401515988e+00
4.042318986957775806e+00
2.759184761641639838e+00
2.299365003981238775e+00
2.101432119625305184e+00
2.633682491702960426e+00
1.980642452690282607e+00
2.228392564016293598e+00
1.998499687608284781e+00
3.054101472384491700e+00
4.435990870200898328e+00
2.597377370044616107e+00
3.031263341881170525e+00
3.204977209500519564e+00
1.296796347656581361e+00
1.606049399882379269e+00
1.997895555375308607e+00
2.040049027207892607e+00
2.636143600889924166e+00
2.711938735877928330e+00
1.837525938956645843e+00
2.148361321074705454e+00
2.676769559660501674e+00
3.754657232379477350e+00
2.235184316437942798e+00
3.969960239855893747e+00
4.421590909144035741e+00
3.619648129071644682e+00
1.398562722836183436e+00
2.556166282501586728e+00
1.972133521523983690e+00
2.707665248292864035e+00
2.912935041228630784e+00
4.359411582636619542e+00
2.981929219244915164e+00
2.950138919766028600e+00
3.975914231629831708e+00
4.356639457259670500e+00
3.412621247859926488e+00
2.804738315137802029e+00
2.257911025931839788e+00
4.090349060234854228e+00
2.693611401809316241e+00
2.178253764976061380e+00
2.873456949888205880e+00
4.137844491504766964e+00
3.265082167358611898e+00
2.630184348636438685e+00
3.033599801614678348e+00
3.234558908249686393e+00
2.376393857877631355e+00
1.950741602163852173e+00
1.955370458132267286e+00
3.505691461612208126e+00
2.782438067646122448e+00
1.901960246875359140e+00
1.608944894406651560e+00
2.870625511455277667e+00
2.678139080625613566e+00
3.817941562033026592e+00
2.485134094614207534e+00
2.548220926004963083e+00
2.465810604638214443e+00
1.869740366465439063e+00
1.784090617570338377e+00
3.742667793875474658e+00
1.958226654283864665e+00
2.355926594262870211e+00
3.579584142075589615e+00
2.322717078263730528e+00
2.999959709393573704e+00
1.257241874193098852e+00
3.875182570652015102e+00
4.471265735302428546e+00
1.922509147548099762e+00
4.246462425307869104e+00
4.264691532161266174e+00
2.893129799824088355e+00
1.422926835661045386e+00
4.087354585673374174e+00
2.626384150133633355e+00
2.604117447627669613e+00
3.073426950494631438e+00
2.048995270646583933e+00
2.538867755144450289e+00
3.056677632268359091e+00
2.488324032574480871e+00
4.413259973412070991e+00
3.235165967892896344e+00
1.498949920670982650e+00
2.683412530023483455e+00
1.401548566800171258e+00
3.979932765697110408e+00
1.282738131916883795e+00
2.844141453191020741e+00
3.462209061032643476e+00
1.997044419045094221e+00
1.133481166480746261e+00
2.311060693889044337e+00
2.419141772052397332e+00
3.751579510915971305e+00
2.937056491559594917e+00
2.930384287695859236e+00
1.465257220216394041e+00
3.894048084468408888e+00
1.912564715024516637e+00
4.399791865101654764e+00
1.195807761092597232e+00
2.131695124323927271e+00
2.552774848088049442e+00
2.412624871079273703e+00
1.994407161784912841e+00
1.842571551910724192e+00
1.913724267505564791e+00
2.715192636851894825e+00
2.575219240442573998e+00
3.704835189176955090e+00
3.203499206688728229e+00
3.118260842978476610e+00
4.188392311985573713e+00
4.122568617091594945e+00
2.081173238142301596e+00
3.028844345644892133e+00
2.023794188547369366e+00
4.426822385663609083e+00
2.866249160902851312e+00
1.590676620719944978e+00
3.313195415684051959e+00
1.142489375543070729e+00
2.005706311827776922e+00
2.885315429180943525e+00
1.778363611368512842e+00
1.592125658105176145e+00
3.364258505279918765e+00
3.089593115661796396e+00
1.598229156968959508e+00
3.298931758799581893e+00
4.227937949063690581e+00
2.696631460583321704e+00
3.116500952868251684e+00
3.163417097996454430e+00
2.422915141051127375e+00
2.424347164158852763e+00
1.271822748447980489e+00
2.445704875703818892e+00
1.242686459071584260e+00
1.826639762919509247e+00
3.905905270616218949e+00
1.310160881932824983e+00
4.268717755706456174e+00
1.105599152410321473e+00
4.408757904570905772e+00
1.582279307581484495e+00
1.160563402672447175e+00
3.062943825859639091e+00
2.450767158814532998e+00
1.440206341594303829e+00
2.474867424725602838e+00
3.045482793849676462e+00
2.324944049057994455e+00
3.580192317877997965e+00
1.696558387449247363e+00
3.550098218929538252e+00
2.177723200809134063e+00
3.779569074374714788e+00
1.972322218085911238e+00
2.274626457858431650e+00
2.221669692317369105e+00
1.400269313495335677e+00
2.159069701491083570e+00
3.007657998678702427e+00
1.598087703654149871e+00
3.511035030586083572e+00
2.574332183647955574e+00
2.601265797955863324e+00
3.624831177950384120e+00
4.254482940917680089e+00
1.777164495754847806e+00
1.231727016722684365e+00
2.968455640353387714e+00
1.318402849332636073e+00
2.399557401013630020e+00
2.070749736638036076e+00
4.363634225211332485e+00
3.879966742065372731e+00
2.683954661950225251e+00
2.321960713622763350e+00
1.363026726347411177e+00
1.908177804169147285e+00
2.241194933950681367e+00
3.690724678572638862e+00
1.274076986219475849e+00
3.623103766520947566e+00
2.442359613636070126e+00
2.296678378439421131e+00
2.671284339635767946e+00
1.750950262653529377e+00
3.026578352829294882e+00
4.494073921672702809e+00
3.162374951061903250e+00
1.902353122010389086e+00
3.836023210001216377e+00
2.879602167848844374e+00
3.813940206053698656e+00
1.933158692191412342e+00
2.675572630454655876e+00
2.782043532697635158e+00
3.295783212274072227e+00
1.646847876651103659e+00
1.474126166804722082e+00
3.680260105219323563e+00
2.413652564308591764e+00
3.864985481635449638e+00
1.851852437800126872e+00
2.087758049682764128e+00
2.117893199309456964e+00
2.963843195351505422e+00
2.617720854714971956e+00
4.279647415973936830e+00
2.286709686480547177e+00
1.990563808728195383e+00
3.100947626242851030e+00
2.585267424187321694e+00
2.058386640184748817e+00
2.401194503847173145e+00
3.087199619080310597e+00
3.449413012367389619e+00
3.351663843548983834e+00
2.635640701873398051e+00
1.585788789058474535e+00
3.209438068778647679e+00
1.889922404050862426e+00
1.186098333388433623e+00
1.199926614239141154e+00
1.581711674743417007e+00
2.747626717457933410e+00
4.022921471050895370e+00
3.145236057956492193e+00
1.662736166730934606e+00
4.383677134086851446e+00
1.902998866569986181e+00
2.679658714860877922e+00
1.976141093657924452e+00
1.914439708084890945e+00
3.085473607704694032e+00
2.621038981993790262e+00
2.122645476977229162e+00
2.930348654475049663e+00
2.341364948229208931e+00
4.192838622440674179e+00
1.339059109061647046e+00
3.960019577999884355e+00
1.416810360626184151e+00
3.135207434887049338e+00
1.715147074927434456e+00
3.140488054832527798e+00
2.938837759702459529e+00
2.334552822342315537e+00
1.945728893456383668e+00
2.162627100356527166e+00
1.839271993061530885e+00
2.653075948866653100e+00
2.706021397563993069e+00
2.533009878603031062e+00
2.726222930186668059e+00
3.151021745810637320e+00
1.516854577439430418e+00
4.356560183667745889e+00
2.430601131939031045e+00
2.598065333440325198e+00
2.487701503144672976e+00
2.270451006063461286e+00
2.879912484321595301e+00
1.425980541046413919e+00
2.287386341151047553e+00
3.133270514182736832e+00
2.387234995059718479e+00
2.360298822164249799e+00
1.384543965673759480e+00
4.113188870162920452e+00
2.330507146320413892e+00
2.420704311374954454e+00
3.419374984895397596e+00
2.649897236611649998e+00
2.517689181089898920e+00
2.477744067289039176e+00
3.700043541206423203e+00
4.352700554936299149e+00
1.810805347402778320e+00
4.244986631213296668e+00
1.872290303061225458e+00
2.421120350621335682e+00
3.014259924653066136e+00
3.190611386953183803e+00
2.596680270153214565e+00
1.910904193769524362e+00
1.396474395746552188e+00
3.654010219737913179e+00
2.392119282413923909e+00
2.000380147708412437e+00
2.933298786459613616e+00
2.471036500028686245e+00
2.276132086035613789e+00
3.883405864387142081e+00
3.103407605373023515e+00
2.494596006348081652e+00
2.910653639593126396e+00
1.955341208848032641e+00
1.165297990222885050e+00
4.409245208621862311e+00
3.549579228447934831e+00
4.422069609265582457e+00
3.054007721747864501e+00
2.986673860251006118e+00
2.413862764878310863e+00
2.314369448210245039e+00
2.700629786524041176e+00
3.521225435207089305e+00
3.115649464662249013e+00
1.920128908772233522e+00
2.780091003463230237e+00
2.511365007965697060e+00
1.626757964259245348e+00
2.169573814040027582e+00
1.681115308124869756e+00
1.745915844220555790e+00
2.941567548983800684e+00
3.954175492935965153e+00
1.498261156645159797e+00
2.897072366039896707e+00
2.808056282247682667e+00
1.644623137772829757e+00
3.187781672888836404e+00
3.371168379759628131e+00
1.341916674734234816e+00
4.102643865698253123e+00
3.849478749024755508e+00
1.274852808351110589e+00
1.313822972894798546e+00
4.313650279783241004e+00
3.471219613475801324e+00
2.702798833786504762e+00
3.794090384854183817e+00
3.267674977228890665e+00
3.475718318828704856e+00
1.160909471875164245e+00
4.495883622577621530e+00
2.255378107967368706e+00
3.538802135771238255e+00
1.927614619535665597e+00
3.063843891969397326e+00
1.578747886101557363e+00
2.816137523795186670e+00
2.846914405770126777e+00
1.429996555208556286e+00
2.875445571966310787e+00
1.937337788652803372e+00
1.967807894475101627e+00
4.320224947116279246e+00
1.180010334864148192e+00
2.647885906712394100e+00
2.630606239061267448e+00
1.103922414974280120e+00
1.740762920347486364e+00
2.334015072688059966e+00
1.788533626979360580e+00
2.205731878185561712e+00
2.958069563848070072e+00
1.948458623552405067e+00
4.279256688825766375e+00
1.591655943629122438e+00
2.180376919039276551e+00
1.625214874627321615e+00
4.257522750131431444e+00
2.108163007950641266e+00
1.912331872674095656e+00
1.596926261217183729e+00
3.703586325896504938e+00
2.619160515558980773e+00
4.160092123339584447e+00
2.672922174149205965e+00
1.437236890223641428e+00
2.179018035823555799e+00
1.283028032426084764e+00
2.412902452807060616e+00
3.068240847379811065e+00
2.806204042676225363e+00
1.655205898088755401e+00
1.173734508090408468e+00
2.435732878286078762e+00
4.086797704928549102e+00
3.916113067138047299e+00
1.472614777575655509e+00
3.100263399031207179e+00
2.275544075808325406e+00
3.261404357229732653e+00
2.043660709392777441e+00
2.406114339590136098e+00
2.213554436534173497e+00
2.078632854009883513e+00
1.522278019558906070e+00
2.252253453599429633e+00
2.839398981072346118e+00
3.940899755719500241e+00
3.192706331408840192e+00
2.600690813218610842e+00
1.511244425326967011e+00
4.193373384863581244e+00
1.419586439877828177e+00
4.041147516402657125e+00
2.081056446082613309e+00
4.483886173237731754e+00
2.785297765496525635e+00
4.282912725588920999e+00
2.428308698956255007e+00
4.170414720622312110e+00
1.917594777049845156e+00
2.526227755229662364e+00
1.906013084851062356e+00
4.471897408628722204e+00
1.427943453394266760e+00
1.425071428456183176e+00
1.207011554989912305e+00
1.703690860382335526e+00
2.328949781869602553e+00
2.598459008751136778e+00
2.009091892943825286e+00
3.312434779616375558e+00
1.474456230231700582e+00
1.448359310949867584e+00
2.871030897447786501e+00
3.130220269493247720e+00
2.013837006907510219e+00
2.009549797206101829e+00
4.381303635711026878e+00
1.396917600357244105e+00
2.993769591269408004e+00
2.805291740231420583e+00
3.028155565430049379e+00
1.203288664995206148e+00
3.153200638600080374e+00
2.993581610423922790e+00
1.712909690583571232e+00
2.657339677461667105e+00
4.146152000543134264e+00
4.341445484903263541e+00
3.907021974527176589e+00
4.028132583169591996e+00
1.219823313599747827e+00
3.510884763972740075e+00
2.295800856646347921e+00
2.136482724293597535e+00
1.490821186459146297e+00
3.128783298196254670e+00
2.444505317047299009e+00
1.913740470884825129e+00
2.157470931850368423e+00
3.578363670748440306e+00
1.566145958851915321e+00
2.716072400656371233e+00
2.915495567689788015e+00
4.101469730067384134e+00
1.524007440921362200e+00
3.681905784748642496e+00
2.256900597953863219e+00
2.760252100423593369e+00
3.823859685209474168e+00
1.895374715337258209e+00
1.975994517131150152e+00
2.733102498674867320e+00
4.357804137102689879e+00
1.111891645921150307e+00
3.164362602811304104e+00
1.296897532941043263e+00
4.466819277952451372e+00
2.217811968696770553e+00
1.923807042102691822e+00
2.574887114578955583e+00
3.964796478607389929e+00
1.378153574446323582e+00
1.553179704458494292e+00
2.445233492168818579e+00
1.893981927552299993e+00
1.107681487151599198e+00
4.105658384079693413e+00
2.066117260657120092e+00
1.524049455183725588e+00
1.482527397830688543e+00
3.687336248289689866e+00
4.198062218726321682e+00
4.361548113817355521e+00
4.329148092256651204e+00
2.356472435755308847e+00
1.619066430776544108e+00
2.757981156614030205e+00
1.658181555546966113e+00
4.460486017864092823e+00
3.545273177774720175e+00
2.774057820344904002e+00
2.651277258369238332e+00
3.126320603713510504e+00
4.251855094656217915e+00
1.542734102789088402e+00
4.496172124321916819e+00
2.631355743383934076e+00
2.697723831515182802e+00
2.146989742874302998e+00
2.383005633919517585e+00
2.442390707924751769e+00
2.639947132291300846e+00
1.709626657412550266e+00
1.664287402907373981e+00
3.008143248489853150e+00
3.951569165560782526e+00
2.253473640696185498e+00
2.222127663498912220e+00
3.756679475874389773e+00
3.401158223656449930e+00
2.052273088248338428e+00
2.239796994856173562e+00
1.608727732346857842e+00
2.104494253356464117e+00
2.851188998731228885e+00
2.824450911556071642e+00
1.173817010222614421e+00
1.284761409408313071e+00
1.344311175999724606e+00
2.186923058039032419e+00
2.908215780603399914e+00
2.131974142088242097e+00
3.890824853539171180e+00
1.787969117476863268e+00
3.122756659277697633e+00
1.897217182216704767e+00
4.284047067467060543e+00
2.399471911104073651e+00
2.262952862858166547e+00
2.479212646495417172e+00
4.466200551172552657e+00
1.792338740885728754e+00
4.475510253618685930e+00
4.292385487266177968e+00
1.423804931012544461e+00
3.546248263107102616e+00
1.465469360477689387e+00
2.232256268209257932e+00
3.398913337318302474e+00
4.127977070255633762e+00
4.380270647872656298e+00
1.944441714111755370e+00
2.443283218064856932e+00
4.364999725246513584e+00
2.998146374916695667e+00
2.788012560290059838e+00
4.027488061083683846e+00
2.981179104573521421e+00
3.298727070697502928e+00
4.424984428141758741e+00
3.024734353075205107e+00
1.918556724785648093e+00
3.002659575151420235e+00
4.165615642858576884e+00
1.939155773814422279e+00
3.639699633057544403e+00
4.322027776015440637e+00
2.744123077936240662e+00
3.936659454287688931e+00
2.053120208867732277e+00
2.448934151247458946e+00
1.661892576328036109e+00
3.035561666495547151e+00
4.163257797885710154e+00
2.978394957154784084e+00
3.082894634213199758e+00
2.026166015665706865e+00
1.457826182646414948e+00
2.475304711366413279e+00
2.256246459531157988e+00
1.483559812100200936e+00
2.435329542583525964e+00
1.679376422215606235e+00
3.459418783654643281e+00
2.599399298649117895e+00
2.904930769833948823e+00
1.481209066103786665e+00
2.890079932691164366e+00
3.649231077821967428e+00
2.917628030045848586e+00
1.407209153795759171e+00
3.640402900144789289e+00
1.851555079865597087e+00
4.491714786474648946e+00
2.615568974257955315e+00
2.442452002528032295e+00
2.334917456940369895e+00
1.690261375557180035e+00
3.046556217422307533e+00
2.033532203863389398e+00
2.335889307092387401e+00
3.071655748745384606e+00
2.513365188979654441e+00
1.196762849206938428e+00
2.976206111506617624e+00
3.977464079566808586e+00
1.468608084473066455e+00
2.719779231965927302e+00
3.063963095495660482e+00
2.731306736347804964e+00
2.795878431372300188e+00
3.148757323826064436e+00
2.336212293596652501e+00
3.283815276587578325e+00
3.546001208006976047e+00
2.595780352478577413e+00
3.111025179863417200e+00
2.496545797370670172e+00
3.134440641960040352e+00
2.821964771819816864e+00
2.657577395002063803e+00
2.682899907933355088e+00
1.490201251325079967e+00
2.587200130640453732e+00
1.390856440546627049e+00
1.492748735099448387e+00
2.534868052467605715e+00
2.168814134609315936e+00
2.134786026138442594e+00
1.823089941027457028e+00
2.406709506788741848e+00
3.678798094450267619e+00
2.616119921977094087e+00
3.062627554383507977e+00
3.771937266361258700e+00
2.567819154681335370e+00
2.536604635831462673e+00
1.759649159721910383e+00
1.515474184208855268e+00
2.069719317874583631e+00
1.975361251885811686e+00
4.282936551763699029e+00
3.508724035438917088e+00
1.639352612685462507e+00
3.972649632936669839e+00
2.798105140994898488e+00
4.103709219971364952e+00
2.794991519653143630e+00
4.204076878523713034e+00
1.570321701199004938e+00
3.034537650540634512e+00
3.609215056712067327e+00
1.913309032616463679e+00
4.426337142961784821e+00
3.822171154856346842e+00
3.350485847592256761e+00
3.890796009986349002e+00
1.782015353068605812e+00
1.300249795752617565e+00
2.893740057272903066e+00
2.174662935650076623e+00
2.438845739007848401e+00
2.263199142783554052e+00
3.463633437355068345e+00
4.316739636561004012e+00
1.995526875690834423e+00
1.612620838569859050e+00
3.589529003150304654e+00
1.485454540248758670e+00
1.851899983671969618e+00
1.159691862202938406e+00
3.322640419829110403e+00
2.605869180651442907e+00
2.727898544771000466e+00
2.600320546643702713e+00
1.458168497646796125e+00
1.780757479532003806e+00
1.184485299669134850e+00
3.106057967409636245e+00
3.984965567045516632e+00
2.365508847080111110e+00
2.945962232576216699e+00
2.155696678190110127e+00
3.213345191192996886e+00
2.401199386987631801e+00
1.525294196519399792e+00
4.218702385670007438e+00
3.833736556804132611e+00
3.724112694576633409e+00
2.362225013700923082e+00
3.060002154225788029e+00
3.849980018176516694e+00
1.680600158796038635e+00
4.203864762372511166e+00
1.762371127315300434e+00
2.190317104694553318e+00
2.528324391355856626e+00
2.244714055122809970e+00
1.583746671338908785e+00
2.543704492633757752e+00
3.438538237915119034e+00
1.130198262662935660e+00
1.293168296212932500e+00
2.183986815809155324e+00
3.088611122490565908e+00
2.460867284534083765e+00
1.981819382070392876e+00
2.228425332318100693e+00
1.398633443036371826e+00
2.026537881042475675e+00
2.376952410461909082e+00
1.680784157080944752e+00
2.317216959915329166e+00
2.963946411400728120e+00
2.087461355472704838e+00
4.496132250508545702e+00
3.315914373795546766e+00
3.830982150147463017e+00
1.673906617905773775e+00
2.620584215158351604e+00
2.565446501943271951e+00
1.886224254060653305e+00
1.802300457621552665e+00
2.952699067748620010e+00
2.004038346126962633e+00
3.055432106308716200e+00
3.178153364049879581e+00
1.951588898341277911e+00
1.134635598936231560e+00
1.487122247412194564e+00
2.677420908263193677e+00
2.020015361107438512e+00
2.122335083632662212e+00
2.944958423428161165e+00
4.401060668654607433e+00
2.744069384391254474e+00
1.213137830772883730e+00
2.675622850017305598e+00
3.870433051001977098e+00
2.731201434333756062e+00
1.801914523411146218e+00
2.561254500569509318e+00
1.593990197302949774e+00
2.414274059951455165e+00
3.281164229576170932e+00
4.095529228829358992e+00
2.081565415665568519e+00
2.277594786774270741e+00
3.567387246090447661e+00
2.064736843074284511e+00
1.539582056887844885e+00
1.925838977741304969e+00
4.291956408098640097e+00
3.651526509938019416e+00
3.989647548490976803e+00
3.145589504433798478e+00
2.620945601681103021e+00
1.248495585567393595e+00
3.271143318681692946e+00
2.582373990505282713e+00
2.604792513421357647e+00
2.586068344053999546e+00
1.614314795690060755e+00
2.254644111093301539e+00
1.939397718664258807e+00
4.137286762465866019e+00
2.444323940334654388e+00
2.131147373360665842e+00
3.478045027878990503e+00
2.223955618135139201e+00
2.877104688591517245e+00
4.143908824525441403e+00
2.249367575297717359e+00
3.829457496057876664e+00
3.619701007335687670e+00
2.118052895575339711e+00
3.147121382441633308e+00
1.541491750487814505e+00
2.364750985548750073e+00
1.572255156233029361e+00
2.908824266160634942e+00
2.741082016933343191e+00
4.429208008295007382e+00
2.347049660002603844e+00
2.864546951881311365e+00
1.511274618970112726e+00
1.671520739077487994e+00
2.120213816284813646e+00
2.486890154785895035e+00
3.008373046877149015e+00
2.102862763154912606e+00
1.491753858530744825e+00
2.867226471178381253e+00
2.647238810206389736e+00
2.930583822751255507e+00
2.198055446960160975e+00
1.489839162045531129e+00
1.586450507613567096e+00
2.979202381112783460e+00
4.341434385626329551e+00
2.547861191565454320e+00
2.193728147954587815e+00
2.872075629595697066e+00
1.463700500643603686e+00
4.263371789820631363e+00
2.179442456330134892e+00
2.405487848072000112e+00
3.136802301043704944e+00
2.489338398421184984e+00
2.458859169096421660e+00
4.301363074800330644e+00
2.628213712189486628e+00
1.819768138008030167e+00
2.565486911714423890e+00
1.895944900176666614e+00
3.088498656442913770e+00
3.795819005178554306e+00
2.259029851476036299e+00
3.127860495990772538e+00
1.581187156387344750e+00
3.829315850750333983e+00
3.479294147291955852e+00
1.165833262717108632e+00
1.902691801080645062e+00
3.070327552135989180e+00
3.178207393439083983e+00
3.074758564886186818e+00
3.105239949844940117e+00
1.929832729100472655e+00
3.917534328194256510e+00
1.233619413117013952e+00
3.381140602395709571e+00
3.079244994652972967e+00
2.020378085976402449e+00
1.954175306549842617e+00
2.618956217410371323e+00
3.277908009292014313e+00
4.041493912845457004e+00
2.676688229905527017e+00
2.057096768655456653e+00
1.686024512930605290e+00
1.819806437031481261e+00
3.320928935471668897e+00
1.963757017079430955e+00
3.355668225902782797e+00
2.003846156767216335e+00
1.365718559283909617e+00
4.456242201321125584e+00
2.361748950445581308e+00
2.164174557602316806e+00
2.545118769121827107e+00
2.794885340909892157e+00
2.904800994845204265e+00
2.932739861625409450e+00
2.480818361363827051e+00
3.104929800759440361e+00
1.986694712775045613e+00
2.647390015496562388e+00
3.160903412474679097e+00
1.292761193519658569e+00
2.646443242537177998e+00
1.944736059763770175e+00
2.963483446073067906e+00
2.550975195434945775e+00
3.931135327468273655e+00
4.027292953656997909e+00
3.652085549035468670e+00
1.875819540972522681e+00
2.322785878471171461e+00
4.173951804051859504e+00
3.222998976265412097e+00
2.239042086502716522e+00
3.132892384190954616e+00
2.671963183471353531e+00
2.338700688015219242e+00
2.861445351689391181e+00
2.958316346068730951e+00
1.157436258809658725e+00
4.305427990630084523e+00
2.734376179748242208e+00
2.560206284146819389e+00
1.795996808313057080e+00
2.168492474331251252e+00
2.942669386047807478e+00
4.110856658860590152e+00
2.548127369674364928e+00
2.443537509448463041e+00
2.168214976702960151e+00
4.173174964485449223e+00
2.587786675050148144e+00
1.532575859258213047e+00
2.884026615433602725e+00
1.371031378470662698e+00
1.900681816828719839e+00
2.907813075538085990e+00
2.295044236342715038e+00
2.638582027203589142e+00
1.789864959408998146e+00
3.995715579367463910e+00
3.334248853401875046e+00
1.656400148244574710e+00
2.881604018344527507e+00
4.478304720340619660e+00
2.558468472550333050e+00
2.331247564337410871e+00
2.061381363819393187e+00
1.619682628170316940e+00
1.675333822107017756e+00
2.528345372555602211e+00
4.063302635956912212e+00
1.965929999368721148e+00
2.669588671776532252e+00
2.754608023601719857e+00
3.976692304454222615e+00
4.404916326616944211e+00
2.274034630078912045e+00
2.169297039495022617e+00
1.196420112601660701e+00
2.895968197187313020e+00
2.972388797511718472e+00
1.911357079515576096e+00
3.715536964697361277e+00
2.281344685660766647e+00
1.133909944093641764e+00
1.425227743237866385e+00
2.416670962467099670e+00
1.463778824317182092e+00
4.467651506267153572e+00
1.236937072901908685e+00
2.982475253047622399e+00
2.699823381684560264e+00
4.016243274196353852e+00
2.847434807093187636e+00
2.082661001203732987e+00
3.201352892286603691e+00
2.112875766441276948e+00
1.369616268204650655e+00
2.073955680386605493e+00
1.507140549658610995e+00
2.751372397042855411e+00
1.481927185969451610e+00
1.428387340005545347e+00
4.255876416896397174e+00
2.671687612579809024e+00
2.308427560711287629e+00
2.547208889717293090e+00
2.438306927157618986e+00
1.524343904481288092e+00
2.714778483418261779e+00
1.279090312632066961e+00
2.969275683148358436e+00
3.494208114377322261e+00
1.919370252080261796e+00
2.911385608512377488e+00
2.118871311227869647e+00
3.065946029195167899e+00
4.079093819254669739e+00
2.895173326316003326e+00
4.254381672821770266e+00
1.193698830144798162e+00
1.204665185332557176e+00
3.814474991056899356e+00
1.279708181356986163e+00
1.441900348972720902e+00
2.002379740847454848e+00
2.941077671402324789e+00
2.206630668938440731e+00
2.359573482020196789e+00
4.390141075056135378e+00
1.581733399150879293e+00
4.481963632710534107e+00
1.513175484594725617e+00
2.254367495364056229e+00
1.969460750567226803e+00
2.404230283908692201e+00
2.685848171618829383e+00
2.039659403937903015e+00
2.686175470635244089e+00
2.994384657770090996e+00
2.710162233663937492e+00
2.748305941276030673e+00
1.626132908041252323e+00
2.444389250558702820e+00
4.421666530253633987e+00
3.941526016431409651e+00
4.486075668636841485e+00
2.089871203091005825e+00
3.563039367475758556e+00
3.371709367975388894e+00
1.883224523672067718e+00
4.017378532218816467e+00
1.631518790418119425e+00
1.779420069435283080e+00
2.127591795823644549e+00
2.823462058670549446e+00
1.434638683563508543e+00
3.139948888563194984e+00
2.732481952173093198e+00
1.480033715563340291e+00
2.079321766654463222e+00
3.975011014766493211e+00
3.597782749941548897e+00
1.669604820022229985e+00
1.242987569023765060e+00
