2.210373068463461266e+00
3.229345261858525884e+00
2.191554101574744617e+00
2.378743093722118562e+00
2.310549908721514001e+00
2.030569084637964039e+00
2.115524974223794707e+00
2.959840802437466944e+00
2.276865505239215270e+00
2.138953840903539572e+00
3.149529175123387148e+00
2.476931860438600808e+00
2.469285703490046391e+00
2.827123054489739218e+00
1.797397100701729533e+00
3.338927107583200105e+00
1.425022059354819515e+00
2.800286569004633019e+00
1.956662343907848989e+00
2.587639125264441287e+00
2.317269016649431190e+00
2.888407272745747711e+00
2.193139391070471511e+00
2.661499964111458727e+00
3.584571870043745889e+00
2.785844002603704794e+00
3.266307719150380873e+00
2.095405211847553684e+00
1.384960518266214358e+00
2.523008907581161697e+00
2.472958871273962078e+00
2.557995810158528727e+00
3.110509032426418852e+00
3.258739342610171619e+00
2.467547466251025945e+00
2.319859974374549161e+00
3.487906254570890763e+00
2.360980163176201518e+00
2.199329724014309484e+00
1.565738220487095544e+00
2.680743655681567805e+00
2.978536203586716002e+00
1.948499141210230823e+00
2.144151224324768013e+00
2.556912877694595743e+00
3.480755854514788084e+00
2.063927234700363211e+00
3.692213960408089246e+00
2.777464522748587239e+00
3.036696765158590328e+00
2.569588418564475063e+00
3.570862195741039802e+00
1.947974596167329153e+00
1.599957195587895731e+00
2.821382371951996593e+00
2.755205891317769495e+00
2.693131355765521651e+00
2.415695820816288197e+00
1.834813956150780800e+00
3.038098685252669906e+00
1.631960415766316785e+00
2.683570364162876754e+00
1.922207059877162560e+00
2.374161291472178803e+00
1.827784748410425930e+00
1.359220824864825428e+00
2.049342695543196591e+00
2.252480965717839290e+00
2.127303743868852237e+00
3.351878660016585521e+00
2.397997159319090965e+00
2.990922405777686421e+00
3.113108429901819463e+00
2.351314651002778255e+00
1.893229699258343501e+00
1.523376558725294316e+00
2.069068948737104563e+00
2.206444966034415867e+00
2.544792523894278347e+00
1.565981497934396005e+00
1.921398422656189986e+00
3.008645871235797298e+00
1.991888784561325565e+00
3.089998220189343225e+00
2.986606855453944664e+00
2.379534035442009365e+00
1.588175654761167843e+00
1.645217330414527668e+00
3.050068401797011663e+00
2.821240869769783277e+00
2.630167433888738859e+00
1.418580487742428398e+00
2.795983014321447246e+00
1.578924298314951846e+00
3.175228467588234516e+00
2.695257670122734428e+00
3.606125497784302691e+00
1.638763669975460635e+00
1.813883179588992478e+00
1.495528186856534880e+00
1.415624535000211015e+00
1.645371131695685163e+00
1.305244064252664149e+00
1.772758425802386517e+00
2.930759987456051263e+00
2.283634915069461702e+00
2.315679666567634243e+00
1.713048124256686844e+00
2.275399169223492279e+00
2.160824999986834083e+00
2.780528367436493120e+00
1.815358469536468178e+00
1.694137819726510452e+00
2.373555662740325367e+00
2.373123516652101639e+00
2.206704692686576319e+00
3.354638770073030241e+00
1.627461283060097408e+00
1.361179126530118744e+00
2.345126829049962502e+00
1.977571838557832917e+00
1.507150679823696438e+00
2.146732299527453147e+00
1.642019646526359455e+00
2.025224751348731811e+00
2.665819086057280796e+00
1.485458607252691410e+00
2.185033447695926334e+00
2.527725579208948137e+00
2.519974517758351240e+00
1.966688355933670751e+00
2.686477490715920791e+00
1.791332871782210789e+00
3.233650920137113083e+00
2.580734519249848091e+00
2.308420683257490502e+00
1.992304057232184622e+00
2.018389352293696426e+00
2.312310112313053168e+00
2.524773302702280731e+00
1.201638774660519493e+00
3.606272728669180250e+00
1.387543049381562144e+00
1.912711294989963173e+00
2.181181123770507657e+00
2.931786838883252422e+00
2.512720464823229971e+00
2.515081314557108261e+00
2.423257424159471540e+00
2.101132946451733652e+00
1.798578480246260325e+00
2.021300028070345700e+00
2.578180497530529358e+00
3.285146192346322103e+00
3.651796734377576570e+00
3.238256803231124525e+00
2.335262180041123514e+00
1.829608052401890950e+00
2.486633520085661964e+00
2.921607451174069503e+00
2.313501687147003771e+00
3.058527758817384701e+00
1.487339946904261634e+00
1.875340811942904251e+00
1.974115714931591326e+00
1.431473285601046141e+00
1.928869837559877620e+00
3.062589034182574554e+00
1.717339701021783460e+00
2.248955870540181312e+00
1.684326604621211532e+00
3.070893481871441733e+00
2.141938687962841481e+00
2.792335931812947258e+00
2.637170624388251561e+00
3.071991490496129185e+00
2.031535823408619379e+00
1.707789125809922703e+00
2.124486764679709871e+00
2.277799516684577696e+00
1.599183993686989824e+00
2.776075155459171828e+00
2.087604207159240666e+00
2.165401344642743364e+00
1.888164067002030766e+00
2.301061384901430085e+00
2.473443938049904478e+00
2.054641035046995690e+00
3.022792342533815013e+00
2.689618980198442699e+00
1.894996899665867263e+00
1.552877261175639845e+00
1.845970983044260105e+00
1.942053720488006618e+00
1.566121810522862479e+00
2.279878222017430733e+00
2.411554897692756327e+00
3.223618476908462593e+00
1.735015734855052338e+00
2.883351971903723943e+00
3.739047405454499984e+00
3.341061556076887484e+00
2.290390507962118072e+00
1.629110046143430468e+00
1.831786033920031809e+00
1.799176230988435155e+00
3.325031962215391879e+00
2.542379356136451829e+00
3.127354979393282886e+00
2.379514911621553708e+00
2.519739852331827290e+00
1.769710255211677463e+00
2.797326769410750646e+00
2.533123947134469756e+00
2.580753405716066595e+00
2.587710649605054147e+00
1.611902112447702429e+00
1.427030950612876437e+00
2.113486997087310471e+00
2.008645576045064107e+00
2.561560812857351710e+00
2.059328499373058285e+00
2.535039237943995438e+00
2.953417386735370354e+00
2.991451663450693577e+00
2.543314272462827930e+00
2.180609293456746478e+00
2.785208627643283918e+00
2.475916518979059067e+00
2.830426930666991137e+00
2.609095337302766549e+00
1.479787067709189774e+00
2.503637437832854751e+00
3.509158825588874375e+00
2.246091861065313999e+00
3.115681688052506892e+00
1.845436877016193744e+00
2.532886791952994709e+00
2.002044305883326825e+00
1.646656902426457680e+00
3.337765096137472742e+00
2.925386576670573113e+00
1.809262395348041563e+00
2.032777141082226180e+00
1.999805444209469707e+00
2.679609267163596709e+00
2.448113207183716611e+00
2.688836944974926091e+00
3.000502504743435050e+00
2.057981054874769455e+00
1.378884501873740787e+00
2.597297217163945682e+00
2.628209624927469790e+00
2.980749315789306131e+00
2.442307729679831230e+00
2.393594991058209942e+00
2.622001182041001410e+00
3.124735655386184252e+00
3.402826169198720496e+00
2.626494109068119087e+00
2.915822484250518709e+00
3.077124366329716754e+00
2.511331399787921193e+00
2.428244625353702002e+00
3.633513094972995017e+00
2.557073413757809721e+00
1.579535896662940253e+00
2.102550428010332428e+00
2.477313993576918616e+00
3.175604878420638766e+00
1.705900410501122622e+00
2.808734050556609407e+00
2.154481757444101309e+00
2.858628757822501143e+00
2.662105952350635185e+00
2.408368695592940867e+00
2.156987911816036441e+00
1.326259521441756961e+00
1.950073902334744647e+00
2.823790729605983874e+00
3.276914996508926148e+00
1.355585756029592526e+00
2.250541595298034103e+00
2.950434854940356288e+00
2.124509466528005319e+00
3.610257803259500520e+00
2.866276793508986565e+00
3.148074047081846683e+00
2.522493319158626512e+00
2.521554118686331947e+00
2.830450816355701171e+00
2.811910354676342205e+00
2.056974048970522606e+00
3.637186111439035141e+00
3.312155077754536325e+00
2.665393676218124508e+00
3.177723052849168450e+00
3.174191443957046666e+00
1.995756615958438118e+00
3.285232371090969661e+00
3.522255191870204527e+00
3.173276215913679366e+00
2.188075393316025963e+00
1.457603593788171503e+00
2.888342597516639021e+00
1.959334603616844195e+00
2.800199942222937999e+00
2.560356721444923878e+00
1.924170901238607456e+00
1.895134619709395229e+00
3.084737741473756678e+00
3.737353682433254054e+00
2.411776987489295809e+00
1.708509754634033984e+00
2.812715074826315220e+00
2.913520832137229899e+00
2.493180040866651570e+00
2.426100918260160721e+00
2.208091549003167398e+00
2.584408583057186792e+00
1.877077898467387262e+00
1.505593653639339280e+00
2.829341156404005631e+00
2.616350715087623069e+00
2.818021808575672527e+00
2.159328243143521675e+00
3.347328209401220001e+00
2.514738758704963661e+00
3.100773261428466654e+00
2.191954904041528263e+00
2.889967755745475486e+00
2.806077270009240010e+00
2.918755226224650112e+00
2.410472007246625026e+00
1.620511725715918283e+00
2.622155500321239785e+00
3.385593464652925988e+00
2.860198139468191236e+00
3.187861473191896611e+00
3.061439229008879437e+00
2.390658154880747066e+00
1.705087033499417037e+00
3.386312595437462658e+00
2.666853514605232345e+00
2.432125884160398765e+00
1.871254526442625910e+00
2.406837447439493349e+00
1.436636029010622595e+00
2.392385829388864238e+00
2.382699520401529991e+00
1.775134364692434019e+00
2.672638636589209415e+00
2.242770825442857330e+00
2.615189724457059217e+00
2.060742049384005625e+00
1.324851060775316114e+00
2.136423061595468464e+00
3.375338866953450090e+00
1.205922852530355360e+00
1.995889305517187573e+00
2.789843502887683790e+00
2.374766752662576863e+00
3.040620606200991727e+00
1.548469755129333825e+00
1.567284474887182588e+00
3.299070670400583438e+00
2.248475386793604258e+00
2.476537666401998461e+00
3.580960429577404458e+00
2.922546234201999660e+00
2.416695306338438876e+00
2.400853104578274166e+00
2.564351561107918176e+00
2.726981281755450404e+00
1.609722176329277721e+00
2.981104339482262500e+00
1.736594527806117005e+00
2.278609056451546433e+00
2.056658070473439182e+00
3.353606981018184552e+00
2.120329377521443792e+00
1.442622132812681590e+00
2.694099232745293282e+00
1.331603808487097806e+00
2.557019377367547808e+00
2.688386841072267330e+00
1.766523130404196840e+00
2.373857658367892309e+00
2.600653998032345982e+00
1.489770080836513078e+00
1.028855778890225281e+00
2.121243406226041461e+00
3.113792966272619811e+00
1.949411527399078192e+00
2.766829761613237348e+00
2.721482091535150527e+00
2.580120369674156144e+00
1.520603027660592188e+00
2.468811438341656395e+00
3.380272720616749549e+00
2.285229291079060143e+00
2.173000522031014903e+00
1.799812405500118784e+00
1.982655533024776595e+00
3.520583800433268351e+00
2.296661156348884347e+00
2.524184451672019769e+00
2.561299121186409788e+00
2.330161863441492009e+00
2.069243213379818425e+00
1.850723261205595938e+00
1.996709338049154292e+00
3.304209012097583109e+00
2.111898593359597953e+00
2.364465337855508942e+00
2.988089537557013120e+00
3.166410212843388194e+00
2.503108291352384107e+00
1.894762499439468506e+00
1.996201452380019115e+00
2.347282440028522821e+00
1.538335132800459970e+00
1.952991447099473588e+00
1.693317375924125345e+00
2.937048254194019048e+00
1.127964982871770605e+00
2.913728078759737716e+00
3.311068311827318755e+00
1.654336301160580280e+00
2.424079745779627260e+00
2.573755280723535321e+00
2.201519175675688444e+00
2.731384942645361580e+00
2.330809724925048787e+00
2.853452047620982146e+00
1.561836978666768960e+00
3.436500744584662481e+00
2.289753896099570252e+00
1.843434098377878083e+00
1.981354233786067898e+00
2.778877489440766624e+00
2.165018948671372900e+00
1.982354085286571754e+00
1.862748072162869972e+00
1.622155689906821241e+00
1.855471046127192603e+00
1.864437878009388427e+00
2.351487550763902590e+00
2.697809480206058375e+00
2.512518550710468812e+00
1.796130777107158627e+00
2.183402948955988521e+00
1.722685499961373434e+00
1.700430954513155291e+00
2.476779961892034088e+00
3.499231951313221067e+00
2.674718689716432785e+00
2.448877800277914574e+00
2.427277349288664343e+00
2.086281718320950329e+00
3.195704811498607079e+00
2.338376242276257955e+00
1.304333712390309374e+00
2.187836041225809325e+00
2.367837735929699594e+00
1.132564320361262311e+00
1.290313779124602878e+00
2.845742424830493000e+00
1.944377896307306175e+00
3.209738779006241494e+00
1.680380796129202992e+00
2.636120874276679515e+00
2.152368297762394800e+00
3.173574973196867433e+00
1.951527730952768769e+00
2.801410268552519955e+00
1.443081322306889014e+00
3.363607260563676427e+00
2.730475066279900442e+00
3.160960043026649569e+00
1.759338713716404934e+00
2.274486126151157528e+00
1.737289602628564245e+00
2.948286993069678008e+00
2.770581873696409403e+00
2.604376655643578786e+00
1.325315872964667685e+00
1.571518342253913181e+00
2.888941863186656356e+00
1.823165468134885003e+00
2.383547840394259154e+00
2.645307112656906767e+00
2.453839030653637288e+00
2.504563665104113657e+00
1.342785045905205310e+00
2.860627074524519919e+00
1.858689797423531243e+00
2.794632224723029967e+00
3.107059785186943923e+00
2.275857409955964972e+00
1.988461023527106519e+00
2.901251347259985014e+00
2.640332803394324301e+00
2.762370899017876358e+00
2.924644597063367435e+00
2.824248723317867693e+00
1.826363211112862039e+00
3.230968312748945692e+00
2.108428712393389137e+00
1.912126954244505184e+00
3.327999271915992097e+00
2.967828280742015767e+00
2.031031603619299464e+00
2.843661452722858307e+00
2.181419445068232044e+00
2.901727672628672483e+00
2.783387670211357801e+00
2.144209894381596815e+00
1.418920218424858160e+00
2.420401506528646163e+00
3.537081148402236863e+00
2.742240109893812505e+00
1.941685102537994423e+00
2.348327782330386082e+00
1.188465609524341993e+00
2.867704906240629015e+00
2.738927119424073631e+00
2.804076935870080778e+00
2.845739700288138163e+00
1.942060501146218643e+00
3.448650999566743369e+00
3.237817114564673471e+00
1.427542551970189422e+00
2.089805684664157948e+00
2.190159122059493590e+00
1.942618120647941815e+00
2.737273366116200091e+00
2.293570920970856353e+00
2.262859657812139602e+00
1.968665996064780543e+00
1.785828692915883309e+00
2.112118893548183163e+00
1.921499296443014204e+00
1.950222974735680515e+00
2.913812890544567491e+00
2.497389682084974361e+00
2.415688268222228263e+00
3.159143100482010968e+00
2.245889098921385330e+00
2.395268238380517722e+00
2.167811166635994269e+00
2.547442569852053307e+00
2.254932102558555140e+00
2.928650015149094621e+00
2.228600535857231613e+00
2.314106850991711095e+00
2.194480849298088287e+00
1.502871943559355161e+00
2.629297872614691833e+00
1.624493730223429022e+00
2.480826144437729308e+00
1.039558556905373132e+00
2.314420100881128040e+00
2.752435111305229221e+00
2.343241317760461850e+00
1.661913566459728431e+00
3.171422658166139552e+00
2.537145535938607921e+00
2.087938352295775513e+00
1.968939492840787953e+00
1.843852950602715479e+00
2.722062821435174751e+00
2.133807322184933408e+00
2.305195773489840505e+00
1.514659452546842644e+00
2.433259635369156904e+00
2.273161962829898020e+00
2.892295481432855198e+00
1.968844288454038027e+00
1.207326289945311215e+00
2.275282279877881564e+00
2.525910573185860208e+00
1.736920154379482994e+00
2.883071971047680648e+00
2.619274297664035078e+00
1.560632819162934837e+00
3.015111057464955113e+00
3.485756187917040005e+00
3.097985055439494317e+00
2.281938672182846073e+00
2.129189550447926127e+00
2.058733198400255038e+00
2.289735482100724084e+00
2.786096008691719472e+00
2.416918735405785945e+00
2.722878827416447489e+00
1.838253494064239213e+00
3.527656804157263792e+00
1.593735943811853684e+00
1.869948584384089063e+00
1.752140216797432481e+00
1.774316053714380725e+00
2.311541622629514681e+00
2.913311420074605529e+00
2.084523563905190002e+00
2.741731215512591913e+00
2.427189817140348094e+00
2.002584464311953916e+00
2.824612898043176834e+00
2.504551864916261916e+00
3.252883949194295798e+00
2.432921804357625728e+00
2.173908319313965887e+00
1.521039664843042427e+00
2.264082447800050524e+00
2.717062570676709310e+00
1.097117231098774681e+00
1.596718902897795722e+00
2.699629376450390694e+00
2.388336185983912952e+00
1.353696836772515288e+00
2.926507601702923456e+00
1.864752537566094270e+00
2.506874945050133086e+00
2.723346260673664698e+00
2.232685222426548766e+00
2.256232590211273870e+00
1.820052682501680952e+00
2.488954568814506274e+00
1.814143478196971859e+00
2.532979756306137809e+00
2.076937080834541316e+00
1.509372430774140295e+00
3.664316083775795096e+00
3.292521927861588260e+00
3.168125008280716415e+00
2.964017283464988495e+00
2.927217619395238835e+00
3.032390601278200482e+00
2.211281221610790659e+00
3.535115757361327216e+00
2.058133035257752486e+00
3.223255912810838897e+00
2.095980716165194657e+00
2.165069482242428567e+00
1.876946629286259993e+00
1.844237399151065659e+00
1.749228521949701909e+00
2.443040963293191314e+00
1.373871524690790435e+00
1.868564211065315339e+00
3.472691398805460850e+00
1.862832330286921634e+00
2.738830551017737314e+00
2.143067235446778351e+00
2.765073272299853446e+00
2.412611580557343594e+00
2.826668416102041448e+00
2.412913659837891522e+00
2.503169969419308583e+00
2.888030612175081835e+00
2.557590789514230689e+00
2.058208187513687282e+00
3.241788150522002088e+00
3.390059570681162260e+00
3.391630342096355388e+00
2.081785072717814877e+00
1.948942717329142482e+00
3.629786761812984874e+00
3.099946512801680765e+00
2.286327016275251367e+00
1.187412251596625667e+00
1.277476990303214821e+00
2.125900164660594616e+00
2.944861773313928843e+00
2.494840392704913867e+00
2.801360313593818319e+00
1.837334327600066208e+00
2.525605121673891507e+00
3.467502229264637581e+00
3.356800090919850987e+00
2.577899116767351728e+00
1.611884706457230587e+00
2.753411100538001755e+00
2.192130629284462007e+00
2.652678364286031876e+00
1.942036688192696703e+00
2.731511560231698166e+00
2.300581880563620452e+00
1.954230967282044817e+00
3.310481771628311698e+00
1.310052663584119204e+00
1.370864236380767265e+00
1.017127927545089294e+00
2.862475024706981674e+00
2.422836613854337795e+00
2.526808012199420084e+00
2.452365742275602667e+00
3.335486241192825219e+00
1.924261625858194158e+00
1.939777352804543886e+00
1.988239542054643483e+00
1.578942205873294480e+00
2.281036138166272487e+00
2.827137938846437493e+00
3.311290386938018138e+00
2.254545116670015226e+00
2.995833191445703036e+00
1.274605315824159479e+00
1.659114762962041967e+00
2.279395953661200291e+00
2.028710069960373730e+00
2.643310886799269177e+00
2.273132516129518166e+00
3.053973412518072195e+00
2.212393804093151228e+00
2.833922026465180100e+00
2.821596666307813361e+00
2.639818369177978408e+00
2.792510211483687055e+00
3.119423939653252820e+00
1.981113621189806162e+00
2.280041450378252232e+00
1.049412361990023301e+00
1.475897679864928147e+00
2.471666982174087757e+00
2.115499315836093963e+00
1.686402757381527895e+00
1.243325133359982848e+00
1.714739622521683993e+00
1.769843885731487543e+00
2.539990202852524082e+00
2.850008176378617808e+00
1.366674415123778630e+00
2.346703910854445407e+00
1.768922483820531966e+00
2.498622868277077469e+00
1.989698630287568104e+00
3.004907082363658777e+00
3.644629566939845855e+00
1.527028833390634555e+00
2.570953748023288910e+00
2.864692059234067667e+00
1.343997471851824832e+00
2.893928401998976163e+00
1.563019244986395995e+00
1.784101902403749884e+00
1.812502436925984783e+00
2.227486719444701446e+00
3.112107585287049005e+00
2.287609923415440338e+00
1.997846377037907795e+00
2.139808612523990572e+00
1.816190455420710670e+00
2.135398980618906872e+00
2.850847018904828278e+00
2.105728438797883406e+00
1.432470197915096000e+00
2.656223162820102957e+00
3.175691929945842595e+00
1.272870187146842635e+00
3.322582246623024815e+00
2.807582581602177996e+00
3.214285401837171374e+00
3.127238289522917380e+00
2.140696102418702562e+00
1.990915274244183797e+00
2.203403621043668714e+00
2.342349099359434472e+00
1.472295277817507575e+00
2.429106844917292563e+00
3.432892929127866033e+00
2.028520915281875947e+00
1.593991972424585013e+00
2.299111290663173435e+00
2.237664424086732939e+00
3.139642211836816355e+00
2.666540352814845249e+00
2.248127692584473536e+00
1.561323872917885769e+00
1.227217198729547487e+00
2.299014041919199780e+00
2.718469571969122534e+00
1.278008158633439972e+00
1.980892665661752261e+00
3.624722294995228022e+00
2.994305704057023121e+00
2.612989212866185795e+00
3.355097693676137194e+00
2.907711095460405737e+00
3.063419889021989029e+00
2.660623505577776271e+00
3.108331450171063715e+00
2.624638976020767345e+00
2.614638756863685298e+00
2.380005973416281062e+00
2.509791757146122571e+00
1.424485245557200130e+00
1.868913978458780045e+00
2.131977747369353526e+00
2.718411184842973061e+00
1.502366906384417167e+00
1.726166488792036269e+00
2.174916659701433108e+00
2.990522370965181587e+00
2.820646161936152030e+00
1.920536635439995976e+00
3.061785858886951761e+00
1.789014930557716765e+00
1.372759619972475420e+00
2.627209658137342974e+00
3.255047278535654343e+00
1.876908245357566063e+00
3.170134334026371459e+00
3.621545000965772143e+00
2.385232896579887019e+00
1.931931165533377737e+00
1.551245617697797563e+00
2.811114732384335735e+00
1.345949223137304473e+00
1.811457291688334248e+00
2.459874264592353477e+00
2.629558429629566429e+00
2.127898075587036697e+00
2.404069053804725797e+00
2.664995276012211534e+00
2.800091926910052820e+00
2.347609277767605640e+00
1.946506583953035996e+00
1.222681568291995147e+00
1.506539259897886618e+00
1.939872321709888325e+00
2.172960316231732136e+00
1.274412261264844082e+00
2.537105884420553181e+00
1.757712978424226025e+00
2.790559394939188032e+00
2.521961757310272834e+00
2.104685361448070502e+00
2.239520898379312897e+00
2.256365886854262648e+00
2.759926555248839897e+00
1.222201962872240255e+00
2.660803792539098822e+00
2.238079691667247406e+00
1.917554664856225832e+00
1.851863451132083505e+00
2.257878314123339614e+00
2.192327848063575058e+00
1.560092150660427279e+00
2.007115526753589396e+00
2.305457019616569792e+00
2.550710788198784496e+00
2.586279308810103039e+00
2.560879622759277385e+00
1.617939133287923603e+00
1.143088930991686292e+00
3.126616071114006967e+00
1.105730770957069176e+00
2.151503000480598171e+00
3.052764438555963800e+00
2.943727189344331752e+00
3.400623226135029764e+00
3.084519093586601368e+00
1.547911985326748452e+00
2.872341550113619579e+00
2.546101478626177972e+00
2.139082305400257678e+00
1.287803824065469227e+00
1.198310014160478776e+00
2.935586599619703030e+00
2.359634008007962080e+00
2.563301926239674344e+00
2.948743301532432692e+00
1.390660629442633578e+00
1.674771029512897469e+00
2.832981709932204328e+00
1.303892419979749251e+00
2.019146442613762193e+00
3.327736845054688253e+00
2.929673502223753445e+00
3.561720214281224095e+00
3.194356482853793366e+00
3.467327134068776573e+00
2.531948965128135054e+00
2.527318953289285908e+00
2.945531809885741037e+00
3.247778098263268021e+00
2.891801679578117845e+00
3.325959618695814690e+00
1.797779508571560658e+00
3.131924380883767789e+00
1.995294558848589750e+00
2.198169035492237189e+00
2.714346000819885418e+00
2.456702412043474393e+00
1.332463646669343138e+00
2.145439933918331210e+00
2.655282258024230568e+00
3.446337017563355865e+00
3.147182419038577539e+00
2.287418397881937793e+00
3.329408474631593062e+00
2.505873022539669037e+00
3.043421061701513608e+00
2.479642995327675514e+00
2.997523591378677743e+00
1.462117309016504496e+00
2.444075085246483425e+00
2.433714030410661699e+00
1.263939620014213228e+00
1.564706242949027715e+00
2.002249055433706904e+00
2.839510943386306163e+00
2.427367566718091840e+00
2.345634157611386605e+00
2.324734113316175410e+00
2.213489472618961784e+00
3.192398031134866532e+00
2.509251079530502526e+00
2.693442832049744773e+00
2.087135198516242074e+00
2.525639127696539088e+00
2.076357695685562277e+00
2.291949453037249285e+00
2.017187779490642541e+00
2.774793083805018767e+00
2.390978197016799367e+00
1.812741021347364034e+00
2.451632346545790320e+00
2.907201334385803637e+00
3.294417711484602496e+00
2.852462379445101615e+00
2.141972874440159380e+00
2.505905012202737314e+00
2.239570050446258787e+00
1.721473996855416688e+00
2.718563168418198117e+00
3.049345393781492053e+00
2.916875040907999761e+00
2.239287867333271898e+00
2.640786283888591601e+00
1.273389264114102692e+00
2.691920878374821413e+00
1.806905634299377672e+00
2.069976510700915373e+00
3.124609292565304841e+00
2.730445258149638121e+00
3.253156373751596053e+00
1.964165238412335812e+00
3.727113815781706307e+00
1.308998532581587826e+00
3.148050489886369707e+00
2.486337996702194797e+00
2.601932908874000638e+00
3.030820167468707194e+00
2.472240945403610723e+00
1.993165783714067496e+00
2.757192666328144526e+00
2.671916937377415202e+00
1.993564400197813224e+00
3.170046602564009941e+00
2.043281151702023735e+00
1.915049016335618859e+00
3.382267172273720757e+00
2.447179003148415966e+00
2.271202990948380851e+00
1.622820720664395866e+00
2.439058575494366998e+00
2.475567799209967834e+00
2.120742608494077253e+00
2.735750192873743103e+00
1.556563437404476113e+00
1.815281279060292130e+00
3.189045764779510073e+00
2.419867046492159446e+00
2.423424290180545171e+00
2.233380652557304114e+00
2.848075124242639422e+00
3.436073372361605038e+00
1.815345037511042481e+00
1.748109273903975858e+00
2.786721093046657494e+00
2.590174747596196703e+00
2.731149626776663286e+00
2.509772793266751290e+00
2.550355210323804744e+00
2.180141468259239712e+00
1.594299307369753116e+00
2.958290254551664944e+00
2.107024169422134108e+00
2.003483580940331965e+00
2.503086168835269021e+00
1.335929554047898815e+00
1.532738512745003723e+00
1.851127879676154331e+00
2.318913719177292165e+00
2.619042457769067411e+00
1.853534683596971488e+00
1.852925479483372273e+00
1.429326854538347957e+00
2.992485685438184273e+00
3.559997977522826318e+00
2.442082910777401139e+00
2.633900818704307589e+00
2.705489695639657022e+00
1.829968966156445997e+00
2.735832945382308257e+00
2.180279838623020439e+00
2.305780044926007299e+00
3.250504694949200246e+00
2.149502826544166911e+00
1.949606168018286789e+00
2.412896371667834661e+00
1.362883784814790333e+00
2.905652975609349653e+00
1.456387889693834481e+00
3.151873245235198073e+00
1.995477092066081592e+00
2.961495084627109975e+00
3.247770820565453409e+00
3.420058955275233181e+00
2.064762849957479052e+00
1.843401830138789110e+00
2.301351054349360048e+00
2.261081416290676938e+00
2.042645842399502421e+00
2.213222701217538724e+00
1.543951778660886509e+00
2.077173237128559169e+00
1.183254342534122872e+00
2.344370667098331307e+00
2.504155286339577291e+00
1.718131224925414591e+00
3.351515260544199570e+00
3.583591882795158501e+00
2.060837901475484291e+00
2.976448497147517802e+00
1.958756948984941904e+00
2.945809637685903315e+00
1.817496206454125796e+00
2.521619768565287689e+00
3.034993542350673312e+00
2.306456211001255419e+00
1.811525386698596307e+00
1.402157149049296558e+00
3.405457211654939531e+00
2.355846632311494826e+00
1.426588822748046770e+00
1.749177007136497597e+00
2.441824455603931909e+00
2.950182314589424148e+00
2.843338635217508070e+00
2.075892303581130971e+00
2.788376115376137943e+00
1.361514509531397632e+00
1.979037146963850802e+00
3.565964083899669568e+00
2.112953664898305384e+00
2.722269187227706944e+00
1.353561807521794336e+00
2.538934128847776694e+00
2.343563022473917901e+00
2.744679707547808878e+00
2.638422444618705676e+00
2.820067027055376485e+00
2.651167079081218514e+00
2.304451613225872553e+00
1.825107509931103156e+00
2.817099266012446535e+00
3.009172909162997733e+00
2.878851505303185121e+00
2.455425851207053256e+00
2.091776427494870472e+00
2.716597932995941544e+00
2.212777498088053907e+00
2.909156399806704485e+00
1.394735823392746932e+00
2.139699497464272682e+00
2.121478367082847871e+00
2.718842274650797197e+00
1.944576274844268982e+00
2.631494830927876283e+00
2.427354366427272314e+00
1.947466018068078730e+00
1.576339925023497068e+00
2.233675024770290118e+00
1.494352835178636374e+00
2.661610129542669068e+00
2.773517916491297974e+00
2.252374242776052249e+00
2.129305892265068056e+00
3.436377582851312340e+00
2.264147517003022525e+00
2.005234913663794138e+00
2.280235098905931235e+00
1.568669328061843560e+00
2.681162373010036237e+00
1.665655896531274660e+00
2.792686274512054645e+00
2.159463167418016027e+00
2.194375172829076348e+00
2.358723514197030191e+00
3.535643279476834877e+00
2.043996358644941669e+00
2.914161801808229146e+00
1.913600375203764248e+00
1.447604484925230972e+00
1.946451798105184317e+00
2.361797225225245267e+00
2.882034656205203937e+00
2.830435223208738638e+00
3.121776715296552318e+00
3.036050292509102189e+00
2.330851284472042817e+00
2.991911931734902108e+00
2.022106880738723689e+00
1.904646219023636844e+00
2.004116814033484850e+00
2.882187249471837909e+00
2.282434444210046376e+00
3.316339657883638381e+00
1.605913841061836989e+00
2.902202973558462240e+00
2.558540430395601195e+00
1.123467889761987637e+00
3.588655707970481501e+00
2.823911647634407718e+00
2.701854644166971298e+00
2.818787097787760487e+00
3.662617797570001166e+00
2.992747446811875989e+00
2.428852413627899942e+00
2.215749337749187919e+00
2.688104845930881837e+00
1.543382111197823647e+00
2.894621655079047784e+00
2.329725378071032083e+00
1.772231443699781028e+00
3.137231697469318625e+00
2.815159628461395780e+00
3.520638796751318189e+00
2.561710237001201929e+00
3.624327092144109752e+00
2.340169388306963416e+00
1.764367052559753235e+00
3.506355136175181908e+00
1.848778188434310632e+00
1.781371868579052498e+00
2.859249031298571442e+00
2.109701693906484543e+00
1.535530059890019450e+00
2.567529023341194261e+00
1.307474857982178884e+00
1.985182509185267730e+00
2.962966775915818918e+00
2.579982637800689815e+00
3.429745096804587501e+00
2.805953052101313183e+00
2.606016985445016143e+00
2.284197934248060058e+00
2.250832158980974107e+00
1.214021470071935838e+00
1.962314054904304106e+00
2.721885849314901407e+00
2.569438758784181154e+00
1.736851663378900179e+00
1.782547485337617976e+00
2.667672091847138383e+00
3.012896249460781828e+00
3.419965562304438933e+00
2.517966530197818020e+00
2.630779879120117570e+00
1.614193258386089180e+00
1.971089539482469899e+00
3.025375764617222796e+00
2.593200648354674787e+00
2.590357054734580444e+00
2.050036994752049146e+00
3.695670609183771660e+00
3.266577735186135367e+00
2.396032710815746647e+00
2.723103978308743400e+00
3.017686357933333952e+00
2.356913615807056495e+00
2.220678682268671711e+00
1.673556145938698947e+00
2.734602046301993994e+00
2.495053126068332627e+00
2.762662764658668113e+00
1.422052341255174435e+00
1.897696817020924076e+00
2.658725507558771906e+00
2.438693995722086783e+00
2.386768148884058416e+00
2.813621274090559066e+00
2.340282129751563911e+00
2.967048510618191415e+00
2.922154695927290380e+00
3.025677406689971427e+00
2.896573737119700898e+00
1.658263902595346284e+00
2.213471511236092315e+00
3.125501766700273354e+00
2.341590588317199906e+00
2.415007876309102741e+00
2.792151291781267197e+00
2.656498651794741317e+00
2.545358045270720737e+00
2.112613153213614758e+00
2.692903843452648882e+00
2.873802198548514486e+00
2.604895489496091177e+00
2.842168510465556963e+00
1.921311371744577112e+00
2.287511438542583875e+00
3.298779555824184140e+00
2.877438447472180361e+00
1.685108584414108268e+00
2.659455245422746472e+00
2.984140222850017565e+00
2.893246029736065150e+00
3.360838369126507796e+00
2.780151182584914338e+00
1.984981617440654267e+00
2.689316178772433119e+00
2.129906255721515151e+00
2.666733570532354047e+00
1.792844076532240427e+00
2.522870605942576727e+00
1.839035097790236994e+00
1.913449542045161600e+00
1.832299535462154960e+00
3.005044868898616883e+00
2.939414665046995445e+00
1.645635226056196165e+00
1.785918272423940856e+00
2.136157291315999185e+00
2.054018715816915641e+00
2.377269815355214533e+00
1.839576434109237990e+00
3.155407523929797176e+00
2.379792266662123623e+00
2.679890244799480126e+00
2.997627863723897335e+00
3.665664853168800974e+00
3.158084793028569148e+00
2.574634977817932491e+00
2.096276002049260345e+00
2.197419099127870368e+00
1.970097933741302265e+00
1.487372782005149219e+00
2.197102519174892077e+00
2.615486029195265960e+00
2.828662915869842642e+00
1.504210570883921516e+00
2.393755860991213513e+00
3.227279049845537706e+00
3.045719683235013964e+00
3.037486525977626695e+00
2.825707744467850446e+00
2.513736761026581057e+00
2.675622029623689446e+00
1.857665362427247446e+00
1.079434417973840432e+00
2.248235855442412667e+00
2.375164057458793554e+00
2.271266250799950814e+00
2.301738501572084594e+00
2.951580646847207667e+00
1.220462287300194015e+00
3.006340011657160360e+00
1.120412611969290984e+00
2.877555530439548814e+00
1.983569365394147299e+00
2.418800944513967544e+00
2.231932190401283211e+00
3.021006514883393113e+00
3.249784876628796670e+00
1.696449770784372868e+00
1.857230528654203017e+00
1.206363580444733019e+00
2.652052780271445531e+00
2.977767632837275968e+00
