﻿{
  "profiles": {
    "IIS Express": {
      "commandName": "IISExpress",
      "launchBrowser": true,
      "environmentVariables": {
        "ASPNETCORE_ENVIRONMENT": "Development"
      }
    },
    "Made.CitationNetwork.WebApi": {
      "commandName": "Project",
      "launchBrowser": true,
      "launchUrl": "api/citation-network/docs",
      "environmentVariables": {
        "ASPNETCORE_ENVIRONMENT": "Development"
      },
      "applicationUrl": "http://localhost:8001"
    }
  }
}
