{
  "calendars":
  [
    {
      "name": "\u0438\u0432\u0442",
      "id": "jcm5arugvkp385ha955i74rvi8@group.calendar.google.com",
      "hash": "792f83355518bd3b0f4686d6b5d8fc5d",
      "url": "https://calendar.google.com/calendar/ical/jcm5arugvkp385ha955i74rvi8%40group.calendar.google.com/public/basic.ics"
    },
    {
      "name": "\u0438\u0432\u0442\u0432\u043c\u0431\u0434-41",
      "id": "b7jtl3njte2ceu240pgihe70vk@group.calendar.google.com",
      "hash": "792f83355518bd3b0f4686d6b5d8fc5d",
      "url": "https://calendar.google.com/calendar/ical/b7jtl3njte2ceu240pgihe70vk%40group.calendar.google.com/public/basic.ics"
    },
    {
      "name": "nenne",
      "id": "7ijim2nrusan6sji4n2vhnnrm0@group.calendar.google.com",
      "hash": "792f83355518bd3b0f4686d6b5d8fc5d",
      "url": "https://calendar.google.com/calendar/ical/7ijim2nrusan6sji4n2vhnnrm0%40group.calendar.google.com/public/basic.ics"
    }
  ]
}
