{
  "version": 1,
  "dependencies": [
    {
      "source": {
        "local": {
          "directory": "jsonnet/kube-gitlab-runner"
        }
      },
      "version": ""
    },
    {
      "source": {
        "git": {
          "remote": "https://github.com/prometheus-operator/kube-prometheus.git",
          "subdir": "jsonnet/kube-prometheus"
        }
      },
      "version": "v0.9.0"
    }
  ],
  "legacyImports": true
}
