module go.maczukin.dev/tools/greleaser

go 1.19

require (
	github.com/magefile/mage v1.14.0
	github.com/spf13/cobra v1.6.1
	golang.org/x/crypto v0.5.0
)

require (
	github.com/inconshreveable/mousetrap v1.0.1 // indirect
	github.com/spf13/pflag v1.0.5 // indirect
)
