{
  "clientId": "api-mtfr",
  "name": "MotoFreaks API",
  "description": "",
  "rootUrl": "http://localhost:8528",
  "adminUrl": "",
  "baseUrl": "http://localhost:8528",
  "surrogateAuthRequired": false,
  "enabled": true,
  "alwaysDisplayInConsole": false,
  "clientAuthenticatorType": "client-secret",
  "secret": "GaW5ntfqmFrSk0eceyzp2D4RNgxxzpJC",
  "redirectUris": [
    "http://localhost:8528"
  ],
  "webOrigins": [
    "*"
  ],
  "notBefore": 0,
  "bearerOnly": false,
  "consentRequired": false,
  "standardFlowEnabled": true,
  "implicitFlowEnabled": false,
  "directAccessGrantsEnabled": true,
  "serviceAccountsEnabled": true,
  "authorizationServicesEnabled": true,
  "publicClient": false,
  "frontchannelLogout": true,
  "protocol": "openid-connect",
  "attributes": {
    "oidc.ciba.grant.enabled": "false",
    "client.secret.creation.time": "1673789086",
    "backchannel.logout.session.required": "true",
    "oauth2.device.authorization.grant.enabled": "true",
    "display.on.consent.screen": "false",
    "backchannel.logout.revoke.offline.tokens": "false"
  },
  "authenticationFlowBindingOverrides": {},
  "fullScopeAllowed": true,
  "nodeReRegistrationTimeout": -1,
  "protocolMappers": [
    {
      "name": "Client ID",
      "protocol": "openid-connect",
      "protocolMapper": "oidc-usersessionmodel-note-mapper",
      "consentRequired": false,
      "config": {
        "user.session.note": "clientId",
        "userinfo.token.claim": "true",
        "id.token.claim": "true",
        "access.token.claim": "true",
        "claim.name": "clientId",
        "jsonType.label": "String"
      }
    },
    {
      "name": "Client IP Address",
      "protocol": "openid-connect",
      "protocolMapper": "oidc-usersessionmodel-note-mapper",
      "consentRequired": false,
      "config": {
        "user.session.note": "clientAddress",
        "userinfo.token.claim": "true",
        "id.token.claim": "true",
        "access.token.claim": "true",
        "claim.name": "clientAddress",
        "jsonType.label": "String"
      }
    },
    {
      "name": "Client Host",
      "protocol": "openid-connect",
      "protocolMapper": "oidc-usersessionmodel-note-mapper",
      "consentRequired": false,
      "config": {
        "user.session.note": "clientHost",
        "userinfo.token.claim": "true",
        "id.token.claim": "true",
        "access.token.claim": "true",
        "claim.name": "clientHost",
        "jsonType.label": "String"
      }
    }
  ],
  "defaultClientScopes": [
    "web-origins",
    "accountIdScope",
    "acr",
    "profile",
    "roles",
    "email"
  ],
  "optionalClientScopes": [
    "address",
    "phone",
    "offline_access",
    "microprofile-jwt"
  ],
  "access": {
    "view": true,
    "configure": true,
    "manage": true
  }
}