<svg width="26" height="26" viewBox="0 0 26 26" fill="none" xmlns="http://www.w3.org/2000/svg">
<path d="M25 17C25 17.7072 24.719 18.3855 24.219 18.8856C23.7189 19.3857 23.0406 19.6667 22.3333 19.6667H6.33333L1 25V3.66667C1 2.95942 1.28095 2.28115 1.78105 1.78105C2.28115 1.28095 2.95942 1 3.66667 1H22.3333C23.0406 1 23.7189 1.28095 24.219 1.78105C24.719 2.28115 25 2.95942 25 3.66667V17Z" stroke="#007CFF" stroke-width="1.5" stroke-linecap="round" stroke-linejoin="round"/>
</svg>
